##TITLE=1H_DE-57_NaOH_b
 D2O
 8 sc, 
 26.6.2024
##JCAMPDX= 6.0         $$ Bruker NMR JCAMP-DX V2.0
##DATA TYPE= NMR FID
##DATA CLASS= NTUPLES
##ORIGIN= UXNMR, Bruker Analytische Messtechnik GmbH
##OWNER= root
$$ XWIN-NMR		Version 3.5
$$ Wed Jun 26 15:51:02 2024 Russian Standard Time (UT+4h)  she@DPX200
##.OBSERVE FREQUENCY= 200.1313
##.OBSERVE NUCLEUS= ^1H
##.DELAY= (6, 6)
##.ACQUISITION MODE= SIMULTANEOUS
##.ACQUISITION SCHEME= undefined
##.AVERAGES= 8
##.DIGITISER RES= 18
##SPECTROMETER/DATA SYSTEM= spect
##.PULSE SEQUENCE= zg30
##.SOLVENT NAME= CDCl3
##.SHIFT REFERENCE= (INTERNAL, CDCl3, 0, 15.7039)
##AUDIT TRAIL= $$ (NUMBER, WHEN, WHO, WHERE, WHAT)
$$ ##TITLE= Audit trail, XWIN-NMR		Version 3.5
$$ ##JCAMPDX= 5.01
$$ ##ORIGIN= Bruker BioSpin GmbH
$$ ##OWNER= she
$$ F:/spectra/data/she/nmr/H-F/1/audita.txt
$$ ##AUDIT TRAIL=  $$ (NUMBER, WHEN, WHO, WHERE, WHAT)
(   1,<2024-06-26 15:50:04.37 +0400>,<she>,<DPX200>,
      <created by zg, POWCHK disabled, PULCHK disabled
       configuration hash MD5:
       00 E9 B6 7A A2 85 ED C7 34 08 36 98 17 FE 4E 26
       data hash MD5: 16K
       73 61 33 B4 4F 43 7A A3 FF 2C 89 8E A4 5D 2E 5A>)
$$ ##END=
$$ 
$$ hash MD5
$$ 81 0E 8C 13 A9 EC A5 57 B6 7C AF B3 4B D3 55 2C
##$RELAX= 
##$RELAX= 
##$RELAX= 
##$RELAX= 
##$RELAX= 
##$RELAX= 
$$ Bruker specific parameters
$$ --------------------------
##$DU= <F:/spectra>
##$EXPNO= 1
##$NAME= <H-F>
##$PROCNO= 1
##$TYPE= <nmr>
##$USER= <she>
##$AMP= (0..31)
100 100 100 100 100 100 100 100 100 100 100 100 100 100 100 100 100 100 
100 100 100 100 100 100 100 100 100 100 100 100 100 100 
##$AQSEQ= 0
##$AQ_mod= 1
##$AUNM= <au_zg>
##$AUTOPOS= <>
##$BF1= 200.13
##$BF2= 200.13
##$BF3= 200.13
##$BF4= 200.13
##$BF5= 200.13
##$BF6= 200.13
##$BF7= 200.13
##$BF8= 200.13
##$BYTORDA= 1
##$CFDGTYP= 0
##$CFRGTYP= 5
##$CHEMSTR= <none>
##$CNST= (0..31)
1 1 145 1 1 1 1 1 1 1 1 1 1 1 1 1 1 1 1 1 1 1 1 1 1 1 1 1 1 1 1 1 
##$CPDPRG= <>
##$CPDPRG1= <>
##$CPDPRG2= <>
##$CPDPRG3= <>
##$CPDPRG4= <mlev>
##$CPDPRG5= <mlev>
##$CPDPRG6= <mlev>
##$CPDPRG7= <mlev>
##$CPDPRG8= <mlev>
##$CPDPRGB= <>
##$CPDPRGT= <>
##$D= (0..31)
0 1.2 0 0 0 0 0 0 0 0.06 0 0.03 0 0 0 0 0.0002 0 0 0 0 0 0 0 0 0 0 0 0 
0 0 0 
##$DATE= 1719402604
##$DBL= (0..7)
120 120 120 120 120 120 120 120 
##$DBP= (0..7)
150 150 150 150 150 150 150 150 
##$DBP07= 0
##$DBPNAM0= <>
##$DBPNAM1= <>
##$DBPNAM2= <>
##$DBPNAM3= <>
##$DBPNAM4= <>
##$DBPNAM5= <>
##$DBPNAM6= <>
##$DBPNAM7= <>
##$DBPOAL= (0..7)
0.5 0.5 0.5 0.5 0.5 0.5 0.5 0.5 
##$DBPOFFS= (0..7)
0 0 0 0 0 0 0 0 
##$DE= 6
##$DECBNUC= <off>
##$DECIM= 32
##$DECNUC= <off>
##$DECSTAT= 4
##$DIGMOD= 1
##$DIGTYP= 9
##$DL= (0..7)
0 120 120 120 120 120 120 120 
##$DP= (0..7)
150 150 150 150 150 150 150 150 
##$DP07= 0
##$DPNAME0= <>
##$DPNAME1= <>
##$DPNAME2= <>
##$DPNAME3= <>
##$DPNAME4= <>
##$DPNAME5= <>
##$DPNAME6= <>
##$DPNAME7= <>
##$DPOAL= (0..7)
0.5 0.5 0.5 0.5 0.5 0.5 0.5 0.5 
##$DPOFFS= (0..7)
0 0 0 0 0 0 0 0 
##$DQDMODE= 0
##$DR= 18
##$DS= 0
##$DSLIST= <SSSSSSSSSSSSSSS>
$$ [...]
##$SUBNAM2= <"">
##$SUBNAM3= <"">
##$SUBNAM4= <"">
##$SUBNAM5= <"">
##$SUBNAM6= <"">
##$SUBNAM7= <"">
##$SUBNAM8= <"">
##$SUBNAM9= <"">
##$SW= 18.0517328524113
##$SWIBOX= (0..15)
0 0 2 0 0 0 0 0 0 0 0 0 0 0 0 0 
##$SW_h= 3612.71676300578
##$TD= 16384
##$TD0= 1
##$TE= 0
##$TE2= 300
##$TE3= 300
##$TEG= 300
##$TL= (0..7)
0 120 120 120 120 120 120 120 
##$TP= (0..7)
150 150 150 150 150 150 150 150 
##$TP07= 0
##$TPNAME0= <>
##$TPNAME1= <>
##$TPNAME2= <>
##$TPNAME3= <>
##$TPNAME4= <>
##$TPNAME5= <>
##$TPNAME6= <>
##$TPNAME7= <>
##$TPOAL= (0..7)
0.5 0.5 0.5 0.5 0.5 0.5 0.5 0.5 
##$TPOFFS= (0..7)
0 0 0 0 0 0 0 0 
##$TUNHIN= 0
##$TUNHOUT= 0
##$TUNXOUT= 0
##$USERA1= <user>
##$USERA2= <user>
##$USERA3= <user>
##$USERA4= <user>
##$USERA5= <user>
##$V9= 5
##$VALIST= <valist>
##$VCLIST= <CCCCCCCCCCCCCCC>
##$VD= 0
##$VDLIST= <DDDDDDDDDDDDDDD>
##$VPLIST= <PPPPPPPPPPPPPPP>
##$VTLIST= <TTTTTTTTTTTTTTT>
##$WBST= 1024
##$WBSW= 4
##$XGAIN= (0..3)
0 0 0 0 
##$XL= 0
##$YL= 0
##$YMAX_a= 144642
##$YMIN_a= -157180
##$ZGOPTNS= <>
##$ZL1= 120
##$ZL2= 120
##$ZL3= 120
##$ZL4= 120
##$ABSF1= 10
##$ABSF2= 0
##$ABSG= 5
##$ABSL= 3
##$ALPHA= 0
##$AQORDER= 0
##$ASSFAC= 0
##$ASSFACI= 0
##$ASSFACX= 0
##$ASSWID= 0
##$AUNMP= <proc_1d>
##$AZFE= 0.1
##$AZFW= 0.1
##$BCFW= 1
##$BC_mod= 2
##$BYTORDP= 1
##$COROFFS= 0
##$CY= 11.3945322036743
##$DATMOD= 1
##$DC= 2
##$DFILT= <>
##$DTYPP= 0
##$F1P= 15.6554695791079
##$F2P= 12.8336369535428
##$FCOR= 0.5
##$FTSIZE= 0
##$FT_mod= 4
##$GAMMA= 1
##$GB= 0.15
##$INTBC= 1
##$INTSCL= 1
##$ISEN= 128
##$LB= 0.24
##$LEV0= 0
##$LPBIN= 0
##$MAXI= 10000
##$MC2= 0
##$MEAN= 0
##$ME_mod= 0
##$MI= 1.114404
##$NCOEF= 0
##$NC_proc= 0
##$NLEV= 6
##$NOISF1= 3.799351
##$NOISF2= 2.8
##$NSP= 1
##$NTH_PI= 0
##$NZP= 0
##$OFFSET= 15.70392
##$PC= 1
##$PHC0= -25321.72
##$PHC1= 13.38748
##$PH_mod= 1
##$PKNL= yes
##$PPARMOD= 0
##$PSCAL= 0
##$PSIGN= 0
##$REVERSE= no
##$SF= 200.130013532006
##$SI= 16384
##$SIGF1= 3
##$SIGF2= 2
##$SINO= 400
##$SIOLD= 16384
##$SREGLST= <1H.CDCl3>
##$SSB= 0
##$STSI= 0
##$STSR= 0
##$SW_p= 3612.71676300578
##$SYMM= 0
##$S_DEV= 0
##$TDeff= 0
##$TDoff= 0
##$TI= <>
##$TILT= no
##$TM1= 0
##$TM2= 0
##$TOPLEV= 0
##$USERP1= <user>
##$USERP2= <user>
##$USERP3= <user>
##$USERP4= <user>
##$USERP5= <user>
##$WDW= 1
##$XDIM= 8192
##$YMAX_p= 0
##$YMIN_p= 0
$$ End of Bruker specific parameters
$$ ---------------------------------
##NTUPLES= NMR FID
##VAR_NAME=  TIME,          FID/REAL,        FID/IMAG
##SYMBOL=    X,             R,               I
##VAR_TYPE=  INDEPENDENT,   DEPENDENT,       DEPENDENT
##VAR_FORM=  AFFN,          ASDF,            ASDF
##VAR_DIM=   8192,          8192,            8192
##UNITS=     SECONDS,       ARBITRARY UNITS, ARBITRARY UNITS
##FACTOR=    0.0002768,     1,               1
##FIRST=     0,             0,               0
##LAST=      2.2672688,     0,               0
##MIN=       0,             -157180,         0
##MAX=       2.2672688,     144642,          0
$$ Real data points
##PAGE= N=1
##DATA TABLE= (X++(R..R)), XYDATA
$$ plain form
0 0 0 0 0 0 0 0 0 0 0 0 0 0 0 0 0 0 3 -8 8 -8 8 -8 11 -16 16 -17 24 -24 30 -32 38 -43 50 -56 61 -70 79 -89
38 -89 98 -109 121 -135 150 -166 185 -202 223 -246 272 -299 329 -363 401 -443 490 -543 603 -675
58 -675 756 -854 974 -1121 1309 -1561 1911 -2440 3325 -5070 9838 -52141 -157180 -80501
72 -80501 -46167 -40626 41743 144642 142334 98921 68233 25527 -46116 -98208 -93617 -31523 18841
85 18841 32031 58617 79319 11482 -74209 -79818 -76149 -111467 -81151 20647 70733 64879 84266
98 84266 87678 22036 -43946 -46377 -24818 -14428 6969 55401 89314 66636 16757 -11392 -40350
111 -40350 -94873 -111884 -55225 -3143 7024 32981 68265 40683 -21405 -37850 -32366 -47868
123 -47868 -38425 24714 78964 84375 75240 64625 22479 -42960 -78175 -66115 -42745 -25566 11082
$$ packed form
0@%%%%%%%%%%%%%%%%Lj1J6j6J6j6J9k7L2l3M1m8N4o2P0q1R3j06J17j31J49j68
38h9J87k07K30k56K85l16L51l87M25m69N18n71O28o92P64q44R33j033J146j278
58f75J431j610J828k095K430k870L472m351N765q395J4908o1979j05039P6679
72h0501L4334N541Q2369J02899k308m3413l0688m2706p1643n2092M591O2094N0364
85A8841J3190K6586K0702o7837q5691n609L669l5318L0316J01798N0086n854J9387
98H4266L412o5642o5982k431K1559J0390K1397M8432L3913k2678m9879k8149k8958
111d0350n4523j7011N6659N2082J0167K5957L5284k7582o2088j6445N484j5502
123d7868R443O3139N4250N411r135j0615m2146o5439l5215J2060K3370J7179L6648
$$ plain form
136 11082 57366 59670 16658 -16429 -35672 -73706 -94677 -51285 9917 38749 62440 92669
148 92669 79036 21829 -19323 -34705 -50524 -52290 -14880 35284 58728 53665 39736 13164
160 13164 -36248 -80342 -81813 -55522 -34938 -3967 47391 72008 48408 22377 6970 -26684
172 -26684 -57337 -40974 -1517 22151 40935 64059 62779 26788 -13976 -37916 -53028 -61881
184 -61881 -47512 -5305 28933 33848 31080 27713 -2159 -44148 -50540 -31926 -21043 -289 43649
197 43649 68719 54235 32559 13657 -17788 -49293 -50688 -24424 994 17194 34516 44691
209 44691 23361 -17036 -39923 -45148 -53437 -44355 -757 38237 45017 43969 43321 15870 -26204
222 -26204 -41820 -31155 -20374 -5158 27137 55219 49268 21657 -16 -21092 -52493 -64844
$$ packed form
136A1082M6284K304m3012l3087j9243l8034k0971M3392O1202K8832K3691L0229
148I2669j3633n7207m1152j5382j5819j766L7410N0164K3444n063j3929k6572
160A3164m9412m4094j471K6291K0584L0971N1358K4617k3600k6031j5407l3654
172b6684l0653J6363L9457K3668J8784K3124j280l5991m0764k3940j5112q853
184f1881J4369M2207L4238M915k768l367k9872m1989o392J8614J0883K0754M3938
197D3649K5070j4484k1676j8902l1445l1505j395K6264K5418J6200J7322J0175
209D4691k1330m0397k2887n225q289R082M3598L8994O780j048o48k7451m2074
222b6204j5616J0665J0781J5216L2295K8082n951k7611k1673k1076l1401j2351
$$ plain form
234 -64844 -38850 -5660 9784 27975 49789 40095 2623 -21330 -26857 -36798 -37690 -7530 31448
247 31448 44737 41092 40697 26738 -12347 -43565 -41731 -30532 -25310 -3409 32583 42921 22817
260 22817 6568 -4382 -29458 -51752 -39620 -8421 9956 23056 45230 51672 23831 -8039
272 -8039 -18511 -25875 -38120 -26789 9630 31377 27855 26128 23999 -3070 -38363 -44721 -30686
285 -30686 -22301 -9295 22531 45363 34322 13200 3156 -11226 -36003 -38234 -10457 12654
297 12654 19929 32765 44123 25796 -9606 -26815 -28810 -36469 -34420 -4764 25337 28767 22575
310 22575 22299 8319 -23434 -39898 -27572 -14081 -5738 15629 42099 42364 19626 4052 -6468
323 -6468 -28092 -41361 -25812 121 11294 19519 33230 30235 2049 -22003 -26932 -30286 -33965
$$ packed form
234f4844K5994L3190J5444J8191K1814r694l7472k3953n527r941q92L0160L8978
247C1448J3289l645l95j3959l9085l1218J834J1199N222K1901L5992J0338k0104
260B2817j6249j0950k5076k2294J2132L1199J8377J3100K2174O442k7841l1870
272h039j0472p364j2245J1331L6419K1747l522j727k129k7069l5293o358J4035
285c0686Q385J3006L1826K2832j1041k1122j0044j4382k4777k231K7777K3111
297A2654P275J2836J1358j8327l5402j7209j995p659K049K9656L0101L430o192
310B2575k76j3980l1753j6464J2326J3491Q343K1367K6470K65k2738j5574j0520
323f468k1624j3269J5549K5933J1173Q225J3711k995k8186k4052m929l354l679
$$ plain form
336 -33965 -15933 16654 31907 28720 27144 21648 -4170 -29951 -30333 -18472 -11531 1384 26798
349 26798 38582 23728 5805 -4835 -20663 -38670 -34572 -10949 6830 15224 27172 33234 15669
362 15669 -10294 -20634 -22017 -25653 -17799 8351 28512 28011 23256 18824 997 -24368 -32119 -22486
376 -22486 -13364 -3672 15005 30425 24880 7518 -3760 -13574 -28046 -30909 -12631 7659 16205
389 16205 24000 31213 20880 -3244 -17227 -20290 -24054 -20822 -1474 19391 24368 20765 16757 4544
403 4544 -16884 -30954 -25876 -15147 -6866 8518 27766 30191 15857 3353 -5521 -20953 -30340
416 -30340 -18473 617 10981 19054 28605 24077 4160 -13747 -20863 -25310 -25101 -11519 11130
429 11130 23292 21573 18657 12361 -6422 -24839 -24900 -15499 -9291 2821 22874 30426 19414 6893
$$ packed form
336c3965J8032L2587J5253l187j576n496k5818k5781l82J1861O941J2915K5414
349B6798J1784j4854j7923j0640j5828j8007M098K3623J7779Q394J1948O062j7565
362A5669k5963j0340j383l636P854K6150K0161n01m755m432j7827k5365p751R633
376b2486R122R692J8677J5420n545j7362j1278r814j4472k863J8278K0290Q546
389A6205P795P213j0333k4124j3983l063l764L232J9348K0865M977l603m008j2213
403D544k1428j4070N078J0729Q281J5384J9248K425j4334j2504q874j5432r387
416c0340J1867J9090J0364Q073R551m528j9917j7907p116m447K09J3582K2649
429A1130J2162j719k916o296j8783j8417o1R401O208J2112K0053P552j1012j2521
$$ plain form
443 6893 -1935 -15627 -27856 -22677 -5887 5931 12480 20788 23179 8745 -9890 -17398 -18702 -21535
457 -21535 -14510 6112 21348 20308 16619 15129 1161 -18472 -22956 -14416 -9378 -2960 13872 25973
471 25973 19355 6437 -1411 -10640 -23184 -24792 -10619 4092 9920 16188 23240 16343 -3126 -14687
485 -14687 -15401 -17941 -17763 -676 18796 20630 15869 15245 6145 -13415 -23930 -19031 -12263 -6557 6607
500 6607 22294 23765 11445 166 -6360 -16478 -24936 -16200 1806 9649 12956 22301 22076 3321
514 3321 -12599 -14411 -16891 -19181 -7574 11195 18717 15617 12783 7969 -5179 -19671 -21217 -12167
528 -12167 -5707 1145 15885 24816 14798 1622 -2159 -8678 -20678 -18271 -2437 6442 8888 16425
542 16425 19862 8277 -7496 -13880 -14905 -15858 -11074 2523 15906 16314 10868 9758 2638 -13376
$$ packed form
443F893q828j3692j2229N179J6790J1818O549Q308K391j4434j8635p508j304k833
457b1535P025K0622J5236j040l689j490j3968j9633m484Q540N038O418J6832J2101
471B5973o618j2918p848r229j2544j608J4173J4711N828O268P052o897j9469j1561
485a4687p14k540J78J7087J9472J834m761o24r100j9560j0515M899O768N706J3164
500F607J5687J471j2320j1279o526j0118q458Q736J8006P843L307R345k25j8755
514C321j5920j812k480k290J1607J8769P522l100k834m814j3148j4492j546R050
528a2167O460O852J4740Q931j0018j3176l781o519j2000K407J5834Q879K446P537
542A6425L437j1585j5773o384j025r53M784J3597J3383M08n446j110p120j6014
$$ plain form
556 -13376 -20839 -12700 -5435 -1730 10233 22059 17691 4910 -1208 -7158 -16985 -19968 -9427 2622
570 2622 8611 12992 17281 12968 -1773 -13991 -14495 -13112 -12835 -2606 13281 17921 12370 10307 6215
585 6215 -8456 -19526 -15527 -7642 -3032 5843 17066 18072 8258 -506 -5896 -13040 -18495 -13540
599 -13540 -999 7872 11222 15171 15206 4030 -9582 -12836 -11187 -11920 -6222 7602 14987 12223 9703
614 9703 7233 -3573 -15399 -15947 -10119 -4688 1830 11011 16214 11410 2582 -3469 -7979 -14362 -14929
629 -14929 -4661 5430 9129 12597 15530 7709 -5675 -10857 -10164 -12184 -9062 2302 11572 11839
643 11839 10482 7451 -143 -10874 -15376 -11351 -4949 415 7615 15677 14036 4746 -1413 -5169 -12395
658 -12395 -15689 -6871 3403 7060 10791 14431 9135 -2299 -9444 -10814 -11550 -9950 -1549 8698
$$ packed form
556a3376p463Q139P265L705J1963J1826m368j2781o118n950r827k983J0541J2049
570B622N989M381M289m313j4741j2218n04J383K77J0229J5887M640n551k063m092
585F215j4671j1070L999P885M610Q875J1223J006r814q764n390p144n455M955
599a3540J2541Q871L350L949L5j1176j3612l254J649p33N698J3824P385k764k520
614I703k470j0806j1826n48N828N431O518R181N203m804q828o051m510o383n67
629a4929J0268J0091L699L468K933p821j3384n182O93k020L122J1364R270K67
643A1839j357l031p594j0731m502M025O402N364P200Q062j641r290o159l756p226
658a2395l294Q818J0274L657L731L640n296j1434p145j370p36J600Q401J0247
$$ plain form
672 8698 12301 10520 7876 3399 -6265 -13919 -11556 -4879 -1661 3970 12980 14234 6282 162 -3043
687 -3043 -9299 -14733 -9537 -40 5223 7936 11547 10832 2170 -6830 -9320 -9343 -9972 -5174 5262 11845
703 11845 9871 7519 5960 -1947 -11581 -11919 -6598 -3277 285 8721 13532 8567 1471 -2115 -6412
718 -6412 -12335 -11907 -2922 4155 6428 9341 11635 5815 -4563 -8583 -8082 -8311 -7121 1840 10661 10150
734 10150 7127 5917 849 -8854 -12729 -7962 -3428 -909 5210 11868 10385 2877 -1897 -4457 -9414
749 -9414 -11668 -5288 2923 6196 7126 10013 8284 -870 -7565 -7803 -7285 -7783 -1965 7151 10008 7031
765 7031 5202 2829 -4656 -11140 -9241 -4179 -1446 2493 9161 11500 5978 -405 -2586 -6032 -10534
780 -10534 -8146 195 5416 5871 8482 8980 2231 -5977 -8128 -6986 -7594 -4686 3777 9168 8145 5156
$$ packed form
672H698L603j781k644m477r664p654K363O677L218N631R010J254p952o120l205
687c043o256n434N196R497N263K713L611p15q662r000k490k3o29M798J0436O583
703A1845j974k352j559p907r634l38N321L321L562Q436M811m965p096l586m297
718f412n923M28Q985P077K273K913K294n820j0378m020N01k29J190Q961Q821n11
734A0150l023j210n068r703l875M767M534K519O119O658j483p508m774k560m957
749i414k254O380Q211L273R30K887j729r154o695k38N18m98N818R116K857k977
765G031j829k373p485o484J899N062K733L939O668K339n522o383k181l446m502
780a0534K388Q341N221M55K611M98o749q208k151J142o08K908Q463N391j023k989
$$ plain form
796 5156 3856 -1589 -8521 -10270 -5241 -1442 955 6570 10666 7696 875 -2389 -4618 -8809 -8998
811 -8998 -2686 3658 5365 6588 8055 4418 -3537 -7458 -6806 -6166 -4895 1051 7666 8592 5491 3784
827 3784 598 -5625 -9256 -6751 -2324 55 3890 9042 8356 2802 -1644 -4015 -6771 -8706 -4927
842 -4927 1574 4740 5929 7463 5824 -556 -5701 -6478 -5712 -5515 -1216 5317 8225 6128 4221 2013
858 2013 -3357 -8268 -7786 -3794 -1284 1979 7208 8453 4770 -212 -2415 -5334 -8217 -6399 -343
873 -343 3844 5105 6889 6762 2048 -4260 -5838 -5818 -5478 -2989 2981 7116 6025 4365 2795 -1552
889 -1552 -6831 -7739 -4260 -1858 879 5123 8178 5656 935 -1615 -3501 -6952 -6973 -1905 2728 4090
905 4090 5243 6518 3592 -2600 -5572 -4992 -5061 -4368 729 5763 6345 4285 3214 406 -4795 -7352
$$ packed form
796E156j300n445o932j749N029L799K397N615M096k970o821l264k229m191j89
811h998O312O344J707J223J467l637p955l921O52O40J271N946O615R26l101j707
827C784l186o223l631K505M427K379L835N152o86n554m446k371k756j935L779
842d927O501L166J189J534j639o380n145p77P66J97M299O533K908k097j907k208
858B013n370m911M82L992K510L263N229J245l683m982k203k919k883J818O056
873c43M187J261J784j27m714o308j578K0L40K489N970M135j091j660j570m347
889a552n279r08L479K402K737M244L055k522m721k550j886l451k1N068M633J362
905D090J153J275k926o192k972N80o9O93N097N034N82k060j071k808n201k557
$$ plain form
921 -7352 -5155 -1996 -166 2984 7246 7099 2235 -1024 -2464 -5392 -7550 -3922 1081 3580 4381 6308
937 6308 5088 -294 -4799 -5021 -5157 -4802 -1460 4244 6670 4901 3329 1812 -2454 -6983 -5812 -2473
953 -2473 -584 1302 5532 7396 3404 -419 -1740 -3960 -6680 -5098 -311 2985 3492 4629 5501 1871
969 1871 -3287 -4962 -4215 -3999 -3036 1780 6345 5361 2734 2476 -209 -5590 -6459 -3220 -905 61 3272
986 3272 6632 4917 890 -1832 -2984 -5289 -5929 -2004 2456 3829 4061 5061 3789 -1288 -5300 -4141
1002 -4141 -3776 -3868 -71 5039 5921 3254 2164 740 -3749 -6405 -4492 -1759 -10 2196 5661 5987
1018 5987 2623 -1051 -2701 -4049 -5755 -3714 1326 3638 3391 4237 4333 301 -4026 -4653 -3831 -3554 -1312
1035 -1312 3077 5479 3936 2378 1082 -1844 -4963 -5196 -2642 146 1317 3925 6134 3845 -93
$$ packed form
921g352K197L159J830L150M262j47m864l259j440k928k158L628N003K499Q01J927
937F308j220n382m505k22j36L55L342N704K426j769j572j517m266m529J171L339
953b473J889J886M230J864l992l823j321k220k720J582M787L296N07J137Q72l630
969A871n158j675P47K16R63M816M565r84k627k58k685n381q69L239K315R66L211
986C272L360j715m027k722j152k305o40L925M460J373K32J000j272n077m012J159
1002d141L65r2L797N110Q82k667j090j424m489k656J913K733J749K206L465L26
1018E987l364l674j650j348j706K041N040K312k47Q46R6m032m327o27Q22K77K242
1035a312M389K402j543j558j296k926l119k33K554K788J171K608K209k289l938
$$ plain form
1050 -93 -1955 -2805 -4767 -4602 -376 2936 2884 4041 4665 1714 -2492 -4254 -3925 -3337 -1880 1366 4524
1067 4524 4893 2780 1436 -229 -3618 -5487 -3452 -847 398 2712 5750 4472 796 -1460 -2557
1082 -2557 -4665 -4861 -2012 1502 2859 3806 4204 2594 -735 -4018 -4253 -3341 -2551 166 3697 4815
1098 4815 3012 1682 768 -2795 -5558 -3993 -1617 -291 1819 4745 4682 1858 -741 -2263 -3788 -4366
1114 -4366 -2841 459 2679 3455 3977 3464 708 -3371 -3957 -3177 -3102 -1484 2619 4889 3143 1934 1821
1131 1821 -1450 -4509 -4444 -2302 -560 1107 3580 4976 3258 39 -1235 -2647 -4293 -3944 -617 2348
1147 2348 2478 3572 4298 2017 -2149 -3762 -3272 -3275 -2571 1219 4032 3855 2513 1816 -218 -3590 -4854
1164 -4854 -3080 -803 433 2122 4648 4083 679 -1660 -1906 -3453 -4677 -2019 1503 2817 2754 3929
$$ packed form
1050i3j862q50j962J65M226L312n2J157O24k951m206j762L29N88J457L246L158
1067D524L69k113j344j665l389j869K035K605J245K314L038j278l676k256j097
1082b557k108j96K849L514J357R47L98j610l329l283k35R12P90K717L531J118
1098D815j803j330r14l563k763J565K376J326K110K926o3k824k599j522j525n78
1114d366J525L300K220P76N22n13k756m079n86P80P5J618M103K270j746j209j13
1131A821l271l059O5K142J742J667K473J396j718l219j274j412j646L49L327K965
1147B348J30J094P26k281m166j613M90lP04L790K813j77j342o97k034l372j264
1164d854J774K277J236J689K526n65l404k339k46j547j224K658L522J314o3J175
$$ plain form
1180 3929 3217 -1155 -3549 -3177 -2907 -2771 -490 3298 4167 2822 1894 866 -2107 -4836 -3962 -1063 8
1197 8 869 3996 4786 1796 -1241 -1339 -2618 -4674 -3446 629 2418 2407 3306 3573 422 -2737 -3413 -2833
1215 -2833 -2359 -1434 1711 4081 3653 1403 986 -688 -3579 -4468 -2009 -441 466 2441 4746 3292
1231 3292 154 -1730 -2057 -3555 -3704 -1038 2298 3021 2770 2963 1760 -1532 -3632 -2842 -2085 -2132 398
1248 398 3633 3783 2342 1173 228 -2970 -4373 -2856 -840 562 1534 3762 3919 843 -1276 -1775
1264 -1775 -3038 -3940 -2026 1186 2498 2569 2926 2630 -136 -2997 -3258 -2373 -1875 -365 2309 4195 2898
1281 2898 1509 465 -1452 -4093 -3598 -1352 126 945 2927 4175 2535 -781 -1714 -2600 -3776 -3197
1297 -3197 -253 2478 2731 2937 2913 1042 -1843 -3231 -2649 -2188 -1518 1309 3573 3323 1864 968 -582
$$ packed form
1180C929p12m372k394L72K70J36K281L788Q69j345r28j028k973k729Q74K899J071
1197HQ61L127P90k990l037r8j279k056J228M075J789j1Q99K67l151l159o76N80
1215b833M74R25L145K370m28k250m17j674k891q89K459J568R07J975K305j454
1231C292l138j884l27j498j49K666L336P23k51J93j203l292k100P90P57m7K530
1248C98L235J50j441j169r45l198j403J517K016J402R72K228J57l076k119m99
1264a775j263r02J914L212J312P1L57k96k766k861k61Q85M98J510K674J886j297
1281B898j389j044j917k641M95K246J478Q19J982J248j640l316r33q86j176N79
1297c197K944K731K53K06k4j871k885j388N82M61O70K827K264k50j459q96j550
$$ plain form
1314 -582 -3042 -4242 -2292 -314 490 2299 3863 2961 364 -1320 -1684 -3383 -3334 -1136 1855 2425 2560
1331 2560 3058 1781 -849 -3063 -2820 -2437 -2091 130 3063 3486 2094 1387 245 -2330 -4012 -2844
1347 -2844 -774 111 1590 3553 3647 1095 -519 -1633 -2836 -3423 -2263 738 2243 2517 2819 2550 78
1364 78 -2325 -2821 -2484 -2390 -735 2024 3647 2431 1386 837 -1385 -3774 -3362 -1079 -33 868 2767
1381 2767 3820 2090 -302 -1231 -2245 -3224 -2950 -238 2130 2298 2878 2930 1134 -2096 -2857 -2451 -2149
1398 -2149 -1571 1382 3579 3133 1526 1067 -470 -2824 -3978 -2056 -329 394 2296 3631 3256 615
1414 615 -1072 -1506 -2717 -3257 -1465 1643 2270 2139 2833 2327 -891 -2887 -2409 -2072 -2000 -250 2934 3518
1432 3518 2040 1257 855 -1594 -3790 -3059 -838 223 1293 2910 3773 1177 -1081 -1253 -1999 -3651
$$ packed form
1314e82k460j200J950J978Q04J809J564r02k597j684l64j699M9K198K991N70J35
1331B560M98j277k630k214K43L83L46K221K933M23j392p07j142k575j682J168
1347b844K070Q85J479J963R4k552j614j114j203n87J160L001J505K74L02k69k472
1364G8k403m96L37R4J655K759J623j216j045n49k222k389M12K283J046R01J899
1381B767J053j730k392r29j014r79K74K712K368J68N80N2j796l230p61M06L02
1398b149N78K953K197m46j607m59j537k354j154J922J727P23J902J335l75k641
1414F15j687m34j211n40J792L108O27j31O94n06l218j996M78L37P2J750L184N84
1432C518j478p83m02k449k196P31K221J061J070J617Q63k596k258j72p46j652
$$ plain form
1448 -3651 -2508 699 2171 1905 2685 2542 425 -2817 -2903 -2201 -1878 -1116 1312 3443 2733 1173 649
1465 649 -781 -3262 -3629 -1521 -112 712 2386 3634 2199 -506 -1172 -1973 -3190 -2865 -519 1892
1481 1892 2249 2091 2705 1674 -1591 -3219 -2303 -1921 -1468 530 3139 3147 1705 584 86 -2354 -3537
1498 -3537 -2262 -167 383 1658 3173 2881 658 -1172 -1720 -2458 -3135 -1745 1146 2586 1979 2337 2090
1515 2090 -656 -2769 -2628 -1813 -1909 -270 2266 3083 2194 1187 401 -1578 -3278 -2731 -1142 -281 1366
1532 1366 2375 3176 1544 -522 -1900 -2095 -2846 -2216 259 2299 2033 2199 2565 435 -2145 -2780 -2133
1549 -2133 -2145 -836 1531 3194 2665 1596 491 -917 -2608 -2871 -1371 131 857 2127 3299 2546
1565 2546 -14 -1641 -1611 -2915 -2818 -622 1627 2077 2054 2708 1242 -1304 -2529 -2337 -2104 -1348 745 3034
$$ packed form
1448c651J143L207J472k66P80j43k117l242q6P02L23P62K428K131p10j560n24
1465F49j430k481l67K108J409Q24J674J248j435k705o66q01j217L25K346K411
1481A892L57j58O14j031l265j628R16L82M53J998K609Qj442j121m98k440j183
1498c537J275K095N50J275J515k92k223j830n48p38o77J390K891J440o07L58k47
1515B090k746k113J41Q15r6J639K536Q17q89j007p86j979j700N47J589Q61J647
1532A366J009Q01j632k066j378j95p51O30K475K040k66J66L66k130k580o35O47
1549b133j2J309K367J663n29j069j105j408j691k63J500J502P26J270J172p53
1565B546k560j627L0j304R7K196K249M50k3O54j466k546j225J92K33P56K093K289
$$ plain form
1583 3034 3040 1783 766 -302 -2068 -3608 -2159 -55 301 914 3176 3123 497 -914 -1492 -2759 -3354
1600 -3354 -1159 1266 1794 1961 2474 1750 -384 -2634 -2504 -2123 -1673 -527 2109 3387 1964 469 667
1617 667 -1313 -3373 -2729 -917 137 818 2664 3382 1257 -305 -1327 -2200 -2760 -2058 432 1715 1869
1634 1869 2123 2517 640 -2017 -2839 -1701 -1765 -1258 1469 3299 2423 1051 636 -587 -2732 -3251 -1562
1651 -1562 -159 392 1981 3385 2737 20 -1172 -1226 -2376 -2699 -811 1461 1819 1785 2190 1771 -1139
1668 -1139 -2539 -1913 -1620 -1749 247 2633 2773 1382 842 -248 -1657 -3063 -2143 -466 879 1134 2575
1685 2575 2955 686 -1252 -1193 -1876 -2991 -1767 826 1922 1579 2133 2041 -187 -2391 -2382 -1845 -1318 -411
1703 -411 1974 2994 2142 763 74 -788 -3009 -2772 -970 440 669 2138 3108 1574 -685 -1335 -1696
$$ packed form
1583C034Oj257j017j068j766j540J449K104L56O13K262n3k626j411n78j267n95
1600c354K195K425N28J67N13p24k134k250J30L81M50J146K636J278j423j495J98
1617F67j980k060O44J812J054O81J846P18k125j562j022q73n60P02K490J283J54
1634A869K54L94j877k657q22J138o4N07K727J830q76j372m15j223k145n19J689
1651a562J403N51J589J404o48k717j192n4j150l23J888K272L58l4M05m19k910
1668a139j400O26K93j29J996K386J40j391n40j090j409j406R20J677J345K55J441
1685B575L80k269j938N9o83j115J224K593J096l43N54r2k228k204RN37N27R07
1703d11K385J020q52j379o89q62k221K37J802J410K29J469R70j534k259o50l61
$$ plain form
1720 -1696 -2544 -2148 -38 1777 1847 2066 2033 881 -1589 -2442 -1681 -1258 -877 860 2733 2673 1284 367
1738 367 -143 -2222 -2929 -1540 153 453 1659 2770 2151 324 -1147 -1774 -2604 -2275 -891 1172 2189
1755 2189 1946 1889 1042 -774 -2327 -2064 -1197 -1258 186 2135 2782 1569 612 121 -1586 -2726 -2023 -462
1773 -462 307 1323 2233 2667 1031 -569 -1214 -1879 -2431 -1201 514 1722 1939 1850 1715 178 -2164 -2318
1791 -2318 -1328 -1501 -253 1483 2316 1947 1388 409 -1079 -2490 -2481 -884 110 777 2009 2369 1336 -316
1809 -316 -1206 -1536 -2513 -1988 30 1407 1587 1609 1996 792 -1708 -1950 -1735 -1291 -906 865 2582 2278
1827 2278 1426 604 -437 -2029 -2650 -1407 -25 344 1384 2614 1956 24 -927 -946 -1980 -2421 -734
1844 -734 1133 1628 1528 1535 1669 -668 -2211 -1804 -1258 -1141 54 2018 2586 1325 610 61 -1147 -2513
$$ packed form
1720a696q48L96K110J815P0K19l3j152k470q53P61M23L81J737J873o0j389r17
1738C67n10k079p07J389J693L00J206J111o19j827j471o27q30L29J384K063J017
1755B189k43n7q47j816j553K63Q67o1J444J949O47j213r57m91j707j140P03J561
1773d62P69J016R10M34j636j600o45o65n52J230J715J208K17q9j35j537k342j54
1791b318R90j73J248J736Q33l69n59r79j488j411RJ597R94O67J232L60j033j652
1809c16q90l30r77N25K018J377J80K2L87j204k500k42K15M44L85J771J717l04
1827B278q52q22j041j592o21J243J382L69J040J230o58j932r51j9j034m41J687
1844g34J867M95j00PJ34k337j543M07N46J17J195J964N68j261p15n49j208j366
$$ plain form
1862 -2513 -1856 -232 204 728 1764 2570 898 -875 -1073 -1555 -2323 -1296 595 1750 1587 1352 1627
1879 1627 90 -1973 -1963 -1245 -1056 -522 1003 2535 1667 601 423 -717 -2262 -2393 -793 314 632
1896 632 1383 2445 1520 -380 -1349 -1351 -1906 -1877 -217 1361 1733 1621 1770 811 -950 -1973 -1452 -864 -934
1915 -934 357 2044 1917 1145 207 -215 -1612 -2478 -1355 -150 435 939 2276 2021 703 -1022 -1044 -1502
1933 -1502 -2105 -919 881 1835 1129 1271 1288 -381 -1823 -1752 -1088 -819 -58 1755 2210 1338 454 -161 -1007
1952 -1007 -2145 -1945 -602 355 545 1673 1922 793 -525 -1186 -1304 -1737 -1605 94 1432 1471 1524 1420
1970 1420 86 -1571 -1795 -1267 -959 -544 902 2106 1773 486 360 -308 -1720 -2421 -921 -39 709
1987 709 1428 2090 1275 -214 -715 -1345 -1708 -1394 -370 875 1309 1390 1425 426 -625 -1444 -1427 -1114 -815 336
$$ packed form
1862b513O57J624M36N24J036Q06j672j773j98m82p68J027J891J155j63k35K75
1879A627j537k063J0P18J89N34J525J532q68j066j78j140j545j31J600J107L18
1896F32P51J062r25j900r69kn55K9J660J578L72j12J49r59j761j023N21N88p0
1915i34J291J687j27p72r38m22j397q66J123J205N85N04J337k55j318j725k2m58
1933a502o03J186J800R54p06J42J7j669j442P1O64K69P61J813M55q72q84o15q46
1952a007j138K00J343R57J90J128K49j129j318o61j18m33J32J699J338L9N3j04
1970A420j334j657k24N28L08M15J446J204l33j287j26o68j412p01J500Q82P48
1987G09P19O62q15j489n01o30l63L14J024J245M34Q1L5r99j051q19J7L13K99J151
$$ plain form
2007 336 1741 2317 850 437 -46 -1370 -2346 -1304 -102 281 789 1562 2043 266 -453 -770 -1287 -1663
2025 -1663 -1018 590 1582 1527 1175 1187 -158 -1675 -1381 -1044 -805 -264 1174 1942 1366 644 63 -869 -1709
2044 -1709 -1736 -228 134 756 1561 1949 1014 -440 -1128 -1325 -1627 -1521 294 1152 1344 1262 1391 445 -1409
2063 -1409 -1460 -1124 -699 -497 682 1500 1337 918 -72 -500 -1293 -1450 -1084 167 675 817 1858 1346 31
2082 31 -1230 -1189 -1367 -1542 -460 1097 1317 1060 1178 585 -756 -1665 -1137 -747 -648 132 1354 1728 960
2101 960 234 138 -920 -1835 -1305 -121 444 805 1566 1853 383 -494 -964 -996 -1478 -1037 372 1214 1108
2120 1108 886 822 -85 -1350 -1270 -913 -461 -346 772 1663 1339 237 231 -506 -1500 -1523 -210 517 577 1048
2140 1048 1475 1145 -206 -771 -1054 -1372 -1334 -98 790 1274 668 1246 523 -927 -1511 -1048 -570 -277 422
$$ packed form
2007C36J405N76j467m13m83j324r76J042J202L83N08P73M81j777p19l17n17l76
2025a663O45J608R92n5l52J2j345j517K94L37K39N41J438P68n76p22n81r32q40
2044a709k7J508L62O22Q05L88r35j454o88j97l02J06J815Q58J92q2J29r46j854
2063a409n1L36M25K02J179Q18j63m19r90m28p93j57L66J251N08J42J041n12j315
2082C1j261M1j78j75J082J557K20k57J18n93j341r09N28L90R9P80J222L74p68
2101I60p26r6j058r15N30J184N65L61P61K87j470q77m70l2m82M41J409Q42j06
2120A108k22o4r07j265Q0L57M52J15J118Q91l24j102op37r94k3J313P27O0M71
2140A048M27l30j351n65k83l18L8J236Q88M84o06N78p23j450n84M63M78K93O99
$$ plain form
2159 422 1486 1225 396 27 -721 -1010 -1779 -847 116 510 698 1367 1262 319 -832 -857 -790 -1243 -293 874
2179 874 1068 677 842 621 -707 -1482 -1101 -756 -859 -239 1431 1547 1078 309 -237 -776 -1313 -1294 -469 344
2199 344 691 940 1417 391 -475 -729 -1088 -1161 -884 24 919 1067 919 738 -234 -1169 -1351 -904 -687 -207
2219 -207 746 1203 1059 442 -264 -343 -1128 -1234 -364 534 550 998 1349 767 -315 -825 -838 -985 -858 39 716
2240 716 920 835 969 430 -327 -1049 -695 -530 -478 321 960 1087 44 43 -89 -852 -1239 -923 311 369 866
2261 866 1227 806 94 -606 -780 -1042 -826 -401 599 828 1001 531 694 -285 -1018 -1214 -529 -459 144 1082
2281 1082 1302 668 112 203 -553 -1128 -1001 -261 76 366 807 1130 334 -429 -477 -883 -842 -726 184 761 703
2302 703 717 767 21 -554 -994 -544 -363 -442 397 1200 751 440 10 -247 -1078 -965 -386 227 449 838 1030
$$ packed form
2159D22J064k61q29l69p48k89p69R32R63L94J88O69j05r43j151k5O7m53R50J167
2179H74J94l91J65k21j328p75L81L45j03O20J670J16m69p69n46n39n37J9Q25Q13
2199C44L47K49M77j026q66k54l59p3K77R08Q95J48j48j81r72r35j82M47K17M80
2219b07R53M57j44o17p06p9p85j06Q70Q98J6M48L51n82j082n10j3j47J27Q97O77
2240G16K04q5J34n39p57p22L54J65N2P99O39J27j043jj32p63l87L16J234N8M97
2261H66L61m21p12p00j74k62K16M25J000K29J73m70J63r79p33j96O85P0O03R38
2281A082K20o34n56R1p56n75J27P40L37K90M41L23p96p63m8m06M1J16R10N77n8
2302G03J4N0p46n75m40M50J81p9Q39Q03m49l11m30k57q31J13N79O13K22L89J92
$$ plain form
2323 1030 586 -61 -439 -375 -788 -703 -710 780 872 457 711 293 -414 -753 -680 -529 -635 315 981 1140 395
2344 395 413 189 -571 -866 -844 -106 481 308 922 630 124 -581 -505 -424 -675 -380 99 820 554 593 407 73
2366 73 -530 -794 -362 -437 -232 532 937 562 -42 20 -276 -722 -761 -281 270 184 616 706 566 -210 -696 -583
2388 -583 -441 -844 252 450 618 447 359 155 -549 -622 -454 -345 -101 256 733 730 2 -31 -10 -599 -929 -526
2410 -526 -39 130 337 815 499 -45 -641 -337 -666 -575 -456 553 900 462 479 329 -1 -934 -557 -328
2430 -328 -125 -91 495 666 437 205 -194 -156 -502 -548 -78 481 481 652 566 547 -183 10 -255 -708 -359 7
2452 7 660 310 370 545 132 -317 -810 -243 -114 -415 381 538 536 261 0 108 -641 -529 -581 -6 280 394
2474 394 874 371 10 -206 -468 -807 -859 71 335 191 691 438 158 -247 -548 -435 -348 -235 -34 621 792
$$ packed form
2323A030m44o47l78O4m13Q5pJ490R2m15K54m18p07l39P3J51j06R50O66J59p45
2344C95J8k24p60k95K2P38N87j73O14k92n06p05P6Q1k51K95M79P21k66L9j86l34
2366G3o03k64M32p5K05P64M05l75o04O2k96m46l9M80N51q6M32R0j40p76m86J13
2388e83J42m03J096J98J68j71q8k04p04p3J68J09K44L57M77lp28l3K1n89l30M03
2410e26M87J69K07M78l16n44n96L04l29R1J19J009L47m38J7j50l30r33L77K29
2430c28K03L4N86J71k29k32l99L8l46m6M70N59%J71q6j9p30J93k65m53L49L66
2452GO53l50O0J75m13m49m93N67J29l01P96J57kk75k61J08p49J12n2N75K86J14
2474C94M80n03l61k16k62l39n2R30K64j44N00k53k80m05l01J13Q7J13K01O55J71
$$ plain form
2495 792 575 272 17 -489 -452 -533 153 189 211 497 550 31 -290 -376 -484 -887 55 448 451 495 500 604 -75 -481
2519 -481 -621 -278 -235 -155 406 463 485 237 -159 -248 -526 -660 -355 -27 244 364 558 332 230 -318 -528 -247
2541 -247 -477 -6 571 499 260 543 181 -117 -461 -216 -430 -295 234 367 465 478 344 208 -394 -187 -336
2562 -336 101 220 94 437 493 112 -374 50 -591 -498 -320 675 577 111 433 430 -482 -615 -496 -279 -287 215
2584 215 120 473 444 156 6 -301 -306 -653 138 171 191 343 266 45 76 -339 -434 -492 -344 82 86 46 105 159 54
2609 54 -516 -437 -383 -358 -436 265 624 343 -1 -311 -212 -451 -721 68 82 184 186 369 122 86 -381 -381 -576 -614
2633 -614 -90 336 213 -86 586 219 -157 -385 -199 -286 -259 89 768 386 240 -139 -57 -354 -633 -264 97
2654 97 -79 496 642 321 91 -258 -435 -439 -410 -376 242 351 406 124 354 133 -560 -77 41 -260 -185 143
$$ packed form
2495G92k17l03k55n06L7q1O86L6K2K86N3n19l21q6j08m03R42L93LM4NJ04o79m06
2519d81j40L43M3Q0N61N7K2k48l96q9k78j34L05L28K71J20J94k26j02n48k10K81
2541b47k30M71N77p2k39K83l62k98l44K45k14J35N29J33R8J3j34j36o02K07j49
2562c36M37J19j26L43N6l81m86M24o41R3J78R95r8m66L22lr12j33J19K17qN02
2584B15r5L53k9k88j50l07nl47P91L3K0J52p7k21L1m15r5n8J48M26Mm0N9N4j05
2609E4n70P9N4K5p8P01L59k81l44l10R9k39k70P89J4J02KJ83k47l6m67%j95l8
2633f14N24M26j23k99O72l67l76k28J86q7K7L48O79l82j46l79Q2k97k79L69L61
2654I7j76N75J46l21k30l49j77mK9L4O18J09N5k82K30k21o93M83J18l01P5L28
$$ plain form
2676 143 647 359 131 -137 -186 -386 -192 -5 -119 -185 554 414 248 268 -205 -372 -263 -234 -158 246 154 148 227
2699 227 219 -400 -157 -286 -47 -147 80 361 313 -8 323 -169 -322 -316 -245 17 129 109 434 177 47 -583
2721 -583 -174 -296 -665 7 229 321 570 746 119 76 -311 -105 -277 130 53 141 458 160 100 147 -115 -429
2743 -429 -520 -215 -211 -3 392 635 252 -151 -224 -485 -392 -235 236 257 95 228 48 -179 -206 -438 -93 -52 61
2766 61 410 669 146 6 -71 -293 -345 -402 14 -92 64 426 501 111 29 -319 -196 -142 -249 61 -36 148 268
2789 268 638 327 -261 -642 -93 -109 -453 21 940 312 284 -62 -24 -283 -361 -250 -256 -84 14 197 470 -55
2811 -55 -205 -70 -310 -444 -280 123 502 494 131 272 148 -248 -321 -211 -135 -315 62 270 430 83 100 -30
2833 -30 -359 -503 -228 123 56 459 514 352 -302 -233 -40 -332 -405 253 210 131 96 65 313 -169 -290 -3 -370
$$ packed form
2676A43N04k88k28k68m9k00J94J87j14o6P39j40j66K0m73j67J09K9P6M04r2oP9
2699B27qo19K43j29K39j00K27K81m8l21L31m92j53OP1K62J12k0L25k57j30o30
2721e83M09j22l69O72K22R2K49J76o27m3l87K06j72M07p7Q8L17k98o0M7k62l14
2743d29r1L05MK08L95K43l83m03p3k61R3J57M71K1j62J33j80k27k7k32L45M1J13
2766F1L49K59n23j40p7k22n2n7M16j06J56L62P5l90q2l48J23N4j07L10r7J84J20
2789B68L70l11n88l81N49j6l44M74R19o28k8l46L8k59p8J11oJ72R8J83K73n25
2811e5j50J35k40j34J64M03L79ql63J41j24l96p3J10P6j80L77K08J60l47J7j30
2833c0l29j44K75L51o7M03N5j62o54O9J93k92p3O58m3p9l5l1K48m82j21K87l67
$$ plain form
2856 -370 -331 137 368 439 25 71 -34 -115 -601 -206 48 303 -22 306 310 72 230 -155 -373 -373 124 236 456
2879 456 335 206 205 54 -121 -314 -439 -90 43 214 329 179 253 -125 -224 -429 -212 8 -55 -5 475 545
2901 545 278 174 -5 -26 -270 -370 189 507 168 -82 445 256 -249 -437 -266 -71 -43 128 315 511 -45
2922 -45 92 120 -490 -503 -158 79 175 238 362 262 196 15 -429 -43 -169 -444 298 -12 123 179 227 -193 -537
2945 -537 -371 -295 -480 68 369 131 82 235 -37 -197 -279 -255 86 -51 153 322 506 217 -231 69 -314
2966 -314 -270 -140 221 122 220 372 346 -213 -250 -370 14 -193 1 -20 54 285 292 -162 -268 -404 -238 -124 108
2989 108 16 299 181 306 -212 -128 -192 -203 -384 8 216 168 309 241 12 -171 -401 -283 -421 -377 179 488
3011 488 334 132 260 -139 -202 -281 -265 -186 -87 280 673 563 61 -53 -201 -204 -498 -245 337 583 550 285 310
$$ packed form
2856c70L9M68K31P1m14M6j05q1m86L95K54K55l25L28Mk38J58l85k18%M97J12K20
2879D56j21j29jj51j75j93j25L49J33J71J15j50P4l78r9k05K17K20o3N0M80P0
2901E45k67j04j79k1k44j00N59L18l39k50N27j89n05j88J71J95K8J71J87J96n56
2922d5J37K8o10j3L45K37R6O3J24j00o6j81m44L86j26k75P42l10J35N6M8m20l44
2945e37J66P6j85N48L01k38m9J53k72j60q2K4L41j37K04J69J84k89m48L00l83
2966c14M4J30L61r9R8J52k6n59l7j20L84k07J94k1P4K31Pm54j06j36J66J14K32
2989A08r2K83j18J25n18Q4o4j1j81L92K08m8J41o8k29j83k30J18j38M4N56L09
3011D88j54k02J28l99o3p9J6P9R9L67L93j10n02j14j48lk94K53N82K46l3k65K5
$$ plain form
3034 310 -269 -608 -243 -42 -63 40 181 555 71 96 261 -535 -734 -514 -63 -42 265 187 282 149 -239 -23
3056 -23 -199 -609 -303 116 213 111 377 215 21 -445 -638 -181 -133 58 73 164 571 428 145 -525 -417 -397
3078 -397 -317 205 284 401 361 405 -86 -229 48 -432 -277 -170 259 419 226 559 19 -430 -296 -222 -323 -278
3100 -278 7 534 258 309 137 -51 -198 -606 -275 106 171 5 405 195 58 -203 4 -363 -459 -157 101
3121 101 176 382 420 409 -317 -243 -281 -515 -330 -5 322 386 113 -129 -52 132 -478 -336 -134 82 5 651 512
3144 512 -40 -111 -132 -468 -648 -383 234 208 11 545 257 22 -418 -334 -232 -117 -187 274 490 289 270 159
3166 159 -69 -701 -379 -303 -193 140 376 476 173 177 -44 -317 -309 -265 -274 503 203 428 190 76 -154 -409 -425
3189 -425 -65 -276 179 533 308 30 23 -274 -726 -767 -115 -136 224 264 596 307 94 13 -412 -198 -403 -340
$$ packed form
3034C10n79l39L65K01k1J03J41L74m84K5J65p96j99K20M51K1L07p8R5j33l88K16
3056b3j76m10L06M19R7j02K66j62j94m66j93M57M8J91J5R1M07j43k83o70J08K0
3078c97Q0N22P9J17m0M4m91j43K77m80J55J07M29J60j93L33n40m49J34P4j01M5
3100b78K85N27k76N1j72j88j47m08L31L81O5j66M00k10j37k61K07l67r6L02K58
3121A01P5K06L8j1p26P4l8k34J85L25L27O4k73k42P7J84o10J42K02K16p7O46j39
3144E12n52p1k1l36j80K65O17k6j97N34k88k35m40Q4J02J15p0M61K16k01j9j11
3166A59k28o32L22P6J10L33K36J00l03Mk21k73QM4rP77l00K25k38j14k30k55j6
3189d25L60k11M55L54k25k78pk97m52m1O52k1L60M0L32k89k13q1m25K14k05O3
$$ plain form
3211 -340 309 169 134 376 319 -404 -458 -230 -133 -166 -60 300 329 536 136 136 -199 -424 -432 -32 169 74 495 595
3235 595 -46 -133 16 -396 -488 -202 -43 167 324 173 398 265 -469 -329 -200 -169 -107 37 637 510 85
3256 85 43 -13 -589 -355 -110 187 184 264 395 190 -81 -168 -277 -315 -309 5 222 331 188 522 20 -265 -382
3279 -382 -637 -224 -297 133 204 568 59 293 229 -513 -316 -96 -113 -31 205 297 192 114 -37 -37 -268 -315 -85
3302 -85 30 400 209 622 66 -53 -465 -419 -373 -338 -162 382 518 226 122 -107 -56 -764 -225 65 -127 87
3324 87 513 624 421 -60 -251 -390 -374 -339 199 448 398 228 361 114 -195 -334 -105 111 14 164 411 504
3346 504 279 245 -74 -399 -577 -285 77 316 446 594 395 8 -402 -439 -360 -399 52 201 391 262 216 490
3368 490 -146 -649 -178 -166 -18 -128 591 390 195 154 111 -315 -666 -134 134 116 354 177 113 -180 24 -406
$$ packed form
3211c40O49j40l5K42n7p23n4K28R7l3J06L60K9K07m00%l35k25qM00K01r5M21J00
3235E95o41q7J49m12r2K86J59K10J57j51K25j33p34J40J29L1O2J44O00j27m25
3256H5m2n6n76K34K45K97lQ0J31k05k71q7j09l8OL14K17J09j43L34n02k85j17
3279c82k55M13p3M30P1L64n09K34o4p42J97K20j7Q2K36R2j05p8j51%k31m7K30
3302h5J15L70j91M13n56j19m12M6M6L5J76N44J36k92j04k29N1p08N39K90j92K14
3324H7M26J11k03m81j91j39J6L5N38K49n0j70J33k47l09j39K29K16r7J50K47R3
3346E04k25l4l19l25j78K92L62K39J30J48j99l87m10l7P9l9M51J49J90j29m6K74
3368D90o36n03M71J2J48j10P19k01j95m1m3m26l51N32K68j8K38j77o4k93K04m30
$$ plain form
3390 -406 -245 -419 -415 302 549 249 234 379 -45 -423 -531 -152 -115 185 199 543 138 102 150 -281 -209 -549 -79
3413 -79 0 159 374 330 51 -277 -191 -276 -434 -531 324 254 10 260 213 215 -151 -524 -287 -249 112 115 377 273
3437 273 89 658 -251 -396 -371 -145 -121 298 116 447 208 -260 -337 -170 -396 -339 -32 176 200 161 283 160
3459 160 -102 -354 -209 -202 78 51 276 229 284 -180 -8 -320 -346 -371 193 67 407 454 448 13 -254 -33 -158
3482 -158 -775 32 268 345 368 416 382 106 -319 -486 -171 -102 -235 388 595 195 -41 -118 -7 -634 -695 63
3504 63 371 235 306 714 7 -218 -309 -290 -301 -181 274 337 246 149 331 315 -723 -472 -437 -118 -340 184 292
3527 292 459 61 -133 -152 -238 -462 -251 -4 85 26 492 252 -170 -502 -344 -459 -365 -223 599 555 214 279
3549 279 113 -2 -346 -190 -404 69 -12 408 479 144 41 -15 -325 -415 -486 -102 -11 350 520 527 -67 30 -414
$$ packed form
3390d06J61j74MP17K47l00j5J45m24l78j08L79L7L00J4L44m05l6M8m31P2l40M70
3413g9P9J59K15m4k79l28Q6q5j58r7Q55p0k44K50m7Kl66l73K37L8L61LK62j04
3437B73j84N69r09j45K5K26K4M19j82L31k39m68p7J67k26N7L07K08K4l9J22j23
3459A60k62k52J45PK80k7K25m7N5m64J72l12k6k5N64j26L40M7om35k67K21j25
3482a58o17Q07K36P7K3M8l4k76m25j67L15O9j33O23K07m00k36p7J11o27o1P58
3504F3L08j36P1M08p07k25r1J9j1J20M55O3r1r7J82j6j038K51L5L19k22N24J08
3527B92J67l98j94j9q6k24K11K47Q9n9M66k40m22l32J58j15R4J42Q22m4l41O5
3549B79j66j15l44J56k14M73q1M20P1l35j03n6l10r0p1L84R1L61J70Pn94R7m44
$$ plain form
3572 -414 -423 -378 -96 278 177 53 196 -56 25 -288 -474 -72 -77 -106 227 668 213 5 113 -274 -210 -180 117
3595 117 275 89 442 428 342 -166 -105 -309 -291 -349 268 373 154 435 279 402 -422 -504 -321 -371 -26 267
3617 267 398 364 -143 -124 -111 -264 -324 -364 115 222 413 565 273 -97 -175 -216 -215 -93 -153 636 266 -30 126
3640 126 161 -154 -227 -380 -43 -100 176 205 425 306 -45 29 -227 -440 -419 -182 -185 107 339 389 107 -245 -140
3663 -140 -352 -188 -312 93 402 361 236 414 -48 -398 -389 -278 -22 -381 151 293 421 140 24 -415 -464
3684 -464 -353 78 335 77 337 353 174 -94 -263 -152 -311 -637 -19 318 562 26 248 374 -80 -481
3704 -481 -460 -251 -249 156 290 426 161 -96 -8 -381 -654 -28 32 20 321 299 290 -24 -209 -226 -333 -191 -123 188
3728 188 408 295 -98 50 -13 -581 -523 41 -71 2 194 473 214 137 -168 -135 -601 -308 9 134 -65 142
$$ packed form
3572d14rM5K82L74j01j24J43k52Q1l13j86M02nk9L33M41m55k08J08l87O4L0K97
3595A17J58j86L53j4q6n08O1k04J8n8O17J05k19K81j56J23q24q2J83n0L45K93
3617B67J31l4n07J9J3j53o0m0M79J07J91J52k92l70p8m1JJ22o0P89l70k96J56
3640A26L5l15p3j53L37n7K76K9K20j19l51P4k56k13K1K37lK92K32N0k82l52J05
3663a40k12J64j24M05L09m1j25J78m62l50RJ11K56l59N32J42J28k81j16m39m9
3684d64J11M31K57k58K60J6j79k68j69J11j59l26O18L37K44n36K22J26m54m01
3704d81K1K09KM05J34J36k65k57Q8l73k73O26O0j2L01k2rl14j85j7j07J42O8L11
3728A88K20j13l93J48o3n68N8N64j12P3J92K79k59p7l05L3m66K93L17J25j99K07
$$ plain form
3750 142 459 51 -126 -378 -74 -288 -293 253 546 65 354 182 31 -337 -398 -176 209 -211 243 400 406 -22
3772 -22 -210 -149 -482 -699 -77 149 200 311 376 159 54 -352 -270 -246 -352 -105 215 102 169 265 -93 -71 -454
3795 -454 -458 -37 -46 268 492 224 185 -35 -47 -525 -487 -93 177 8 340 175 292 101 -93 -322 -378 -348 -351 -91
3819 -91 345 164 217 306 -77 -307 -161 -53 96 28 398 286 213 17 23 137 -423 -142 -39 -43 206 403 700
3842 700 119 -138 -432 -224 -725 -214 50 226 344 150 57 57 -300 -288 75 -263 -253 358 373 204 -14 78
3864 78 -128 -367 -440 -149 130 -119 385 404 327 3 -389 -193 -38 -404 4 351 207 170 253 120 -128 -165
3886 -165 -505 20 -52 -77 283 297 -57 -18 -46 -646 -408 -73 69 318 280 588 344 -41 -371 -302 -8 -454
3908 -454 -260 305 532 -44 -203 454 82 -580 -260 105 -48 197 284 168 104 33 -191 -184 -648 -393 34 45
$$ packed form
3750A42L17m08j77k52L04k14nN46K93m81K89j72j51l68o1K22L85m20M54J57Om28
3772b2j88O1l33k17O22K26N1J11O5k17j05m06Q2K4j06K47L20j13O7R6l58K2l83
3795d54mM21rL14K24k68l9k20j2m78L8L94K70j69L32j65J17j91j94k29n6L0lK60
3819i1M36j81N3Q9l83k30J46J08J49o8L70j12p3j96OJ14n60K81J03mK49J97K97
3842G00n81k57k94K08n01N11K64J76J18j94r3%l57J2L63l38J0O11J5j69k18R2
3864G8k06k39p3K91K79k49N04J9p7l24l92J96J55l66M08L47j44l7Q3j33k48l7
3886a65l40N25p2k5L60J4l54L9k8o00K38L35J42K49l8L08k44l85l30O9K94m46
3908d54J94N65K27n76j59O57l72o62L20L65j53K45Q7j16o4p1k24Pm64K55M27J1
$$ plain form
3930 45 273 126 316 -55 69 45 -47 -173 -34 75 272 147 162 125 50 -221 -419 -34 -150 -83 48 464
3952 464 308 -222 187 174 -315 -249 -32 185 335 106 481 -46 39 -489 -320 -402 -315 -31 475 136 23 211
3974 211 213 -248 -274 -1 -111 -93 131 327 -11 45 -292 -3 -323 -188 -66 63 204 -29 162 435 172 -115
3996 -115 -138 -225 -236 113 179 236 -58 -156 95 -59 -276 -379 -135 -200 -247 252 358 323 1 -432 -63 -412 -436
4019 -436 158 65 99 159 170 213 -306 -116 -227 -316 -111 4 275 436 107 239 -125 -278 -194 -186 -131 83 -40
4042 -40 208 233 -71 -128 24 -386 -235 -64 188 31 281 528 41 -277 -81 -257 -192 -257 99 456 -90 210
4064 210 348 -88 -295 -362 -271 -60 -114 -163 426 612 9 -69 90 -222 -232 -122 -36 6 114 163 190 213 -138 -292
4088 -292 -406 -403 39 471 472 200 217 210 40 -218 -328 -77 -21 47 149 566 264 -202 171 -522 -455 30 150
$$ packed form
3930D5K28j47J90l71J24k4r2j26J39J09J97j25J5l7p5k71j98L85j16O7J31M16
3952D64j56n30M09j3m89O6K17K17J50k29L75n27Q5n28J69q2Q7K84N06l39j13J88
3974B11Km61k6K73j10J8K24J96l38N6l37K89l20J35J22J29J41k33J91K73k63k87
3996a15k3q7j1L49O6N7k94r8K51j54k17j03K44o5m7M99J06l5l22m33L69l49k4
4019d36N94r3L4O0J1M3n19J90j11q9K05J15K71J61l29J32l64j53Q4QN5K14j23
4042d0K48K5l04n7J52m10J51J71K52j57K50K47m87l18J96j76O5o5L56L57n46L00
4064B10J38m36k07o7R1K11n4m9N89J86o03p8J59l12j0J10Q6M2J08M9K7K3l51j54
4088b92j14LM42M32Jk72J7pj70k58j10K51N6O8J02M17l02m66L73o93O7M85J20
$$ plain form
4111 150 233 69 383 372 276 -29 -26 374 -266 -270 231 351 345 40 126 216 -172 -271 -314 30 9 443 523 -26 -32 -86
4137 -86 -20 -161 -332 -185 113 232 -60 152 185 -118 -136 140 125 -63 112 368 41 212 130 222 -383 -199
4159 -199 -124 83 -76 -58 467 144 35 18 6 -117 -340 33 -140 460 333 508 219 145 -238 -650 -375 -356
4181 -356 5 290 158 198 319 -1 -80 -110 -229 299 -120 -137 203 133 304 30 -165 -102 -357 -500 -284 164
4203 164 144 98 26 -121 -98 -109 -187 -116 -445 71 219 325 104 16 -1 -213 -396 -345 126 -90 211 291 101 141
4227 141 -11 -185 -180 -315 -262 -50 195 22 107 303 44 -329 -211 -169 -58 -275 274 234 190 99 -41 -52 -275
4250 -275 -111 -281 -87 52 256 504 14 -336 226 -94 -277 39 47 176 104 320 181 306 -197 -292 -192
4271 -192 -228 -126 -46 406 173 -4 48 76 0 -186 -229 118 347 166 163 154 17 -188 -397 -453 -318 46 246 189
$$ packed form
4111A50Q3j64L14j1r6l05LM00o40mN01J20ol05Q6R0l88r9m3L44k1M34Q0n49on4
4137h6O6j41j71J47K98J19k92K12L3l03j8K76j5j88J75K56l27J71q2R2o05J84
4159a99P5K07j59J8N25l23j09j7j2j23k23L73j73O00j27J75k89p4l83m12K75J9
4181c56L61K85j32M0J21l20p9l0j19N28m19j7L40p0J71k74j95O3k55j43K16M48
4203A64k0m6p2j47K3j1p8P1l29N16J48J06k21q8j7k12j83N1M71k16L01Q0j90M0
4227A41j52j74Nj35N3K12K45j73Q5J96k59l73J18M2J11k17N49m0m4r1j40j1k23
4250b75J64j70J94J39K04K48m90l50N62l20j83L16QJ29p2K16j39J25n03r5J00
4271a92l6J02Q0M52k33j77N2K8p6j86m3L47K29j81lrj37k05k09n6J35L64K00n7
$$ plain form
4295 189 -35 236 -6 -279 5 11 -170 57 -238 396 228 210 127 58 -292 -182 -157 -109 -100 -91 471 -88 7 -102
4319 -102 -12 -154 -682 -186 22 56 -65 188 128 242 99 -298 -66 -208 -267 282 -11 38 100 74 -67 -288
4341 -288 -69 -305 -162 -37 510 159 115 297 116 -231 -185 94 -131 307 -67 211 83 -46 -87 -114 -56 -245
4363 -245 -372 -325 -112 50 126 348 -20 -99 -539 19 -67 -182 322 496 347 -203 108 151 -100 -390 -50 92
4385 92 85 -74 216 -111 -148 -236 -235 25 -141 3 227 495 244 -74 331 -119 -225 -429 -90 129 225 206 90
4408 90 112 34 -47 -69 -32 -125 193 50 14 219 144 -106 -134 -213 -156 -145 -39 208 273 302 249 -127 235 -176 1
4433 1 -125 -26 72 226 257 -107 -319 -92 -94 -299 -272 6 187 67 199 158 48 -415 -249 -77 -36 -334 8
4456 8 123 324 16 40 -48 -24 -258 -80 -22 -134 77 263 147 275 -240 -205 100 70 -269 33 -35 13 405
$$ packed form
4295A89k24K71k42k73K84Oj81K27k95O34j68j8q3o9l50J10K5M8RRN62n59R5j09
4319a02R0j42n28M96K08L4j21K53o0J14j43l97K32j42n9N49k93M9O2k6j41k21
4341b88K19k36J43J25N47l51m4J82j81l47M6K79k25M38l74K78j28j29m1k7N8j89
4363b45j27M7K13J62P6K22l68p9m40N58q6j15N04J74j49n50L11M3k51k90L40J42
4385I2pj59K90l27l7q8JK60j66J44K24K68k51l18M05m50j06k04L39K19R6j9j16
4408I0K2p8q1k2L7r3L18j43l6K05p5k50k8p9N7J1J06K47O5K9n3l76L62m11J77
4433Aj26R9R8J54L1l64k12K27kk05K7K78J81j20J32m1j10m63J66J72M1k98L42
4456HJ15K01l08K4q8K4k34J78N8j12K11J86j16J28n15L5L05l0l39L02o8M8L92
$$ plain form
4479 405 33 211 -251 15 106 -208 -326 221 -104 -105 423 102 -219 -313 61 -107 40 73 320 135 97 -87
4501 -87 115 -51 -88 -44 -33 -9 -68 -73 65 -154 -206 -98 -105 -249 -77 124 252 81 -81 39 -26 -353 -111 -18
4525 -18 157 243 22 80 70 39 73 -5 -20 -223 -20 274 99 100 191 -97 -317 -27 -149 19 -493 56 8 230
4549 230 -28 165 -78 -202 -270 -130 -24 287 28 435 162 16 -11 -177 -85 -276 67 60 331 135 156 231
4571 231 -11 -175 -74 -118 1 44 414 -88 319 136 86 107 -143 140 -322 -90 6 449 184 -177 -289 -34
4593 -34 -15 -227 -199 263 116 401 162 36 62 -261 -132 -220 -198 77 147 418 -22 84 160 34 -101 -298 44
4616 44 -156 -131 158 488 74 -82 -132 -145 -240 -52 12 465 107 -108 175 222 -151 -302 2 -147 -248 27
4638 27 306 217 327 85 -147 -270 -273 -263 127 -99 -54 -16 141 228 -47 -117 19 -315 -197 200 165 -49 254
$$ packed form
4479D05l72J78m62K66R1l14j18N47l25jN28l21l21r4L74j68J47L3K47j85l8j84
4501h7K02j66l7M4J1K4n9nJ38k19n2J08pj44J72K01J28j71j62J20o5l27K42R3
4525a8J75Q6k21N8j0l1L4p8j5k03K03K94j75JR1k88k20K90j22J68n12N49m8K22
4549B30k58J93k43j24o8J40J06L11k59M07k73j46k7j66R2j91L43pK71j96K1P5
4571B31k42j64J01m4J19M3L70n02M07j83n0K1k50K83m62K32R6M43k65l61j12K55
4593c4J9k12K8M62j47K85k39j26K6l23J29q8K2K75P0K71m40J06P6j26j35j97L42
4616D4k00K5K89L30m14j56n0j3r5J88O4M53l58k15K83M7l73j51L04j49j01K75
4638B7K79q9J10k42k32j23lJ0L90k26M5L8J57Q7k75p0J36l34J18L97l5k14L03
$$ plain form
4661 254 22 -221 88 -199 -7 -61 -113 366 201 -85 71 244 -38 -149 -32 -239 233 185 300 313 -22
4682 -22 -68 -266 -389 -386 -178 -224 315 12 211 328 -133 -208 -155 -169 65 10 -19 220 -67 -85 -297 -293 101 -177
4706 -177 -192 -228 81 55 375 -6 -133 -65 -126 185 -516 127 15 294 268 248 -14 -200 -94 -253 129 -426
4728 -426 3 117 558 10 -68 -226 -25 35 -93 -138 -62 315 -92 330 7 -148 -43 158 -251 -146 -86 146
4750 146 83 132 88 6 -157 -7 -251 66 -134 12 181 -40 -15 72 -223 -178 -168 80 -329 -105 142 242 38
4773 38 -290 -157 -72 35 -11 117 33 144 -24 -168 68 46 -181 89 86 -230 57 209 62 436 -179 45
4795 45 -222 -181 -154 129 149 241 102 143 -123 -47 -266 110 -243 252 193 -2 -161 146 -89 -104 36 -214 -469
4818 -469 149 -21 -93 126 -151 161 50 -233 -182 -19 73 3 -13 179 201 33 -47 -212 -139 8 78 2 -113
$$ packed form
4661B54k32k43L09k87J92n4n2M79j65k86J56J73k82j11J17k07M72m8J15J3l35
4682b2m6j98j23LK08m6N39l03J99J17m61p5N3j4K34n5k9K39k87j8k12ML94k78
4706a77j5l6L09k6L20l81j27O8o1L11p01O43j12K79k6k0k62j86J06j59L82n55
4728d26M29J14M41n48p8j58K01O0j28m5P6L77m07M22l23j55J05K01m09J05O0K32
4750A46o3M9m4q2j63J50k44L17k00J46J69k21K5Q7k95M5J0K48m09K24K47J00k04
4773C8l28J33Q5J07m6J28q4J11j68j44K36k2k27K70ll16K87J52j47L74o15K24
4795D5k67M1K7K83K0R2j39M1k66P6k19L76l53M95n9j95j59L07k35j5J40k50k55
4818d69O18j70p2K19k77L12j11k83N1J63R2p0j6J92K2j68q0j65P3J47P0p6j15
$$ plain form
4841 -113 -14 403 218 45 1 -377 164 -45 122 189 -74 165 432 346 -84 -227 -344 199 -76 22 39 79
4863 79 -17 -21 -125 132 74 -41 -268 -84 178 246 27 55 -141 -240 -7 32 -23 2 124 -128 -53 97 -129 -177
4887 -177 -168 -188 17 61 50 83 202 -43 -133 -81 -117 -331 -11 89 -67 301 207 213 43 -367 17 26 -143 -158 -64
4912 -64 -29 39 164 49 -73 -107 120 -163 12 -147 53 150 266 51 62 187 -147 -72 -148 -79 -170 167 145 -4
4936 -4 -24 -98 -118 -221 -132 155 224 -2 319 239 -108 -199 -148 -60 -24 43 -78 382 -22 -448 -175 -81 -34 -35 -47 249
4962 249 -63 223 33 103 137 -122 7 -29 110 138 270 288 188 -47 -187 -104 -175 -32 -58 -36 382 363 3
4985 3 -52 -42 -71 -362 219 131 -43 61 124 -70 -52 -279 -334 -84 -213 180 156 82 106 -97 24 143 88 -288
5009 -288 -406 52 83 -31 238 -17 1 -127 -195 -104 -51 -474 204 226 -5 97 -41 190 -85 2 -340 -90
$$ packed form
4841a13R9M17j85j73m4l78N41k09J67O7k63K39K67q6m30j43j17N43k75R8J7M0
4863G9r6mj04K57n8j15k27J84K62O8k19K8j96r9K33L9n5K5J22k52P5J50k26m8
4887a77Rk0K05M4j1L3J19k45r0N2l6k14L20J00j56L68r4Oj70m10L84Rj69j5R4
4912f4L5O8J25j15j22l4K27k83J75j59K00R7J16k15J1J25l34P5p6O9r1L37k2j49
4936dk0p4k0j03Q9K87O9k26L21q0l47r1N1Q8L6O7j21M60m04m26K73R4M7jj2K96
4962B49l12K86j90P0L4k59J29l6J39K8J32J8j00k35j40Q3p1J43k6K2M18j9l60
4985Cn5J0k9k91N81q8j74J04O3j94J8k27n5K50j29L93k4p4K4k03J21J19n5l76
5009b88j18M58L1j14K69k55J8j28o8R1N3m23O78K2k31J02j38K31k75Q7l42K50
$$ plain form
5031 -90 -221 152 421 -97 191 -98 -104 -241 -153 -186 131 13 141 337 112 27 -72 -95 -276 -142 137 165 32
5054 32 -167 -152 -105 -55 80 219 -31 -15 -57 -241 82 -300 180 235 -107 -126 -106 -114 -12 -179 113 -146 -54 73
5078 73 -266 -78 -164 -58 -136 -30 106 -299 129 -28 58 220 41 -32 40 76 120 -57 -167 -63 -112 -81 -34 -73
5102 -73 137 167 90 9 223 -214 32 44 42 -72 32 152 90 -272 -16 46 -2 -60 -150 -85 122 -48 -110 50 264
5127 264 -10 -42 31 -118 -19 96 164 -25 44 100 75 5 -85 -202 -128 89 136 46 -176 145 -126 -23 -301 -64
5151 -64 115 -7 17 112 126 -64 246 -193 31 -215 -279 -96 153 -128 206 -98 -78 -200 -113 -211 -154 86 49
5174 49 161 -34 -30 172 163 -12 17 138 20 206 354 34 -46 -63 96 -35 -157 -104 29 -78 -44 -167 -81 41
5198 41 128 -230 98 -74 -381 -67 -139 209 180 -303 14 -186 -38 32 -100 -180 73 189 146 138 -287 -101 243
$$ packed form
5031i0j31L73K69n18K88k89oj37Q8l3L17j18J28J96k25q5r9k3j81J34K79K8j33
5054C2j99J5M7N0J35J39k50J6m2j84L23l82M80N5l42j9K0qJ02j67K92k59R2J27
5078G3l39J88q6J06p8J06J36m05M28j57Q6J62j79p3P2L6M4j77j10J04m9L1M7l9
5102g3K10L0p7q1K14m37K46J2kj14J04J20o2l62K56O2m8n8r0O5K07j70o2J60K14
5127B64k74l2P3j49R9J15O8j89O9N6k5p0r0j17P4K17M7r0k22L21k71J03k78K37
5151f4J79j22K4R5J4j90L10m39K24k46o4J83K49k81L34l04K0j22Q7r8N7K40l7
5174D9J12j95MK02rj75K9J21j18J86J48l20q0j7J59j31j22N3J33j07L4j23Q6J22
5198D1Q7l58L28j72l07L14p2L48k9m83L17k00J48P0j32q0K53J16m3qm25J86L44
$$ plain form
5221 243 0 -5 -235 295 -64 9 213 199 333 -29 303 -42 -267 -177 -49 -137 -165 -99 -153 115 14 -87 -109
5244 -109 220 286 -84 -26 51 358 -39 -200 -200 162 -38 97 63 -189 -173 -321 54 93 -190 -139 -151 181 145 -55
5268 -55 -22 -59 83 122 -142 21 337 -133 -91 319 167 -26 166 -7 -233 -115 -33 -104 -98 290 173 317 -5
5291 -5 -87 -150 74 -42 -14 -66 46 365 282 170 -277 -44 65 -92 -126 197 384 107 39 -61 -261 -226 86
5314 86 114 -140 -69 -53 230 94 1 -47 61 148 140 72 -281 97 -129 246 -41 -82 -135 140 -65 -96 19 28 -131
5339 -131 -155 12 29 -33 -39 68 172 -14 146 27 -64 -214 -34 113 -183 91 373 -44 53 39 185 80 -120
5362 -120 -210 -85 -286 -65 93 263 -139 -200 148 47 103 -148 96 -90 209 148 -143 58 -53 40 112 -2
5384 -2 -197 -112 140 183 74 292 -38 40 -69 -155 -58 159 0 358 200 95 -97 -125 66 -140 -89 -231 -79
$$ packed form
5221B43k43nk30N30l59P3K04j4J34l62L32l45k25R0J28q8k8O6n4K68j01j01k2
5244a09L29O6l70N8P7L07l97j61%L62k00J35l4k52J6j48L75L9k83N1j2L32l6k00
5268e5L3l7J42L9k64J63L16m70M2M10j52j93J92j73k26J18Q2p1OL88j17J44l22
5291eq2o3K24j16K8n2J12L19q3j12m47K33J09j57l4L23J87k77o8j00k00L5L12
5314H6K8k54P1J6K83j36r3m8J08Q7qo8l53L78k26L75k87m1n3K75k05l1J15Rj59
5339a31k4J67J7o2oJ07J04j86J60j19r1j50J80J47k96K74K82m17R7j4J46j05k00
5362a20r0J25k01K21J58J70m02o1L48j01N6k51K44j86K99o1k91K01j11R3P2j14
5384bj95Q5K52M3j09K18l30P8j09q6R7K17j59L58j58j05j92k8J91k06N1j42J52
$$ plain form
5407 -79 61 -83 -49 -20 6 -78 -177 -101 -205 -200 281 -49 159 26 -70 7 -146 272 197 165 68 -94 133 -260 12
5432 12 -115 -127 -220 -37 36 30 41 122 297 -175 129 128 -73 -116 8 110 199 21 97 172 41 54 297 74 -39
5457 -39 146 7 181 377 -91 6 -323 259 -32 -23 2 -94 104 -20 31 -99 -61 -29 45 73 -322 -151 -5 -27
5481 -27 394 32 -49 -160 -197 -201 131 -155 348 368 -76 174 185 150 -98 -31 -102 48 140 142 43 -180 88 -340 90
5506 90 -128 -337 -49 -124 205 -252 32 -374 -267 82 131 -25 17 -31 -50 -101 -65 -138 -81 -324 -114 -103 303 -13
5530 -13 -72 31 113 -74 14 265 -107 -148 -29 -56 -141 -240 -52 74 -1 149 144 -58 -60 63 54 -88 -56 -27 89 -137
5556 -137 -111 205 -34 34 259 367 -67 160 -102 -324 -129 108 97 201 211 -42 -56 -407 -102 -306 -7 -81
5578 -81 155 31 -34 155 241 25 71 -60 67 -53 54 -33 -110 162 25 172 36 99 -80 4 -46 -31 167
$$ packed form
5407g9J40j44L4K9K6q4r9P6j04NM81l30K08j33r6P7j53M18p5l2r7j62K27l93K72
5432A2j27j2r3J83P3oJ1Q1J75m72L04jk01m3J24J02Q9j78P6P5j31J3K43k23j13
5457c9J85j39J74J96m68R7l29N82k91RK5r6J98j24N1j30L8L2P4K8l95J71J46k2
5481b7M21l62q1j11l7mL32k86N03K0m44K50J1l5k48O7p1J50R2Kr9k23K68m28M30
5506I0k18k09K88p5L29m57K84m06J07L49M9j56M2m8j9n1L6p3N7k43K10J1M06l16
5530a3n9J03Q2j87Q8K51l72m1J19k7q5r9J88J26p5J50nk02kJ23rj42L2K9J16k26
5556a37K6L16k39O8K25J08m34K27k62k22J95K37j1J04J0k53j4l51L05k04K99p4
5578h1K36j24o5J89Q6k16M6j31J27j20J07q7p7K72j37J47j36O3j79Q4n0J5J98
$$ plain form
5601 167 2 -232 -173 -171 -71 166 -47 -23 -264 -70 309 -125 184 336 -119 52 -2 -43 -91 144 364 88
5623 88 -130 -228 36 -85 -306 73 100 8 222 -175 -1 -81 -105 224 151 -165 -5 -112 2 -208 179 391
5645 391 112 -80 155 -103 74 -238 187 53 38 -152 -18 198 -57 -76 -44 86 125 103 -137 215 -125 -86
5667 -86 -66 -72 -123 123 8 -267 -133 210 -368 79 -72 102 22 83 387 313 -43 -32 -62 24 229 66 -104 182
5691 182 -103 119 86 86 -145 -101 212 -69 -247 -18 -159 160 16 96 54 -85 -103 -153 43 199 23 21 84 57
5715 57 13 -116 -50 -117 -309 84 200 26 249 124 -41 -81 -288 90 123 -11 249 163 273 -219 19 -20 -184
5738 -184 -132 -81 -10 102 -31 201 187 -175 -310 -292 -27 -166 194 -115 26 41 294 -49 -253 -308 -105 -32 55
5761 55 92 167 149 -64 -6 -73 316 -245 54 -139 145 -154 162 -34 74 169 -154 217 -128 31 177 202 272
$$ packed form
5601A67j65k34N9KJ00K37k13K4k41J94L79m34L09J52m55J71n4m1m8K35K20k76
5623H8k18r8K64j21k21L79K7r2K14l97J74q0k4L29p3l16J60j07J14k10L87K12
5645C91k79j92K35k58J77l12M25j34j5j90J34K16k55j9L2J30L9k2k40L52l40L9
5667h6K0on1K46j15k75J34L43n78M47j51J74q0O1L04p4l56J1l0Q6K05j63j70K86
5691A82k85K22l3%k31M4L13k81j78K29j41L19j44Q0m2j39j8n0J96J56j76kO3k7
5715E7m4j29O6o7j92L93J16j74K23j25j65m0k07L78L3j34K60q6J10m92K38l9j64
5738a84N2N1P1J12j33K32j4l62j35J8K65j39L60l09J41J5K53l43k04n5K03P3Q7
5761E5L7P5j8k13N8o7L89n61K99j93K84k99L16j96J08R5l23L71l45J59J46K5P0
$$ plain form
5784 272 207 -114 29 -141 -2 -4 -461 46 -273 -99 -65 -261 118 38 23 -532 -164 -316 94 160 130 114 -19
5807 -19 266 -111 -213 -323 -87 23 -18 -68 27 39 -148 180 268 28 -94 -147 174 75 233 42 46 78 146 -290
5831 -290 -77 111 20 13 195 -265 -531 -70 -22 -132 148 33 -280 -27 -43 140 4 -78 -35 -64 -153 361 98
5854 98 168 143 -190 -148 -174 -95 -136 114 105 -112 215 135 230 -212 -63 -35 37 -162 -146 51 149 89 123 20 42 -188
5880 -188 161 -96 -301 130 151 -120 99 234 -195 55 77 -175 -102 -4 -45 -213 -85 -134 50 -61 -221 -65
5902 -65 20 -114 225 37 195 104 -159 -85 -81 -457 145 161 190 94 283 164 -55 -369 -31 -51 198 -172 -75 -41
5926 -41 -27 191 82 -133 -311 -15 -46 -198 -7 76 5 -151 -244 -55 -100 -209 202 -35 183 257 166 88 -28
5949 -28 -15 -165 -110 -97 195 -35 408 254 -427 -152 144 58 -229 59 -123 40 181 11 167 66 -204 146
$$ packed form
5784B72o5l21J43j70J39km57N07l19J74L4j96L79q0j5n55L68j52M10O6l0j6j33
5807a9K85l77j02j10K36J10m1n0R5J2j87L28Q8k40j22n3L21r9J58j91ML2O8m36
5831b90K13J88r1pJ82m60k66M61M8j10K80j15l13K53j6J83j36q2M3k9q9N14k63
5854I8P0k5l33M2k6P9m1K50rk17L27q0R5m42J49K8P2j99J6J97R8o0L4j03K2k30
5880a88L49k57k05M31K1k71K19J35m29K50K2k52P3R8m1j68J28m9J84j11j60J56
5902f5Q5j34L39j88J58r1k63P4Ml76O02J6K9r6J89j19k19l14L38k0K49l70R7L4
5926d1J4K18j09k15j78K96l1j52J91Q3p1j56r3J89m5j09M11k37K18P4r1p8j16
5949b8J3j50N5J3K92k30M43j54o81K75K96q6k87K88j82J63J41j70J56j01k70L50
$$ plain form
5971 146 118 -116 -77 165 111 -299 -66 -117 2 -102 141 -251 -18 158 -250 82 -343 72 -312 -82 -24 112
5993 112 38 86 135 -55 339 90 136 -429 -262 -220 -198 -135 119 -3 -300 -45 -202 -3 -223 -29 180 -58
6015 -58 -16 19 28 -1 -24 -140 42 141 -63 122 160 170 257 -124 -130 -75 -264 114 -119 169 89 85 93 -12 -21 149 -273
6042 -273 96 -130 261 -11 194 142 -162 30 -59 -166 -169 -239 11 128 72 -32 -280 207 -220 134 37 -74
6064 -74 -61 97 205 116 21 205 -171 -74 -44 86 -150 5 -18 93 -48 -224 79 184 -110 -78 -57 -54 151 75
6088 75 34 -185 -80 -171 -18 43 -104 260 456 66 394 -48 -99 -162 127 -3 199 23 54 374 -119 -92 9
6111 9 -48 76 -117 -137 89 170 -32 125 -108 -25 -52 -106 31 255 12 -3 129 -4 8 40 -58 -437 141 33
6135 33 69 101 41 -76 -116 -182 -92 -249 -33 -91 97 -211 -23 110 70 -125 -184 -240 7 60 -195 133 320 -81
$$ packed form
5971A46k8k34L9K42n4m10K33n1J19j04K43l92K33J76m08L32m25M15l84K30N8J36
5993A12p4M8M9j90L94k49M6n65J67M2K2O3K54j22k97K55j57J99k20J94K09k38
6015e8M2L5Rk9k3j16J82R9k04J85L8J0Q7l81oN5j89L78k33K88q0mQj05rJ70m22
6042b73L69k26L91k72K05n2l04J92q9j07lp0K50J17n6j04k48M87m27L54r7j11
6064g4J3J58J08q9r5J84l76R7L0J30k36J55k3J11j41j76L03J05k94L2K1LK05p6
6088G5m1k19J05r1J53O1j47L64J96l90L28m42n1o3K89j30K02j76L1L20m93K7J01
6111In7J24j93k0K26Q1k02J57k33Q3k7n4J37K24k43j5J32j33J2L2r8l79N78j08
6135C3L6L2o0j17m0o6R0j57K16n8J88l08J88J33m0j95n9n6K47N3k55L28J87m01
$$ plain form
6159 -81 -264 306 100 -178 -171 -127 227 -35 333 226 -237 -155 -26 -127 43 42 -9 -17 -40 191 15 96 51 43 107
6184 107 -173 -164 29 88 76 50 -64 -397 -258 -139 -223 137 168 -127 294 -58 60 80 -142 -15 -147 -107 197
6207 197 -50 -146 322 288 -173 131 -138 -7 0 259 -46 58 -36 60 -123 -35 -150 -189 111 85 179 271 277 154
6231 154 -75 -149 -16 -13 146 -143 91 -65 21 103 -116 270 -101 56 1 -129 -149 338 209 168 -5 -129 -13
6254 -13 -241 39 -177 -148 176 60 116 -146 -33 -31 -349 -75 -78 115 202 -57 263 14 144 -228 -121 -122 19
6277 19 178 77 -15 -32 18 147 -244 40 -121 445 151 18 69 281 207 80 95 140 -114 -82 -92 -238 122
6300 122 -44 132 -313 -263 -175 -79 -62 93 175 281 -79 101 -190 139 -187 213 -87 -190 -11 -319 -131 58
6322 58 -27 -256 -34 -187 63 28 156 325 -12 -187 -41 -15 -84 139 126 -174 13 -65 167 -42 -167 -206 -98
$$ packed form
6159h1j83N70k06k78PM4L54k62L68j07m63Q2J29j01J70jn1qk3K31j76Q1m5qO4
6184A07k80RJ93N9j2k6j14l33J39J19q4L60L1k95M21l52J18K0k22J27j32M0L04
6207A97k47r6M68l4m61L04k69J31PK59l05J04r4R6j83Q8j15l9L00k6R4R2Oj23
6231A54k29p4J33LJ59k89K34j56Q6Q2k19L86l71J57n5j30k0M87j29m1j73j24J16
6254a3k28K80k16K9L24j16N6k62J13Kl18K74lJ93Q7k59L20k49J30l72J07jJ41
6277A9J59j01r2j7N0J29l91K84j61N66k94j33N1K12p4j27J5M5k54L2j0j46L60
6300A22j66J76m45N0Q8R6J7J55Q2J06l60J80k91L29l26M00l00j03J79l08J88J89
6322E8q5k29K22j53K50l5J28J69l37j75J46K6o9K23j3l00J87p8K32k09j25l9J08
$$ plain form
6345 -98 -238 -251 -18 -17 -51 5 39 25 -18 -42 -57 43 128 -105 -287 83 158 -14 -153 -423 129 -28 83 243
6369 243 175 133 17 248 332 -189 -246 -285 199 160 -167 38 104 -13 -191 287 95 58 -46 2 36 85 -67 39
6393 39 -289 26 209 -187 163 -228 100 -48 109 147 65 187 -101 -20 -12 -123 111 -126 25 11 78 -213 -136
6416 -136 -57 -390 32 -122 -152 -84 32 -132 -275 -196 -26 257 74 169 184 -196 54 -63 -105 -266 69 -39
6438 -39 -50 46 -17 178 -26 71 151 -35 -67 -37 188 489 68 -121 -358 57 -84 40 -219 -160 -92 -142 81 289
6462 289 237 -106 -300 -142 3 -52 50 21 -68 -171 -10 -42 103 -67 -77 -6 85 126 66 -18 127 135 -26 12 249
6487 249 -117 -286 113 -5 37 -122 190 188 -141 112 -28 -232 -106 69 -17 -87 -38 11 0 -198 -85 -52 -225
6510 -225 159 -66 156 67 -255 203 -131 -194 248 -57 -99 161 -197 -57 160 -91 -227 -177 25 -2 154 -53
$$ packed form
6345i8j40j3K33Jl4N6L4j4m3k4j5J00Q5k33j82L70P5j72j39k70N52j57J11J60
6369B43o8m2j16K31Q4n21n7l9M84l9l27K05O6j17j78M78j92l7j04M8L4M9j52J06
6393C9l28L15J83l96L50l91L28j48J57L8q2J22k88Q1Qj11K34k37J51j4O7k91P7
6416a36P9l33M22j54l0O8J16j64j43P9J70K83j83R5J5l80K50j17m2j61L35j08
6438c9j1R6o3J95k04R7Q0j86l2L0K25L01m21j89k37M15j41J24k59N9O8n0K23K08
6462B89n2l43j94J58J45n5J02k9q9j03J61l2J45j70j0P1R1M1o0q4J45Qj61L8K37
6487B49l66j69L99j18M2j59L12kl29K53j40k04J26J75q6p0M9M9j1j98J13L3j73
6510b25L84k25K22q9l22M58l34o3M42l05m2K60l58J40K17k51j36N0K02k7J56k07
$$ plain form
6532 -53 125 251 86 -83 97 -83 15 -34 204 -5 -261 5 -157 455 -212 65 83 -74 221 49 -7 -3
6554 -3 -128 417 75 -220 194 17 170 -35 17 82 -143 -7 78 -63 69 -204 -333 -39 -238 -124 88 140
6576 140 116 -14 53 -51 -34 119 63 81 -83 -46 33 -170 -91 356 74 1 114 -10 61 146 -81 -62 -39 -21 -52
6601 -52 115 -60 -127 -230 106 -56 34 -332 229 -105 -195 -35 178 25 -240 -8 -49 5 -182 19 77 -103
6623 -103 139 -228 -95 -177 -240 -174 132 162 1 -11 -71 -36 -70 -99 -45 116 171 94 93 -89 170 207 124 -188 69
6648 69 -128 -145 185 -89 163 -85 201 -56 28 -103 68 46 -128 -99 183 -50 -287 -100 -40 -5 -112 210
6670 210 -190 -109 131 84 -72 53 -192 38 -56 99 -52 -26 -248 60 14 -84 -307 -127 -82 321 224 -161 -33
6693 -33 -334 13 198 103 -280 -184 -224 -259 -133 -233 -215 -183 -328 -85 59 77 -54 -50 37 -18 65 -161 -119 -30 8
$$ packed form
6532e3J78J26j65j69J80j80R8m9K38k09k56K66j62O12o67K77J8j57K95j72n6M
6554cj25N45l42k95M14j77J53k05N2O5k25J36Q5j41J32k73j29K94j99J14K12N2
6576A40k4j30O7j04J7J53n6J8j64L7P9k03P9M47k82p3J13j24P1Q5k27J9K3J8l1
6601e2J67j75o7j03L36j62R0l66N61l34r0J60K13j53k65K32m1N4j87K01N8j80
6623a03K42l67J33q2o3O6L06L0j61j2o0L5l4k9N4J61N5p7jj82K59L7q3l12K57
6648F9j97j7L30k74K52k48K86k57Q4j31J71k2j74K9K82k33k37J87O0L5j07L22
6670B10m00Q1K40m7j56J25k45K30r4J55j51K6k22L08m6r8k23J80M5M03r7l85J28
6693c3l01L47J85r5l83R6m0l5J26j00J8L2j45K43J44J8j31MQ7n5Q3k26M2Q9L8
$$ plain form
6718 8 139 44 -38 -249 166 25 38 71 66 -157 -81 -126 285 99 85 121 1 214 -175 1 -240 -207 -218 -134 277
6743 277 -254 322 39 16 -228 221 76 203 205 48 -66 154 160 163 -13 -54 -303 229 29 -210 48 197 204
6766 204 38 -78 100 -44 -140 -35 121 -93 -182 -112 53 -66 -113 54 -30 291 -36 118 -80 -221 -88 59
6788 59 -43 -140 -11 17 -87 -8 212 262 -251 31 96 -79 -81 -278 5 -2 -59 74 -204 -48 16 -105 1 -154
6812 -154 -86 184 -44 16 154 287 -250 -40 87 -88 -79 78 186 81 -380 30 -267 -159 22 -402 14
6833 14 -74 83 -115 146 -31 16 -127 -48 35 -36 -19 169 5 297 -128 -54 -129 -78 141 -145 -39 -263 20
6856 20 127 127 23 -24 -33 115 -28 -3 152 -57 3 34 -1 102 -15 120 -91 43 177 -126 -118 -92 47 -135
6880 -135 -256 -50 122 120 327 197 90 -18 61 -217 60 193 -130 182 59 -30 85 -128 74 -149 -132 41
$$ packed form
6718HJ31r5q2k11M15j41J3L3nk23P6m5M11j86j4L6j20K13l89J76k41L3j1Q4M11
6743B77n31N76k83k3k44M49j45J27Kj57j14K20OLj76m1k49N32k00k39K58J49P
6766B04j66j16J78j44r6J05J56k14q9P0J65j19m7J67q4L21l27J54j98j41J33J47
6788E9j02r7J29K8j04P9K20N0n13K82O5j75kj97K83pn7J33k78J56O4j21J06j55
6812a54O8K70k28O0J38J33n37K10J27j75RJ57J08j05m61M10k97J08J81m24M16
6833A4q8J57j98K61j77M7j43P9Q3p1J7J88j64K92m25P4p5N1K19k86J06k24K83
6856B0J07%j04m7rJ48j43K5J55k09O0L1l5J03j17J35k11J34J34l03QK6J39j82
6880a35j21K06J72kK07j30j07j08P9k78K77J33l23L12j23q9J15k13K02k23J7J73
$$ plain form
6902 41 -84 153 -66 -164 -88 56 164 -132 -120 254 -144 4 19 24 -193 270 -102 50 80 -305 -194 -135 -48
6925 -48 208 -19 101 -43 -36 57 -64 78 -263 -33 -64 -118 73 -403 -265 -204 83 -22 -48 -289 138 183 144
6948 144 5 -119 176 170 -190 112 -8 277 53 88 -11 -330 -174 186 18 -76 -12 92 42 116 -99 114 -81
6971 -81 -152 116 -93 252 -22 44 35 21 -159 -94 -110 -115 67 -59 -1 161 -124 -49 104 -199 -288 -22 -139 97
6995 97 168 -35 71 -17 25 33 -126 -7 113 86 6 113 -9 50 104 -235 -29 210 -240 -42 5 200 8 168
7019 168 31 -152 -328 193 -214 -87 -51 64 126 158 -17 97 -141 -169 -67 -15 -78 -33 113 48 -85 -8 164
7042 164 150 -13 -32 30 76 20 75 -13 -5 -48 79 -200 121 -44 -85 -98 163 -106 70 -92 45 1 129 286
7066 286 -64 -174 -143 -107 -87 -20 79 180 -134 -66 -152 -64 -111 -82 57 -128 -17 170 -2 120 166 12 111 126
$$ packed form
6902D1j25K37k19r8P6J44J08k96J2L74l98J48J5Nk17M63l72J52L0l85J11N9Q7
6925d8K56k27J20j44PR3j21J42l41K30l1n4J91m76J38O1K87j05k6k41M27M5l9
6948A44j39j24K95ol60L02j20K85k24L5r9l19J56L60j68r4O4J04n0P4k15K13j95
6971h1p1K68k09L45k74O6rj4j80O5j6nJ82j26N8J62k85P5J53l03q9K66j17K36
6995I7P1k03J06q8M2Qj59J19J20k7q0J07j22N9N4l39K06K39m50J98M7J95j92J60
7019A68j37j83j76N21m07J27L6J15O2L2j75J14k38k8J02N2o3M5J46o5j33P7J72
7042A64j4j63j9O2M6n6N5q8Qm3J27k79L21j65m1j3K61k69J76j62J37m4J28J57
7066B86l50j10L1L6K0O7R9J01l14O8q6Q8m7K9J39j85J11J87j72J22M6j54R9J5
$$ plain form
7090 126 111 88 -181 74 -120 -44 -208 168 -12 -179 -126 125 -186 227 -65 -28 -64 90 86 -188 -101 -53 -106 47
7114 47 131 99 -19 67 199 -6 327 -53 -10 39 -139 -29 -11 -90 -4 89 207 -197 190 -24 -175 -50 130
7137 130 -54 -21 199 -30 -258 93 191 -217 -89 160 98 105 21 128 249 182 -253 29 88 115 -24 -105 299
7160 299 282 4 152 142 113 187 -111 81 -270 -50 58 248 151 -199 -147 -135 -116 -63 106 -59 136 154 -179
7183 -179 -187 -35 -16 97 -35 111 -94 74 -22 -1 -299 267 -190 -170 -62 134 -158 371 -248 -295 13 210
7205 210 30 85 -66 -131 166 -73 -184 166 -29 -329 61 332 -92 -64 113 -103 84 -62 10 -113 -281
7226 -281 107 25 12 -78 206 -148 -3 103 46 32 -21 83 -18 53 127 -39 -43 -38 136 -135 35 -3 36 -164 -64
7251 -64 210 -86 -40 -85 -282 -306 328 -135 3 92 -51 -93 -72 325 -64 79 57 0 177 -56 72 -7 -80 -83
$$ packed form
7090A26j5k3k69K55j94P6j64L76j80j67N3K51l11M13k92L7l6J54mk74Q7M8n3J53
7114D7Q4l2j18Q6J32k05L33l80M3M9j78J10J8p9Q6R3J18m04L87k14j51J25J80
7137A30j84L3K20k29k28L51R8m08J28K49o2Pq4J07J21o7m35K82N9K7j39q1M04
7160B99j7k78J48j0k9P4k98J92l51K20J08J90r7l50N2J2J9N3J69j65J95J8l33
7183a79qJ52J9J13j32J46k05J68r6K1k98N66m57K0J08J96k92N29o19m7L08J97
7205B10j80N5j51o5K97k39j11L50j95l00L90K71m24K8J77k16J87j46P2j23j68
7226b81L88q2j3r0K84l54J45J06n7j4n3J04j01P1P4j66mNJ74k71J70l8L9k00J00
7251f4K74k96M6m5j97k4O34m63J38Q9j43m2K1L97l89J43k2n7J77k33J28p9p3l
$$ plain form
7275 -83 -176 -170 53 90 -193 95 62 114 -5 -36 91 -80 6 -159 94 13 16 -158 -263 179 106 69 -58 132 83
7300 83 4 -169 -154 -70 -77 138 155 -155 -1 -133 -223 -1 -24 -2 71 -27 122 210 22 104 87 390 182 -76 28
7325 28 148 335 -69 -25 122 -37 -132 -87 -257 -240 -61 156 223 -67 64 314 226 -163 -172 -89 97 -68 -207
7348 -207 63 134 48 -13 201 -70 -202 62 49 -64 -36 -24 106 142 -273 59 -92 -57 -15 -179 -105 -78 105 -96
7372 -96 -48 -115 -273 -67 16 -242 -86 325 -307 13 18 -235 -20 57 205 214 -119 140 -85 302 38 179 17
7395 17 -93 95 8 -68 -42 0 40 200 -114 -66 -285 155 101 59 133 -38 -55 5 -262 -273 94 -105 133 -302
7419 -302 160 196 -155 -37 -114 147 1 100 130 -133 68 -35 138 -17 -76 -13 -213 -18 -24 -309 -145 -136 -199 -288
7443 -288 295 122 -85 -97 -139 -115 -255 69 174 -123 37 7 122 -50 -240 -204 127 -283 4 -84 -203 210
$$ packed form
7275h3r3OK23L7k83K88l3N2j19l1J27j71Q6j65K53q1Lj74j05M42p3l7j27J90m9
7300H3p9j73J5Q4pK15J7l10J54j32r0K22k3K2P3r8J49Q8j88Q2j7L03k08k58J04
7325B8J20J87m04M4J47j59r5M5j70J7J79K17O7k90J31K50q8l89rQ3J86j65j39
7348b07K70P1q6o1K14k71j32K64j3j13K8J2J30L6m15L32j51L5M2j64P4K7J83k01
7372i6M8o7j58K06Q3k58J56M11o32L20Nk53K15P7J48Rl33K59k25L87k64J41j62
7395A7j10J88q7p6K6M2M0J60l14M8k19M40n4m2P4j71j7O0k67j1L67j99K38m35
7419c02M62L6l51J18p7K61j46R9L0k63K01j03J73j55n9O3k00J95ok85J64Ro3q9
7443b88N83j73k07j2m2K4j40L24J05k97J60l0J15j72j90L6L31m10K87q8j19M13
$$ plain form
7465 210 -305 -107 -28 -288 14 33 -85 167 -90 -332 31 -42 -9 10 -100 -57 -40 118 168 -403 24 98 -98
7488 -98 5 -230 147 100 29 5 -118 132 59 -35 25 -225 -83 -33 -37 163 441 65 -43 37 -32 103 182 -139
7512 -139 223 -181 211 30 153 62 -166 27 61 103 81 95 4 -145 1 129 170 -221 26 -130 -241 132
7534 132 -106 -39 -130 91 -219 51 -234 -6 -261 33 93 -25 -283 -227 -33 -90 145 -276 123 -231 112 -10
7556 -10 -109 -32 -55 -291 48 -39 -393 299 -116 -121 -129 -48 -81 55 89 -151 -213 341 -153 243 170 -19 28 41 170
7581 170 -202 -2 189 -16 91 109 97 -30 -40 78 -153 -14 52 -23 65 -123 36 -7 128 148 2 -39 -41 99
7605 99 -169 294 93 -46 -253 196 -40 -205 -129 -71 -152 -66 17 -86 -78 -119 -212 354 -176 124 -17 56 -118 164
7629 164 159 41 17 165 64 128 -178 -351 189 -225 310 -40 -79 -56 66 73 -138 -65 -31 265 97 91 35 -49 46
$$ packed form
7465B10n15J98P9k60L02J9j18K52k57k42L63p3L3J9j10M3J7J58N0n71M27P4j96
7488i8J03k35L77m7p1k4j23K50p3r4O0k50J42N0mK00K78l76j08Q0o9J35P9l21
7512a39L62m04L92j81J23r1k28J93L4M2k2J4r1j49J46J28M1l91K47j56j11L73
7534A32k38O7r1K21l10K70k85K28k55K94O0j18k58N6J94n7K35m21L99l54L43j22
7556a0r9P7k3k36L39q7l54O92m15nqQ1l3J36L4k40o2N54m94L96p3j89M7J3J29
7581A70l72K00J91k05J07J8j2j27j0J18k31J39O6p5Q8j88J59m3J35K0j46m1kJ40
7605I9k68M63k01j39k07M49k36j65P6N8q1Q6Q3j03Qm1r3N66n30L00j41P3j74K82
7629A64nj18k4J48j01O4l06j73N40m14N35l50l9K3J22Pk11P3L4K96j68on6q4R5
$$ plain form
7654 46 40 -22 128 -11 90 -19 47 32 -120 -11 -84 175 -69 -198 -119 -248 -36 272 188 -93 -22 -45 -183 -1
7678 -1 -415 -124 33 -106 -32 168 190 232 37 -59 345 -111 -106 -240 108 -5 152 -57 381 -238 88 44 4
7701 4 -123 56 -120 110 249 131 331 -30 84 127 128 -26 19 41 37 -258 -50 78 -104 -110 157 -227 157 217
7725 217 -158 -302 -62 59 -281 53 -259 -54 27 32 -105 -231 64 -367 -34 -97 101 83 56 9 23 -102 32
7748 32 -145 -38 29 41 -97 190 -204 31 13 -107 -66 332 170 1 -23 -62 -64 111 2 -179 6 -250 -119
7771 -119 -11 -60 -101 204 -26 -46 -106 403 291 22 171 -76 106 -275 -63 63 -46 99 152 -93 63 128
7793 128 -183 -158 341 -212 39 -147 -115 -246 -358 -34 229 147 -84 -4 40 432 -39 229 -254 -124 -79 -155
7815 -155 -23 208 377 165 -276 3 346 -143 232 -106 50 -195 94 -188 -8 85 -75 -33 -120 -121 -163 118
$$ packed form
7654D6oo2J50j39J01j09O6j5j52J09p3K59k44j29P9j29K12L08q4k81P1k3j38J82
7678am14K91J57j39P4K00K2M2j95r6M04m56Nj34L48j13J57k09M38o19L26m4m0
7701Dj27J79j76K30J39j18K00l61J14M3Jj54M5K2mk95K08J28j82oK67l84L84O0
7725B17l75j44K40J21l40L34l12K05Q1Nj37j26K95m31L33o3J98j8k7m7J4j25J34
7748C2j77J07O7J2j38K87l94K35j8j20M1L98j62j69k4l9kJ75j09j81J85k56J31
7771a19J08m9m1L05k30k0o0N09j12k69J49k47J82l81K12J26j09J45N3k45J56O5
7793A28l11K5M99n53K51j86L2j31j12L24K63q2k31Q0M4L92m71K68m83J30M5p6
7815a55J32K31J69k12m41K79L43m89L75l38J56k45K89k82J80R3j60M2q7jm2K81
$$ plain form
7837 118 120 26 163 -35 -171 63 -16 -269 -334 -66 82 -137 -192 8 -229 110 16 -111 -143 -122 248 66 49
7860 49 10 237 29 25 -66 143 -36 -16 -12 91 23 -185 74 88 -183 22 95 94 -128 91 256 -211 -131 -59 -278
7885 -278 -81 122 -89 -95 218 -118 17 102 211 143 64 -127 11 -177 44 83 -126 157 -50 11 67 44 72
7908 72 77 145 16 -118 240 87 -131 -160 262 -76 -144 13 -103 35 -64 78 -47 -237 330 -70 117 -89
7930 -89 4 -170 189 188 -199 -107 -313 -218 6 -199 49 -17 294 -89 -217 2 -184 22 -81 348 100 -55
7952 -55 -168 354 -147 35 -126 -138 117 53 -48 113 191 -59 -40 -129 -47 28 -213 124 -454 -51 -24 -16 -28 274
7976 274 13 -53 169 -119 -126 55 95 89 -135 26 -3 161 100 -110 120 -249 -184 -282 428 -34 -50 34 -227 -65
8000 -65 214 -43 133 400 -145 -282 11 32 -68 64 -75 -225 -236 -179 154 115 99 -48 -32 182 115 462 12
$$ packed form
7837A18Kr4J37j98j36K34p9k53o5K68J48k19n5K00k37L39r4j27l2K1L70j82j7
7860D9l9K27k08mr1K09j79K0MJ03o8k08K59J4k71K05P3jk22K19J65m67Q0P2k19
7885b78J97K03k11oL13l36J35Q5J09o8p9j91J38j88K21L9k09K83k07O1N6k3K8
7908G2NO8j29j34L58j53k18k9M22l38o8J57j16J38r9J42j25j90N67m00J87k06
7930h9R3j74L59jl87R2k06R5K24k05K48o6L11l83j28K19j86K06j03M29k48j55
7952e5j13N22n01J82j61j2K55o4j01J61P8k50J9q9Q2P5k41L37n78M03K7Qj2L02
7976B74k61o6K22k88pJ81M0ok24J61k9J64o1k10K30l69O5r8P10m62j6Q4k61J62
8000f5K79k57J76K67n45j37K93K1j00J32j39j50j1N7L33l9j6j47J6K14o7L47m50
$$ plain form
8023 12 -263 -136 131 110 104 -151 -51 4 -10 55 25 -297 215 -81 -343 99 133 50 -157 101 187 36 71 -54
8047 -54 -198 -64 -128 35 386 266 -52 139 40 60 89 -18 73 -73 55 -132 263 236 4 101 91 48 -58
8070 -58 132 -8 215 -6 -303 78 117 14 -46 6 -59 -116 166 -156 -112 -236 -92 -130 -145 -67 -385 53 -108
8093 -108 -97 -83 191 344 73 -348 81 4 210 28 208 -25 -56 -81 -35 122 -52 4 -132 -82 72 90 100
8116 100 25 54 -94 120 -30 101 30 -142 11 236 124 15 -206 -104 -16 -57 178 -396 -64 33 -24 329
8138 329 -23 -114 175 -32 119 66 -18 6 -3 30 -8 -37 39 -145 133 43 130 -103 57 257 167 325 19 -55 53
8163 53 33 108 -184 54 110 -179 16 27 197 -140 -230 53 -98 96 -154 -139 -126 112 -20 126 -37 85 103
8186 103 189 289 127 -12 102
$$ packed form
8023A2k75J27K67k1ok55J00N5j4O5l0l22N12k96k62M42L4q3k07K58Q6j51L5j25
8047e4j44J34o4J63L51j20l18J91r9K0K9j07R1j46J28j87L95k7k32R7j0m3j06
8070e8J90j40K23k21k97L81L9j03o0N2o5n7K82l22M4j24J44l8j5P8l18M38j61
8093a08J1J4K74J53k71m21M29p7K06j82J80k33l1k5M6J57j74N6j36N0J54J8J0
8116A00p5K9j48K14j50J31p1j72J53K25j12j09k21J02Q8m1K35n74L32R7n7L53
8138C29l52r1K89k07J51n3q4K4rL3l8k9P6j84K78r0Q7k33J60K00r0J58l06p4J08
8163E3k0P5k92K38N6k89J95J1J70l37r0K83j51J94k50J5J3K38j32J46j63J22J8
8186A03Q6J00j62j39J14
8191A02
$$ Imaginary data points
##PAGE= N=2
##DATA TABLE= (X++(I..I)), XYDATA
$$ plain form
0 0 0 0 0 0 0 0 0 0 0 0 0 0 1 -8 8 -8 8 -9 16 -16 23 -24 32 -33 40 -48 56 -65 73 -85 97 -113 126 -143 161
35 161 -181 204 -228 255 -286 317 -352 391 -433 478 -529 584 -645 709 -781 860 -949 1046
53 1046 -1154 1277 -1411 1566 -1745 1950 -2195 2488 -2846 3299 -3889 4692 -5861 7726 -11191
68 -11191 19871 -95016 -104934 19308 -4388 56946 104656 63714 -29884 -51571 -64337 -74106
80 -74106 -61641 8605 89480 134244 107748 80308 54413 -22447 -104138 -84657 -41028 -45572
92 -45572 -19444 62289 73233 11658 -19406 -30377 -84026 -115028 -67227 2015 36088 59608
104 59608 89978 95011 47920 -11346 -31307 -29277 -42115 -28641 36571 77824 50827 23984
116 23984 16530 -32181 -98039 -97434 -56340 -39020 -14957 45034 79856 52416 13899 -5563 -31331
$$ packed form
0@%%%%%%%%%%%%JrJ6j6J6j7K5l2L9m7N6o5P3q8J04j21J38j58J82k10K39k69L04
35A61l42L85m32M83n41O03o69P43q24R11j007J113j229J354j490J641j809J995
53A046k200K431k688K977l311L695m145M683n334O145p188Q581j0553J3587j8917
68a1191L1062j14887r918J24242k3696O1334M7710m0942r3598k1687j2766r769
80g4106J2465P0246Q0875M4764k6496k7440k5895p6860q1691J9481M3629m544
92d5572K6128Q1733J0944o1575l1064j0971n3649l1002M7801O9242L4073K3520
104E9608L0370N033m7091n9266j9961K030j2838J3474O5212M1253k6997k6843
116B3984p454m8711o5858O05M1094J7320K4063N9991L4822k7440l8517j9462k5768
$$ plain form
129 -31331 -60334 -48625 5121 51696 67558 76035 80648 43228 -26225 -66659 -68447 -71661 -62908
142 -62908 -6594 50657 52082 31975 23792 -8374 -63122 -79622 -50471 -20667 8138 55041
154 55041 92999 85333 45993 8408 -22159 -53359 -66559 -37817 8041 30494 38348 51693
166 51693 37107 -16216 -56304 -61137 -64258 -60850 -17378 37323 55763 52488 49813 29661 -11961
179 -11961 -41324 -38360 -21785 -4746 20650 52680 62393 34401 313 -19988 -46341 -71174
191 -71174 -55698 -14245 8386 21538 44476 45893 9442 -23402 -32250 -38012 -37914 -9935 32041
204 32041 55736 53792 44320 28262 -6512 -45140 -52999 -34851 -20660 -2765 32174 50416 27456
217 27456 -1405 -15941 -37874 -60306 -47995 -8910 19571 34924 52577 57620 29212 -10682
$$ packed form
129c1331k9003J1709N3746M6575J5862Q477M613l7420o9453m0434j788l214Q753
142f2908N6314N7251J425k0107q183l2166n4748j6500K9151K9804K8805M6903
154E5041L7958p666l9340l7585l0567l1200j3200K8742M5858K2453P854J3345
166E1693j4586n3323m0088m833l121L408M3472N4701J8440l275k675k0152m1622
179a1961k9363K964J6575J7039K5396L2030R713k7992l4088k0301k6353k4833
191g1174J5476M1453K2631J3152K2938J417l6451l2844q848n762R8K7979M1976
204C2041K3695j944r472j6058l4774l8628p859J8148J4191J7895L4939J8242k2960
217B7456k8861j4536k1933k2432J2311L9085K8481J5353J7653N043k8408l9894
$$ plain form
229 -10682 -30164 -33230 -37425 -26198 12301 43824 41178 29884 22646 -4560 -46143 -59494 -41909
242 -41909 -26209 -11200 22305 50810 44003 18023 2439 -11562 -36601 -44585 -17545 13800
254 13800 25265 36033 50442 37251 -3263 -28823 -33571 -40910 -42424 -14785 21915 32710 26389
267 26389 24615 13738 -19460 -44469 -36582 -18154 -8727 11638 44325 52185 27985 7434 -2810
280 -2810 -24614 -45154 -32552 -1062 14228 19469 32637 33423 3575 -27950 -34231 -32169 -35085
293 -35085 -19147 18098 39666 33013 25329 21062 -3383 -33844 -36224 -17264 -5461 4793 29950
306 29950 45609 28487 1834 -10486 -22731 -42130 -41636 -12669 12055 18318 26505 35124 18581
319 18581 -13825 -27988 -24863 -25670 -19992 7606 35380 36910 26364 20811 5527 -24525 -40722
$$ packed form
229a0682j9482l066m195J1227L8499L1523k646j1294p238k7206m1583j3351J7585
242d1909J5700J5009L3505K8505o807k5980j5584j4001k5039p984K7040L1345
254A3800J1465J0768J4409j3191m0514k5560m748p339j514K7639L6700J0795o321
267B6389j774j0877l3198k5009P887J8428R427K0365L2687P860k4200k0551j0244
280b810k1804k0540J2602L1490J5290N241J3168P86k9848l1525o281K062k916
293c5085J5938L7245K1568o653p684m267k4445l0461k380J8960J1803J0254K5157
306B9950J5659j7122k6653j2320j2245j9399M94K8967K4724O263Q187Q619j6543
319A8581l2406j4163L125q07N678K7598K7774J530j0546n553j5284l0052j6197
$$ plain form
332 -40722 -29442 -14772 -6425 12071 34969 33635 11102 -4900 -13453 -30160 -39927 -21819 6205
345 6205 18714 25118 35988 30872 3292 -19641 -23720 -24064 -24482 -7929 19715 31794 23951 16746
359 16746 8046 -14592 -36544 -33621 -17406 -6700 6167 27884 36028 19757 1276 -7234 -18807
372 -18807 -31152 -23122 865 16489 21153 27053 26552 7687 -17138 -25818 -24176 -23196 -13668 9477
386 9477 26819 23522 15017 9355 -5891 -26720 -30151 -16340 -4735 5172 22758 34420 24564
399 24564 6361 -5527 -15697 -27661 -28151 -9896 8933 16219 21522 25603 14063 -9973 -23183
412 -23183 -22870 -23391 -18222 2723 23780 26697 20903 16214 3254 -17671 -28380 -21842 -10534 -1112
426 -1112 13729 28890 27539 10907 -3445 -12141 -24600 -30543 -17229 3152 12662 18514 25907
$$ packed form
332d0722J1280J4670Q347J8496K2898j334k2533j6002q553j6707r767J8108K8024
345F205J2509O404J0870n116k7580k2933m079l44m18J6553K7644J2079p843p205
359A6746q700k2638k1952K923J6215J0706J2867K1717Q144j6271j8481q510j1573
372a8807j2345Q030K3987J5624M664N900n01j8865k4825q680J642R80R528K3145
386I477J7342l297q505n662j5246k0829l431J3811J1605R907J7586J1662r856
399B4564j8203j1888j0170j1964m90J8255J8829P286N303M081j1540k4036j3210
412b3183L13n21N169K0945K1057K917n794m689j2960k0925j0709O538J1308R422
426a112J4841J5161j351j6632j4352q696j2459n943J3314K0381R510N852P393
$$ plain form
439 25907 20533 -405 -16629 -19171 -19797 -18494 -3040 17652 24567 19762 14783 6804 -10647 -25504
453 -25504 -23531 -12173 -4464 5346 21186 25890 12298 -1554 -7661 -16344 -25746 -18373 694 11392
467 11392 14696 22019 22459 6026 -11984 -17015 -17162 -17659 -9541 9011 20785 18342 12378 8448 -3604
482 -3604 -21584 -25644 -14462 -5172 1051 16144 27273 18602 2613 -3894 -10562 -22353 -21965 -5591
496 -5591 8187 13673 18706 22379 12017 -7171 -18662 -18763 -17468 -14544 579 18617 20838 12945
510 12945 10483 3717 -14775 -25142 -16130 -5867 -763 11286 24470 21454 7193 -2656 -8466
523 -8466 -17074 -21950 -13258 3172 12044 13564 17635 15919 -437 -16846 -16478 -12743 -13908 -5063 13379
538 13379 19593 13542 11033 7298 -7218 -19783 -17737 -8220 -1630 5093 15413 20556 11538 -1603
$$ packed form
439B5907n374k0938j6224k542o26J303J5454K0692O915m805m979p979j7451j4857
453b5504J973J1358P709R810J5840M704j3592j3852o107q683r402P373J9067J0698
467A1392L304P323M40j6433j8010n031j47m97Q118J8552J1774k443n964l930j2052
482c604j7980m060J1182R290O223J5093J1129q671j5989o507o668j1791L88J6374
496e591J3778N486N033L673j0362j9188j1491j01J295K924J5123J8038K221p893
510A2945k462o766j8492j0367R012J0263N104J2049J3184l016j4261r849n810
523h466q608m876Q692J6430Q872J520M071j716j6356j6409L68L735j165Q845J8442
538A3379O214o051k509l735j4516j2565K046R517O590O723J0320N143r018j3141
$$ plain form
552 -1603 -7200 -10924 -19395 -17675 -1730 10377 11685 15276 17794 5364 -11004 -15161 -12407 -12886
566 -12886 -8038 6692 17664 16662 11220 6971 -2214 -16016 -21276 -12718 -2498 2197 10444 19381
580 19381 15609 1569 -5649 -8586 -16242 -18557 -5909 8015 12076 14403 16550 9318 -5496 -14256
594 -14256 -14083 -12471 -9316 240 12656 17057 11794 6386 720 -10319 -19236 -14935 -4359 755
608 755 6239 16018 16813 6446 -2054 -5531 -12150 -16554 -9696 2902 9575 11983 13729 10721 -43
623 -43 -10484 -13496 -11775 -9990 -4291 7740 15438 12548 7456 3973 -4851 -15602 -14589 -6082 -1362
638 -1362 3520 12860 16440 9091 919 -4723 -10349 -15056 -12097 -1952 7421 10319 11643 11229 4135
653 4135 -7605 -12756 -10612 -9517 -6444 5309 14827 13013 8530 5688 -2188 -12494 -14393 -8445
$$ packed form
552a603n597l724q471J720J5945J2107J308L591K518j2430j6368m157K754m79
566a2886M848J4730J0972j002n442m249r185j3802n260Q558J0220M695Q247Q937
580A9381l772j4040p218k937p656k315J2648J3924M061K327K147p232j4814q760
594a4256J73J612L155R556J2416M401n263n408n666j1039q917M301J0576N114
608G55N484R779P95j0367q500l477o619m404O858J2598O673K408J746l008j0764
623d3j0441l012J721J785N699J2031P698k890n092l483q824j0751J013Q507M720
638a362M882R340L580p349q172n642n626m707K959J0145R373K898J324m14p094
653D135j1740n151K144J095L073J1753R518j814m483k842p876j0306j899N948
$$ plain form
667 -8445 -2796 1869 9265 14632 11247 2493 -4132 -7961 -12632 -13509 -5162 5621 8711 9663 12006
682 12006 7523 -3830 -10483 -9711 -9063 -7969 1149 11209 12822 8842 5574 929 -8393 -13973 -10690
697 -10690 -4382 -575 4809 11987 12722 5076 -2191 -4469 -9312 -13150 -7462 2811 7562 8157 11155
712 11155 9854 521 -8701 -9719 -8321 -8270 -3210 7061 12039 8890 4980 2705 -4300 -12482 -11950
727 -11950 -5315 -707 2531 9414 13473 7691 -760 -4023 -6459 -11495 -9444 -174 6476 7480 8477
742 8477 9451 3127 -6338 -9851 -8130 -7116 -5129 3199 10449 9781 5292 3087 -1214 -8990 -11986 -6591
758 -6591 -893 1516 6424 12003 9365 1530 -3393 -5319 -9058 -10598 -4288 3978 6699 6888 8263
773 8263 6051 -2647 -8918 -8145 -6391 -5858 -448 8186 10822 6889 3756 1548 -5194 -10676 -8679 -2791
$$ packed form
667h445N649M665P396N367l385q754o625l829m671q77Q347J0783L090R52K343
682A2006m483j1353o653P72O48J094R118J0060J613l980l268m645r322n580L283
697a0690O308L807N384P178P35p646p267k278m843l838N688J0273M751N95K998
712A1155j301r333r222j018J398N1N060J0271M978l149l910k275p005q182N32
727a1950O635M608L238O883M059n782q451l263k436n036K051R270O650J004R97
742H477R74o324r465l513J721J014J987Q328P250o68m489k205m301p776k996N395
758f591N698K409M908N579k638p835m923j926l739j540O310Q266K721J89J375
773H263k212q698o271P73J754N33N410Q634K636l933l133k208o742n482J997N888
$$ plain form
789 -2791 567 3765 9192 10045 4148 -2379 -4455 -6994 -9951 -6718 1687 6262 6536 7671 7337 711
805 711 -6862 -7987 -6141 -5185 -2198 5201 9605 7513 3830 1662 -2913 -8945 -9286 -4438 -99 2293
821 2293 6697 9812 5931 -721 -3994 -5312 -7821 -7477 -869 5091 6439 6606 7150 3065 -4198 -7350
837 -7350 -6346 -4999 -3624 2173 7880 7991 4267 2211 -1059 -6801 -9009 -5785 -1392 1505 4985
852 4985 8347 7507 1603 -2735 -4414 -6861 -7896 -3351 3223 5725 5970 6589 4505 -1607 -6602 -6754
868 -6754 -5485 -4322 -87 5727 7894 5420 2968 561 -4147 -8252 -6535 -2129 982 3277 7502
883 7502 7999 3481 -1408 -3257 -5734 -7679 -4726 1152 4750 5430 5754 5088 469 -5270 -6340 -5216
899 -5216 -4174 -1632 3816 7311 5899 3152 1824 -2236 -6672 -6980 -3069 -248 1626 5353 7520
$$ packed form
789b791L358L198N427Q53n897o527k076k539k957L233Q405M575K74J135l34o626
805G11p573j125J846R56K987P399M404k092l683k168m575o032l41M848M339K392
821B293M404L115l881o652l273j318k509L44O608N960J348J67N44m085p263l152
837g350J004J347J375N797N707J11l724k056l270n742k208L224M393K897L480
852D985L362q40n904m338j679k447j035M545O574K502K45O19k084o112m995j52
868f754J269J163M235N814K167k474k452k407m708m105J717M406L111K295M225
883G502M97m518m889j849k477j945K953N878L598O80L24o66m619n739j070J124
899e216J042K542N448L495j412k747j328m060m436l08L911K821J874L727K167
$$ plain form
914 7520 4712 -386 -2924 -4519 -6833 -6525 -1038 3778 4741 5137 5780 2926 -3551 -6203 -4548 -4232
930 -4232 -3337 1839 6603 6665 3795 2060 -412 -5284 -7545 -4738 -991 683 3574 6924 5983 1241
946 1241 -2553 -3485 -5380 -6781 -2872 2875 4703 4275 5497 4172 -1146 -5565 -5239 -3839 -3750 -565
962 -565 5002 6490 4203 2019 526 -3255 -6791 -5864 -1721 410 1815 5325 6885 2986 -1671 -2791
978 -2791 -3927 -5822 -4553 1051 4053 3995 4585 5031 967 -4173 -5470 -4131 -3543 -1763 2524 6285
994 6285 5130 2005 894 -1014 -5213 -6674 -3018 198 1290 3941 6682 4490 -479 -2432 -3304
1009 -3304 -5210 -5271 -914 2959 4051 3906 4404 2437 -2323 -5456 -4900 -3048 -2251 665 5598 6261 2834
1026 2834 1287 59 -3788 -6507 -3876 -499 898 2819 5861 5405 1238 -2040 -3215 -4117 -4951 -2919
$$ packed form
914G520k808n098k538j595k314L08N487M816R63L96O43k854o477k652J655L16
930d232Q95N176M764O2k870j735k472m872k261K807L747J674K891L350r41m742
946A241l794r32j895j401L909N747J828m28J222j325n318m419L26J400Q9L185
962e65N567J488k287k184j493l781l536R27M143K131J405L510J560l899m657j120
978b791j136j895J269N604L002n8N90M46m064n140j297J339N88J780M287L761
994F285j155l125j111j908m199j461L656L216J092K651K741k192m969j953q72
1009c304j906o1M357L873J092j45M98j967m760l133N56J852P97K916M933O63l427
1026B834j547j228l847k719K631L377J397J921L042m56m167l278j175r02q34K032
$$ plain form
1042 -2919 1577 4024 3982 3852 3341 -192 -4742 -5041 -3091 -2586 -545 3620 5712 3689 1642 624
1058 624 -2391 -5434 -4792 -2025 168 2161 4433 5241 2898 -970 -2902 -3480 -4482 -3509 -14 3514
1074 3514 3902 3730 3927 1155 -3301 -4755 -3387 -2848 -1116 2397 4889 3960 2373 904 -1428 -4408
1090 -4408 -5446 -3241 -236 1370 3293 5090 3851 147 -2206 -2672 -3957 -4332 -1116 2674 3397 3687
1106 3687 3776 2179 -2044 -4055 -3772 -2951 -1564 1017 3923 4269 2672 1297 -477 -3214 -5321 -3699
1122 -3699 -512 1091 2589 4698 4391 858 -1549 -2069 -3597 -4523 -2255 1306 3135 3205 3972 2583
1138 2583 -520 -3768 -4047 -2998 -2111 -614 2998 4664 3460 1498 731 -1754 -4844 -4526 -1425 412
1154 412 1385 3855 4796 2048 -776 -1686 -2998 -4459 -3464 -196 3007 3577 3249 3432 1217 -2578 -3987
$$ packed form
1042b919M496K447m2j30n11l533m550k99J950N05K041M165K092k023k047j018
1058F24l015l043O42K767K193J993K272Q08k343l868j932n78j002R73L495L528
1074C514L88j72J97k772m456j454J368N39J732L513K492r29j587j469k332k980
1090d408j038K205L005J606J923J797j239l704k353m66j285l75L216L790P23K90
1106C687Q9j597m223k011K83Q21J387K581K906L46j597j375j774k737k107J622
1122c699L187J603J498K109l07l533k407n20j528r26K268L561J829P0P67j389
1138B583l103l248k79J049Q87J497L612J666j204j962p67k485l090L18L101J837
1154D12R73K470R41k748k824r10j312j461R95L268L203N70l28J83k215l795j409
$$ plain form
1171 -3987 -2768 -1949 -1564 1451 4344 3756 1809 991 -756 -3691 -4975 -2253 205 687 2758 4515
1187 4515 3812 171 -1750 -2292 -3481 -3948 -1200 2359 2990 2669 3048 2273 -1512 -4190 -3165 -2274 -2093
1204 -2093 92 3657 4403 2594 1111 45 -2390 -4492 -3400 -520 785 1659 3778 4365 1576 -1522
1220 -1522 -2171 -2581 -4042 -2731 1184 3267 2724 2899 3015 51 -3307 -3750 -2580 -2048 -856 2289 4593
1237 4593 3310 1277 341 -1387 -3998 -4328 -1176 873 1481 2747 4513 2791 -732 -2146 -2299 -3748
1253 -3748 -3450 -562 2526 2801 2358 2779 1290 -2021 -3956 -3144 -2013 -1355 966 3780 3807 1822 767
1270 767 -506 -2899 -4388 -2439 182 844 1888 4001 3621 481 -1486 -2278 -3044 -3379 -1573 1681
1286 1681 3104 2884 3055 2227 -844 -3465 -3343 -2235 -1719 -234 3314 3842 2542 1058 -13 -1894
$$ packed form
1171c987J219Q19L85L015K893n88j947q18j747k935j284K722K458M82K071J757
1187D515p03l641j921n42j189m67K748L559O31l21L79p75l785k678J025Q91J81
1204b093K185L565P46j809j483j066k435k102J092K880J305Q74K119N87k789l098
1220a522o49m10j461J311L915K083n43J75J16k964l358m43J170N32J192L145K304
1237D593j283k033r36j728k611l30L152K049O08J266J766j722l523j414j53j449
1253c748K98K888L088K75m43M21j489l311j935Q12J131O58K321K814K7j985j055
1270G67j273k393j489J949K621O62J044K113l80l140j967p92p66l35J806L254
1286A681J423k20J71q28l071k621J22J108N16J485L548N28j300j484j071j881
$$ plain form
1302 -1894 -4206 -3248 -707 718 1737 3187 3748 1642 -1105 -2168 -2693 -3453 -2502 532 2825 2608
1318 2608 2679 2229 336 -2642 -3408 -2356 -1978 -710 1678 3723 2933 1176 415 -1366 -3217 -3693 -1678
1335 -1678 404 1060 2553 3600 2637 -428 -1626 -2267 -3068 -3020 -755 2153 2795 2604 2812 1208 -1743
1352 -1743 -3564 -3086 -2123 -1361 997 3286 3568 1983 908 -55 -2760 -3898 -2542 -212 853 2012
1368 2012 3927 3223 576 -1078 -1883 -2706 -3318 -1518 1543 2604 2409 2889 2250 -416 -3096 -3126 -2174
1385 -2174 -1991 -151 2776 3716 2450 862 193 -1838 -3819 -3253 -942 594 1204 2737 3754 1920
1401 1920 -876 -1812 -2189 -3457 -2190 669 2463 2564 2501 2665 566 -2397 -3486 -2405 -1789 -1095 1391
1418 1391 3803 2956 1128 474 -464 -3029 -3848 -1604 157 863 2214 3517 2300 -128 -1693 -1717 -2766
$$ packed form
1302a894k312R58K541J425J019J450N61k106k747j063n25p60R51L034K293k17
1318B608P1m50j893k978p66J052L78J268K388K045p90j757p61j781j851m76K015
1335a678K082O56J493J047r63l065j198o41q01M8K265K908O42j91K08j604k951
1352a743j821M78R63P62K358K289K82j585j075r63k705j138J356K330J065J159
1368B012J915p04k647j654q05q23o12J800L061J061j95M80o39k666k680l0R52
1385b174J83J840K927R40j266j588o69k031j981N66K311J536O10J533J017j834
1401A920k796r36l77j268J267K859J794J01o3J64k099k963j089J081O16O94K486
1418A391K412q47j828o54r38k565q19K244J761P06J351J303j217k428j565k4j049
$$ plain form
1435 -2766 -3199 -811 2084 2418 2055 2555 1686 -1030 -3400 -2504 -1723 -1428 263 3200 3956 1676 789
1452 789 183 -2133 -3856 -2404 -278 1138 1451 3193 3417 1024 -1376 -1597 -2103 -3346 -2115 1314
1468 1314 2472 2323 2237 1918 -271 -2846 -3129 -1825 -1542 -547 2327 3800 2822 907 146 -1502 -3247
1485 -3247 -3308 -988 810 1160 2250 3932 1997 -824 -1927 -1910 -3033 -2644 246 2458 2486 2186 2074
1502 2074 791 -2063 -2940 -2451 -1652 -691 1288 3160 3107 1579 1 -887 -2383 -3747 -1989 250 975
1519 975 1742 3347 2988 -38 -1894 -1566 -2489 -2869 -868 1832 2487 2448 2243 1275 -941 -3040 -2743 -1707
1537 -1707 -1019 140 2627 3593 2252 254 58 -1932 -3442 -2425 -562 296 1274 2990 2794 974
1553 974 -748 -1947 -2469 -2609 -1610 635 2403 2648 2251 2042 165 -2334 -3085 -2038 -1164 -871 1991
$$ packed form
1435b766m33K388K895L34l63N00q69k716k370Q96P81K95J691K937P56k280q87
1452G89o06k316j723J452K126J416L13J742K24k393k400k21n06j243J231L429
1468A314J158j49q6l19k189k575k83J304K83R95K874J473r78j915p61j648j745
1485c247o1K320J798L50J090J682j935k821j103J7j123L89K890K212K8l00j12
1502B074j283k854q77M89P99R61J979J872n3j528j578q88j496j364J758K239P25
1519I75P67J605l59l026j856L28r23l80K001K700O55l9k05r68k216k099K97J036
1537a707O88J159K487R66j341j998j96j990j510J017J863Q58R78J716j96j820
1553I74j722j199n22j40R99K245J768K45l97k09j877k499p51J047Q74K93K862
$$ plain form
1570 1991 3452 2344 854 24 -1220 -3021 -2874 -1099 158 1249 2209 3521 1436 -425 -1838 -2069
1586 -2069 -2532 -2336 -89 1943 2167 2065 2346 1161 -1964 -3158 -1818 -1762 -1363 1213 3054 2612 1334
1603 1334 688 -385 -2339 -3353 -1852 -81 1068 1993 2939 2871 165 -1827 -1701 -2338 -2860 -909 1480
1620 1480 2209 1780 2302 1233 -826 -2557 -2741 -1559 -1174 173 2429 3272 1664 522 -45 -1351 -3346
1637 -3346 -2507 -486 632 1175 2897 3134 837 -1352 -1537 -1853 -2950 -1873 940 2146 1928 2160 1839
1654 1839 94 -2336 -2606 -1648 -1165 -428 1501 3284 2230 636 330 -543 -2922 -3404 -993 267 804
1671 804 1889 3146 1802 -645 -1426 -1953 -2188 -2116 -218 2054 2224 1863 1820 1118 -1251 -2962 -2206 -1133
1689 -1133 -881 622 2794 2667 1208 275 -502 -1978 -3577 -2287 105 1073 1702 2599 2379 195 -1191
$$ packed form
1570A991J461j108j490q30j244j801J47J775J257J091R60J312k085j861j413k31
1586b069m63J96K247K032K24j02K81j185l125j194J340N6L99K576J841m42j278
1603A334o46j073j954j014J501J771J149R25R46o8k706j992J26o37n22J951K389
1620A480P29m29N22j069k059j731j84J182L85J347K256Q43j608j142n67j306j995
1637c346Q39K021J118N43J722K37k297k189j85l16j097J077K813J206k18K32l21
1654A839j745k430k70R58M83P37J929J783j054j594l06q73k379m82K411J260N37
1671H04J085J257j344k447p81n27k35P2J898K272J70l61m3p02k369j711P56J073
1689a133K52J503K172j27j459r33p77j476j599J290K392R68O29Q97k20k184j386
$$ plain form
1706 -1191 -1779 -1716 -2436 -1356 1223 2518 1944 1743 1538 -460 -2509 -2231 -1186 -858 -64 1930 2811 1860
1724 1860 514 -33 -1291 -2858 -2343 -675 629 1418 2013 2777 1219 -933 -1755 -1626 -2367 -1965 368
1741 368 1997 1862 1765 1625 255 -1962 -2562 -1971 -1058 -470 975 2697 2400 1062 177 -662 -2408 -2614
1759 -2614 -1270 373 1214 1475 2728 1611 -288 -1483 -1545 -1941 -2248 -228 1975 1906 1779 1591 977 -1425
1777 -1425 -2440 -1845 -1304 -749 606 2507 2663 1239 264 -500 -1707 -2699 -1749 -290 877 1300 2252
1794 2252 2351 564 -990 -1598 -1850 -2208 -1056 950 1926 1894 1822 1316 -219 -2228 -2285 -902 -996 91 1684
1813 1684 2801 1550 518 -115 -1104 -2694 -2297 -601 312 861 2066 2439 829 -498 -1492 -1605 -2146
1830 -2146 -1631 434 1708 2005 1505 1608 637 -1789 -2262 -1637 -1098 -593 1101 2532 1921 607 -44 -588
$$ packed form
1706a191n88O3p20J080K579J295n74k01k05j998k049K78J045L28P94J994Q81r51
1724A860j346n47j258j567N15J668J304P89N95P64j558k152q22J29p41M02K333
1741C68J629j35r7j40j370k217o00N91R13N88J445J722k97j338q85q39j746k06
1759b614J344J643Q41K61J253j117j899j195o2l96l07K020K203o9j27j88o14k402
1777a425j015N95N41N55J355J901J56j424r75p64j207r92R50J459J167M23R52
1794B252R9j787j554o08k52l58J152K006R76l2p2n06j535k009n7J383r4J087J593
1813A684J117j251j032o33r89j590L97J696R13N49J205L73j610j327r94j13n41
1830b146N15K065J274K97n00J03r71k426m73O25N39N05J694J431o11j314o51n44
$$ plain form
1848 -588 -2238 -2949 -789 -4 681 1249 2375 1704 -290 -1219 -1411 -1791 -1984 -492 1412 2026 1435 1572
1866 1572 1107 -1015 -2558 -1699 -1069 -960 303 2125 2404 1184 425 -253 -1432 -2767 -1751 -169 609
1883 609 1158 2249 2441 526 -1108 -1538 -1267 -2118 -1344 826 2050 1557 1370 1014 -241 -1946 -2186 -1239
1901 -1239 -783 -225 1563 2361 1821 567 -79 -877 -2122 -2234 -448 861 739 1766 2521 1119 -840
1918 -840 -1237 -1385 -1906 -1476 35 1763 2041 1287 1111 413 -1097 -2167 -1278 -728 -471 678 2321 2018
1936 2018 767 -135 -221 -1298 -2259 -1232 174 881 1249 1809 1653 161 -1387 -1549 -1639 -1902 -556 1111
1954 1111 1895 1336 1111 720 -663 -2117 -1442 -754 -718 239 1687 2142 881 109 -74 -1101 -2401 -1480
1972 -1480 -32 492 1140 1495 1584 741 -864 -1180 -1512 -1530 -1112 674 1733 1709 1237 1068 -14 -1712 -1749
$$ packed form
1848e88j650p11K160P85O85N68J126o71j994r29j92l80j93J492J904O14n91J37
1866A572m65k122j543Q59O30J09J263J822K79j220p59o78j179j335J016J582P78
1883F09N49J091J92j915j634m30K71q51P74K170J224m93j87l56j255j705k40R47
1901a239M56N58J788P98n40j254o46p98j245j12J786J309j22J027P55j402j959
1918h40l97j48n21M30J511J728K78p54j76o98j510j070Q89N50K57J149J643l03
1936B018j251r02q6j077r61J027J406P07L68N60j56j492j548j62r0k63J346J667
1954A111P84n59k25l91j383j454O75O88L6R57J448M55j261p72j83j027j300R21
1972a480J448N24O48L55Q9q43j605l16l32j8M18J786J059k4m72j69j082j698l7
$$ plain form
1991 -1749 -1335 -616 -127 1085 1988 1375 405 -331 -723 -1786 -1962 -964 456 1027 1232 1838 1392 -599
2009 -599 -1173 -909 -1340 -1373 248 1644 1711 1015 1277 409 -1056 -1776 -1445 -704 -192 876 1502 1820 626
2028 626 -34 -628 -1700 -2078 -1238 197 489 934 1653 1450 352 -915 -1285 -1310 -1397 -413 1151 1632 1162
2047 1162 1116 771 -413 -1923 -1841 -948 -551 -148 1304 1923 1006 -37 -51 -987 -1823 -1320 29 315 562
2066 562 1427 1431 366 -797 -1064 -1299 -1360 -952 395 1532 1371 1052 914 -103 -1525 -1602 -920 -336 -439
2085 -439 848 2179 1198 102 -104 -725 -1782 -1764 -596 375 599 1118 1382 946 -493 -1358 -1125 -1303
2103 -1303 -1248 -239 1149 1268 693 1110 498 -882 -1752 -1176 -850 -520 308 1463 1608 483 -148 -511
2121 -511 -1194 -1566 -1203 89 871 941 1364 1476 441 -963 -1082 -845 -1254 -796 1092 1240 968 697 718
$$ packed form
1991a749M14P19M89J212R03o13r70p36l92j063j76R98J420N71K05O06m46j991
2009e99n74K64m31l3J621J396O7o96K62q68j465p20L31P41N12J068O26L18j194
2028F26o60n94j072l78Q40J435K92M45P19k03j098j267l70k5q7R84J564M81m70
2047A162m6l45j184j510Q2Q93L97M03J452O19r17j043j4r36q36N03J349K86K47
2066E62Q65Mj065j163k67k35o1M08J347J137j61l19j38j017j422p7O82N84j03
2085d39J287J331r81j096k06o21j057J8J168R71K24N19K64m36j439q65K33j78
2103a303N5J009J388J19n75M17o12j380q70N76L26L30Q28J155J45j125o31l63
2121e11o83l72L63J292P82P0M23J12j035j404j19K37m09M58J888J48k72k71K1
$$ plain form
2140 718 -184 -1464 -1206 -722 -248 -11 1157 1441 997 29 -270 -542 -1508 -1553 -353 475 509 878 1645 603
2160 603 -652 -992 -498 -1108 -930 459 1197 1169 832 591 10 -859 -1377 -1012 -633 -266 514 1777 1235
2179 1235 410 -98 -163 -1125 -1667 -838 431 780 528 1350 868 109 -865 -634 -1151 -803 -101 886 1122 726
2199 726 638 412 -406 -1461 -1202 -770 -474 -206 1231 1292 578 80 -237 -695 -1451 -906 -151 665 888 1162
2219 1162 1379 528 -313 -684 -837 -787 -592 592 826 837 1002 457 -283 -1142 -1110 -781 -305 118 713 1383
2239 1383 1147 -11 -233 -362 -1206 -1263 -587 319 788 927 1130 517 -285 -883 -933 -808 -1021 85 895 1034
2259 1034 771 827 -20 -756 -926 -1087 -348 -215 562 948 1106 236 -37 -336 -859 -1353 -612 499 705 697
2279 697 976 866 -65 -834 -695 -789 -885 -394 750 1010 644 936 472 -574 -1014 -1036 -584 -316 -133 898
$$ packed form
2140G18r02j280K58M84M74K37J168K84m44r68k99k72r66m5J200Q28L4L69P67j042
2160F03j255l40M94o10J78J389P38k8l37k41n81q69n18L65L79L67P80J263n42
2179A235q25n08o5r62n42Q29J269L49k52Q22m82p59r74K31n17L48P02R87K36l96
2199G26q8k26q18j055K59M32K96K68J437O1p14m98l17m58p56N45P55Q16K23K74
2219A162K17q51q41l71j53N0J95J184K34J1J65n45p40q59L2L29M76M23N95O70
2239A383k36j158k22j29q44n7O76R06M69J39K03o13q02n98n0J25k13J106Q10J39
2259A034k63N6q47p36j70j61P39J33P77L86J58q70k73k99n23m94P41J111K06q
2279F97K79j10r31p69J39r4r6M91J144K60l66K92m64j046m40k2M52K68J83J031
$$ plain form
2299 898 995 811 107 -24 -579 -1512 -1137 -50 336 420 813 1038 347 -775 -721 -356 -910 -355 177 1129
2319 1129 739 381 719 -18 -798 -1362 -684 -345 7 461 1086 835 116 -69 -219 -670 -883 -313 183 379
2339 379 680 846 750 -268 -396 -300 -644 -841 -36 758 922 402 622 139 -739 -883 -594 -268 -268 149 1091
2360 1091 982 294 -142 -288 -477 -944 -664 179 332 420 632 754 79 -498 -979 -795 -723 -260 419 949
2380 949 479 501 520 -346 -737 -680 -385 -242 72 428 892 496 -78 -186 -166 -723 -700 -314 248 321 720 790
2402 790 111 -305 -425 -672 -933 -743 -2 847 726 320 511 -34 -327 -980 -445 37 -253 466 640 905
2422 905 327 -106 29 -960 -853 -429 63 377 222 411 327 11 -478 -581 -313 -476 -83 522 456 390 279
2443 279 93 -60 -697 -849 -95 -232 83 933 885 207 -109 -25 -409 -648 -573 168 539 234 412 350 20
$$ packed form
2299H98R7j84p04j31n55r33L75J087L86Q4L93K25o91j122N4L65n54N55N32R52
2319A129l90l58L38p37p80n64O78L39L52M54O25k51p19j85j50m51k13N70M96J96
2339C79L01J66r6j018j28R6l44j97Q05P94J64n20K20m83q78j44K89L26%M17R42
2360A091j09o88m36j46j89m67K80Q43J53Q8K12J22o75n77m81J84P2M63O79N30
2380I49m70K2J9q66l91N7K95J43L14L56M64l96n74j08K0n57K3L86N62P3L99P0
2402G90o79m16j20k47k61J90P41Q49j21m06J91n45k93o53N35M82k90P19J74K65
2422I05n78m33J35r89J07M24M92L14j55J89q4l16m89j03K68j63L93O05o6o6j11
2443B79j86j53o37j52P54j37L15Q50m8o78l16Q4l84k39P5P41L71l05J78o2l30
$$ plain form
2464 20 -412 -596 -363 -414 -299 80 446 674 387 136 -167 -538 -547 -92 -50 -76 367 482 571 327 -236 -351
2486 -351 -712 -513 -101 186 486 595 564 664 -142 -516 -461 -509 -545 230 300 483 317 529 46 -505 -470 -376
2508 -376 -438 -195 234 829 650 222 -82 -61 -267 -592 -299 -72 431 133 701 204 28 -410 -194 -216 -482
2529 -482 -116 535 359 275 484 101 -565 -601 -276 -227 -326 106 474 391 250 248 13 -348 -794 -345 -92 329
2551 329 87 388 690 69 -381 -631 -153 -336 -241 72 499 137 243 310 -106 -593 -525 -169 -262 -26 352
2572 352 826 461 8 12 -184 -405 -305 -152 16 178 115 720 583 -25 -259 -384 -344 -313 -214 89 556 443
2594 443 304 198 -147 -700 -368 15 -183 -1 495 353 187 48 -52 -438 -449 -250 -355 21 -116 0
2614 0 579 -33 -367 -48 -89 -186 -301 -254 478 105 111 330 -293 -422 -486 -255 -154 -121 116 682 244 309 -126
$$ packed form
2464B0m32j84K33n1J15L79L66K28k87k51l03l71rM55M2k6M43J15Q9k44n63j15
2486c51l61J99M12K87L00J09l1J00q06l74N5m8l6P75P0J83j66K12m83n51L5R4
2508c76o2K43M29N95j79m28l04K1k06l25K93K27N03k98N68m97j76m38K16k2k66
2529d82L66O51j76q4K09l83o66l6L25M9r9M32L68q3j41kk35l61m46M49K53M21
2551C29k42L01L02o21m50k50M78j83R5L13M27l62J06O7m16m87O8L56r3K36L78
2572C52M74l65m53Mj96k21J00J53J68J62o3O05j37o08k34j25M0L1R9L03M67j13
2594D43j39j06l45n53L32L83j98J82M96j42j66j39j00l86j1J99j05L76j37J16
2614@N79o12l34L19m1r7j15M7P32l73OK19o23j29o4K31J01L3K37N66m38O5m35
$$ [...]
8191B23
##END NTUPLES=NMR FID
##END=
