##TITLE=1H_DE-57_NaOH_C
 D2O
 8 sc, 
 10.7.2024
##JCAMPDX= 6.0         $$ Bruker NMR JCAMP-DX V2.0
##DATA TYPE= NMR FID
##DATA CLASS= NTUPLES
##ORIGIN= UXNMR, Bruker Analytische Messtechnik GmbH
##OWNER= root
$$ XWIN-NMR		Version 3.5
$$ Thu Jul 11 13:43:43 2024 Russian Standard Time (UT+4h)  she@DPX200
##.OBSERVE FREQUENCY= 200.1314
##.OBSERVE NUCLEUS= ^1H
##.DELAY= (6, 6)
##.ACQUISITION MODE= SIMULTANEOUS
##.ACQUISITION SCHEME= undefined
##.AVERAGES= 8
##.DIGITISER RES= 18
##SPECTROMETER/DATA SYSTEM= spect
##.PULSE SEQUENCE= zg30
##.SOLVENT NAME= CDCl3
##.SHIFT REFERENCE= (INTERNAL, CDCl3, 0, 15.7039)
##AUDIT TRAIL= $$ (NUMBER, WHEN, WHO, WHERE, WHAT)
$$ ##TITLE= Audit trail, XWIN-NMR		Version 3.5
$$ ##JCAMPDX= 5.01
$$ ##ORIGIN= Bruker BioSpin GmbH
$$ ##OWNER= she
$$ F:/spectra/data/she/nmr/H-F/1/audita.txt
$$ ##AUDIT TRAIL=  $$ (NUMBER, WHEN, WHO, WHERE, WHAT)
(   1,<2024-07-11 13:42:17.65 +0400>,<she>,<DPX200>,
      <created by zg, POWCHK disabled, PULCHK disabled
       configuration hash MD5:
       00 E9 B6 7A A2 85 ED C7 34 08 36 98 17 FE 4E 26
       data hash MD5: 16K
       7C 59 BF CA DD 71 41 F0 C0 28 2A 9D 36 BE 34 BD>)
$$ ##END=
$$ 
$$ hash MD5
$$ FF D9 7E 8B 28 64 17 89 30 19 C0 C6 72 77 35 99
##$RELAX= 
##$RELAX= 
##$RELAX= 
##$RELAX= 
##$RELAX= 
##$RELAX= 
$$ Bruker specific parameters
$$ --------------------------
##$DU= <F:/spectra>
##$EXPNO= 1
##$NAME= <H-F>
##$PROCNO= 1
##$TYPE= <nmr>
##$USER= <she>
##$AMP= (0..31)
100 100 100 100 100 100 100 100 100 100 100 100 100 100 100 100 100 100 
100 100 100 100 100 100 100 100 100 100 100 100 100 100 
##$AQSEQ= 0
##$AQ_mod= 1
##$AUNM= <au_zg>
##$AUTOPOS= <>
##$BF1= 200.13
##$BF2= 200.13
##$BF3= 200.13
##$BF4= 200.13
##$BF5= 200.13
##$BF6= 200.13
##$BF7= 200.13
##$BF8= 200.13
##$BYTORDA= 1
##$CFDGTYP= 0
##$CFRGTYP= 5
##$CHEMSTR= <none>
##$CNST= (0..31)
1 1 145 1 1 1 1 1 1 1 1 1 1 1 1 1 1 1 1 1 1 1 1 1 1 1 1 1 1 1 1 1 
##$CPDPRG= <>
##$CPDPRG1= <>
##$CPDPRG2= <>
##$CPDPRG3= <>
##$CPDPRG4= <mlev>
##$CPDPRG5= <mlev>
##$CPDPRG6= <mlev>
##$CPDPRG7= <mlev>
##$CPDPRG8= <mlev>
##$CPDPRGB= <>
##$CPDPRGT= <>
##$D= (0..31)
0 1.2 0 0 0 0 0 0 0 0.06 0 0.03 0 0 0 0 0.0002 0 0 0 0 0 0 0 0 0 0 0 0 
0 0 0 
##$DATE= 1720690937
##$DBL= (0..7)
120 120 120 120 120 120 120 120 
##$DBP= (0..7)
150 150 150 150 150 150 150 150 
##$DBP07= 0
##$DBPNAM0= <>
##$DBPNAM1= <>
##$DBPNAM2= <>
##$DBPNAM3= <>
##$DBPNAM4= <>
##$DBPNAM5= <>
##$DBPNAM6= <>
##$DBPNAM7= <>
##$DBPOAL= (0..7)
0.5 0.5 0.5 0.5 0.5 0.5 0.5 0.5 
##$DBPOFFS= (0..7)
0 0 0 0 0 0 0 0 
##$DE= 6
##$DECBNUC= <off>
##$DECIM= 24
##$DECNUC= <off>
##$DECSTAT= 4
##$DIGMOD= 1
##$DIGTYP= 9
##$DL= (0..7)
0 120 120 120 120 120 120 120 
##$DP= (0..7)
150 150 150 150 150 150 150 150 
##$DP07= 0
##$DPNAME0= <>
##$DPNAME1= <>
##$DPNAME2= <>
##$DPNAME3= <>
##$DPNAME4= <>
##$DPNAME5= <>
##$DPNAME6= <>
##$DPNAME7= <>
##$DPOAL= (0..7)
0.5 0.5 0.5 0.5 0.5 0.5 0.5 0.5 
##$DPOFFS= (0..7)
0 0 0 0 0 0 0 0 
##$DQDMODE= 0
##$DR= 18
##$DS= 0
##$DSLIST= <SSSSSSSSSSSSSSS>
$$ [...]
##$SUBNAM2= <"">
##$SUBNAM3= <"">
##$SUBNAM4= <"">
##$SUBNAM5= <"">
##$SUBNAM6= <"">
##$SUBNAM7= <"">
##$SUBNAM8= <"">
##$SUBNAM9= <"">
##$SW= 24.0689651099613
##$SWIBOX= (0..15)
0 0 2 0 0 0 0 0 0 0 0 0 0 0 0 0 
##$SW_h= 4816.95568400771
##$TD= 16384
##$TD0= 1
##$TE= 0
##$TE2= 300
##$TE3= 300
##$TEG= 300
##$TL= (0..7)
0 120 120 120 120 120 120 120 
##$TP= (0..7)
150 150 150 150 150 150 150 150 
##$TP07= 0
##$TPNAME0= <>
##$TPNAME1= <>
##$TPNAME2= <>
##$TPNAME3= <>
##$TPNAME4= <>
##$TPNAME5= <>
##$TPNAME6= <>
##$TPNAME7= <>
##$TPOAL= (0..7)
0.5 0.5 0.5 0.5 0.5 0.5 0.5 0.5 
##$TPOFFS= (0..7)
0 0 0 0 0 0 0 0 
##$TUNHIN= 0
##$TUNHOUT= 0
##$TUNXOUT= 0
##$USERA1= <user>
##$USERA2= <user>
##$USERA3= <user>
##$USERA4= <user>
##$USERA5= <user>
##$V9= 5
##$VALIST= <valist>
##$VCLIST= <CCCCCCCCCCCCCCC>
##$VD= 0
##$VDLIST= <DDDDDDDDDDDDDDD>
##$VPLIST= <PPPPPPPPPPPPPPP>
##$VTLIST= <TTTTTTTTTTTTTTT>
##$WBST= 1024
##$WBSW= 4
##$XGAIN= (0..3)
0 0 0 0 
##$XL= 0
##$YL= 0
##$YMAX_a= 157304
##$YMIN_a= -120835
##$ZGOPTNS= <>
##$ZL1= 120
##$ZL2= 120
##$ZL3= 120
##$ZL4= 120
##$ABSF1= 10
##$ABSF2= 0
##$ABSG= 5
##$ABSL= 3
##$ALPHA= 0
##$AQORDER= 0
##$ASSFAC= 0
##$ASSFACI= 0
##$ASSFACX= 0
##$ASSWID= 0
##$AUNMP= <proc_1d>
##$AZFE= 0.1
##$AZFW= 0.1
##$BCFW= 1
##$BC_mod= 2
##$BYTORDP= 1
##$COROFFS= 0
##$CY= 11.3945322036743
##$DATMOD= 1
##$DC= 2
##$DFILT= <>
##$DTYPP= 0
##$F1P= 15.6554695791079
##$F2P= 12.8336369535428
##$FCOR= 0.5
##$FTSIZE= 0
##$FT_mod= 4
##$GAMMA= 1
##$GB= 0.15
##$INTBC= 1
##$INTSCL= 1
##$ISEN= 128
##$LB= 0.24
##$LEV0= 0
##$LPBIN= 0
##$MAXI= 10000
##$MC2= 0
##$MEAN= 0
##$ME_mod= 0
##$MI= 1.114404
##$NCOEF= 0
##$NC_proc= 0
##$NLEV= 6
##$NOISF1= 3.799351
##$NOISF2= 2.8
##$NSP= 1
##$NTH_PI= 0
##$NZP= 0
##$OFFSET= 15.70392
##$PC= 1
##$PHC0= -25676.85
##$PHC1= 11.58748
##$PH_mod= 1
##$PKNL= yes
##$PPARMOD= 0
##$PSCAL= 0
##$PSIGN= 0
##$REVERSE= no
##$SF= 200.130013532006
##$SI= 16384
##$SIGF1= 3
##$SIGF2= 2
##$SINO= 400
##$SIOLD= 16384
##$SREGLST= <1H.CDCl3>
##$SSB= 0
##$STSI= 0
##$STSR= 0
##$SW_p= 3612.71676300578
##$SYMM= 0
##$S_DEV= 0
##$TDeff= 0
##$TDoff= 0
##$TI= <>
##$TILT= no
##$TM1= 0
##$TM2= 0
##$TOPLEV= 0
##$USERP1= <user>
##$USERP2= <user>
##$USERP3= <user>
##$USERP4= <user>
##$USERP5= <user>
##$WDW= 1
##$XDIM= 8192
##$YMAX_p= 0
##$YMIN_p= 0
$$ End of Bruker specific parameters
$$ ---------------------------------
##NTUPLES= NMR FID
##VAR_NAME=  TIME,          FID/REAL,        FID/IMAG
##SYMBOL=    X,             R,               I
##VAR_TYPE=  INDEPENDENT,   DEPENDENT,       DEPENDENT
##VAR_FORM=  AFFN,          ASDF,            ASDF
##VAR_DIM=   8192,          8192,            8192
##UNITS=     SECONDS,       ARBITRARY UNITS, ARBITRARY UNITS
##FACTOR=    0.0002076,     1,               1
##FIRST=     0,             0,               0
##LAST=      1.7004516,     0,               0
##MIN=       0,             -120835,         0
##MAX=       1.7004516,     157304,          0
$$ Real data points
##PAGE= N=1
##DATA TABLE= (X++(R..R)), XYDATA
0 0 0 0 0 0 0 0 0 0 0 0 0 0 7 -7 7 -7 7 -9 14 -14 16 -21 23 -28 30 -34 39 -43 50 -57 63 -71 78 -89 98 -109
36 -109 122 -134 150 -164 182 -201 223 -247 275 -304 339 -379 426 -479 544 -622 723 -851 1024
55 1024 -1272 1650 -2299 3619 -7377 41343 157304 73948 -40477 -81396 -32292 72466 98496
68 98496 -12419 -105117 -85853 6437 77535 51015 -35957 -64154 -10728 64359 78840 4653
80 4653 -67481 -50483 9559 42935 22205 -36306 -57771 -4970 47503 44129 5673 -31765 -27022
93 -27022 17599 37552 6260 -32155 -37610 -7484 27539 25512 -6236 -24877 -8349 22015 28985
106 28985 3907 -22846 -22356 -652 18027 11091 -13788 -21795 -2348 18929 19973 2235 -15470
119 -15470 -12341 7083 15885 2614 -14958 -16964 -1863 13698 12547 -2548 -12509 -4396 10174
132 10174 13270 1681 -11995 -12366 498 10355 6118 -6080 -10634 -1604 10282 10837 671 -9092
146 -9092 -7537 3255 8414 2212 -7145 -8945 -1362 7767 7646 -982 -6736 -2960 4505 6985 1472
161 1472 -6624 -7183 -79 5799 3482 -2349 -5319 -1318 4976 5996 636 -5121 -4322 1167 4380 1901
177 1901 -3508 -4856 -725 4396 4537 -320 -3855 -2098 2205 4007 847 -3666 -4048 -340 3341 2585
193 2585 -1072 -3542 -1035 2957 3528 382 -2802 -3047 283 2584 1372 -1665 -3084 -847 2757 2993
209 2993 202 -2217 -1878 871 2319 647 -2106 -2542 -336 2039 1862 -200 -2017 -981 1369 1968
225 1968 585 -1267 -1871 -153 1370 857 -996 -1749 -246 1096 1530 92 -1096 -1103 214 1230 612
242 612 -630 -1203 -395 1227 876 -130 -1077 -614 575 762 363 -802 -993 13 725 534 -331 -822
260 -822 -297 501 752 67 -686 -765 172 430 257 -712 -659 166 652 613 -204 -573 -116 381 604 -7 -482
281 -482 -474 -15 315 80 -71 -587 -210 414 601 -1 -411 -289 -14 443 79 -271 -408 275 336 237 35 -308
303 -308 -112 159 86 255 -1 -480 105 352 66 173 -183 298 -17 225 5 -442 -243 348 -11 2 -63
324 -63 -386 -14 -233 41 33 -286 -242 361 -152 -250 -376 -174 434 85 -67 -136 -40 -54 194 380 -82 -339 -253
347 -253 239 33 230 -177 42 -57 165 190 -173 -233 -76 -11 206 -1 70 -261 -149 206 187 -82 -201 -12
369 -12 382 104 57 -308 -104 240 96 240 37 71 231 63 11 21 -120 59 145 -74 -64 -45 216 250 -19
392 -19 -106 -298 -171 -120 352 163 -102 -82 18 116 38 -9 39 44 122 -92 114 -19 -99 -25 198 -64 23 -174 52
417 52 72 97 -96 29 87 -46 189 166 -43 26 -88 12 317 67 71 -198 0 72 -71 -170 -158 -356 121 298
441 298 -3 -17 37 159 106 -115 -40 -101 36 150 -170 144 -296 -34 132 -37 31 -181 -187 78 174 262 -176 -185
465 -185 -47 -252 15 17 -274 195 75 97 237 196 -272 -289 182 140 -41 -81 33 67 114 248 -118 -37 116 43
489 43 -14 -166 -170 182 -69 326 -48 -92 42 72 -161 193 -173 -239 53 221 103 -37 -89 -91 -80 9 32 6 -55
514 -55 -18 4 -211 28 47 -103 20 -140 50 -63 -48 71 74 162 270 -49 -26 95 50 -309 -158 107 9 80
538 80 114 -61 109 -184 -172 59 -10 205 43 222 45 70 -203 -304 -275 183 -17 -80 -44 107 94 -39 -11 114
562 114 -50 -4 -116 136 -21 -254 -30 -56 -78 154 -31 40 63 190 269 102 -135 49 -126 104 209 13
584 13 21 63 18 14 -101 50 -10 -17 204 -331 -122 170 59 140 -143 -62 2 -129 -42 -7 -26 -91 104 8 15 162 91
611 91 -28 -54 33 202 -202 -9 27 -370 121 19 86 -156 1 1 -28 122 21 51 -68 -120 -116 283 92 178 16
636 16 81 -161 -38 -8 -88 -225 -142 192 -64 -106 -8 -3 188 11 -115 159 139 -29 21 -137 -133 -48 47 15 178 -175
662 -175 3 128 51 109 -53 -29 153 123 33 186 -98 50 -175 -91 135 -168 -223 -62 297 71 235 -126 -234
685 -234 -279 158 -118 -46 139 -163 -63 -65 -180 101 -36 18 212 149 -113 35 71 268 -149 60 272 -53 219
708 219 118 -79 -51 -27 107 -166 -1 33 -299 108 93 -2 7 4 -3 -14 148 25 -156 25 -13 62 -108 -268 -164
733 -164 39 -121 -257 -128 79 110 -106 69 34 -63 4 74 50 119 -32 72 169 313 130 -329 -34 172 -150
756 -150 0 -17 224 84 -144 -143 -351 166 -69 -114 81 -124 -188 17 230 -11 -75 -153 -166 -36 -2 233 -186
779 -186 117 -236 2 -40 25 49 188 -194 82 158 -127 196 212 -72 143 75 -60 79 -33 -225 -68 -45 -265
802 -265 2 -87 -40 304 79 -150 59 -158 209 89 -44 156 -93 -27 -189 297 -184 59 -15 36 -216 -61
824 -61 27 283 256 76 -34 33 -105 41 -56 -248 214 180 17 184 -131 193 -139 113 124 102 13 -123 -193 -20
848 -20 -161 141 118 -40 -15 -56 -60 -428 102 151 -2 149 -140 -103 253 154 171 81 257 7 346 -107 -59 94
872 94 -23 -146 -215 110 -120 -10 -26 139 57 -182 188 105 -111 135 -87 -140 -177 -54 217 13 81 -182 298
895 298 48 -180 105 131 101 -205 -164 373 -68 -51 -75 -124 -84 204 38 141 -84 200 -100 -233 -117 -42 202
918 202 -99 151 -75 -70 -98 -125 -91 281 -65 -128 -29 128 105 -5 -290 255 153 129 7 129 -83 179 -17
941 -17 102 167 -48 -220 2 8 28 -55 -43 91 -231 -110 102 111 -2 97 -68 -57 -9 -329 30 75 -171 -50 278
966 278 207 18 -57 111 -62 32 -130 -136 -40 1 11 -63 -127 12 -278 -88 -241 44 -22 271 17 -315 100 -127
990 -127 -158 -223 -33 97 40 -14 47 -70 -89 60 -140 94 116 -65 -56 140 341 126 36 134 46 -69 48 40 31 -148
1016 -148 -78 15 -125 133 -24 98 -20 229 -167 -203 -114 -28 -188 176 -73 -171 7 122 -96 -116 265 79
1038 79 106 279 21 132 -145 -186 -51 51 189 -54 -241 -156 -165 -39 -68 75 121 -106 -98 -93 -132 -157 56 163 -101
1063 -101 -87 12 -135 -58 -138 112 -99 -251 311 -41 -59 -140 121 -84 -163 136 186 9 -195 73 11 12 -123 259
1087 259 -279 76 115 162 190 127 4 -25 117 -187 -24 183 289 -135 -200 50 114 117 -196 161 -76 -55 9 -93
1111 -93 166 309 92 -44 31 68 52 112 55 -58 -214 5 -39 -197 81 65 -167 65 91 -40 50 -113 101
1134 101 -163 43 49 -85 -163 35 -130 -320 -52 -96 -172 -212 -260 331 83 14 -310 102 280 -129 -121 172 68
1157 68 243 162 -156 -157 180 -193 -93 164 46 13 -28 57 -108 33 50 60 -112 21 -47 143 -123 -75 41 26
1181 26 -220 -80 -101 202 271 38 -133 -105 -43 44 108 -63 -253 124 -149 -101 76 -9 -39 -52 195 84 126 -107
1205 -107 342 15 -49 262 -191 211 79 4 187 -82 244 15 -140 -58 -76 -153 226 -60 271 -176 -202 -79
1227 -79 -37 -36 112 -10 -99 113 173 215 -82 46 71 -156 121 -203 37 -39 159 -174 96 88 38 -15 -183 216
1251 216 87 19 -125 222 -214 266 333 -101 91 -65 100 -266 127 -41 -372 218 -251 47 104 81 15 121
1273 121 -202 -131 99 -64 106 194 146 -169 -107 -172 -25 -33 199 -40 92 -107 174 128 -137 -6 -218 73 -225
1296 -225 -27 -79 150 12 31 193 -8 60 -113 -144 -65 -175 -5 -10 -157 46 -74 136 -94 -189 -1 75 36
1319 36 72 183 -223 3 -154 -12 -193 82 2 -216 67 229 -21 -285 -72 50 -38 -34 95 58 -102 65
1341 65 55 -89 -52 126 70 -23 168 -32 16 -65 49 -116 -37 59 -63 86 155 261 164 -10 -58 -285 57 -27
1365 -27 -107 13 -12 64 -72 -108 284 5 -50 58 -40 61 -112 35 -93 6 0 93 87 -29 252 -20 38 109 -45
1390 -45 -28 -336 239 123 47 30 -17 52 35 -96 -100 39 -78 101 27 -71 -93 206 18 152 22 93 47 159 -74
1415 -74 -3 -77 86 29 109 -209 -139 -144 -74 185 6 -8 -30 216 22 -49 33 -12 -107 86 -62 22 216 83 -329
1440 -329 -105 283 -147 -122 94 -35 61 98 -117 38 -101 -189 300 34 -8 160 -165 -83 -81 116 -208 80 105
1463 105 276 -180 106 -2 -1 116 -115 -90 -38 1 -54 29 2 -44 75 217 37 51 -62 -1 -105 -85 -40 -113 41
1488 41 -22 -59 -284 41 115 -27 86 -19 1 35 -152 -95 110 -66 -74 -108 -70 173 36 -38 164 144 -167 153
1512 153 -126 79 195 -97 8 -186 181 -73 -135 187 134 2 -271 20 -41 -289 -105 428 -114 140 330
1533 330 102 -321 -131 -18 -128 -125 -148 61 -188 -162 218 -87 95 125 -176 -26 -157 155 110 4 -86 -205
1555 -205 147 -106 109 -202 142 -71 -8 17 96 -54 69 -173 -455 69 -168 57 -77 -95 -177 49 -64 73
1577 73 -84 215 -121 31 13 8 -152 -271 -7 136 -10 90 105 -336 237 -17 53 -146 120 -52 191 85
1599 85 85 -50 -14 -79 -77 27 -94 331 111 124 164 -164 3 -111 20 -165 -24 81 -161 146 -245 -16 -69
1622 -69 233 -209 -146 -39 -336 -119 -27 192 95 -199 -178 -50 315 66 -144 -113 -227 267 50 85 27 94 -291
1645 -291 88 42 -66 4 202 27 -154 11 -177 99 1 7 -99 92 508 139 -127 11 326 -97 -82 -47
1667 -47 96 48 -5 127 8 63 76 160 97 40 201 223 -206 -100 -116 160 -91 -30 59 93 -148 -219 -291 20 -84
1692 -84 294 51 -29 -277 -167 -137 -250 -74 271 -169 -27 -42 -118 6 38 71 -156 74 67 -115 -106 -61 180 -81
1716 -81 -152 -333 -141 128 199 37 7 -39 78 74 147 -81 99 -205 130 -6 -173 -66 96 4 58 -70 -24 -2
1740 -2 152 227 32 0 -263 -280 -283 82 -50 165 -283 -88 -51 -77 -148 -64 -127 63 -83 1 -62 55 350 -195 -116
1765 -116 231 -60 -216 -257 -151 -131 -2 -133 43 -121 -175 -72 -7 -6 -102 -8 -49 155 20 114 -129 103 38 20
1789 20 -209 -211 50 0 -356 -2 170 -144 142 114 -70 -69 -37 99 -11 148 38 -170 274 65 162 112 -61
1812 -61 93 -130 -47 200 225 -72 -81 -66 174 -329 56 237 -86 163 -227 199 -165 -268 174 67 -14 3 27
1835 27 8 -3 250 -88 189 -129 -111 237 144 47 111 -44 -136 -114 115 185 35 71 -233 259 41 -107 76 -159
1859 -159 -46 66 -55 40 -226 62 -33 113 145 7 196 24 54 -57 -157 4 -124 75 34 -88 -241 142
1881 142 -175 21 50 61 -189 -19 -140 -28 114 81 82 -164 237 132 -116 27 -116 64 97 183 -57 7 -17
1904 -17 16 -33 45 169 -125 -268 -83 -184 45 256 20 103 84 -22 333 101 200 190 -5 146 -54 -23 36
1927 36 -72 138 77 -171 -57 73 -153 -67 30 -100 -190 25 9 120 -28 -20 -99 164 156 -274 89 67 -78 126
1951 126 -327 -113 292 -229 -21 84 177 -139 44 29 -237 -83 -6 58 76 -68 -68 -77 -5 191 40 62 78 100
1975 100 77 -225 89 65 5 155 1 77 -37 55 64 -175 -181 64 205 -62 65 -117 -81 -117 -16 99 5 -215
1999 -215 43 -114 111 -34 -14 -199 121 210 -4 87 89 -1 353 -91 93 -138 -311 27 -174 86 -227 -126
2021 -126 30 -130 94 -7 -102 -26 199 -9 35 67 7 155 -36 96 114 -46 104 17 -252 159 57 148 142
2044 142 -35 48 124 -180 63 130 95 -89 -47 -84 189 37 236 110 254 78 66 -105 22 48 -122 -191 40
2067 40 96 -169 45 -141 51 -95 0 216 -226 4 22 -26 -212 6 144 195 -119 68 85 -136 250 50
2089 50 -9 -134 -160 18 88 50 -145 31 144 -9 91 229 -266 -111 -83 98 -142 -65 83 45 -339 -39 68
2112 68 110 -165 -82 -64 -28 -204 -121 -148 20 -69 183 -54 11 -1 23 167 124 231 303 -74 -181 -139 -290 -67 83
2137 83 266 120 -91 -257 -41 60 61 -34 -210 -136 -48 185 21 -30 -252 114 145 84 9 -161 58 -152 -46
2160 -46 -94 -41 -54 -136 -20 -115 -96 -70 -54 -139 446 -211 -140 -100 -101 -50 -41 -159 -67 -14 -212 96 97 -265 -257 60 142 141 44
2189 44 248 241 -93 -99 -1 77 -128 112 -4 245 -210 82 -253 200 -173 -5 46 15 189 -126 208 133 255
2212 255 -120 -164 194 57 -8 10 -18 -236 -190 -11 -49 -119 -122 -100 -90 3 82 27 79 22 -109 208 44 43 -47 56
2238 56 178 16 -145 -13 7 14 283 -171 97 -16 135 -80 159 209 -95 119 -154 -153 43 -77 -25 -112 119
2261 119 -141 -84 -80 57 248 -169 58 -164 83 120 105 138 11 -166 -110 173 49 41 -32 14 8 50 32 138 -47
2286 -47 -45 218 198 25 -50 76 -54 51 206 145 -66 79 50 170 32 -167 -36 -49 -76 48 168 -113 162
2309 162 -18 148 -273 103 -104 28 15 -24 166 -114 129 95 -219 0 165 -31 -49 -190 -107 -108 -5 160
2331 160 39 -7 -47 -108 -202 407 -13 -153 355 9 -190 -273 89 -40 113 -90 -133 -59 -1 -89 129 -203 168
2354 168 -21 172 -479 -138 228 195 130 106 -10 -115 -14 99 166 -78 219 206 244 13 216 -129 -70 126
2376 126 -107 -200 -198 1 191 -12 -168 -75 81 38 200 136 57 -103 18 -114 -164 -85 71 175 53 5 108
2399 108 -92 -237 -18 10 -34 -104 365 -56 -307 -40 -125 -9 -17 110 -72 -104 25 -281 -131 -33 191 64 -56
2422 -56 135 96 131 -53 -92 125 -12 201 26 23 -231 120 -254 -76 92 73 111 168 -112 -135 -221 -29 75 -70
2446 -70 169 -91 -196 -81 303 -117 -349 -133 -140 14 45 167 -45 228 11 2 -118 -198 262 287 -34 87 94
2469 94 -155 -240 -149 -120 -38 -83 -47 -297 183 138 93 -311 -51 28 46 -146 158 -49 -28 -64 -72 -15 84 -132 -19 172
2495 172 -198 -177 -57 33 -206 49 117 276 -19 0 66 -364 -119 81 17 -91 -16 135 -233 0 24 104 29
2518 29 -173 216 -4 1 19 73 193 -229 -199 106 -195 72 26 39 122 25 50 -103 -127 -80 -96 -256 206 155 -79
2543 -79 87 -172 22 -55 63 34 -64 -91 -57 -387 -40 174 174 132 -66 60 -6 -104 -84 74 30 -20 -83 -18 215
2568 215 69 32 -81 46 5 -212 -170 239 23 -169 172 -29 142 9 -112 154 167 5 113 223 -49
2589 -49 -126 79 -90 63 -138 11 -38 107 -204 -123 -54 91 -256 -120 -32 149 -87 81 -236 82 -106 -100 199
2612 199 -127 249 105 -187 180 -66 -28 -108 -314 43 199 -111 144 -24 79 -13 133 -216 89 94 77 76 -238
2635 -238 285 52 -192 -127 -147 -71 -120 169 -29 147 -305 212 123 -21 -42 -154 373 -33 -85 -195 46 8 89
2658 89 96 -69 -37 59 -149 -259 23 94 -121 -247 -234 270 -53 4 233 51 80 -14 79 -1 36 -179 59 123 -180
2683 -180 102 24 -116 89 98 112 -159 106 -256 -208 -103 -116 120 -142 -266 -60 185 92 -117 -34 12 -148 84
2706 84 205 -93 -39 -2 274 50 85 -231 -169 9 -7 223 -96 37 -235 139 53 -194 -56 -70 -17 201 -139
2729 -139 -111 -85 -333 -2 -94 -75 37 8 86 -95 54 -108 -10 -185 -187 39 -144 -370 111 -141 107 228 5
2752 5 47 46 122 40 -118 24 208 131 -207 -64 24 115 -26 -193 137 11 84 -84 -261 -33 55 164 -84 105
2776 105 -37 11 -163 -96 -80 215 -235 35 -157 -280 -217 44 -355 -68 -37 31 177 -2 181 -230 -121 -253
2798 -253 -40 -221 84 -108 151 193 -15 63 -28 53 39 60 73 -95 -109 11 124 -55 -59 -33 140 -106 15 10
2822 10 -39 144 187 68 -84 -47 -205 107 -199 202 -76 -7 -132 136 179 -42 44 -130 -105 21 16 63 -179 -143
2846 -143 -17 118 -201 -318 -384 148 180 -371 -85 41 13 -65 -202 -258 -204 -21 88 155 108 5 -252 25 -57
2869 -57 -18 34 82 -51 90 -107 -40 -70 -101 12 215 31 -153 -66 -189 38 52 -295 141 -23 58 121 205 250
2893 250 105 -69 190 53 18 -306 -78 69 -213 -194 -37 22 12 -119 -82 -295 8 22 -61 -124 -90 153 -33
2916 -33 60 -339 44 51 52 -46 23 235 235 79 -320 -128 97 -73 -23 -37 16 -12 13 -161 41 153 2 -37 -52 107
2942 107 85 -59 -180 32 -133 -41 244 -63 25 -207 -25 -111 -77 -171 240 99 22 -135 53 -201 88 105 109
2965 109 -110 -34 49 -59 -38 60 106 -29 3 -249 -74 -171 -73 -50 43 -168 -142 117 85 -223 -1 -18 -43 44 -55
2990 -55 132 -246 158 49 -62 -71 68 93 -90 43 -282 200 245 -32 31 -200 -30 148 -14 -52 85 61 -36
3013 -36 -127 -58 -95 -103 77 83 46 -28 -163 92 158 -4 211 16 23 25 128 5 -160 -107 140 68 -317 -52 -31 1
3039 1 54 -24 -61 -25 244 -86 -161 101 -111 29 95 153 -244 -133 -74 -54 80 -168 149 248 -85 101 75 137 159
3064 159 5 26 37 129 53 59 -1 8 127 -147 25 -107 38 120 -34 112 -31 -139 9 -43 -193 124 138 15
3088 15 225 182 -145 0 -134 42 -46 12 332 178 -90 29 -43 -50 62 -112 -176 -81 -39 -1 -17 -101 -79 165 57
3113 57 108 159 163 119 -117 -68 -69 -87 -114 -67 112 1 160 40 -162 25 34 14 -91 12 -31 187 169 -17 -56 -287
3139 -287 -43 -205 107 -35 163 -80 157 104 79 18 48 -139 -114 -97 112 -158 104 261 245 117 -89 -120 -57
3162 -57 105 43 9 -158 59 43 -33 -180 -52 -128 140 245 93 -249 -24 44 -197 -21 158 63 32 238 0
3185 0 109 -132 -145 -111 271 78 -42 11 214 82 -48 -9 -67 -268 -6 -94 -56 -149 216 152 -14 -260 -220 165
3209 165 -233 -182 49 8 14 7 -80 -210 234 -65 -92 -59 -28 -27 -111 -109 -69 -165 181 -107 83 -32 273 99 -287 65
3235 65 134 -140 8 -23 44 -90 -67 83 56 -14 -204 258 20 305 29 217 232 22 56 -138 14 135 37
3258 37 -33 10 261 91 208 -121 104 39 -204 -171 241 45 292 -231 -227 116 89 -189 -14 184 -102 51 211
3281 211 12 -177 -258 83 -116 183 137 61 -73 44 98 169 -54 219 -7 -368 17 461 -91 -222 18 24
3303 24 -76 -116 -259 -111 235 -115 316 -51 -168 67 -130 41 116 90 -168 -63 -239 -401 43 -123 33
3324 33 57 -73 101 68 57 -42 -141 -36 -90 -34 -27 227 -73 171 60 -56 264 136 -33 -54 222 -9 89 61
3348 61 -111 -29 124 -40 230 -182 151 -184 -100 -1 -23 48 75 238 -87 -35 39 61 54 -60 -110 246 -125 68
3372 68 35 183 15 -86 264 56 -300 -82 83 -206 -144 -14 142 8 164 239 203 149 -158 -8 56 126 -58
3395 -58 -222 -13 -34 161 158 168 -198 66 -6 206 -76 -93 -133 104 52 226 56 -188 -32 -144 231 -128 -55
3418 -55 -138 12 46 -191 66 6 -27 -133 -140 121 -109 99 22 60 45 292 118 -107 103 66 140 -55 -158 33
3442 33 -171 92 92 -49 -51 69 -169 -146 -87 37 208 71 -101 -83 215 -74 19 -186 198 236 -19 280 -19
3465 -19 105 66 107 -377 -97 -218 259 157 -28 -51 -199 -25 -151 -42 60 3 -368 -59 -72 -3 132 114 -347
3488 -347 97 -151 336 260 348 -89 244 -44 180 106 143 -71 -128 79 -223 109 50 190 -145 -134 -124 182 -11
3511 -11 141 -5 -23 49 -167 -64 -52 -122 141 -141 -40 -52 74 144 267 0 -128 -36 -29 109 -25 -140 -31
3534 -31 -53 -215 123 -21 106 -180 259 215 144 -292 20 117 -132 111 -207 -78 26 5 -39 85 -162 69
3556 69 113 -48 -32 215 181 104 113 -92 138 165 -78 54 -75 -125 -55 -121 89 62 101 -64 -91 108 93 105 169 -158
3582 -158 -76 140 105 37 -55 -223 99 338 -113 -193 287 89 249 -6 -240 367 -102 64 -104 -90 140 163
3604 163 42 69 -255 -24 -136 -45 -24 237 151 212 149 -7 34 -136 15 149 39 144 -73 -180 -36 -7 70
3627 70 -224 -175 -5 190 -106 -85 -259 -185 -236 46 -79 -313 17 -141 142 206 -37 -265 53 -161 -69 96
3649 96 137 -6 79 -153 -222 186 188 -43 -67 -38 -177 18 -10 -74 68 -92 79 -151 -21 54 96 -50 -78 -80 58
3674 58 -12 -3 -274 2 56 223 -199 310 157 -15 -142 -237 105 -48 182 -45 -20 42 81 -68 133 -24 -150
3697 -150 30 -70 13 -37 -111 2 -238 2 93 -62 47 -237 -167 11 12 -86 23 269 70 76 -29 109 -125
3720 -125 220 -291 -200 -250 -25 -121 -299 -98 -18 29 225 -26 -28 232 49 -5 -157 26 -53 -84 -153 23 49 10
3744 10 -107 -304 -129 145 -127 -31 -118 11 -100 -242 26 -163 -77 107 -134 -81 -195 131 2 102 -21 55
3766 55 -25 -87 -42 -149 -274 31 69 98 -13 62 -217 3 73 199 35 -194 9 219 -37 -191 112 94 161
3789 161 -252 -39 -41 -171 71 183 154 -92 38 9 23 -144 -318 -13 107 -82 32 117 70 79 64 44 -17 110
3813 110 34 151 -42 -153 130 206 65 124 -190 -100 156 143 -80 61 -238 -117 -38 6 -71 -113 -328 -17 -66
3836 -66 -29 42 236 -184 10 -172 130 -218 121 161 -61 -125 285 41 -132 69 -68 -171 6 213 14 318
3858 318 -29 -57 30 140 90 273 -6 140 12 -97 -28 115 -146 100 -87 -154 -16 -117 -88 62 -63 131
3880 131 81 -77 152 -26 157 87 75 -201 -144 30 33 -120 29 197 37 241 17 -52 -117 -91 165 -183 341
3903 341 -48 -20 5 210 -10 11 148 -133 -28 -24 62 189 273 27 39 -207 28 173 -228 45 -58 -52 -17 42
3927 42 81 -88 -117 261 118 142 -13 -48 87 27 3 -131 301 -197 131 -131 -19 -129 11 -275 -27 155
3949 155 131 152 195 -63 -51 0 67 226 -210 113 73 -93 -103 89 -76 68 194 24 70 64 -39 -247 46 8
3973 8 219 -77 20 10 -31 -32 -164 -22 -177 68 20 9 160 -44 175 276 -40 -54 -87 -173 229 172 -108 -142 -21
3998 -21 -131 -84 -122 -254 -143 -13 -15 196 99 95 -26 139 -91 102 96 -55 179 -121 -111 -16 124 17 -180 -20
4022 -20 -146 -32 -6 194 2 297 214 -122 -211 -60 54 -120 -107 -245 -63 -133 149 -47 125 60 35 -104 -160
4045 -160 70 -34 -255 44 -39 111 69 -164 -62 185 65 145 531 102 -60 40 -190 -66 -5 -131 -125 133
4067 133 175 107 143 130 -96 -58 -291 -22 -39 -33 -122 -15 -27 -23 -101 -130 -135 -146 -59 122 -47 -96 134 48 174 -2 67
4094 67 134 35 -109 -25 -63 26 125 -107 275 205 -138 -23 -93 114 38 -129 -3 -37 -145 147 -186 117 -53 -136
4118 -136 -40 -14 -203 39 86 -97 21 223 -59 -66 257 -86 0 -295 56 -16 45 3 42 233 36 -146 309
4141 309 53 -141 147 -66 -58 53 -358 -14 81 18 47 77 -104 -53 94 -179 -115 -25 126 -32 196 223 -146
4164 -146 452 -159 -85 5 -73 108 146 -67 -152 2 262 -69 148 21 -209 185 -82 56 -26 126 -15 101
4186 101 14 3 -84 -174 198 162 201 -116 -212 381 -196 -15 117 -116 -25 320 -72 2 119 62 156 -112 37 -162
4210 -162 -256 -229 262 83 -95 104 126 -182 303 -105 -52 114 -80 -95 52 -130 -65 46 72 10 30 -67 -196
4233 -196 251 -8 -18 43 215 39 -71 170 196 -278 -146 14 63 -18 61 -233 -77 5 -76 -87 89 57 -98
4256 -98 104 245 -152 52 -149 -69 30 79 248 -47 -178 142 -151 66 -120 -37 -81 -191 34 -62 97 35 46
4279 46 227 -379 220 -107 -68 -244 -55 59 -495 -98 115 -82 -163 -6 -184 308 84 -356 -93 50 -186
4300 -186 36 71 -206 -191 18 140 -285 -56 307 171 -7 89 -240 88 130 -193 -153 -124 33 -159 23 -47
4322 -47 -240 -171 -146 67 -74 -32 -140 5 -186 -78 -4 -69 -249 158 -136 -74 205 -149 -82 3 -105 -22 293
4345 293 314 -132 -37 212 -158 123 164 82 12 98 -52 81 213 75 -246 -91 -161 -35 42 148 171 38 -88
4368 -88 -198 229 -28 174 -52 -204 103 -259 -150 -133 125 -134 -151 80 -343 -285 -64 -105 158 215 129 205 105
4391 105 31 -101 -424 -179 -170 -13 22 -68 -142 -180 -32 -17 -108 57 -179 177 82 -313 110 -400 -140 217 -256
4414 -256 -159 -184 231 -202 60 -184 96 35 -41 101 43 -70 106 -114 -66 -84 105 -49 -50 -243 -259 -51 13 48
4438 48 -109 155 -57 -241 22 -44 -40 -226 -158 103 182 47 -157 -156 58 -68 -220 -128 111 120 32 -211 273 80
4462 80 -113 90 60 23 -193 129 54 -36 45 -76 157 232 -66 209 134 -189 -141 -255 28 45 135 143 -97 134
4486 134 161 -159 84 153 -142 -222 125 186 17 -55 -33 -203 -251 223 138 287 -58 287 190 -64 -21 -56 -200 213
4510 213 35 80 36 40 -412 4 129 -66 -5 -139 62 93 -6 -83 34 -225 -104 -34 149 -105 -119 -361 104
4533 104 38 17 116 21 -69 -46 81 -96 116 -196 94 142 -47 -102 100 -69 211 223 95 187 -8 -113 -303
4556 -303 -415 23 222 -37 159 -130 156 82 -140 107 193 -34 -128 38 -27 221 -252 -87 196 -162 -156 -1
4578 -1 -39 -140 -122 -316 97 -269 -164 -156 -1 6 37 -177 173 -214 -63 -60 -93 -143 -218 345 149 -3 -9 271 -4
4603 -4 -124 -52 166 107 82 104 25 192 247 -12 83 62 31 90 -112 -147 131 34 252 -29 163 168 -72 -169 33 25
4629 25 -74 183 95 -163 -68 -145 252 5 89 72 38 -65 124 123 -9 -74 193 130 6 -144 -2 -199 136 30
4653 30 -73 252 -138 -129 -134 245 66 51 -275 333 -281 -2 65 81 -72 -185 -111 177 -127 -69 -129 2 49 117
4677 117 -198 -45 -70 100 -2 -140 113 80 -49 -51 12 51 -19 87 13 -102 -67 -26 42 -105 88 9 -69 2 157
4702 157 -53 -43 -48 -8 7 71 -21 -63 84 6 147 -253 -40 172 -206 40 -14 -269 -49 -16 -127 -73 -19 -125
4726 -125 -96 45 -99 148 -210 -50 -104 -54 -13 135 189 145 7 75 351 -3 -39 6 -238 -153 -61 184 -36 53
4750 53 73 -120 244 14 -32 31 -61 -75 32 -65 -115 168 15 -215 -213 246 198 -46 12 103 -135 72 91 -285 -71
4775 -71 -136 136 295 -229 32 187 -47 145 115 358 255 -96 -58 115 114 137 321 121 -17 27 -40 133 -149
4798 -149 -150 -59 39 -127 52 -90 261 -130 58 -73 -25 -71 20 124 235 117 -11 -74 28 -33 -52 -18 214 -48
4822 -48 -24 -100 -213 139 16 -103 -75 100 42 223 61 -107 141 45 84 -143 -86 -59 96 -339 -332 -8 23 141
4846 141 -103 152 43 -161 12 74 34 -266 26 20 -24 24 196 -214 -3 -200 -185 108 -199 157 -145 39
4868 39 -63 -7 225 114 -214 15 28 225 79 63 -223 -36 -102 10 -55 -120 -91 128 -23 -31 -28 -121 156 155 -126
4893 -126 135 -160 194 93 -154 78 147 65 -72 -131 101 -120 131 57 -106 -147 69 285 61 50 88 111 -89
4916 -89 -125 63 43 141 189 -170 -16 -109 -24 239 20 -182 -50 -247 4 -20 16 -248 33 -290 -118 126 -97
4939 -97 14 258 4 -58 -40 -133 -99 -39 120 -60 47 97 -101 -33 -94 86 98 -223 38 109 -222 83 -110 -5
4963 -5 -70 74 98 -114 -34 174 250 -73 -37 -188 -181 -381 -65 63 103 140 26 141 67 74 -64 197 157 -21 -129
4988 -129 -168 190 -159 106 -34 -3 86 -37 119 178 -65 173 80 -107 113 -97 -40 179 -35 167 -254 76
5010 76 -249 -193 197 -104 -167 -26 -308 160 -82 5 -80 -155 57 262 -65 44 67 89 -129 -197 27 -48 -159
5033 -159 -91 -354 -15 15 -95 134 -85 155 -108 -35 -9 -292 62 -31 202 -2 103 187 152 165 -15 -129 -70
5056 -70 191 83 49 209 63 -153 -47 16 -98 206 277 129 233 -51 166 75 -31 221 6 -262 194 186
5078 186 -18 -90 105 -90 -121 239 22 -87 41 -3 94 68 67 8 -94 92 -46 66 -65 -117 45 69 127 340
5102 340 -16 -236 -50 -78 -167 30 72 114 -23 119 -147 -261 -67 106 140 320 -74 -152 -73 -109 -80 -56 109
5125 109 18 6 -38 -110 -157 -205 -7 175 246 47 -145 212 -124 114 -54 -215 181 117 127 -34 -136 -72 -18 223
5149 223 68 -198 -397 -39 -83 188 27 -26 -203 223 68 -120 -19 -165 119 -54 -2 -147 -10 -334 -71
5170 -71 132 73 -55 49 161 83 -58 -111 396 -174 28 -142 -101 -67 162 96 222 -8 -136 -28 106 190 98
5193 98 -152 29 406 -268 36 -287 165 80 188 -42 133 -41 66 142 8 25 122 57 -71 151 175 0
5215 0 -16 178 -335 70 -143 -235 -7 -41 -81 -30 -288 -164 -110 -3 -94 124 -7 -100 -213 250 32 129 -73 -110
5239 -110 68 84 -115 -7 53 -244 54 102 52 17 19 -80 -324 52 -55 -18 75 53 -56 -71 120 -204 176 117
5263 117 -37 -59 10 -240 147 54 110 24 99 75 114 149 -174 -14 121 -290 -37 -172 -35 165 2 42 -66
5286 -66 119 33 247 -52 268 -128 -9 174 52 -90 204 -158 -45 53 34 -25 36 -204 92 -96 87 147
5308 147 16 120 -25 -92 -160 21 124 -106 -6 33 -126 -101 -191 173 -222 -102 154 244 -114 -82 16 46 -101
5331 -101 177 -10 -221 -58 -208 71 -6 12 56 8 -124 -156 90 48 -263 -195 302 68 -117 -72 324 201 -114
5354 -114 97 219 190 102 108 -59 -205 -189 19 33 -24 -83 -97 25 15 71 121 22 -78 10 28 -22 -236 -162 -19 3
5380 3 77 -147 -117 73 73 -183 -50 100 109 169 62 171 -62 -259 186 53 -163 -90 113 -236 192 -101 -129 92
5404 92 -3 262 150 -94 174 -8 277 -111 -248 72 -87 -255 -14 -215 -1 -22 -7 -244 -192 -314 -100 53
5426 53 -123 105 -215 125 -184 -150 -95 51 53 -60 167 266 -101 169 178 266 -47 16 236 -280 -60 47 38 163
5450 163 200 202 131 -21 -143 127 77 -251 -167 -18 25 -18 -49 -379 47 -237 7 158 58 170 343 75 2
5473 2 53 -131 -74 37 -108 -3 -368 -117 -64 251 -80 30 68 264 -60 278 87 -28 110 23 102 120 120 38
5497 38 -19 -120 -40 -162 239 -78 177 89 3 -38 82 -91 -248 46 -72 -131 55 -71 207 -98 311 -39
5519 -39 -236 120 281 182 81 25 -68 0 -8 -52 -209 60 -106 -36 -189 -99 -82 70 99 -41 21 97 -140 -178 23
5544 23 33 2 212 -69 138 230 -166 -158 145 -241 -4 -178 35 79 -85 -57 20 -79 -191 138 147 -146 40 -40
5568 -40 -207 -131 -106 164 -14 200 -214 -26 77 -36 178 -175 59 -203 -19 -21 89 -176 -86 151 -102 60
5590 60 -219 106 21 47 39 -171 -95 -266 222 -219 -140 -49 -187 -37 -1 -3 -82 -21 -153 22 63 -168 -57 135 -8
5615 -8 33 -133 -50 73 -158 14 -135 -4 23 -66 -77 -118 146 -66 -43 -190 -83 201 73 115 -51 119 -114
5638 -114 33 -160 96 -51 194 35 -234 55 142 -38 35 34 66 -42 144 -22 92 -17 -58 186 17 220
5660 220 3 55 -63 21 16 43 72 25 346 -325 -100 29 -281 14 124 75 -93 1 129 -38 -192 -304 189
5683 189 -192 43 -63 -60 -2 181 -23 -83 -27 61 190 39 60 -245 16 63 -201 -102 -73 -82 -82 197 212 1 -253
5708 -253 -172 10 -75 -176 145 41 -12 -100 -120 31 23 -120 110 142 -74 -28 -280 67 78 -223 122 58 223 419
5732 419 -65 -144 -2 -141 26 -201 -133 45 -107 -221 40 155 -82 -60 139 -53 80 -73 -76 -79 -201 -131 -212
5755 -212 -125 -91 -198 -111 319 -29 -64 184 -94 -148 121 85 -156 -139 -55 -191 3 -338 -70 -120 222 196 127 177
5779 177 107 -83 48 -133 138 -55 9 -148 -130 -277 -153 8 84 163 136 -6 -123 -426 106 -12 -76 151
5801 151 -161 70 -122 -51 90 37 -190 -17 102 -99 -93 -120 -194 -3 -39 47 -46 -161 -142 15 -66 130 288 52
5825 52 53 -39 -96 -69 -289 -90 76 -6 76 160 -227 -199 111 18 -4 -406 1 85 -42 -149 -42 -87 154 77 -152
5850 -152 -106 -70 62 -144 -87 -110 -246 -135 14 -141 243 -397 -108 131 -190 15 15 -19 116 -2 -52 56 123
5873 123 62 41 87 -167 54 132 182 -34 53 129 -234 239 -22 112 -73 -75 90 142 -19 74 -43 -30 44 95 42
5898 42 -18 -60 -45 49 90 100 316 137 -45 5 356 142 -163 -134 -48 -205 250 -36 7 -60 -13 263 87 -68
5922 -68 -105 51 115 139 -176 -27 9 60 30 208 -302 -295 -178 -74 -34 99 -108 -37 156 -23 339 175 -244 37
5946 37 100 111 87 -101 316 195 -15 95 -86 -51 3 -116 -208 -111 -159 -18 235 130 30 194 -3 88 -141
5969 -141 -184 69 -48 122 27 74 4 -27 5 78 11 -194 -211 -22 4 93 -30 -35 -58 101 -251 -123 153 -16 131
5994 131 23 249 23 93 -57 29 -27 26 -33 160 -144 -73 61 27 136 175 -99 -203 -334 214 -3 11 -195
6017 -195 18 14 -118 202 325 -42 88 -20 66 47 -98 2 -67 8 79 -131 -44 -91 14 32 -43 78 107 16
6041 16 155 -12 -80 83 54 -55 181 -45 116 69 82 69 9 -192 21 97 42 40 -168 7 -79 -55 53 -292
6065 -292 -263 293 79 57 115 25 -22 164 93 84 38 78 -35 114 90 3 49 -350 -43 -162 -20 -374 -44 117
6089 117 -226 -56 -103 -264 105 25 5 18 77 -97 19 117 -26 94 -116 -371 33 -61 334 143 -94 189
6111 189 102 114 -161 -78 77 117 -13 -2 258 -181 -162 26 240 -101 6 107 -74 147 -50 24 -78 -92 110
6134 110 -290 -101 65 -84 -57 -148 -19 -77 185 89 -48 148 67 157 -93 -84 -80 139 124 -13 -212 -72 -37 -25
6158 -25 -64 148 -18 63 67 161 53 -167 57 -59 -202 165 -195 165 7 84 192 5 -10 -239 -7 -217 183
6181 183 20 -291 -161 -13 58 264 189 -5 -342 -45 -94 -116 -138 15 86 -62 109 111 159 -30 137 -47 83
6204 83 -15 -124 144 254 169 196 -109 -296 202 89 85 -56 -62 41 103 45 -38 -98 -48 -81 -36 112 229 -10 123
6229 123 -12 130 179 -176 -236 5 141 94 229 2 -119 -85 -335 157 13 -18 8 -172 58 112 62 -115 120
6252 120 -28 -125 69 -78 -264 29 -63 369 -42 -152 -126 -72 67 -60 -31 -92 138 -21 23 23 -40 -20 66 -216
6276 -216 -66 171 25 226 -105 -109 56 104 -106 182 -107 6 -104 261 199 -2 87 -87 95 47 -4 266
6298 266 124 -85 -121 129 134 36 -75 -44 -304 46 -125 202 143 -268 -129 -28 0 119 -80 181 24 200
6320 200 -147 181 122 260 39 6 241 139 82 -181 41 -65 277 -89 168 89 105 40 -68 -106 87 -81
6342 -81 26 -165 170 -95 17 -24 102 60 -117 151 15 30 -381 233 -65 292 24 49 -47 -231 20 153
6364 153 -68 83 -92 -36 165 53 -210 -141 102 103 -153 -198 -26 10 171 -28 238 -13 -181 196 -14 -17 174
6387 174 -98 -25 158 -212 -314 35 -326 -161 -187 56 25 -152 170 -93 159 83 186 148 205 -69 198 -115
6409 -115 53 -58 -126 -68 220 76 284 0 -77 -190 -123 78 -9 11 100 58 -18 -4 -206 175 -28 -32 -212 -140
6433 -140 37 -102 2 55 39 243 56 -138 -72 109 163 108 422 31 -304 -1 -80 100 14 -296 -52 55
6455 55 175 354 92 -133 22 162 -192 56 -53 9 100 78 -15 -245 115 -212 -124 -115 -4 184 178 288 -13
6478 -13 189 41 -59 94 83 -98 47 -202 10 161 125 51 64 73 -104 -36 -45 -87 -80 14 -135 220 -33 37 -200
6503 -200 271 92 58 -201 26 135 -20 -127 87 -283 -37 62 22 61 -36 90 144 132 0 52 74 -74 61
6526 61 137 -150 -47 -31 -150 -27 212 170 220 -205 -229 -221 -22 -144 230 35 125 -143 -14 -4 -409 107 206 45
6550 45 -59 180 173 150 -177 86 160 -390 -15 -56 -21 74 -48 34 -28 -95 15 71 -130 135 -67 111 -194 -64
6574 -64 81 143 -92 -19 -39 -99 -15 209 109 -141 18 193 -33 229 105 31 -41 106 90 -164 87 60 81 -10
6598 -10 -25 16 -194 244 -31 -178 -37 58 81 -49 -80 270 87 -95 -120 -103 -47 -126 22 155 99 81 99 108 -59
6623 -59 119 -12 164 -212 53 -66 6 -19 120 96 27 122 20 -54 174 54 -118 85 -186 29 143 50 -14
6646 -14 216 -50 -93 -24 -85 -22 48 -13 146 126 -40 -24 -164 -138 137 82 -46 337 103 76 -3 113 -289 214
6670 214 130 -38 167 15 113 44 71 86 143 -194 -90 -190 -98 -67 145 139 110 -68 258 186 -360 112 83 12 -89
6695 -89 -90 184 -12 83 0 56 295 149 185 325 23 -18 -98 -256 99 -94 -191 -90 -87 -104 53 -214 234 204 -61
6720 -61 114 112 -14 153 132 203 -67 59 -216 -166 145 87 -11 -37 100 186 233 -174 172 -164 132 370 -42 -79
6744 -79 51 42 -113 -150 -83 -193 150 270 125 33 -104 -32 88 -26 11 174 -213 -20 -20 144 186 94 265 23
6768 23 38 284 162 123 -166 -223 142 -59 -164 -227 -207 -52 137 -3 97 25 56 276 51 -70 -85 24 58
6791 58 24 41 45 -124 169 133 -250 56 -75 -73 -99 279 114 123 12 -91 108 -111 -18 220 -9 -105 17 90 158
6816 158 -88 128 45 168 -54 14 -251 -96 139 -63 -100 31 -96 -3 -27 -39 27 -126 -212 -103 291 81 -38
6839 -38 -79 116 45 34 214 113 -99 -40 32 -53 -225 -102 188 167 -310 80 -96 -149 -51 -44 -211 7 -99 14
6863 14 36 -73 -70 -154 -144 81 56 -23 -32 -74 3 99 -30 60 1 12 173 -164 22 -234 124 18 1 213 -55 76
6889 76 127 365 86 122 -127 194 -177 95 -284 47 10 35 20 -315 -173 107 154 -44 -114 -136 -33 -171 33
6912 33 47 42 -18 140 -70 -36 39 -93 35 244 236 -110 34 -51 -78 -23 55 -216 14 -55 34 66 -18 79 11 -111
6938 -111 -351 -36 34 -47 233 -11 196 167 120 89 -65 -142 297 -147 127 104 -4 -18 268 -34 -74 54 -13
6961 -13 -201 66 -199 -35 27 44 140 -113 166 -212 206 -140 65 84 -92 -201 68 -179 -184 259 -18 -27 -9
6984 -9 -94 283 107 71 -45 284 81 148 232 -31 -64 -132 170 16 -204 -167 137 -82 -49 -93 43 -36 -71 61
7008 61 168 -218 -73 218 -34 125 -17 -97 111 -130 135 -103 24 32 -85 32 114 112 246 34 -49 12 134
7031 134 -205 -358 -31 -336 -129 247 -27 84 98 60 85 32 253 -129 -143 -142 -65 76 -150 -176 146 -103 -108 -83
7055 -83 -181 -13 73 91 20 -158 -2 100 -58 -63 91 -39 -148 2 -169 -217 -78 120 -60 -24 -90 9 -137 148
7079 148 -61 174 -45 -179 29 1 -44 9 -196 -198 151 -116 115 -264 -181 -55 64 -96 -129 -243 -486 84
7101 84 186 150 -167 41 41 -47 -37 -26 -69 -180 226 -125 -285 104 -234 -22 -122 53 17 30 -83 -113 -46 -114
7125 -114 8 -188 -72 33 -179 -171 198 59 108 -26 -80 -40 -91 84 370 -54 132 218 -115 105 -91 -81 110
7148 110 72 73 -123 -41 136 -200 48 14 126 -147 -139 50 18 -43 -330 120 -53 221 92 10 157 -147 115
7171 115 -94 16 81 -62 37 325 -105 -64 146 -156 237 -8 -14 82 272 -17 106 109 -8 166 -97 -189 -93
7194 -93 18 123 54 -40 141 148 -180 -30 79 188 146 -127 72 -73 -142 127 -189 81 43 198 -364 -90 -42
7217 -42 -232 -121 -46 175 57 132 57 -120 240 28 50 -17 52 5 -77 -50 -194 -49 -115 -145 -57 -21 -131 -183 -171
7242 -171 71 -142 -74 123 -163 76 220 73 -121 -67 -34 -41 90 -16 88 -85 -23 18 23 42 92 65 126 -386
7266 -386 189 86 -28 418 5 113 -142 -165 -28 -87 -179 -7 227 49 211 -137 -138 -71 82 75 -54 143 106
7289 106 2 -92 -8 -153 -35 -7 -61 58 -176 -134 113 74 -84 51 -217 -42 227 49 110 188 164 93 -89
7312 -89 21 36 15 9 -24 -62 73 90 -166 24 210 25 -3 -17 243 -64 94 31 183 -180 -60 -89 4 100 -159
7337 -159 133 1 -60 -299 -178 59 279 118 -65 -29 259 56 -13 89 -209 -35 97 111 226 -8 189
7358 189 -30 -4 -99 -144 44 -222 102 253 -173 -85 -147 4 -120 -9 20 85 -240 68 178 -9 -77 48 -183
7381 -183 -103 176 77 206 167 50 -5 -180 86 -80 62 186 -27 263 123 -69 111 -5 18 -70 46 16
7403 16 -276 -239 51 -165 194 60 -248 -183 187 24 38 -52 109 -64 120 -81 136 -130 18 -98 -97 21
7425 21 -165 -142 87 16 145 160 -142 -64 94 -95 213 -84 -155 -89 -63 -73 74 -30 30 -221 -335 193 205 107
7449 107 128 -219 -29 227 125 48 13 -77 -91 153 -95 -4 -129 188 -80 90 -104 123 182 1 -80 -259 172
7472 172 -272 -125 45 114 -78 22 -160 -10 89 -229 -161 -151 48 -81 -56 -228 40 109 -10 -55 -16 31 38 -61
7496 -61 -112 -102 -56 207 117 120 44 -270 2 15 312 112 258 -31 -20 142 -1 -45 -107 -456 -143 -1 311 -70
7520 -70 126 199 -113 -252 -105 -11 -77 -54 43 -21 -74 193 128 94 -120 44 147 82 55 65 -13 -209 194 -27 -191
7545 -191 9 -48 -173 -124 -155 13 -64 216 -113 32 121 106 -58 49 75 49 85 346 -89 270 -44 -186 187
7568 187 119 175 170 63 47 253 18 161 148 -82 57 39 -133 -121 -232 -207 -292 -167 -135 -127 154 -15 187 25
7592 25 -17 -188 51 66 28 15 -33 144 -86 150 132 26 -183 74 -261 208 73 117 25 -83 -76 -1 -40 97
7616 97 12 186 -227 -110 109 234 -4 -14 -135 30 21 200 -109 19 90 225 -84 147 98 -286 56 8 22
7639 22 -133 101 68 193 101 -22 31 51 -67 -184 97 214 44 122 -48 -259 -115 -167 -71 26 -128 -134 -50 -108
7663 -108 -59 -157 180 185 32 264 -231 -234 73 -360 -81 -91 162 -26 -30 -70 -350 130 -95 -128 -276 3 -68 -41
7687 -41 44 81 -46 138 -79 179 269 -142 38 -111 -183 75 142 -336 -200 -32 104 55 -111 -160 -60 -134 -45
7710 -45 11 -15 -101 -221 -11 -42 -409 304 9 196 -114 -123 82 53 -79 -70 2 -90 21 -292 94 -89 -126 54
7734 54 184 -30 243 31 238 91 5 -68 73 -27 -260 274 1 -106 -281 69 -182 -137 121 136 -36 -50
7756 -50 143 162 -105 -216 55 105 94 8 -91 141 -41 196 86 113 -21 -29 27 -220 29 2 63 92 89 -50 -182
7781 -182 -37 11 -183 -49 -29 77 -260 23 198 -15 -61 61 -300 64 42 -29 -117 -2 -124 -190 189 1
7803 1 19 -135 -92 27 117 26 129 -59 -79 94 127 119 33 -41 85 -26 -49 -239 89 222 -236 -196 -54 43 20
7828 20 41 189 -72 -279 112 -208 -136 -1 -79 -137 -149 175 -143 -134 -108 -192 51 -70 -95 -10 9 5 136 128 3 24
7854 24 31 -204 29 208 -49 49 -299 -12 115 -174 100 92 153 -295 122 16 -79 110 -97 36 24 -105 143
7877 143 16 -13 0 -203 -21 -124 48 35 135 -18 -120 72 -143 -149 -37 -75 57 71 -61 -81 4 417 -194
7900 -194 114 258 -13 19 -38 265 -35 -141 -245 13 -187 61 16 106 -96 292 66 -171 141 -230 -197 53
7922 53 -244 16 -42 -127 112 86 -78 -48 18 -18 205 -60 -295 45 -244 330 100 157 -233 -155 27 63 109 377
7946 377 -18 76 171 84 266 9 -120 64 -28 41 39 -42 7 -60 42 11 57 -141 133 52 -142 -101 -36 -128 -178 -67
7972 -67 75 61 -264 -118 123 -203 96 52 -69 49 -109 38 -137 105 42 44 -93 -41 -165 -182 159 166 -1
7995 -1 -95 -19 9 79 -248 15 -42 96 -125 213 28 27 -263 132 5 -4 -252 -316 78 -58 -52 107 -408 88 -121
8020 -121 -198 109 -30 53 168 278 9 -101 -32 214 3 108 178 184 161 -224 45 -123 53 -76 104 -133
8042 -133 49 -33 -55 11 32 244 145 -162 133 322 -137 -28 111 127 4 -149 56 -48 111 61 10 343 158
8065 158 -54 -35 22 82 -134 1 34 -240 236 116 -150 32 62 41 87 144 -115 -216 94 11 41 -122 -67 -104
8089 -104 193 -161 143 -275 113 35 269 -72 149 -92 88 38 -59 37 -99 -43 -174 -58 104 181 123 -102
8111 -102 -11 13 -18 56 141 80 76 -119 -66 40 -76 66 -28 -106 28 177 -236 -204 18 114 147 266 112 5 47
8136 47 -4 -201 -91 -67 -188 116 72 126 101 156 -38 -279 -122 22 -207 -22 73 5 -22 -340 127 157 157 124 -43
8161 -43 43 -181 -182 64 5 -354 163 126 -101 -59 -98 27 73 82 117 -112 79 -330 -24 99 25 43 -112 86 109
8186 109 228 151 31 31 -79
8191g9
$$ Imaginary data points
##PAGE= N=2
##DATA TABLE= (X++(I..I)), XYDATA
0 0 0 0 0 0 0 0 0 -7 7 -7 7 -13 14 -14 21 -21 28 -35 42 -49 56 -64 77 -87 100 -114 131 -148 169 -190 215
31 215 -241 270 -303 337 -377 420 -464 515 -572 634 -702 775 -859 952 -1056 1173 -1305 1458
49 1458 -1637 1846 -2097 2403 -2787 3291 -3973 4963 -6538 9432 -16552 71282 50556 -111989
63 -111989 -79650 -7708 80609 60664 -52365 -120835 -41429 58994 96324 31935 -52819 -58330
75 -58330 18861 70161 48810 -36551 -85544 -37992 36908 47674 7803 -40558 -39970 20805 62575
88 62575 30704 -20195 -42101 -21054 23009 32000 -9468 -40224 -25367 13740 37515 21666
100 21666 -15143 -24920 88 25477 19426 -11419 -30731 -17000 10016 21379 6520 -16011
112 -16011 -16198 7969 23563 13614 -8569 -20046 -9324 10657 14192 -3585 -17157 -10759 7358
125 7358 17910 9444 -7895 -12901 -933 11813 8908 -5223 -14985 -8623 6228 12664 3632 -8216
139 -8216 -8128 2995 11599 7378 -5039 -11512 -5075 5942 8093 -664 -8131 -5811 3596 9913 5542
154 5542 -4353 -7882 -1336 5980 5009 -2264 -7797 -4809 3398 7194 2392 -4147 -4718 805 5875 4171
170 4171 -2585 -6376 -3232 2852 4741 -35 -4430 -3238 1560 5487 3426 -2591 -4709 -1345 2944
185 2944 2890 -1079 -4456 -2928 1850 4213 1793 -2181 -3098 213 3322 2547 -1460 -3674 -2187 1529
201 1529 2862 404 -2303 -2383 672 3327 1755 -1394 -2714 -1034 1355 2045 -172 -2639 -2003 585
217 585 2729 1232 -1119 -1958 -524 1712 1594 -419 -1946 -1606 833 1793 607 -1062 -1490 115 1459
234 1459 1088 -398 -1534 -988 728 1485 234 -844 -845 251 1093 682 -332 -957 -257 905 548 -92
252 -92 -1124 -693 281 699 219 -675 -649 197 586 331 -260 -536 -302 454 500 -71 -570 -682 324 756 396
273 396 2 -805 -336 245 536 -290 -543 -142 239 322 259 -241 -328 108 535 8 -132 -267 -238 311 442 40
295 40 -496 -396 354 723 112 -298 -435 -81 283 275 166 -194 -313 178 350 113 -227 -121 77 376 59
316 59 -76 -334 -156 154 318 11 -283 -150 80 173 32 -339 -403 -54 76 264 -26 -82 -131 197 140 4
338 4 -227 37 -115 161 58 -338 -213 156 -35 54 110 -430 226 73 2 39 -54 -207 27 590 333 -43 50
361 50 -9 76 43 -130 -34 -87 62 184 -136 -289 -104 -226 128 263 -45 32 -112 99 82 -282 -154 100 -27
384 -27 124 14 -205 -337 -179 420 6 27 -254 -182 70 176 204 -174 -17 109 -22 -29 -255 79 -66 143
406 143 204 85 -226 54 362 43 128 214 -9 -73 -187 158 -119 -188 56 39 56 122 73 19 -39 265 270 -441 -129
431 -129 131 212 376 106 -44 -73 -217 -160 83 -33 -262 -56 293 -199 53 16 84 202 210 -293 -78 -37 63
454 63 104 14 74 -86 201 65 335 28 84 -10 31 -48 94 77 137 114 201 20 20 -169 172 -14 21 295 8
479 8 153 -64 145 -17 29 12 319 -21 -19 -44 41 -112 158 372 174 5 54 134 -29 280 216 -18 -14 80 377
504 377 320 -15 -258 -47 -36 151 73 -178 102 -163 61 167 -302 -41 36 86 -202 38 -273 -166 4 -194
526 -194 21 131 40 193 -68 192 168 -162 -93 -289 88 -30 -146 180 -123 -71 -164 -55 -153 -26 221 2
548 2 -17 79 -316 22 93 -99 46 18 89 306 201 119 -162 -158 180 -114 -137 -76 -6 104 -41 -130 272 189 -118
573 -118 -69 27 -105 54 -60 196 180 81 -248 160 42 -171 117 -223 -177 116 -73 161 -87 238 105 -117
595 -117 106 -216 -27 -22 118 -196 -67 -219 -58 -6 149 -38 80 108 -177 158 218 -188 -54 140 -22 104
617 104 123 20 -319 -14 65 74 239 -84 41 86 -47 180 62 -50 -41 124 -152 -207 48 199 -167 -39 254
640 254 -97 -111 -98 -26 77 -43 -92 -145 -39 -89 59 136 -60 -24 -72 72 132 -95 -94 -142 16 1 63 -92 -22 -165
666 -165 10 16 -31 -153 86 -337 0 332 4 -36 25 2 -30 -133 -90 -160 70 -197 66 -19 -330 17 -83 54
690 54 -32 -44 -182 -139 27 49 57 49 -42 77 -56 -263 286 96 -32 49 -172 283 -63 86 19 168 269 82
714 82 -39 -3 -108 -77 270 -4 -35 -29 55 11 -17 213 88 78 -137 -30 -56 114 79 49 -198 117 231 -44 152
739 152 -116 -129 -102 -6 37 -58 -30 -105 151 286 -35 -99 117 -17 199 68 -156 -26 -307 -55 -113 182 164 -252
763 -252 -23 -135 59 -117 38 149 -104 -356 -202 89 -7 -151 -215 -13 1 21 28 116 241 144 10 -138 -91
786 -91 127 -179 -126 -16 -202 -65 152 99 225 -119 -41 5 -110 -1 -56 159 -51 31 -65 117 -160 166 37
809 37 -90 9 246 96 148 -171 -155 48 0 79 190 63 152 216 -42 -68 75 -196 -18 103 176 55 -351 168
833 168 221 -193 156 228 -128 -255 -58 -229 9 -112 68 -52 147 -40 -26 -181 120 55 -177 64 142 59
855 59 -95 -68 125 -68 127 194 65 64 55 199 13 -136 36 -292 20 12 -149 -161 135 -80 -56 -221 -101 -26
879 -26 -181 -49 -130 294 140 -155 27 240 -342 -124 100 103 -4 87 -11 133 170 -33 -178 -49 -228 91 -114
902 -114 82 11 -157 -55 41 -82 -49 31 18 -85 72 53 -249 -43 -105 208 -141 222 136 -143 -37 49 -24 29
926 29 205 -42 -121 160 224 -132 -190 -95 46 -100 23 -54 94 -139 20 221 -38 256 65 38 -109 -146 18
949 18 231 -112 39 110 -28 -221 47 149 -99 0 -124 106 131 76 73 -229 179 -185 -53 156 235 -39 165
972 165 299 90 -50 -30 166 129 196 32 2 -153 -42 236 -187 -49 60 307 -84 142 -62 42 -133 -95
994 -95 129 107 223 -28 -193 -18 20 -18 -4 12 -311 124 -91 -238 -127 120 43 123 -53 -175 86 82 171 -108
1018 -108 281 115 -4 -89 -170 -188 -227 -145 -82 43 43 175 -40 32 58 119 75 -52 90 -217 -96 43 228 94
1042 94 -267 114 -217 69 11 133 -150 -36 185 56 3 86 -48 -122 -37 30 21 51 63 -62 103 -33 2 26
1066 26 92 -25 107 91 262 40 -90 63 43 -154 -50 201 -12 118 38 -22 66 -117 62 -49 196 232 95
1089 95 -196 -10 -233 80 13 19 -2 -34 -286 30 86 -308 101 6 81 -227 95 -5 206 -164 -148 97 -3
1112 -3 -19 227 -78 -19 -54 -30 121 -166 -180 -173 29 -216 33 -112 162 158 -102 266 -73 38 39 2 122 122 -122
1137 -122 201 17 -267 148 -80 -183 123 -56 -86 41 -217 -57 136 -115 4 -44 -54 96 221 -261 322
1158 322 201 250 65 -132 -5 -77 41 95 -149 -22 76 -97 4 143 -110 -173 7 -143 -309 -108 -39 107
1180 107 117 -271 170 -160 90 111 164 35 7 384 266 -31 -28 -240 161 -57 -200 233 270 249 237 -120 -32
1203 -32 -165 -126 -161 -88 -74 134 156 -25 -19 -51 -171 -212 134 -219 13 -212 -104 -2 108 158 -132 98 64 24
1227 24 -57 241 101 55 -161 -70 228 -360 122 -13 24 147 -76 40 -83 -208 47 -111 -70 62 -24 -25 38
1250 38 84 111 101 -108 -49 47 18 60 -63 -38 -50 211 -255 15 181 -176 -69 -171 6 33 -9 -20 -135 -135 5
1275 5 -17 30 -273 94 -147 -28 225 -373 -117 136 139 98 -95 170 237 84 -156 180 61 3 -69 29 230 -44
1299 -44 159 -93 -81 32 89 -174 -1 -111 -6 -196 71 -39 179 -285 -265 20 -61 -72 3 138 181 -29 -95
1322 -95 49 91 151 27 12 -36 -139 -65 149 78 144 -65 -238 107 -29 -286 -272 137 192 135 -260 -25 -41 52
1346 52 53 18 68 -130 -296 -12 -118 -184 -265 375 242 -102 -39 -76 -55 -45 172 -113 -243 324 113 50 -78 -33
1370 -33 91 -10 -22 138 -156 -135 -68 -23 -132 138 -175 -39 -6 29 5 117 56 22 180 79 269 132 -84
1393 -84 -64 -14 -119 89 -143 67 -37 28 158 35 82 -157 161 278 -152 14 84 58 -131 -149 -74 160 132
1416 132 -88 -207 -187 199 16 6 -260 -24 -11 -169 165 -9 26 171 -59 -49 12 40 52 -45 76 202 65
1439 65 -50 63 32 -338 -38 248 -15 17 -7 166 -145 48 -105 27 62 90 230 25 -49 10 144 17 -180
1462 -180 52 226 57 115 39 207 29 -114 -104 55 78 209 -10 87 -4 -2 51 -1 62 -444 189 -130 -78 -159
1486 -159 237 -167 -175 -47 -57 8 97 83 -111 -25 -145 -74 -254 119 -36 251 -171 88 128 237 180 117 -24 14
1510 14 340 -35 50 -289 158 -51 -92 -226 -264 42 33 106 -17 -73 87 89 100 -93 -194 -8 -57 -23 -114 30 50
1535 50 -72 -58 -106 -51 69 -147 7 43 121 16 228 41 100 136 -39 -114 -111 85 103 -110 -41 109 -113 -51 77
1560 77 -64 184 281 139 90 83 -152 39 -82 55 -79 -16 -23 -149 275 -27 17 187 -152 77 69 -187 -44 -8
1584 -8 53 46 -142 -90 22 -62 91 -99 -215 42 51 -119 62 -136 -348 92 59 91 -11 106 -78 -16 -23 -159 231
1609 231 -6 75 166 143 -290 243 158 -124 225 12 -29 140 -150 -112 -97 73 -159 13 -4 142 166 -84 -27
1632 -27 -272 -247 -21 247 110 -214 187 -114 -108 -39 -87 33 -59 37 262 -184 29 73 28 48 -299 33 266 236
1656 236 212 -176 -150 151 -95 -95 -391 -109 42 95 13 -1 -133 2 -66 -261 142 298 48 6 -43 -233 -3
1679 -3 -38 -117 119 76 40 25 15 116 -89 131 133 -6 153 9 174 137 -132 -31 61 205 159 -28 42 160 242
1704 242 -16 -156 2 -70 -88 99 -192 -245 48 81 30 107 -104 -141 -97 78 22 -29 -150 -211 -171 -44 59 -43
1728 -43 177 53 -175 -108 -8 -109 202 -52 -76 83 -146 -80 -48 -139 -103 11 -76 92 212 -80 3 -210 147
1751 147 -74 363 19 -59 67 305 235 -310 175 70 -1 15 150 186 141 -138 111 259 119 63 87 -273 -197
1774 -197 69 17 -249 -66 5 -23 -132 240 119 -84 -45 145 -88 157 116 -91 -244 67 -245 38 118 85
1796 85 81 236 189 149 43 -79 66 -95 -2 -88 88 66 -156 -10 -65 -138 50 276 39 129 124 -181 59 -88
1820 -88 164 215 148 -309 -45 128 50 99 14 -3 76 -101 -47 108 126 -85 93 21 -99 -114 -241 8 -131 -17
1844 -17 -67 110 180 -64 -101 -18 86 19 123 -193 -41 66 -115 17 -304 28 4 -146 35 67 90 -55 149
1867 149 -84 10 7 -95 -20 -43 -195 26 134 13 51 144 -111 85 -84 -185 152 -207 129 95 -250 136 28
1890 28 73 -108 -30 -71 13 -6 68 -263 99 57 -23 263 -100 116 -35 53 -205 108 4 -49 -58 42 68 240 104
1915 104 96 -3 -192 -206 -15 182 39 -89 -313 19 157 60 139 94 -76 130 56 123 -239 -38 141 33 -21
1938 -21 -34 150 -64 224 4 -140 54 98 249 -54 -23 -28 -202 53 -63 -71 -65 -69 -89 48 -117 -28 68 86 87 -67
1964 -67 -193 -164 -12 9 0 277 117 18 -188 -2 153 187 88 -159 -105 -16 240 59 -28 -271 -109 -434 25 -246
1988 -246 209 67 -147 39 62 92 -301 -40 39 -12 -150 145 -45 211 -182 -252 416 63 -218 143 -323 -141
2010 -141 60 -52 -244 -54 78 -95 -97 -81 -113 -197 217 7 159 73 8 125 283 19 -123 -164 -344 -32 58
2033 58 197 14 231 -199 -65 78 -100 202 -101 -256 -340 75 -139 144 -79 -96 -154 66 -292 -41 36 57
2055 57 -75 -160 -133 21 37 -106 -21 -56 -73 -199 33 -104 -25 61 -126 -121 -33 146 -70 -115 -145 -148 97 92 -36 -18
2081 -18 104 119 23 37 190 -240 15 143 -42 -111 -100 -217 -93 -102 -300 193 -218 -134 8 57 -119 -71 -45 -165
2105 -165 -76 116 -222 -200 -149 213 135 247 -93 -5 -69 -107 20 -211 -58 21 -57 -116 -1 65 -75 -126 -61 -27 -34
2130 -34 -153 -100 41 -96 -224 -302 84 61 218 148 -7 53 -89 -81 37 -76 265 -339 -110 70 353 233 79
2153 79 -93 -138 220 45 101 -31 -60 -11 37 -60 46 130 221 -221 88 36 -187 110 160 -35 -330 166 -42 -16
2177 -16 63 -3 -24 -83 -81 -231 101 55 151 -58 120 185 -204 -143 -209 68 -64 -98 32 203 49 -157 -61 -31 -223
2202 -223 404 -34 75 172 -118 28 54 87 80 173 -143 92 120 -14 -77 -451 222 86 31 64 -60 29 32 -69
2226 -69 -125 318 91 -34 -88 -113 -263 8 56 292 66 -28 -68 -22 -10 -129 230 -80 -267 302 335 -5 34 -206
2250 -206 120 -131 118 66 -29 -397 -59 88 -6 87 -38 -25 8 171 -271 -126 -139 -124 -34 -235 -222 -86 -295
2273 -295 -132 90 93 199 -51 7 30 -50 170 -55 130 102 -209 37 115 -80 -41 123 245 -132 -97 307 76
2296 76 7 -173 112 155 119 209 61 -311 -189 -162 233 250 159 -30 55 -252 109 132 156 -80 -125 88 -104 34
2320 34 -105 3 -370 -165 -53 130 211 -102 121 -96 17 -57 -82 57 -101 164 200 -397 -113 4 -78 349
2342 349 77 -139 -200 93 67 -86 166 -171 -337 -90 38 -83 -6 18 -118 94 132 182 10 179 57 -14
2364 -14 -42 -224 155 -58 -124 -86 -101 59 -32 -52 -101 167 114 14 68 -11 -17 -136 10 37 111 30 -133 -59 203 280
2390 280 -26 -193 -41 163 136 61 -81 -43 169 87 -142 105 8 -277 -122 -13 -156 146 176 140 297 -89
2412 -89 224 25 85 -194 -253 1 -163 -66 35 -96 -35 319 -89 5 231 -151 53 -46 202 -149 -36 -84 9
2435 9 239 -5 -139 -56 319 230 78 16 -53 -13 -114 -166 205 -192 60 -90 16 -96 62 134 58 151 131 89
2459 89 -7 151 66 67 197 43 4 -110 122 130 -50 27 -298 11 -91 -14 133 89 72 147 208 66 -27 32 193
2484 193 -123 136 -60 68 23 -111 -18 -79 -41 193 138 -179 -63 56 91 -94 268 11 -180 209 146 -41
2506 -41 90 17 0 -92 134 -28 196 152 120 -116 -195 -59 21 141 96 -89 10 54 65 48 -22 259 -112 178 95
2531 95 -134 18 -106 -331 96 -88 168 -29 -164 42 -9 93 75 -67 -65 -29 29 115 -64 -45 -128 278 130
2554 130 94 37 192 213 327 115 83 -26 -278 235 117 -9 187 -225 -167 198 -95 201 -54 314 295 77
2576 77 -133 71 82 -69 -180 46 -93 294 -167 10 100 58 271 -16 -58 -86 42 -85 -156 -47 105 -284
2598 -284 234 -206 43 406 143 178 201 -82 -15 143 34 146 30 41 95 -127 -50 -165 -129 157 -71 -23 72
2621 72 -40 294 -74 -62 -267 -170 191 -229 -73 -178 22 1 115 -50 -74 34 -120 -60 -75 -89 174 -2 104
2644 104 166 120 -20 -175 48 25 -202 89 -57 -176 102 -16 55 99 32 45 -161 -286 132 200 36 -275 -151
2667 -151 -145 28 -53 -136 -136 -127 -33 53 -145 -79 97 -187 -39 -35 186 -34 -45 -192 188 -101 -154 298 70 8 -6 -79
2693 -79 -138 -159 138 137 -89 282 -117 54 -195 -255 -164 51 -21 -118 -86 -35 165 -60 67 134 -201 130 64 -72
2717 -72 -179 -265 167 221 126 120 65 -32 3 4 35 -157 64 152 -12 151 100 -127 49 -85 258 -74 8 43 53 64
2743 64 80 136 192 8 -13 160 -141 -40 59 234 -151 35 259 32 285 -51 231 -9 134 -318 179 331
2765 331 125 -8 99 37 -52 -142 23 83 -21 107 88 174 -65 220 88 -65 90 206 131 -98 1 -127 -79
2788 -79 -15 91 141 -164 60 -86 74 150 227 -125 159 57 26 -146 77 135 -82 20 -87 -16 133 -53 -138
2811 -138 136 -51 -44 64 149 -64 245 95 34 31 -30 225 -94 -103 81 24 -21 -85 -63 -87 31 151 120 -134 -105
2836 -105 95 -152 -107 72 190 -94 -42 94 -182 -62 20 -57 91 9 -66 107 190 -282 -22 21 134 144 -86
2859 -86 -61 230 228 47 -199 -110 -16 34 -138 -37 -64 -257 -110 23 -119 -275 19 -59 177 -198 72 -75 53
2882 53 173 47 90 -146 132 -114 -86 -151 -6 73 173 18 40 -145 43 202 178 85 59 -221 -101 41 -47
2905 -47 -23 181 -165 42 25 15 -126 25 148 -177 -82 76 16 -108 -29 30 -90 165 74 217 -182 -119 330
2928 330 119 55 21 -38 -60 84 -128 -82 5 169 -90 -153 -44 84 -96 81 -3 -7 114 -293 -76 133 67 -90
2952 -90 -40 220 43 -213 2 16 -27 -37 -344 -146 -133 -308 114 -92 -89 5 142 -114 143 338 319 88 114 -117
2976 -117 214 -278 0 130 -53 34 4 42 119 98 -62 -60 -101 73 80 149 -103 109 -117 -143 168 -133 -185 71
3000 71 120 98 -87 286 37 -69 -87 172 -117 -271 -37 -117 71 -85 -116 -102 -127 -55 -56 141 -174 48 -50 9
3024 9 183 -12 -91 -51 -200 116 236 136 54 46 53 3 -30 115 -110 -19 -100 34 172 -124 113 -11 251 -307
3048 -307 -194 -111 -181 129 -94 -84 -61 -104 -104 126 104 -142 -2 31 20 0 -48 -229 -69 70 236 111 104 -199 158
3073 158 -87 -205 -17 127 -273 60 -191 11 198 -3 -183 -460 -71 216 -17 -113 -54 91 183 141 -46
3094 -46 -21 -88 102 55 -65 237 35 15 -39 -56 27 23 193 132 108 -57 -131 -149 176 256 -92 -68 -92 -156 43 139
3120 139 -153 139 195 29 -368 192 64 -31 154 1 -115 -97 -390 200 173 -98 239 -114 5 30 -6 -24
3142 -24 -1 4 4 -152 3 -233 -92 -80 -123 77 -13 89 146 -6 -95 -129 108 -245 -13 63 67 64 -47 24 69 -25 -176
3169 -176 67 46 263 -71 -96 -42 -90 16 -56 -91 84 -110 104 -85 -19 255 -141 -23 96 -178 5 -46 7
3192 7 -59 -59 65 77 -191 -150 157 58 163 -146 61 63 32 200 -138 -23 163 -60 -61 -5 214 -169 208 -23 3
3217 3 257 15 -220 24 -132 -144 -129 -64 -41 -27 -65 -43 -24 -4 -172 -207 251 19 -274 -156 39 -123 39 90
3241 90 48 27 -12 -16 139 -95 52 -43 116 333 -30 165 -14 58 46 6 -85 -159 -111 138 -140 132 -33 -66 -69
3266 -69 -97 -64 -73 54 176 15 164 8 93 -130 -108 -69 7 -131 -159 -259 -105 -195 236 104 109 -97 -20 8 141
3291 141 141 -39 381 -20 -69 -8 55 -17 -44 -65 -124 12 -54 -50 107 -252 205 -12 -190 76 -181 -44 -28 -7 85
3316 85 -113 107 -185 -237 59 79 -32 -104 65 155 178 -34 -182 55 31 87 139 41 145 53 -63 -3 -38 -78 86
3341 86 -201 19 191 -4 105 31 -151 -207 -100 -37 144 -196 -68 61 2 -72 61 -90 90 -7 -19 -164 -156
3364 -156 384 244 202 -87 56 129 69 252 -94 170 28 27 -62 -319 -50 -43 67 59 -1 -146 419 -76 -48 -15
3388 -15 -31 -202 -102 74 -103 -201 31 152 129 -283 -164 25 -34 -120 -104 165 -8 -92 159 79 198 118 -41
3411 -41 2 262 -236 115 -122 62 14 -12 305 -63 -194 1 -353 214 10 -118 119 95 -113 -34 -55 -34 125
3434 125 -59 30 61 53 -110 -29 146 38 35 -49 307 124 -55 119 -152 166 134 66 -160 262 230 -31 -55 52
3458 52 190 55 81 -185 -33 119 -169 -120 -40 -117 -241 -144 11 -12 174 0 -193 -7 122 -48 -83 29 -319
3481 -319 -243 84 26 26 -171 -19 28 -175 -4 175 161 96 -143 59 19 -14 -28 222 -128 126 -159 44 61 17
3505 17 -65 -321 39 -84 -120 95 -165 -94 197 196 -247 101 -119 -58 -3 126 40 -184 -206 -83 320 4 13 -50
3529 -50 -40 46 145 136 111 95 -49 -149 15 50 48 98 177 -103 43 15 39 257 67 -173 -114 -97 51 -14 -21 206 -74
3556 -74 -40 274 -166 97 50 144 288 -79 -104 -6 -25 -299 31 -284 193 -86 -119 59 -92 -151 21 -23 12 15
3580 15 -196 -78 -58 -253 125 69 -250 -367 -16 -41 138 48 -119 -10 -16 72 80 -227 -65 102 101 46 29 -29 -116
3605 -116 3 -18 54 -309 106 -99 -224 -92 186 -67 -164 137 -71 77 81 -82 34 75 -140 120 -131 144
3627 144 -173 249 179 199 77 -26 -163 79 -174 23 158 135 58 -217 -137 71 95 -119 216 -177 13 65
3649 65 20 -146 -42 92 -66 -39 109 -106 -45 -125 38 2 -44 47 59 126 50 228 186 -7 -155 -133 -105 -22 -74
3674 -74 130 207 -204 -25 85 328 -242 -19 33 166 20 157 128 -191 -7 75 213 -4 -50 -82 186 -93
3696 -93 201 53 77 -61 36 -76 18 46 52 -289 -92 26 -172 -289 -135 30 -118 196 -105 -259 90 109 -145
3719 -145 -358 -101 1 -147 71 -64 152 61 44 82 -91 335 159 -279 129 -40 227 187 -9 143 307
3740 307 52 79 -39 -131 -56 101 150 280 96 276 -140 -1 -122 -23 66 39 -114 140 96 50 -49 28 150 51
3764 51 -53 95 -80 8 3 -361 -44 239 215 -121 -139 -39 -85 -162 82 37 47 -3 89 23 -59 150 106 -8 -195
3789 -195 -86 -74 69 -219 38 -206 46 270 109 -159 -24 261 43 1 324 29 37 -63 127 357 45
3810 45 -145 76 -72 -112 -59 -158 -146 61 150 -23 -227 -247 -40 185 76 125 366 119 79 -195 328 -36 40
3833 40 -76 -9 109 -213 -139 51 332 -177 214 -87 -105 52 -82 -116 159 88 22 -7 -91 264 206 -120 160
3856 160 -48 141 66 -298 85 -164 215 57 30 -369 -43 -41 26 102 242 101 -132 62 -68 -53 96 -63
3878 -63 -71 -30 239 157 -152 27 -82 37 0 5 98 -85 89 12 60 65 -99 -15 -144 -242 -192 37 58 46 212 98
3904 98 33 -4 -111 99 98 13 -298 -147 45 -97 132 -288 -124 131 8 28 -82 66 -73 389 215 -75
3926 -75 -201 -55 -30 -85 23 -193 -154 -63 -51 43 -107 63 -40 -61 -153 -164 132 188 -21 86 92 256 161 -102 44
3951 44 41 221 221 -121 -4 303 -240 -106 -4 -249 172 207 -122 73 62 82 -74 40 11 -246 -4 54 -130
3974 -130 292 -54 -72 -35 -32 -207 -98 48 -226 138 -54 70 96 180 -32 -15 193 -226 42 -123 264 149
3996 149 -24 303 55 164 -250 75 178 -114 -96 150 -77 -166 -73 12 -22 250 367 -51 95 35 183 75
4018 75 62 -100 13 -196 -151 -26 -253 23 -28 -112 -56 -9 90 14 -277 -155 -88 -43 -18 131 176 -42 -152 25
4042 25 254 115 111 81 -84 144 -236 -168 -26 -72 -57 34 -171 205 -38 75 -24 -111 -27 136 108 -105 172 121
4066 121 90 -68 -228 -160 15 -111 -156 -41 43 66 78 -81 -84 -174 53 -164 -91 90 39 -5 117 -130 -52 4 134
4091 134 -165 106 -8 -48 -96 43 -115 -85 -30 99 369 -205 -61 43 -220 1 53 -254 -163 -23 -58 -102 15
4114 15 291 158 -3 113 -104 -207 1 135 24 -109 -160 263 -62 49 -19 58 -187 121 29 171 -80 191
4136 191 17 132 114 -36 -32 -251 -159 -172 -64 124 -96 9 41 -88 102 197 72 -33 78 72 -46 59 89
4159 89 170 33 -152 -53 19 218 -229 -229 183 -77 42 -74 -232 -288 25 -37 -166 305 -141 -88 92 -11 226
4182 226 79 177 -101 -157 -45 -137 -17 -285 -85 -82 173 249 124 -82 -158 -13 -85 20 174 -103 1 -266 86
4205 86 192 -86 24 117 37 43 -16 237 28 -77 -37 76 205 129 -103 -37 57 -5 -117 -108 58 -84 52 184
4229 184 231 -342 111 -3 100 41 41 -37 129 106 -270 -96 222 149 -132 -200 -164 12 -161 328 132 -45 -145
4252 -145 181 43 90 -105 80 159 189 -104 8 -169 -66 161 204 42 161 202 -141 305 85 -73 1 -57
4274 -57 109 -45 49 2 -103 79 71 -99 -103 12 -123 103 -32 80 -34 -151 47 215 11 -36 48 54 -6 -159
4298 -159 -1 21 -114 258 -97 -318 -72 262 -90 -27 18 -46 -137 36 -35 -24 -307 -166 -321 -135 50 -220
4320 -220 17 -126 47 31 310 -31 -72 -16 -67 -180 -38 -72 -325 -86 64 319 153 101 -29 11 245 61
4342 61 83 -165 91 -66 49 134 50 85 -173 -11 -70 -191 0 116 -15 -84 -67 88 16 -324 135 -184 -155
4365 -155 57 130 -141 70 178 -64 -189 12 8 81 54 167 -210 -75 -183 215 0 -146 -35 -3 -75 -90 124
4388 124 203 41 131 -118 24 -16 -89 -241 29 76 203 263 -157 67 -38 -140 9 -30 37 -26 -81 147 104 45
4412 45 45 -172 309 -50 187 47 -66 37 -326 220 -54 -4 102 65 64 3 -77 -35 23 -33 25 -49 -3 -92 71
4437 71 -126 64 -29 -295 -51 -102 -31 -16 264 -17 -247 -47 -113 0 14 -23 235 -119 32 53 -71 12 147
4460 147 -175 -75 -52 -45 133 177 -125 12 197 196 141 15 141 -137 202 -157 -178 108 -206 38 12 135 88
4483 88 -179 101 -299 -293 252 337 233 90 45 -7 42 -139 -108 -3 -13 32 -274 -248 168 -111 -53 -256 -4 -137
4507 -137 113 -373 -12 4 85 52 -388 -231 -15 323 -52 -20 98 230 -153 292 19 -37 -149 92 -84 107
4529 107 -177 -17 70 -40 141 -15 130 141 -131 -1 -280 64 -20 119 -290 31 121 -178 34 277 -333
4550 -333 114 -99 78 48 -20 181 -250 -40 -219 -77 107 -26 28 327 -149 -21 152 -11 -96 -54 -89 -219
4572 -219 -52 129 -96 -31 118 12 36 132 100 152 111 -172 -98 -45 57 -25 -248 125 345 -66 109 58 -77
4595 -77 -110 -259 57 -93 306 -1 -21 186 127 -108 58 359 150 85 41 -204 20 -138 -3 -79 63 142 110
4618 110 -31 154 -117 137 38 -89 -17 91 127 -127 77 34 37 -217 76 -140 169 30 -115 129 5 -23
4640 -23 23 -71 -13 -59 -154 60 48 -106 -193 -140 -210 -79 195 11 -31 82 307 24 117 -64 -8 24 395 35 -41
4665 -41 101 -371 -131 165 -280 -100 206 81 6 146 311 -221 -46 -66 -51 8 -113 130 32 26 -22 118 60
4688 60 -23 -229 -165 171 220 116 -59 -155 67 -220 -30 -207 -266 -131 -136 -284 225 -22 77 125 -286 190 47
4711 47 152 264 -267 -96 -82 -113 98 124 -140 57 76 161 171 -328 24 -50 15 -35 271 -308 -98 9 -186
4734 -186 -5 -131 -233 -56 212 -145 65 42 -229 126 -45 2 272 -180 -211 -151 -198 39 -134 178 22 5
4756 5 -337 -295 -252 33 18 -53 -247 22 -34 -149 -89 -44 -15 64 -62 -113 154 104 60 137 156 73 -132 74 -253 34
4782 34 -67 -270 -107 179 133 121 -72 105 -85 32 77 56 -124 -114 102 82 21 -117 224 -50 2 184 -16
4805 -16 -38 -98 142 -47 -62 -73 -5 107 147 112 -26 124 2 -25 -175 49 159 -43 39 -23 36 -64 -116 -36 -57
4830 -57 74 170 91 -3 -87 96 -51 297 -47 172 -8 -360 155 -33 -137 -251 189 -236 -47 3 -8 2 214
4853 214 43 -15 -316 -143 -141 -150 105 12 -161 115 -218 -175 -181 192 79 -20 8 -48 206 -118 102 33 -262 58
4877 58 -299 -35 165 -20 -59 262 -47 74 -9 69 8 -133 -16 -30 28 -136 -77 -205 -29 289 198 -138 144
4900 144 -154 -40 -71 274 -237 -72 -91 -23 -134 25 -96 158 279 75 -72 202 -20 -141 126 100 116 -45
4922 -45 185 -246 -297 76 -197 -35 -67 -189 -52 260 -40 -215 -37 270 156 84 31 -98 77 -21 -107 -49 239
4945 239 154 2 -55 -79 25 255 -139 133 120 164 111 -65 53 -90 -53 -49 -16 112 -16 -140 39 -112 95
4968 95 -183 -6 8 114 304 37 -134 113 -211 -143 -100 86 -124 100 -7 279 186 1 139 44 113 -117
4990 -117 101 -111 -75 -156 225 125 161 19 -13 147 4 -51 -140 -24 -118 -43 -70 -125 167 -99 14 -75 -62 171
5014 171 -170 121 -79 -246 -252 343 -68 164 -86 -37 165 -176 47 -61 -98 186 -164 -108 -95 53 132 188 98
5037 98 -71 32 -89 -247 6 -141 122 81 -87 -154 49 -113 -131 -16 306 -51 -87 -86 187 -127 -29 -63 -56 -193
5061 -193 -40 -5 25 -185 -184 34 45 4 -119 127 -41 137 303 82 -56 257 156 -219 -118 129 -68 -15
5083 -15 67 3 -164 154 158 163 32 106 238 -185 111 124 184 -100 -252 -103 64 -64 167 13 -46 -37 -25 -185 40
5108 40 -58 46 -99 -139 -104 -103 -107 -28 -83 53 166 -103 -30 257 298 -91 50 69 222 -120 180 164 86 71 -154
5133 -154 57 13 50 -32 -41 5 95 44 -161 151 113 66 177 -126 -92 -92 82 -49 -260 -27 -77 -80 8 -68 193 -8
5159 -8 -2 315 90 229 50 -170 -17 189 84 -95 -63 255 66 -255 66 -70 -281 -1 -78 -72 -162 46 -64
5182 -64 22 77 20 314 -108 248 -12 -60 134 -4 -89 -19 19 127 -3 -233 98 173 226 213 155 46 -172 146
5206 146 -87 132 -163 -31 214 -140 -35 74 -6 304 -73 210 7 -119 -152 -141 85 20 -29 90 -54 -152
5228 -152 115 -265 85 136 131 71 -115 89 -12 85 111 -55 -71 -261 -10 -73 -16 -33 126 316 -67 104 177 54
5252 54 -18 234 -1 -98 52 -242 -38 218 -189 -194 38 75 -4 49 -82 85 -123 5 246 124 -100 -154 265
5275 265 -11 -160 -12 -24 104 -12 -1 50 -239 -167 83 -52 -32 200 -142 -2 -175 316 3 -133 57 -69
5297 -69 -56 -12 88 200 89 -76 45 -219 60 -156 61 11 -76 376 126 -57 110 -203 29 -107 -98 -173 -133
5320 -133 89 77 220 -140 -168 -58 150 -126 -104 -93 39 61 96 246 -27 -51 25 36 -92 -131 -142 -171 -101 54
5344 54 -37 -127 144 151 58 73 47 8 -22 -92 137 172 -56 132 81 80 -137 66 -79 78 158 48 -96 29 111 13
5370 13 -115 60 160 25 166 43 16 -72 -153 -155 59 41 -46 -81 159 266 151 182 -62 -76 71 -25 99 74
5394 74 90 -30 7 71 125 -15 -137 -263 -232 -190 -95 -165 -37 38 107 -98 -85 -314 68 137 24 -157 -57 -119 142
5419 142 92 214 99 -277 -104 -26 396 165 122 -95 -36 134 -124 -259 34 -98 -11 -215 71 5 55 -88
5441 -88 -400 -152 -133 -74 68 -60 -216 -37 76 58 -230 1 56 281 4 -14 -270 76 -20 -296 191 39
5463 39 -45 92 141 -27 146 -17 -91 228 -145 9 -213 -109 162 103 -117 -102 15 -271 57 152 -40 -102 -35
5486 -35 -122 75 230 -120 125 75 -20 -91 29 182 79 99 144 -244 -172 147 2 153 -207 25 -4 -281 -229
5509 -229 77 153 267 47 20 0 -101 -21 -183 5 111 210 86 195 -113 34 -62 -119 -129 -270 355 -262 268
5532 268 6 -75 -358 -53 131 24 4 -102 292 -21 -126 -198 5 -43 330 -225 -114 -150 152 31 -195 -72
5554 -72 -136 185 195 116 -82 44 5 99 -5 286 209 174 132 235 -157 280 142 -20 -108 61 -184 -81 -129 -44
5578 -44 91 137 -104 -52 12 -75 -63 -123 -42 -56 25 119 -56 -116 -131 -338 -144 -29 52 -94 -43 52 -43 167 75 -120
5604 -120 -41 -29 359 -65 -5 -125 56 209 -173 214 156 167 150 -2 -146 55 90 78 35 124 -37 3 161 20
5628 20 -164 -139 -20 -165 -307 16 113 -104 -144 88 11 -18 80 198 -196 -110 219 -97 -5 154 -131 -177 240
5651 240 8 -11 185 88 146 39 -142 238 36 223 17 200 -68 69 -1 -187 10 -104 140 156 -29 29
5673 29 -50 -20 9 25 -140 125 190 112 172 142 155 -150 454 196 178 -11 48 73 33 -136 -45 -29 56 68 -178 6
5699 6 49 -302 -193 -17 -81 -62 -34 -19 217 -79 6 151 -16 57 85 -87 74 -154 74 124 -130 -281 175 -29
5723 -29 -4 41 40 150 33 -121 270 213 -3 165 -188 -1 98 -20 -12 -33 152 90 -54 -40 94 -112 -4 223
5747 223 111 -287 168 114 47 -124 19 -107 -10 98 -326 -60 -57 164 -132 -260 -35 40 -41 -89 -100 59 182
5770 182 -100 -82 95 52 99 -133 148 142 -151 90 44 101 -324 -137 144 24 -44 142 82 29 140 4 -5 -6 -48
5795 -48 51 -391 33 -213 -5 25 81 22 -62 194 35 26 -83 -3 96 -98 -107 -87 -7 -31 -81 313 -152 130 177 -40
5821 -40 239 84 -193 -67 -122 -137 192 11 315 7 -140 -107 -7 17 -71 66 16 53 69 25 -106 -78 -79 91
5845 91 -177 -82 -51 93 -67 -116 -163 126 80 4 221 -1 15 157 11 -147 -336 120 182 -160 -11 -207 -140
5868 -140 -9 142 -166 190 34 -75 59 36 -61 73 59 175 -101 -256 -102 -56 -16 -46 -179 120 154 148 -304
5891 -304 -117 -84 290 -70 137 2 2 54 -22 123 -16 121 29 -72 62 109 -83 -292 -101 102 173 -233 -237
5914 -237 64 -255 -228 -101 109 -35 86 91 -56 -54 -22 -37 143 213 7 -85 -79 -91 285 258 -240 -47 -73 -22 -59
5939 -59 83 -118 -217 -137 78 -172 105 100 -6 -53 47 -146 151 71 25 10 83 195 187 -310 -9 -88 101 -233
5963 -233 -109 15 -14 -104 93 26 4 -40 -164 99 -152 -36 -43 69 -83 -137 -29 71 151 326 168 -542 -208
5986 -208 -3 -100 347 -93 42 140 76 -346 -80 93 96 -61 121 43 84 -31 36 -166 217 60 -205 -96 -22
6009 -22 -29 177 -225 -72 -114 41 -89 -89 -139 69 -102 -62 147 34 18 -132 -59 -22 49 -41 155 -77 211 128 -96
6034 -96 52 247 95 199 -40 125 -22 -105 92 16 -128 43 -153 59 -23 -190 -263 11 115 184 185 271 121
6057 121 10 -56 69 56 -45 -140 -7 -101 37 -199 4 -49 -16 134 -123 37 -196 73 -121 -143 -134 11 -207
6080 -207 81 110 36 95 237 -22 240 -101 78 -89 57 54 107 -25 -116 32 48 -80 114 -171 44 -80 206
6103 206 326 63 -13 165 -126 -221 -10 -201 50 -108 53 376 -35 304 -56 55 -56 -160 -14 21 -140
6124 -140 10 231 -141 75 -167 -41 -219 -63 127 5 -73 -106 -54 -2 -52 218 -45 -121 238 -359 228 -45
6146 -45 -20 213 16 -133 -118 -78 -73 3 -73 -121 -31 191 68 -23 54 -175 47 -107 90 -47 -30 -132 41 131 -44
6171 -44 169 -16 -232 -198 88 270 139 3 -258 189 50 -51 -49 -62 -60 23 57 129 74 78 91 -131 9 -125 -172
6196 -172 -52 33 245 -58 -340 -19 11 -167 -177 -103 95 -387 -37 149 -131 238 -23 239 -145 70 -220
6217 -220 -178 178 68 -41 78 84 21 259 -14 252 32 -191 88 -50 13 116 85 3 -305 -252 -196 95 -53
6240 -53 -144 -35 -47 98 -61 -1 24 45 115 18 -181 96 351 58 -51 6 267 -56 38 -23 28 78 -83 16 16
6265 16 44 121 44 -160 -140 -122 -78 -125 213 67 12 -9 98 26 249 142 -219 -69 -32 -37 -135 -112 62 -80 112
6290 112 -241 155 232 107 -45 -132 238 -188 74 -9 -19 15 -166 -205 -372 -2 -151 16 4 74 230 -176 71
6313 71 19 -28 196 63 -13 -166 126 -45 22 -233 -54 283 -158 101 -152 -10 120 109 -209 -111 188 47
6335 47 122 -119 97 27 135 -14 -279 52 -171 181 4 -270 -129 -8 -114 -89 -42 -112 -135 44 -152 -123 71
6358 71 -76 22 -193 -104 -194 -186 -224 -39 -169 -31 -5 21 -35 34 -170 -10 -9 163 -205 185 14 327 -47 71
6382 71 -67 54 -172 -115 92 5 283 92 64 -127 150 -81 276 199 -203 -361 -284 -114 -58 341 23 -248
6404 -248 -60 -195 101 283 -33 65 16 37 -95 14 97 0 62 284 -3 130 104 91 17 138 -20 -159 269
6427 269 10 131 77 45 -12 -191 137 -97 -182 1 -69 13 -23 -103 -45 48 -61 191 132 194 55 -143 -17 39
6451 39 26 -94 46 -131 126 98 74 -84 58 -201 198 118 182 -219 -203 -128 -21 82 -70 278 166 -23 -146
6474 -146 244 -76 140 92 -184 -74 282 -21 -152 200 -159 95 -77 -16 -53 113 -199 95 60 -252 -217 -65
6496 -65 71 -83 134 114 149 -106 -372 -143 -26 203 17 -169 -109 -19 26 59 79 16 -15 403 26 111 240 107
6520 107 58 119 139 -6 341 156 7 -51 23 -19 -253 -71 52 -54 203 -126 10 76 -223 126 -308 211
6542 211 -170 -13 -2 -51 -247 -98 -9 -76 -62 66 87 -258 -82 -64 90 -15 102 -73 -120 28 -40 85 231
6565 231 -30 239 -13 1 60 34 -114 -186 128 -196 40 -10 73 -293 -23 -5 -501 -13 -76 -261 76 126 -59
6588 -59 19 -124 29 -164 6 63 -298 -41 101 94 -136 16 248 -71 -71 -5 82 169 -56 -97 0 -225 88 17
6612 17 -83 18 -116 -141 172 -90 190 -77 71 -170 27 34 88 114 -48 48 75 -10 64 38 65 -134 -214 65
6636 65 101 16 -260 -55 41 -157 193 35 -113 -29 4 10 -47 38 79 44 -113 136 -122 -278 -172 -95 -25 -70 -59
6661 -59 -233 37 99 43 100 -1 -199 146 287 17 -188 90 -44 9 241 -48 -42 -151 222 -57 213 -117
6683 -117 239 -28 -229 3 50 -55 156 -35 -60 -300 -176 34 -149 225 -45 33 -203 148 -99 54 5
6704 5 15 215 -153 -147 -19 -172 266 107 -50 231 -61 -179 -225 -76 43 186 -73 -59 186 -171 6 -60 -72
6727 -72 196 -111 -78 200 -8 -112 331 156 -19 56 -233 28 -19 -68 -202 -172 222 48 -33 69 72 -61 -47
6750 -47 88 -222 -77 -70 142 96 -82 8 -83 -268 -95 -171 -338 102 -156 151 -147 6 15 -189 35 -166 -147
6773 -147 -118 -127 214 -146 -128 -119 -133 -83 48 30 -118 -188 21 -43 -218 156 -102 173 -22 169 20 -145 -107 163
6797 163 -33 1 -163 -230 0 324 -3 -50 21 198 -93 -161 262 -44 -152 128 1 264 124 -64 -46 -110
6819 -110 12 -44 35 307 105 -167 -14 -152 -7 -275 -114 -65 -88 111 37 -62 258 176 -83 251 96 -100
6841 -100 -54 -179 162 -12 13 125 245 41 -180 -27 -161 -158 -4 172 243 3 -28 -42 63 170 187 -92 -75
6864 -75 -366 -211 145 -187 25 192 -9 185 164 25 75 -124 -125 14 -272 -47 133 -93 86 40 -115 -80
6886 -80 281 -98 -2 -44 -13 -86 271 104 59 102 202 120 -138 -12 102 57 141 116 -24 -4 -80 61 -119 -25 -272
6911 -272 -73 -172 -98 173 86 107 -85 100 224 153 -22 15 92 205 -164 -106 -30 -200 -35 275 -63 -19 28 17
6935 17 -136 105 0 49 266 -165 -82 -42 -152 -103 53 -52 188 -18 -125 -49 97 -93 -208 175 14 177
6957 177 -220 94 160 -30 -213 149 -110 37 -6 -79 223 -6 205 -226 -192 1 0 49 -72 -196 -6 -265
6979 -265 -99 204 146 207 -13 148 -131 -1 131 221 -128 164 121 -34 -88 -23 -72 336 -210 109 107 208 153
7002 153 186 -75 146 58 -3 -79 -60 90 -23 -132 84 -88 -102 -79 76 96 -295 -22 -91 -120 88 89 -7 271
7026 271 -101 -44 71 -176 85 -11 196 8 -187 -23 -165 -22 -138 -20 81 206 -92 -37 52 -16 -75 70
7048 70 161 -56 -24 -129 122 -147 -164 68 55 138 -7 -93 61 -311 -96 292 -104 58 19 29 14 -130 55
7071 55 -128 -240 -143 -140 199 -81 111 8 184 -123 -80 77 -61 -96 -70 48 164 18 -228 -98 -23 216 -228
7094 -228 -161 -354 143 -3 38 225 -25 -205 83 -40 76 -117 -65 -163 20 74 260 -58 -66 62 85 199 -117
7117 -117 142 -101 -22 -75 119 -71 82 68 -59 -73 174 46 78 89 -133 -37 233 109 -298 -46 -98 154 -12
7140 -12 -215 -106 147 -147 -191 229 -136 -33 -78 70 -47 -193 -53 253 172 12 -242 34 -59 -94 58 -120
7162 -120 124 69 230 90 189 -178 -100 49 -102 -96 74 283 -181 -65 375 -150 156 -219 -36 228 -56 -95
7184 -95 -110 63 -58 134 3 -228 130 -27 -37 -237 195 18 107 211 30 -30 -210 6 30 214 -226 -122
7206 -122 -75 32 -186 0 187 -32 180 -115 -57 14 -44 -4 -71 -155 -180 -334 203 -88 116 168 16 -132 103
7229 103 115 42 -75 94 45 25 41 -9 28 220 -87 -47 35 93 204 82 -14 -117 107 -202 -31 285 -76 -171
7253 -171 173 -38 175 123 -304 129 120 37 -9 18 -272 64 98 -25 -104 -108 -111 -121 -105 41 -134 -141 131 -40 -305
7278 -305 57 -180 -111 31 55 -108 43 -39 -23 82 37 0 96 -16 147 -44 -211 220 307 130 125 -134 129
7301 129 52 -41 39 32 21 -62 -107 75 61 -123 50 184 -15 20 45 338 94 -98 154 108 70 105 -148 340 177
7326 177 -50 137 234 32 0 12 93 62 -31 66 68 -37 39 201 45 51 38 -5 11 3 -43 -228 -99 -248 29 109
7352 109 17 140 -172 112 132 79 -232 -29 33 65 -62 -97 109 -53 -63 311 -200 -2 -62 36 405 -30 -204
7375 -204 -119 -69 198 -13 335 -111 -61 -55 -28 195 37 217 26 -111 -249 -55 54 172 -122 118 205 83
7397 83 -123 29 -257 -25 -61 218 -99 160 -269 133 -166 4 52 -182 -176 54 55 102 -41 -10 -150 85 -250
7420 -250 -21 -48 -128 -43 47 1 -224 -74 23 124 -28 32 -51 -36 -128 385 83 -184 -360 -236 -305 128 251 160
7444 160 218 112 -6 257 -98 131 -20 200 76 75 67 28 -23 -88 -361 89 18 92 -59 -33 -12 -159 280 171
7468 171 15 -274 69 40 65 -41 -207 57 -18 153 194 -106 183 80 -193 -152 224 -120 -153 86 -257 228
7490 228 -28 172 -26 -152 -154 241 -95 12 112 -29 -7 -306 -193 -89 -125 71 -30 -145 208 -117 -181 212
7512 212 -57 77 -285 -134 -111 68 38 -41 241 -158 -55 -94 -77 -15 132 42 -70 -48 -66 325 -32 -190 269
7535 269 204 -101 55 80 -70 -142 -83 26 -227 -277 119 -150 139 152 107 -56 -301 371 149 -19 68 -44 116
7558 116 -70 -146 -48 97 -152 -230 -121 69 -145 -197 93 14 152 53 63 -104 -151 192 204 -179 -282 79 -214
7581 -214 72 -109 -185 -143 -257 -109 -183 -36 48 -19 -66 -39 -248 281 -21 126 -8 184 -164 -168 -281 -109 102
7604 102 242 -41 -158 165 21 309 -239 -175 -268 61 58 133 -63 -157 -15 -122 -71 200 251 144 39 248 91
7627 91 -36 77 54 61 -227 39 82 123 -73 3 134 2 -120 -194 249 29 -147 -17 -117 -4 -37 -182 204
7650 204 -70 -116 -177 58 -100 244 -106 -72 -23 186 -54 161 32 171 -80 151 166 140 281 -5 44 117 37
7673 37 157 234 370 202 -86 -10 -65 11 -294 151 -6 3 -167 -150 162 -138 -77 87 -50 -50 46 -54 2 14 -284
7698 -284 -11 80 120 108 78 -84 4 42 16 -96 -52 10 71 20 51 142 85 39 -169 32 -139 -134 23 10 58 144 -204
7725 -204 -143 235 77 219 -113 -175 -14 -130 -192 190 -90 152 273 -44 -152 129 258 208 75 -150 -37
7746 -37 -34 -53 18 -77 29 14 -173 -6 -25 9 123 147 -68 82 -93 50 -102 -83 -190 -50 -23 -138 4 -90
7770 -90 210 35 134 -125 -79 303 41 100 -29 120 -244 -20 81 -117 196 -210 -56 24 49 118 65 45 -1
7793 -1 139 -43 -98 -58 -74 -65 -96 -97 103 86 61 -42 -20 100 119 137 -74 -234 -236 -175 267 11 25 -159 -58 363
7819 363 169 -4 -40 151 -38 -43 -50 42 -97 327 28 -96 142 -17 -29 156 102 237 -13 -85 83 -169 -100
7842 -100 -134 118 -7 -247 -81 -62 -24 62 100 63 19 30 9 -44 96 83 -112 184 -39 10 11 -86 150 5 79
7867 79 -100 240 -157 -1 16 221 -314 -80 -203 -228 127 144 -87 67 -22 242 178 -235 -35 -226 118 -68
7889 -68 11 -85 130 239 37 325 -179 289 -140 -79 -96 4 114 -58 14 39 -18 35 -81 27 54 192 -364
7912 -364 41 83 -133 102 -230 22 -35 68 -68 -167 74 3 -31 175 -127 130 -71 9 37 48 0 10 -391
7935 -391 53 67 -84 283 112 109 3 341 1 -45 -353 157 153 -17 -116 -142 277 -124 -196 -222 42 22 -220 -37
7959 -37 15 258 -78 -15 25 64 93 -271 253 -275 256 -35 -126 91 81 305 17 -255 -35 201 144 -36 74
7982 74 334 -68 133 64 34 275 51 -100 172 173 -132 -40 127 -136 106 -12 85 40 -56 -292 -184 -97 2 -98
8006 -98 276 151 -27 -72 -137 -48 91 -145 65 53 13 -151 -17 -57 -34 199 -113 218 215 22 -281 208 -243
8029 -243 121 183 154 22 112 119 271 -53 133 -314 99 76 67 86 -120 47 -225 45 17 72 -254 98 70 -86
8053 -86 -146 236 72 39 94 80 -89 78 91 88 -134 268 194 -98 44 226 59 73 -21 133 24 46 291 16
8077 16 111 89 -153 10 13 -61 -148 80 112 63 161 -21 20 -43 32 89 -134 -15 55 -140 -86 186 -21 140 -36
8102 -36 -175 -99 -79 9 241 -161 -95 120 64 119 -142 -41 95 24 167 391 148 -118 33 248 214 -58 16
8125 16 140 116 -137 23 227 38 72 26 15 -1 -157 151 97 37 -78 105 75 -55 -144 -126 -167 116 44 39 6
8150 6 -85 -103 42 -228 -90 47 -117 178 39 96 -6 -106 -316 73 -5 -57 169 -154 -61 249 -113 184 -56
8173 -56 43 -13 -327 52 5 -54 188 -32 -117 -133 253 95 -108 86 105 52 -114 -124
8191a24
##END NTUPLES=NMR FID
##END=
