##TITLE=1H_DE-57_NaOH
 D2O
 8 sc, 
 25.6.2024
##JCAMPDX= 6.0         $$ Bruker NMR JCAMP-DX V2.0
##DATA TYPE= NMR FID
##DATA CLASS= NTUPLES
##ORIGIN= UXNMR, Bruker Analytische Messtechnik GmbH
##OWNER= root
$$ XWIN-NMR		Version 3.5
$$ Tue Jun 25 16:33:09 2024 Russian Standard Time (UT+4h)  she@DPX200
##.OBSERVE FREQUENCY= 200.1312
##.OBSERVE NUCLEUS= ^1H
##.DELAY= (6, 6)
##.ACQUISITION MODE= SIMULTANEOUS
##.ACQUISITION SCHEME= undefined
##.AVERAGES= 8
##.DIGITISER RES= 18
##SPECTROMETER/DATA SYSTEM= spect
##.PULSE SEQUENCE= zg30
##.SOLVENT NAME= CDCl3
##.SHIFT REFERENCE= (INTERNAL, CDCl3, 0, 15.7039)
##AUDIT TRAIL= $$ (NUMBER, WHEN, WHO, WHERE, WHAT)
$$ ##TITLE= Audit trail, XWIN-NMR		Version 3.5
$$ ##JCAMPDX= 5.01
$$ ##ORIGIN= Bruker BioSpin GmbH
$$ ##OWNER= she
$$ F:/spectra/data/she/nmr/H-F/1/audita.txt
$$ ##AUDIT TRAIL=  $$ (NUMBER, WHEN, WHO, WHERE, WHAT)
(   1,<2024-06-25 16:32:26.43 +0400>,<she>,<DPX200>,
      <created by zg, POWCHK disabled, PULCHK disabled
       configuration hash MD5:
       00 E9 B6 7A A2 85 ED C7 34 08 36 98 17 FE 4E 26
       data hash MD5: 16K
       7D 4A 58 A3 00 5F 76 6A 38 38 CD 07 AD 7B CB 66>)
$$ ##END=
$$ 
$$ hash MD5
$$ 03 72 63 4C C7 94 B0 96 08 24 15 17 DB 56 20 B3
##$RELAX= 
##$RELAX= 
##$RELAX= 
##$RELAX= 
##$RELAX= 
##$RELAX= 
$$ Bruker specific parameters
$$ --------------------------
##$DU= <F:/spectra>
##$EXPNO= 1
##$NAME= <H-F>
##$PROCNO= 1
##$TYPE= <nmr>
##$USER= <she>
##$AMP= (0..31)
100 100 100 100 100 100 100 100 100 100 100 100 100 100 100 100 100 100 
100 100 100 100 100 100 100 100 100 100 100 100 100 100 
##$AQSEQ= 0
##$AQ_mod= 1
##$AUNM= <au_zg>
##$AUTOPOS= <>
##$BF1= 200.13
##$BF2= 200.13
##$BF3= 200.13
##$BF4= 200.13
##$BF5= 200.13
##$BF6= 200.13
##$BF7= 200.13
##$BF8= 200.13
##$BYTORDA= 1
##$CFDGTYP= 0
##$CFRGTYP= 5
##$CHEMSTR= <none>
##$CNST= (0..31)
1 1 145 1 1 1 1 1 1 1 1 1 1 1 1 1 1 1 1 1 1 1 1 1 1 1 1 1 1 1 1 1 
##$CPDPRG= <>
##$CPDPRG1= <>
##$CPDPRG2= <>
##$CPDPRG3= <>
##$CPDPRG4= <mlev>
##$CPDPRG5= <mlev>
##$CPDPRG6= <mlev>
##$CPDPRG7= <mlev>
##$CPDPRG8= <mlev>
##$CPDPRGB= <>
##$CPDPRGT= <>
##$D= (0..31)
0 1.2 0 0 0 0 0 0 0 0.06 0 0.03 0 0 0 0 0.0002 0 0 0 0 0 0 0 0 0 0 0 0 
0 0 0 
##$DATE= 1719318745
##$DBL= (0..7)
120 120 120 120 120 120 120 120 
##$DBP= (0..7)
150 150 150 150 150 150 150 150 
##$DBP07= 0
##$DBPNAM0= <>
##$DBPNAM1= <>
##$DBPNAM2= <>
##$DBPNAM3= <>
##$DBPNAM4= <>
##$DBPNAM5= <>
##$DBPNAM6= <>
##$DBPNAM7= <>
##$DBPOAL= (0..7)
0.5 0.5 0.5 0.5 0.5 0.5 0.5 0.5 
##$DBPOFFS= (0..7)
0 0 0 0 0 0 0 0 
##$DE= 6
##$DECBNUC= <off>
##$DECIM= 32
##$DECNUC= <off>
##$DECSTAT= 4
##$DIGMOD= 1
##$DIGTYP= 9
##$DL= (0..7)
0 120 120 120 120 120 120 120 
##$DP= (0..7)
150 150 150 150 150 150 150 150 
##$DP07= 0
##$DPNAME0= <>
##$DPNAME1= <>
##$DPNAME2= <>
##$DPNAME3= <>
##$DPNAME4= <>
##$DPNAME5= <>
##$DPNAME6= <>
##$DPNAME7= <>
##$DPOAL= (0..7)
0.5 0.5 0.5 0.5 0.5 0.5 0.5 0.5 
##$DPOFFS= (0..7)
0 0 0 0 0 0 0 0 
##$DQDMODE= 0
##$DR= 18
##$DS= 0
##$DSLIST= <SSSSSSSSSSSSSSS>
$$ [...]
##$SUBNAM2= <"">
##$SUBNAM3= <"">
##$SUBNAM4= <"">
##$SUBNAM5= <"">
##$SUBNAM6= <"">
##$SUBNAM7= <"">
##$SUBNAM8= <"">
##$SUBNAM9= <"">
##$SW= 18.0517418723606
##$SWIBOX= (0..15)
0 0 2 0 0 0 0 0 0 0 0 0 0 0 0 0 
##$SW_h= 3612.71676300578
##$TD= 16384
##$TD0= 1
##$TE= 0
##$TE2= 300
##$TE3= 300
##$TEG= 300
##$TL= (0..7)
0 120 120 120 120 120 120 120 
##$TP= (0..7)
150 150 150 150 150 150 150 150 
##$TP07= 0
##$TPNAME0= <>
##$TPNAME1= <>
##$TPNAME2= <>
##$TPNAME3= <>
##$TPNAME4= <>
##$TPNAME5= <>
##$TPNAME6= <>
##$TPNAME7= <>
##$TPOAL= (0..7)
0.5 0.5 0.5 0.5 0.5 0.5 0.5 0.5 
##$TPOFFS= (0..7)
0 0 0 0 0 0 0 0 
##$TUNHIN= 0
##$TUNHOUT= 0
##$TUNXOUT= 0
##$USERA1= <user>
##$USERA2= <user>
##$USERA3= <user>
##$USERA4= <user>
##$USERA5= <user>
##$V9= 5
##$VALIST= <valist>
##$VCLIST= <CCCCCCCCCCCCCCC>
##$VD= 0
##$VDLIST= <DDDDDDDDDDDDDDD>
##$VPLIST= <PPPPPPPPPPPPPPP>
##$VTLIST= <TTTTTTTTTTTTTTT>
##$WBST= 1024
##$WBSW= 4
##$XGAIN= (0..3)
0 0 0 0 
##$XL= 0
##$YL= 0
##$YMAX_a= 122034
##$YMIN_a= -105291
##$ZGOPTNS= <>
##$ZL1= 120
##$ZL2= 120
##$ZL3= 120
##$ZL4= 120
##$ABSF1= 10
##$ABSF2= 0
##$ABSG= 5
##$ABSL= 3
##$ALPHA= 0
##$AQORDER= 0
##$ASSFAC= 0
##$ASSFACI= 0
##$ASSFACX= 0
##$ASSWID= 0
##$AUNMP= <proc_1d>
##$AZFE= 0.1
##$AZFW= 0.1
##$BCFW= 1
##$BC_mod= 2
##$BYTORDP= 1
##$COROFFS= 0
##$CY= 11.3945322036743
##$DATMOD= 1
##$DC= 2
##$DFILT= <>
##$DTYPP= 0
##$F1P= 15.6554695791079
##$F2P= 12.8336369535428
##$FCOR= 0.5
##$FTSIZE= 0
##$FT_mod= 4
##$GAMMA= 1
##$GB= 0.15
##$INTBC= 1
##$INTSCL= 1
##$ISEN= 128
##$LB= 0.24
##$LEV0= 0
##$LPBIN= 0
##$MAXI= 10000
##$MC2= 0
##$MEAN= 0
##$ME_mod= 0
##$MI= 1.114404
##$NCOEF= 0
##$NC_proc= 0
##$NLEV= 6
##$NOISF1= 3.799351
##$NOISF2= 2.8
##$NSP= 1
##$NTH_PI= 0
##$NZP= 0
##$OFFSET= 15.70392
##$PC= 1
##$PHC0= -25322.59
##$PHC1= 9.587481
##$PH_mod= 1
##$PKNL= yes
##$PPARMOD= 0
##$PSCAL= 0
##$PSIGN= 0
##$REVERSE= no
##$SF= 200.130013532006
##$SI= 16384
##$SIGF1= 3
##$SIGF2= 2
##$SINO= 400
##$SIOLD= 16384
##$SREGLST= <1H.CDCl3>
##$SSB= 0
##$STSI= 0
##$STSR= 0
##$SW_p= 3612.71676300578
##$SYMM= 0
##$S_DEV= 0
##$TDeff= 0
##$TDoff= 0
##$TI= <>
##$TILT= no
##$TM1= 0
##$TM2= 0
##$TOPLEV= 0
##$USERP1= <user>
##$USERP2= <user>
##$USERP3= <user>
##$USERP4= <user>
##$USERP5= <user>
##$WDW= 1
##$XDIM= 8192
##$YMAX_p= 0
##$YMIN_p= 0
$$ End of Bruker specific parameters
$$ ---------------------------------
##NTUPLES= NMR FID
##VAR_NAME=  TIME,          FID/REAL,        FID/IMAG
##SYMBOL=    X,             R,               I
##VAR_TYPE=  INDEPENDENT,   DEPENDENT,       DEPENDENT
##VAR_FORM=  AFFN,          ASDF,            ASDF
##VAR_DIM=   8192,          8192,            8192
##UNITS=     SECONDS,       ARBITRARY UNITS, ARBITRARY UNITS
##FACTOR=    0.0002768,     1,               1
##FIRST=     0,             0,               0
##LAST=      2.2672688,     0,               0
##MIN=       0,             -105291,         0
##MAX=       2.2672688,     122034,          0
$$ Real data points
##PAGE= N=1
##DATA TABLE= (X++(R..R)), XYDATA
$$ [...]
1507F56n14o46l17k77KQ5L97M49O63J96M40o7J09o13n02n31m68k31J05K95J42
$$ 656 142 -504 -821 -1098 -1096 -1011 -614 -165 498 694 1134 1067 1176 563 61 -470 -938 -1169 -1064 -769 -627
1528f27M71M64M73J63J65p9m51l22o26m75k21j73K84L54M43M52M17J67L47l92
$$ -627 -156 308 781 944 1109 1030 579 257 -369 -844 -1065 -1238 -954 -600 -157 295 712 879 1226 834
1548H34k63l67l66n83j70j83J43K64N91M68L68K99m4j69m2n31l99o50k73J89J49
$$ 834 571 204 -162 -745 -915 -1098 -955 -691 -100 368 736 1035 991 822 780 249 -150 -800 -1073 -884 -735
1569g35J19K93O06M47J58mK90l99o67j98l89m27J14j41J85M41N97K73J89J42J19
$$ -735 -616 -323 283 730 888 884 1174 775 108 -90 -479 -906 -792 -933 -748 -307 290 563 752 894 1013
1590A013m38l07m42n87j65o2Q6L84L38L82K37N10J22j67j42n56j70n48n03J72
$$ 1013 575 268 -174 -761 -926 -988 -902 -518 -180 202 439 949 1071 904 762 206 36 -512 -1015 -843
1610h43Q2J43K06L41N04K86J97k74pj81m84n00k56n7P4J62K62M30N25K06n3L0
$$ -843 -761 -618 -412 -71 433 719 916 642 635 454 -30 -530 -786 -843 -769 -607 -345 85 610 816 763 793
1632G93q4k21p82j30k21j56L0O7M86N04P3K95P0J47j79l01l54l63m28m6p6K4M05
$$ 793 709 488 -294 -424 -645 -801 -771 -704 -218 286 359 654 724 871 692 391 37 -326 -754 -800 -876 -852 -447
1655d47M42J92L30L23r9J18n00k97l70j11n31r0N73R2M15N9N02K12o2j65j34n16
$$ -447 -5 187 517 840 741 859 359 62 -308 -419 -950 -1040 -467 -375 40 99 601 813 751 586 452 -64
1677f4j0o01k13L35j6K26K53L93L99N6M5Q5l08l02n67k30O3k77P0P5M28M24P9
$$ -64 -74 -675 -888 -553 -569 -343 -90 303 702 758 803 888 580 278 -289 -519 -456 -733 -663 -588 -160 264 343
1700C43L58J1Q4l95k71n52R6k07j74p4J82O29K17J85K02Q5l8j13j91n97j60j90
$$ 343 701 712 796 401 130 -422 -326 -533 -707 -781 -599 30 247 432 634 719 681 568 377 -220 -380 -570
1722e70k88%L60K26M45J89L55J31k05j69k30k51l30k43k40J51K37L24J36L81L31
$$ -570 -858 -858 -498 -272 173 362 717 848 643 474 244 -7 -337 -580 -820 -669 -432 -108 28 409 740
1743G40q2j25m1l65k64l31k33j9K16l7K56L08L70J89j1r9J16k18l24l68j67mj88
$$ 740 658 533 492 127 -137 -468 -701 -720 -504 -541 -285 23 393 582 571 472 588 370 46 -322 -489 -493 -681
1766f81P0L30L21L90o0J41J58p0l99l43j27j99k44J11K47J09J77K56L49j03J36
$$ -681 -611 -281 40 430 370 511 669 599 200 -143 -270 -469 -713 -602 -355 -246 -69 187 536 433 569
1787E69n8k85k54o3m33j30m2K54J77K69J95K29RJ40o2l02k09r3m26j24L0K9K82
$$ 569 511 226 -28 -91 -524 -654 -696 -442 -265 4 199 428 437 577 515 213 4 -89 -515 -639 -609 -580 -298
1810b98J95L77J33K28OJj82j67o07k49Q7J95l02J99M27K31K71jO2r2k22k87j49
$$ -298 -103 274 407 635 641 642 460 293 -314 -563 -476 -281 -583 -384 43 274 545 544 606 514 292 5 -144
1833a44l46n0O8k04K18M54K15J55K9J12oj82j96j82l78j20q1K27Q9L28KL99J7
$$ -144 -490 -540 -472 -676 -458 -4 211 366 395 507 501 319 123 -59 -437 -557 -638 -411 -322 6 8 407 424
1856D24J57j88k16n5j98k01j67o5K23R5J2K15L24O4J99l41J9j00j79l17k06J78
$$ 424 581 393 177 122 -76 -277 -444 -509 -286 -191 -179 36 360 424 623 282 301 201 22 -295 -501 -323
1878c23j14j20M22J38K32K17n6l0o8M5m85l12M1l3J48j01K30J01J81K81M2J03
$$ -323 -437 -557 -135 3 235 452 396 366 298 343 -142 -454 -413 -446 -298 -399 -169 -68 113 394 436 539
1900E39k60q4j97k81n0k74J28J44L52N4R6K16O8J14j25k89r5j67j83l0r2L2K45
$$ 539 279 195 -2 -283 -333 -607 -479 -335 17 71 167 383 451 565 440 151 56 -111 -294 -324 -416 -384 -139
1923a39K64m6L78j6n9L8k11P7l97k61l7J8o1K87L3L84M9J44J0r2j17j39l31j10
$$ -139 125 79 457 441 382 420 209 286 -111 -372 -409 -391 -452 -165 -132 252 301 445 455 363 246 107 -224 -334
1947c34l5p5K01k08M16K81J33Qj26J50k59m8k59j13P5o7j89Q2L91Q1J46J92j28
$$ -334 -369 -444 -243 -451 -35 246 379 387 261 411 152 104 -155 -268 -193 -260 -449 -367 24 105 251 443 315
1970C15J88l64l74K37k96Q5m03L00L1J40L27l8L04j52j02J9j68O8l08k96J71Q
$$ 315 503 139 -235 2 -294 -209 -612 -312 -281 -141 186 148 452 300 198 217 49 117 -191 -487 -316 -308
1992c08O8J71l0L09K34j03q7n5J2k26k60j68L6K77j36R9K14K67O3l9J3J6k61q9
$$ -308 -240 -69 -99 210 444 341 254 199 211 -15 -275 -443 -407 -130 -266 -167 47 314 377 338 351 367 106 17
2016A7k55o0m0J2O4P2K54J34l0K73M3j7l69j94j9k23l1K9J9K67J24m5J58J31O2
$$ 17 -238 -298 -338 -326 -262 -190 64 198 168 441 484 467 98 -96 -115 -338 -369 -340 -321 -54 70 25 183 314 376
2041C76m0k54r0m7k45rJ5Q1J78P6J20J25k8K7P4k40k08J25l30P1j04J13J91l8
$$ 376 336 82 -8 -55 -300 -309 -294 -213 -35 41 161 286 258 285 359 119 -89 36 -294 -223 -327 -214 -23 -61
2065f1L04r5J45n4M3K25m77j60r5n1L3J70k12Q0J49J48P3J76J3j56l34J46j71
$$ -61 243 148 293 239 282 507 30 -130 -225 -276 -243 -73 -285 -205 -56 92 165 341 354 198 -136 10 -161
2088a61o4j21K5j5L75J40k8J05J21r6n3k26q9k03J63j33l2J80p0J32L16M8L4q8
$$ -161 -225 -346 -321 -336 39 179 151 256 377 281 228 2 -87 -290 -127 -260 -292 -112 -182 -50 266 314 348 260
2112B60j36P6j55k04j44q7J47Q8N4K86K8R2o9M7R0k71k67J6r9r0J58j5J72j71
$$ 260 124 200 45 -159 -303 -390 -243 -155 -101 185 213 305 236 283 373 102 -165 -149 -248 -338 -180 -195 -23 -194
2136a94K40P5L18j97M3k85q3n1j96m1J28O7j28K57K09j77J59J08P4j46k22l4j19
$$ -194 46 121 439 242 285 0 -83 -134 -330 -371 -243 -176 -304 -47 162 -15 144 252 326 180 -42 -76 -195
2159a95j5j00%Q2L94m8n3J58K5l7k11o2N9p7l16K02P4j97L64j2N8L43j0j72j26
$$ -195 -210 -310 -310 -228 166 118 65 223 248 211 0 -62 -3 -80 -396 -194 -120 -317 47 35 93 436 426 254 128
2184A28r3k23q5p2J11l5J91oM7K79r1J03O0m05J65q3k17K7J43k49J75K6L23j31
$$ 128 35 -188 -273 -345 -234 -269 -78 -84 -37 242 151 254 314 -91 74 -9 -226 -199 -56 -305 -130 -104 219 88
2208H8O1P3K8j19j62j15K5p1k15K84j60K04J7J5K38J9j02N2o7j89l6j2j18J81
$$ 88 149 222 250 131 -31 -146 -121 -192 -407 -123 -283 -79 -62 -47 191 210 108 160 93 -96 -132 -144 -262 -81
2232h1j20P5r8K16J44J53n9Pq1j49l8k10Q1j57L52p3N3K05l3k9J39j35J03l13
$$ -81 -201 -126 -224 -8 136 289 230 237 156 7 -31 -241 -160 -317 35 -38 15 220 187 158 297 162 265 -48
2256d8j39n4qj36K20O1o9K79L5j96K04m6j00j3M4l9j91Rn9K16k8J06RQ0p3Q9j12
$$ -48 -187 -241 -249 -385 -165 -104 -173 106 141 -55 149 103 3 -10 34 -5 -196 -187 -246 -30 -58 48 57 137 64 153 41
2283D1n5M1o2j11j4J37M0j62K51OK77r4o8j88p9R9l02m6O0J09o5M8J23O8J90N4
$$ 41 -14 27 -35 -146 -160 -23 17 -145 106 112 389 295 227 39 -40 59 -243 -289 -229 -120 -185 -137 -14 54 244 298
2309B98j76l3k13R1k48J21j81L4R1P9J95j22J54j29K33R5l8j90j60OJ5j26pJ54
$$ 298 122 89 -124 -33 -281 -160 -341 -307 -216 -137 58 -64 90 -39 194 289 251 61 -99 -93 -78 -204 -211 -57
2333e7J66O6Q1k32J69j4j81oP5q1n8q7o6K28J61R7k88K96j32O5j79K1j43q2j83
$$ -57 109 175 256 24 193 179 -2 -8 67 -14 -72 -159 -225 3 164 261 -27 269 137 202 23 44 -99 -181 -364
2358c64J94J30q6P3mJ59K03J6j55p1p0P8l53J91j80K50m8j29K35J27j30lK15J07
$$ -364 -170 -40 -126 -53 -57 102 305 321 166 95 25 103 -250 -59 -239 11 -37 -166 69 196 66 63 278 385
2382C85m29K4j57K5K7j60J26K3P6L04k89K85j44q6%q0q2K8%p0J76L7o9K67m3K27
$$ 385 -44 -20 -177 -152 -125 -285 -159 -136 -60 244 -45 240 96 10 10 -70 -152 -124 -124 -194 -18 19 -50 217 174 401
2408D01j58Pj03k16J2j8j38N3J08J61o9K1k9J71k62K12M6j52q5o8R2l39L29j01
$$ 401 243 250 147 -69 -57 -75 -213 -160 -52 109 40 61 32 203 -59 153 199 47 -38 -106 -14 -353 -24 -125
2432a25K58j18O0P3m8j4m1r2k4j58J54J31k72J20M1R1R5j9J08j5k63%j69O6J86
$$ -125 133 15 75 148 100 86 45 -47 -71 -229 -75 56 -216 -96 -55 36 131 112 220 205 -58 -58 -227 -161 25
2457B5j33nJ54q5J24r8K00mo8r4j08O5k40nJ12O2J48m0Q4n6rJ55O5p1j48K8J3
$$ 25 -108 -113 41 -44 80 -18 182 178 110 16 -92 -27 -267 -272 -160 -98 50 10 94 38 29 184 249 178 30 58 71
2484G1k35J25j39J04j3J70k0o5M8P7KJ30k89J1j21L7n4J43jm2K63k45J43K4r7
$$ 71 -164 -39 -178 -74 -87 83 63 -2 46 123 125 255 -34 -23 -144 -107 -161 -18 -19 -61 202 -43 100 124 27
2509B7j39K42j49j31P9j92J0J92J5l1K2K06j03Q6j74K04k18J03j68k5L6j3J51
$$ 27 -112 130 -19 -150 -71 -263 -253 -61 -46 -77 -55 151 48 134 -40 164 -54 49 -119 -144 -108 -121 30
2532C0J46j09O1J7j08j07J27j07k39J76J1J04m8r2J41J94m7n5M9K6j04j6k12m
$$ 30 176 67 128 145 37 -70 57 -50 -289 -113 -102 2 -46 -138 3 197 150 95 144 170 66 50 -162 -166
2556a66J1J98l6J13q8J61k9K8j23k41O1J02m2K84l06j15P2k5K87l24J69O6J16
$$ -166 -155 43 7 120 32 193 164 192 69 -172 -111 -9 -51 233 -73 -188 -116 -141 146 -178 -9 57 173
2579A73j93j4k6L2j89J16L8J00l0J04O8k9R0q9l9j79j5J47k08J09j43N1Q6R1j32
$$ 173 -20 -34 -60 -28 -217 -101 -63 37 7 111 179 150 240 151 112 -67 -82 65 -143 -34 -177 -126 -40 51 -81
2604h1J96L4k4n5m0j75p9K26j03J14r7M9m9N3J06M3Q6j02R2l94Q7j45O2O3qJ6
$$ -81 115 149 125 70 30 -145 -224 2 -101 13 -84 -35 -84 -31 75 118 204 102 194 -200 -113 -258 -196 -133 -141 -125
2630a25J03J29J29j70M3K16k17o5K9k16K6L4j86K56R5m2J75j59K04k49J37j12
$$ -125 -22 107 236 66 109 325 108 43 72 -144 -118 -84 -270 -14 81 39 214 55 259 10 147 35
2652C5j29K7J3j86J93M9J26k8o4J15l0l8k5m6l1l0j16J59J58k14R7n1n3L61j86
$$ 35 -94 -67 -54 -240 -47 2 128 100 36 151 121 83 58 12 -19 -49 -165 -6 152 -62 35 -16 -69 292 106
2677A06P6p3onp7k51mJ81j78K08O6K29l04R8P7q5j46j5L7j12qm1p4K08nK59k9
$$ 106 182 109 103 98 21 -230 -234 -53 -231 -23 43 272 -32 66 143 58 -88 -103 -66 -178 -186 -227 -301 -93 -98 161 132
2704A32p2n2J02j87P8K1k26L17l86L03P1j33J12l8q9J28J5j3j43J97k99j9O7J18
$$ 132 60 8 110 -77 1 22 -204 113 -273 30 101 -32 80 42 -47 81 96 83 -60 137 -162 -181 -114 4
2728Dlq3J83J5nl0q2K42k17l1j44o3K29j93R9Q5L2lJ50M9k47L9l1L0j80M4N8j74
$$ 4 1 -82 101 116 111 81 -1 241 24 -7 -151 -214 15 -178 -79 6 38 35 185 234 -13 26 -5 25 -155 -111 -53 -227
2756b27P2k8J93M8P6p1N7O1k11N3j42J27r6J4K0n7J11j16J96J2J4P2j36r2r3J37
$$ -227 -155 -183 10 58 134 63 120 181 -30 23 -119 8 -88 -74 -54 -111 0 -116 80 92 106 178 42 -50 -143 -6
2782fj07p1K16k1M9M3J3l80L61q7R2L6l81O2k3m6J18Q3O1K2p3J17j26K76j75j94
$$ -6 -113 -184 32 11 60 103 116 -264 97 10 102 138 -243 -181 -204 -250 -132 -49 12 34 -39 78 -48 228 53 -141
2808a41L45l68J17L9j46J7O7L75r0j40n1q0J18o8q2k5n2Rj4J69p1l8J75J10J8
$$ -141 204 -164 -47 -8 -154 -137 -70 305 215 75 24 -56 62 -6 -88 -113 -165 -156 -170 -1 -72 -110 65 175 193
2833A93j99K9l8r4kO5Mm4O9%J58o7l0J07k03Q7j05J8r3J53n5J3J82m10M03Pj05
$$ 193 -6 23 -15 -109 -111 -46 -42 -86 -17 -17 141 74 44 151 -52 35 -70 -52 -145 8 -47 -34 148 -262 141 148 43
2860D3N0P5k03k7J62j05q4M9k7N3r0J61K47k76J37j32N0p4J07k24j08n2L91q5
$$ 43 93 168 -35 -62 100 -5 -89 -40 -67 -14 -104 57 304 28 165 33 83 9 116 -108 -216 -268 123 38
2884C8k58L34O7Q0j06k27J13J44k08R5j79M8j9KJ29O5j4M3j18O4j12O2q3K04k61
$$ 38 -220 114 181 261 155 -72 41 185 -23 72 -107 -59 -78 -76 53 118 104 147 29 93 -19 43 -40 164 -97
2909i7j1P7K5o7Q4P7Q2j51M8n0o2J16j39n2K8J85j75O1J17L7j33J55j10Rp1K9
$$ -97 -108 -31 -6 -73 11 88 170 19 67 17 -45 71 -68 -120 -92 93 -82 -21 96 133 0 155 45 54 -17 12
2935A2j38K6J8P2J3j31J63O9L9L4j23J4j19J4j02J45K7j63Q7K4m0J90k2j18m1
$$ 12 -126 -100 -82 -10 3 -128 35 104 143 177 54 68 -51 -37 -139 6 33 -130 -43 -19 -59 131 109 -9 -50
2960e0J08M3j2j67m6N4L1pM9j02J33J60j08l5J32p5r7lN8j7o4r9J34N6j51J96
$$ -50 58 101 89 -78 -124 -70 -39 -46 3 -99 34 194 86 51 183 108 11 8 66 49 -15 -114 20 76 -75 121
2986A21j5j44O6Q9j35K3o8j16L5j19K34O1j09K20r9O8L4j93R4n5l1j05J38r0k1
$$ 121 106 -38 28 117 -18 5 -63 -179 -144 -263 -29 32 -77 143 44 112 146 -47 47 -8 -39 -144 -6 -96 -117
3011a17J35j43K61j51m3M2L13k29P5l23J19jJ62nj35J4J16Q0j44J02O8j24R2k42
$$ -117 18 -125 136 -15 -58 -16 297 68 143 -180 -61 -62 100 95 -40 -26 90 170 26 128 196 72 164 -78
3035g8j52K19j52Q4j12L73j30O8j10K18j86M9j31m5Q3j18J92N4j09j32L36k38
$$ -78 -230 -11 -163 -79 -191 182 52 120 10 228 42 91 -40 -85 -2 -120 72 126 17 -115 221 -17
3057a7K5J39L9j30k0J08k70k0j70J39R0R4j6K06j59kL3J18l61K86k17j15R9J6
$$ -17 8 147 186 56 36 144 -126 -146 -316 -177 -87 7 -9 197 38 36 69 187 -174 112 -105 -220 -121 -105
3081a05R0m7J41o8J29J27k05K7p6q2J71l05J81k29K91j57K00o7jK12q6j28K5N7
$$ -105 -15 -62 79 11 140 267 62 89 13 -69 102 -203 -22 -251 40 -117 83 16 15 227 141 13 38 95
3105I5k64o9J35K2K3q4J14J19R4j55J9q9mm3P9q9L0j21Q7J6P8K02r1m8J13j61
$$ 95 -169 -238 -103 -81 -58 -142 -28 91 185 30 49 -40 -44 -87 -8 -97 -67 -188 -101 -85 -7 195 104 56 169 8
3131HN0k93J28N2Oj5J54Kj39J97J00j59pk21J78j88J16O0k2j37K9L6OK6R8Q2k07
$$ 8 58 -235 -107 -55 -49 -64 90 92 -47 150 250 91 84 -137 41 -147 -31 29 7 -130 -101 -65 -59 -33 65 147 -60
3158f0J68j91K94k44k25J06p4K28L9N9p0L5J9j02K03r9j70j6j56J84k20J87M5
$$ -60 108 -83 211 -33 -258 -152 -226 2 41 100 30 65 84 -18 185 86 -84 -100 -256 -72 -292 -105 -60
3181f0L6M4M6k15K93j34k7O2m1pQ5j35l5J92j38K7J3Q6l9R9p4j43j07K77k43Q1
$$ -60 -24 20 66 -149 144 10 -17 45 4 -3 82 -53 -88 104 -34 -7 6 92 53 152 78 -65 -172 105 -138 -57
3207e7J33q4O2M6k9q2P5l3j06O8K8M9k37K44Qk27J60qJ4j1K97k36O5q4l2j26J26
$$ -57 76 -8 54 100 71 -11 64 31 -75 -7 21 70 -167 77 85 -142 18 10 24 13 310 74 139 55 23 -103 23
3234B3j72J6J09R4J5k37J07K73r8j0Nj88Qk4%k5J42k55O5O4J97R7j18o3l9kM4
$$ 23 -149 -133 -24 70 85 -152 -45 228 130 120 125 -63 -55 -79 -79 -104 38 -217 -152 -88 109 206 88 25 -14 -16 28
3261B8k27K05m9J9QK5R3o6J20o5L3k55J84M7j31p8K07r7P4J22j39M3k7l0J28r4
$$ 28 -199 6 -43 -24 -16 9 102 36 156 91 124 -131 53 100 -31 -109 98 1 75 197 58 101 74 44 172 78
3287G8j27j01O0j06J38J04Oj1m1N2j4j57K49k30J54r5j13R9N6o4K5O5n7K17Rp9
$$ 78 -49 -150 -90 -196 -58 46 52 41 0 52 38 -119 130 -100 54 -41 -154 -55 1 -63 -38 27 -30 187 196 117
3313A17q2L1J16k91J96q7p4l9m3J92O0j23J46J52k58j0P9j45l9J2K4O7RJ40l40
$$ 117 35 66 182 -109 87 0 -74 -113 -156 36 96 -27 119 271 13 3 82 -63 -102 -90 -66 1 10 150 -190
3338a90L08%K5j43P6k7j5r8j20N5j46J56J0Q1J37j32o5J49O8j48jnj44j7J36L9
$$ -190 118 118 143 0 76 49 34 -64 -184 -129 -275 -119 -109 -28 109 -23 -88 61 129 -19 -20 -25 -169 -186 -50 -11
3364a1j29K37K4j58O3M8Qj23J5k24L28j45Q7j37J08J61m1N6k83K34k8q6k4j61
$$ -11 -140 97 121 -37 26 74 82 -41 -26 -250 78 -67 20 -117 -9 152 111 167 -116 118 90 4 -20 -181
3388a81K83l40K36q8J16Q5K6j23l0k2M3K30m02J85r3J44j23k8o6J59J09m5L0L8
$$ -181 102 -238 -2 -90 26 111 137 14 -16 -38 5 235 -167 18 -75 69 -54 -82 -148 11 120 75 105 143
3412A43jk20J12j2J2J0j80QO4Q4N1P2j46J21m3qj26J86k67J25j36J77O8j01n9
$$ 143 142 -78 34 22 34 44 -136 -128 -64 20 71 143 -3 118 75 67 -59 127 -140 -15 -151 26 94 -7 -66
3437f6R7R8j08L2j10q1J61j59Q1j32K72j51QK30j50L6k5k3j1j15J22O2j94N9j22
$$ -66 31 129 21 53 -57 -138 23 -136 -55 -187 85 -66 -58 172 22 58 33 10 -1 -116 6 68 -126 -67 -189
3462a89K33J51k05R2J7o9J25n4j38l7P1J20n3r0k3P6K98k76j6P8L4m9n9N5j26
$$ -189 44 195 -10 82 99 30 155 101 -37 -74 -3 117 64 -26 -49 27 325 49 33 111 145 96 37 92 -34
3487c4Q7j51K25j07n4P5p1R5j28K54r6r9o3j47K87nj14r6n9J70q0Q2K27j02q4
$$ -34 53 -98 127 20 -34 41 -30 65 -63 191 95 -4 -67 -214 73 68 -46 -142 -201 -31 -111 -29 198 96 12
3512A2M4j02pn8J69j0r6o3J53Ol2l6M1r4K11m8j67J28k2k2j62J68m9O6J00j8P5
$$ 12 56 -46 -53 -111 58 48 -48 -111 42 48 16 -20 21 -73 138 90 -77 51 29 7 -155 13 -36 30 130 112 187
3539A87p2r7J8o4L6j31j35K02Q6r2K42lr0K7k21J43J2k26J38n0j9l8N4K33k64
$$ 187 115 18 36 -28 8 -123 -258 -56 30 -62 180 177 87 114 -107 36 48 -178 -40 -90 -109 -147 -93 140 -124
3564a24K9J74l4J57j18k21M1J42k92K44ok2o6K78m3n7r0O3m1j3j12K3j06K63n6
$$ -124 -95 79 45 202 84 -137 -96 46 -246 -2 -8 -30 -96 182 139 82 -8 55 14 1 -111 -88 -194 69 13
3589A3mj6n9J33o0n9Q6j35J55n9m7Q8o2k6L3N4N8L7p2j57K69n4L7k10j11J82p4
$$ 13 9 -7 -66 67 7 -52 34 -101 54 -5 -52 36 -26 -52 -19 35 93 130 58 -99 170 116 153 -57 -168 14 -60
3616f0O0l8n4Q4K02l16J11NO3r9l6N8k16J98O9k0j67K34Jp5J68j04j81L4J3qJ35
$$ -60 0 -38 -92 -8 194 -122 -11 -6 57 -42 -78 -20 -236 -38 31 11 -156 78 79 4 172 68 -113 -79 -66 -74 61
3643F1k62L32j49lP6l2J09N3j90J63j84J43k38P8q7L5JJ46N6j35J76l8j29O0j6
$$ 61 -201 131 -18 -21 55 23 132 185 -5 158 -26 117 -121 -43 -130 -95 -94 52 108 -27 149 111 -18 42 26
3668B6k2M1k06K9K7LL9P1K5O4J8M6l8j18l35J49K89l25K97j78P1Q4j75K18P7j78
$$ 26 4 45 -161 -132 -105 -102 -63 8 33 97 115 161 123 5 -330 -181 108 -217 80 -98 -27 57 -118 100 177 -1
3694aJ09Q5l67J71q6l4K35m6j5o7Q6r7J69j12K0j2p6q8J45k1o5J44m8j0%pJ72
$$ -1 108 193 -174 -3 -89 -123 112 66 51 -16 70 -27 142 30 50 38 -38 -126 19 -2 -67 77 29 19 19 12 184
3721A84j43J04l1j45J54k57%J24K4j21K38M4l72K26j72J82k2N1l12J37Q8j22J66
$$ 184 41 145 114 -31 123 -134 -134 -10 14 -107 131 175 -197 29 -143 39 17 68 -244 -107 -19 -141 25
3744B5k9Q3PJ2n3J43l1j08O7j91m8k0J05K38k96L47k76K9n3J98k53J93k83J50
$$ 25 -4 79 86 98 45 188 157 49 116 -75 -123 -143 -38 200 -96 251 -25 4 -49 149 -104 89 -194 -44
3768d4J1r6l1K53o0k5R3n0ok07L17l6o2j11J35q1P7k11R9l4P4O0J03j12N1k6j18
$$ -44 -33 -129 -160 93 33 8 101 51 45 -162 155 119 57 -54 81 0 77 -134 -35 -69 5 65 168 56 107 81 -37
3795c7Q1j00O7l5N8PK6q9J99o6p0J13m5k22j26M9J15J56o0R9l4Q0k25m0L7Q1J63
$$ -37 44 -56 11 -24 34 41 67 -22 177 111 41 154 109 -113 -239 -190 -75 81 21 120 86 166 -59 -99 -62 19 182
3822A82j50j6n6N9j12N5J58k42J87m0J95L3q9j21L3j19L7q1Q3O9q0M5j2Oq4r0
$$ 182 32 16 -40 19 -93 -38 120 -122 65 25 220 253 164 43 76 -43 -6 -87 -4 65 -15 30 18 24 -60 -150
3848a50K36mj61n6L3N2N7j33K07l06K70q1J42pl3R2k2j16l9j70J36J98k20j3R1
$$ -150 86 82 -79 -135 -102 -50 7 -126 81 -225 45 -36 106 99 66 158 136 20 -19 -189 -53 145 -75 -88 3
3873Cq8J51M9o0J58k73r6J3j4P3J36O1Lpk23K15j41J60j08QM3j74J21r7J60p1
$$ 3 -85 66 115 55 213 -60 -156 -143 -157 -84 52 113 116 109 -114 101 -40 120 12 20 63 -111 10 -87 73 2
3899Bp7nM8P3k40K59o7L9q7P6N9k71J14j88K96o0J05n5O2N6o4j47K48j80J4r3
$$ 2 -75 -80 -32 41 -199 60 -7 32 -55 21 80 -191 -77 -265 31 -29 76 21 83 139 75 -72 176 -4 10 -83
3925h3m8p4J37N1J43M6j26L3L9k26O9k2l9N4j18J11M7q5R0Q5Q3rl21J29J08r6
$$ -83 -131 -205 -68 -17 126 172 46 79 118 -108 -39 -61 -100 -46 -164 -53 -6 -91 -1 84 167 158 -163 -34 74 -22
3951b2%p4R4QL4j03J06M0o1j09jK65r6j30L8L7j65J36Q4r1j16K51K5l8r2m0lJ02
$$ -22 -22 -96 -2 6 40 -63 43 83 22 -87 -88 177 81 -49 -11 26 -139 -3 81 -10 -126 125 150 112 20 -20 -23 79
3979G9j24Q5n1q9K1P0l4J8M7RK0p7mJk2J74j38J6j58J52J44j90Q9J71j52Q6j84
$$ 79 -45 40 -11 -100 -79 -9 -43 -25 22 31 51 -26 -30 -29 -51 123 -15 1 -157 -5 139 -51 38 209 57 143 -41
4006d1J09j04L3k2Kr0L12l87K48j0j38K26m8q3k7M1n9M7n3J3ko9J35J78j33k29
$$ -41 68 -36 -3 -25 -23 -113 199 -188 60 50 -88 138 90 7 -20 21 -38 9 -44 -31 -33 -102 33 211 78 -151
4032a51J17J50j22p1j9P1n1M1J40L2n7m0L3m0P4n1P4j08l8J56k55P0P8O9m9K1
$$ -151 -34 116 -6 -77 -96 -25 -76 -35 105 137 80 40 73 33 107 56 130 22 -16 140 -115 -45 33 102 53 74
4058G4j04Q2k8KR1j2l46k5K34J35j80J19p7J59n1k4j98L3J05j24J18J11j45k7
$$ 74 -30 52 24 26 117 105 -241 -266 -32 103 -77 42 -35 124 73 49 -149 -116 -11 -135 -17 94 -51 -78
4082g8P3Q1q0K3J3o9%P2Pj56J04j21PK11ok84K92q1J50k73K52k5j60J53j60m1
$$ -78 -5 76 -4 19 32 -37 -37 35 42 -114 -10 -131 -124 87 81 -203 89 8 158 -115 137 112 -48 105 -55 -96
4108i6K8j41L72q4r4J66q8J45j23j07J32k09R4lP9k6j0N1m6q0K43j08n6r1M2N3
$$ -96 -68 -209 163 79 -15 151 63 208 85 -22 110 -99 -5 -8 71 45 35 86 40 -40 203 95 39 -52 -10 43
4134D3j12J52j45k9J21j00%R1K4k3n2Q7Np6O4q6j02J92j14J79j06j04R1l6K85
$$ 43 -69 83 -62 -91 30 -70 -70 21 45 22 -30 57 62 -14 50 -36 -138 54 -60 119 13 -91 0 -36 249
4159B49k80MM3j53P7J12n2l2k9K2J30K7r1L2P2j91K59j62qk1p5N7Q3P3k31J36
$$ 249 -31 -27 16 -137 -60 52 0 -32 -61 -39 91 118 27 59 131 -60 199 37 29 8 -67 -10 73 146 -85 51
4185E1j52K02l4q7J35j68J71r5J02r9p3J1J45q5kJ59N0l21K12j43j7M4K3o6JR8
$$ 51 -101 101 67 -20 115 -53 118 23 125 26 -47 -36 109 24 22 181 231 -90 122 -21 -38 6 29 -37 -36 62
4211F2O6K0j16J57j09k8q0j7j31J79p3O5k8J3n6J3J33O2j44j20P6R3J85o5o5j33
$$ 62 128 148 32 189 80 52 -28 -45 -176 3 -70 -5 -33 -20 -76 -63 70 132 -12 -132 -56 37 222 157 92 -41
4237d1o5J07J31k2j85L3K0J83j33j02J24j72J30l7j13K12j90j13J93J10O1k5j24
$$ -41 -106 1 132 110 -75 -42 -22 161 28 -74 50 -122 8 -29 -142 70 -120 -233 -40 70 131 106 -18
4260a8J48n1m0j84J51J33p5r7N5N1j91J51Mn3L0j54L31j17o9Mr1J34n7l2M6P8
$$ -18 130 79 39 -145 6 139 64 -33 22 73 -118 33 37 -16 14 -140 191 74 5 9 -82 52 -5 -37 9 87
4286H7k50J99j22Q0J6m2O1o7k7J25n7J1M7J5K2j25p9J85r5N6L0j33J60L7k32K00
$$ 87 -163 36 -86 -6 10 -32 29 -38 -65 60 3 14 61 76 98 -27 -106 79 -16 40 70 -63 97 134 -98 102
4312A02J24m27K18j6j11J32J3j00p0J57j33o8K06O6k6J62j9j56j47J02p0m4J44
$$ 102 226 -201 17 1 -110 22 35 -65 -135 22 -111 -179 27 93 67 229 210 54 -93 9 -61 -105 39
4335C9q9KJ25jn3j7j9J74k34k2m2J44K04k46j5l0N4J7l6o8J09N6O4p8j75K2n5
$$ 39 -50 -48 77 76 23 6 -13 161 -73 -95 -137 7 211 -35 -50 -80 -26 -9 -45 -113 -4 52 116 38 -137 -115 -170
4362a70K13j63O3L8pP3o0J23n1m3L6p7n0J39J5o9j4o9J22q5L0N6n9J56p8o6j9
$$ -170 43 -120 -57 -19 -26 47 -13 110 59 16 52 -25 -75 64 79 10 -4 -73 49 -36 -6 50 -9 147 69 3 -16
4389a6o9L9Q4k4q9J42n3q3K7J1N2j2pQ4j48M8J09k45J31N9j34O9qJ11l9j70jJ0
$$ -16 -85 -46 38 14 -75 67 14 -69 -42 -31 21 9 2 86 -62 -14 95 -150 -19 40 -94 -25 -33 78 39 -131 -132 -122
4417a22J85j11L07l41N3K9J07k19Q2Q2k1j52pR3L6k06K15N5r7q1K07j29J62j06
$$ -122 63 -48 259 -82 -29 0 107 -112 -30 52 31 -121 -128 -35 1 -205 10 65 -32 -113 94 -35 127 21
4441B1J5m1K4P9k29J38k43J31KJ61j47P1KR3j11O3m3O5j16O7n9On3J33j25MJ71
$$ 21 36 -5 19 98 -131 7 -236 -105 -103 58 -89 -18 -16 77 -34 29 -14 51 -65 2 -57 -51 -104 29 -96 -92 79
4468G9j83K09o0m7k7R5j23m1O6J75k33P3j1M0l1L1M3k7K3n9k51J05J47J84l39
$$ 79 -104 105 45 -2 -29 66 -57 -98 -32 143 -90 -17 -28 12 -19 12 55 28 51 -8 -259 -154 -7 177 -162
4493a62J75j14PJ93o6k9o6J23l12K38m0l3M0K52l35J14n6J27q1n6L9K8n7M1J50
$$ -162 13 -101 -94 99 33 4 -62 61 -251 -13 -53 -86 -46 206 -129 -15 -71 56 -25 -81 -42 -14 -71 -30 120
4518A20j8j17P1o4j96R1K04m3j08J39j88J84J08j27Kj18j06J42r6J89k52K79o8
$$ 120 102 -15 56 -8 -204 -113 91 48 -60 79 -109 75 183 56 58 -60 -166 -24 -120 69 -183 96 28
4541B8K0p1M8r2J36j21l8j12J45J25N6N1j65J3j64J72o4n0L0M7L4K9r4qJ35j74
$$ 28 48 -23 25 -67 69 -52 -90 -202 -57 68 124 175 10 23 -141 31 -33 -83 -53 -6 28 57 -37 -45 90 -84
4567h4J61j66R2J37j16o4J8J3K1J0j02j29K66j78J44j68J44k9P6j14o6J03N5M1
$$ -84 77 -89 3 140 24 -40 -22 -9 12 22 -80 -209 57 -121 23 -145 -1 -30 46 -68 -134 -31 24 65
4591F5j40J22j58J05om7l8R4k7m2r8Q0R6P0k67J83R5n3P5r8q7K8K9O6O3j63M0
$$ 65 -75 47 -111 -6 -12 -59 -97 -3 -30 -72 -170 -90 6 76 -191 -8 87 34 109 11 -76 -48 -19 47 110 -53 -13
4618a3K7k03K58j91J48j64J25p6J70j05M3L5P3j83rJ79j17q2o0J54R6J9r7l5k13
$$ -13 14 -189 69 -122 26 -138 -13 -89 81 -24 19 54 127 -56 -65 114 -3 -85 -145 9 105 124 27 -8 -221
4643b21J84R8j00j9J2J16R8n3Q1j49l3P6O2j18j42L8O6M8Kj16L6p2J12J03j75
$$ -221 -37 61 -39 -58 -46 70 168 115 196 47 14 90 152 34 -108 -70 -4 44 46 -70 -34 -106 6 109 -66
4668f6J86k33J08j2O2j50J75q3o8N3J64j93J08l3j7k3j51J22k4K05j64L2M8j47
$$ -66 120 -113 -5 -17 45 -105 70 -13 -81 -28 136 -57 51 18 1 -22 -173 -51 -75 130 -34 -2 46 -101
4692a01J72p6l0O1n6r7J89J5k3m2n1p6oJ41R6k65J19p1K08m3j45M4k0J30o6k7
$$ -101 71 -5 -35 26 -30 -127 62 77 54 12 -39 -115 -121 20 116 -149 -30 -101 107 64 -81 -37 -57 73 7 -20
4718b0n1j97J83J07j17K7J9N7P4l1o8K50o1p4j75nJ4R0j33N4J95n5L0j14J8J3
$$ -20 -71 -268 -85 22 -95 -68 -49 8 82 51 -17 233 172 98 -77 -82 -68 22 -111 -57 138 83 113 -1 17 30
4744C0K3M1%N8j94J1P7Q2j44J80j92m2J91p3p2Q0j34M6P1M4k1q3j2M6j55R4O4
$$ 30 53 94 94 152 -42 -31 46 128 -16 164 -28 -70 121 48 -24 56 -78 -32 39 83 62 -21 -33 13 -142 -48 16
4771A6K5n9o8M2J2j2k0J16p1J38r5j48J08o2k18N40k77pl4R9p6J16r6P2m1J79
$$ 16 41 -18 -86 -44 -32 -44 -64 52 -19 119 24 -124 -16 -78 -296 244 -33 -40 -74 25 -51 65 -31 41 0 179
4797A79q5j03L2M4j28M3P0j06j09R7J30k18K31n1N4j11m1o7J58j25L6J39j88K30
$$ 179 94 -9 23 67 -61 -18 52 -54 -163 -66 64 -154 77 26 80 -31 -72 -139 19 -106 -70 69 -119 111
4821A11k75K2R0J1N4J5rk62L24q6m8K57j54j73J31j4j69K87k01j4J22k77J39K44
$$ 111 -164 -142 -52 -41 13 28 19 -243 81 -5 -53 204 50 -123 8 -6 -175 112 -89 -103 19 -258 -119 125
4845A25n6j22Q8q5o5J95n6k1p4K19k14J36k9j51J17JJ2J9j37K72k74rK57J2k14
$$ 125 69 -53 35 -50 -115 80 24 3 -71 148 -66 70 41 -110 7 8 20 39 -98 174 -100 -109 148 160 -54
4870e4K12j41j37J69m7l1m8r0J57J41L7p7j29O8l7M9p2K93m30P4K01P8j95J67
$$ -54 158 17 -120 49 2 -29 -77 -167 -10 131 168 91 -38 30 -7 42 -30 263 -167 -93 108 186 -9 158
4894A58l2j62j22P8L4P0j24J82L2k58Q7l2J5J82k04P2j68M09j94j0J77k31k2J47
$$ 158 126 -36 -158 -80 -46 24 -100 82 114 -144 -57 -89 -74 108 -96 -24 -192 217 23 13 190 -41 -63 84
4918H4pl4O1j55P9k04K07j47P3J32J28k78j75K57Qj41O3lO9j53J83j90J72j25
$$ 84 77 43 104 -51 28 -176 31 -116 -43 89 217 -61 -236 21 29 -112 -49 -52 17 -136 47 -143 29 -96
4942i6l9O6J0Mn6N3K42l52J84J27k26K01j77n5J33o2QK46p9M6l09J69j28N0m1
$$ -96 -135 -69 -59 -55 -111 -58 184 -168 16 143 -83 118 -59 -114 19 -43 -35 211 132 178 -131 38 -90 -40 -81
4967h1J82k89P8K28k52M0j0MJ55j81K44j18N8j11K1L28l52j1Q2J69p5q5o3L2J22
$$ -81 101 -188 -110 118 -134 -94 -104 -100 55 -126 118 0 58 -53 -32 296 -56 -67 15 184 109 24 -39 -7 115
4992A15r9j05J64n5j02K4J15k71K96p0N5j61Q7J51o0j01l4J5J24J7q5L9j42j11
$$ 115 16 -89 75 20 -82 -58 57 -214 82 12 67 -94 -7 144 84 -17 -51 -36 88 105 20 59 -83 -194
5016a94K2P5L5N2J57j65r4J31l6k51L37k9o8mJ53k2o0R3j41j2J99k68K02l6j2
$$ -194 -172 -97 -62 -10 147 -18 -112 19 -17 -268 69 40 -28 -32 121 99 39 132 -9 -21 178 -90 112 76 64
5041F4M2j04n5J48r5o5J57p7q8o5J1K11j0j07J11j38J58j40j19K60j90K26kr2
$$ 64 106 2 -53 95 0 -65 92 15 -73 -138 -127 84 74 -33 78 -60 98 -42 -161 99 -91 135 133 41
5065D1k7Q7q0R0j63N3j34P3k0J15j86K21J02mp7j94O3P8n9q6J82k2l5J16n3p0
$$ 41 14 101 21 111 -52 1 -133 -60 -80 35 -151 70 172 168 91 -103 -40 38 -21 -107 75 53 18 134 81 11
5091A1q6J78pj81J17o0K9J48r1j51O2PK1j73K12k1m7R4j04p7J20m7P8o2J15o7
$$ 11 -75 103 96 -85 32 -28 1 149 58 -93 -31 -24 -3 -176 36 15 -32 62 -42 -119 1 -46 32 -30 85 18
5117A8j92P7K15j61M6p1Q5l5N0JkJ69k79K28j08o6m0Q5j0P2j67J58l22M32j04
$$ 18 -174 -97 118 -43 3 -68 17 -18 32 33 31 200 -79 149 41 -25 -65 20 10 82 -85 73 -249 183 79
5142G9j21J5j50J80R8r2j07R6k32K40J18j39l5j02L35j34p8n9N2j40J27J27j87
$$ 79 -42 -27 -177 3 101 9 -98 -2 -234 6 124 -15 -50 -152 183 49 -29 -88 -36 -176 -49 78 -109
5165a09J03J64j34P7j56P3q0K52q4r6N3K9q2J05Nr5j57j6L08m2J9j81N4p3K1J05
$$ -109 -6 158 24 101 -55 18 -62 190 106 10 63 92 10 115 120 25 -132 -148 160 118 137 -44 10 -63 -42 63
5191F3l5k3L4l5q3K08j34m1k8K2M2m1p2Q5L5p5K94k93J13j60J16Q6p3J08k64K3
$$ 63 28 5 39 4 -79 129 -5 -46 -74 -52 -10 -51 -123 -38 -3 -78 216 -77 36 -124 -8 78 5 113 -151 -128
5217a28K48j35n3n2K48o2N6m8k4m2Q4o1j06P8m0j15K89p8j12J54j98J18j9J13
$$ -128 120 -15 -68 -120 128 66 122 74 50 8 92 31 -75 3 -37 -152 137 59 -53 101 -97 21 2 115
5241A15k15J67k9K0k4J5k5k05J24K24k86J85k3k5K1J86j87n2J9O2J22j74M4n1
$$ 115 -100 67 38 58 34 49 24 -181 -57 167 -119 66 43 18 39 225 38 -14 5 67 189 15 59 8
5265HJ3O9q1q3N3N3M0q3j3j10J03J54l5p0ln8N8p2J72r2j6p8j9P6ln3J32j13J29
$$ 8 21 90 9 -74 -21 32 72 -11 -24 -134 -31 123 88 18 15 -43 15 -57 115 23 7 -71 -90 -14 -17 -70 62 -51 78
5294G8L6n4j01Ko7J84n3nJ64k09K2k7l6%O1J3J94k49J38j68J86J0j42l2R0m0l4
$$ 78 114 60 -41 -39 -106 78 25 20 184 -25 -3 -30 -66 -66 -5 8 202 -47 91 -77 109 119 -23 -55 35 -5 -39
5321c9RO7k81K70j3L2N0r0l4m4P5n1o0L05k01J31J7r5n2L5j76K72Qk59J48Q8j57
$$ -39 -30 37 -244 26 13 45 95 5 -29 -73 2 -49 -109 196 -5 126 143 48 -4 31 -145 127 135 -124 24 112 -45
5348d5M6Q7j50J82j28K1J32r7p9O4k1j84L06j82l2R0NL7O4o7j34%N0r9J25p2N3
$$ -45 1 88 -62 120 -8 13 145 48 -31 33 12 -172 134 -48 -80 10 15 52 116 49 -85 -85 -35 -134 -9 -81 -28
5375b8J32k00M9Mo6L0R5o6N5k6J27J1k6j07J35r2o0J6p6J12JJ54j74J0j56J39
$$ -28 104 -96 -47 -43 -109 -79 16 -50 5 -21 106 117 91 -16 119 27 -33 -17 -93 19 20 174 0 10 -146 -7
5401gjj16n0K22J5q3L0o1k8N0j3J17j30j54K37Q5j49k9J14Oo0l5J8N5P6M6j61
$$ -7 -8 -124 -174 48 63 -20 10 -51 -79 -29 -42 75 -55 -209 28 113 -36 -65 49 55 -5 -40 -22 33 109 155 -6
5428fq3J10J2kJ06k95J31j3J19K1k05J27l2r3K29k07K12p2q7L4J32m7n5j62K6
$$ -6 -89 21 33 31 137 -158 -27 -40 79 100 -105 22 -10 -103 126 -81 131 59 -28 6 138 91 36 -126 -100
5453a00K35j25J89j43r4p9M0P4OP1L8j65j75J55Q4m2q6jJ63o4O0J60o3k43M9R0
$$ -100 135 10 199 56 -38 -117 -77 -3 3 74 112 -53 -228 -73 11 -31 -117 -118 45 -19 41 201 138 -105 -56 34
5479C4j39J49j77J54K6j66L7O3j48J70N0J6j68L7N8j77K10J7j60n7K77k3m9J30
$$ 34 -105 44 -133 21 47 -119 -82 -19 -167 3 53 69 -99 -62 -4 -181 29 46 -114 -171 106 83 34 164
5503A64j1k64Q8J34k59O1K7J1R3L9j18j16J72J8J16k80J55J8J17j44j20Q1p9J5
$$ 164 153 -111 -23 111 -148 -87 -60 -49 44 83 -35 -151 21 39 155 -125 30 48 165 21 -99 -18 -97 -82
5527h2P8m0k5K70j34K1k8l8k16P3J21J60r2j05P6K34k62m1M2N7J2j48p8k4M7J33
$$ -82 -4 -44 -69 201 67 88 60 22 -194 -121 0 160 68 -37 39 273 11 -30 12 69 81 -67 -145 -169 -122 11
5553A1M8p4k9L1j76K37j05J04J06j55o9J28r1J19k51Q6J96j80m0M4O1n2Jj0J77
$$ 11 59 -15 -44 -13 -189 48 -57 47 153 -2 -71 57 -34 85 -166 -80 116 -64 -104 -60 1 -51 -50 -60 117
5578A17j78P7j84J88Jp8J12N7j45k17L21o8M0o5K8P5j8O8m3k39K63j11O2k46k5
$$ 117 -61 16 -168 20 21 -57 55 112 -33 -250 71 3 43 -22 6 81 63 131 88 -151 112 1 63 -183 -208
5603b08K76Lj08J79j26k89M24j09q3J20k04J94j04R2j43Qj36K58k6q0N9M0N8j25
$$ -208 68 71 -37 142 16 -273 151 42 -41 79 -125 69 -35 57 -86 -78 -214 44 18 -62 -3 37 95 -30
5627c0J49k37Q1j57J60jK6J78k70J07K1n2J39k51K08j39j05J77m6J5N2L2O3m2
$$ -30 119 -118 -37 -194 -34 -35 -9 169 -101 6 27 -25 114 -137 71 -68 -173 4 -42 -27 25 57 120 78
5651G8n0j59R7N5N6k5j31P8m8%J8J45j46M0m3N5j32J29J94j26k9n8Mn5J07j33
$$ 78 28 -131 -34 21 77 52 -79 -1 -49 -49 -31 114 -32 8 -35 20 -112 17 211 85 56 -2 2 -53 54 -79
5677g9J71j49j18J04p4k9K52j11K3j16L5P5K8n3P6j14J80j7m7l3m7L3Q4j6k25
$$ -79 92 -57 -175 -71 -145 -174 78 -33 -10 -126 -91 -16 12 -41 35 -79 101 84 37 4 -43 -10 74 58 -167
5702a67P4J9rL1L7jKP9k41J8J59o1J34r6J54k38J02J38j66P6n5n1O7J26j49l0
$$ -167 -93 -74 -83 -52 -15 -16 -14 65 -176 -158 1 -60 74 -22 132 -106 -4 134 -32 44 -11 -62 5 131 -18 -48
5728d8R6K03l63L3P7q7M1O0J78k00O0p2n7Q8l6j6q7L04j69R0j82M8L0o9m1P1m2
$$ -48 48 251 -112 -79 -2 -89 -48 12 190 -10 50 -22 -79 9 -27 -43 -130 174 5 95 -87 -39 -9 -78 -119 -48 -90
5755i0P0R5K4p3j3n0o3J22k1k50K26roJ42q4J14Q1k26J39k4k31P8L4O3n9J2JO7
$$ -90 -20 75 99 26 13 -37 -100 22 1 -249 -23 -32 -38 104 20 134 215 -11 128 104 -127 -49 -15 48 -11 1 2 69
5783F9J38j37j39m3L5r4O0K79j31J3j20j2R4j74L37j85j8q5J20J1j43P9n1J58
$$ 69 207 70 -69 -112 -77 -171 -111 168 37 50 -70 -82 12 -162 175 -10 -28 -113 7 18 -125 -46 -97 61
5807F1Q1j24q0J47q5Q4o2j14J29l9JK0j58M5J92j09k42L18m7M3Q8j96M6n6J69
$$ 61 142 18 -62 85 0 84 22 -92 37 -2 -1 19 -139 -94 98 -11 -253 65 18 61 149 -47 -1 -57 112
5832A12j21m5nJ03k5K4j49n7M12l81L49mk28n2j8K43j22o3Q8k2j0n4j31M89m22
$$ 112 -9 -54 -59 44 19 43 -106 -163 249 -132 217 213 -15 -67 -85 158 36 -27 61 39 29 -25 -156 333 -89
5857h9J1J8J05j37L0J80k14j9Q9J02N9k71J24o8J56k3Q0k60J14K5Kq0J28p8L8
$$ -89 -78 -60 45 -92 -62 118 -96 -115 -26 76 135 -136 -12 -80 76 53 133 -127 -13 12 14 -66 62 -16 22
5882B2o2O5j32J73Oj45J76k93K13p9O4k36J63J10P9r1r1J60n6P6k07Q5n8j13J68
$$ 22 -40 25 -107 66 72 -73 103 -190 23 -56 8 -228 -65 45 124 33 -58 102 46 122 -85 0 -58 -171 -3
5907cO2jk3r9K73k26LJ54j19o9R0N9j36Jj4J04k27J47J31n1P2K4n9j95J36k3Q9
$$ -3 59 58 35 -64 209 -17 -14 140 21 -48 42 101 -35 -34 -48 56 -171 -24 107 56 128 152 93 -102 34 11 100
5934A00l02K07K4J18k59J81J7j22O0L9Pq7J2L8j27R5J12j79M9q0J17R6n2k43Q0
$$ 100 -202 5 29 147 -112 69 86 -36 24 63 70 -17 -5 33 -94 1 113 -66 -17 -97 20 116 64 -179 -99
5959i9O8j2j07P9M3K4j12j00K56J5R1j04p7j47K17k6o3q9K41j25O6K8q2J03j88
$$ -99 -31 -43 -150 -71 -28 -4 -116 -216 40 55 146 42 -35 -182 35 9 -54 -143 98 -27 39 67 -15 88 -100
5984a00J35O0k57J21L1J13j24J01j50j02kJ96J28l03J22j9M5m0N9N4j72j39J41
$$ -100 35 95 -162 -41 -10 103 -21 80 -70 -172 -174 22 150 -153 -31 -50 -5 -45 14 68 -104 -243 -102
6007a02r5P2L77k41p1J81j34J12k09K18j28k11K60P9k8j23J82j86K4R5j15J25
$$ -102 -197 -125 252 11 -60 121 -13 99 -110 108 -20 -231 29 108 80 -43 139 -47 -23 72 -43 82
6029H2j52JJ51kj4p2M7K1OmMm0q1J6K31j06j01l6j08J77q8k0O4J48j54L6j77J43
$$ 82 -70 -69 82 80 66 -6 41 62 68 64 68 28 -53 -37 194 88 -13 -49 -157 20 -68 -88 -24 124 -30 6 -171 -28
6057b8O0O4j17l8J82j96J68j79J74j27K40j99J0q6K0R5O7j11J77m0k42Q1r8K35
$$ -28 32 96 -21 -59 123 -73 95 -84 90 -37 203 4 14 -72 -52 43 110 -1 176 136 -106 -25 -123 112
6081A12q0K2j05M7q5P4R1j11n9K22o2j39J41p1j55K15J71k00J5J5k5j19J37J41
$$ 112 32 54 -51 -4 -89 -15 76 -35 -94 128 66 -73 68 -3 -158 57 228 28 43 58 33 -86 51 192
6105A92j60M7j04lj8R2j2j19l4K00j6Kj01PP1m4J8K5K1p3J5k03K87k25R8K3nR3
$$ 192 32 79 -25 -28 -46 46 34 -85 -119 81 65 67 -34 -27 44 0 18 43 64 -9 6 -197 90 -135 -37 -14 -19 74
6133G4O5j31J39K9j29j42J97n9j98K34j4q6j07R9Q0l8L7j10K08k36K38r9r6l7
$$ 74 139 8 147 176 47 -95 102 43 -155 79 65 -21 -128 -29 51 13 50 -60 148 -88 150 51 -45 -82
6157h2n2J95j4O7j11n8K4J40o0j43J22jJ02k80K28j90J81o1Kj5k05J79Q9j34K3
$$ -82 -134 61 47 114 3 -55 -31 109 49 -94 28 27 129 -151 77 -113 68 7 9 -6 -211 -32 57 -77 -54
6182e4K4J01j9k06J98n0j9J70k67O0J14J8k3K2qj36M8R2k05J27pj43J26Qj37L8
$$ -54 -30 71 52 -154 44 -6 -25 145 -122 -62 52 70 47 69 61 -75 -27 65 -140 -13 -20 -163 -37 -29 -166 -128
6208a28R4K2J0oL2n0k18K16J35p4J5n4kK2o7l5Q8q7L0kJ54j72P1Qk9K8M1J49k33
$$ -128 -34 -12 -2 -8 24 -26 -244 -28 107 33 48 -6 -8 14 -53 -88 0 -87 -57 -59 95 -77 -6 2 -27 1 42 191 -42
6237d2M5j08J35j32K16j9n9j42RQ8nJ01p3M3p1J34j44R1k24J78oR2k17K5J78m3
$$ -42 3 -105 30 -102 114 95 36 -106 -97 -9 -14 87 14 57 -14 120 -24 67 -157 21 15 107 -110 -85 93 50
6263E0j76J87O5k2q2jk5J50j26j01rM0L5m6Q2k5L3o4L9j1j1j10K75q6j16K33j76
$$ 50 -126 61 126 104 22 21 -4 146 20 -81 -90 -50 -15 -61 21 -4 29 -35 4 -7 -18 -128 147 61 -55 178 2
6290BP4N3k54L08k25J52j16J17k7j07j65J49K01j55m5k0L4L4J08j90J28k18J30
$$ 2 76 129 -125 183 -42 110 -6 111 84 -23 -188 -39 162 7 -38 -58 -24 10 118 -72 56 -162 -32
6313c2Oj41P1N9r6K9J42j5J34l01L29j56k2q0J26j56L21l19J75j01oJ46pj57K13
$$ -32 -26 -167 -96 -37 -133 -104 38 23 157 -144 185 29 7 -73 53 -103 218 -101 74 -27 -33 113 106 -51 162
6338A62j32j92L3J61J38j53J5qj39Q0j2p5K52N6j89J22j08j15jJ76jk6l5MR6M
$$ 162 30 -162 -129 32 170 17 32 24 -115 -35 -47 -122 130 186 -3 119 11 -104 -105 71 70 44 9 13 109 113
6364A13l4o7J1r7J87k46M3P8j6J02l0j07l1r7J96J44j12k04K39k5l2p8M5R3j64
$$ 113 79 12 23 -74 113 -133 -90 -12 -28 74 44 -63 -94 -191 5 149 37 -167 72 47 15 -63 -18 75 -89
6389h9K27j51J49j50r1J09K5R9k35j02K46k06K64j76O4R3j92O9J91k58K6J88j65
$$ -89 138 -13 136 -14 -105 4 29 128 -107 -209 37 -169 95 -81 -17 76 -116 -47 144 -114 -88 100 -65
6412f5O4Q0j25L2J27j88n6K93j61J52p2o2P8j02L1Nk42L0R6J95p8j91J46rj43
$$ -65 -1 79 -46 -14 113 -75 -131 162 1 153 81 19 97 -5 26 31 -211 -181 -85 110 32 -159 -13 -22 -165
6437a65R7K17j69J10n0j1j07L0K11n2ro8j06j82K49O7k90K74o7m1J10j27J47j49
$$ -165 -68 149 -20 90 40 29 -78 -48 163 111 102 34 -72 -254 -5 62 -228 46 -21 -62 48 -79 68 -81
6461h1J35j15J57j22r0j1K12j49OmR8J5j72l9K09k3j36J67J20l87J69o7q5j3J10
$$ -81 54 -61 96 -26 -116 -127 85 -64 -58 -62 36 51 -121 -160 49 26 -110 57 177 -210 -41 -108 -193 -206 -96
6486i6R8k05J31J71j06J51k53q2K46nkr9M3j24N0O0m0P9N2q9M7mo8K24j52r9J58
$$ -96 2 -203 -72 99 -7 144 -109 -191 55 50 48 -51 -8 -132 -82 -22 -62 17 69 -20 27 23 -45 179 27 -72 86
6513H6p3Q6l6j33O1J13M9M5k73L8qJ72k28O9O2K7j53J44p0l8J58j18o5J11r2L1
$$ 86 13 99 63 -70 -9 104 153 198 -75 -37 -45 127 -101 -32 30 57 -96 48 -22 -60 98 -20 -85 26 -66 -35
6539c5Q9j85J31j4J80j72Qj6m5J33N7K5l74N9J31K29j01m3Np3K2O8m9%M0PK8j64
$$ -35 54 -131 0 -14 166 -6 2 -14 -59 74 131 156 -218 -159 -28 201 100 57 62 -11 11 79 30 30 70 77 105 -59
6567e9J8J55j16J14r3j27k2J20J4M4Lj6k7Q5j50J88j99L19l44K43j55P8r0oj62
$$ -59 -41 114 -2 112 19 -108 -130 -10 4 48 51 35 8 93 -57 131 -68 251 -93 150 -5 73 -17 -23 -185
6592a85J79J47j05j32Q3j1J40j38K9J56j84J78k61J87k36J67J5n7M4k56K45nP1
$$ -185 -6 141 36 -96 -13 -24 116 -22 7 163 -21 157 -104 83 -153 14 29 -28 16 -240 5 0 71
6615G1n2O4J6k3k10J71Po7M3m7k3L1j09K73k7K2ql41K06J64k34J33Rk22J04J30
$$ 71 19 83 99 76 -134 37 44 -23 20 -27 -50 -19 -128 145 118 140 132 -209 -3 161 -73 60 69 -153 -49 81
6641H1P0k67O7M3J08j15j6o2J40k3P7j73M0P9m0kn1M7np2j46K81j31K18j09l0
$$ 81 151 -116 -49 -6 102 -13 -29 -91 49 26 103 -70 -30 49 9 7 -44 3 -2 -74 -220 61 -70 148 39 9
6667Ij79J10K3o0J28L7l9m4Q6q8K0R3m7Q8m2J1j02n3Q7l4Kn0J63j83%k1J22O6
$$ 9 -170 -60 -37 -97 31 68 29 -15 71 -17 3 96 49 137 95 106 4 -49 38 4 6 -44 119 -64 -64 -85 37 103
6695A03j09M7j08ol0L3J22o8p0L2n2j0J34q9J21k26J26O8J07j39j10K08N8j10
$$ 103 -6 41 -67 -73 -103 -70 52 -16 -86 -54 -106 -116 18 -71 50 -176 -50 18 125 -14 -124 84 142 32
6719C2Q4k60J36nr1J76j14L22k54m0P9j72M1Q4o2p1n2J62J21k08L4k6pJ11o7p5
$$ 32 116 -144 -8 -13 -104 72 -42 280 26 -14 65 -107 -66 18 -44 -115 -167 -5 116 -92 -58 -84 -91 20 -47 -122
6745a22J12kNj53J23K6J9r9QJ27p8J06rjR5K6j42L0l2J73k08K39l06l2P4J05R1
$$ -122 -10 -12 -7 -160 -37 -11 8 -91 -83 44 -34 72 63 62 157 183 41 71 39 212 4 243 -63 -95 -21 84 175
6772A75j32p7qQ7l8j41J33K6j13M0K66k11n5j97L52k57J67o4K0j94J76Kn5L0l9
$$ 175 43 -34 -42 45 7 -134 -1 25 -88 -48 218 7 -48 -245 107 -150 17 -47 -27 -221 -45 -43 -98 -68 -107
6797a07J23n5j75L01j48P3r7N7J13m9J77k56J08o9P1m1j10Q0J15q4j5J7N6j48
$$ -107 16 -39 -214 87 -61 12 -85 -28 85 36 213 -43 65 -4 67 26 -84 -4 111 27 12 29 85 -63
6821f3j49L09j10R8q4j72J64P6K1j25J23j21R3r3q0k3j05L89r0o9k26L27k38O8
$$ -63 -212 97 -13 85 1 -171 -7 69 90 -35 88 -33 60 -33 -113 -136 -241 148 58 -11 -237 90 -148 -80
6845h0J42n0R7k24K19j16O8j8R2l9o7o8J0M2Lj83K83Rk17k9K38j29K3R6k39K39
$$ -80 62 12 109 -115 104 -12 56 38 130 91 24 -44 -34 8 11 -172 111 120 -97 -126 112 -17 6 102 -137 102
6871A02j33J27n0j16K0J41j87J11K7n8J4l2J8j3O6j7N0Q3j64Q1j43J69l1o6R7
$$ 102 -31 96 46 -70 -50 91 -96 15 42 -16 -2 -34 -16 -29 37 20 70 153 -11 70 -73 96 65 -1 96
6896I6j0L7j45K60l21p2J93q9j24J40r3pJ07j4N2K5J48j93J72j18j12L5P5j4j10
$$ 96 86 123 -22 238 -83 -155 38 -51 -175 -35 -128 -135 -28 -42 10 35 183 -10 162 44 -68 -33 42 28 -82
6921h2l2J44Q4k31P5N9J4j22l1K39p0j91J32r3n0J70K2j46L30l03J04L7l6l9J5
$$ -82 -114 30 114 -117 -42 17 31 -91 -122 117 47 -144 -12 -105 -155 15 37 -109 221 -82 22 59 23 -16 -1
6946aM5n6lJ92j76l2j63Q1J53k16J88P3k22J44L7j58R4Q7o8J8j9j7OJ54j55k3
$$ -1 44 -12 -15 177 1 -31 -194 -113 40 -176 12 85 -137 7 44 -114 -20 67 -1 17 -2 -19 -13 141 -14 -37
6972c7J23j97J38j60J88o9J87j49J2J17m5k94J38J18r7r2J27J58j59jj03J19r9
$$ -37 86 -111 27 -133 55 -14 173 24 36 153 108 -186 -48 70 -27 -119 8 166 7 6 -97 22 -77
6995g7L3mL0j29LO5m5J59j66K19r5n2J20l9%O1j30K65k43J9N0m2J4Oj45mL9K6
$$ -77 -44 -48 -18 -147 -144 -79 -124 35 -131 88 -7 -59 61 22 22 83 -47 218 -25 -6 44 2 16 22 -123 -127 -88 -62
7023f2k0oJ4J79O1k22l0K8P7K43m20J08J99j57J11k76K51o3M5P9r0j48P5J14j91
$$ -62 -82 -88 -74 105 166 -56 -86 -58 19 262 -158 -50 149 -8 103 -173 78 15 60 139 49 -99 -24 90 -101
7048a01N4Lp1J35j01J87J9j15j4K7j25N7J27m0p5N2J10k62J45Pl0j58L61k75J63
$$ -101 -47 -44 -115 20 -81 106 125 10 -4 23 -102 -45 82 42 -33 19 129 -133 12 19 -11 -169 192 -83 80
7073H0j68M8k2J85O9k11k8k2m3J87j95R5O4q9J68m0J34j99l1l5L7J70j19J41k20
$$ 80 -88 -40 -62 123 192 -19 -47 -69 -112 75 -120 -25 39 -50 118 78 212 13 -18 -53 -16 154 35 176 -44
7098d4RK31k76j49K19O5p4N5m8M0J22j4j48K44k89J19K11k44L3J10m6k18l5K92
$$ -44 -35 196 -80 -229 -10 55 -19 36 -12 28 150 136 -12 232 -57 62 273 29 62 172 126 -92 -127 165
7122A65k10J10n8J8j22P0R5Km9l3m9J89o4q1J33l9j29M6J29Qk18J82J40k82LP
$$ 165 -45 65 7 25 -97 -27 68 70 21 -12 -61 128 64 -17 116 77 -52 -6 123 131 -87 95 235 -47 -44 -37
7148c7k3J1l1J61J0j89K20r6rK1J75l75J77j3n6M2K1n5K56k06J2K2m3l5K7K08
$$ -37 -60 -49 -80 81 91 -98 122 26 17 38 213 -162 15 2 -54 -12 9 -46 210 4 16 38 -5 -40 -13 195
7174A95j96j19l7J61qj87L89l23J48J40k27J02k05K46q7N3M7pj95J87n8J20j24
$$ 195 -1 -120 -157 4 -4 -191 198 -125 23 163 -64 38 -167 79 -8 45 92 85 -110 77 19 139 15
7197A5JK2k1Q8m7l3J15Q2k02j00J47j58J05l0J29j38J20j53k4J01o5n0M7Q7M2
$$ 15 16 38 17 105 58 25 140 222 20 -80 67 -91 14 -16 113 -25 95 -58 -82 19 -46 -96 -49 38 80
7222H0p2j8o4J73m3m1J29k03J1J04N0P0k79J30K7L7J8l49M16q9j14j5N3K61k41
$$ 80 8 -10 -74 99 56 15 144 -59 -48 56 106 176 -103 27 54 91 109 -240 176 87 -27 -42 11 272 31
7247C1j31J31O4j36j24J68K23j14r1j86J52O4L2q1R6n5j16L7QL6j2o2M8L7j04
$$ 31 -100 31 95 -41 -165 3 226 112 21 -165 -13 51 83 2 98 43 -73 -36 -28 8 -4 -66 -18 19 -85
7272h5J23L0r2K0q4O1n6J20l0rJ8Q8k07N4K3N6m5J4o1J12l3o9J41J79j32k95K20
$$ -85 38 68 -24 -4 -88 -27 -83 37 7 -2 16 104 -103 -49 -26 30 -15 -1 -62 50 17 -52 89 268 136 -159 61
7299F1k6k61J75j15J85p2K07j73Q5p8nl1K22j74K00k31L2J1P4m2jj6o2k5NJ43
$$ 61 35 -226 -51 -166 19 -53 154 -19 66 -12 -17 -48 174 0 200 -31 1 12 86 44 43 27 -35 -60 -55 88
7325H8k54J82L3j55J05J7O7R2r7k6J22n9j64J0p4Q4q8mJ56k39K85j71J99m4n2
$$ 88 -166 16 49 -106 -1 16 83 175 78 52 174 115 -49 -39 -113 -29 -117 -121 35 -204 81 -90 109 65 13
7350A3j8oP2q9J1P8k02K65o3j14K6n0J4N9Q5M1j22k1Q2jm6j02Q4N7k74K34K1r8
$$ 13 -5 -11 61 -28 -17 61 -141 124 61 -53 -27 -77 -63 -4 81 122 0 -21 61 60 14 -88 -4 53 -221 13 34 -64
7378f4J35j06lj6J00P1j2j46n8m2J29R1j41j36L32j34lk2N3K6N9k95L9L22j21
$$ -64 71 -35 -38 -54 46 117 105 -41 -99 -141 -12 79 -62 -198 134 0 -3 -25 28 54 113 -182 -143 179 58
7403E8J12q9J2j06lQ0J9Q7k23J8kP9j35L7k7J10o8P7O2o9O3j74J13R5k53J04k8
$$ 58 170 81 93 -13 -16 64 83 170 -53 -35 -37 42 -93 -56 -83 27 -41 36 98 29 92 -82 31 126 -127 -23 -51
7430e1o6jJ44Rj06J14j4j02J88l02K51j53J73J35k46N0OM1p0K9k1Q3o1N8j17J79
$$ -51 -117 -118 26 35 -71 43 29 -73 115 -187 64 -89 84 219 -27 23 29 70 0 29 8 91 30 88 -29 150
7456A50k21P1J0O3j8K04k99j01J89N6p6P6N6o3m3j41p0J60m1K19n7k80P9N6l2
$$ 150 -71 0 10 73 55 259 -40 -141 48 104 28 104 160 97 54 -87 -157 3 -38 181 124 -156 -77 -21 -53
7481e3O1Q4j05k4J01J00j63j1r0Q1P8j12Q3l6K4j00Q2J50j79J46j98O0KL5n4M6
$$ -53 8 92 -13 -37 64 164 1 -10 -100 -19 59 -53 30 -6 18 -82 0 150 -29 117 -81 -21 -19 16 -38 8
7507Hn2O5J0J5k38K40k9K9n5m1Q0o4m5J87j3o5J1j3k3rP8n5k71K45j06K21j66
$$ 8 -44 21 31 46 -192 48 19 48 -7 -48 32 -32 -77 110 97 32 43 30 7 -2 76 21 -250 -5 -111 110 -56
7534e6J55o4n3J62p6k1k23J49pK44j45o2j7K7Qqm8J9O2m9J08j93K40j71J58j28
$$ -56 99 35 -18 144 68 47 -176 -27 -34 210 65 3 -14 13 21 13 -35 -16 46 -3 105 -88 152 -19 139 11
7560A1j93P7M3J76j66J90j78R6j03J2J15j09J4J72k07R9o4l8J36R3k09j3J2m1
$$ 11 -182 -105 -62 114 -52 138 -40 56 -47 -35 80 -29 -15 157 -50 49 -15 -53 83 176 -33 -46 -34 -75
7584g5K09J10l89K01q1Q4m8J81k20O0Oq2k7PJ17L0q5rpQm4N0q5J45j66j5R0q6
$$ -75 134 244 -145 56 -25 59 11 192 -28 32 38 -44 -71 -64 53 83 -2 -11 -18 -10 -54 -4 -89 56 -110 -125 -35 -121
7612a21J8J44j6M5o9p0L6P7J62j95O3rRJ3p1k8O7p2J6L4j10M5L2l6J10k1k15J96
$$ -121 -103 41 25 70 1 -69 -33 44 206 11 74 65 74 87 16 -12 55 -17 -1 33 -77 -32 0 -36 74 53 -162 34
7640C4J69j20j94J86P0j2k24J80j63J84n2j01k4Q8q0LJ40k42K32nl4q3J78j48
$$ 34 203 83 -111 75 145 133 -91 89 -74 110 58 -43 -67 21 -59 -56 84 -158 74 69 35 -48 130 -18
7664a8m4l4J49j77K4N4N2nJ11o2j5q1M5J80k79L1o3Q4l3L58l01j2M7O9k04J42
$$ -18 -62 -96 53 -124 -100 -46 6 1 112 50 35 -46 -1 179 -100 -69 -132 -48 -81 277 -24 -36 11 80 -124 18
7690A8J7o9Kj15K52j63j1q7K81j06P6j88Q2l4J91K8j11p4N5NP2j4j92J43k4M1
$$ 18 35 -34 -32 -147 105 -58 -69 -156 125 19 95 -93 -11 -45 146 174 63 -11 44 49 121 107 -85 58 34 75
7716G5l7l3Q3n5j7R9j56j82K63j03J91j26J4N7l3p5J9R5j01QM4PNm5R2P6l17K01
$$ 75 38 5 88 33 16 115 -41 -223 40 -63 128 2 16 73 40 -35 -16 79 -22 -14 30 37 42 -3 89 165 -152 49
7744D9M9k06K00k3Op9J05k18M2J10k9J92k57P0j8%p1O3J89k21k2J7K44j79Jk3
$$ 49 98 -108 92 69 75 -4 101 -117 -75 35 6 198 -59 11 -7 -7 -78 -15 174 -47 -69 -52 192 13 14 -9
7770io5m4M1Q0q8j8J43j37K31j32j15R8n2J6Q5n4j2m5Q0J76q7p1Q3p5k9n6J42
$$ -9 -74 -118 -77 3 -85 -103 40 -97 134 2 -113 -15 -67 -51 34 -20 -32 -77 3 179 92 21 104 29 0 -56 86
7797H6q9K8R6p1j66R0L3k7J51r8O9pq5K9J68j31j36N9K8n2J82k35J20m6J17r3
$$ 86 -3 25 121 50 -116 -26 7 -20 131 33 102 95 10 39 207 76 -60 -1 27 -25 157 -78 42 -4 113 20
7823B0N4j07P2n2K01r7q8p0L3q4J48l9J7k61J62K04P2j46o7Mp1K19j44K12k66
$$ 20 74 -33 39 -13 188 91 3 -67 -34 -118 30 -9 8 -253 -91 113 185 39 -28 -24 -95 124 -20 192 -74
7848g4J97j65K01l2q2l6j77J98Pm3k0J49p0j72L04l07O8J30j36q3J39P4j47K37
$$ -74 123 -42 159 127 45 9 -168 30 37 -6 -26 123 53 -119 185 -122 -54 76 -60 -143 -4 70 -77 160
7872A60k39M7l4O5n6P1r1K2j65L9J95J18r0J12k59L7K49j59J66j62j6q5J11L9
$$ 160 -79 -32 -66 -1 -57 14 -77 -55 -220 -181 14 132 42 154 -105 -68 181 22 188 26 10 -75 36 75
7896G5r9L6O3j65Q8N5K9j70N2j2J45M0j60K04j39K3J14k71L0J52r6pO5j26QP6
$$ 75 -24 12 75 -90 -2 53 82 -88 -36 -48 97 137 -23 181 42 65 179 -92 -62 90 -6 -13 52 -74 -66 10
7922A0K0j65J78O9k19j0J03J7R9j32N5L1q5p1m9J30J1N0m8j4K1Pj3R9m0j47PJ16
$$ 10 30 -135 43 112 -107 -117 -14 3 102 -30 25 56 -29 -100 -149 -19 -8 42 -6 -20 1 8 -5 94 54 -93 -86 30
7950C0N4j02j04m2J36j66K43K8L9j79n9J88p8J21k39RL28j38j82K36l6p5j09j4
$$ 30 84 -18 -122 -164 -28 -194 49 77 116 -63 -122 66 -12 109 -130 -121 207 69 -113 123 87 12 -97 -111
7974a11J82j55J74K9q6J3k6n3J01M8k20k9M0J18l8O3r2Q1j1k6J06j63M4q1J8J07
$$ -111 71 -84 90 119 33 46 20 -33 68 116 -104 -133 -93 25 -13 50 -42 39 28 2 108 -55 -11 -92 -74 33
8000C3k8K0M4J45k21J29k60L8M2J66j27LK04j78n4O9kPJ03k2m5N3m4k24P2N9L6
$$ 33 5 25 69 214 -7 122 -138 -100 -58 108 -19 -16 188 10 -44 25 23 30 133 111 66 119 75 -149 -77 -18 18
8027A8j53P1M5N1O4j91N1k5J3Q0j23J16J11j57J27Km9q9k20L64Qj13j26n6K59
$$ 18 -135 -64 -19 32 96 -95 -44 -69 -56 24 -99 17 128 -29 98 100 51 -38 -258 106 114 1 -125 -181 78
8052G8j81N2J46r3N2Oj50J93k13K25p1J7K8k34J06N2l4p8J41j2j60K27l8j06P3
$$ 78 -103 -51 95 2 54 60 -90 103 -110 115 44 61 89 -145 -39 13 -21 -99 42 30 -130 97 59 -47 26
8077B6k18K59r5L6n3J22Q2j57Jj81J47K3J78l32K76k65J25Q4m4j36K15r5o7p8
$$ 26 -192 67 -28 8 -45 77 159 2 3 -178 -31 -8 170 -162 114 -151 -26 58 14 -122 93 -2 -69 -147
8101a47J94j27R6l3J30j1L1j25j23J86k06N7Pl8Q0N7k19K66m3p2j41J43m9j1K12
$$ -147 47 -80 16 -17 113 102 133 8 -115 71 -135 -78 -71 -109 -29 28 -191 75 32 -40 -181 -38 -87 -98 114
8126A14k06j7J92j77%R5N1l5K9O7j63J43k05J23o3J46r9m5O8l3J83r4J69j52J4
$$ 114 -92 -109 83 -94 -94 1 52 17 46 113 -50 93 -112 11 -52 94 -5 -50 18 -15 168 74 243 91 105
8151A05j65J5J41K2m3j92O7P2j22J07r7K2M0o6k1N1M2O9j36O0QN5p4oqj41K65
$$ 105 -60 -45 96 118 75 -117 -50 22 -100 7 -90 -68 -28 -94 -115 -64 -22 47 -89 -29 -21 34 -40 -46 -54 -195 70
8178G0o6o1m4J7J29q7j47K86Qj81r4J12j59
$$ 70 4 -57 -101 -84 45 -42 -189 97 105 -76 -170 -58 -217
8191b17
$$ Imaginary data points
##PAGE= N=2
##DATA TABLE= (X++(I..I)), XYDATA
0@%%%%%%%%%%%%%%Kj0J6j6J6j7K5l2L4m2M9n7P0q0R1j06J22j38J55j79K03k28
$$ 0 0 0 0 0 0 0 0 0 0 0 0 0 0 0 2 -8 8 -8 8 -9 16 -16 18 -24 25 -32 38 -42 49 -57 65 -73 82 -97 106 -122
36a22K58k89L24l62M02m46M95n49O11o76P42q16R03r98J097j207J331j469J622
$$ -122 136 -153 171 -191 211 -235 260 -289 322 -354 388 -428 475 -523 574 -633 698 -771 851
55H51j794J990k212K471k776L135l572M119m821N764p105R181j2859K1370q0926
$$ 851 -943 1047 -1165 1306 -1470 1665 -1907 2212 -2609 3155 -3950 5231 -7628 13742 -67184
70f7184l4651Q0208J249L6420N5204N0788j3734l0779l2347k3627m3186m7377
$$ -67184 -101835 -21627 -20378 16042 71246 122034 108300 77521 45174 21547 -21639 -69016
82f9016l6275O018L2806L1951J7859L9409N3689K2998k6985k7905r589k2650n4188
$$ -69016 -105291 -99273 -66467 -34516 -16657 22752 76441 99439 72454 44549 34960 12310 -41878
95d1878m0227K782K3353J2196J5361L7981M8124K3439q809k0231j3395j9803m0999
$$ -41878 -82105 -79323 -55970 -43774 -28413 9568 57692 81131 72322 52091 38696 18893 -22106
108b2106m4398j4454J3970J4683R153K6695M8028L6879L719j0615m254j0459l4941
$$ -22106 -66504 -80958 -66988 -52305 -43152 -16457 31571 68450 72169 61554 57300 46841 11900
121A1900m4716k3225L95N79l525J4214L7102L4077J1434K083P710L655j8172l1695
$$ 11900 -32816 -56041 -55646 -55067 -58592 -44378 -7276 26801 38235 40318 48028 51683 33511 1816
135A816k1279n243m245j0061j453J9154K5233J1161J61P773J1912m858k2286j5964
$$ 1816 -19463 -24706 -28951 -39012 -40465 -21311 3922 15083 15244 23017 34929 30071 7785 -8179
149h179r46k675j2864o212J2208J6651N998J209Q930J2034R80j1571j0761k712
$$ -8179 -9125 -11800 -24664 -30876 -18668 -2017 3981 5190 14120 26154 27134 15563 4802 2090
163B090l049j2433j2875Q85J0435L416k439P569J8475J0207l462j908N889P76
$$ 2090 -959 -13392 -26267 -25382 -14947 -11531 -13970 -6401 12074 22281 18819 16911 22800 23576
177B3576j3228j5947o171j208o554r046J168J2935J2581M664M790J2413J1223
$$ 23576 10348 -5599 -11770 -12978 -19532 -28578 -27410 -14475 -1894 2770 7560 19973 31196
190C1196l647j3124o831k611j0727j7318o846P325P581K283O374J6120J4815K327
$$ 31196 27549 14425 7594 4983 -5744 -23062 -29908 -22583 -15002 -12719 -6345 9775 24590 26917
204B6917o517m761k594j0283j8427j2281K022O638J599M519J7483J9519O593m175
$$ 26917 20400 15639 13045 2762 -15665 -27946 -25924 -19286 -17687 -13168 4315 23834 30427 26252
218B6252k202j230j1972k1377j6905m053J291k27L523J6454K3639J4656K381K181
$$ 26252 24050 22820 10848 -10529 -27434 -31487 -30196 -30423 -26900 -10446 13193 27849 30230 32411
232C2411M070o385k2035k1774r410m013p863m021J1816K1980J6101P391P696R434
$$ 32411 36481 30096 8061 -13713 -23123 -27136 -34999 -39020 -27204 -5224 10877 18268 25964 35398
246C5398J441j4494k0135j1609n557j0198j0467L360J7876J5711O030P564J3156
$$ 35398 36839 22345 2210 -9399 -14956 -25154 -35621 -32261 -14385 1326 7356 14920 28076
259B8076O755r625j6895j0357n831j0860j2765j723J2939J4728P301P062J4230
$$ 28076 34831 25206 8311 -2046 -7877 -18737 -31502 -33225 -20286 -5558 1743 8805 23035
272B3035J1842l196j4278j0812m854j0861j7319q415P196J1061N406O022J4972
$$ 23035 34877 31681 17403 6591 1737 -9124 -26443 -34858 -27662 -16601 -11195 -5173 9799
285I799J6385M400p313o401j929p975j6910j3780j01N846P59N58J0545J6575Q563
$$ 9799 26184 30584 23271 16870 14941 6966 -9944 -23724 -23825 -17979 -17220 -16662 -6117 10458 19021
300A9021k681j862L222k003j2706j3638l348K832k048m210M733J3660R311k88
$$ 19021 16340 14478 17700 15697 2991 -10647 -13995 -11163 -13211 -17421 -12688 972 10283 9995
314I995n44N333K747q339j2300n445J182l521p320M11J0546R673K182J513P501
$$ 9995 9451 14784 17531 9192 -3108 -8553 -7371 -10892 -18212 -17801 -7255 2418 4600 6113 13614
329A3614P169l183r967o130j235n022j0806n920M757P678K184J512R314J1995
$$ 13614 20783 17600 7633 1503 268 -4754 -15560 -21480 -16723 -9045 -6861 -5349 3965 15960
343A5960L662m937l080N26m164j1966j0340j206K586r91j018O963J2429P715K6
$$ 15960 19622 14685 11605 12131 7967 -3999 -14339 -15545 -12959 -13950 -14968 -8005 4424 12139 12165
358A2165K01L344m16r290j1344m602J03l454m060L858J1141Q633K231K328N522
$$ 12165 12366 15710 15294 6004 -5340 -9942 -9839 -13293 -17353 -13495 -2354 6279 8510 10838 16360
373A6360K190p389j0766o204k775n114o247P39R195R605M917M421Q122N907l424
$$ 16360 18550 11161 395 -5809 -8584 -13698 -19945 -19206 -10011 -406 4511 8932 17054 22961 19537
388A9537r696p230m499p689r944l966N379P518M921N544J0314R890J623n209n067
$$ 19537 9841 2611 -1888 -9577 -19521 -23487 -18108 -10590 -5669 -125 10189 20079 21702 16493 11426
403A1426l611p288j1530p746M47L937K284L438R343J1212M925j820k042o87n172
$$ 11426 7815 527 -11003 -18749 -18302 -14365 -12081 -8643 700 11912 16837 15017 12975 12288 7116
418G116j0676r141k156J625K98R81P520J1034O450K97M4J174k866r693r970m239
$$ 7116 -3560 -12701 -14857 -13232 -12934 -11953 -4433 6601 13051 13348 13392 14566 11700 2007 -7963 -12202
434a2202p78k138j411N587J0135P940L007K579L987O80p020r727n418k601n083
$$ -12202 -12980 -15118 -16529 -10942 -807 7133 10140 12719 16706 17386 10366 639 -4779 -7380 -12463
449a2463n278J130P502P290L017M297O796M748k851o803m027k368n425p355l068
$$ -12463 -17741 -16611 -9109 -1819 1198 5495 12291 17039 14188 7385 3358 990 -4435 -11790 -14858
464a4858L883M888J621K398O958P171L18m251k233l09m379q021m857J476K893
$$ -14858 -10975 -6087 -4466 -2068 4890 12061 12379 8128 5895 5586 1207 -6814 -11671 -10195 -7302
479g302M79Q79O200P849L040j971j166J021k643p693p172j251J187j517j376M824
$$ -7302 -6823 -5944 256 8105 11145 9174 8008 9029 6386 -1307 -8479 -9730 -8543 -10060 -11436 -6612
495f612Q405N190O23J361L280J44n927p504l225j156l684m570J200O839N353J629
$$ -6612 1793 6983 7606 8967 12247 12391 6464 -1040 -4265 -5421 -9105 -13675 -12475 -5636 -283 1346
511A346K548O086L577k787n525l224j328m406o537k134L407M508J338J837O088
$$ 1346 3894 9980 13557 10770 5245 2021 693 -3713 -10250 -12384 -8977 -4469 -3131 -1294 4794
526D794O297J34m201k298k44l937p576m550J787L038K49J638O115P285K537j571
$$ 4794 11091 11225 7024 4726 4482 545 -7031 -11581 -9794 -6756 -6507 -4869 1246 8531 11068 9497
542I497j302K3l076p567o806j517J317m53o14N026Q627N295O37P08K397j179o579
$$ 9497 8195 8218 5142 -2425 -9231 -10748 -9431 -9884 -10498 -5472 3155 8450 9087 9795 12192 11013 4434
559D434p195l638j578k567k391K220O723O124K466K161M185K060l673o582m087
$$ 4434 -2761 -6399 -7977 -10544 -12935 -10715 -3992 2132 4598 6759 10944 13004 9331 2749 -1338
574a338j740l666m715l97M968M787K658K574M955L892j672m742l397k277l924
$$ -1338 -3078 -6744 -11459 -11856 -6888 -2101 557 3131 8086 11978 10306 5564 2167 -110 -4034
589d034n324k718K597M192K410K581N537N385R61k782k881j639l800o731m432
$$ -4034 -9358 -12076 -9479 -5287 -2877 -296 5241 10626 11587 8805 5924 4285 485 -6246 -10678
604a0678k19K300J252J862N070O911L241k45o86j15k749o066n529k407k3p11k75
$$ -10678 -10897 -8597 -7345 -5483 -413 6498 9739 9494 8808 8693 5944 -122 -5651 -8058 -8081 -8792 -9067
621i067L493O014M281J510P42K024o15m038n488k811r24k210k117J681M713M037
$$ -9067 -5574 440 4721 6231 6973 8997 8382 4344 -1144 -3955 -4879 -7089 -9206 -7525 -2812 1225
637A225J705J920K951J571k907m340k742j998k776l430k88L228L834J763K166
$$ 1225 2930 4850 7801 9372 6465 2125 -617 -2615 -5391 -8821 -9109 -5881 -2047 -284 1882
652A882M180L323q16l188j873j766l777m625k384J215K091J084J696M652M410
$$ 1882 6062 9385 8569 5381 3508 1742 -2035 -6660 -9044 -7829 -5738 -4654 -2958 1694 6104
667F104J902j063q56k29k565m940m148o71L66n45J15L643M897K589N93N60J502
$$ 6104 8006 6943 6087 5858 3293 -1647 -5795 -6466 -6100 -6645 -6530 -2887 2010 4599 5192 5752 7254
684G254j210m037m270j613l88k001j380K285M374L062R71J623K501O65l054m036
$$ 7254 6044 2007 -2263 -3876 -4264 -6265 -7645 -5360 -986 2076 3047 4670 7171 7836 4782 746
700G46k121j391k881k547N56L416L176J535K328L458K612j339l228k144j395l579
$$ 746 -1375 -2766 -5647 -8194 -7638 -4222 -1046 489 2817 6275 8887 7548 4320 2176 781 -2798
716b798m150j581J756K114J064K093M353M457M96j654j073o42k873m814l273J91
$$ -2798 -6948 -8529 -6773 -4659 -3595 -1502 2851 7308 7804 6150 5077 4435 1562 -3252 -6525 -6334
732f334P50o0Q70L811M643K151l91J21M86j753m268l816j154j94p19l99K603M806
$$ -6334 -5584 -5644 -4774 -963 3680 5831 5440 5561 6047 4294 26 -3790 -4944 -5138 -5857 -6256 -3653 1153
750A153K603P82R60J304l16l697m041k016r31j801j753J342M134L128J616J732
$$ 1153 3756 4538 5498 6802 6486 2789 -1252 -3268 -4199 -6000 -7753 -6411 -2277 851 2467 4199
766D199K618J384k398l540k325j552k537l155m79K271K991J657J955L321K860
$$ 4199 6817 8201 5803 2263 -62 -1614 -4151 -7306 -7785 -5514 -2523 -866 1089 4410 7270
781G270l38k181j820j242k698l623k004P72J889O26J485L231L426J170j039q80
$$ 7270 6932 4751 2931 1689 -1009 -4632 -6636 -5864 -3975 -3349 -1864 1367 4793 5963 4924 4044
797D044n57k055l448l118j70Q62N2M90K685L836K132K25j13J62j068l392l357
$$ 4044 3487 1432 -2016 -5134 -5304 -4442 -4390 -3900 -1215 2621 4753 4978 4865 5027 3959 567 -2790
814b790j547l05o35n22J824L563K712J219Q44J409J87k301l054k013j312j499
$$ -2790 -4337 -4642 -5277 -5799 -3975 -412 2300 3519 4363 5772 5959 3658 604 -1409 -2721 -4220
830d220j888N09K311K448J455J594K106J660p99k092j917j251k129k247j066J168
$$ -4220 -6108 -5599 -3288 -840 615 2209 4315 5975 5176 3084 1167 -84 -2213 -4460 -5526 -4358
846d358J596J136J405K572K404M13j096j205o72k158k764k009O5J031Q2J413K478
$$ -4358 -2762 -1626 -221 2351 4755 5168 4072 2867 2195 37 -2727 -4736 -4671 -3640 -3558 -2145 333
863C33K757J467r6j31k87j624k892k741q89j84m53J89K268K941K005O27J329P41
$$ 333 3090 4557 4461 4330 4043 2419 -473 -3214 -4103 -4287 -4740 -4551 -2283 658 2663 3290 4619 5360
881E360o02k518k526j665j139j562q92J064K585J959J400J408J825O47j286k199
$$ 5360 4758 2240 -286 -1951 -3090 -4652 -5544 -4480 -1895 64 1464 2872 4697 5344 4058 1859
897A859j653j296j973j756j93J502J718J014J592K684J414l06j203j420j194k120
$$ 1859 206 -1090 -3063 -4819 -5012 -3510 -1792 -778 814 3498 4912 4606 3403 1983 789 -1331
913a331k430r51M79J117P57J428K544K184Q89o41l68o02k141k759k067m02K74
$$ -1331 -3761 -4712 -4233 -3116 -2359 -931 1613 3797 4686 4045 3677 3075 934 -1825 -3892 -4294 -4020
930d020j05P53K470K732J730K88L36L24j206k667k488j005n57p93l45J749K308
$$ -4020 -4125 -3372 -902 1830 3560 3848 4184 4508 3302 635 -1853 -2858 -3415 -4208 -4553 -2804 -496
947d96J842J132Q67J070n4j843k166j353j021j310j287O30K093J379J181J419
$$ -496 1346 2478 3345 4415 4361 2518 352 -1001 -2022 -3332 -4619 -3989 -1896 -517 664 2083
963B083J618Q58r22j927j122j221j600j851l72J269J199R69J122K257J692Q3q59
$$ 2083 3701 4559 3637 1710 588 -633 -2233 -4084 -4456 -3187 -1988 -1019 103 2360 4052 4135 3276
980C276j067q14j691k370j393M27N89L26J122J854K341R35l7j65k98j246k111
$$ 3276 2209 1395 -296 -2666 -4059 -3632 -3043 -2717 -1595 259 2600 3535 3498 3333 3035 1789 -322
997c22j895o57l27k95K51J463K255J615M43N37M19l90j821j661j300p03o42o26
$$ -322 -2217 -2874 -3201 -3496 -3245 -1782 473 2088 2531 3068 3487 3097 1276 -385 -1685 -2388 -3030 -3656
1015c656Q63J965J231J095O84J150M20j073j788j180q68j166j250j30J240J112
$$ -3656 -2793 -828 403 1498 2182 3332 3752 2679 891 -289 -1157 -2323 -3573 -3703 -2463 -1351
1031a351J276J159J579J097k33j139q43j250j263j682q45K20R02O66R31J982J414
$$ -1351 -75 1084 2663 3760 3527 2388 1545 295 -968 -2650 -3495 -3275 -2373 -1707 -776 1206 2620
1048B620O08l14k88n37j419j644j555m29R4J34N48J428J728J308K51L78J0p65
$$ 2620 3228 2914 2626 2089 670 -974 -2529 -2958 -2864 -2730 -2182 -754 974 2282 2533 2911 2921 2156
1066B156j602j739q18p15r0k09J175J470J374P61P46P66m05j054j528j083q55
$$ 2156 554 -1185 -2003 -2718 -2808 -3017 -1842 -372 1002 1763 2509 3275 2870 1816 288 -795 -1650
1083a650j005p29L84J231J383R25R73J324N32n09j149j030j210j052j217n06P44
$$ -1650 -2655 -3384 -3000 -1769 -386 539 1512 2836 3368 2859 1710 680 -530 -1582 -2799 -3305 -2561
1100b561P58Q81J241J296J034L40n84o24p36j193j670r68o4L21N80Q05J468J440
$$ -2561 -1803 -922 319 1615 2649 2989 2405 1781 1045 -148 -1818 -2786 -2850 -2529 -1949 -1144 324 1764
1118A764O25J34J4m43j061j354j341p92r6J5K27J455J329J240M65M13K13n75j261
$$ 1764 2389 2523 2537 2094 1033 -321 -1662 -2454 -2550 -2535 -2308 -853 476 1716 2181 2594 2807 2232 971
1137I71j519r22n84o23K5M81J370J000J009P71P73j95m37j247q33j009r79p61
$$ 971 -548 -1470 -2054 -2677 -2652 -2171 -801 199 1208 1979 2752 2557 2120 873 40 -969 -1948 -2709
1155b709K7Q64R92Q70Q84J133O15j70o79p94q48q73j218o38K63N52M38R09J371
$$ -2709 -2682 -1818 -826 44 928 2061 2676 2506 1827 1033 185 -688 -1906 -2544 -2281 -1729 -1291 -382 989
1174I89J111K54j54k44n69j250j186p68m39P5L32M71J192J168P97L54L18l90o89
$$ 989 2100 2354 2200 1956 1387 137 -1049 -1817 -2256 -2181 -1849 -1378 -186 982 1779 2133 2451 2061 1372
1193A372j125j232o77l73k57J47P30J223R31P95M47L74o0j030q74r48q88n24l86
$$ 1372 247 -985 -1662 -2035 -2292 -2145 -1415 -192 739 1534 1981 2355 2295 1265 391 -557 -1445 -1969 -2355
1212b355K08R89Q77Q97N79P78L61l00q62r19n30r60q06m09M29O55R12Q30R51O78
$$ -2355 -2147 -1158 -281 616 1195 1973 2334 2034 1172 253 -277 -1237 -2043 -2452 -2023 -1368 -456 374 1325 2003
1232B003J54l32m58p13j155r18o01o5L08M99O18R67Q97O28J42r8l00p76j185j148
$$ 2003 2157 1825 1367 654 -501 -1419 -2020 -2085 -1777 -1278 -660 307 1204 1832 1974 1876 1576 800 -385 -1533
1252a533l34r1r7N35P48J123P31M03N30Q7n29j201o04r96l01l94j12O70O56J022
$$ -1533 -1867 -1958 -2055 -1520 -772 351 1082 1485 2015 2102 1573 372 -232 -1228 -1529 -1923 -2035 -1365 -709 313
1272C13N65P04L77Q6p05p14p31q94n99l44P8K64R92J038L23N51P36k10o23m04
$$ 313 878 1582 1959 2045 1340 626 -105 -999 -1598 -1942 -1864 -1600 -608 430 753 1304 2040 1830 1207 803
1292H03q93p60p26k76p3N38N30Q62Q32O60K90n3m43n47p86r90m90k84K95J24M95
$$ 803 -90 -850 -1576 -1852 -1925 -1387 -857 5 837 1497 1787 1734 1291 744 -42 -1032 -1522 -1806 -1511 -1387 -892
1313h92R43O87N15N28p7k99m83o52q13p73j67k07K72O93P43O88L87L46L10k60
$$ -892 51 738 1253 1781 1704 1405 922 270 -543 -1316 -1483 -1690 -1418 -725 18 706 1093 1439 1749 1489
1333A489m05p47r52o06k85k09K83N09Q57P11L47P20O3k91m95o69q42m74o32oM65
$$ 1489 1084 337 -615 -1221 -1506 -1715 -1432 -923 -66 645 992 1712 1775 1484 989 320 -522 -996 -1628 -1634 -1169
1354a169K75N16P95O33M66J31j67n90o00p56o65m01L3N3O42M93N06Q75L34K20
$$ -1169 -894 -378 417 1050 1516 1647 1480 890 290 -466 -1131 -1532 -1499 -1446 -804 -311 195 1070 1404 1624
1374A624k69l75o91n78o53n91k8J42M03N22R43M94M96N1n3k35n91q72o02n73j30
$$ 1624 1355 980 289 -289 -942 -1533 -1561 -1419 -1016 -494 449 943 1439 1490 1437 1202 611 -261 -863 -1436 -1566
1395a566J74M70M99P31O03K47K03J50l46p29p99m10m95j83n6N13L86O60O63N54
$$ -1566 -1392 -922 -423 308 911 1158 1361 1511 1165 436 -363 -773 -1268 -1451 -1507 -994 -608 52 715 1269
1415A269J75j42r0o74n48q40l69m4j65L37N81N89N66N43J59k4j73n26n32p53l94
$$ 1269 1444 1302 1212 538 -10 -850 -1219 -1263 -1428 -1091 -510 79 645 1188 1347 1323 1150 624 92 -661 -1055
1436a055k82N6J98M18N95P73M49K50n6l86l44n95n03k61n53q4N28J70M49P43N20
$$ -1055 -1337 -1281 -1083 -665 -70 703 1152 1402 1346 960 616 21 -482 -743 -1296 -1380 -852 -682 -233 510 1030
1457A030L02L8k70l51n84o70n27k28R4J7K94P25O97K94M82k17p3k76o91o38m29
$$ 1030 1332 1370 1100 749 165 -505 -1032 -1260 -1166 -1149 -855 -130 567 861 1343 1126 1053 777 86 -552 -981
1478i81j47j26M8N32N60M86N21K14J19nn12o94m92m17k48p7K14J85O11P01J35
$$ -981 -1128 -1254 -1206 -674 -114 372 893 1107 1226 1221 709 15 -477 -894 -1142 -1219 -1005 -820 -209 492 627
1499F27N70R6j48n57k73l74p44l27j25K70K71M26P64J12L83J71k39l05j82o44
$$ 627 1197 1293 1145 588 315 -59 -803 -1130 -1255 -985 -714 -288 476 588 971 1142 903 598 416 -228
1519b28n56j71j14j1L91J59P74L48M18O1k81qn07l57n78k72j93K75LN85M70K92
$$ -228 -784 -955 -1069 -1080 -689 -530 244 592 1010 1071 790 782 275 -82 -660 -932 -1125 -850 -847 -262 208 500
1541E00L85J3J8n6m50n51n97j66j93Q3J27M83N15L83K58J42O8j49n07k99m16m01
$$ 500 885 898 916 860 410 -141 -738 -904 -1097 -1014 -887 -404 111 494 752 894 962 813 306 7 -409 -810
1563h10k42P7K32K95M22L50M42K61M9l02l30k95n45m61k4q8J48M58L10N29N5L98
$$ -810 -1052 -975 -743 -448 -26 324 766 1027 1076 774 444 149 -396 -857 -881 -969 -821 -363 -53 476 531 929
1585I29k26nl18k71l74m66j29j06k1L56N93L61N13P5J33j01l06m09m38n15k16
$$ 929 703 698 380 109 -265 -731 -860 -966 -987 -631 -38 323 836 911 1044 943 637 228 -210 -725 -941
1606i41O4O0K12N82L18K40K85J5M2k52n44l64k83j1m93J97M45K92K14M10L50J43
$$ -941 -877 -817 -605 -23 295 535 820 835 877 625 81 -283 -566 -577 -1070 -873 -428 -136 78 488 838 981
1628I81j21l26o37L0o82r9OM8L56L48J50M79L80M8k87m53l6k76o65j71J79j1J57
$$ 981 860 534 -103 -73 -755 -854 -848 -800 -444 -96 54 533 913 961 674 221 185 -91 -756 -927 -748 -759 -602
1651f02J72N34L71L47R4n6k04n27m32j94k05kq1O6N02M46K21K48R5L6k05l92m07
$$ -602 -430 104 475 822 916 860 656 129 -303 -497 -702 -704 -785 -719 -217 229 450 698 793 829 624 232 -175
1674a75k39k32k66jK80L36N49K18J25K52J1k65m60l61m6l12k22lL25K49K27K25
$$ -175 -414 -646 -912 -913 -633 -297 252 470 595 847 858 593 133 -228 -274 -586 -808 -811 -486 -237 -10 215
1696B15L26J00J41l78l93j01j27l36l39K88P6J83K65K62L45K81j16r2l54j90l56
$$ 215 541 641 782 404 11 -90 -217 -553 -892 -604 -528 -345 -80 182 527 808 692 600 246 56 -300
1717c00m72K3J77o4M23J83L37K66K33k28j6k19k38n44r0r7k19J88K87M60J54K37
$$ -300 -772 -749 -572 -636 -213 -30 307 573 806 578 562 343 105 -439 -529 -626 -845 -657 -370 90 244 481
1739D81l7L77k50o2n34k9m99j90R0J56J57L99K25J80J19J86j86k86j43m33p6k29
$$ 481 444 821 571 509 -25 -54 -553 -743 -653 -497 -340 59 284 464 583 769 583 297 154 -279 -355 -584
1761e84m21L70K64L61J61K49L61j26j99O7m24j95l04k68L9K01J97J0K42M71R7
$$ -584 -1005 -635 -371 -10 151 400 761 635 436 503 79 -116 -420 -688 -649 -448 -251 -241 1 472 569
1782E69j03J92j72l64k74k73j42J3J7J48P0N19K99k1P7j01K6l34k58j43l14q7
$$ 569 466 658 486 122 -152 -425 -567 -554 -537 -389 -319 200 499 478 555 454 480 146 -112 -255 -569 -656
1804f56j0L08J61M47J8J22L58j79k27k48j79M6m00j11J2L07m8M12R2K65K52k06
$$ -656 -666 -358 -197 250 268 390 748 569 342 94 -85 -39 -439 -550 -538 -231 -279 133 225 490 742 536
1826E36j52k89j15k60j68l11K53K3L05J00J38M75r1j19K5j22p2m32k14l2R0R0
$$ 536 384 95 -20 -280 -448 -759 -506 -483 -178 -78 60 535 444 325 350 228 156 -276 -490 -522 -432 -342
1848c42jK59L88J31k9J32j23l29k39j53j06p4n5N5J57M63J59o7L36J23j54k92
$$ -342 -343 -84 304 435 406 538 415 86 -153 -306 -412 -486 -541 -486 -329 134 293 226 562 685 531 239
1870B39k97l5j43k39j86J77K69J94Q3J80J41K85k30p6m15j75k05j38J33pK96J88
$$ 239 -58 -93 -236 -475 -661 -484 -215 -21 62 242 383 668 438 362 -53 -228 -433 -571 -438 -445 -149 39
1892C9M1J95L75j49k08r2j85k5k85r4M6k0O3J44K76J27N8J42j42p1M3l81j44k98
$$ 39 80 275 650 501 293 201 16 -9 -294 -388 -342 -362 -299 -155 121 248 306 448 306 235 278 -103 -247 -545
1916e45N0J83r3K30K07M85k64L0K68l80k56kk31O8p0j86K39J8M77j13K97J72j91
$$ -545 -495 -312 -405 -175 32 517 253 283 551 171 -85 -87 -318 -250 -320 -506 -267 -249 228 115 412 584 393
1939C93j14P3l77j64o8j68n2M7L32L01r4M4L90k37J6k91J00l96j20j79J81R5K03
$$ 393 279 352 -25 -189 -257 -425 -477 -430 -98 203 109 153 543 306 322 31 131 -265 -385 -564 -383 -288 -85
1962h5o6L25K72nj19l5J53n53o3j11j59R9P5J20J71J16K00O5L5l5r1j55j23m47
$$ -85 -151 174 446 441 322 287 440 -113 -176 -287 -446 -347 -272 -152 19 135 335 400 435 400 309 154 31 -416
1986d16J46k01J58O0K45K67j96M54k18J33m68j15K8j20m8m9o5K64J41K33l8J59
$$ -416 -270 -471 -313 -253 -8 259 63 517 299 432 -36 -151 -123 -243 -291 -340 -405 -141 0 233 195 354
2008C54J08j56k91o9R6l24j76K3K79J54n3J93Q9p8K74m7k98J21l47k8m0k02R3
$$ 354 462 306 15 -54 42 -282 -458 -435 -156 -2 -55 138 227 149 423 376 78 199 -148 -176 -216 -418 -325
2031c25l4K82K24J1K47M4j68P6j87n8n17P9P9j84K26J55Q1K58m9j9P5j36K0m37
$$ -325 -359 -77 147 158 405 449 281 357 170 112 -405 -326 -247 -431 -205 -50 31 289 240 221 296 160 180 -257
2055b57K27j93k01L4M5J83J92J12J87O9q7o0k44l6m8k19J36k40J88R3J61K64q
$$ -257 -30 -223 -424 -390 -345 -162 30 142 329 398 311 251 7 -29 -77 -296 -160 -400 -212 -119 42 306 298
2078B98J78k20q2L2j72j76j95j03J23J75J4J60J27J48r9J74l13L3Kj44l29J27
$$ 298 476 256 174 206 34 -142 -337 -440 -317 -142 -128 32 159 307 208 382 69 102 104 -40 -369 -242
2100b42j12N6OL92J65j10J89k8n7Ol42o4j71L5m5p0K67k5K59K22j74J88j52j44
$$ -242 -354 -298 -292 100 265 155 344 316 259 265 -77 -141 -312 -277 -322 -392 -125 -150 109 331 157 345 193 49
2124D9n2J2k71q0P5mQ4J80J01Q3r9L90k82n2j37n2j08l65J66J10N5K01Q2J46N9
$$ 49 -3 9 -262 -342 -267 -271 -187 -7 94 177 78 468 186 134 -3 -55 -163 -528 -362 -252 -197 4 86 232 291
2149B91n4O5k51n7m7k47k5J2J28m8O8L21k9J33j07R9k5j81M9k42j57O3N8N4o7
$$ 291 237 302 51 -6 -53 -300 -325 -313 -185 -233 -165 156 127 260 153 252 227 46 95 -147 -304 -241 -183 -129 -196
2174a96J67J77K8O6Q7J1k14k02n4K4k21R3J9K36l2n0K30J68l8k4k41l18L60k46
$$ -196 -29 148 176 242 329 340 126 -76 -130 -106 -327 -234 -215 21 -11 -61 169 337 299 275 34 -284 76 -170
2198a70j97R5j24L86n3K72Q0r2J35j36l8o5j19k45K48k37O6JJ39qK17J77j1q6
$$ -170 -367 -272 -396 -10 -63 209 289 197 332 196 158 93 -26 -271 -23 -260 -194 -193 -54 -62 155 332 321 235
2222B35j31Mj01k01Q3k24J05J01K8K99j5J93k03K16k63j2k75J09q3j21n5K05q5
$$ 235 104 108 7 -194 -111 -335 -230 -129 -101 198 183 376 173 389 126 114 -161 -52 -135 -256 -311 -106 -191
2245a91K14J66l9O9O9j54l5j09j63m7n0J76p8K03p1K10OJ14j03q7j32P3j20j91
$$ -191 23 189 150 219 288 134 99 -10 -173 -220 -270 -94 -172 31 -40 170 176 290 187 100 -32 41 -79 -270
2269b70J56k63K69J2l2J09K29J3j56J11r0k5k15r1R1L5nj08J32J04K04lp1Q0j34
$$ -270 -114 -377 -108 -96 -128 -19 210 223 67 178 88 63 -152 -243 -152 -117 -122 -230 -98 6 210 207 136 216 82
2294H2j04j37j07J83l09J78J14J47J50k4M4M4Nj97M4k78J43k14o6J94K5K00J11
$$ 82 -22 -159 -266 -83 -392 -214 -100 47 197 173 217 261 266 69 113 -165 -22 -236 -302 -108 -83 117 228
2317B28K3q2P5Q6k16M0k25M2j01rl3Q4P4K1J10J64j04L4N6j86j45j06l8Q7j17
$$ 228 251 169 244 330 114 154 -71 -29 -130 -139 -172 -88 -14 7 117 281 177 211 267 81 -64 -170 -208 -121 -238
2342b38J56R1J26J21j35M7P3r5Rl49N7J13j41N1k5M7K48r8n2J25q8L3L0l20m5
$$ -238 -82 9 135 256 121 168 241 146 155 -194 -137 -24 -165 -114 -139 -92 156 58 6 131 43 76 106 -214 -259
2367b59J78j33M5%L7J0K09J54M5r8r3L0l25K94j25k81J49J66j7MJ84j77Q3J45
$$ -259 -81 -214 -169 -169 -132 -122 87 241 286 188 95 125 -200 94 -31 -312 -163 3 -14 -10 174 -3 80 225
2391B25l4j86K9M2j55k5k0j05R3l1K99o5J0O1m7J63k81r0K6l4o2J01j57J05K8
$$ 225 191 5 34 76 -79 -104 -124 -229 -136 -167 132 67 77 138 91 254 -27 -117 -91 -125 -187 -86 -243 -138 -110
2416a10L65o0m6j43M5j54O6j1j01Kk10M00j22J86q9O8M3Rj30J56j73k69K07j11
$$ -110 255 195 149 6 51 -103 -37 -48 -149 -147 -357 43 -79 107 18 86 129 138 8 164 -9 -278 -71 -182
2440a82j54L09Q5j46L27k07J06p9p5J65o2j39k37J76RL7J21pJ61q4ok0N0j68J71
$$ -182 -336 -27 58 -88 239 32 138 59 -16 149 87 -52 -289 -113 -104 -67 54 47 208 124 118 98 148 -20 151
2465A51j78J6j53O9J64j84P0O3K0P9O7m9k17M8p6J2r4j6J40l7L8K13J12j34Pj26
$$ 151 -27 -11 -164 -95 69 -115 -45 18 38 117 184 135 -82 -34 -110 -98 -192 -208 -68 -105 -67 146 258 124 131 5
2491EJ48j42O4k78P8n6M9K33j43J60J6ok9j26J01j8r0j68j30Q4J27r5K33n7J20
$$ 5 153 11 75 -203 -125 -181 -132 101 -42 118 134 128 99 -27 74 56 -34 -202 -332 -248 -121 -216 17 -40 80
2516H0K8p8r4J06j8m5o7p7K11j42J1J15K4Q1P0n7k1P8r6o7l77J34J7O3K8R4J6
$$ 80 108 30 -64 42 24 -21 -88 -165 46 -96 -85 30 54 135 205 148 127 205 109 42 -335 -201 -184 -121 -93 1 17
2543A7J48j25L4l6K9j94J63k17r9J04p6K54k38J88J61R0j95J26l0j96J16J16j22
$$ 17 165 40 74 38 67 -127 36 -181 -280 -176 -252 2 -236 -48 113 203 8 134 104 -92 24 140 18
2566A8j41L1l8j5J36J28J09K9k29N4j06L0j1Kj9j95K11r3J00Q6J99q4K8k03J76
$$ 18 -123 -92 -130 -145 -9 119 228 257 28 82 -24 6 -5 -3 -22 -217 -6 -99 1 87 286 202 230 27 203
2591B03j94o7LRk62L75m8o8R5j06R2j27K02n7o2o6R1m3M7l9m2J89j88K55j13O0
$$ 203 9 -58 -55 -46 -308 67 19 -49 46 -60 32 -95 107 50 -12 -78 13 -30 17 -22 -64 125 -63 192 79 139
2617A39O7P5n3j80j11k09L31k82L51k30K15J37o2k25Q0j71O7J04j66m8j42J77
$$ 139 206 281 228 48 -63 -272 59 -223 128 -102 113 250 188 -37 43 -128 -61 43 -123 -171 -313 -136
2639a36J1R1O3J2k6qJ0J18j1k32K7M1k31K50P9j48O5J39j72J18M5J5j76m1n5M9
$$ -136 -125 -34 29 41 15 7 17 135 124 -108 -81 -40 -271 -21 58 -90 -25 114 -58 60 105 120 -56 -97 -152 -103
2665a03J19j84Q8P8k6N1qJ46j19J07q6k18j0J13J6j40J24P0j28J88L1K0m3n5J49
$$ -103 16 -168 -80 -2 -28 23 15 161 42 149 63 -155 -165 -52 -36 -176 -52 18 -110 78 109 129 86 31 180
2690A80r5j32k2j80R7J40q2J18Q8pk2j09K20n6j85l2R7l6j05J29J59q0j34J3J16
$$ 180 85 -47 -69 -249 -152 -12 -94 24 112 105 83 -26 194 138 -47 -79 18 -18 -123 6 165 85 -49 -36 80
2715H0N0q2K9Q3k13J17lo4L5j16J04o6R2N6m1J28q2l6j64j73J35pjl5K11q4K51
$$ 80 130 48 77 160 -53 64 61 -3 32 -84 20 -46 46 102 61 189 107 71 -93 -266 -131 -138 -139 -174 37 -47 204
2742B04k06J43J51k76n9J62M8j77j25lRJ45m6K23m3j47J24J8j82R7r4j38Q6k9
$$ 204 -2 141 292 16 -43 119 167 -10 -135 -138 -129 16 -30 193 150 3 127 145 -37 60 -34 -172 -86 -115
2766a15K25k93J83K08j35J81j58n7J3M8p7j21J08j22J45j06pp3K60L4Oq2K6J5
$$ -115 110 -183 0 208 73 254 96 39 52 100 23 -98 10 -112 33 -73 -80 -153 107 141 147 65 91 106
2790A06o3r3J3P7k19J75j46J39L2j59K59J48j82m1j54K36k46l4k2J43KK28Q2j43
$$ 106 43 -50 -37 40 -179 -4 -150 -11 21 -138 121 269 87 46 -108 128 -118 -152 -174 -31 -29 199 281 138
2814A38J04j99M9o0j66p1L03k09M3j6N0l7K35o7j74L04q2M1j73j32M8o7J09j21
$$ 138 242 43 92 32 -134 -205 98 -111 -68 -84 -34 -71 164 97 -77 227 145 186 13 -119 -71 -138 -29 -150
2838a50P4J39j20J47J22j32J04k68o4rO0n9J06Q3o8q0J67k5P0q8P6M1j96O8j66
$$ -150 -76 63 -57 90 212 80 184 -84 -148 -157 -97 -156 -50 33 -35 -115 52 27 97 9 85 126 -70 -2 -168
2863a68J27l3M8J66l7n6J20m7j32J21j63J64j01k35J24M4o2J96l00K82J15j04
$$ -168 -41 -74 -26 140 103 47 167 120 -12 109 -54 110 9 -226 -102 -58 -120 76 -224 58 173 69
2885F9n8m5m7K39k4k16j20J33o7J77j04J70K9K6J06k46J48j26j82R8j08J30k9
$$ 69 11 -34 -81 158 134 -82 -202 -69 -136 41 -63 107 136 162 268 22 170 44 -138 -40 -148 -18 -47
2908d7q9L15p6j79J38P3j46M8j28L0l7q1J60j26J09M0J35j41K00k13lQ7J7l32
$$ -47 -136 179 103 -76 62 135 -11 37 -91 -61 -98 -179 -19 -145 -36 4 139 -2 198 -15 -18 69 86 -246
2932b46J35j94OK35K24k29J60j29N9J37q7P4k12k0j8M3j14M2L7J18O1r3M9P3k4
$$ -246 -111 -305 -299 -64 160 -69 91 -38 21 158 71 145 -67 -87 -105 -62 -176 -134 -97 21 82 -11 38 111 87
2957H7Q9k87K10j51J5J04k47l3J68j8K06R2j46k3n3N5j36M8Ol3o0j22K37J04l8
$$ 87 176 -111 99 -52 -37 67 -180 -213 -45 -63 143 235 89 66 13 68 -68 -20 -14 -47 -107 -229 8 112 74
2982G4j03J96j51N8j19J02j72N0p7J12N3J5k0J73o6J18k83P0PQ5j79r3j0o0J32
$$ 74 -29 167 16 74 -45 57 -115 -65 -142 -30 23 38 18 191 125 243 -40 30 37 122 -57 -150 -160 -220 -88
3007h8R1O0L5m6k6K22j75J5Q2k21L4j69J77j40J24M3n8M9Q1j09J61N7k53rk03
$$ -88 3 63 98 52 26 248 73 88 170 -51 -17 -186 -9 -149 -25 18 -40 9 90 -19 142 199 -54 -63 -266
3032b66L59l05J01J21k43L68p6K4P7j6j75P2j48J15j80P6K73k68J39j2P0J34o8
$$ -266 93 -212 -111 10 -233 135 59 83 160 144 -31 41 -107 8 -172 -96 177 -91 48 36 106 240 172
3055A72k13K25j63j07r2J9LM8J05rJ35j85K08m4M3k17N9M7j34J75j25lJ54k48
$$ 172 -41 184 21 -86 -178 -159 -156 -108 -3 -12 123 -62 146 102 145 -72 -13 34 -100 75 -50 -53 101 -147
3079a47R7J1J50j63N6N3j05O9j44J69j28r8J24N7p5N7P1k3P7OJ06k26RJ69m54
$$ -147 -50 -39 111 -52 4 57 -48 21 -123 46 -82 -180 -56 1 -74 -17 54 31 108 114 220 -6 3 172 -282
3104b82L61j78P3o6J91q3P2q7L85m21K03j44K5j76MJ05J94j07J82j52J62j11j15
$$ -282 79 -99 -26 -92 99 16 88 1 386 -35 168 24 49 -127 -123 -18 176 69 251 99 261 150 35
3127C5m5k19L65k21J3J04j53J48p9M5J02M1j6lrk36K11k19N8r6J9j51L23Q6j15
$$ 35 -10 -229 136 -85 -72 32 -121 27 -52 -7 95 136 120 117 108 -128 83 -136 -78 -174 -155 -306 17 103 -12
3152a2L3m7J52j20j02J64p7j49J33P1j84O4K4J37L6m1N4j11q8J9j04Q9M2j41L3
$$ -12 21 -26 126 6 -96 68 -9 -158 -25 46 -138 -74 -50 87 123 82 136 25 -63 -44 -148 -59 -17 -158 -125
3177a25J79j37K17K3O8k64O3Rj42K42j39j36L2Mm5J50M9K5o1J18q1J54k90j72
$$ -125 54 -83 134 157 225 -39 24 33 -109 133 -6 -142 -110 -106 -151 -1 48 73 12 130 49 203 -87 -259
3201b59K76l9j21J20l6J97q8J3N9L6l7j91mN1Jk00J49q4J88q1nJ09k8MJ02j36
$$ -259 17 -22 -143 -23 -59 138 50 63 122 158 121 -70 -74 -23 -22 -222 -73 -157 31 -50 -55 54 26 30 132 -4
3227dL9n4j68J25n3Q9L03k41O2O1n0o0P5Pl0%k74K37l07L0K70k15J82lM2p7J89
$$ -4 35 -19 -187 -62 -115 -26 277 36 98 159 109 49 124 131 101 101 -173 64 -243 -213 57 -158 24 21 63 -14 175
3254A75j93R1k61n5K24o0J23r2J75n2k1j78J80N0j9j99Q5J36j31j43P6k6nR2O9
$$ 175 -18 73 -188 -243 -19 -79 44 -48 127 75 54 -124 56 106 87 -112 -27 109 -22 -165 -89 -115 -120 -28 41
3279D1Q5Jk10o4O6J19j72J8O3j46J35N8k0K29l25R8L7M8J4o4j62J32l1j15K75
$$ 41 126 127 -83 -147 -81 38 -134 -116 -53 -199 -64 -6 -26 203 -122 -24 13 61 75 11 -151 -19 -50 -165 110
3304A10J9j99N2O7K11l09K15j69l04L52j16lJ84n7oj10R6L1k06J60R9q2j1r3n
$$ 110 129 -70 -18 49 260 -49 166 -3 -307 45 -71 -74 110 53 47 -63 33 64 -142 18 117 35 24 -69 -74
3329g4J00k24j1J0K30k2J35k49K10k45K4j4Q8O9r8m1J09p5K27l9m2Q0n1nj04K4
$$ -74 26 -198 -209 -199 31 9 144 -105 105 -140 -116 -130 -42 27 -71 -112 -3 -78 149 110 68 148 97 92 -12 12
3355A2p1R4j69O6o9K81k1j10J27n3J6p3Q4k10J70m1j56R4R4l9M1O7j76L91k55
$$ 12 -59 35 -134 -68 -137 144 123 13 140 87 103 30 114 -96 74 33 -123 -29 65 26 67 134 -42 349 94
3380I4j14R7j36k0o3J94r8k05K31o6K37j60KO2J01kl04J51j35J91j97J26o8L08
$$ 94 -20 77 -59 -79 -142 52 -46 -251 -20 -86 151 -9 -7 55 156 154 -150 1 -134 57 -140 -14 -82 226
3404B26k58N8J96j91LL9j01J4j27M2r2J49p7L43k24N9j03J44o5J5j32J87j74J15
$$ 226 -32 26 222 31 34 73 -28 -14 -141 -99 -191 -42 -119 224 0 59 -44 100 35 50 -82 105 -69 46
3428D6j90J91j3j27J75j52l9K07R0j77J63l30K0jP9J5k5K8Q9o3K60k81K41k36
$$ 46 -144 47 34 -93 82 -70 -109 98 188 11 174 -156 -136 -137 -58 -43 -68 -40 49 -14 246 -35 206 -30
3452c0J1k8O6j55J57j52Q4P8Q7J51j74j71K02Q8j33N5j59qm6o2J59J6R0l1k4k0
$$ -30 -19 -47 19 -136 21 -131 -47 31 118 269 95 -76 126 214 81 136 -23 -31 -77 -139 20 36 126 95 71 51
3478E1J40q4o9r0Or4PJ69J06q4qP1j31J24j3j24K10j09j92M2r2m1J76J28m2k14
$$ 51 191 107 38 -52 -46 -140 -133 36 142 58 50 121 -10 114 101 -23 187 78 -114 -72 -164 -205 -29 99 57 -157
3504a57L24j10RR6j59J27k26j26J69j75M2O7J38Q4k21K43m7M5k99J62m6p0J20
$$ -157 167 57 66 162 3 130 -96 -222 -53 -228 -186 -119 19 103 -118 125 78 123 -176 -14 -60 -130 -10
3527a0l1o0J09Q6k54J99lO3Rl3mj91R4O8k02J38J40j43J51ln9m9J11j47M2k6j31
$$ -10 -41 -101 8 94 -160 39 36 99 108 75 71 -120 -26 42 -160 -22 118 -25 126 123 64 15 126 -21 21 -5 -136
3554a36M8n8oO5LJ88r6J48j14K78k47Mr4p4N4O3P1k17K30q2K0N1j00L7m1k4J46
$$ -136 -88 -146 -152 -87 -84 104 8 156 42 320 73 77 -17 -91 -37 26 97 -120 110 28 48 99 -1 36 -5 -29 117
3581A17j34j08M7J9kJ28Q7n6j20%j9R8j22K2J02k59P1O4%P9k0lp6K48o0k05J1
$$ 117 -17 -125 -78 -59 -61 67 154 98 -22 -22 -41 57 -65 -43 59 -200 -129 -65 -65 14 -6 -9 -85 163 103 -102 -91
3608i1J22l0j5j66J81J02q9m8j95J90J82j53O4o7o3j4J69k62N1o5Q6K2L04J0r0
$$ -91 31 1 -14 -180 1 103 14 -34 -229 -39 143 -10 54 -13 -76 -90 79 -183 -132 -197 -111 -89 215 225 135
3633A35j56N3j40N0J80l18J48K2M9j15J54P5k9j24N7Oqj33PQ9j37Q0n7J21P0n2
$$ 135 -21 32 -108 -58 122 -196 -48 -26 23 -92 62 137 108 -16 41 47 39 -94 -87 2 -135 -55 -112 9 79 27
3659B7L6N9p3L4k00j2J74L2j61pJ34j65N0R1J50j53L6MOk01K31k68J82j53L18
$$ 27 63 122 49 83 -117 -129 45 77 -84 -91 43 -122 -72 19 169 16 52 56 62 -139 92 -176 6 -147 171
3684A71k80J67q4J5K35k98J04r1J40k41K44k00p5K11j51J30J06n1M2j45l1J17
$$ 171 -109 58 -26 -11 224 -74 30 -61 79 -162 82 -118 -193 18 -133 -3 103 52 94 -51 -82 35
3706C5Q9j24j30j1J85j91J24J0M7J78o7k59J78o8j4m2k1P8q8n0J15M6R0k71J75
$$ 35 124 0 -130 -141 44 -147 -23 -13 34 212 145 -114 64 -4 -18 -60 -81 -3 -91 -141 -26 20 110 -161 14
3731A4j8R9L4j68m1r0M8J36j47J82m8N0l0j62K56q1j65J23l6r9R9p0J33O2j50
$$ 14 -4 95 129 -39 -80 -170 -122 14 -133 49 1 51 21 -141 115 34 -131 -8 -44 -143 -44 -114 19 81 -69
3756f9J40MQ1j80p8J85m3r2QR2M2r0N7j04N7j16j8J03j04R2Q3j43P3N6j57k3J51
$$ -69 71 75 156 -24 -102 83 40 -52 -44 48 90 0 57 -47 10 -106 -124 -21 -125 -33 50 -93 -20 36 -121 -144 7
3783Gj9k5J4p4K15n0k5j92K40j26L8k0m6lj03J16o8J87Pq3j86K40L3m7p1q8P6
$$ 7 -12 -37 -23 -97 118 68 43 -149 91 -35 3 -17 -63 -66 -169 -53 -121 66 73 -10 -196 44 77 30 -41 -129 -53
3810e3k9J85j48qK12q7J41j65k97K65ok8K21k48O9j3N4NK6L0Kp7M7j14q9R0M6
$$ -53 -82 103 -45 -53 159 72 213 48 -249 16 10 -18 203 -45 24 11 65 70 96 126 128 51 98 -16 -105 -15 31
3837C1n6m5n8pJ86qk0p7J20l2J0l40L86k81J92l5K4m3p6J98R8l79K06J21N7j33
$$ 31 -25 -70 -128 -135 51 43 23 -54 66 34 44 -296 90 -191 1 -34 -10 -53 -129 69 167 -212 -6 115 172 39
3863C9j82J71n1p4J95p7j54K00j82M47k41ko3K7j73J81l9r6J33J4O1o3L8k01m3
$$ 39 -143 28 -23 -97 98 21 -133 67 -115 332 91 89 26 53 -120 61 22 -74 59 73 134 71 109 -92 -135
3888a35J81m1K1J1j24J32mq3J02K6j33K76q8j12j31J89k82J26KJ02j47R1K1j05
$$ -135 46 5 26 37 -87 45 41 -42 60 86 -47 229 141 29 -102 87 -195 -69 -67 35 -112 -21 0 -105
3912a05J74j03J3n8pj5K53j79Nj0r9l5J67m5K1K31k32OqJ47j44l8Q1q8K84l02
$$ -105 69 -34 -21 -79 -86 -101 152 -27 -22 -32 -131 -166 1 -44 -23 208 -24 -18 -26 121 -23 -61 20 -68 216 -86
3938h6J46p3M1l3l6L2J33k4m6j33Oo6K00n5k40K54M3p2P1j2KJ5j54OrJ71k46K03
$$ -86 60 -13 28 -5 -41 -9 124 100 54 -79 -73 -139 61 6 -234 20 63 -9 62 50 52 67 -87 -81 -90 81 -165 38
3966C8m0N2j4mk04J62jl9j15K19m5j22Q8rJ43l34K30N7J30l15K21l6q4k7J31k74
$$ 38 -2 50 36 32 -172 -10 -11 -50 -165 54 9 -113 -25 -34 109 -225 5 62 192 -123 98 62 -22 -49 82 -192
3992a92J55K7J08j52j32J52M0n2J71o4j3j34J28L7k93K59R2l30J45J89qj31P9
$$ -192 -37 -10 98 -54 -186 -34 6 -46 125 61 48 -86 42 79 -214 45 137 -193 -48 141 133 2 81
4015H1P0j78J19k14J48RMp2R7j95L01j28P7p7m3Qj6N8j03P2j85J49oj56L16k64
$$ 81 151 -27 92 -122 26 35 39 -33 64 -131 170 42 119 42 -1 7 -9 49 -54 18 -167 -18 -24 -180 136 -128
4041a28J06Q9j48K18j04N6q2J79m00J36J20k4J05q2P0j93J5RL1J93j8p2k9j8j91
$$ -128 -22 67 -81 137 33 89 7 186 -214 -78 42 18 123 41 111 -82 -67 -58 -27 166 148 76 47 29 -162
4066a62K16qJ12O0k31J43k61K30j6q8r0J4O3O2j0P8j72J34j29k1R7J35j59N6j12
$$ -162 54 46 158 218 -13 130 -131 99 83 -5 -95 -81 -18 44 34 112 -60 74 -55 -76 21 156 -3 53 -59
4091e9K6k6L3j8P9J87l36K23j83p3K8J11j72M7r2J51O3P9n4j08N7j7N5J7q1k2
$$ -59 -33 -59 -26 -44 35 222 -114 109 -74 -147 -119 -8 -180 -133 -225 -74 -11 68 14 -94 -37 -54 1 18 -63 -85
4117h5l9R5o7J6n8K52r0J22k1k72J42P4r1L0j3k07K42j41K35k93L5L33j06j13
$$ -85 -124 -29 -96 -80 -138 114 24 146 125 -147 -5 69 -22 8 -5 -212 30 -111 124 -169 -134 199 93 -20
4141b0K89k45m4Q3n1lj23J25qM7k37L73m5j79JJ51k86L42l04K06k64K83j39K9
$$ -20 269 24 -20 63 12 9 -114 11 3 50 -187 186 141 -38 -37 114 -172 170 -134 72 -192 91 -48 -19
4165a9N3k3N5k4Q4R0l40O3J14k11K60j94J04O0j92K44j36LJ80j94no3k2J60j77
$$ -19 34 11 66 42 126 216 -124 -61 53 -158 102 -92 12 72 -120 124 -12 -9 171 -23 -28 -91 -113 47 -130
4190a30LK6P3J14p6q0K29j18jJ52j98R9r2o2J57R3j57j98O3N4K79j13j25L4o0
$$ -130 -127 -101 -28 86 10 -70 159 41 40 192 -6 93 1 -61 96 189 32 -166 -103 -49 230 117 -8 26 -34
4215c4k8k5K51k65K08k17L35k36j80J87N7o8N1k6j60J77j97J35P0l7kk92M61j01
$$ -34 -62 -87 164 -101 107 -110 225 -11 -191 -4 53 -15 36 10 -150 27 -170 -35 35 -2 -4 -296 165 64
4239F4j20Q2N2J09k03p1QP0j19J56n6P2q4j13j0J68J08k43N5J37j52J57OQ5j96
$$ 64 -56 26 78 187 -16 -87 -79 -9 -128 28 -28 44 -40 -153 -163 5 113 -130 -75 62 -90 67 73 158 -38
4264c8J8m2J01J11k41M6J44q5OnO4o2j62R2q6L3J28Lk8m0J87k72M8J16m5J48k8
$$ -38 -20 -62 39 150 -91 -45 99 14 20 15 79 17 -145 -53 -139 -106 22 25 -3 -43 144 -128 -80 36 -9 139 111
4291A11j33j26R7L1P3r5J54L4k31K74l95K74j17j2J54jp8j4j10Q2l7KnJ09j12
$$ 111 -22 -148 -51 -20 53 -42 112 146 -85 189 -206 68 -49 -61 93 92 14 0 -110 -28 -65 -63 -68 41 -71
4316g1O2j21J13KK45m5k95J0Q9L3N3M7j66M9Qo5J65m9Qk14J65K4m4N2j9J02p8
$$ -71 -9 -130 -17 -15 230 185 -110 -100 -11 22 75 122 -44 5 13 -52 113 64 72 -142 23 47 3 55 36 138 60
4343F0o2J13O1l89L27j71j6N5J6N4n8J04j61LP4J0o8K6r9N8m8J07M3J25n6j10
$$ 60 -2 111 172 -217 110 -61 -77 -22 -6 48 -10 94 -67 -64 10 20 -48 -22 -121 -63 -111 -4 39 164 108 -2
4369bj7N6l9M8Ol2L4l0j75J34n9J24j17J31ko9p8r0J78p1L2P8j15J53p5j7J1m6
$$ -2 -19 37 -2 46 52 20 54 24 -151 -17 -76 48 -69 62 60 -9 -87 -177 1 -70 -38 40 -75 78 3 -14 -3 -49
4397d9K0j37J49n7L0m6J45j7j82P4Q9N1p3J45q8j47J33qqj64K40m7L1j96J36j9
$$ -49 -29 -166 -17 -74 -44 -90 55 38 -144 -70 19 70 -3 142 54 -93 40 32 24 -140 100 53 84 -112 24 5
4423EJ4Rp9J34n7J2O6j80PR1K1N0n6j41K30k62K43o7r5L8J67n7n5M6m1M1j36J90
$$ 5 19 28 -51 83 26 38 104 -76 -69 22 43 93 37 -104 126 -136 107 40 -55 -17 150 93 38 84 43 84 -52 138
4451A38m3M0j70L5J75r2k56J77L1k61K14p6O8J0K6Oj04O7j05J53j90K30l8j56
$$ 138 95 135 -35 0 175 83 -173 4 35 -226 -12 -88 -20 -10 16 22 -82 -15 -120 33 -157 73 35 -121
4475a21J30J17k13R7J6kJ01j53L5P1K8j52L1L9j91J44J7N3L3K3j18R5k68K52j16
$$ -121 9 126 -87 10 26 24 125 -28 7 78 106 -46 -15 24 -167 -23 -6 47 80 103 -15 80 -188 64 -52
4500e2K4J39l3k28J49k10K62n7J06k82L34k39O9l1J06j5k9k12J12L20l05jO4o8
$$ -52 -28 111 78 -150 -1 -211 51 -6 100 -182 152 -87 -18 -49 57 42 13 -199 -87 233 -72 -73 -9 -77
4524g7J46j98L15k08J8r4K7J36J20k74J1R0n7J18j15J58j64J0Nq9K24j0j99j3
$$ -77 69 -129 186 -22 -4 -98 -71 65 185 -89 -78 12 -45 73 -42 116 -48 -38 -33 -122 102 92 -107 -120
4548a20J83M6kL2k51M6n2K48m7j78j2J29qo9k2Q9Rl0P3L0p6J6n0Q5j52J77oj1
$$ -120 63 109 107 139 -112 -66 -118 130 83 -95 -107 22 14 -55 -77 12 21 -9 64 94 18 34 -16 69 -83 94 88 77
4576G7q1l8P5P0n6k8l8J47j11O6o5m1k7J25O3k69J39l8O9j43J44q4o4J45j15m0
$$ 77 -4 -42 33 103 47 19 -19 128 17 83 18 -23 -50 75 138 -131 8 -30 39 -104 40 -44 -108 37 -78 -118
4602a18J80j05k0J85q6j27J02j70J36J62j74o1P7jJ17M3Pk12lNJ70j00k6J53k76
$$ -118 62 -43 -63 122 36 -91 11 -159 -23 139 -35 -96 -19 -20 97 140 147 -65 -68 -63 107 7 -19 134 -142
4627a42l3K83j40R3K7j65J51j63J73p3J11j97K51k70O7K7l2j45J87q9M8N1k13
$$ -142 -175 108 -32 61 88 -77 74 -89 84 11 122 -75 176 -94 -27 0 -32 -177 10 -79 -31 20 -193
4650a93K98j62j7l6J34n2k7J00J69l35J46L2k08L00j34j06L6J1J07j08m7M7R6
$$ -193 105 -57 -74 -110 24 -28 -55 45 214 -121 25 57 -151 149 15 -91 -55 -44 63 -45 -92 -45 51
4673E1j62j04L06nn0R5K7N1l37J08N6N4r9mM3j12l1J10M0J53q7r8Q0j04L9J3l9
$$ 51 -111 -215 91 86 36 131 158 209 -128 -20 36 90 -9 -13 30 -82 -113 -3 37 190 103 5 85 -19 20 33 -6
4700fLk27L01k56K23l4K5r6n3J20K5k5m2JO9J69j41q4P0N9j65k2N8J71j20rn8
$$ -6 -3 -230 71 -185 38 4 29 -67 -120 0 25 0 -42 -41 28 197 56 -28 42 101 -64 -86 -28 143 23 14 -44
4727d4rQ8m5j5J14k26K49R4k03Q4l1j73M00j33j49k08K37J83p8k82K08j05J08
$$ -44 -53 35 -10 -25 89 -137 112 206 3 87 56 -117 283 150 1 -207 30 213 135 -147 61 -44 64
4750F4K13l78j16J39J05o7J69l33K80J2KJ87j74j46J49k34J86r1j11K61j29j74
$$ 64 277 -101 -217 -78 27 -40 129 -204 76 88 90 277 103 -43 106 -128 58 -33 -144 117 -12 -186
4772a86J67p9O2J23m6J06l5J61k55J3q3L6MK0L3j69P7O5L6kl8J24k83J57NP5q0
$$ -186 -19 -98 -36 87 41 147 112 273 18 31 -52 -16 -12 8 41 -128 -51 14 50 48 10 134 -149 8 13 88 8
4799Hj13N8M2K5k18K52K2j37O3M2j14J54Q0j78KRlj38N3l4K31j62J81k75J27j9
$$ 8 -105 -47 -5 20 -198 54 76 -61 2 44 -70 84 164 -14 -12 -3 -6 -144 -91 -125 106 -56 125 -150 -23 -42
4825d2N3J23m6j08m8Q2J52k43j43K83j25N2o8R8q4J67k35K20q4Q1j59PJ73j32
$$ -42 11 134 88 -20 -68 14 166 -77 -220 63 -62 -10 -78 20 -64 103 -132 88 4 85 -74 -67 106 -26
4849b6Km9o1K91q5P4k87K29K5j59q2R8o8k7K79j08j22N8O1J12mj87p0K11j61l
$$ -26 -24 -73 -134 157 72 146 -141 88 113 -46 -128 -30 -98 -125 154 46 -76 -18 43 155 151 -36 -106 105 -56 -59
4875e9J03Q3L8j09j79J30j49K56j98K59j22j11P2J53j33j90qj58J86P1R5K7n6
$$ -59 44 127 165 56 -123 7 -142 114 -84 175 53 -58 14 167 34 -156 -164 -322 -136 -65 30 57 1
4898AJ8j4K3l9p3K31j97K0K28k44M3m6l9l9K27j10J57q1j43J16j71K34l4j42M
$$ 1 19 5 28 -11 -84 147 -50 -30 198 -46 -3 -49 -88 -127 100 -10 147 66 -77 39 -132 102 68 -74 -70
4923g0J63k51K29o7j1J21o6k9J00j62J40j16L4R3q4j60K15j12j5J82k80J87j76
$$ -70 93 -158 71 4 -7 114 48 19 119 -43 97 -19 15 108 24 -136 79 -33 -48 134 -146 41 -135
4946a35K03r2N2j60J14J1m0j28K33m5K2j01kK2P9L3j61J66L6o6N3q8J0j62O9J12
$$ -135 68 -24 28 -132 -18 -7 -47 -175 58 13 35 -66 -68 -46 33 66 -95 71 107 41 94 6 16 -146 -77 35
4972C5j09J87j78J50j5j07p3J22m5k5j20O9R5r2J07J89j41K1j57j3J83j38J01
$$ 35 -74 113 -65 85 70 -37 -110 12 -33 -58 -178 -109 -14 -106 1 190 49 70 -87 -100 83 -55 46
4995D6L0j76k8P7k7R5r7K34j60N2j12N5LR7j30N7j4J13N8l23K05j36J0O1Q9N9
$$ 46 76 -100 -128 -51 -78 17 -80 154 -6 46 -66 -11 -8 89 -41 16 2 115 173 -150 55 -81 -71 -10 79 138
5021A38j08j02N5N6P8j63J36j52J12j55J09ko8J62J05k87J0Rj57L34j59J21M9
$$ 138 30 -72 -17 39 117 -46 90 -62 50 -105 4 2 -66 96 201 -86 -76 -67 -224 110 -49 72 121
5044A21k08M7K94l10j1Q2k39J89J77l8r3p1M0j4j7J00N1p6m4P6J6j82L8J73k4
$$ 121 -87 -40 254 -56 -67 15 -224 -35 142 104 11 -60 -20 -34 -51 49 100 24 -20 56 72 -110 -72 101 77
5069G7l7j70J71l2r9J17l6j80K62l7M1N1j93j0k8O2J10j86L12j25j8m5QJ9J7j59
$$ 77 40 -130 41 9 -90 27 -9 -189 73 36 77 128 -65 -75 -103 -41 69 -117 195 70 52 7 15 34 51 -108
5095a08%P5N3K5q9L4O0k41L5J88k8L4K43k98j03n2J88J35k53J28j27N1k2O6K4
$$ -108 -108 -33 20 45 -44 -10 50 -191 -156 32 4 38 281 -17 -120 -172 16 151 -102 26 -101 -50 -72 -6 18
5120A8r3jK17j62o0q0J05M7J11q1K1m0j44J75q4j56K29R3k59K87k59N8J56j67
$$ 18 -75 -76 141 -21 -81 -161 -56 -9 102 21 42 2 -142 33 -51 -207 22 115 -144 143 -116 -58 98 -69
5144f9J18j67P3M6m5l0J2KP3J1N6m4j7J40n3N6k77O5J90j50K1j09K89j56r0J0
$$ -69 49 -118 -45 1 -44 -74 -62 -60 13 24 80 36 19 159 106 162 -115 -50 140 -10 11 -98 191 35 -55 -45
5170d5J29kq8Q2r3J28k2j04j8Q4K6j60kJ5J71j48Q0o5K3j34J95m0j60J90M3j87
$$ -45 84 82 -6 76 -17 111 89 -15 -33 51 77 -83 -85 -70 101 -47 33 -32 -9 -143 52 12 -148 42 85 -102
5196a02J60Kp3Q2m9LL0R2j62k8m5NR5p1P1M9j41J62l6k2J16n7j96Q5l9K77k57
$$ -102 58 60 -13 69 20 23 53 145 -17 -45 -90 -85 10 -61 10 59 -82 80 44 22 138 81 -115 -30 -69 208 -49
5223d9J65j35oQ7j72K31m0j36P9l1j20R4p1J34o5M8o9J0Q5J50j01j06R8L3j18
$$ -49 116 -19 -25 62 -110 121 81 -55 24 -7 -127 -33 -104 30 -35 13 -56 -46 39 189 88 -18 80 113 -5
5248el1M9j09J88r1rj02k9K97K5k32J47j44J41j67J54j28j36R7J63O9j24m7oN7
$$ -5 -36 13 -96 92 1 -8 -110 -139 158 183 -49 98 -46 95 -72 82 -46 -182 -85 78 147 23 -24 -30 27
5273B7Oj08O8R2j08L4J23q7J05j72j1P5nl6L7J07j16m4K4o6L4j65K0K8J76P8j25
$$ 27 33 -75 -7 85 -23 11 134 47 152 -20 -31 44 39 3 40 147 31 -13 11 -55 -21 -186 -166 -138 38 116 -9
5300iJ32j89Q0q9J56r2r7J39kp9N1J40j32l1J5P9q7N5jl8PP1k14J15O1p6o9J21
$$ -9 123 -66 14 -75 81 -11 -108 31 29 -50 1 141 9 -22 -7 72 -15 40 39 1 8 79 -135 -20 41 -35 -104 17
5328A7P4j23J32n8J82k66mP7Q3M7o9j90R7j7lm3J9J95k41PO3p8J36l6o8K24k18
$$ 17 91 -32 100 42 224 -42 -46 31 114 161 92 -98 -1 -18 -21 -64 -45 150 -91 -84 -21 -99 37 1 -67 157 -61
5355f1J30j38K13Rk49K16j48J63l34J88n3P2p3P1k18M43j81k9L2j50K40m4j46
$$ -61 69 -69 144 153 -96 120 -28 135 -199 -11 -64 8 -65 6 -212 231 50 21 53 -97 143 99 -47
5378d7J9k9m8P5J09%k04P2j17J12j03M22j40j14L1m4o1L5M8J24j77K28j17K2r5
$$ -47 -28 -57 -105 -30 79 79 -125 -53 -170 -58 -161 261 121 7 38 -6 -67 -32 16 140 -37 191 74 96 1
5403Aj21L25k21m6J33j51P4k8P6k3j36J57J8o9O0or9J03qJK6M3q0j8j09J68n1
$$ 1 -120 205 -16 -62 71 -80 -6 -34 42 19 -117 40 58 -11 49 43 -56 47 39 40 66 109 29 11 -98 70 19
5430A9K5j50J86m7q0J74r7M0p5l3K0j40K87k37J59J23k51nK48k14J99j32N2n5
$$ 19 44 -106 80 33 -47 127 30 70 -5 -38 -18 -158 129 -108 51 174 -77 -82 166 -48 151 19 71 16
5454A6j73n1O8K0J59k37K91j26M6j24J39L8L0j56O4K2J8r7m8m1K78p8o6J08n4
$$ 16 -157 -208 -140 -120 39 -198 93 -33 13 -111 28 66 96 -60 4 26 44 -53 -101 -142 136 58 -8 100 46
5479D6L0k12K38q0o2JM1N2j11l0J98j07K17j95Oj02M7m5O2L9j47K4J1kM4J64l4
$$ 46 76 -136 102 22 -40 -39 2 54 -57 -87 111 4 221 26 32 -70 -23 -68 -6 33 -114 -90 -79 -81 -37 127 93
5506I3o2k6O5j64J4J83l09J27O1L4l5RO2R8k22k7K49q6Q3r1Ln8J35j81nJ46j4
$$ 93 31 5 70 -94 -80 103 -206 -79 -18 16 -19 -10 52 150 -72 -99 150 64 147 56 59 1 136 -45 -50 96 82
5533H2O0q5J81l78O7p2L04q5n5O5m1Q3n0r4q9o1L14j97L2O3j19M4N0k30K20J06
$$ 82 142 57 238 -140 -73 -145 159 74 19 84 43 126 76 -18 -107 -168 146 -51 -19 44 -75 -31 19 -211 9 115
5559A15j73J08k5j12L2J77j13J84n9k06J63m9m5k6j8OK7N3j5j0n2l0R9M5l4l7
$$ 115 -58 50 25 -87 -55 122 9 193 134 -72 91 42 -3 -29 -47 -41 -14 39 24 14 -38 -68 31 76 42 5
5585EJ57j2k60J28M8j00j18J1K07j77K06k17R2rp1R0P6o6m8K16k07N3n4R9rp4
$$ 5 162 150 -110 18 66 -34 -152 -141 66 -111 95 -122 -30 -39 -110 -20 56 -10 -58 158 -49 4 -50 49 40 -34
5611c4J55k50R8J22p5P0j01Lp0J80K6j00L5q2R3o9N7p6Mp9j8o7J63L5q0R3o4K4
$$ -34 121 -129 -31 91 16 86 -15 -12 -82 98 124 24 59 -23 70 1 58 -18 -14 -93 -111 -178 -15 20 -60 33 -31 -7
5639gM9M2j0m9R6J4J16m12J88njk3l1l0J66j35j5J50p4Q5j39M2J81k28l4J45k
$$ -7 42 84 74 25 121 135 251 -161 27 22 21 -2 -33 -63 103 -32 -47 103 29 114 -25 17 198 -30 -64 81 79
5666G9k98N1J46L6O4j13Q1n2O1l28K96J28k34l7N3K0K10j44j02MO5J20r0L8l0
$$ 79 -219 -168 -22 14 78 -35 46 -6 55 -273 23 151 -83 -120 -67 -47 163 19 -83 -79 -14 106 16 54 24
5691B4L4j33N1M5N4j44J19N0o5j08R7J7n8n4Q2j36K68j69j22N4M1m9N6N7p1QJ60
$$ 24 58 -75 -24 21 75 -69 50 100 35 -73 24 41 -17 -71 11 -125 143 -26 -148 -94 -53 -102 -46 11 -60 -52 108
5718A08p3k33K48p6L8r5R2J17j17j1Oon2%K8r4R3J80j92r5K63K2k30P1oJ8r8O9
$$ 108 35 -198 50 -26 12 -83 9 126 9 -2 4 -2 -54 -54 -26 -120 -27 153 -39 -134 129 151 -79 -8 -14 4 -94 -25
5746b5N7j44J97q0Q7j02Q2k83J78j4P7j32Q5J08k36J70l0j09n2J46j17J33J26
$$ -25 32 -112 85 5 92 -10 72 -211 -33 -47 30 -102 -17 91 -145 25 -5 -114 -166 -20 -137 -4 122
5769A22j14mJ02q8j20J41J0J33Ml12J49m1j86K44j26Q2N6j53K10r6R4q5Q3J7l18
$$ 122 8 4 106 18 -102 39 49 182 186 -126 23 -18 -204 40 -86 -4 52 -101 109 13 107 22 105 122 -196
5794a96J96r1K39j46j2L2K1J08o6j57q2J88J10r9o3l0rQ0n0K5M5Q3j55K20j39
$$ -196 0 -91 148 2 -10 22 43 151 85 -72 -154 34 144 45 -18 -48 -57 23 -27 -2 43 126 -29 191 52
5819E2j10R2p2o2K9J46M0j80L3J49J06l07K69j74j88J10K88j80o5J40m7n5m1o7
$$ 52 -58 34 -38 -100 -71 75 115 -65 -32 117 223 -84 185 11 -177 -67 221 41 -24 116 69 14 -27 -94
5843i4O8J66j69k2J79q4on9j02Q8O3K91n15K21j26Q6n2J23j5o0J54j43j0m2M1
$$ -94 -26 140 -29 -51 128 44 38 -21 -123 -35 28 319 -196 25 -101 -15 -67 56 41 -19 135 -8 -18 -60 -19
5868a9J1L2k65K55o6jQ7J28n4j72K4pL0J4j10PK92j80m8J24Pj94K54j63j72J36
$$ -19 -8 24 -241 14 -52 -53 34 162 108 -64 -40 -47 -17 -3 -113 -106 186 6 -42 82 89 -105 149 -14 -186 -50
5894e0m7J29j4n7l7J4j36K33M7j46J16j05J6m0P9o8J00k6N6L4j14j72J25O8j41
$$ -50 -97 32 18 -39 -76 -62 -198 35 82 -64 52 -53 -37 -77 2 -66 34 8 64 98 -16 -188 -63 5 -136
5919a36J53n3R9j26o3JK6J39O6j60m2J88O9j74J60k70K90j25O8k3l1j45K3n9K65
$$ -136 17 -36 63 -63 -126 -125 -99 40 106 -54 -96 92 161 -13 147 -123 167 42 110 87 56 -89 -66 -125 140
5944A40o6o1J24j53k4J29j52J79j28l6K82k16N8O1k37N6J10M4j00p2o3P3j34J83
$$ 140 74 13 137 -16 -40 89 -63 116 -12 -48 234 18 76 137 -100 -44 66 110 10 -62 -125 -52 -186 -3
5968cl5L8J30j2j48o7J35L5j8p4n3J17k15K12Rq0n7q2J31QlK08j14j29J05r8N8
$$ -3 -38 0 130 118 -30 -97 38 73 55 -19 -72 45 -170 42 51 -29 -86 -168 -37 -29 -32 176 62 -67 38 -60 -2
5995bn6J68lj4j74JK15o7O0j17k3J05k40O3M1m9J38r8l9J19R9j25J60k35Q6O9
$$ -2 -58 110 107 93 -81 -80 135 68 128 11 -12 93 -147 -84 -43 -92 46 -52 -91 28 127 2 162 -73 13 82
6021H2l26K63j29J36l2l9J85k45P9K38r4p0R6l34L5j8J36R2k34P3K19k34m5J93
$$ 82 -244 19 -110 26 -6 -45 140 -105 -26 212 118 48 144 -190 -155 -173 -37 55 -179 -106 113 -121 -166 27
6045B7P5M3k73j1J87l5J9j07L0k21J88J30J7j09N5k6J27O4Rk21P0L2j12R2j71
$$ 27 102 145 -128 -139 48 13 32 -75 -45 -266 -78 52 69 -40 15 -11 116 180 189 -32 38 70 -42 50 -121
6070a21J06k1J8J53j26J49k60K93j42j50N5N5j37P1j7j04L19m5r8j96L48o8l1
$$ -121 -15 -36 -18 135 9 158 -102 191 49 -101 -46 9 -128 -57 -74 -178 141 96 -2 -198 150 82 51
6093E1o0L4K3j20J15l4lJ7O1j29L8PJ4q6kK8J03LJ9M8j43J44k41P7J47qj08R2
$$ 51 -9 25 48 -72 43 9 6 23 84 -45 -7 0 14 -72 -74 -46 57 60 79 127 -16 128 -113 -36 111 103 -5 87
6121H7r6j7k1J72j11q9N3j4J52l26K59l4l0j75O9J16j04J97j44pm5J11K2r9J06
$$ 87 -9 -26 -47 125 14 -75 -22 -36 116 -210 49 15 -15 -190 -121 -5 -109 88 -56 -63 -108 3 25 -74 32
6146C2nj37J41o4J07j18K25l23L8J67j15N7j6mk2j48O6K93k16L8l3J12j88P2q9
$$ 32 27 -110 31 -33 74 -44 181 -142 -104 63 -52 5 -11 -15 -37 -185 -119 174 -42 -4 -37 75 -113 -41 -130
6171a30J23j65J37m5J41L4l21J46m9J10J2Q7j59Q3j8M0o0M1j3P4j64R5J00j70
$$ -130 -7 -172 -35 -80 61 95 -226 -80 -129 -19 -7 80 -79 4 -14 26 -34 7 -6 68 -96 -1 99 -71
6195g1k2J88k23P1l3l5K2J09J45m7j59l8J25K2j08K80j63p3m1O0J10k46k2K76
$$ -71 -93 95 -128 -57 -90 -125 -103 6 151 104 -55 -93 32 54 -54 226 63 -10 -51 9 119 -127 -149 127
$$ [...]
8191D8
##END NTUPLES=NMR FID
##END=
