##TITLE=1H_DE-57_D2O
 D2O
 8 sc, 
 5.7.2024
##JCAMPDX= 6.0         $$ Bruker NMR JCAMP-DX V2.0
##DATA TYPE= NMR FID
##DATA CLASS= NTUPLES
##ORIGIN= UXNMR, Bruker Analytische Messtechnik GmbH
##OWNER= root
$$ XWIN-NMR		Version 3.5
$$ Fri Jul  5 13:44:31 2024 Russian Standard Time (UT+4h)  she@DPX200
##.OBSERVE FREQUENCY= 200.1314
##.OBSERVE NUCLEUS= ^1H
##.DELAY= (6, 6)
##.ACQUISITION MODE= SIMULTANEOUS
##.ACQUISITION SCHEME= undefined
##.AVERAGES= 8
##.DIGITISER RES= 18
##SPECTROMETER/DATA SYSTEM= spect
##.PULSE SEQUENCE= zg30
##.SOLVENT NAME= DMSO
##.SHIFT REFERENCE= (INTERNAL, DMSO, 0, 15.7039)
##AUDIT TRAIL= $$ (NUMBER, WHEN, WHO, WHERE, WHAT)
$$ ##TITLE= Audit trail, XWIN-NMR		Version 3.5
$$ ##JCAMPDX= 5.01
$$ ##ORIGIN= Bruker BioSpin GmbH
$$ ##OWNER= she
$$ F:/spectra/data/she/nmr/H-F/1/audita.txt
$$ ##AUDIT TRAIL=  $$ (NUMBER, WHEN, WHO, WHERE, WHAT)
(   1,<2024-07-05 13:42:54.65 +0400>,<she>,<DPX200>,
      <created by zg, POWCHK disabled, PULCHK disabled
       configuration hash MD5:
       00 E9 B6 7A A2 85 ED C7 34 08 36 98 17 FE 4E 26
       data hash MD5: 16K
       1C 5F 64 21 B4 3C AF 9D A0 75 71 BD 9D 0D 57 C3>)
$$ ##END=
$$ 
$$ hash MD5
$$ 9C BC BD 08 06 5C 79 07 CC 1C 70 62 9F 7F E3 F1
##$RELAX= 
##$RELAX= 
##$RELAX= 
##$RELAX= 
##$RELAX= 
##$RELAX= 
$$ Bruker specific parameters
$$ --------------------------
##$DU= <F:/spectra>
##$EXPNO= 1
##$NAME= <H-F>
##$PROCNO= 1
##$TYPE= <nmr>
##$USER= <she>
##$AMP= (0..31)
100 100 100 100 100 100 100 100 100 100 100 100 100 100 100 100 100 100 
100 100 100 100 100 100 100 100 100 100 100 100 100 100 
##$AQSEQ= 0
##$AQ_mod= 1
##$AUNM= <au_zg>
##$AUTOPOS= <>
##$BF1= 200.13
##$BF2= 200.13
##$BF3= 200.13
##$BF4= 200.13
##$BF5= 200.13
##$BF6= 200.13
##$BF7= 200.13
##$BF8= 200.13
##$BYTORDA= 1
##$CFDGTYP= 0
##$CFRGTYP= 5
##$CHEMSTR= <none>
##$CNST= (0..31)
1 1 145 1 1 1 1 1 1 1 1 1 1 1 1 1 1 1 1 1 1 1 1 1 1 1 1 1 1 1 1 1 
##$CPDPRG= <>
##$CPDPRG1= <>
##$CPDPRG2= <>
##$CPDPRG3= <>
##$CPDPRG4= <mlev>
##$CPDPRG5= <mlev>
##$CPDPRG6= <mlev>
##$CPDPRG7= <mlev>
##$CPDPRG8= <mlev>
##$CPDPRGB= <>
##$CPDPRGT= <>
##$D= (0..31)
0 1.2 0 0 0 0 0 0 0 0.06 0 0.03 0 0 0 0 0.0002 0 0 0 0 0 0 0 0 0 0 0 0 
0 0 0 
##$DATE= 1720172574
##$DBL= (0..7)
120 120 120 120 120 120 120 120 
##$DBP= (0..7)
150 150 150 150 150 150 150 150 
##$DBP07= 0
##$DBPNAM0= <>
##$DBPNAM1= <>
##$DBPNAM2= <>
##$DBPNAM3= <>
##$DBPNAM4= <>
##$DBPNAM5= <>
##$DBPNAM6= <>
##$DBPNAM7= <>
##$DBPOAL= (0..7)
0.5 0.5 0.5 0.5 0.5 0.5 0.5 0.5 
##$DBPOFFS= (0..7)
0 0 0 0 0 0 0 0 
##$DE= 6
##$DECBNUC= <off>
##$DECIM= 24
##$DECNUC= <off>
##$DECSTAT= 4
##$DIGMOD= 1
##$DIGTYP= 9
##$DL= (0..7)
0 120 120 120 120 120 120 120 
##$DP= (0..7)
150 150 150 150 150 150 150 150 
##$DP07= 0
##$DPNAME0= <>
##$DPNAME1= <>
##$DPNAME2= <>
##$DPNAME3= <>
##$DPNAME4= <>
##$DPNAME5= <>
##$DPNAME6= <>
##$DPNAME7= <>
##$DPOAL= (0..7)
0.5 0.5 0.5 0.5 0.5 0.5 0.5 0.5 
##$DPOFFS= (0..7)
0 0 0 0 0 0 0 0 
##$DQDMODE= 0
##$DR= 18
##$DS= 0
##$DSLIST= <SSSSSSSSSSSSSSS>
##$DSPFIRM= 0
$$ [...]
##$SUBNAM2= <"">
##$SUBNAM3= <"">
##$SUBNAM4= <"">
##$SUBNAM5= <"">
##$SUBNAM6= <"">
##$SUBNAM7= <"">
##$SUBNAM8= <"">
##$SUBNAM9= <"">
##$SW= 24.0689651099613
##$SWIBOX= (0..15)
0 0 2 0 0 0 0 0 0 0 0 0 0 0 0 0 
##$SW_h= 4816.95568400771
##$TD= 16384
##$TD0= 1
##$TE= 0
##$TE2= 300
##$TE3= 300
##$TEG= 300
##$TL= (0..7)
0 120 120 120 120 120 120 120 
##$TP= (0..7)
150 150 150 150 150 150 150 150 
##$TP07= 0
##$TPNAME0= <>
##$TPNAME1= <>
##$TPNAME2= <>
##$TPNAME3= <>
##$TPNAME4= <>
##$TPNAME5= <>
##$TPNAME6= <>
##$TPNAME7= <>
##$TPOAL= (0..7)
0.5 0.5 0.5 0.5 0.5 0.5 0.5 0.5 
##$TPOFFS= (0..7)
0 0 0 0 0 0 0 0 
##$TUNHIN= 0
##$TUNHOUT= 0
##$TUNXOUT= 0
##$USERA1= <user>
##$USERA2= <user>
##$USERA3= <user>
##$USERA4= <user>
##$USERA5= <user>
##$V9= 5
##$VALIST= <valist>
##$VCLIST= <CCCCCCCCCCCCCCC>
##$VD= 0
##$VDLIST= <DDDDDDDDDDDDDDD>
##$VPLIST= <PPPPPPPPPPPPPPP>
##$VTLIST= <TTTTTTTTTTTTTTT>
##$WBST= 1024
##$WBSW= 4
##$XGAIN= (0..3)
0 0 0 0 
##$XL= 0
##$YL= 0
##$YMAX_a= 169060
##$YMIN_a= -181157
##$ZGOPTNS= <>
##$ZL1= 120
##$ZL2= 120
##$ZL3= 120
##$ZL4= 120
##$ABSF1= 10
##$ABSF2= 0
##$ABSG= 5
##$ABSL= 3
##$ALPHA= 0
##$AQORDER= 0
##$ASSFAC= 0
##$ASSFACI= 0
##$ASSFACX= 0
##$ASSWID= 0
##$AUNMP= <proc_1d>
##$AZFE= 0.1
##$AZFW= 0.1
##$BCFW= 1
##$BC_mod= 2
##$BYTORDP= 1
##$COROFFS= 0
##$CY= 11.3945322036743
##$DATMOD= 1
##$DC= 2
##$DFILT= <>
##$DTYPP= 0
##$F1P= 15.6554695791079
##$F2P= 12.8336369535428
##$FCOR= 0.5
##$FTSIZE= 0
##$FT_mod= 4
##$GAMMA= 1
##$GB= 0.15
##$INTBC= 1
##$INTSCL= 1
##$ISEN= 128
##$LB= 0.24
##$LEV0= 0
##$LPBIN= 0
##$MAXI= 10000
##$MC2= 0
##$MEAN= 0
##$ME_mod= 0
##$MI= 1.114404
##$NCOEF= 0
##$NC_proc= 0
##$NLEV= 6
##$NOISF1= 3.799351
##$NOISF2= 2.8
##$NSP= 1
##$NTH_PI= 0
##$NZP= 0
##$OFFSET= 15.70392
##$PC= 1
##$PHC0= -25528.53
##$PHC1= 12.18748
##$PH_mod= 1
##$PKNL= yes
##$PPARMOD= 0
##$PSCAL= 0
##$PSIGN= 0
##$REVERSE= no
##$SF= 200.130013532006
##$SI= 16384
##$SIGF1= 3
##$SIGF2= 2
##$SINO= 400
##$SIOLD= 16384
##$SREGLST= <1H.CDCl3>
##$SSB= 0
##$STSI= 0
##$STSR= 0
##$SW_p= 3612.71676300578
##$SYMM= 0
##$S_DEV= 0
##$TDeff= 0
##$TDoff= 0
##$TI= <>
##$TILT= no
##$TM1= 0
##$TM2= 0
##$TOPLEV= 0
##$USERP1= <user>
##$USERP2= <user>
##$USERP3= <user>
##$USERP4= <user>
##$USERP5= <user>
##$WDW= 1
##$XDIM= 8192
##$YMAX_p= 0
##$YMIN_p= 0
$$ End of Bruker specific parameters
$$ ---------------------------------
##NTUPLES= NMR FID
##VAR_NAME=  TIME,          FID/REAL,        FID/IMAG
##SYMBOL=    X,             R,               I
##VAR_TYPE=  INDEPENDENT,   DEPENDENT,       DEPENDENT
##VAR_FORM=  AFFN,          ASDF,            ASDF
##VAR_DIM=   8192,          8192,            8192
##UNITS=     SECONDS,       ARBITRARY UNITS, ARBITRARY UNITS
##FACTOR=    0.0002076,     1,               1
##FIRST=     0,             0,               0
##LAST=      1.7004516,     0,               0
##MIN=       0,             -181157,         0
##MAX=       1.7004516,     169060,          0
$$ Real data points
##PAGE= N=1
##DATA TABLE= (X++(R..R)), XYDATA
$$ plain form
0 0 0 0 0 0 0 0 0 6 -3 8 -8 8 -8 16 -16 22 -24 32 -33 41 -48 56 -65 76 -86 99 -114 129 -146 166 -185 208
32 208 -234 262 -290 324 -361 400 -443 493 -544 605 -668 740 -819 912 -1012 1127 -1261 1417
50 1417 -1601 1824 -2098 2446 -2905 3542 -4481 6017 -8976 16758 -82409 -181157 4216 122504
64 122504 102573 -46892 -134175 -53262 109652 131296 9586 -116816 -98214 33405 115112
75 115112 40815 -83297 -112443 -2450 113090 90075 -35196 -99068 -41797 67678 93070
86 93070 -6147 -101930 -72061 33991 93896 42515 -59221 -79868 8653 86681 58805 -38422
98 -38422 -91052 -36149 57821 71435 -6515 -74356 -46683 42741 82738 25388 -57390 -68163
110 -68163 3361 67813 40402 -41746 -72254 -15575 59518 65653 -5947 -65177 -37589 37593
$$ packed form
0@%%%%%%%OrJ1j6J6j6K4l2L8m6N6o5P4q9J04j21J41j62J85k13K43k75L12l51L93
32B08m42M96n52O14o85P61q43R36j037J149j273J408j559J731j924K139k388K678
50A417l018L425l922M544n351O447q023J0498j4993K5734r9167r8748J85373J18288
64A22504j9931j49465q7283Q0913J62914K1644j21710j26402J8602J31619Q1707
75A15112p4297j24112k9146J09993J15540k3015j25271o3872N7271J09475K5392
86I3070r9217r5783K9869J06052N9905n1381j01736k0647Q8521P8028k7876r7227
98c8422n2630N4903R3970J3614p7950o7841K7673Q9424L9997n7350q2778j0773
110f8163P1524O4452k7411q2148l0508N6679P5093O135p1600n9230K7588P5182
$$ plain form
122 37593 63042 8743 -58598 -58618 10248 64023 37122 -33472 -57526 -6448 54910 50610 -15698
135 -15698 -63473 -34809 32222 54798 7099 -49235 -42945 18173 59678 30076 -33736 -53349
147 -53349 -7395 44814 37923 -17799 -53264 -24320 35263 51947 5827 -42529 -34963 15620
159 15620 47194 18956 -35186 -47042 -2444 41523 33538 -14116 -42429 -15051 32890 40729
171 40729 -1057 -41284 -31697 15274 39772 12964 -29648 -35300 4299 39932 27114 -17089
183 -17089 -37938 -11871 27636 31282 -6353 -37187 -21629 19481 36771 9993 -27428 -28794
195 -28794 7249 33910 17596 -20864 -34589 -6574 28228 26834 -7385 -30990 -14714 21326
207 21326 31493 2852 -28586 -25387 8066 30293 12961 -20818 -27623 -221 28453 23345 -10034
$$ packed form
122C7593K5449n4299o7341k0O8866N3775k6901p0594k4054N1078O1358m300o6308
135a5698m7775K8664O7031K2576m7699n6334O290O1118M1505k9602o3812j9613
147e3349M5954N2209o891n5722l5465K8944N9583J6684m6120m8356P566N0583
159A5620L1574k8238n4142j1856M4598M3967p985m7654k8313K7378M7941P839
171D0729m1786m0227R587M6971K4498k6808m2612n652L9599L5633j2818m4203
183a7089k0849K6067L9507L646l7635l0834J5558M1110J7290k6778l7421j366
195b8794L6043K6661j6314l8460j3725K8015L4802j394l4219k3605J6276L6040
207B1326J0167k8641l1438L199L3453K2227j7332l3779o805K7402K8674n108l3379
$$ plain form
220 -10034 -29691 -11850 19540 25682 -1137 -27491 -20084 11872 28913 10842 -19047 -24254 2062
233 2062 25549 16859 -12817 -27219 -8925 19894 22922 -2530 -23606 -14702 12886 25361 6160
246 6160 -20207 -21349 2961 22683 13405 -13029 -23076 -3988 20148 19808 -4352 -22536 -12262
259 -12262 12866 20477 2609 -19487 -17525 6140 22044 10659 -12869 -19401 -1749 18631 15163
272 15163 -7346 -21007 -9102 13495 18824 682 -17709 -13329 8101 19853 7205 -14436
284 -14436 -17713 677 17400 12225 -8381 -18770 -5370 14772 16666 -1323 -17346 -11258 8826
297 8826 17397 4069 -14538 -15516 2994 17293 10165 -8841 -16374 -3442 14270 13802 -4085 -16808
311 -16808 -9075 9275 15909 2640 -13877 -12481 4433 15796 7779 -9766 -15151 -1757 13301
$$ packed form
220a0034j9657J7841L1390O142k6819k6354P407L1956J7041j8071k9889n207K6316
233B062K3487q690k9676j4402J8294K8819L028k5452k1076Q904K7588J2475j9201
246F160k6367j142K4310J9722r278k6434j0047J9088K4136l40k4160j8184J0274
259a2262K5128P611j7868k2096J962K3665J5904j1385k3528o532J7652K0380l468
272A5163k2509j3661J1905K2597N329j8142j8391M380K1430J1752j2648k1641
284a4436l277J8390J6723n175k0606j0389J3400K0142J894j7989j6023O088K0084
297H826Q571j3328j8607r78J8510J4299p128j9006p533J2932J7712m68j7887j2723
311a6808P733J8350O634j3269j6517J396J6914J1363q017j7545n385J3394J5058
$$ plain form
324 13301 11294 -4760 -15174 -6489 10151 14152 864 -13073 -10581 5152 13902 5201 -10116
337 -10116 -12883 59 12727 9067 -5524 -13337 -4316 9874 11705 -777 -12835 -8344 5901
350 5901 12557 3594 -9928 -10530 1928 11982 7378 -6358 -12210 -2666 10019 9834 -2189 -11583
364 -11583 -6418 6696 11255 1749 -9830 -9147 3072 10935 5382 -7268 -10857 -773 9852 8362
378 8362 -3225 -10624 -4487 7288 9793 263 -9933 -7271 3650 10255 3882 -7056 -8917 302
392 302 9556 6681 -4055 -10043 -3245 7127 8682 -823 -9389 -5988 4596 9255 2605 -7104 -8113
407 -8113 1221 8935 5340 -4714 -8858 -2117 7388 7592 -1733 -8400 -4820 5057 8326 1277 -7441
422 -7441 -6920 1965 7913 3819 -5106 -7481 -411 7136 6158 -2369 -7762 -3169 5178 7129 -26 -7020
$$ packed form
324A3301k007j6054j0414Q685J6640M001j3288j3937K492J5733Q750q701j5317
337a0116k767J2942J2668l660j4591p813R021J4190J831j2482j2058M491J4245
350E901O656q963j3522o02J2458J0054m604j3736n852R544J2685j85j2023r394
364a1583N165J3114M559r506j1579O83J2219P863n553j2650l589J0084J0625j490
378H362j1587p399O137J1775K505r530j0196K662J0921O605o373j0938j861R219
392C02R254k875j0736n988O798J0372J555r505q566L401J0584M659o650r709j009
407h113R334P714l595j0054m144O741R505K04r325o667L580R877L269p049q718
422g441N21Q885N948m094q925k375P070P547r78q527n393M593Q347J951p155o994
$$ plain form
438 -7020 -5610 2930 7641 2895 -5372 -6761 268 7037 4648 -3290 -7323 -2063 5656 6211 -792
453 -792 -6842 -4189 3380 6997 1806 -5482 -5807 1311 6331 3947 -3647 -6773 -995 5681 5371 -1583
469 -1583 -6522 -3347 3979 6349 678 -5628 -4939 2049 6443 2866 -4298 -5988 -258 5610 4509
484 4509 -2243 -6064 -2378 4331 5518 -398 -5559 -4067 2365 6220 1995 -4439 -5376 483 5219
499 5219 3996 -2596 -5721 -1668 4213 4924 -464 -5269 -3314 2981 5435 1224 -4563 -4588 746 5252
515 5252 2862 -2808 -5085 -921 4565 4292 -1105 -5250 -2688 2837 4890 661 -4360 -4034 1555 5040
531 5040 2509 -3056 -4402 -393 4091 3446 -2003 -4632 -2107 3351 4176 -190 -4331 -3140 1792 4834
547 4834 1310 -3245 -4182 140 4137 2980 -2114 -4827 -920 3581 3959 -328 -4090 -2717 2150 4451
$$ packed form
438g020J410Q540M711m746q267j389P029O769k389p938m033N260P719N55p003
453g92o050K653P569L617n191p288l25P118N020k384p594l126N778O676l10o954
469a583m939L175P326K370n671o306O89O988M394l577p164j690N730N868j101
484D509o752l821L686O709J187n916n161J492O432L855m225o434r37N859M736
499E219j223o592l125M053N881P11n388m805J955O295K454m211n787k5N334M506
515E252k390n670k277M164N486k73n397m145K562N525K053m229n021L26N589L485
531E040k531n565j346M009M484o45n449k629K525N458Q25m366m141J191M932L042
547D834l524m555r37M322L997j157n094k713L907M501L78m287l762J373M867K301
$$ plain form
563 4451 1100 -3529 -3618 903 4188 2283 -2398 -4104 -618 3380 3246 -983 -4162 -1971 2377 3911
579 3911 443 -3437 -3222 1106 3984 1670 -2718 -3723 -253 3468 3027 -1145 -3717 -1558 2571 3590
595 3590 44 -3572 -2670 1637 3494 1201 -2659 -3264 203 3519 2274 -1630 -3537 -811 2848 3017
611 3017 -503 -3209 -1806 1684 3375 1129 -2776 -2472 730 3420 1968 -2024 -3085 -340 2711
626 2711 2349 -801 -3020 -1271 2009 3036 432 -2957 -2492 903 3279 1352 -2055 -2876 -242 2731
642 2731 2469 -1080 -2876 -1167 2017 2783 -131 -2697 -2252 957 2858 1109 -2236 -2558 251 2679
658 2679 1792 -1353 -2847 -891 2310 2599 -204 -2688 -1672 1468 2729 728 -2233 -2261 458 2604
674 2604 1500 -1477 -2659 -466 2210 2098 -600 -2447 -1328 1549 2547 246 -2251 -1867 719 2787
$$ packed form
563D451l351m629q9M521L285j905m681j706L486L998j34m229l179K191M348J534
579C911l468l880K15M328K878k314m388j005L470L721m41m172k572K159M129J019
595C590l546l616R02M307J857k293l860o05L467L316j245l904j907K726L659J69
611C017l520k706J403L490J691k246l905L04L202K690j452l992j061K745L051
626B711l62l150k219J749L280J027k604l389M65L395K376j927l407q21K634K973
642B731k62l549j796J709L184P66k914k566M45L209J901j749l345l22K809K428
658B679q87l145j494J956L201K89k803k484J016L140J261k001k961k8K719K146
674B604j104k977j182K193K676j12k698j847J119K877R98k301k497L84K586K068
$$ plain form
690 2787 1189 -1580 -2280 -215 2100 2141 -622 -2497 -850 1390 2380 -16 -2137 -1681 1149 2341
706 2341 629 -1784 -2183 67 2195 1433 -1100 -2444 -959 1918 1691 -174 -2234 -1298 1148 2423
722 2423 611 -1859 -1885 436 2222 1118 -1206 -2287 -361 1713 1930 -393 -2023 -1090 1123 1845
738 1845 430 -1610 -1473 432 1954 1078 -1199 -1831 -103 1787 1504 -682 -1750 -924 1382 1699 64
755 64 -1619 -1404 487 1845 504 -1213 -1605 -16 1482 1452 -642 -1592 -488 1286 1641 91 -1737
772 -1737 -1389 746 1645 407 -1168 -1542 -46 1285 953 -908 -1710 -598 1276 1358 -228 -1651 -956
789 -956 1058 1384 610 -1245 -1305 270 1670 946 -644 -1277 -260 1549 854 -353 -1446 -570 1105
806 1105 1417 289 -1215 -1208 402 1390 499 -1085 -1080 -260 1141 853 -348 -1581 -457 1023 1362 -52
$$ packed form
690B787j598k769p00K065K315M1k763j875J647K240R90k396k121M56K830J192
706B341j712k413l99K250K128p62k533j344J485K877k27j865k060R36K446J275
722B423j812k470k6K321J786j104k324j081J926K074K17k323j630R33K213P22
738A845j415k040J37J905J522q76k277o32J728J890k83k186j068Q26K306L17j635
755F4j683K15J891J358j341j717l92J589J498l0k094r50J104J774L55j550j828
772a737L48K135Q99j238j575l74J496J331l32j861q02J112J874Q2j586j423O95
789i56K014L26p74j855o0J575J400p24j590o33J017J809o95j207j093Q76J675
806A105L12j128j504PJ610R88q91j584NQ20J401k88j201j233J124J480L39j414
$$ plain form
824 -52 -1293 -1045 268 1226 145 -921 -1082 139 1248 718 -863 -1152 -494 871 857 -269 -1196 -624
842 -624 637 1392 246 -1023 -1206 199 903 921 -708 -922 -114 1065 794 -268 -1171 -495 620 1021
860 1021 40 -859 -842 182 947 288 -507 -1030 411 756 912 -234 -1063 -458 823 770 -241 -1083 -689
879 -689 278 971 477 -706 -847 79 1280 638 -362 -926 -299 769 724 -197 -804 -536 385 950 360
898 360 -876 -891 235 825 326 -433 -715 -264 754 513 -257 -947 -466 601 811 252 -665 -793 437
917 437 911 263 -508 -769 -196 682 502 -175 -1022 -351 744 594 91 -513 -793 221 725 474 -300 -499
937 -499 -24 694 309 -555 -1116 10 648 782 -185 -1124 -622 496 704 401 -499 -651 117 600 690 -270
957 -270 -619 85 807 657 -32 -726 -436 370 659 122 -671 -497 94 699 559 -316 -676 50 583 397
$$ packed form
824e2j241K48J313R58j081j066j61J221J109n30j581k89O58J365j4j126r27N72
842f24J261P55j146j269j83J405P04J8j629k14Q08J179k71j062r03O76J115M01
860A021r81q99J7J024P65o59p95n23J441L45J56j146q29O05J281n3j011q42L94
879f89R67O93m94j183j41R26J201o42j000n64O27J068m5r21o07K68R21N65n90
898C60j236j5J126N90m99p59k82M51J018k41p70o90M81J067K10n59r17j28J230
917D37M74o48p71k61N73Q78j80o77q47O71J095j50n03o04k80J014N04k51p74j99
937d99M75P18l85q64n61J126O38J34r67r39N02J118K08l03r00j52P68M83R0r60
957b70l49P04P22j50o89o94K90Q06K89n37p93J74N91O05j40q75l60P26N33j86
$$ plain form
977 397 -215 -708 -161 481 731 -22 -993 -415 552 704 469 -451 -693 -210 676 602 -109 -744 -138 376 468
998 468 164 -557 -464 382 637 332 -324 -852 -109 769 435 -231 -617 -57 590 596 -162 -534 -129 184 352
1019 352 168 -451 -458 -118 339 213 -288 -681 -217 417 329 -126 -642 -191 219 487 -14 -729 -404 191 660
1040 660 277 -26 -426 106 540 451 -139 -558 -276 -32 272 139 -587 -386 187 410 370 -483 -561 -67 170
1061 170 533 -17 -168 -155 367 494 92 -431 -659 380 293 202 -483 -406 96 425 355 -372 -639 120 515
1082 515 159 -179 -378 -269 261 413 -81 -232 -351 51 477 565 -45 -480 -322 108 204 -250 -461 -233 79
1103 79 281 287 -335 -131 164 425 196 -356 -167 -114 105 134 -115 -238 -329 113 403 -229 -210 -93 -5 411 -27
1126 -27 -415 -549 -36 434 468 83 -310 -255 469 357 -143 -427 -277 139 356 141 -364 -456 222 272 228 -200
$$ packed form
977C97o12m93N47O42K50p53r71N78R67J52k35r20k42M83Q86p4p11o35O06N14R2
998D68l04p21R3Q46K55l05o56n28P43Q78l34o66l86N60O47Op58l72M05L13J68
1019C52j84o19pL40M57j26n01l93M64O34q8m55n16M51M10K68n01p15L25N95M69
1040F60l83l03m00N32M34q9n90m19K82K44L04j33p26K01N73K23m0q53p8M94K37
1061A70L63n50j51J3N22J27m02n23k28J039q7r1o85P7N02L29p0p27k67P59L95
1082E15l56l38j99J09N30J52m94j51j19M02M26Q8o10m35J58M30R6m54k11K28L12
1103G9K02Oo22K04K95K61k29n52J89N3K19K9k49j23r1M42K90o32J9J17Q8M16m38
1126b7l88j34N13M70L4l85l93N5P24j12n00k84J50M16K17k15n05r2O78N0m4m28
$$ plain form
1148 -200 -324 -146 261 302 34 -442 -116 211 511 -329 -438 -243 117 364 235 16 -194 -97 331 175 25
1169 25 -181 -29 442 523 -78 -190 -143 137 334 131 -242 -473 -57 148 -15 -321 -313 -205 101 293 257 -340
1191 -340 -45 374 382 248 181 -376 -65 326 165 -265 -107 -205 -4 22 -317 -519 -232 21 64 -53 -249 -170
1213 -170 347 207 36 -43 -85 -123 -64 351 -414 -186 -229 216 204 -340 -288 -240 138 209 270 -270 -348 111 116 144 90
1238 90 -146 77 171 126 -41 -344 -136 217 275 142 -287 -108 116 143 -101 -40 -262 -77 247 156 -71 -347
1260 -347 -244 321 -24 -32 23 -144 114 -5 85 -96 -329 110 -14 222 -49 -126 -98 17 27 -54 -228 47 16
1283 16 121 -102 -173 -101 18 147 258 65 132 -79 27 101 290 -135 -250 51 64 158 203 123 -86 143 150 14
1307 14 -127 -76 124 197 -100 -49 -55 180 277 77 28 -414 63 -128 -293 -324 -129 -145 220 -186 3 41 49 -121
$$ packed form
1148b00j24J78M07M1k68m76L26L27L00q40j09J95L60K47j29k19k10R7M28j56j50
1169B5k06J52M71Q1o01j12M7K80J97k03l73k31M16K05j63l06QJ08L06J92l6n97
1191c40K95M19Qj34o7n57L11L91j61m30J58r8K01K6l39k02K87K53M3j17j96P9
1213a70N17j40j71p9m2l8N9M15p65K28m3M45j2n44N2M8L78P1O1n40p8M59NK8n4
1238I0k36K23R4m5j67l03K08L53N8j33m29J79K24K7k44O1k22J85L24r1k27k76
1260c47J03N65l45qN5j67K58j19R0j81k33M39j24K36k71p7K8J15J0q1j74K75l1
1283A6J05k23p1P2J19J29J11j93O7k11J06P4J89m25j15L01J3R4M5q0k09K29Pj36
1307A4j41N1K00P3k97N1oK35R7k00m9m42M77j91j65l1J95j6L65m06J89L8Qj70
$$ plain form
1331 -121 -38 71 50 -163 19 172 108 133 -46 99 -82 349 -36 -74 -52 167 -80 159 -215 137 -49 85
1353 85 -154 -38 -73 208 32 -94 -332 -337 23 -233 87 -51 109 -247 26 30 258 -249 -71 194 -50 70
1375 70 -153 -87 73 280 7 -183 -98 68 -75 -138 -46 -134 181 -95 246 -52 27 -6 -102 104 -12 -224 -60
1398 -60 -11 -52 34 -275 107 -100 -47 276 80 82 -91 -7 -5 -220 -61 -166 204 253 -88 -216 16 -63 405 316
1422 316 -79 117 -105 -13 82 -294 -133 -16 -17 102 -25 -302 -241 470 29 164 -291 -187 -495 -21 -25 12 -148
1445 -148 -215 99 43 125 -92 -52 7 302 -295 -18 -182 21 64 60 -67 -80 -70 41 91 127 195 92 -197 165
1469 165 254 -180 10 -54 118 116 50 34 -156 155 -69 48 26 -470 252 36 -65 -122 -106 9 279 -26 -12
1492 -12 -103 -177 217 42 -79 65 90 -200 166 -184 106 -373 29 128 -42 -150 261 75 283 106 -211 -77
$$ packed form
1331a21Q3J09k1k13J82J53o4K5j79J45j81M31l85l8K2K19k47K39l74L52j86J34
1353H5k39J16l5K81j76j26k38nL60k56L20j38J60l56K73MK28n07J78K65k44J20
1375G0k23O6J60K07k73j90Q5J66j43o3R2q8L15k76L41k98P9l3r6K06j16k12J64
1398f0M9m1Q6l09L82k07N3L23j96Kj73Q4Kk15J59j05L70M9l41j28K32p9M68q9
1422C16l95J96k22R2R5l76J61J17jJ19j27k77O1P11m41J35m55J04l08M74mL7j60
1445a48o7L14n6Q2k17M0N9K95n97K77j64K03M3mj27j3J0J11N0L6O8j03k89L62
1469A65Q9m34J90o4J72ko6j6j90L11k24J17k2m96P22k16j01n7J6J15K70l05J4
1492a2r1p4L94j75j21J44K5k90L66l50K90m79M02R9j70j08M11j86K08j77l17J34
$$ plain form
1514 -77 -70 74 170 42 -156 -25 189 27 -79 -63 -154 -61 -27 152 -95 -101 148 35 300 -194 -47 -82 -66 107
1538 107 287 -128 -153 -91 84 27 -88 -34 273 288 79 70 -129 -185 -58 43 -87 -145 -156 -64 369 109 -236 69
1562 69 9 -38 -73 107 45 -158 181 102 123 -196 -251 45 47 214 -3 -136 -329 31 164 110 20 190 164 358
1586 358 197 -266 -68 -77 129 -64 176 -256 -24 38 61 -147 -248 23 -35 -69 171 35 -85 -101 97 254
1608 254 -187 -175 46 -32 -100 -43 -239 192 64 232 -10 -16 -134 61 256 44 -48 -113 294 111 50 61 -310
1631 -310 111 -197 172 -151 -102 26 25 -3 263 -180 -137 -190 -17 95 -82 -107 80 233 -54 36 -124 -92 379
1654 379 -1 173 -24 76 160 -64 -73 -108 256 -8 59 80 -118 -210 -107 -103 -71 263 -55 -239 130 -53 -73 -228
1678 -228 -150 15 -109 18 171 -4 -321 189 -64 -49 -182 -205 -3 62 -176 -242 -106 32 85 136 -14 -82 -17
$$ packed form
1514g7PJ44R6j28j98J31K14j62j06J6r1R3L4J79k47oK49j13K65m94J47l5J6J73
1538A07J80m15k5O2J75n7j15N4L07J5k09rj99n6J27J01j30n8j1R2M33k60l45L05
1562F9o0m7l5J80o2k03L39p9K1l19n5K96KJ67k17j33j93L60J33n4r0J70k6J94
1586C58j61m63J98rK06j93K40m32K32O2K3k08j01K71n8l4K40j36j20j6J98J57
1608B54m41J2K21p8o8N7j96M31j28J68k42oj18J95J95k12r2o5M07j83o1J1l71
1631c10M21l08L69l23M9J28jk8K66m43M3n3J73J12j77k5J87J53k87R0j60L2M71
1654C79l80J74j97J00Q4k24rl5L64k64O7K1j98r2J03ML2L34l18j84L69j83k0j55
1678b28P8J65j24J27J53j75l17N10k53J5j33k3K02O5k38o6J36J38N3N1j50o8O5
$$ plain form
1701 -17 76 71 233 -88 -207 -213 147 218 18 -6 183 7 43 144 -28 -130 -101 171 109 135 39 -323 101 201
1725 201 -146 60 -226 137 147 293 85 102 83 -23 14 66 -173 -54 158 11 183 -112 127 -223 83 -186
1747 -186 -106 39 31 197 -2 -32 88 84 -51 -71 -259 -163 -198 -6 98 104 -1 18 -71 -53 50 -197 1 -144 128
1772 128 59 353 132 -471 348 98 67 -286 142 129 -22 64 -234 -109 51 96 202 11 42 -199 202 -36
1794 -36 50 210 111 -323 -74 -31 73 2 103 43 -81 -62 157 36 227 72 45 24 158 -112 138 91 159 67
1818 67 -114 -53 42 -143 56 -265 80 60 105 59 -16 -45 -25 -108 44 35 83 -26 17 -147 -191 10 30 125 -106 -82
1844 -82 103 -96 -116 85 64 259 234 104 102 69 216 39 61 -175 175 35 19 -78 -217 -32 -151 -75 55 -294
1868 -294 66 120 -18 -75 31 -141 -107 -98 81 -92 -55 145 -141 -142 69 110 59 39 -97 -37 -182 -25 -161 -43
$$ packed form
1701a7R3nJ62l21j19oL60P1k00k4J89j76L6J01j72j02K9K72o2K6r6l62M24J00
1725B01l47K06k86L63J0J46k08J7j9j06L7N2k39J19K12j47J72k95K39l50L06k69
1747a86Q0J45qJ66j99l0J20mj35k0j88R6l5J92J04Oj05J9q9J8J03k47J98j45K72
1772A28o9K94k21o03Q19k50l1l53M28j3j51Q6k98J25J60M5J06j91L1k41M01k38
1794c6Q6J60r9m34K49M3J04p1J01o0j24J9K19j21J91j55k7k1J34k70K50m7O8r2
1818F7j81O1R5j85J99l21L45k0M5m6p5k9K0q3J52rM8j09M3j64m4K01K0R5k31K4
1844h2J85j99k0K01k1J95k5j30kl3J47j77K2k36L50j40j6r7j39J85j19P6J30l49
1868b94L60N4j38n7J06j72L4RJ79j73L7K00k86jK11M1n1k0j36O0j45J57j36J18
$$ plain form
1892 -43 47 65 42 -222 113 -66 -41 -123 -73 -26 -161 -186 42 88 -102 -223 50 -135 -44 45 -45 -163 -210 -25 -33
1917 -33 21 98 -52 35 -211 154 229 257 45 73 45 -91 29 -72 204 154 93 -168 -10 -333 -228 -83 -106 50
1941 50 24 110 -137 -50 -241 80 195 23 -42 -109 -126 256 -123 -135 4 -104 13 -42 -164 -52 103 499 180
1964 180 134 5 107 36 129 114 -62 42 135 288 97 37 -16 54 96 -154 95 -298 193 -60 101 30 -24 35
1988 35 126 250 144 54 -28 -52 -106 42 -145 -158 -40 -140 2 135 -136 -126 -56 91 95 45 -74 -44 -5 -204 -10
2013 -10 -5 18 -82 -36 -91 -200 -86 149 -319 -19 57 -83 -2 -78 -239 105 107 41 -157 -146 225 -58 1 -123 -176
2038 -176 -73 -132 43 -202 160 -86 249 33 -139 55 -132 148 35 29 -63 -118 -293 -79 24 3 170 -342
2060 -342 25 122 -14 -57 -103 -128 73 -129 127 -199 162 85 48 -35 -117 -6 -235 -43 140 174 -174 20 113
$$ packed form
1892d3R0J8k3k64L35j79K5q2N0M7j35k5K28M6j90j21K73j85R1Q9r0j18m7J85q
1917c3N4P7j50Q7k46L65P5K8k12K8k8j36J20j01K76n0o1k61J58l23J05J45k3J56
1941E0k6Q6k47Q7j91L21J15j72o5o7j7L82l79j2J39j08J17n5j22J12J55L96l19
1964A80m6j29J02p1R3j5j76J04R3J53j91o0n3P0M2k50K49l93M91k53J61p1n4N9
1988C5R1J24j06r0q2k4n4J48j87j3J18j00J42J33k71J0P0J47Mn0j19L0L9j99J94
2013a0NK3j00M6n5j09J14K35m68L00P6j40Q1p6j61L44Ko6j98J1L71k83N9j24n3
2038a76J03n9J75k45L62k46L35k16j72J94j87K80j13or2n5j75K14J03k1J67n12
2060c42L67R7j36m3m6k5K01k02K56l26L61p7l7q3q2J11k29J92J83L4l48J94R3
$$ plain form
2083 113 153 113 293 118 33 -330 183 -105 253 125 67 -24 -251 94 238 46 13 254 84 -165 -177 142
2105 142 -189 -144 76 -87 -147 236 125 -84 -95 -121 72 -95 -196 -6 -92 -237 203 76 6 371 -15 -22 -8
2128 -8 -146 -44 211 165 -262 -72 189 48 43 201 -57 186 127 53 -186 154 55 62 324 -44 5 -75 -186 -76
2152 -76 48 98 -13 -138 -87 251 17 148 -27 -73 19 147 138 -84 126 151 167 -55 28 -106 24 63 30 175
2176 175 -132 -78 191 180 -79 130 -109 180 255 232 -26 75 -51 286 81 59 158 -62 -126 -147 182 -49 -184
2199 -184 1 95 -150 -78 -96 62 124 -235 -50 129 232 59 53 -157 -99 128 -34 95 201 48 -135 29
2221 29 28 255 82 174 58 126 233 -8 -64 -155 87 51 220 16 39 -197 19 288 -7 70 -24 196 51 -20
2245 -20 56 -381 99 250 244 16 -55 1 -5 -122 44 194 -138 360 28 137 -18 11 -256 -177 155 26 -38 64
$$ packed form
2083A13M0m0J80j75q5l63N13k88L58j28n8r1k27L45J44j92l3K41j70k49j2L19
2105A42l31M5K20j63o0L83j11k09j1k6J93j67j01J90q6j45M40j27p0L65l86pJ4
2128hj38J02K55m6m27J90K61j41nJ58k58K43n9p4k39L40r9PK62l68M9q0j11J10
2152g6J24N0j11j25N1L38k34J31j75m6R2J28rk22K10K5J6k22Q3j34J30L9l3J45
2176A75l07N4K69j1k59K09k39K89P5k3k58J01j26L37k05k2R9k20o4k1L29k31j35
2199a84J85R4k45P2j8J58O2l59J85J79J03j73ok10N8K27j62J29J06j53j83J64
2221B9jK27j73R2j16O8J07k41n6r1K42l6J69k04K3k36K16K69k95P7r4K20j45p1
2245b0P6m37M80J51ok28p1N6oj17J66J50l32M98l32J09j55K9k67P9L32j29o4J02
$$ plain form
2269 64 -102 51 -340 62 89 26 100 -136 61 -71 -171 -200 44 -263 117 -15 63 52 -103 -102 32 -52 59
2292 59 70 120 83 -168 -24 127 -69 -175 81 190 117 23 -110 -170 127 -220 -12 161 -133 -185 289 -10 -251
2315 -251 -117 -122 -77 -54 19 80 50 -41 1 61 34 29 270 -16 94 171 72 -97 -20 -65 230 -17 -9 72 -222 -73 146
2342 146 72 300 9 100 -74 -50 187 -25 -7 72 78 92 -116 111 -66 60 223 -38 -4 11 -194 27 211
2365 211 -99 -141 -56 265 -97 200 97 179 16 62 -41 318 -1 -150 -304 153 62 82 104 -130 205 -56
2387 -56 17 243 -51 -91 114 -43 104 -48 -105 -85 418 -54 256 25 -120 0 263 -44 -171 -159 102 252
2409 252 365 -244 -58 226 -102 89 -133 112 -86 122 18 -68 313 -90 -104 -118 -195 -44 -221 -116 -98 -210
2431 -210 -63 -175 190 74 263 -204 154 62 18 -4 244 156 -75 -209 26 -69 68 -145 220 75 -4 11
$$ packed form
2269F4j66J53l91M02K7o3P4k36J97j32j00k9K44l07L80j32P8j1j55JJ34q4J11
2292E9J1N0l7k51J44J51j96j06K56J09p3r4j33o0K97l47K08J73k94n2M74k99k41
2315b51J34nM5K3P3O1l0r1M2O0k7nK41k86J10P7r9j69P7m5K95k47QQ1k94J49K19
2342A46p4K28k91R1j74K4K37k12J8P9OJ4k08K27j77J26J63k61L4J5k05K21J84
2365B11l10m2Q5L21l62K97j03Q2j63M6j03L59l19j49j54M57r1K0K2k34L35k61
2387e6P3K26k94m0K05j57J47j52n7K0N03m72L10k31j45J20K63l07j27J2K61J50
2409B52J13o09J86K84l28J91k22K45j98K08j04q6L81m03j4j4p7J51j77J05J8j12
2431b10J47j12L65j16J89m67L58r2m4k2K48q8k31j34K35r5J37k13L65j45p9J5
$$ plain form
2453 11 -228 158 40 274 -42 -276 -319 -72 -189 123 -41 -183 -17 7 -90 32 211 -131 74 48 -94 -184
2475 -184 187 106 -70 156 57 -165 15 140 -85 42 -200 -143 -3 59 -38 -180 -152 118 19 -69 -26 -74 128
2498 128 31 20 -7 1 -113 -36 -354 124 93 -68 -33 -151 -70 42 -96 -144 -95 90 -44 -65 -105 235 26 -22 -51
2523 -51 -68 -102 7 256 -102 191 -39 0 -23 -190 149 87 26 154 31 -37 27 -276 46 -122 28 161 -41
2546 -41 174 -95 260 -76 187 -31 -97 -110 174 33 286 -110 23 -58 117 -58 37 -19 29 -110 -67 -22 51
2569 51 -109 -90 -277 47 166 201 123 -234 32 86 172 120 14 188 86 181 -240 -13 12 -75 96 -52 -14 111
2593 111 45 -95 74 318 -10 -135 215 -220 -99 -109 -33 89 -17 -47 -56 -91 -203 -274 -12 58 59 -185 109 -144
2617 -144 -82 -36 154 52 308 -77 -325 109 148 83 225 -26 -202 93 -50 -198 -231 139 158 125 71 -367 -21
$$ packed form
2453A1k39L86j18K34l16k34m3K47j17L12j64j42J66K4r7J22J79l42K05k6j42r0
2475a84L71q1j76K26r9k22J80J25k25J27k42N7J40O2r7j42K8K70r9q8M3m8K02
2498A28r7j1k7Qj14P7l18M78l1j61L5j18Q1J12j38m8M9J85j34k1m0L40k09m8k9
2523e1j7l4J09K49l58K93k30L9k3j67L39o2o1J28j23o8O4l03L22j68J50J33k02
2546d1K15k69L55l36K63k18o6j3K84j41K53l96J33q1J75j75R5n6M8j39M3M5P3
2569E1j60J9j87L24J19L5p8l57K66N4Q6n2j06J74j02R5m21K27K5q7J71j48L8J25
2593A11o6j40J69K44l28j25L50m35J21j0P6J22j06l0rl5j12p1K62P0Jk44K94k53
2617a44O2M6J90j02K56l85k48M34L9o5J42k51j76K95j43j48l3L70J9l3n4m38L46
$$ plain form
2640 -21 -135 68 188 2 -225 -15 79 28 215 -152 -277 16 -186 165 54 -16 82 -118 177 160 67 9 -399
2663 -399 -86 -102 -101 164 18 54 34 -73 -12 217 -93 -86 -47 -21 -64 -13 -93 0 -121 -100 -115 -235 -208 76 -185 -164
2689 -164 -6 43 -1 -92 -54 87 55 8 -62 209 129 5 59 75 -109 124 -99 -25 -255 -316 145 -16 81 76 49
2714 49 182 86 -40 246 29 -80 -27 -87 -23 26 -124 -12 -283 -24 -179 16 -23 -143 51 -47 -64 -54 147
2737 147 49 12 5 -88 95 -54 -315 -260 -82 -107 63 -111 68 71 -120 46 46 -45 -32 -115 127 -16 44 -13 229
2762 229 -164 -45 104 -151 31 -56 -155 -10 99 -85 -83 -130 -189 133 119 247 72 -37 76 225 -97 -10 -215
2785 -215 16 -208 -55 -16 351 53 -248 -143 4 -23 16 117 56 -59 154 240 69 -75 -272 1 330 -66
2807 -66 -35 20 147 127 8 97 -175 257 -94 -33 63 36 34 160 -23 -132 -76 36 56 124 276 168 17 -26 -54
$$ packed form
2640b1j14K03J20j86k27K10R4n1J87l67j25K93k02L51j11p0R8k00K95j7r3n8m08
2663c99L13j6JK65j46L6k0j07O1K29l10PL9K6m3N1q0R3j21K1j5j20K7K84k61K1
2689a64J58M9m4r1L8J41l2m7p0K71q0j24N4J6j84K33k23P4k30o1M61j61R7nk7
2714D9J33r6j26K86k17j09N3o0O4M9j50J12k71K59j55J95l9j20J94r8j7J0K01
2737A47r8l7pr3J83j49k61N5J78k5J70j74J79Lj91J66%r1J3q3K42j43O0n7K42
2762B29l93J19J49k55J82q7r9J45J09j84Km7n9L22j4J28j75j09J13J49l22Q7k05
2785b15K31k24J53L9L67k98l01J05J47k7L9J01o1j15K13Q6j71j44j97K73L29l96
2807f6L1N5J27k0j19Q9k72M32l51O1R6k7kJ26j83j09N6J12K0O8J52j08j51m3k8
$$ plain form
2832 -54 -123 -73 -146 78 -172 -149 -138 121 157 244 54 119 -57 -79 40 7 95 51 -18 187 250 83 268 69 20
2857 20 -23 109 244 -142 0 -2 -99 -15 -53 36 -202 96 -41 -105 -140 182 -271 29 57 76 81 -129 235 -98 -214
2882 -214 -108 142 -229 118 183 -37 133 -157 84 0 147 -167 -253 211 123 176 124 131 -175 64 0 -61 232
2905 232 65 -7 37 -104 46 -34 70 313 -191 -180 23 120 -46 84 -155 157 6 -135 -5 -87 -147 -92 -134
2928 -134 -50 126 -325 -91 -232 -27 -130 -388 -102 -31 -65 152 -119 80 -123 -208 -8 154 56 -102 116 -47
2950 -47 209 -164 15 73 48 57 -198 -48 68 41 -41 -27 20 -108 97 6 85 -206 209 3 93 -13 226 -82
2974 -82 -170 90 -179 108 -223 90 -7 -23 203 12 -130 73 20 -59 -2 116 18 173 -136 -57 -194 -186 -86 -97
2998 -97 55 -12 127 80 -41 -41 -351 -102 -40 -183 -88 -72 82 -149 -68 -20 -168 158 128 122 -111 -112 60 78 31 -12
$$ packed form
2832e4o9N0p3K24k50K3J1K59L6Q7j90O5j76k2J19l3Q8m4o9K05O3j67J85j99m9
2857B0m3J32J35l86J42kr7Q4l8Q9k38K98j37o4l5L22m53L00K8J9Nk10L64l33j16
2882b14J06K50l71L47O5k20J70k90K41q4J47l14q6M64q8N3n2Pl06K39o4o1K93
2905B32j67p2M4j41J50q0J04K43n04J1K03R7j66J30k39L12j51j41J30q2o0N5m2
2928a34Q4J76m51K34j41K05j03k58K86P1l4K17k71J99k03q5K00J62r8j58K18j63
2950d7K56l73J79N8k5Rk55J50J16k7q2J4M7j28K05r1P9k91M15k06R0j06K39l08
2974h2q8K60k69K87l31L13r7j6K26j91j42K03n3p9N7J18r8J55l09P9j37QJ00j1
2998i7J52o7J39m7j21%l10K49O2j43R5J6J54k31Q1M8j48L26l0ok33jJ72J8m7m3
$$ plain form
3024 -12 52 104 -207 52 51 -78 -88 -100 -26 26 25 78 158 -193 -193 253 13 143 23 78 -111 92 316 273 66 -31
3050 -31 62 134 202 -23 -83 60 -76 65 90 -87 98 59 -60 -124 -90 -115 271 -47 -154 107 -54 106 187 -277
3074 -277 -51 198 -31 -21 -185 -32 25 -60 -63 -67 136 -209 41 -199 -255 -64 -82 -199 -73 -144 -114 40 -79 89
3098 89 72 4 18 -22 0 19 -50 -12 185 21 -19 -154 114 -188 -2 138 -148 -104 -127 113 174 -135 -210 -63 -137
3123 -137 124 20 67 76 -146 246 40 -34 19 -33 213 20 88 34 124 132 -204 -43 -9 70 -86 35 -38 -32 181
3148 181 -32 -1 -89 -6 -100 -84 -31 -1 -55 -327 -254 -218 -181 87 32 37 -58 -37 -64 -30 40 106 43 -44 -101 -68 -270 69
3176 69 -110 -40 -113 -267 104 113 -72 233 -190 285 367 78 -53 29 94 -9 174 -48 -117 56 -121 37 237
3199 237 -50 125 -218 78 -84 -150 13 36 -65 30 19 23 -27 26 213 88 -22 117 132 -252 -158 -53 118
$$ packed form
3024a2O4N2l11K59jj29j0j2P4N2jN3Q0l51%M46k40J30j20N5j89K03K24m3k07r7
3050c1R3P2O8k25o0J43j36J41K5j77J85l9j19o4L4k5L86l18j07K61j61J60Q1m64
3074b77K26K49k29J0j64J53N7q5lmK03l45K50k40n6J91j8j17J26p1L0J54j19J68
3098H9j7o8J4m0K2J9o9L8J97j64m0j35K68l02J86J40k86M4k3K40O1l09p5J47p4
3123a37K61j04M7Rk22L92k06p4N3n2K46j93O8n4R0Ql36J61L4P9j56J21p3OK13
3148A81k13L1q8Q3r4J6N3L0n4k72P3L6L7K68n5Nr5K1k7L4P0O6o3q7n7L3k02L39
3176F9j79P0p3j54L71Rj85L05m23M75Q2k89j31Q2O5j03J83k22o9J73j77J58K00
3199B37k87J75l43K96j62o6J63K3j01R5j1Mn0N3J87j25j10J39J5l84R4J05J71
$$ plain form
3222 118 111 -240 -21 -181 244 -24 -43 167 76 -4 135 -92 -33 171 -49 139 -51 -116 -10 56 -36 -38 -276 -46
3246 -46 125 -150 -203 174 29 123 -250 233 -61 -148 149 101 -62 -218 -137 89 -12 -78 -272 -131 370 -186
3268 -186 22 69 191 91 37 -89 97 18 -75 -214 -5 154 -137 47 82 18 -227 -33 -44 0 177 -172 19
3291 19 34 -26 160 110 -166 101 8 -184 127 74 35 -15 -26 212 -159 167 162 -56 217 68 152 -218 234 83
3315 83 -83 34 -77 -66 -81 -124 -259 246 98 93 7 124 134 225 148 -36 45 181 41 181 -65 -118 -12 -131
3339 -131 -187 105 -137 182 67 238 -51 61 303 -89 123 -288 -152 222 108 127 -195 -154 111 -55 122
3360 122 -170 -74 -394 243 44 -107 -214 1 -134 113 -46 54 134 42 29 -51 -86 10 125 -57 59 -14 -175
3383 -175 -111 9 -348 173 -149 -156 94 -121 0 -55 -147 -51 251 -87 -110 16 -244 -102 -31 92 -19 -18 178
$$ packed form
3222A18pl51K19j60M25k68j9K10r1q0J39k27N9K04k20J88j90o5J06O6r2kk38K30
3246d6J71k75n3L77j45R4l73M83k94q7K97m8j63j56Q1K26j01o6j94J41N01n56
3268a86K08M7J22j00n4j26J86p9r3j39K09J59k91J84L5o4k45J94j1M4J77l49J91
3291A9J5o0J86n0k76K67r3j92L11n3l9n0j1K38l71L26nk18K73j49Q4l70M52j51
3315H3j66J17j11J1j5m3j35N05j48nq6J17J0R1p7j84Q1J36j40J40k46n3J06j19
3339a31n6K92k42L19j15J71k89J12K42l92K12m11J36L74j14J9l22M1K65j66J77
3360A22k92R6l20O37j99j51j07K15j35K47j59J00Q0r2j3q0l5R6J15j82J16p3j61
3383a75O4J20l57N21l22pK50k15J21n5r2R6L02l38k3J26k60J42P1J23j11JJ96
$$ plain form
3406 178 -357 -165 236 -52 -149 -101 55 -145 23 17 69 55 -158 166 -1 64 165 355 -322 6 -209 -63
3428 -63 319 -298 -3 15 -56 209 -242 -140 -47 59 151 -74 -66 37 60 -128 -147 234 49 -60 181 69 168
3451 168 -175 5 56 -40 43 -25 -84 186 162 3 168 -109 292 135 -24 63 -110 61 -173 -80 -140 49 -109
3474 -109 204 -93 46 -234 -158 -128 -9 75 -116 71 165 -159 -4 152 131 69 3 45 27 72 -156 -21 -77 181
3498 181 114 158 84 -119 -89 -110 1 -164 41 -145 23 -284 -295 -58 -49 -164 -214 61 68 109 -136 74 -21 -171
3522 -171 267 -120 5 55 30 -108 375 7 -13 96 -166 14 16 329 20 -30 41 43 -55 43 275 -66 3 57
3546 57 -198 5 -72 15 377 55 -45 164 -38 114 12 -126 -318 222 135 264 128 -153 94 -83 268
3567 268 -142 55 -30 217 -1 -103 -182 142 61 -49 -27 111 -294 -55 -218 165 34 -131 67 -43 73
$$ packed form
3406A78n35J92M01k88r7M8J56k00J68oN2j4k13L24j67O5J01J90o77L28k15J46
3428f3L82o17K95J8p1K65m51J02R3J06R2k25QJ03K3j88j9L81j85j09K41j12R9
3451A68l43J80N1r6Q3o8n9K70k4j59J65k77M01j57j59Q7j73J71k34R3o0J89j58
3474a09L13k97J39k80P6L0J19Q4j91J87R4l24J55J56k1o2o6M2j8M5k28J35n6K58
3498A81o7M4p4k03L0k1J11j65K05j86J68l07j1K37Rj15n0K75PM1k45K10r5j50
3522a71M38l87J25N0k5j38M83l68k0J09k62J80KL13l09n0P1Kr8R8K32l41O9N4
3546E7k55K03p7Q7L62l22j00K09k02J52j02j38j92N40q7J29j36k81K47j77L51
3567B68m10J97q5K47k18j02p9L24q1j10K2J38m05K39j63L83j31j65J98j10J16
$$ plain form
3588 73 70 35 -309 -149 -131 -101 97 -126 -10 -213 83 -203 -61 -57 125 -91 -108 475 -93 98 1 9 24 -146
3612 -146 111 -28 -29 16 -109 78 -33 188 -127 132 83 88 -199 24 3 232 -100 -130 66 -35 -168 13 153
3635 153 154 -41 -64 135 21 -3 129 375 56 139 -91 156 -159 -238 18 184 -130 65 39 21 -4 60 258
3658 258 68 34 138 65 -63 8 40 -38 -164 -73 163 131 6 60 -112 216 33 -118 -228 5 -18 -42 -10 -112
3682 -112 61 -192 54 347 19 -70 32 14 28 -76 2 35 -57 -151 -109 -121 90 105 189 -264 -188 155 -130 13
3706 13 -214 158 182 34 -93 -36 -109 125 -213 -24 163 122 157 49 -96 -88 31 -11 165 -70 -168 -9 98
3729 98 -18 84 -87 -10 333 216 26 42 142 241 274 -328 -347 -36 -4 -203 122 90 67 22 -129 -313 63
3752 63 25 178 69 -28 -143 27 225 -88 298 299 -238 -42 -167 -37 229 -320 150 -98 129 -95 -47 -37
$$ packed form
3588G3ll5l44J60J8L0J98k23J16k03K96k86J42MJ82k16j7N83n68J91r7QJ5j70
3612a46K57j39jM5j25J87j11K21l15K59m9Nk87K23k1K29l32l0J96j01j33J81J40
3635A53Jj95k3J99j14k4J32K46l19Q3k30K47l15p9K56J66l14J95k6j8k5O4J98
3658B58j90l4J04p3j28P1L2p8j26R1K36l2j25N4j72L28j83j51j10K33k3k4L2j02
3682a12J73k53K46K93l28q9J02j8J4j04P8L3r2r4M2j2K11J5Q4m53P6L43k85J43
3706A3k27L72K4j48j27N7p3K34l38J89J87m1L5j08j45QJ19m2J76k35r8J59J07
3729I8j16J02j71P7L43j17j90J6J00R9L3o02j9L11L2j99L25l2k3m5j51j84L76
3752F3l8J53j09r7j15J70J98l13L86Jn37J96j25J30K66n49M70k48K27k24M8J0
$$ plain form
3774 -37 206 196 142 -115 36 247 -109 3 26 -8 -99 -143 44 102 -4 1 -148 -101 -392 -23 -7 110 102 67 -74
3799 -74 -127 184 26 84 111 -95 111 99 -48 63 70 -54 -97 -66 -136 -94 -35 -25 30 13 -174 236 80 -223 -102
3824 -102 223 -6 31 130 112 225 151 18 -35 -22 -151 -81 -205 -226 -87 -170 -241 -166 227 -55 -56 -280 239 309 -180
3849 -180 -188 138 207 -13 7 235 38 82 -83 -70 -47 -51 -4 -202 -176 -144 56 9 77 27 -94 118 -266 -260 -85 199
3875 199 -88 154 68 119 323 -100 319 96 2 4 -15 -57 146 69 41 -209 -75 155 119 114 -5 274 -287 -1
3899 -1 119 -38 73 40 40 304 -20 -7 -81 -19 16 -240 1 -33 -120 -280 -116 232 130 -12 92 -142 -147 -141 109
3924 109 170 130 128 -123 -115 259 -71 38 -122 380 57 -23 200 195 90 132 16 123 165 17 -117 205 33 -110
3948 -110 -62 211 -125 187 -98 0 -87 -12 49 -105 -199 -105 -87 22 -268 -64 33 -129 -21 4 259 122 -41
$$ packed form
3774c7K43j0n4k57J51K11l56J12K3l4r1m4J87N8j06Nj49M7k91L69J6J17ql5j41
3799g4n3L11j58N8K7k06K06j2j47J11Pj24m3L1p0M2N9J0N5j7j87M10j56l03J21
3824a02L25k29L7R9j8J13p4j33n3J3j29P0j24k1J39q3p1P5L93k82jk24N19P0m89
3849a80qL26O9k20K0K28j97M4j65J3K3mM7j98K6L2K00m7O8n0j21K12l84OJ75K84
3875A99k87K42q6N1K04m23M19k23r4Kj9m2K03p7k8k50J34K30l6nj19K79n61K86
3899aJ20j57J11l3%K64l24J3p4O2L5k56K41l4q7j60J64L48j02j42J04k34nOK50
3924A09O1m0kk51QL74l30J09j60N02l23q0K23nj05M2j16J07M2j48j34L22j72j43
3948a10M8K73l36L12k85R8q7P5O1j54r4R4J8J09k90K04R7j62J08K5K55j37j63
$$ plain form
3971 -41 -41 -133 -47 57 109 2 236 -3 79 -42 -227 52 35 44 33 -41 43 187 -164 13 -60 -35 13 117 54 -171
3997 -171 -89 312 95 231 -133 41 -19 41 -3 137 -297 -49 -83 34 81 -55 121 249 -70 179 -33 210
4019 210 -68 126 67 -169 9 -132 273 -129 -101 -85 118 -50 124 130 -16 225 -144 -84 57 200 -275 13
4041 13 239 -139 -29 -70 -206 4 148 33 64 168 -16 -60 73 -133 25 45 219 228 210 37 -221 36 17
4064 17 4 -12 243 76 -232 -126 165 216 -105 -324 35 -115 -27 179 39 -49 -328 -38 66 73 63 48 -94
4087 -94 -49 77 39 132 147 -153 -2 -149 5 -111 -158 -11 -27 76 -27 176 -1 -240 39 172 -183 -250 -50
4110 -50 -14 -60 -69 235 185 -27 172 -30 65 13 -186 -61 216 26 -167 196 -40 145 -273 218 15 49 23
4133 23 -98 -55 -30 -61 -29 105 -239 -58 54 -268 155 13 74 32 45 76 -96 63 -126 6 -151 246 -27
$$ packed form
3971d1%r2Q6J04N2j07K34k39Q2j21j85K79j7Rj1p4Q4J44l51J77p3K5M8J04o3k25
3997a71Q2M01k17J36l64J74o0O0m4J40m34K48l4J17M7j36J76J28l19K49k12K43
4019B10k78J94n9k36J78j41M05m02K8J6K03j68J74Oj46K41l69O0J41J43m75K88
4041A3K26l78J10m1j36K10J44j15L1J04j84m4J33k06J58K0J74Rj8j73k58K57j9
4064A7j3j6K55j67l08J06K91N1l21k19L59j50Q8K06j40q8k79K90J04Pj0j5j42
4087i4M5J26l8R3J5l00J51j47J54j16m7J47j6J03j03K03j77k39K79J33l55o7K00
4110e0L6m6rL04n0k12J99k02R5n2j99J25K77j90j93L63k36J85m18M91k03L4k6
4133B3j21M3K5l1L2J34l44J81J12l22M23j42O1m2J3L1j72J59j89J32j57L97k73
$$ plain form
4156 -27 -191 -100 12 -194 200 -104 261 -93 205 116 145 63 111 99 -61 277 157 -150 -229 -261 74 111 5
4179 5 -51 -166 -300 -168 -113 -224 -84 -80 -68 7 -12 64 205 124 -172 145 -185 -254 -20 55 56 98 -28 -19 82 171
4205 171 -74 13 -116 -90 56 -98 147 16 -20 348 -182 205 -187 -86 31 -24 124 -124 -255 -336 148 46
4227 46 -255 -457 -237 -13 -175 236 253 101 212 -135 18 198 1 112 206 36 246 227 -28 154 119 -232
4249 -232 -123 -60 224 -114 12 -69 84 -55 -76 34 -95 -117 151 -202 139 71 -213 81 103 -161 32 58
4271 58 44 51 115 80 40 89 -250 103 67 133 -12 265 48 41 -113 196 -53 141 -17 -133 -35 85 115 -168 35
4296 35 38 123 -77 -107 -95 191 -106 44 -151 -208 -43 12 121 -130 -140 -190 14 -34 -56 -112 -205 192 63 -92 237
4321 237 62 -12 -63 -341 -9 -70 181 148 192 -14 -240 251 -38 -40 -151 -210 191 44 40 -86 -111 299 298 189
$$ packed form
4156b7j64R1J12k06L94l04L65l54K98q9K9q2M8j2j60L38j20l07p9l2L35L7j06
4179En6j15j34J32N5j11J40MJ2P5j9P6J41q1k96L17l30o9K34P5JM2j26RJ01Q9
4205A71k45Q7j29K6J46j54K45j31l6L68n30L87l92J01J17n5J48k48j31q1M84j02
4227D6l01k02K20K24j62M11J7j52J11l47J53J80j97J11R4j70K10j9k55J82l5l51
4249b32J09O3K84l38J26q1J53j39k1J10j29k2K68l53L41o8k84K94K2k64J93K6
4271E8j4PO4l5m0M9l39L53l6O6j45K77k17pj54L09k49J94j58j16R8J20L0k83K03
4296C5LQ5k00l0J2K86k97J50j95n7J65N5J09k51j0n0K04m8k2n6r3L97j29j55L29
4321B37j75p4n1k78L32o1K51l3M4k06k26M91k89kj11n9M01j47mj26k5M10jj09
$$ plain form
4345 189 -19 -29 -19 -162 275 -120 -42 -56 -156 84 384 -86 -200 171 -98 -157 -126 54 -123 -127 -6 119 -109
4368 -109 88 173 291 24 -84 66 167 -11 -124 -86 296 45 99 69 -184 56 -5 100 -222 -18 106 13
4390 13 77 103 -104 35 233 -46 -4 -91 152 116 -182 -91 -79 274 -294 4 96 -48 -92 129 269 134 52 54
4414 54 204 -94 -26 184 -84 17 80 38 133 8 -33 62 -67 28 -14 -232 5 -90 38 163 187 -80 -226 44
4438 44 -210 -179 -140 -202 -352 153 -149 -58 56 -73 77 -37 -90 -65 78 -184 211 81 -151 13 -27 279 105
4461 105 92 40 58 134 -50 17 -35 -31 121 -54 214 13 -33 43 -254 -95 -187 145 -282 157 -116 -19 -39 -95 -45
4486 -45 -171 108 151 -146 -204 -93 111 49 -13 -158 -24 42 272 69 -141 -379 24 -39 50 -89 -22 -69 -298
4509 -298 262 211 131 46 77 152 49 -210 -120 9 43 -207 -77 71 -34 -15 178 -8 36 -161 57 -125 -65
$$ packed form
4345A89k08j0J0j43M37l95P8j4j00K40L00m70j14L71k69n9L1J80j77mJ21J25k28
4368a09J97Q5J18k67j08J50J01j78j13L8L82k51N4l0k53K40o1J05l22K04J24r3
4390A3O4K6k07J39J98k79M2q7K43l6k98R1J2L53n68K98R2j44m4K21J40j35q2K
4414E4J50k98O8K10k68J01O3m2R5j25m1R5j29R5m2k18K37r5J28J25K4k67j46K70
4438D4k54L1L9o2j50N05l02R1J14j29J50j14n3K5J43k62L95j30k32J64m0L06j74
4461A05j3n2J8P6j84O7n2MJ52j75K68k01m6P6k97J59r2L32m27M39k73R7k0n6N0
4486d5j26K79M3k97n8J11K04o2o2j45J34O6K30k03k10k38M03o3Q9j39O7m7k29
4509b98N60n1q0q5L1P5j03k59R0J29L4k50J30J48j05J9J93j86M4j97K18j82O0
$$ plain form
4532 -65 -31 -30 64 -37 -98 -137 -182 -203 -35 -206 -138 103 -55 93 38 153 -122 -74 115 111 -82 27 -72 173 203
4557 203 -53 -39 -81 -73 -292 24 -40 -101 -231 4 81 -122 38 82 196 -68 -9 -99 114 -15 -27 -61 224 46
4581 46 8 203 88 2 156 -253 -23 225 81 33 -33 -239 -88 -42 -195 -36 110 87 186 106 -13 92 -32
4604 -32 35 -131 -205 -30 -44 167 -11 -71 20 34 -136 -238 -2 -12 81 -216 216 106 -16 11 121 -71 208
4627 208 298 57 254 -65 156 3 42 -311 -255 45 -167 -271 80 99 30 201 412 66 353 -48 -12 -30
4649 -30 -94 292 115 -114 -336 -108 18 9 209 -85 176 -12 149 -237 -40 117 -67 19 222 82 10 78
4671 78 79 113 -62 163 -85 149 48 -263 -5 79 115 -48 -90 90 204 198 -13 -195 149 -12 115 129 -117
4694 -117 -191 96 -5 158 77 -144 103 -231 -51 204 -111 -45 -120 -133 83 11 -16 -226 -63 -225 227 48
$$ packed form
4532f5L4JR4j01o1l9m5k1J68j71O8K41j58J48n5J15k75M8J89mj93J09r9K45L0
4557B03k56J4m2Qk19L16o4o1j30K35P7k03J60M4J14k64N9r0K13j29j2l4K85j78
4581D6l8J95j15q6J54m09K30K48j44m8o6k06J51M6j53J59J46k3R9q0j19J05j24
4604c2O7j66p4J75j4K11j78o0R1J4j70j02K36j0R3k97M32j10j22K7J10j92K79
4627B08R0k41J97l19K21j53L9l53N6L00k12j04L51J9o9J71K11l46K87m01L6j8
4649c0o4L86j77k29k22K28J26rK00k94K61j88J61l86J97J57j84Q6K03j40p2O8
4671G8JL4j75K25k48K34j01l11K58Q4L6j63m2J80J14ok11j82L44j61J27J4k46
4694a17p4K87j01J63q1k21K47l34J80K55l15O6p5j3K16p2k7k10J63j62M52j79
$$ plain form
4716 48 45 -50 -51 -31 -68 -64 -92 38 191 168 -63 10 -91 130 67 460 -65 -57 41 -95 222 -142 81 70 22 -4 -362
4743 -362 -23 -30 43 -1 -12 -116 -78 25 31 -1 17 52 -221 55 -42 -211 244 283 -101 -10 -4 3 98 160 -43 127 166
4770 166 -110 -31 -198 -66 65 114 79 -143 -36 25 239 81 72 -47 -171 -151 -220 35 -100 -27 85 -205 79
4793 79 -234 -74 109 0 46 -248 -102 18 -81 -56 -213 -194 -79 38 -12 142 -54 -152 -18 -58 -94 -183 -44
4816 -44 92 -29 155 -119 114 -12 118 271 308 95 107 196 -6 100 -165 -103 106 131 115 -57 134 -92
4838 -92 191 -54 52 -160 161 -37 -12 6 119 -179 191 -49 -171 106 178 139 -109 73 50 70 34 -89 -75
4861 -75 -38 9 139 -63 181 41 308 10 -281 105 -76 -115 230 -237 150 239 -110 52 64 -28 129 -122
4883 -122 -123 99 -215 -174 -191 -108 -63 167 -54 -270 24 96 9 -163 -48 82 -29 19 240 -4 -10 144 -15 -240
$$ packed form
4716D8lr5jK0l7Mk8J30J53k3k31P3j01K21o3L93n25QR8j36L17l64K23j1m8k6l58
4743c62L39pP3m4j1j04L8J03Ol2J8L5k73K76r7j69M55L9l84R1OPR5O2k03J70L9
4770A66k76P9j67J32J31M9l5k22J07O1K14j58rj19j24K0o9K55j35P3J12k90K84
4793G9l13J60J83j09M6k94J46J20r9K5j57J9J15J17n0J54j96r8J34m0l6q9J39
4816d4J36j21J84k74K33j26J30J53L7k13J2Q9k02J06k65O2K09K5j6j72J91k26
4838i2K83k45J06k12L21j98K5J8J13k98L70k40j22K77P2l9k48J82k3K0l6j23J4
4861g5L7M7J30k02K44j40K67k98k91L86j81l9L45m67L87Q9l49J62J2r2J57k51
4883a22jK22l14M1j7Q3M5K30k21k16K94P2q7j72J15J30j11M8K21k44oJ54j59k25
$$ plain form
4907 -240 -106 91 114 111 -58 -114 -101 54 -244 26 -103 -26 73 122 -81 24 -83 -219 -122 -137 51 211 35
4930 35 -44 -88 -96 12 -24 -115 -29 105 118 233 3 257 -5 18 -110 53 -145 67 -29 -58 62 29 135 151 103
4955 103 -72 -286 38 79 -112 -54 -102 46 -190 -114 -101 -61 -70 -102 -188 -115 53 57 80 162 -46 -61 23 -123 -208 -99
4981 -99 -12 -122 -195 -156 37 34 -20 -130 -229 186 -60 7 -171 -261 11 20 3 269 -19 -60 -4 -32 -95 -11 97 50
5007 50 -19 390 174 -57 -138 106 -159 128 40 22 -189 -64 75 -132 -63 -166 365 25 -29 -139 196 -99
5029 -99 220 -82 -21 198 -251 104 73 -9 -23 13 77 164 123 63 -13 -97 192 92 -4 -3 204 -8 -126 -96 -24 36
5055 36 -85 197 30 -121 56 -16 -3 -75 211 166 102 149 23 -111 -193 116 55 -12 154 -69 -90 177 74 85
5079 85 -7 -62 61 -82 -13 164 18 -198 -50 -160 170 59 -180 -7 19 -54 68 145 -27 177 14 143
$$ packed form
4907b40J34J97K3lj69n6J3J55k98K70j29P7R9M9k03J05j07j36R7j5J88J60j76
4930C5p9m4qJ08l6r1Q6J34J3J15k30K54k62K3j28J63j98K12r6k9J20l3J06J6m8
4955A03j75k14L24M1j91N8m8J48k36P6J3M0rl2q6P3J68MK3Q2k08j5Q4j46q5J09
4981i9Q7j10p3L9J93ln4j10r9M15k46O7j78r0K72Rj7K66k88m1N6k8o3Q4J08m7
5007E0o9M09k16k31q1K44k65K87q8j8k11J25J39k07O9j03N31l40n4j10L35k95
5029i9L19l02O1K19m49L55l1q2j4L6O4Q7m1o0p6q4K89j00r6JK07k12j18L0P2O0
5055C6j21K82j67j51J77p2J3p2K86m5o4M7j26j34q2L09o1o7J66k23k1K67j03J1
5079H5r2n5J23j43O9J77j46k16J48j10L30j11k39J73K6p3J22P7j72K04j63J29
$$ plain form
5101 143 -39 -3 219 -56 41 85 -41 -127 -6 84 -42 -24 103 -237 -108 -10 86 -89 14 -107 -56 -75 -19 -151
5125 -151 30 -81 -215 -45 9 92 -285 -38 -60 -10 29 -111 20 -11 -30 -173 -319 -335 164 142 141 -122 -160 182
5149 182 278 142 228 -52 23 26 21 -11 97 82 -192 -114 106 -150 4 203 43 291 306 98 146 65 -158 39
5173 39 110 179 -179 -199 115 18 -26 61 98 16 26 137 -28 -12 53 122 16 -64 -173 -192 -2 -97 -34 -228 -76 83
5199 83 52 -73 -82 0 45 64 9 114 -39 -111 -118 -46 190 2 -257 306 40 23 42 49 71 -106 317 35 154 -64
5225 -64 83 -182 -95 26 288 -208 -117 -177 -53 390 -43 -240 13 -70 133 81 135 -124 137 140 5 46 -136
5248 -136 226 -16 75 70 -60 99 -99 -57 -86 -164 -80 122 77 -247 113 -77 64 137 15 125 -93 182 4
5271 4 -38 -32 79 206 -49 88 -264 -173 -161 95 -64 124 37 133 115 25 -117 174 8 -177 78 178 -46 -74
$$ packed form
5101A43j82L6K22k75R7M4j26q6J21R0j26J8J27l40J29R8R6j75J03j21N1j9N6j32
5125a51J81j11j34J70N4Q3l77K47k2N0L9j40J31l1j9j43j46j6M99k2jk63l8L42
5149A82R6j36Q6k80P5Lnl2J08j5k74P8K20k56J54J99j60K48J5k08M8q1k23J97
5173C9P1O9l58k0L14r7m4Q7L7q2J0J11j65J6O5O9j06q0j09j9J90r5O3j94J52J59
5199H3l1j25rQ2M5J9n5J05j53p2pP2K36j88k59N63k66j7J9PK2j77M23k82J19k18
5225f4J47k65Q7J21K62m96R1o0J24M43m33j97K53q3K03n2N4k59K61Lj35M1j82
5248a36L62k42R1nj30J59j98M2k9p8Q4K02m5l24L60j90J41P3j22J10k18K75j78
5271Dm2OJ11J27k55J37l52R1J2K56j59J88q7R6j8r0j42K91j66j85K55J00k24k8
$$ plain form
5295 -74 190 -49 -99 -97 220 -75 139 -14 283 -26 248 75 68 -310 -51 -137 -61 85 285 173 12 39 106
5318 106 43 -162 84 99 7 -156 5 147 -4 -29 117 256 -100 -37 -18 84 110 -320 -143 -188 120 92 115
5341 115 52 127 3 -15 -162 -215 -186 -36 36 68 56 -180 37 55 -137 -91 8 -85 -51 165 -148 5 -159 -176 64
5366 64 -95 -94 -26 91 294 88 -202 109 163 56 29 -202 145 197 6 185 328 -160 -163 360 167 -83 -264
5389 -264 -50 68 29 -304 35 133 25 -161 36 -60 94 -132 145 155 -151 -34 -124 -124 -6 69 -170 242 90
5412 90 102 150 185 110 -166 -88 -58 -96 -28 5 200 -97 -53 -53 215 -154 -41 69 40 36 34 -87 -57 -22 -26 5 -68 268
5440 268 46 -156 -52 44 -207 -109 198 166 -45 173 111 -193 -313 83 -73 -91 -50 23 -1 41 -122 -113 -119 -66 -154
5465 -154 -361 -27 199 64 12 13 93 16 151 142 147 6 -159 63 -46 -153 -140 224 285 65 8 -150 -2 104
$$ packed form
5295g4K64k39n0KL17k95K14j53K97l09K74j73pl78K59q6P6J46K00j12j61K7O7
5318A06o3k05K46J5r2j63J61J42j51k5J46J39l56O3J9J02K6m30J77m5L08k8K3
5341A15o3P5j24j8j47n3K9J50P2L2j2k36K17J8j92M6R9r3L4K16l13J53j64j7K40
5366F4j59JO8J17K03k06k90L11N4j07k7k31L47N2j91J79J43m88lN23j93k50j81
5389b64K14J18l9l33L39R8j08j86J97r6J54k26K77J0l06J17r0%J18P5k39M12j52
5412I0J2M8L5p5k76P8L0l8O8L3J95k97M4%K68l69J13J10k9mkj21L0L5mL1p3L36
5440B68k22k02J04R6k51R8L07l2k11K18o2l04j20L96j56j8M1P3k4M2j63RoN3q8
5465a54k07L34K26j35n2JQ0p7J35rNj41j65K22j09j07J3L64O1k20n7j58J48J06
$$ plain form
5489 104 -51 86 -138 131 -98 96 -97 22 259 -77 73 -127 -48 25 -1 -25 -11 -72 252 78 123 178 111
5512 111 -41 -276 -180 63 62 -16 115 -226 64 -59 -130 128 -45 -109 -70 226 -191 399 101 -151 -100 104 -28
5535 -28 120 -91 73 20 44 -58 64 -10 61 -28 -196 151 -31 -318 19 -21 24 -126 -7 62 -196 39 -12
5558 -12 220 -90 -66 55 240 -20 52 126 -175 75 -228 129 -196 -50 -238 278 32 127 83 -112 -209 127
5580 127 36 88 10 -100 -225 137 42 -34 289 14 -38 127 84 78 -45 -121 -5 235 -149 65 -88 335 -29
5603 -29 50 20 -173 -153 6 194 -120 46 -222 -404 49 43 50 53 273 350 -219 395 20 38 -94 145 208 70
5627 70 15 -90 -131 -105 10 -180 165 -95 29 -140 80 -190 -38 77 -27 67 -107 16 -117 -69 97 173
5649 173 162 79 -21 61 -252 6 -20 -9 -5 -71 130 29 -42 -32 -102 -2 3 14 -252 -197 -209 -209 85 134 70 -193 -167
$$ packed form
5489A04j55J37k24K69k29J94j93J19K37l36J50k00P9P3k6k4J4o1L24j74M5N5o7
5512A11j52k35R6K43jp8J31l41K90j23p1K58j73o4L9K96m17N90k98k52N1K04j32
5535b8J48k11J64n3K4j02J22p4P1q9j68L47j82k87L37m0M5j50J19O9k58K35n1
5558a2K32l10K4J21J85k60P2P4l01K50l03L57l25J46j88N16k46R5m4j95r7L36
5580A27r1N2p8j10j25L62r5p6L23k75n2J65m3oj23p6J16K40l84K14j53M23l64
5603b9P9l0j93K0J59J88l14J66k68j82M53oPLK20P7n69O14l75J8j32K39O3j38
5627G0n5j05m1K6J15j90L45k60J24j69K20k70J52J15j04R4j74J23j33M8J66P6
5649A73j1q3j00Q2l13K58k6J1Mo6K01j01p1J0p0J00NJ1k66N5j2%K94M9o4k63K6
$$ plain form
5676 -167 128 -219 39 -96 81 -131 -141 75 109 171 146 40 29 231 252 43 29 145 182 10 62 -50 -133
5699 -133 46 320 35 -80 224 -62 187 147 -12 155 -52 127 21 -172 286 -171 -18 -76 -61 37 24 -7
5721 -7 158 -92 125 -174 -8 30 151 -103 -173 -208 -275 -148 133 142 -53 123 204 149 6 204 -275 75 -141
5744 -141 -39 -65 191 -91 83 20 -157 216 82 86 60 99 -19 67 347 -45 -100 69 39 4 159 63 1 165
5768 165 9 41 -37 -120 -88 -41 -115 -137 -61 315 285 141 53 137 140 90 184 248 15 -115 -161 38 33 275 37 133 -61
5795 -61 148 -341 -143 -79 -25 120 -44 -117 -126 -62 119 -93 197 -314 -18 211 83 156 75 -163 325 174 294
5818 294 7 164 -146 -164 -290 -214 65 152 90 80 132 149 20 -197 -14 33 -101 -43 -77 129 -157 -32 267
5841 267 260 -75 -143 -75 -4 89 140 43 47 265 -34 25 142 66 -60 89 317 -71 -37 404 -31 7 -115 133 -91
$$ packed form
5676a67K95l47K58j35J77k12j0K16L4O2k5j06j1K02K1k09j4J16L7j72N2j12q3
5699a33J79K74k85j15L04k86K49m0j59J67k07J79j06j93M58m57J53n8J5R8j3l1
5721gJ65k50K17k99J66L8J21k54p0l5o7J27K81Rj95J76Q1n5j43J98m79L50k16
5744a41J02k6K56k82J74o3j77L73j34Mk6L9j18Q6K80l92n5J69l0l5J55r6o2J64
5768A65j56L2p8q3L2M7p4k2P6L76l0j44q8Q4Ln0R4O4k33j30m6J99nK42k38R6j94
5795f1K09m89J98O4N4J45j64p3rO4J81k12K90n11K96K29j28P3q1k38M88j51J20
5818B94k87J57l10j8j26P6K79Q7o2j0N2J7j29k17J83M7j34N8l4K06k86J25K99
5841B67pl35o8O8P1R3N1r7MK18k99N9J17p6j26J49K28l88L4M41m35L8j22K48k24
$$ plain form
5866 -91 7 -130 -277 141 -209 -101 -267 327 -174 56 -148 -8 -166 48 229 99 -161 -147 -37 -92 -39 121
5888 121 -37 105 -4 -33 -49 -9 99 134 -95 -55 72 304 199 -234 44 170 13 0 32 54 -88 105 20
5911 20 -212 -104 -91 -75 -297 -237 137 -71 -28 86 -45 -127 122 -62 91 -146 160 -102 -166 52 47 3 30 130
5935 130 -35 -139 -107 99 1 -56 -7 -162 131 22 330 -155 -80 128 -131 -46 43 -44 86 -196 57 -103 19
5958 19 -25 -40 -6 -236 37 -110 -75 -66 191 247 116 165 20 -93 -40 -72 39 -109 -115 -11 -148 -193 115 -20 -82
5983 -82 -99 -267 -51 -211 18 -48 104 -224 -188 -225 -286 -95 153 -108 -48 156 171 37 119 27 80 201 97 -41
6007 -41 -36 58 -349 -45 -175 -29 -50 18 -115 -70 -68 45 -112 104 12 -35 94 242 -73 -145 92 65 -55 -80 69
6032 69 222 104 -349 -177 -20 27 -150 -97 11 15 112 -21 201 -262 -128 116 -16 60 137 61 -94 293 63
$$ packed form
5866i1R8j37j47M18l50J08j66N94n01K30k04J40j58K14J81j30k60J4J10n5N3J60
5888A21j58J42j09k9j6M0J08L5k29M0J27K32j05m33K78J26j57j3L2K2j42J93q5
5911B0k32J08J3J6k22O0L74k08M3J14j31q2K49j84J53k37L06k62o4K18nm4K7J00
5935A30j65j04L2K06r8n7M9j55K93j09L08m85P5K08k59Q5Q9q7J30k82K53j60J22
5958A9m4j5L4k30K73j47L5RK57N6j31M9j45j13N3l2J11j48oJ04j37m5L08j35o2
5983h2j7j68K16j60K29o6J52l28L6l7o1J91K48k61O0K04J5j34Q2r2N3J21j04j38
6007d1NR4m07L04j30J46k1O8j33M5KJ13j57K16r2m7J29J48l15p2K37k7j20k5J49
6032F9J53j18m53J72J57M7j77N3J08MR7j33K22m63J34K44j32P6P7p6j55L87k30
$$ plain form
6055 63 148 -52 36 7 46 99 -262 -150 -136 10 62 178 -67 116 79 -93 134 -171 170 -239 5 -67 -91 61
6079 61 61 -130 111 164 -141 -262 -215 -25 36 104 -190 47 -94 138 -55 -125 -156 13 25 -140 81 -19 193
6102 193 114 -189 45 52 -97 10 -206 151 -181 341 40 -97 -172 50 149 70 -133 -58 304 63 -151 -217 9
6125 9 256 -179 -150 156 219 164 149 -105 -22 45 30 60 114 -220 -153 249 125 -44 186 -30 -187 36 -81 -220
6149 -220 118 64 -10 276 -85 29 -28 -81 99 -207 60 87 -130 45 -66 110 -172 -113 -11 -46 194 -8
6171 -8 269 -56 225 -44 -115 12 -44 288 -11 188 116 96 114 -92 -335 84 166 -28 93 -173 7 -95 -105
6194 -105 67 -361 -50 -39 -114 119 -123 81 -184 -30 183 -23 33 -103 95 78 -210 158 109 -4 -160 -44
6216 -44 25 -4 -86 172 -127 163 150 32 -93 -151 209 -21 193 118 124 -131 82 0 369 -153 -30 -136 56
$$ packed form
6055F3Q5k00Q8k9L9N3l61J12J4J46N2J16k45J83l7j72K27l05L41m09K44p2k4J52
6079F1%j91K41N3l05j21M7J90O1O8k94K37j41K32j93p0l1J69J2j65K21j00K12
6102A93p9l03K34Pj49J07k16L57l32N22l01j37p5K22R9p9k03P5L62k41k14o6K26
6125IK47m35K9L06O3n5j5k54Q3O7j5L0N4l34O7M02j24j69K30k16j57K23j17j39
6149b20L38n4p4K86l61J14n7n3J80l06K67K7k17J75j11J76k82N9J02l5K40k02
6171hK77l25K81k69p1J27n6L32k99J99p2k0J8k06k43M19Q2j94J21k66J80j02j0
6194a05J72m28L11J1p5K33k42K04k65J54K13k06N6j36J98j7k88L68m9j13j56J16
6216d4O9k9q2K58k99K90j3j18j25n8L60k30K14p5Ok55K13q2L69n22J23j06J92
$$ plain form
6239 56 -192 149 -185 -311 -335 79 -74 -123 34 -161 -26 -150 54 82 61 -118 9 -30 -141 -95 -164 -116 50
6262 50 134 -159 -46 221 -25 37 -246 -155 -17 -13 1 -30 116 -185 -113 -361 -102 -77 195 -46 -78 -174 42 70
6286 70 -55 8 -7 -136 -117 -310 11 -115 -186 -101 -9 -52 35 78 -22 -25 268 237 -99 -12 -109 127 -60 -68 39 220
6312 220 116 -234 127 184 46 -48 -190 93 -25 -52 -4 50 -94 -366 275 89 109 -100 142 -12 89 34
6334 34 -137 -292 -36 23 -61 -221 193 151 -75 28 95 -14 303 167 39 -41 42 60 -93 -115 -17 90 -97
6357 -97 -333 -96 86 183 131 -44 -370 -122 -36 270 77 -24 31 15 210 2 -9 7 50 -38 50 211 -84 203
6381 203 -132 48 -13 17 216 -92 2 201 -45 -8 314 -104 25 53 48 89 -45 231 72 -49 -138 92 -197
6404 -197 -9 -11 -183 128 93 -320 165 -123 -69 141 127 -27 18 238 -150 142 -67 148 45 -253 9 44
$$ packed form
6239E6k48L41l34j26k4M14j53m9J57j95J35j24K04K8k1j79J27l9j11M6o9M8J66
6262E0Q4k93J13K67k46O2k83R1J38MJ4l1J46l01P2k48K59K5K72k41l2r6K16K8
6286G0j25O3j5j29J9j93L21j26p1Q5R2m3Q7M3j00lK93l1l36Q7r7K36j87qJ07J81
6312B20j04l50L61N7j38r4j42K83j18k7M8N4j44k72O41j86K0k09K42j54J01n5
6334C4j71j55K56N9q4j60M14m2k26J03O7j09L17j36j28q0Q3J8j53k2R8J07j87
6357i7k36K37J82R7n2j75l26K48Q6L06j93j01N5j6J95k08j1J6M3q8Q8J61k95K87
6381B03l35J80o1L0J99l08R4J99k46L7L22m18J29K8nM1j34K76j59j21q9K30k89
6404a97J88kj72L11l5m13M85k88N4K10j4j54M5K20l88K92k09K15j03k98K62L5
$$ plain form
6426 44 61 -66 -56 167 -43 -46 -79 144 68 55 -64 -287 -225 -87 153 -154 -65 17 -68 -220 -39 -8 -257 -179 -13
6451 -13 -12 -46 -160 -34 125 10 -208 -41 214 -70 44 189 308 -22 18 -182 56 19 -159 -163 -24 -35 -27 -184
6475 -184 65 43 4 -105 78 203 -98 278 -113 7 -563 -64 294 -333 331 -121 -77 36 -139 -120 97
6496 97 -55 132 -87 97 -117 89 253 139 118 -180 154 183 156 -39 38 -63 -147 -324 -428 115 110 49 102
6519 102 113 -80 113 -45 -77 -95 -123 29 72 40 -36 216 94 -91 -41 177 -12 183 245 112 -132 156 133
6542 133 -55 64 -88 -45 117 -85 26 47 -34 -167 -10 87 -117 -29 -74 -108 364 -210 -112 158 -157 94 207
6565 207 14 -5 -61 347 260 55 110 81 -50 19 139 -92 -24 -104 162 -44 -52 164 -58 82 -88 214 -84
6588 -84 265 14 56 95 -23 -146 182 -71 173 70 308 -145 -21 -31 181 81 119 -22 -176 -8 43 -81
$$ packed form
6426D4J7j27J0K23k10ll3K23p6j3j19k23O2J38K40l07Q9Q2q5j52J81L1k49P8J66
6451a3Jl4j14J26J59j15k18J67K55k84J14J45J19l30M0k00K38l7j78mJ39j1Qj57
6475a84K49k2l9j09J83J25l01L76l91J20n70M99L58o27O64m52M4J13j75J9K17
6496I7j52J87k19J84k14K06J64j14k1k98L34K9k7j95P7j01q4j77j04N43no1N3
6519A02J1j93J93j58l2j8k8J52M3l2p6K52j22j85N0K18j89J95O2j33k44K88k3
6542A33j88J19j52M3J62k02J11K1q1j33J57R7k04Q8m5l4M72n74R8K70l15K51J13
6565B07j93j9n6M08q7k05N5k9j31O9J20k31O8q0K66k06qK16k22J40j70L02k98
6588h4L49k51M2L9j18j23L28k53K44j03K38m53J24j0K12j00L8j41j54J68N1j24
$$ plain form
6610 -81 155 171 37 118 -81 7 152 -341 109 376 -55 98 -113 -100 199 108 -8 93 78 -201 7 36 60
6633 60 -96 -253 -211 42 265 -7 193 -19 -52 83 -90 75 11 116 182 -122 81 26 -189 -96 -13 47 -38
6656 -38 -69 -24 -42 80 192 134 71 43 147 -301 -208 -5 183 123 -42 -287 -25 165 98 55 37 173 -28 -86
6680 -86 28 -1 -92 16 -163 114 21 -41 216 148 132 190 150 112 -22 118 -54 -188 325 167 -41 -26 -210 38
6704 38 -131 85 -57 -113 -138 -233 84 -96 142 -7 -23 245 -102 6 -39 -22 -10 -146 -61 193 -114 12 -122
6727 -122 362 3 66 79 -94 58 73 206 -9 259 256 110 204 98 -133 -149 -15 125 -95 204 -76 208
6749 208 203 136 302 76 -146 113 90 97 162 52 75 -166 76 -94 -97 190 54 157 9 91 165 193 62 -84
6773 -84 3 -149 -55 48 156 -137 -161 -90 -61 -239 -67 -82 -74 -36 58 -111 -215 44 -196 199 261 -87 96 -74
$$ packed form
6610h1K36J6j34Q1j99Q8J45m93M50K67m31J53k11J3K99r1j16J01j5k79K08K9K4
6633F0j56j57M2K53K23k72K00k12l3J35j73J65o4J05O6l04K03n5k15R3Q3O0q5
6656c8l1M5j8J22J12n8o3k8J04m48R3K03J88o0j65k45K62J90o7m3j8J36k01n8
6680h6J14k9r1J08j79K77r3o2K57o8j6N8m0l8j34J40j72j34N13j58k08J5j84K48
6704C8j69K16j42n6k5r5L17j80K38j49j6K68l47J08m5J7J2j36Q5K54l07J26j34
6727a22M84l59O3J3j73J52J5J33k15K68lj46R4j06k31j6J34J40k20K99k80K84
6749B08no7J66k26k22K59k3PO5j10K3k41K42j70lK87j36J03j48Q2P4K8j31j46
6773h4Q7j52R4J03J08k93k4P1K9j78J72j5QL8R4j69j04K59k40L95O2l48J83j70
$$ plain form
6797 -74 7 273 -106 69 92 -36 68 22 -67 26 -64 141 -9 -63 289 -101 164 -78 23 -135 150 -117 172
6820 172 103 140 -186 132 -37 -121 104 -240 -78 -266 61 202 105 -83 72 6 83 -164 -63 -86 -47 -27 8
6843 8 44 15 -181 -36 238 -34 -154 119 -87 -38 -115 -29 138 -57 28 -13 -93 -230 63 -39 -32 -194 134 -156
6867 -156 165 3 115 183 -235 14 33 184 27 190 108 -64 18 -2 -91 -72 2 158 -81 32 -47 318 -230
6890 -230 266 -136 35 23 90 110 -230 -33 26 10 -125 -156 -241 -14 1 39 311 -77 87 -42 51 -59 -99 148
6914 148 106 -3 213 4 -235 -72 -134 -163 -157 -22 -96 39 -25 29 -151 -166 115 -47 143 -12 -22 381 -81
6937 -81 -138 -164 17 -87 -36 77 -109 -79 -125 61 -106 170 -104 -236 -21 136 37 -47 -6 -137 102 -74 -87
6960 -87 4 -64 42 71 -121 -175 -64 -264 127 -133 -86 47 405 -53 -54 -63 -183 10 97 -173 3 -95 -388 -50
$$ packed form
6797g4Q1K66l79J75K3j28J04m6q9R3r0K05j50n4L52l90K65k42J01j58K85k67K89
6820A72o9L7l26L18j69q4K25l44J62j88L27J41r7j88J55o6P7k47J01k3L9K0L5
6843HL6k9j96J45K74k72j20K73k06M9p7Q6J67j95Q5m1q0j37K93j02Pj62L28k90
6867a56L21j62J12O8m18K49J9J51j57J63q2j72Q2k0q9J9P4J56k39J13p9L65n48
6890b30M96m02J71j2O7K0l40J97N9j6j35l1q5K27J5L8K72l88J64j29R3j10m0K47
6914A48m2j09K16k09k39J63o2k9OJ35p4J35o4N4j80j5K81j62J90j55j0M03m62
6937h1n7k6J81j04N1J13j86L0m6J86j67K76k74j32K15J57r9q4M1j31K39j76j3
6960h7R1o8J06K9j92n4J11k00L91k60M7J33L58m58jrj20J93Q7k70J76r8k93L38
$$ plain form
6984 -50 -157 42 32 -67 80 38 -125 -65 -17 -310 -74 -194 147 -40 -8 93 58 -82 -142 98 298 192 139
7007 139 -144 -114 238 -97 69 -46 86 -137 -267 75 -101 297 8 88 141 301 162 166 -197 -2 120 5
7029 5 -217 -30 -14 -307 26 -66 69 164 -221 -244 -11 69 -119 33 -365 -262 221 76 40 136 52 -50 20 0
7053 0 171 -347 -62 -58 260 190 87 -5 41 2 -70 125 -51 -47 89 106 -52 -178 -252 51 -97 -75 -260 53 -28
7078 -28 138 47 -61 150 -11 -16 0 168 -104 -146 128 -83 -56 62 -114 -1 -65 32 113 18 -143 202 -96 62
7102 62 157 148 14 231 46 -9 136 205 -157 -2 79 50 197 1 -113 36 72 36 47 -107 139 135 25 -144
7126 -144 -263 99 -131 -171 -114 -24 -148 67 52 -252 19 6 161 -46 143 -50 -221 169 -40 91 182 -138
7148 -138 29 -41 -12 57 -136 -83 148 92 -66 -73 -21 45 119 189 -212 -145 -142 136 64 147 112 79 -90 35 -57 -50 226
$$ packed form
6984e0j07J99j0r9J47m2j63O0M8k93K36j20L41j87L2J01l5j40o0K40K00j06n3
7007A39k83L0L52l35J66j15J32k23j30L42j76L98k89Q0N3J60j39Ml63J95J22j15
7029Ek22J87J6k93L33r2J35R5l85k3K33Q0j88J52l98J03M83j45l6R6q4j02P0k0
7053@J71n18K85ML18p0j03r2M6l9p2J95j76MJ36J7j58j26p4L03j48K2j85L13q1
7078b8J66r1j08K11j61nJ6J68k72m2K74k11K7J18j76J13o4R7Q1r5j61L45k98J58
7102F2R5rj34K17j85n5J45O9l62J55Q1k9J47j96j14J49L6l6J1j54K46mj10j69
7126a44j19L62k30m0N7R0j24K15j5l04K71j3J55k07J89j93j71L90k09J31R1l20
7148a38J67p0K9O9j93N3K31n6j58pN2O6P4P0m01O7LK78p2Q3l5l3j69J25r2PK76
$$ plain form
7175 226 80 -93 110 2 -64 -123 5 -80 -366 -215 80 -168 -41 310 60 -25 -90 -48 -87 182 63 119 -129
7198 -129 63 -29 -243 225 261 -94 -146 69 37 152 -1 -80 55 110 -80 -29 61 -12 138 -13 -118 -125 19 60
7222 60 -26 78 104 7 268 288 299 16 74 143 -339 -148 239 -139 -19 -27 -276 184 45 -36 -34 -34 68 86 13 99
7248 99 35 -108 11 -207 27 -30 -168 182 -25 -40 -132 -255 -4 -11 89 -157 42 -56 -238 -74 18 -104 201
7271 201 114 50 -137 -71 41 188 -214 171 -13 -44 7 -156 136 66 85 -191 -87 -100 23 234 196 206 65
7294 65 -174 190 37 395 156 -78 99 -34 -160 -130 202 -81 70 90 9 53 163 66 -146 -73 -135 26 -234
7317 -234 125 -149 108 36 56 -9 -22 75 -71 33 168 -24 -160 249 110 -26 54 198 -6 137 194 304
7339 304 74 -212 5 -172 -100 15 -270 -2 164 -38 -64 252 -45 -289 -77 206 -86 338 78 130 -154
$$ packed form
7175B26j46j73K03j08o6n9J28q5k86J51K95k48J27L51k50q5o5M2l9K69j19N6k48
7198a29J92r2k14M68L6l55n2K15l2J15j53p9J35N5j90N1R0p3J50j51j05pJ44M1
7222F0q6J04K6r7K61K0J1k83N8O9m82J91L87l78J20qk49M60j39q1K%J02J8p3Q6
7248I9o4j43J19k18K34n7j38L50k07j5r2j23K51pJ00k46J99r8j82J64R2j22L05
7271B01q7o4j87O6J12J47m02L85j84l1N1j63K92p0J9k76J04j3J23K11l8J0j41
7294F5k39L64j53L58k39k34J77j33j26L0L32k83J51K0q1M4J10r7k12P3o2J61k60
7317b34L59k74K57p2K0o5j3R7j46J04J35j92j36M09j39j36Q0J44k04J43N7J10
7339C04k30k86K17j77P2J15k85K68J66k02k6L16k97k44K12K83k92M24k60N2k84
$$ plain form
7360 -154 -122 33 -199 -104 118 -11 -84 -33 -29 -233 44 197 82 -60 -122 27 -14 -53 115 52 -22 139 174 98
7384 98 194 83 104 -95 176 -100 213 -87 55 -120 140 -36 -178 26 -26 -250 -280 -247 -120 54 135 -66
7406 -66 -287 -21 -38 224 64 -325 -68 -77 70 -65 -106 144 -176 -63 -168 -88 -84 -38 71 -62 -50 -283 -8
7429 -8 174 13 -210 -183 41 -136 -12 49 199 -105 -146 -65 -2 35 -23 60 -131 -22 -101 254 -108 54 -78 -94
7453 -94 -85 -82 67 54 43 -229 -152 -121 235 -139 47 -245 298 -76 -203 135 61 -42 -211 -63 -51 58 -93 -187
7477 -187 -122 36 162 19 -129 70 195 7 -144 94 33 -194 145 154 -82 51 -23 -179 70 54 -266 -211
7499 -211 -57 203 155 -141 111 123 62 95 -131 -126 56 228 -130 -163 -85 -169 -128 -166 -6 -83 -171 -134 20 -47 16
7524 16 -212 -92 78 106 -193 116 112 -101 -97 24 13 72 230 135 -164 -155 41 205 18 21 -65 -78 240 -99 -49
$$ packed form
7360a54L2J55k32R5K22j29p3N1Mk04K77J53j15j42o2J49m1l9J68o3p4J61L5p6
7384I8R6j11K1j99K71k76L13l00J42j75K60j76j42K04n2k24l0L3J27J74Q1k01
7406f6k21K66j7K62j60l89K57rJ47j35m1K50l20J13j05Q0MM6J09j33J2k33K75
7429hJ82j61k23K7K24j77J24O1J50l04m1Q1O3L7n8Q3j91J09p9L55l62J62j32j6
7453i4RLJ49j3j1k72P7L1L56l74J86k92N43l74j27L38p4j03j69J48J2J09j51r4
7477a87O5J58J26j43j48J99J25j88j51K38o1k27L39Rk36J33p4j56K49j6l20N5
7499b11J54K60m8k96K52J2o1L3k26NJ82J72l58l3P8q4M1l8J60p7q8L7J54o7O3
7524A6k28J20J70K8k99L09mk13MJ21j1N9J58r5k99RJ96J64j87Lq6j3L18l39N0
$$ plain form
7549 -49 -60 -61 -112 -29 57 -60 113 -108 -125 -139 58 96 -105 -60 19 176 -24 -40 53 73 -81 -63 -117 123 -41 168
7575 168 214 -43 -20 -22 97 -11 -7 -107 -46 111 57 -132 -136 -136 -33 19 -292 83 76 171 -38 -67 -119 -88 8 13 4 149
7603 149 49 -100 60 -200 249 213 -330 -65 1 161 -103 -52 -58 159 -43 -186 -43 83 72 62 232 86
7625 86 -129 -70 -5 -43 -50 -30 -295 152 -67 -17 147 189 -208 50 133 96 -172 -66 63 265 24 97 -83 -150
7649 -150 121 118 -116 -164 -291 160 -202 -45 4 85 -36 67 2 -74 -12 121 4 -129 -22 26 -287 62 68 116
7673 116 -52 124 291 -48 107 -54 124 -175 235 -339 93 -139 32 -126 -28 97 -118 330 -17 -38 -75
7694 -75 72 -205 36 -75 -105 142 141 136 83 -128 59 -143 50 -131 36 -147 115 -56 -14 -89 -28 69 -323 81
7718 81 -75 78 -150 158 189 111 116 66 309 -126 -176 -283 195 47 162 305 -74 -64 282 27 85 -212 44
$$ packed form
7549d9j1jn1Q3Q6j17J73k21j7j4J97L8k01M5P9J57k00j6R3K0j54J8n4K40j64K09
7575A68M6k57K3kJ19j08Mj00O1J57n4j89m%J03N2l11L75pR5k09k9n2L1R6NrJ45
7603A49j00j49J60k60M49l6n43K65O6J60k64N1oK17k02j43J43J26j1j0J70j46
7625H6k15N9O5l8pK0k65M47k19N0J64M2l97K58Q3l7k68J06J29K02k41P3j80o7
7649a50K71lk34m8j27M51l62J57M9Q1j21J03o5p6O2J33j17j33J07M8l13L49OM8
7673A16j68J76J67l39J55j61J78k99M10n74M32k32J71j58R8J25k15M48l47k1l7
7694g5J47k77K41j11l0K47jnn3k11J87k02J93j81J67j83K62j71M2p5O1R7l92M04
7718H1j56J53k28L08L1p8Nn0K43m35n0j07M78j48J15J43l79J0L46k55N8k97K56
$$ plain form
7741 44 150 -44 -22 -45 39 126 26 -82 45 -173 -178 -188 122 -241 -37 -152 -66 97 203 -176 252 99 -76
7764 -76 -28 131 107 42 -318 -287 163 265 -12 -102 -165 40 225 -73 53 -275 -103 157 -141 -72 -70 23 47 333
7788 333 -153 106 20 -170 50 -191 -55 225 188 -52 158 -254 -139 -7 -93 132 -297 -123 -31 -30 -99 17
7810 17 190 -53 160 -85 -69 32 323 -138 158 393 -129 -105 -258 39 175 -143 0 229 -18 -29 -115 1
7832 1 114 -117 82 -150 -151 -64 243 122 158 142 22 -83 109 76 -170 125 -124 -265 41 69 -63 -61 302 78
7856 78 -211 -136 0 -53 -73 48 -38 -94 -174 -115 -9 1 -80 -107 201 0 -86 22 -92 -115 -169 -186 -48 -29 -130
7881 -130 4 228 -32 116 10 14 -304 51 -220 -56 106 158 123 -116 -34 214 566 205 -232 273 84 105
7903 105 -65 136 -13 43 -97 -305 378 -47 -218 85 137 -83 -158 -240 51 6 -178 -10 -163 -38 -62 16
$$ packed form
7741D4J06j94K2k3Q4Q7j00j08J27k18nj0L10l63K04j15Q6J63J06l79M28j53j75
7764g6M8J59k4o5l60L1M50J02k77r0o3K05J85k98J26l28J72K60k98O9KR3K4K86
7788C33m86K59q6j90K20k41J36K80l7k40K10m12J15J32q6K25m29J74R2Jo9J16
7810A7J73k43K13k45J6J01K91m61K96K35n22K4j53K97J36l18J43K29k47j1q6J16
7832AJ13k31J99k32jQ7L07j21L6j6j20j05J92l3k46K95k49j41L06K8j32KL63k24
7856G8k89P5J36n3k0J21q6n6q0N9J06J0q1k7L08k01q6J08j14k3n4j7J38J9j01
7881a30J34K24k60J48j06Ml18L55k71J64J62N2l5k39Q2K48L52l61m37N05j89K1
7903A05j70K01j49N6j40k08O83m25j71L03N2k20p5q2K91m5j84J68j53J25k4P8
$$ plain form
7925 16 32 -20 65 99 144 -199 -54 120 92 -93 -9 23 -149 61 -198 180 -138 -293 -42 139 -20 161 196
7948 196 156 267 210 -181 -133 175 -150 -101 -248 161 -71 -146 -226 125 -211 33 287 -10 -33 -112 185 -147 154
7971 154 -92 -50 193 77 20 35 -46 -56 -112 102 33 -168 -22 301 -35 186 443 -34 41 247 16 -83 -13
7994 -13 10 -32 -66 -27 62 -201 104 -187 -108 48 -149 -51 45 110 -15 -25 -52 -195 1 94 180 208 -251 13 165
8019 165 146 84 -78 -34 -4 -95 -72 -234 -52 -74 -209 104 -149 -160 -25 147 -84 -84 -280 -195 -51 -150 -71 239
8043 239 -19 -92 7 -139 -18 -25 18 -98 -66 316 4 -70 -97 25 38 109 250 -249 -85 -103 -27 -149 296 105
8067 105 233 86 -223 -9 137 -135 111 146 -95 56 -114 76 -219 -76 -191 122 39 -56 -176 -77 -154 -49
8089 -49 219 25 163 -62 -31 146 -3 82 149 -18 100 82 7 128 93 58 123 -42 15 103 121 -108 50 -243
$$ packed form
7925A6J6n2Q5L4M5l43J45J74k8j85Q4L2j72K10k59L78l18j55K51J81j59J81L5
7948A96m0J11n7l91M8L08l25M9j47M09k32p5q0L51l36K44K54k97k3p9K97l32L01
7971A54k46M2K43j16n7J5q1j0n6K14o9k01J46L23l36K21K57m77P5K06k31r9P0
7994a3K3m2l4L9Q9k63L05k91P9J56j97R8R6O5j25j0k7j43J96R3Q6K8m59K64J52
8019A65j9o2j62M4L0r1K3j62J82k2j35L13k53j1J35J72k31%j96Q5J44r9P9L10
8043B39k58p3R9j46J21pM3j16L2L82l12p4k7J22J3P1J41m99J64j8P6j22M45j91
8067A05J28j47l09K14J46k72K46L5k41J51j70J90k95J43j15L13q3r5j20R9p7J05
8089d9K68j94J38k25L1J77j49Q5O7j67J18j8p5J21l5l5O5j65N7Q8J8k29J58k93
$$ plain form
8113 -243 90 -117 -170 109 169 98 179 40 36 14 148 27 122 165 143 219 53 43 -39 -228 -59 -144 -60 282 -76
8138 -76 118 -123 138 22 86 33 -73 64 293 117 238 -73 42 176 -90 198 -154 -160 86 -125 26 107
8160 107 142 145 -74 89 157 -128 9 214 162 258 -47 -49 48 -275 -42 153 209 155 44 -41 -118 -16 -148 118
8184 118 -70 39 32 109 -22 195 -161
$$ packed form
8113b43L33k07n3K79O0p1Q1j39mk2J34j21R5M3k2P6j66j0q2j89J69q5Q4L42l58
8138g6J94k41K61j16O4n3j06J37K29j76J21l11J15J34k66K88l52oK46k11J51Q1
8160A07L5Lk19J63O8k85J37K05n2R6l05kR7l23K33J95N6n4j11q5p7J02j32K66
8184A18j88J09pP7j31K17l56
8191a61
$$ Imaginary data points
##PAGE= N=2
##DATA TABLE= (X++(I..I)), XYDATA
$$ plain form
0 0 0 0 0 0 0 0 0 0 -5 5 -8 8 -8 11 -16 16 -24 24 -32 33 -41 48 -56 65 -75 86 -98 113 -127 144 -164 181
32 181 -205 230 -256 285 -317 353 -391 435 -481 532 -589 654 -721 801 -890 989 -1104 1239
50 1239 -1393 1579 -1808 2092 -2457 2950 -3655 4747 -6685 11155 -41982 51108 169060 54678
64 54678 -81944 -126703 1610 132528 101909 -57730 -136906 -65113 77338 112748 5128
75 5128 -106144 -78958 46241 126295 52874 -78661 -104070 -6755 85779 69945 -42199 -106362
87 -106362 -35284 75567 92717 8859 -79609 -65267 35964 88223 24364 -70130 -83831 -742
99 -742 80238 59858 -32191 -75852 -19777 64702 70598 -10191 -77701 -53127 29964 71606 19421
112 19421 -58584 -59406 16356 73353 45563 -34098 -70787 -18940 53219 52285 -16941 -66879 -36360
$$ packed form
0@%%%%%%%%nJ0j3J6j6J9k7L2m0M8n6O5p4Q9j04J21j40J61j84K11k40K71l08L45
32A81l86M35m86N41o02O70p44Q26r16J013j121J243j375J522j691J879k093K343
50A239k632K972l387L900m549N407o605Q402j1432J7840n3137R3090J17952j14382
64E4678j36622m4759J28313J30918l0619j59639p9176P1793J42451L5410j07620
75E128j11272K7186J25199Q0054p3421j31535k5409R7315R2534j5834j12144o4163
87a06362P1078J10851J7150q3858q8468J4342J01231N2259o3859r4494j3701Q3089
99g42Q0980k0380r2049m3661N6075Q4479N896q0789o7510K4574Q3091M1642n2185
112A9421p8005q22P5762N6997k7790p9661l6689N1847P2159r34o9226m9938L0519
$$ plain form
125 -36360 38411 68170 16608 -50873 -50131 14348 59998 29475 -39682 -63317 -11715 51230
137 51230 49136 -12496 -54526 -25611 37713 56139 6361 -51332 -46797 12299 51808 24159
149 24159 -33382 -48452 -2950 49234 42539 -15027 -50811 -22908 29926 43068 259 -44869
161 -44869 -35923 17993 48851 21121 -28692 -40390 -592 40311 29334 -19387 -45199 -17393
173 -17393 30051 38356 -75 -36535 -25045 19051 41103 12003 -31422 -35738 1617 34369
185 34369 22810 -18225 -36598 -7671 31456 32292 -4418 -34629 -21299 18323 32788 4717
197 4717 -30039 -28627 7989 34594 18660 -18479 -30817 -4016 28316 24786 -10697 -33014 -16055
210 -16055 19328 29988 3136 -26837 -21422 11648 31013 13033 -20648 -28821 -1535 25944
$$ packed form
125c6360P4771K9759n1562o7481P42O4479M5650l0523o9157k3635N1602O2945
137E1230k094o1632m2030K8915O3324J8426m9778n7693M535N9096L9509k7649
149B4159n7541j5070M5502N2184o695n7566l5784K7903N2834J3142m2809m5128
161d4869Q946N3916L0858k7730m9813j1698L9798M0903j0977m8721k5812K7806
173a7393M7444Q305l8431l6460J1490M4096K2052k9100m3425m316L7355L2752
185C4369j1559m1035j8373K8927L9127Q36l6710l0211J3330L9622J4465k8071
197D717l4756J412L6616K6605j5934l7139j2338K6801L2332l530l5483k2317J6959
210a6055L5383J0660k6852k9973N415L3070J9365j7980l3681q173K7286K7479
$$ plain form
222 25944 19847 -11100 -28328 -9887 21719 26704 -176 -25658 -18978 11143 26489 7658 -21358
235 -21358 -23987 2172 25678 17808 -11701 -25035 -6658 19635 21366 -4057 -25023 -15591 12497
248 12497 23985 5573 -18964 -19121 5079 23310 13071 -13309 -22941 -4488 18760 17462 -5566
261 -5566 -21683 -10926 14079 21436 3053 -18440 -16488 5494 20170 8747 -14404 -19760 -901
274 -901 18971 15107 -6730 -19229 -7372 13908 17866 -807 -18559 -13697 7577 19024 6617
287 6617 -13559 -16498 1768 18138 11720 -8545 -18364 -5641 13645 15510 -2665 -17473 -10298
300 -10298 9630 17844 4475 -13846 -14186 2659 16338 9148 -10062 -16846 -2780 13816 13490
313 13490 -3333 -15845 -8268 10055 15113 1630 -14083 -12545 4056 15164 7177 -9658 -14045
$$ packed form
222B5944o097l0947j7228J8441L1606M985k6880k5482O680L0121J5346j8831k9016
235b1358k629K6159K3506p870k9509j3334J8377K6293J731k5423k0966R432K8088
248A2497J1488j8412k4537j57K4200J8231j0239k6380r632J8453K3248j298k3028
261e566j6117J0757K5005P357j8383k1493J952K1982J4676j1423k3151n356J8859
274i01J9872l864k1837j2499J1857K1280L958j8673j7752M862K1274J1447j2407
287F617k0176k939J8266J6370o418k0265r819J2723J9286J865j8175j4808P175
300a0298J9928Q214j3369j8321l40J6845J3679p190j9210o784J4066J6596l26
313A3490j6823j2512P577J8323N058j3483j5713J538J6601J1108p987j6835m387
$$ plain form
326 -14045 -761 13935 11150 -4859 -14831 -6332 9589 13274 110 -13204 -9550 5737 13897
339 13897 5426 -9880 -12292 562 12394 8629 -6109 -13045 -4109 10094 11418 -1107 -11977
352 -11977 -7483 6434 12431 3117 -10068 -10620 1939 11642 6672 -6667 -11563 -1951 10047 9619
366 9619 -2585 -11489 -5869 6692 10767 1203 -9881 -8487 3326 11287 5109 -6833 -9998 -598
380 -598 9507 7739 -4014 -10506 -4451 7309 9581 293 -9547 -6723 3848 10364 3677 -7483
394 -7483 -8776 602 9197 6401 -4712 -9484 -2623 7244 8418 -1138 -8962 -5667 4667 8951 2001
409 2001 -7555 -7559 1392 8721 4971 -4934 -8631 -1301 7190 6608 -1945 -8381 -4263 5309 8224 965
425 965 -7229 -6016 2540 8150 3707 -5076 -7572 -430 7075 5663 -2857 -7921 -3026 5396 7163
$$ packed form
326a4045J3284J4696k785j6009r972Q499J5921L685j3164j3314L654J5287Q160
339A3897q471j5306k412J2854J1832l765j4738o936Q936J4203J324j2525j0870
352a1977M494J3917N997r314j3185n52J2559R703m970j3339m896R612J1998m28
366I619j2204q904N620J2561M075r564j1084J394J1813P961o178j1942l165R400
380e98J0105j768j1753o492O055J1760K272r288r840K824J0571O516o687j1160
394g483j293R378Q595k796j1113m772O861R867J174r556p824L295J0334M284o950
409B001r556mQ951P329l750r905l697P330Q491n82q553o436M118R572K915p259
425I65q194J213Q556N610m443q783k496P142P505j412q520n064M895Q422J767
$$ plain form
440 7163 -67 -6855 -5108 3035 7319 2330 -5617 -6635 544 6752 4679 -3152 -7055 -1849 5628
455 5628 6008 -717 -6908 -4063 3837 6557 1272 -5703 -5403 1653 6568 3482 -3970 -6434 -834 5480
471 5480 5095 -1975 -6456 -3043 4074 5919 691 -5513 -4693 1946 6442 2512 -4124 -5735 -28 5645
487 5645 4321 -2057 -5943 -2039 4449 5599 -396 -5371 -4028 2557 5636 1780 -4404 -5035 499
502 499 5555 3422 -2549 -5547 -1356 4201 4742 -778 -5254 -3174 2631 5451 787 -4343 -4416 1365
518 1365 4810 2719 -3087 -5081 -514 4357 3947 -1342 -5090 -2619 3076 4681 297 -4591 -3776 1415
534 1415 4603 1913 -3178 -4520 -370 4375 3270 -1607 -4712 -1743 3306 4254 -368 -4316 -3082
549 -3082 1804 4619 1693 -3566 -4082 563 4202 2496 -2262 -4376 -1282 3277 3617 -595 -4204 -2690
$$ packed form
440G163p230o788J747Q143M284m989p947j018P179O208k073p831l903N206P477
455E628L80o725o191K845P900K720n285o975L00P056M915l086p452k464N600O314
471E480l85p070m481L413P117J845n228o204Q20O639M496l930o636j611N707N673
487E645j324o378l886L904O488J150n995m975J343O585L079l856o184o31N534
502D99N056k133n971k998M191N557N41n520m476K080N805K820m664n130p3N781
518A365L445k091n806j994M567M871m10n289l748K471N695J605m384m888Q15N191
534A415L188k690n091j342M150M745j105m877l105K969N049R48m622l948J234
549c082M886K815k926n259n16M645L639j706m758k114L094M559L40m212l609J514
$$ plain form
565 -2690 2268 3992 957 -3418 -3628 794 4202 2220 -2559 -4010 -621 3564 3472 -1095 -4105 -2183
581 -2183 2559 3626 262 -3418 -2966 1461 3942 1758 -2615 -3706 -168 3473 2490 -1331 -3916 -1470
597 -1470 2716 3399 -294 -3556 -2369 1562 3469 1052 -2727 -3106 187 3200 2090 -1765 -3465 -770
613 -770 2731 3025 -639 -3102 -1864 1901 3252 424 -2642 -2684 539 2890 1632 -2182 -3081 -408
629 -408 2776 2546 -826 -3334 -1711 1952 2914 237 -2672 -2404 1365 3092 1472 -2353 -3129 -17
645 -17 2531 2094 -1406 -3284 -1123 2052 2639 -120 -2623 -1873 1374 2946 917 -2275 -2471 235 2696
662 2696 1379 -1293 -2827 -671 2246 2209 -163 -2680 -1673 1211 2874 480 -1930 -2155 648 2658
678 2658 1518 -1371 -2683 -492 1980 2256 -808 -2640 -1223 1482 2387 109 -2274 -1765 984 2328
$$ packed form
565b690M958J724l035m375k10M422L408j982m779j451L389M185r2m567l010J922
581b183M742J067l364l680M52M427K481k184m373j091L538L641r83l821k585K446
597a470M186O83l693l262J187L931J907k417l779l79L293L013j110l855j700K695
613g70L501K94l664k463J238L765J351k828l066m2L223K351j258l814q99K673
629d08L184k30l372k508J623L663R62k677k909K68L769J727j620l825p76L112
645a7K548m37l500j878K161L175N87k759k503P50L247J572k029l192j96K706K461
662B696j317k672j534K156K917l7k372k517J007K884J663k394k410k25K803K010
678B658j140k889j312K191K472K76l064j832J417K705R05k278k383N09K749J344
$$ plain form
694 2328 1177 -1831 -2403 -298 1935 1711 -653 -2352 -944 1700 2175 0 -2152 -1505 842 2066
710 2066 697 -1719 -1934 129 1860 1326 -1095 -2006 -676 1799 1815 -405 -2106 -1240 1057 1967 561
727 561 -1848 -1748 375 2044 1133 -1092 -2027 -400 1690 2086 -314 -1790 -855 1106 1960 304 -1916
744 -1916 -1390 381 1780 893 -1259 -1771 -87 1627 1437 -469 -1785 -887 1240 1751 210 -1616 -1522
761 -1522 660 1798 684 -1210 -1345 335 1458 1132 -554 -1830 -859 1537 1816 146 -1597 -1024
777 -1024 773 1532 405 -1551 -1382 392 1768 820 -821 -1626 -84 1314 1189 -165 -1450 -973 1051
794 1051 1273 493 -1293 -1320 179 1496 746 -727 -1340 -115 1160 1163 -472 -1535 -644 1012 1352 -44
812 -44 -1205 -1305 613 1454 640 -1019 -1354 19 1402 907 -593 -1416 -606 960 1360 29 -1113 -952
$$ packed form
694B328j151l008n72K105K233k24k364j699J408K644M75k175k152O47K347J224
710B066j369k416k15K063J731n34k421r11J330K475J6k220j701Q66K297R10j406
727E61k409J00K123J669r11k225r35J627K090L96k400j476R35J961Q54j656k220
744a916N26J771J399q87k152n12J684J714j90j906j316Q98K127N11j541j826R4
761a522K182J138j114j894j35J680J123l26j686j276R71K396K79j670j743N73
777a024J797P59j127j956J69J774J376r48j641q05J542J398j25j354j285M77K024
794A051K22p80j786k7J499J317p50j473o13J225J275Lj635j063Q91J656L40j396
812d4j161j00J918Q41q14j659l35J373J383m95j500q23Q10J566M00j331j142J61
$$ plain form
830 -952 639 1154 392 -1069 -1097 -210 1000 868 -733 -1512 -345 914 974 -60 -1250 -779 506 932
848 932 -17 -780 -1137 239 1068 616 -749 -1025 -203 1026 943 -125 -813 -721 668 1112 -123 -894 -673
867 -673 198 929 611 -478 -1096 -12 771 670 -367 -912 -326 730 823 60 -790 -631 594 848 -18
886 -18 -493 -725 151 896 583 -169 -979 -300 765 718 110 -935 -464 700 953 181 -657 -794 377 1243
906 1243 364 -633 -932 -123 457 802 -315 -744 -292 725 817 -40 -520 -525 203 709 312 -647 -693 197 724
927 724 579 -45 -708 -328 688 578 -193 -795 -467 469 821 97 -609 -815 -39 523 470 -376 -580 -78
947 -78 643 607 -244 -846 -540 474 838 171 -551 -779 265 890 325 -206 -634 2 880 515 -282 -688
967 -688 -492 259 560 165 -761 -533 406 920 575 -534 -520 -54 728 477 -361 -704 6 289 660 -8
$$ packed form
830i52J591N15p62j461k8Q87J210j32j601p79J167J259O0j034j190M71J285M26
848I32r49p63l57J376Q29m52j365k76Q22J229q3j068o88R2J389M44j235p71K21
867f73Q71P31l18j089o18J084P83j01j037n45N86J056R3p63q50J59J225K54q66
886a8m75k32Q76P45l13p52q10O79J065m7o08j045M71J164K53p72q38j37J171Q66
906A243q79r97k99Q09N80L45j117m29M52J017R2q57m80nP28N06l97r59m6Q90N27
927G24j45o24o63L80J016j10p71o02L28R36L52p24p06k06P76N62n3q46k04N02
947g8P21l6q51o02L06J014L64o67p22k28J044O25n65n31m28O36Q78l65p97m06
967f88J96P51L01l95r26K28R39N14l45j109J4M66P82k51q38l43P10K83L71o68
$$ plain form
987 -8 -702 -391 314 731 165 -619 -470 296 866 352 -336 -806 -148 288 524 -108 -510 -601 486 788 99
1008 99 -603 -704 392 462 518 -445 -316 -221 309 876 -56 -714 -109 458 263 226 -352 -534 329 678 405
1029 405 -307 -671 -130 653 555 -166 -391 -594 539 497 10 -479 -466 341 490 331 -564 -790 -118 586 337
1050 337 14 -398 -88 377 532 154 -561 -373 212 434 251 -156 -387 4 261 315 -231 -400 -128 384
1070 384 595 279 -335 -438 252 613 280 -361 -450 -70 599 318 -293 -583 -422 462 468 -154 -392 -213 101
1091 101 302 82 -363 -268 448 376 -221 -212 -385 -61 227 476 -164 -244 59 225 508 -175 -419 -238 139 199
1113 199 -83 -370 -263 39 545 305 -134 -276 -170 503 378 190 -350 -165 313 398 -132 -131 -394 -163 469
1134 469 193 -378 -544 -63 241 424 -47 -358 -29 214 260 138 -299 -570 -195 462 -130 5 -136 -85 231
$$ packed form
987ho94L11P05M17n66p84J49P66N70n14o88m70O58M36K36o32m02r1J087L02o89
1008I9p02j01J096P0N6r63J29R5N30N67r32o58O05N67j95l7n78j82Q63L49k73
1029D05p12l64N41P83r8p21k25k03J133m2m87m89J3Q07J49j59q95k26O72P04k49
1050C37l23m12L10M65J55l78p15J88N85K22j83m07k31L91K57N4n46j69K72N12
1070C84K11l16o14j03O90L61l33o41q9L80O69k81o11k90J61Q84Oo22k38J79L14
1091A01K01k20m45R5P16p2n97Rj73L24K88K49o40q0L03J66K83o83k44J81L77O0
1113A99k82k87J07L02N06k40m39j42J06O73j25j88n40J85M78Q5n30Jk63K31O32
1134D69k76n71j66M81L04J83m71l11L29K43M6j22m37k71L75O57n92J35j41N1L16
$$ plain form
1155 231 75 1 -301 -376 340 487 -238 -179 -149 115 265 183 -353 -183 78 222 141 -279 -296 -248 185 195 -141
1178 -141 -409 -115 72 368 -74 -290 -557 -56 335 15 -171 -536 -128 -111 203 105 -300 -238 52 161 -28
1199 -28 -150 -353 37 58 -145 -168 -39 -57 373 77 -246 -239 38 -16 324 -212 -285 -8 -51 296 307 -9 -77 -194
1223 -194 96 350 -202 -105 -201 153 288 186 -135 -75 151 204 201 -351 6 -117 139 -17 -270 -223 -259 -138 342
1246 342 -32 -172 -109 188 -1 112 -142 -236 128 169 261 114 -99 -126 221 152 -221 -52 -203 308 211 -9
1268 -9 -285 -337 61 314 251 -24 -115 -162 114 20 271 -53 101 9 140 46 54 -55 380 -25 139 125 -118 9
1292 9 78 146 -96 -311 175 53 93 80 -221 251 -245 115 291 -136 -189 38 111 -41 -224 -226 18 68 187 -226
1316 -226 51 373 -132 -92 -133 -228 -215 -93 49 148 143 -151 -115 -9 83 227 -104 257 64 -167 -71 -141 -57 -65 232
$$ packed form
1155B31j56p4l02p5P16J47p25N9L0K64J50q2n36J70K61J44q1m20j7M8M33J0l36
1178a41k68K94J87K96m42k16k67N01L91l20j86l65M08J7L14r8m05O2K90J09j89
1199b8j22k03L90K1k03k3J29j8M30k96l23PK77n4L40n36p3K77m3L47J1l16o8j17
1223a94K90K54n52R7r6L54J35j02l21O0K26N3ln52L57j23K56j56k53M7l6J21M80
1246C42l74j40O3K97j89J13k54r4L64M1R2j47k13k7L47o9l73J69j51N11r7k20
1268ik76n2L98K53o3k75r1m7K76r4K51l24J54r2J31r4Qj09M35m05J64j4k43J27
1292IO9O8k42k15M86j22M0j3l01M72m96L60J76m27n3K27P3j52j83kK44N0J19m13
1316b26K77L22n05M0m1r5J3J22J42R9nk94L6J06R2J44l31L61j93k31R6p0Q4qK97
$$ plain form
1341 232 -198 -62 -178 110 145 139 -89 -115 176 -26 -4 -186 191 -50 112 424 -222 114 -281 -6 102 143
1363 143 49 -18 93 146 97 -213 96 -75 -29 114 -7 151 -15 278 87 25 -352 -143 181 119 113 -240 -160
1386 -160 -186 269 141 99 259 24 226 -32 52 -119 56 24 256 135 30 -9 -160 -64 46 -310 -162 63
1408 63 333 194 -67 -101 -123 -20 209 134 -146 -7 3 -58 61 50 -76 6 14 61 173 -135 27 117 262 -92
1432 -92 -165 260 232 88 260 -205 -124 156 23 93 39 -404 41 153 107 -23 -109 -185 226 -61 -89 -25 -10 58
1456 58 7 173 -74 -218 -47 -58 321 40 -240 67 301 258 -211 -283 24 -70 196 156 -287 -35 -176 41
1478 41 -48 -85 -96 -109 219 99 46 -305 63 -72 166 34 -88 -100 -40 267 -190 -50 -226 -185 176 84 -10 -116
1502 -116 -107 88 28 232 40 -282 -21 124 52 -71 -406 235 69 344 127 -140 -59 -147 71 110 -164 -64
$$ packed form
1341B32m30J36j16K88L5ok28k6K91k02K2j82L77k41J62L12o46L36l95K75J08M1
1363A43r4o7J11N3m9l10L09j71M6J43j21J58j66K93j91o2l77K09L24o2ol53Q0
1386a60k6M55j28m2J60k35K02k58Q4j71J75l2K32j21j05l9j51R6J10l56J48K25
1408F3K70j39k61l4k2J03K29p5k80J39J0o1J19j1j26Q2QM7J12l08J62R0J45l54
1432i2p3M25k8j44J72m65Q1K80j33P0n4m43M45J12m6j30q6p6M11k87k8O4J5O8
1456E8n1J66k47j44J71j1L79k81k80L07K34m3m69p2L07r4K66m0m43K52j41K17
1478D1q9l7j1j3L28j20n3l51L68j35K38j32j22j2O0L07m57J40j76M1L61r2r4j06
1502a16RJ95o0K04j92l22K61J45p2j23l35O41j66K75k17k67Q1q8K18L9k74J00
$$ plain form
1524 -64 51 200 -23 58 -35 99 -11 78 115 75 -49 98 -3 -183 163 -171 79 5 89 -176 -226 17 -59
1547 -59 23 -331 -260 83 86 65 -48 -215 -210 -34 -61 -37 -94 -229 113 -43 -83 -26 -84 -232 32 193 -121 33 -79
1572 -79 26 261 -61 47 -8 23 -29 3 -18 -134 -273 100 155 120 -190 190 -146 94 51 -180 150 59 -42
1595 -42 87 -76 -36 139 10 299 124 -61 -56 3 219 96 -181 -183 -255 307 -272 -238 -316 159 8 206 -32
1618 -32 -26 310 61 166 27 -28 -150 60 11 75 -200 -139 164 248 71 -77 -217 66 52 330 101 -113 8
1641 8 70 -94 42 138 -277 34 131 20 66 -190 34 133 -63 205 142 -72 -237 140 72 72 -222 86 -241 83
1665 83 -87 -111 7 -80 48 171 98 -240 214 144 17 -89 -84 48 -36 135 158 -7 226 24 157 -22 -217
1688 -217 -34 106 -113 61 63 -25 -133 79 -118 -2 7 -98 144 -17 -14 -54 160 -236 164 11 -267 -61 -26
$$ packed form
1524f4J15J49k23Q1r3J34j10Q9L7m0j24J47j01j80L46l34K50p4Q4k65n0K43p6
1547e9Q2l54P1L43Lk1j13j67NJ76k7K4n7j35L42j56m0N7n8j48K64J61l14J54j12
1572g9J05K35l22J08n5L1n2L2k1j16j39L73N5l5l10L80l36K40m3k31L30r1j01
1595d2J29j63M0J75j29K89j75j85NN9K16j23k77kp2N62n79L4p8M75j51J98k38
1618c2OL36k49J05j39n5j22K10m9O4k75O1L03Q4j77j48j40K83j4K78k29k14J21
1641HO2j64J36R6m15L11R7j11M6k56K24R9j96K68o3k14j65L77o8%k94L08l27L24
1665H3j70k4J18q7J28J23p3l38M54p0j27j06NJ32q4J71K3j65K33k02J33j79j95
1688b17J83J40k19J74Kq8j08K12j97J16Rj05K42j61Lm0K14l96M00j53k78K06L5
$$ plain form
1711 -26 111 -35 -98 -117 44 38 348 141 -316 -227 -101 -17 154 19 -142 29 99 -13 -55 45 -312 42 -39
1734 -39 107 122 -259 -167 107 -16 -150 -76 30 206 -45 -198 -157 -32 -146 -70 136 -268 7 8 171 -60 -76
1757 -76 38 -17 -81 278 -115 -89 179 -28 -95 76 189 -161 -59 -298 109 -41 202 -92 110 -312 270 -188
1779 -188 -261 235 33 -29 -2 66 215 -161 51 -130 -43 25 -136 -156 239 -70 -173 157 -114 111 -175 64
1801 64 -211 236 41 109 -199 17 3 -37 -118 -163 164 66 31 46 -63 -148 173 -44 -334 -166 46 -73 31
1824 31 -252 -354 -164 -230 -1 146 -24 189 129 164 40 -181 -40 71 66 90 92 33 -29 -164 202 -73 -157 59
1848 59 -89 -30 -91 41 6 -158 79 77 -106 203 -261 167 74 199 1 -111 153 15 251 158 -75 -66 310
1871 310 -150 -26 -92 -58 83 -177 -76 26 71 191 65 109 -37 142 -39 -92 2 -58 -86 -31 148 74 -22 -301
$$ packed form
1711b6J37j46o3j9J61oL10k07m57Q9J26Q4J71j35j61J71P0j12m2J00l57L54q1
1734c9J46J5l81R2K74j23j34P4J06J76k51j53M1J25j14P6K06m04K75JJ63k31j6
1757g6J14n5o4L59l93K6K68k07o7J71J13l50J02k39M07j50K43k94K02m22N82m58
1779a88p3M96k02o2K7O8J49l76K12j81Q7O8j61k0L95l09j03L30k71K25k86K39
1801F4k75M47j95O8l08K16j4m0q1m5L27r8l5J5j09q5L21k17k90J68K12j19J04
1824C1k83j02J90o6K29J47j70K13o0L5j24k21J41J11nK4Kn9o2j35L66k75q4K16
1848E9j48N9o1J32l5j64K37kj83L09m64M28r3J25j98j12K64j38K36r3k33RL76
1871C10m60J24o6L4J41k60J01J02M5J20j26M4j46J79j81n3R4o0k8N5J79p4r6k79
$$ plain form
1895 -301 -236 -85 147 -143 -42 46 203 -133 103 -107 160 57 -33 112 -157 114 -208 -90 -93 273 -91 168
1917 168 -253 232 -79 37 120 -113 258 216 24 -171 -7 -159 -242 -80 -173 201 238 -56 105 -30 -187 -131
1939 -131 254 24 -48 -3 134 66 55 -77 -238 -125 -100 -249 120 115 96 -173 -37 -223 224 16 -51 -310 19
1962 19 -50 97 224 24 121 101 -19 -38 24 -92 278 10 -324 124 -113 145 131 299 103 -14 -73 226 101
1985 101 -74 -76 60 123 62 -191 -272 83 10 152 58 167 -133 11 -161 3 -3 47 77 -6 -19 -166 -189 -49 -128
2010 -128 34 67 259 -81 70 114 -5 113 37 -139 5 85 178 -143 -58 125 -227 123 166 -72 190 -119
2032 -119 208 105 -109 10 -206 16 -130 379 -268 -26 -133 120 110 144 -37 -11 -32 -134 60 -192 -17
2053 -17 -85 64 -168 -17 139 76 211 -229 148 -150 30 -70 113 81 -70 19 -220 154 120 32 -53 -4 -12 191
$$ packed form
1895c01O5J51K32k90J01Q8J57l36K36k10K67j03r0J45k69K71l22J18lL66l64K59
1917A68m21M85l11J16Q3k33L71m2j92j95J64j52q3J62r3L74L7k94J61j35j57N6
1939a31L85k30p2M5J37o8j1j32j61J13K5j49L69nj9k69J36j86M47k08o7k59L29
1962A9o9J47J27k00R7k0j20j9O2j16L70k68l34M48k37K58j4J68j96j17n9K99j25
1985A01j75kJ36O3o1k53q1L55p3J42r4J09l00J44j72J64oN0L0q3j3j47k3J40p9
2010a28J62L3J92l40J51M4j19J18p6j76J44Q0R3l21Q5J83l52L50M3k38K62l09
2032a19L27j03k14J19k16K22j46N09o47K42j07K53j0L4j81K6k1j02J94k52J75
2053a7o8J49k32J51J56o3J35m40L77k98J80j00J83l2j51Q9k39L74l4q8q5M9qK03
$$ plain form
2077 191 -34 -292 133 197 96 225 -121 -49 -91 -43 58 217 -119 -169 81 2 -101 -210 221 129 56 138 8
2100 8 52 225 20 152 83 -75 1 -41 62 96 -39 151 19 46 -177 49 106 -6 72 267 221 -44 -55 -201
2124 -201 -181 136 40 49 -108 -250 459 95 44 -309 46 31 65 131 92 32 36 126 148 -343 66 309 -18 -57 -67
2149 -67 -54 69 10 54 -235 -63 246 28 -186 49 12 -19 103 -111 -11 -48 -27 -44 -71 -140 -144 -37 114 -6
2173 -6 311 29 -225 90 -17 47 93 81 -19 168 -43 53 213 26 59 -250 21 -57 -184 49 -74 9 115
2196 115 265 75 -108 65 -165 -113 130 56 210 0 -12 173 1 -100 -126 -80 -110 63 -55 -146 377 -121
2218 -121 -71 -76 62 -189 -147 -207 -116 116 -21 117 41 160 -6 189 -104 168 -51 -349 69 61 -55 -46 91 270
2242 270 23 -332 -35 -65 244 144 25 -97 -15 193 -205 25 79 -72 -42 68 -35 -46 167 332 31 92
$$ packed form
2077A91k25k58M25O4j01J29l46P2m2M8J01J59l36n0K50p9j03j09M31r2p3Q2j30
2100HM4J73k05J32o9j58P6m2J03L4j35J90j32K7k23K26N7j12P8J95m6k65j1j46
2124b01K0L17r6Rj57j42P09l64n1l53L55j5L4O6l9o0MR0K2m91M09K43l27l9j0
2149f7J3J23n9M4k89J72L09k18k14K35l7l1J22k14J00l7K1j7k7o9mJ07J51j20
2173fL17k82k54L15j07O4M6j2j00J87k11R6J60j87L3l09K71p8j27K33j23Q3J06
2196A15J50j90j83J73k30N2K43p4J54k10j2J85j72j01k6M6l0J73j18r1N23m98
2218a21N0nJ38k51M2o0R1K32j37J38p6J19j66J95k93K72k19k98M18qj16RJ37J79
2242B70k47l55K97l0L09j00j19j22Q2K08l98K30N4j51L0J10j03j1K13J65l01O1
$$ plain form
2264 92 78 -70 -170 -1 80 11 -16 -22 38 102 96 -141 311 197 40 138 70 124 -9 30 -45 58 323 25 -137
2289 -137 204 -168 -42 6 23 20 -8 36 22 40 170 -24 -167 117 -225 58 43 188 -219 27 -22 67 214 184
2313 184 -123 -34 289 80 117 -205 33 221 103 133 -128 -153 -129 19 -131 -73 -234 -317 114 -146 79 154 -46
2336 -46 90 -103 -11 -72 -73 -144 -80 -8 173 -12 -192 -5 -116 -126 114 -54 36 -215 196 297 -74 30 -102
2359 -102 -31 167 34 -40 145 32 -8 -24 79 -122 4 26 54 192 -206 35 -143 104 124 22 -21 39 58
2382 58 -121 58 -17 -54 -27 -20 -28 -166 40 -48 148 90 -91 50 256 195 -175 -109 -149 -15 102 340 -109 326
2406 326 124 114 -74 2 121 -59 200 23 -188 34 -18 -41 219 -78 26 101 328 -140 78 45 -48 -4 -119
2429 -119 -53 -6 -143 160 74 159 -8 91 -53 -162 178 132 -67 -32 -153 5 -52 41 -111 123 260 179 13
$$ packed form
2264I2j4j48j00J69Q1o9k7oO0O4ok37M52j14j57R8o8N4j33L9p5J03K65k98j62
2289a37L41l72J26M8J7lk8M4j4J8J30j94j43K84l42K83j5J45m07K46m9Q9J47l0
2313A84l07Q9L23k09L7l22K38J88j18L0k61k5K4J48j50N8j61q3M31k60K25P5k00
2336d6J36j93R2o1jp1O4P2J81j85j80J87j11j0K40j68R0k51M11J01l71J04j32
2359a02P1J98j33p4J85j13m0j6J03k01J26K2K8J38l98K41j78K47K0j02m3O0J9
2382E8j79J79p5l7K7Pqj38K06q8J96n8j81J41K06o1l70O6m0J34J17K38m49M35
2406C26k02j0j88P6J19j80K59j77k11K22n2k3K60k97J04P5K27m68K18l3r3M4j15
2429a19O6M7j37L03q6Q5j67R9j44j09L40m6j99L5j21J58n7R3j52K34J37q1j66
$$ plain form
2452 13 -270 -153 -99 66 44 -33 146 -296 39 -55 221 43 48 235 -59 -252 -10 96 179 -69 -13 -263 -209
2475 -209 -194 299 235 -123 -141 148 147 272 -49 66 -49 -67 -13 -95 -44 75 18 -73 -86 -3 -103 -166 -5 34 28 -51
2501 -51 -192 -231 44 -188 -76 255 105 -89 -83 102 -29 -13 -6 135 -80 35 -117 43 -119 -148 150 -54 23
2524 23 -97 177 -148 -207 -107 18 81 -265 114 18 85 -180 1 23 -3 -122 1 34 56 104 -115 163 -197
2547 -197 21 205 -90 102 -173 -56 -5 -138 238 -68 343 73 -10 139 -68 -94 146 -75 -212 39 51
2568 51 -110 -119 73 10 97 -240 -182 198 -206 270 101 -141 -170 -244 192 -97 -64 118 38 -99 -66 -66 7 98 34
2593 34 -114 125 -104 47 -44 35 82 163 -74 -303 232 -174 -194 -44 -100 6 -204 -87 70 -37 -61 -164 60
2616 60 -14 78 -70 91 33 -28 -8 170 -40 28 -58 159 -93 9 129 -10 89 -45 41 193 -149 148 -33
$$ packed form
2452A3k83J17N4J65k2p7J79m42L35r4K76j78NJ87k94j93K42J06Q3k48N6k50N4
2475b09J5M93o4l58j8K89jJ25l21J15j15j8N4q2N1J19n7r1j3Q3j00o3J61L9op9
2501e1j41l9K75k32J12L31j50j94OJ85j31J6PJ41k15J15j52J60j62k9K98k04P7
2524B3j20K74l25n9J00J25O3l46L79r6O7k65J81K2k6j19J23L3K2M8k19K78l60
2547a97K18J84k95J92k75J17N1j33L76l06M11k70q3J49k07k6K40k21j37K51J2
2568E1j61rJ92o3Q7l37N8L80m04M76j69k42k9p4M36k89L3J82q0j37L3%P3R1o4
2593C4j48K39k29J51r1P9M7Q1k37k29N35m06k0J50n6J06k10J17J57j07k4j03K24
2616F0p4R2j48J61n8o1K0J78k10O8q6K17k52J02J20j39R9j34Q6J52l42K97j81
$$ plain form
2639 -33 -63 -203 167 -83 66 48 -286 39 117 29 -18 82 -5 -182 -259 86 113 29 -119 -122 56 -326 -41 -55
2663 -55 -206 -72 -40 -78 42 170 -207 183 54 -60 168 67 -206 64 105 -182 -114 -336 -116 166 -121 81
2685 81 12 177 118 74 96 -94 -251 51 -201 120 -44 200 -6 -12 174 -87 -20 -115 -139 -46 55 59 -142 8
2709 8 64 -32 -235 -75 -19 55 87 -190 -221 149 32 125 91 78 -218 153 46 -235 -165 -152 15 -75 94 53 280
2734 280 -46 2 72 57 -50 -226 164 -230 94 170 20 -6 143 44 112 -123 -19 -21 -172 141 -260 -105 7
2757 7 -26 -118 -105 -160 19 -137 112 30 -60 -99 251 237 65 9 37 123 39 130 40 -136 -287 118 -31 96 -49
2782 -49 -105 122 -165 -56 12 1 192 103 -220 71 199 18 -285 -221 77 -13 159 57 72 82 100 -31 -156
2805 -156 132 -150 -67 -194 -58 41 83 -177 -262 -49 71 -80 -252 36 -151 67 -134 -52 -6 66 17 37 115
$$ packed form
2639c3l0j40L70k50J49j8l34L25P8q8m7J00q7j77p7L45K7q4j48lJ78l82K85j4
2663e5j51J34L2l8J20J28l77L90j29j14K28j01k73K70M1k87O8k22K20K82k87K02
2685H1o9J65n9m4K2j90j57L02k52L21j64K44k06oJ86k61O7r5k4R3J01Mk01J50
2709HN6r6k03J60N6P4L2k77l1L70j17R3l4j3k96L71j07k81P0J3J67r0J69m1K27
2734B80l26M8P0j5j07j76L90l94L24P6j50k6J49r9O8k35J04kj51L13m01J55J12
2757Gl3r2J3n5J79j56K49q2r0l9L50j4j72n6K8Q6q4R1r0j76j51M05j49J27j45
2782d9n6K27k87J09O8j1J91q9l23K91J28j81l03O4K98r0J72j02J5J0J8j31j25
2805a56K88k82Q3j27J36R9M2k60q5K13J20j51j72K88j87K18k01Q2M6P2m9K0P8
$$ plain form
2828 115 -50 -119 -35 120 9 21 -166 -27 -3 -91 95 -34 139 -79 116 -147 -47 97 3 -100 -92 112 255
2851 255 4 83 69 122 -95 357 -107 -42 -33 77 -14 -217 92 208 -213 -188 -85 56 93 -188 -172 -118 78 26
2875 26 -4 -155 37 -20 138 271 -150 -236 21 76 -105 59 120 201 34 45 -91 -71 -91 -102 -26 209 -141 -110
2899 -110 9 -123 23 269 95 -265 -216 43 -120 -189 54 205 -150 -194 192 -72 184 175 97 66 43 -12 -140
2922 -140 -96 -209 -173 287 136 72 12 164 -150 214 243 -87 -250 -61 -25 163 -19 -122 -166 26 31 175 21
2945 21 115 78 -140 -138 -49 168 -281 130 -18 -20 189 67 -246 -197 -27 -113 -87 200 -38 169 -194 136 137 74 -134
2970 -134 32 112 -198 49 118 -58 -30 165 -310 -235 274 -154 -101 -278 115 107 -94 205 -138 138 -306 -194
2992 -194 -107 -151 87 320 -38 -119 40 -33 -133 -201 22 -93 135 210 111 -212 -24 -101 -61 -73 11 127 183 105
$$ packed form
2828A15j65o9Q4J55j11J2j87J39K4q8J86j29J73k18J95k63J00J44r4j03QK04J43
2851B55k51P9j4N3k17M52m64O5RJ10r1k03L09J16m21K5J03J41L7k81J6N4J96n2
2875B6l0j51J92n7J58J33m21q6K57N5j81J64O1Q1j67J1j36K0k0j1P6K35l50L1
2899a10J19j32J46K46j74l60M9K59j63o9K43J51l55m4L86k64K56rp8l1k3n5j28
2922a40M4j13L6M60j51o4o0J52l14L64K9l30j63J89L6J88j82j03m4J92NJ44j54
2945B1R4l7k18KQ9K17m49M11j48kK09j22l13M9J70q6K6K87k38K07l63L30Jo3k08
2970a34J66Q0l10K47O9j76K8J95m75P5N09m28N3j77L93qk01K99l43K76m44J12
2992a94Q7m4K38K33l58q1J59p3j00o8K23j15K28P5r9l23J88p7M0j2Q4J16N6p8
$$ plain form
3016 105 -221 138 128 41 -126 -23 -337 149 -7 48 16 183 222 28 -63 73 296 -33 -42 -227 -6 -150 176
3039 176 -63 24 -100 45 -5 37 -19 268 -77 -45 -115 -10 -197 -101 -65 -15 -221 48 185 -44 336 -57 -12
3062 -12 163 193 15 -92 -185 10 -72 100 -94 43 -473 -64 -104 60 43 301 -65 30 227 6 -248 -44
3084 -44 -93 251 191 318 -93 42 229 -67 145 139 -173 -71 -45 -59 105 -82 185 74 133 -119 -70 120 -59
3107 -59 102 -110 -78 134 237 -222 -115 -6 -338 -125 -47 -1 -49 241 15 38 110 -127 -39 61 32 7 -68 166
3131 166 2 212 366 -140 27 -84 107 -50 196 92 93 -33 119 -69 -61 189 8 -380 203 -105 -33 -40
3153 -40 128 178 81 136 161 -48 -185 68 228 -9 -36 15 -132 145 170 -200 234 46 -79 70 -65 102 -52
3176 -52 -71 49 -23 32 108 -84 -47 -349 -79 128 294 -53 -245 36 23 -142 82 116 134 102 -204 22 74 126
$$ packed form
3016A05l26L59j0q7j67J03l14M86j56N5l2J67L9j94r1J36K23l29rj85K21j44L26
3039A76k39Q7j24J45n0M2n6K87l45L2p0J05j87R6L6N0k06K69J37k29L80l93M5
3062a2J75L0j78j07r3J95q2J72j94J37n16M09m0J64j7K58l66R5J97k21k54K04
3084d4m9L44o0J27m11J35J87k96K12ol12J02K6j4J64j87K67j11N9k52M9J90j79
3107e9J61k12L2K12J03m59J07J09l32K13P8M6m8K90k26K3P2k37Q8J00k9k5p5K34
3131A66j64K10J54n06J67j11J91j57K46j04Jj26J52j88QK50j81l88N83l08P2p
3153d0J68N0r7N5K5k09j37K53J60k37k7N1j47K77K5l70M34j88j25J49j35J67j54
3176e2j9J20p2N5P6j92L7l02K70K07J66l47j92K81j3j65K24L4J8l2l06K26N2N2
$$ plain form
3200 126 93 -21 -41 127 145 121 -163 388 -17 -24 -246 178 65 22 64 130 -20 134 87 -75 -97 -243 -64 -215
3224 -215 -11 64 28 42 76 -400 197 9 -141 -36 55 -99 0 -172 214 -26 -125 124 -4 -54 -182 -100 230
3247 230 83 -101 -95 -67 -124 123 -73 -35 -38 -291 62 -214 45 -17 -103 130 73 -72 242 122 351 -198 173
3270 173 -30 -13 -2 56 -91 -126 50 130 -145 -67 20 172 -33 -56 170 25 159 -166 -62 100 -115 -24 119
3293 119 138 125 10 -157 -14 -256 -87 100 -121 267 -89 -49 -242 -66 148 -118 -99 -7 55 -81 -184 272
3315 272 -175 -30 -2 156 298 -153 -76 -153 -27 -59 67 107 178 19 125 -56 -66 92 203 54 124 154 -76
3338 -76 -52 -98 -14 46 127 58 -168 -189 -144 39 14 6 -165 69 -225 105 -75 -88 47 -58 6 342 -5 152 8
3363 8 174 5 -29 114 -101 93 -183 -98 -210 142 218 60 100 -36 -173 198 140 -185 33 36 -94 -94 12 -25
$$ packed form
3200A26l3j14k0J68J8k4k84N51m05pk22M24j13m3M2O6j50J54m7j62k2j46J79j51
3224b15K04P5l6J4L4m76N97j88j50J05R1j54R9j72L86k40r9K49j28n0j28Q2L30
3247B30j47j84OK8n7K47j96L8lk53L53k76K59o2q6K33n7j45L14j20K29n49L71
3270A73k03J7J1N8j47l5J76Q0k75P8Q7J52k05k3K26j45J34l25J04J62k15R1J43
3293A19J9j3j15j67J43k42J69J87k21L88l56M0j93J76K14k66J9R2O2j36j03M56
3315B72m47J45K8J58J42m51P7p7J26l2J26M0P1j59J06j81j0J58J11j49P0L0k30
3338g6K4m6Q4O0Q1o9k26k1M5J83k5qj71K34k94L30j80j3J35j05O4L36l47J57j44
3363HJ66j69l4J43k15J94k76Q5j12L52P6j58M0j36j37L71n8l25K18Lj30%J06l7
$$ plain form
3387 -25 -115 -76 155 38 -89 24 198 -108 -305 -109 397 226 35 21 -100 98 -15 112 -160 -26 -27 12
3409 12 130 -267 289 10 24 -94 35 126 -82 166 134 -25 92 15 -85 9 17 121 -185 170 -155 30 76
3432 76 -219 -56 14 85 61 -16 47 -208 -131 -121 122 35 22 164 -108 -91 81 126 81 237 -221 68 -138 248
3456 248 96 -41 88 138 224 88 -15 213 118 -21 -127 73 135 81 -48 -197 -258 225 -4 43 67 5 21
3479 21 -61 10 -71 -148 136 -45 128 133 -174 -194 -1 25 -86 84 279 -156 -31 -130 -244 -63 69 259 261 -33
3503 -33 16 -281 -276 -72 -26 -87 -140 -183 14 22 102 -28 177 -178 -253 -72 142 53 0 -129 -37 14 -54 -113 119 -131
3529 -131 63 90 -43 -219 -152 -25 -93 -106 -67 33 51 -82 89 -110 -18 -236 -282 144 76 -29 -199 -94 -54
3552 -54 219 -194 -7 -122 116 -183 34 -192 -311 42 36 163 -19 -121 -282 -75 0 102 -309 74 103 -85
$$ packed form
3387b5r0L9K31j17j27J13J74l06j97J96N06j71j91j4j21J98j13J27k72J34jL9
3409A2J18l97N56k79J4j18J29R1k08K48l2j59J17p7j00R4QJ04l06L55l25J85M6
3432G6k95J63P0P1k4p7O3k55P7J0K43q7j3J42k72J7J72M5m5J56m58K89k06L86
3456B48j52j37J29N0Q6j36j03K28r5j39j06K00O2n4j29j49o1M83k29M7K4o2J6
3479B1q2P1q1p7K84j81J73Nl07k0J93K6j11J70J95m35J25r9j14J81J32J90Kk94
3503c3M9k97NK04M6o1n3m3J97QQ0j30K05l55p5J81K14q9n3j29R2N1o8n9K32k50
3529a31J94K7j33j76O7J27o8j3L9J00J8j33J71j99R2k18m6M26o8j05j70J05M0
3552e4K73m13J87j15K38k99K17k26j19L53oJ27j82j02j61K07P5J02m11L83K9j88
$$ plain form
3574 -85 -76 53 182 205 -2 -84 -316 124 -93 27 93 18 9 -202 216 9 -72 -38 -195 63 27 -12 81 -326 61
3599 61 84 65 30 166 -35 80 -122 -6 32 -203 114 129 -35 136 -208 162 -95 -96 -167 69 106 140 2 154
3623 154 -6 -58 -56 -175 -22 44 11 124 -89 -307 80 169 286 30 -41 177 103 -85 -43 201 69 -138 -2
3646 -2 -24 -68 232 124 211 264 97 182 -47 -70 -106 85 -107 246 202 209 -138 181 -262 175 76 -230 -17 -12 -38
3671 -38 -89 248 -148 -60 31 -120 -39 101 13 87 19 -101 -45 14 127 29 91 -54 -81 -106 82 -111 -160 154 -179
3696 -179 -269 -31 -66 -154 -28 -33 -5 144 -46 -175 198 306 53 -51 160 207 -74 -103 117 106 46 20 177 -186
3720 -186 105 -10 -171 190 -253 -1 130 -130 -34 -119 -140 -2 -129 -155 -246 -182 -163 32 33 -116 -7 147 -83
3743 -83 -146 260 -85 62 134 85 288 -107 22 57 145 74 98 200 23 127 -43 -24 28 -108 23 -274 -58
$$ packed form
3574h5RJ29J29K3k07q2k32M40k17J20O6p5rk11M18k07q1L4j57K58l6l9R3m07L87
3599F1K3j9l5J36k01J15k02J16L8k35L17J5j64J71l44L70k57jp1K36L7L4j38J52
3623A54j60n2Kj19J53O6l3J13k13k18L87Q9J17k56p1K18p4j88M2K44j32k07J36
3646bk2m4L00j08Q7N3j67Q5k29k3l6J91j92L53m4Pl47L19m43M37r9l06K13Nk6
3671c8n1L37l96Q8R1j51Q1J40q8P4o8j20N6N9J13r8O2j45k7k5J88j93m9L14l33
3696a79r0K38l5q8J26nK8J49j90j29L73J08k53j04K11M7k81k9K20j1o0k6J57l63
3720a86K91j15j61L61m43K52J31k60R6q5k1J38j27k6r1O4J9J95Jj49J09J54k30
3743h3o3M06l45J47P2m9K03l95J29L5Q8p1K4J02j77J04j70J9N2j36J31k97K16
$$ plain form
3766 -58 -118 -223 143 70 163 278 -141 122 170 -57 -77 -83 65 147 -84 56 -51 -46 -39 -51 61 -48 65 -294 -56
3791 -56 -51 132 65 -25 108 157 55 166 -33 -39 213 110 4 106 168 208 147 -17 -164 -160 -124 82 134 -194 4
3816 4 99 139 -324 -11 -225 -215 -104 -247 -168 -152 -361 111 -33 267 142 -10 163 37 -69 123 87 -160 -203
3839 -203 166 -38 29 -13 -2 150 -252 -64 72 376 -73 1 4 -34 -11 -163 -217 -100 -138 -124 -60 124 -52 -35
3863 -35 33 -36 9 -65 -14 17 -124 69 196 4 -137 -153 140 -74 184 109 -219 238 -88 -47 -319 -265 11 55
3887 55 476 282 7 -103 -31 51 49 -50 198 -278 107 37 -224 55 21 130 -29 -27 228 120 50 173 153 -26
3911 -26 -94 -307 -56 -195 -204 -61 -114 138 -29 4 96 -15 16 184 -45 -93 80 -142 -355 -83 -65 -145 -109 11
$$ packed form
3766e8o0j05L66p3R3J15m19K63M8k27k0oJ48Q2k31J40j07NPj2J12j09J13l59K38
3791e6NJ83o7r0J33M9j02J11j99oK52j03j06J02O2M0o1j64j47ML6K06N2l28J98
3816DR5M0m63L13k14J0J11j43P9J6k09M72j44L00j25j52J73j26j06J92l6k47m3
3839b03L69k04O7m2J1J52m02J88J36L04m49P4Ll8K3j52n4J17l8J4O4J84j76J7
3863c5O8o9M5p4N1L1j41J93J27j92j41j6K93k14K58p5l28M57l26M1k72N4K76M4
3887E5M21j94k75j10P2Q2kr9K48m76L85p0k61K79l4J09j59KK55j08p0J23k0j79
3911b6o8k13K51j39rJ43n3K52j67L3R2j11L1J68k29m8J73k22k13K72J8q0L6J20
$$ [...]
8191b12
##END NTUPLES=NMR FID
##END=
