##TITLE=1H_DE-57K_d6
 DMSO-d6
 8 sc, 
 4.7.2024
##JCAMPDX= 6.0         $$ Bruker NMR JCAMP-DX V2.0
##DATA TYPE= NMR FID
##DATA CLASS= NTUPLES
##ORIGIN= UXNMR, Bruker Analytische Messtechnik GmbH
##OWNER= root
$$ XWIN-NMR		Version 3.5
$$ Thu Jul  4 14:14:43 2024 Russian Standard Time (UT+4h)  she@DPX200
##.OBSERVE FREQUENCY= 200.1314
##.OBSERVE NUCLEUS= ^1H
##.DELAY= (6, 6)
##.ACQUISITION MODE= SIMULTANEOUS
##.ACQUISITION SCHEME= undefined
##.AVERAGES= 8
##.DIGITISER RES= 18
##SPECTROMETER/DATA SYSTEM= spect
##.PULSE SEQUENCE= zg30
##.SOLVENT NAME= DMSO
##.SHIFT REFERENCE= (INTERNAL, DMSO, 0, 15.7039)
##AUDIT TRAIL= $$ (NUMBER, WHEN, WHO, WHERE, WHAT)
$$ ##TITLE= Audit trail, XWIN-NMR		Version 3.5
$$ ##JCAMPDX= 5.01
$$ ##ORIGIN= Bruker BioSpin GmbH
$$ ##OWNER= she
$$ F:/spectra/data/she/nmr/H-F/1/audita.txt
$$ ##AUDIT TRAIL=  $$ (NUMBER, WHEN, WHO, WHERE, WHAT)
(   1,<2024-07-04 14:14:03.71 +0400>,<she>,<DPX200>,
      <created by zg, POWCHK disabled, PULCHK disabled
       configuration hash MD5:
       00 E9 B6 7A A2 85 ED C7 34 08 36 98 17 FE 4E 26
       data hash MD5: 16K
       C1 BE DE 82 18 E1 67 DB 02 5E 3F 11 73 8E 24 5A>)
$$ ##END=
$$ 
$$ hash MD5
$$ 62 C0 90 E6 CC 05 4C 08 7D 9B 94 BD D3 EC 64 F2
##$RELAX= 
##$RELAX= 
##$RELAX= 
##$RELAX= 
##$RELAX= 
##$RELAX= 
$$ Bruker specific parameters
$$ --------------------------
##$DU= <F:/spectra>
##$EXPNO= 1
##$NAME= <H-F>
##$PROCNO= 1
##$TYPE= <nmr>
##$USER= <she>
##$AMP= (0..31)
100 100 100 100 100 100 100 100 100 100 100 100 100 100 100 100 100 100 
100 100 100 100 100 100 100 100 100 100 100 100 100 100 
##$AQSEQ= 0
##$AQ_mod= 1
##$AUNM= <au_zg>
##$AUTOPOS= <>
##$BF1= 200.13
##$BF2= 200.13
##$BF3= 200.13
##$BF4= 200.13
##$BF5= 200.13
##$BF6= 200.13
##$BF7= 200.13
##$BF8= 200.13
##$BYTORDA= 1
##$CFDGTYP= 0
##$CFRGTYP= 5
##$CHEMSTR= <none>
##$CNST= (0..31)
1 1 145 1 1 1 1 1 1 1 1 1 1 1 1 1 1 1 1 1 1 1 1 1 1 1 1 1 1 1 1 1 
##$CPDPRG= <>
##$CPDPRG1= <>
##$CPDPRG2= <>
##$CPDPRG3= <>
##$CPDPRG4= <mlev>
##$CPDPRG5= <mlev>
##$CPDPRG6= <mlev>
##$CPDPRG7= <mlev>
##$CPDPRG8= <mlev>
##$CPDPRGB= <>
##$CPDPRGT= <>
##$D= (0..31)
0 1.2 0 0 0 0 0 0 0 0.06 0 0.03 0 0 0 0 0.0002 0 0 0 0 0 0 0 0 0 0 0 0 
0 0 0 
##$DATE= 1720088043
##$DBL= (0..7)
120 120 120 120 120 120 120 120 
##$DBP= (0..7)
150 150 150 150 150 150 150 150 
##$DBP07= 0
##$DBPNAM0= <>
##$DBPNAM1= <>
##$DBPNAM2= <>
##$DBPNAM3= <>
##$DBPNAM4= <>
##$DBPNAM5= <>
##$DBPNAM6= <>
##$DBPNAM7= <>
##$DBPOAL= (0..7)
0.5 0.5 0.5 0.5 0.5 0.5 0.5 0.5 
##$DBPOFFS= (0..7)
0 0 0 0 0 0 0 0 
##$DE= 6
##$DECBNUC= <off>
##$DECIM= 24
##$DECNUC= <off>
##$DECSTAT= 4
##$DIGMOD= 1
##$DIGTYP= 9
##$DL= (0..7)
0 120 120 120 120 120 120 120 
##$DP= (0..7)
150 150 150 150 150 150 150 150 
##$DP07= 0
##$DPNAME0= <>
##$DPNAME1= <>
##$DPNAME2= <>
##$DPNAME3= <>
##$DPNAME4= <>
##$DPNAME5= <>
##$DPNAME6= <>
##$DPNAME7= <>
##$DPOAL= (0..7)
0.5 0.5 0.5 0.5 0.5 0.5 0.5 0.5 
##$DPOFFS= (0..7)
0 0 0 0 0 0 0 0 
##$DQDMODE= 0
##$DR= 18
##$DS= 0
##$DSLIST= <SSSSSSSSSSSSSSS>
$$ [...]
##$SUBNAM2= <"">
##$SUBNAM3= <"">
##$SUBNAM4= <"">
##$SUBNAM5= <"">
##$SUBNAM6= <"">
##$SUBNAM7= <"">
##$SUBNAM8= <"">
##$SUBNAM9= <"">
##$SW= 24.0689651099613
##$SWIBOX= (0..15)
0 0 2 0 0 0 0 0 0 0 0 0 0 0 0 0 
##$SW_h= 4816.95568400771
##$TD= 16384
##$TD0= 1
##$TE= 0
##$TE2= 300
##$TE3= 300
##$TEG= 300
##$TL= (0..7)
0 120 120 120 120 120 120 120 
##$TP= (0..7)
150 150 150 150 150 150 150 150 
##$TP07= 0
##$TPNAME0= <>
##$TPNAME1= <>
##$TPNAME2= <>
##$TPNAME3= <>
##$TPNAME4= <>
##$TPNAME5= <>
##$TPNAME6= <>
##$TPNAME7= <>
##$TPOAL= (0..7)
0.5 0.5 0.5 0.5 0.5 0.5 0.5 0.5 
##$TPOFFS= (0..7)
0 0 0 0 0 0 0 0 
##$TUNHIN= 0
##$TUNHOUT= 0
##$TUNXOUT= 0
##$USERA1= <user>
##$USERA2= <user>
##$USERA3= <user>
##$USERA4= <user>
##$USERA5= <user>
##$V9= 5
##$VALIST= <valist>
##$VCLIST= <CCCCCCCCCCCCCCC>
##$VD= 0
##$VDLIST= <DDDDDDDDDDDDDDD>
##$VPLIST= <PPPPPPPPPPPPPPP>
##$VTLIST= <TTTTTTTTTTTTTTT>
##$WBST= 1024
##$WBSW= 4
##$XGAIN= (0..3)
0 0 0 0 
##$XL= 0
##$YL= 0
##$YMAX_a= 110055
##$YMIN_a= -194081
##$ZGOPTNS= <>
##$ZL1= 120
##$ZL2= 120
##$ZL3= 120
##$ZL4= 120
##$ABSF1= 10
##$ABSF2= 0
##$ABSG= 5
##$ABSL= 3
##$ALPHA= 0
##$AQORDER= 0
##$ASSFAC= 0
##$ASSFACI= 0
##$ASSFACX= 0
##$ASSWID= 0
##$AUNMP= <proc_1d>
##$AZFE= 0.1
##$AZFW= 0.1
##$BCFW= 1
##$BC_mod= 2
##$BYTORDP= 1
##$COROFFS= 0
##$CY= 11.3945322036743
##$DATMOD= 1
##$DC= 2
##$DFILT= <>
##$DTYPP= 0
##$F1P= 15.6554695791079
##$F2P= 12.8336369535428
##$FCOR= 0.5
##$FTSIZE= 0
##$FT_mod= 4
##$GAMMA= 1
##$GB= 0.15
##$INTBC= 1
##$INTSCL= 1
##$ISEN= 128
##$LB= 0.24
##$LEV0= 0
##$LPBIN= 0
##$MAXI= 10000
##$MC2= 0
##$MEAN= 0
##$ME_mod= 0
##$MI= 1.114404
##$NCOEF= 0
##$NC_proc= 0
##$NLEV= 6
##$NOISF1= 3.799351
##$NOISF2= 2.8
##$NSP= 1
##$NTH_PI= 0
##$NZP= 0
##$OFFSET= 15.70392
##$PC= 1
##$PHC0= -25512.77
##$PHC1= 21.18748
##$PH_mod= 1
##$PKNL= yes
##$PPARMOD= 0
##$PSCAL= 0
##$PSIGN= 0
##$REVERSE= no
##$SF= 200.130013532006
##$SI= 16384
##$SIGF1= 3
##$SIGF2= 2
##$SINO= 400
##$SIOLD= 16384
##$SREGLST= <1H.CDCl3>
##$SSB= 0
##$STSI= 0
##$STSR= 0
##$SW_p= 3612.71676300578
##$SYMM= 0
##$S_DEV= 0
##$TDeff= 0
##$TDoff= 0
##$TI= <>
##$TILT= no
##$TM1= 0
##$TM2= 0
##$TOPLEV= 0
##$USERP1= <user>
##$USERP2= <user>
##$USERP3= <user>
##$USERP4= <user>
##$USERP5= <user>
##$WDW= 1
##$XDIM= 8192
##$YMAX_p= 0
##$YMIN_p= 0
$$ End of Bruker specific parameters
$$ ---------------------------------
##NTUPLES= NMR FID
##VAR_NAME=  TIME,          FID/REAL,        FID/IMAG
##SYMBOL=    X,             R,               I
##VAR_TYPE=  INDEPENDENT,   DEPENDENT,       DEPENDENT
##VAR_FORM=  AFFN,          ASDF,            ASDF
##VAR_DIM=   8192,          8192,            8192
##UNITS=     SECONDS,       ARBITRARY UNITS, ARBITRARY UNITS
##FACTOR=    0.0002076,     1,               1
##FIRST=     0,             0,               0
##LAST=      1.7004516,     0,               0
##MIN=       0,             -194081,         0
##MAX=       1.7004516,     110055,          0
$$ Real data points
##PAGE= N=1
##DATA TABLE= (X++(R..R)), XYDATA
0@%%%%%%%%%Oj4J6j6J6k4L2l2M0m8N6o9P7q8J04j20J38j59J79k03K30k58K90l24
33a71L64m06M51n03N59o19O89p66Q47r36J037j149J272j414J576j760J973k225
51a181K529k900L364l971M799n999P909j1424K0028q1407j25828R3459M5093j5076
65g0605O392N7277K6232N987K0704N0055P920m5567n0531j8686m465J5509J4809
78A5031l2005o3596n375M3598J4387p021L1897M0838m140j8272L5981N8732j4052
91I6003q3112n0246L979k004k4832l634K2464Q649l589K4862M5284K6105J48j6367
105D3710k5192j2479J3114J2878k6885m4464o772J8575o559j2646K7376L3222
117A3878j6030k3021L7653N3796l623l4987j0076o23j9758j7805J488k96j8159
$$ y = [0, 0, 0, 0, 0, 0, 0, 0, 0, 0, 6, -8, 8, -8, 8, -16, 16, -16, 24, -24, 32, -37, 40, -48, 56, -64, 74, -85, 94, -109, 121, -137, 153, -171, 193, -213, 238, -265, 294, -325, 364, -402, 445, -491, 546, -603, 669, -745, 831, -929, 1044, -1181, 1348, -1552, 1812, -2159, 2640, -3359, 4550, -6874, 13154, -68253, -194081, -100622, -55529, -70605, -64213, -6936, 19296, 25283, 45987, 96042, 103962, 58395, 7864, -10822, -15287, 222, 15031, -16974, -80570, -85945, -42347, -27960, -34981, -3084, 37754, 33614, 15342, 51323, 110055, 96003, 12891, -37355, -33376, -35380, -60212, -63846, -41382, -32733, -36322, -11460, 33824, 59929, 60077, 43710, 18518, 6039, 19153, 32031, 5146, -39318, -46090, -27515, -34074, -46720, -19344, 13878, -2152, -25173, 12480, 66276, 62653, 27666, 17590, 16967, -2791, -20596, -19108, -19404, -37563]
130c7563q845J4118J7326J9062K4034L484k2381m313K7093J1668k7376k2884M762
143a815n032k4023l501K4265R325k2500j1110K6104K9778N917m749r31k572p322
157A1834k799l34p955j4000j0535o301L92J6097J9496N54j3984L455K3811J1526
171C1257j2598p434N213r605k2947j231J8572j39k3036q850J5209J3878N208O190
185I687M354l959k842O010L363n906m887n259j6190j1051J3319J6594p281j4304
199a8352O876J7339K820j908R231N778j2970j4205L927R559l967j2417o884j087
213a6260K676P294P526J195r83K096L143J033L359N463n546j6314q470Q213P409
228A834o936q631L593O811j695J945J2010P189p594q945K755O615j494n327n458
$$ y = [-37563, -46408, -32290, -14964, 4098, 28132, 31616, 9235, 4922, 32015, 43683, 16307, -6577, -1815, -6847, -30870, -34371, -10106, -781, -23281, -34391, -8287, 21491, 27408, 22659, 21728, 19156, 11834, 9035, 8701, 746, -13254, -23789, -30090, -29698, -13601, 5895, 6449, -7535, -4080, 19731, 31257, 18659, 11225, 16438, 6833, -16114, -17345, 1227, 1088, -21948, -30798, -15589, -1711, 3497, 9687, 14041, 10082, 7240, 13250, 16613, 10707, 5820, 561, -15629, -26680, -13361, 3233, -4048, -18352, -11476, 5863, 8683, 6775, 16006, 21784, 8814, -5391, -1464, 8095, 4128, -8289, -15173, -16260, -13584, -6290, 1236, 2431, 1448, 3544, 6687, 7720, 11079, 16542, 10996, -5318, -13788, -5575, 1834, -5102, -13733, -10140, -3329, -5024, -3079, 8931, 16120, 8526, -419, 2336, 8951, 7457, 2130, -3328]
243c328n969k578M156M888q8p89L269J190j682N724J0503j997j3256m968P075
258B150J741p422l174K799j981n040M031R930L408l453k230J482K414K788P96
273H239n398o554j130J622o65j446K329J693l294j551P094Q524j062o387j534
288D80L989k90l856p86N79l343n010R54N374K736q69r69J60K415L635J922k513
305D608m193q85O06j889j873K737J007n972k460O485O490j355l114J168K317j210
321B467j004K282m05m691l255O00J217J275J387j190k381J446M933K627k137j115
337B056P66j672k636P67K988j418n284j977L552L531k22l54N15M14j75J207J507
354C565L06j879l023j609N31J356R40j778k195N63L061J920l76P69M98j088k423
$$ y = [-3328, -9297, -11875, -7719, -2831, -2919, -3708, -439, 751, -931, 4793, 15296, 13299, 43, -4925, 2150, 3891, -3531, -6705, -3906, -5887, -10927, -6896, 3034, 6442, 2989, 759, 2241, 4655, 7443, 8239, 2841, -3713, -4843, -3221, -3886, -5332, -3003, -1310, -4604, -6155, 939, 9463, 8401, 2014, 480, 4469, 4179, 323, -463, 116, -3227, -8237, -7283, -1909, 827, -42, -1011, -851, 1564, 5199, 7121, 4608, 415, -470, 136, -1753, -3626, -889, 118, -5854, -8314, -1829, 4661, 3306, 192, 1360, 3677, 2467, 1463, 3745, 3340, -1351, -4606, -4006, -2789, -1514, -127, -1317, -3698, -2252, 2681, 5308, 3171, 2056, 2822, 1150, -1486, -719, 2269, 851, -4433, -6410, -2858, 673, 451, 97, 612, 1026, 851, 2058, 3565, 3871, 1992, -1031, -2640, -2109, -753, 187, -1591, -3786, -3223, -162, 1758, 1382, 2151, 2649, 1561, -862]
371h62J547K718q75m568j922J909M50L07P48P69r76n05J700J791O64k86j166k280
389h37q24J953P90k029k065P11J223j82M89K313O42j828r83J499J774l08k179
406A59q38l35n74N43L82J30k61l17J78P54J749R11l27k279j17J290J39j099j011
425i23j48j13p18N08J695J177j667j101J509J436K86q53n49m63p70J72N40n12
443d94m06l56j11K6J495J457m21j396K9J505o2p98l85R7p98j296R25J257k82r93
463a007K01K95P72P54J17m28m74K1k26Lk44L68q71q44K69J239O53k59n35L40O86
484H30J46k94J0L02q93r39Q2N69J87o42j99j68O36L42P00j51o0J69l85N3J90P1
506E56m72j049k89P45Q37l71k19k17N30m1n0J002k33o96n86N47m8L44l20o42m03
$$ y = [-862, 685, 3403, 2528, -2040, -3962, -2053, -1603, -1296, -548, 221, -755, -1260, 440, 2231, 2895, 2609, 1443, -837, -1661, 292, 1082, -947, -3012, -2301, -1078, -1260, -771, 1542, 2184, 356, -627, 872, 2646, 2338, 159, -679, -1014, -1588, -1045, -663, -533, -794, -1111, -933, -179, 1570, 2481, 2154, -125, -242, 1048, 1187, 88, -923, -1071, -1184, -1902, -1394, 301, 1478, -189, -1290, 219, 1655, 1941, 1088, 539, 76, -694, -522, 18, -494, -900, -1256, -1367, -1341, 154, 1611, 1190, -206, -177, 1328, 1266, 468, 83, 180, -618, -1914, -989, 268, -14, -1007, -806, -511, 261, 1015, 1132, 704, 230, 251, 25, 28, -216, 152, -719, -1563, -1294, -55, 598, 339, -196, 144, 830, 976, 682, 692, 994, 101, -838, -756, -187, 0, -642, -841, -1009, -373, -31, 669, 518, 458, 627, 242, 295, 485, 556, 84, -965, -1254, -509, 328, -43, -262, -479, 51, 10, -40, 962, 729, 33, -553, -6, -54, 290, -30, -672, -1075]
527a075K86Q74j2m7K58l24J65k20Q28J40m52m82n56L22L22m90n7M30j96j58N97
548A53K15p7L2k31P1l6K33m17n2m73J83K40J16Q2m20Q58p20o7N81O28n06p77j5
571c99M90m01J08K02p1l44l06O38O9K98K53m71J2q5J50K41l56L7k31o8j31l0M22
594B7k81J76J06J93L70k39j88j5k17k3k1O7M5j07j03k63J58K69n9K00k50J38K41
617B24j51K2j5l37RL77k93J40J15m18m6L53M20j64l14P3J67r9J27K4j21r4k33
640b34k84L84N1m9J77Lk52L59j60L03k99J23j74l5M21m45L82J5q01L11N78l84
662a0R2J91k1l30N4k64L59j02L1k58K25L57r3m79P5N09k90L11j11p6J83k32l74
685b53L97j07N3n6o6L5o9J43J4l47K23ql31L65J70k53J78k00p1K47J88N6j95m85
$$ y = [-1075, -789, 85, 73, 26, 284, -40, 125, -95, 733, 873, 421, -61, -617, -295, 27, -463, -520, -90, -286, -444, 153, 368, 291, 323, 92, 163, 127, 360, -57, -109, -582, -399, -159, -43, 39, -381, 477, -243, -310, 271, 899, 393, -384, -399, 91, -310, -202, 0, -71, -415, -721, -83, -14, 284, 537, 66, 78, -7, 143, 384, 28, 65, -166, -234, -365, -395, 27, -254, -78, 28, 221, 591, 352, 164, 149, -68, -91, -112, -45, 0, -107, -210, -473, -315, -46, -105, 95, -155, -17, 224, 73, 95, 80, -257, -248, 129, -164, -24, 91, -327, -373, -20, 400, 236, -78, -5, 162, 63, 190, 214, 93, -1, -234, -518, -134, -83, -132, 45, 48, -204, 155, -5, 298, -1, 122, -52, -87, 334, -111, 271, 286, -515, -204, 374, -10, 82, 273, 252, -78, -24, -288, 71, -31, 0, -258, -33, 324, 231, -248, -173, 336, 46, 357, 246, 170, 353, 121, -253, 144, 37, 90, 34, -32, 3, -66, 77, 91, -256, -33, -41, -372, -7, 163, -90, 88, -112, -183, 64, 252, 308, 113, -372]
709c72L31J45q3J98l98Q7K33N8j18m7j66K00l00O9J06j03N5K99k77R9j21N43k35
732B03r9p0J38r0l3k02j44M23j50r1j04o8K08%r9J83k01K42J43p7J2k99lM74N5
757C51m73j51J20p2K22K2M0O3J93m10L44j81L7o2J60J6l68K66j79k7K17l6m1n5
781dk70K97P1k70L62k2j41o2K51l90J7K41J16o4K20m19K3r4L54k07m0L18q2o2
805A43k78R3o8j36j15M71n0Q3j89l8J37k4j37L52j95O7J29j67o7k71N59k36j78
828a15K24k38K90m78M66K4q0l89L21Q6l2j00J45k05J06k80M09k57L54k55mN7j52
851a03P3j55M98k39j48K58k61M5J19j04k4k0J00j91L94k56r8J35L10j78l02j85
873c32M52j55m10L98Q5l4K14k05m7l5J83m4k44RJ7K28k81K00jN8l38K76l06M17
$$ y = [-372, -41, 104, 21, 219, -179, -92, 141, 199, 81, 34, -132, 68, -232, -163, -57, -160, -105, 194, -83, 16, -105, 438, 203, 104, 34, 172, 82, 49, -153, -297, 126, -24, -115, -219, -287, -79, -79, -178, 5, -196, 46, 189, 112, 124, -175, -178, 296, 351, -122, -273, -153, -225, -3, 19, 59, 122, 315, -95, 249, 68, 105, 43, 203, 219, -149, 117, -62, -89, 128, 92, 51, -4, -274, 23, 94, -176, 186, 164, 23, -39, 212, -178, -161, 80, 196, 132, 352, -67, -44, -138, 216, 9, -31, 287, 205, 143, -135, -42, -110, -246, -361, 110, 60, 143, -46, -84, 53, 29, -108, 244, 49, 116, 245, 78, 11, -260, 299, 63, -115, 109, -129, 161, -317, 149, 173, 93, -296, 25, 111, 79, -21, 124, -81, 25, -255, 154, -103, 251, -4, -8, 49, -103, -30, -185, 313, 74, -74, 184, -77, -32, 87, -17, -41, -61, 39, -152, 242, -14, -112, 23, 333, 155, -147, -332, 120, -35, -445, -47, 38, 4, 218, 13, -34, -69, 114, 70, -174, -165, -148, 80, -201, -1, -2, 56, -282, -6, -312, 105]
897A05l03K53j86k94K81O8N2M5k65K12k01K93k27K81L41o62K12L4K25o33L34L40
919C05j33P9j35k5j42L2J19L6k89r0J09J23R0l59j2L7N78j57k87J26k16L12k1
942H0l52L29k03J6J74M0k7j45L40l59j98J50L61l71m9L61j22q4p8p3L14J26m65
965b35J65jJ01j27Q8J8k3J01n64P25p0n5n8k59L25k52n6K08j22K87Q2l29k35M02
989A16k56k56N27J5kk60r7J83j91J11l66M60k02K54J27r1k48p1L61R8R8o04L61
1012F7o6J60j84N6K72r4j13K07l16k44L11L18n50J64N6J4J34M8n07K69m6kL84
1035C38m06r9J85K72k64m4k36k9M40k58P8P7K50L4p21K56l2R6K35k50k9M15m23
1058a15q8L07j32K28k06j15J04J44p2j22k54K81J43K41o25L9N30o18L37j25K69
$$ y = [105, -198, 55, -131, -425, -144, -76, -24, 21, -244, -32, -233, 60, -167, 114, 455, -207, 5, 39, 264, -369, -35, 305, 172, 251, 116, 91, -51, -19, 100, 136, -153, -243, -134, -11, 79, -280, -292, -255, 323, 166, -121, 5, -211, 101, 80, -272, 57, -146, -130, 44, 84, 57, -88, 252, -107, -305, -155, 206, -165, -214, 147, 25, -59, -137, -210, 104, 230, -235, -70, -71, 30, -97, -9, 9, -14, 87, -477, 248, 178, 123, 65, -194, 131, -121, -177, 31, -91, 196, 278, -51, -286, 116, -140, -396, 131, 146, 144, -116, -213, -30, -221, -110, -476, -16, -218, 36, 163, 72, -176, -247, 114, 212, 310, -294, 67, 1, 161, -23, 33, 305, 211, 98, 305, -11, -255, 56, 374, -176, -12, 44, 58, 192, 240, -267, 2, -44, -46, 338, -68, -167, 18, 290, 26, -18, -254, -283, 157, -101, -23, 54, 304, 338, -383, -127, -159, -63, 172, -78, -107, 308, -115, -203, 104, -28, 200, -6, -121, -17, 127, 55, -67, -321, -40, 103, 344, -281, -242, 288, -330, 7, -118, 151]
1079A51k69J77k7k35L52p0j13k47K65R6J13k21k51J00K83k12K06l52K28K45k66
1100d7k00L84k88M4L23j13N2k80M05j52K3l0R0l69K13K1j7k6k15L3k8L70m16K53
1124C0J98k66j12Q7K4J24m0j0o6Q5K76m15j71J66K39o6j07L45n20J21q7J33j10
1147a42K5J11O0P9l99J45P0j3L8k62K23N2n2L39k14j05N7J03N7k9L24n72K26l8
1171H3J92l76k2p8R0J18l30N55j09m2K9M1n23L64P6p1K3m52L00J88qJ72m01L2
1195a49J53J99m30P1kK04q1L63l87m7L22j94r1Q0J05j56j06J8J61M3J3N9l74K39
1219A3k66J81M2J96k40J35r4L87l82J45oj30K23p9j41K40j42j40K42P6j34J46
1241B72L5m9k04j38K18o08O53j86k05K71k18K2J69l2L1P1o44N00j93M47k45k14
$$ y = [151, -118, 59, 32, -203, 149, 79, -34, -281, -16, 80, 193, -28, -279, -179, 104, -108, 98, -254, -26, 219, -47, -247, 137, -151, -107, 216, 103, 155, -125, 280, 128, 151, 121, 211, -158, 55, 76, 59, 33, -182, -149, -177, 193, -223, 30, 228, -38, -150, -63, -39, 85, 45, 35, -31, 54, 330, -85, -256, -90, 149, 83, -24, 321, -199, -78, -165, -32, -142, -117, -6, 54, 133, -266, -121, -51, -64, -26, -288, -65, -13, -65, 274, 60, -45, 12, 115, 172, 143, 467, -105, 121, 83, 275, -101, -123, -201, -111, 7, -323, 232, 123, 81, 110, 151, -372, -8, 68, -3, 20, -432, -132, 56, 48, 220, -181, -149, 4, 203, -227, -156, -158, 46, -35, 328, -59, -106, 216, 22, -69, 11, 116, -40, -146, -128, 33, 76, 89, 148, -226, 13, -253, -72, -30, 166, -74, 61, -33, 354, -28, 117, 111, -19, 204, 125, -16, 224, 82, -58, 184, 260, 126, 272, 307, 258, 54, -84, 134, -474, 179, -7, -212, 59, -159, -137, 32, 0, 31, 102, -542, -42, -235, 212, -33, -247]
1263b47L01q7K18l7l53K48J01p1j86K49m69N49J38j52l29K13k1m03L46K23k92
1284f1jM39k12j96l65R7P9o3L94k9l20J68J94j89P1J89j79j78Q7j51R2K58j92
1307f8l7J47k90L23L6l74K45k06J35P9l0J11j37J29J5j80P1j27M6J40j29L24k42
1330a9K86m88K19j1K6m6O0K33m46K4L50l36K78k14M5l4j17L64k53OJ12J29j62
1353FO0l2k8m5k26mM26j33N6j17l4Q9N2K21k73j20K39k44j22Q8l1R0L33k86J3
1378b2K79m23N2K71j22k99K04K46J5o9j25j34K46k86M4K3O1k24K00j0M9k34K03
1401e5K27j2K79m50L8j12o3J54q2J27r6K66k29k33K33o3j29k16N39k8j97n2j1
1424a65L22k74J53l69L24J07l7r6K58l42N57m65l02K47M1o2J68N1L7k28L90l43
$$ y = [-247, 54, -33, 185, 148, -205, 43, 144, 73, -113, 136, -333, 216, 354, 202, -127, 86, 65, -338, 8, 231, -61, -62, 377, 165, -31, -396, -299, -220, -283, 111, 82, -238, -70, 124, -65, 6, 195, 16, -162, -75, -226, -134, 124, -68, -105, 42, -248, 75, 111, -263, -18, -224, -89, -10, -40, 71, -66, 63, 78, -102, -31, -158, -112, 28, -101, 223, -19, 267, -221, -2, -13, 13, -33, 27, 260, -186, -162, 188, -148, 130, -84, -39, -73, -190, 174, -79, -73, 39, 168, 6, 66, 34, 6, -39, -265, -269, 157, 24, 80, -37, -71, 18, 70, 291, 18, -102, 137, -107, -229, -141, -172, -82, 251, -35, -22, 257, -166, -114, 157, 35, -264, -60, 186, 201, 132, 7, -127, 119, -167, -123, -100, -39, -263, -63, -73, -24, -258, -55, 172, 160, 439, -11, 27, -85, -148, 6, -76, 51, -45, 221, -8, -241, -8, -71, -200, -416, 123, 95, -102, -154, -165, 157, -117, 36, -333, -9, 98, 61, -35, 223, -119, 438, -27, -329, -82, -41, -103, 65, 116, 153, -75, 315, -28]
1446b8j98L9K85Q6k27J26j93m7M9L05k23J13n33K83J94k3j10N2M40m55l1J8O0
1469a8n8k8J42K2k6L21k11l13J43J45J2j09l5k11k18K92K29k0j35k5K12l08j4
1492b11J20J27j63J36L6m4q1p0M66m34K39j55j8L2o6L8o3L6L44n37L20o5j58M16
1516B45k32k9J62J21r1j19l90L23l8Jn6M58m16K01o25L92L70j81k42m0J37Np6
1539a20J77r2P1p1J74j49n7j02j19K45M3j4m13L41J16j60P8K6Q5M6j6j77M58n39
1563a69PJ4L67L37p30K24m7j1j99M07k7j32Jn1k59N23j87k27N7J98K3l40L86j22
1587D3m6k11J85J23l10L28k43J67K85l19P2L4j7l99J06K33m57L96j74J49J74j91
1609g2k14K38k30J88L9k93M31j13O3J69j34L2o9j18j58L35l11O7q5K22%k59K44
$$ y = [-28, -226, -187, 98, 184, -43, 83, -110, -157, -108, 197, -26, 87, -446, -163, 31, 8, -102, -50, 390, -65, -96, -78, -18, -76, -104, 38, 60, 34, 355, 144, -169, -26, 119, 131, 22, -13, -224, -442, -150, 79, 59, -76, -101, 111, -197, -211, -91, 36, -127, 9, 45, 1, -80, -150, 316, -118, 121, -34, -52, -20, -86, -48, -111, -75, 269, -268, 52, -13, -171, 245, 13, -16, 146, 267, 176, 57, -333, -10, -48, -47, -103, 355, -61, 140, -485, -93, 277, 96, -146, -186, -49, -44, -120, 57, -35, 36, -35, 139, -10, -67, -169, -288, -43, 0, -14, -427, -86, 30, -130, -52, -26, 59, 105, 89, -88, 370, -169, -162, -148, 219, 556, -174, 50, 3, -8, -207, 200, 173, 41, 42, -9, -268, 255, 68, -159, -102, 96, 119, -221, 165, 43, -3, -214, -29, 94, -216, 112, -131, 36, 321, 2, 74, 108, 91, -308, -202, 31, -426, -30, -204, -55, 119, -72, -286, -48, -278, -90, -51, -344, 87, -26, 37, 206, 72, 104, 35, -83, -241, 94, -217, -150, -235, -13, -13, -272, -28]
1632b8K8m8J32l67J57J34j26L33m32L03L1j9j59k80L59K4mk88P4L4R6R4j18K66
1656A96m06J62J6j08j3J90k34L30l64M22j04j68L00K31l95o3L19j79k94K71o0
1677D9o1k15M13k76K59l85j11L33J4j91J72k41L52J7l7j87p7K32r2NO6j45L04
1700A98k17j61o8N27j52l38J02j3K40j80J17J2K87k44Jp1j80N3J01j09O3L6Lo6
1724e9K3L8r7Q6k8P9j97R3q8k6M57m79M58j73l16J37J36j7j03r5J69o2n9K97K0
1749A94O0l26n2R3K98n26K34l5j59M8J91M9m18J90J69r9l8J26j00o2L27p3j97
1772a06n2m1M38m32K97k27K14p2J91P8l81J92J28k5Q2l22k9Mp4L88m82J61K73
1795B03k92k54L22J77l5k41L47q5l46K40j84J59o4r8P0K0R4j2m2k2j6q5K2J40
$$ y = [-28, 0, -48, 84, -283, -126, 8, -118, 215, -217, 86, 117, 98, -61, -341, 18, 42, 38, -250, -176, -142, -46, 48, -70, 196, -210, -48, -32, -140, -153, 37, -197, 133, -231, 191, 87, -81, 219, 450, 55, -8, 311, 132, -162, 109, 49, -12, -227, 186, -90, 169, -216, -327, 6, 20, -171, 1, -240, 112, 129, 92, -95, -172, 60, -32, -27, 39, -106, 198, -19, -180, -248, 279, 127, -211, -109, -122, 118, -62, 55, 67, 354, 110, 111, 40, -140, -87, 14, -95, -32, 4, 7, -59, -36, 2, -95, -9, -37, 42, -155, -62, -150, -176, 281, -198, 260, 87, -229, -92, 44, 27, -76, -171, -2, -64, -123, 174, 194, 254, -72, -124, -31, 267, -259, -25, -60, -219, -171, 20, 69, -349, -159, 10, -89, -127, -1, -101, -163, 164, 91, -106, -158, -199, 239, -193, 104, -123, 91, 19, 210, 288, -93, 99, 227, 202, 284, -38, -67, -63, -137, 251, -231, -70, 203, -89, -343, -21, 156, 121, -120, 227, 142, -204, 36, -148, 11, -53, -151, -81, -61, 33, 21, -21, -43, -59, -144, -122, 18]
1819A8k53K08J7j2J82O1j40j05K35Rl58L27k86K4j10N28j74k04K39l37L16r7J00
1842A88k41J4n3Q1op7K53j42q0p6K0L70k70k76J85L00j69L4l50K45L54k85k77
1865b58L73Q2j62k00N4K90l2K4j34M05k24j78Q0j79M4j27J41j32K96K05n61M25
1887B32p8m19L10J17j05o5J66l16K87r6K28J22m39j95K45j13K95j75N1M10m66
1908dK64p6j43P0L5l70L11k26J55R9o1j85J55j06O5p8k81N85j83j65m0K49j18
1931d8k6J39J44J2l07k1L30m25j71M34j02J9P5M6j30K57k73K19m2j85K28k36K24
1954A61o7k28K81l38L41k00N0r4R6j88K39j52j33M32l03N0j20K54L8ro3j3l75
1977c41K77k70J00J68K97j43j70j49J76j66L03J64j76K17k80m3M9n14J77M16J18
$$ y = [18, -235, -27, -10, -22, 160, 221, 81, -24, 211, 220, -138, 189, -97, -73, -183, 345, 171, -33, 206, -131, 185, 88, 188, -53, -39, -92, -11, -17, -94, 159, 17, -63, -139, -119, 251, -19, -295, -110, 190, 21, 55, -295, -50, 304, 19, -258, 115, 197, 35, -165, -111, 179, 147, 171, 37, 442, 218, 40, 120, -59, -15, -142, -1, -133, 163, 368, -193, 232, 154, -265, 45, 162, 57, -8, 158, -158, 129, 33, 261, 383, -56, -251, -6, -119, 176, 1, 52, 462, -4, 260, 184, 41, 111, 146, -224, 87, -139, 16, 115, 54, -131, 24, -82, -17, -95, -376, 209, 26, -139, -179, 70, -48, -74, 65, 209, 221, -86, -107, 223, -202, -373, 61, -41, -22, 53, 99, -31, 226, -47, 172, 130, -55, 173, -63, 161, 94, -134, 147, -191, 150, -50, 0, -94, 2, -186, 53, -99, -232, 200, -103, -53, -173, 81, 119, 110, 47, 34, -341, -64, -334, -234, -66, 231, 88, -82, -231, -55, -221, 82, 246, 70, 287, 7, -36, 13, -501, -324, 92, 210]
1998B10k50j57J10P8k09K72L32l76R7j55J74l56J05r7K09jn4J39j79n6K34j05
2020c5O5l6M3Q2J40j78j09K06l98L56O0l55J77O8q4J11l80L98K34p2k92N3j76
2043a22J2J9l4L57l00r8M61m40P3P9J49l3k83M8L41J67m17J49j18k1o7j43oM6
2067a81J82J35l86K57n0j13J87k07J51J36j53J26l8j27j28L22N0p1j02K5k9Q1
2089F7N5J00l06n7L45k23N3k79N96k30k26n6kJ83N0j5j95J51j08K02p3L1l00K86
2113D9L0Mj65j3Q4J7j78J50J88j86K01p8Kr5J48l77r9L67p7O6J38j87m7J11m3
2138A0j58K32j75%n4J63j23j51J94K7L71j30j42O2J17k06J67l65K26O5j72K30
2160A88j09q8Q9m1LO4K9r8k3K15j17N2K16m34K74N7l67M1n7l69Q01m37J89L2P8
$$ y = [210, -40, -197, -87, -9, -218, 54, 386, 10, 107, -48, 126, -230, -125, -222, -13, -14, -68, 71, -108, -164, 70, -35, 30, -6, 37, 119, 259, 81, -28, 178, -220, 136, 196, -159, 18, 86, 2, 113, -267, 131, 365, 293, 1, 54, -122, -110, -91, -125, 232, -68, -166, 295, -145, -72, 7, 156, 123, -160, -112, 229, 396, -21, 128, 10, -11, -78, -221, -227, -181, 1, 136, -250, 7, -43, -156, 31, -176, -25, 111, -42, 84, 46, -81, -209, 113, 163, 92, -10, 15, -14, 67, 122, 222, -84, -141, 204, -19, 34, -245, 351, 121, -105, -161, -163, 20, 70, 55, -140, 11, -97, 105, 32, 63, -237, 49, 79, 83, -82, -95, -11, 6, -172, -22, 166, -20, 181, 103, 105, 10, 158, -219, -318, 49, -28, 38, 176, -11, -58, 53, 10, -148, 84, -91, -91, -145, 18, -105, -256, -62, -35, 336, 206, 64, 126, 243, 37, 204, -161, 65, 130, -42, 188, 79, -9, 80, 39, 42, 106, 135, 37, 14, 229, 112, 164, 380, -54, 220, 277, -90, -49, -106, -475, 326, -111, 78, 110, 188]
2185A88J4l00K96j73k83J25L37j47j99K7J1O0j05n2M44k65J37p4qK14M5k05j85
2208i8n4K37p4p6M53n34K69K76n75O02k83l70K17K9k34K45nqR3j11K5J69m48J02
2232a53K35q6p4L12r8l45K96L8ql34K33k57K73o5J0R1j31Q2N1j04j33J83O5l46
2256b65L40j42j03kJ57j0O0j5r2J16j70K82Q6k60JJ30k0k61M57k30k11L75j89
2279C4j78K70k2N1j93l96N99p2K91l41k35Mj82N55m26M32j03j3N6j67j15K01k09
2302a59M04k08k72M56n59L26K2o1N2k44k7l9M21l61J22K76k06K1N8k44j02L27
2324CN5K08l5j40k89N71m03K62k56k79K18J04k12L54J42n38L34p8M6J5L0q1j97
2347a66Q7N8l62L65L86k48nL8m35P40m14N1J33r0l17J88j03k2J18m20M26L25m76
$$ y = [188, 202, -98, 198, 25, -258, -133, 204, 57, -142, -115, -104, -44, -149, -201, 243, -22, 115, 41, 33, 247, 292, 87, -98, -152, 85, 11, -65, 388, -146, 123, 399, -176, 426, 143, -227, -10, 19, -215, 30, 25, 17, 110, -1, 24, 193, -255, -153, 82, -4, -78, 234, 136, -209, 87, 125, 117, -217, 16, -241, 32, -33, -23, 68, -63, 19, 70, -34, -167, 16, 81, -265, 75, -67, -170, -172, -15, -25, 35, 20, -72, 44, -126, 156, 242, -18, -17, 113, 93, -168, 289, 59, -152, 223, 34, -144, 126, 104, 155, -38, -434, 165, 93, 384, 43, -192, -188, -370, 185, -241, 191, 88, 75, 131, -36, -151, 50, -159, 245, 37, -235, 221, -338, -12, 10, -51, 1, -243, -270, -309, 112, -249, -127, 149, -57, -36, 22, -222, -324, 3, 58, 266, 231, 91, -198, 373, -30, 232, -24, -303, -85, 19, -193, 161, 303, -235, 99, 21, 67, 82, 112, 31, -166, -79, -21, -383, -18, 368, 120, 115, 153, -282, 458, 44, 95, 228, 138, -179, 9, -94, -116, 2, -418, 8, 333, -143]
2370a43k3J29k28N33k57L6r2J11m1j42M48n57L75l04K18k9j0J89k75l23M48k9
2392C4J6P9k86J02k00K96J96n37M36q5j84J2jL70o4n2j15q5J61l9J82j97m8P8
2416F9k%o1n2N0j10O2j03R1P5j23J76j05qM7J58k69J27L3j04j13j28O7M81k07
2441E1k59L92l0k30j04k2M62l70J38n7n9L1L2k62L05K30l10J22L2r1K99k11k86
2464a97L1M54l23n8K03l08L61k92k11K30L4qK85l17j00M24n9k21L02j14j6j40
2486d0J48q0R1P3k0J7j37Mj93K20pk0K34m30O5K96l66J5PJ67j50j34O4J59k6J0
2512c3n0l0K4j42J74K41q3j77K45l38R4K06Ql07k2J91l68L11lj02K96m38L54k92
2536b41N7M9L13k65L02n6l18L90j97Q9P0o5j13l4MJ04R3l09J24j19J14K37j24
$$ y = [-143, -166, -37, -265, 268, 11, 47, -45, 66, 25, -117, 331, -226, 149, -155, 63, 34, 24, 213, -62, -385, 63, 34, 50, 129, -157, -55, -255, 41, 237, -300, 136, 51, -133, -121, -122, 248, 184, 132, 17, -68, 93, 54, 236, 39, -9, 69, 67, 67, 6, -46, 4, -106, -44, -147, -56, 19, -104, 72, -33, -41, 6, 164, -105, 22, 55, -49, -162, -290, -223, 258, 51, -208, 184, 154, -76, -180, -202, 260, -110, 28, -29, -88, -57, -25, -287, 18, 248, -62, 60, 92, 1, 300, 89, -197, -166, 288, -35, -93, 110, -198, 163, -129, -340, -110, -76, -84, 201, -116, -216, 208, 149, -72, 230, 116, 100, -40, 108, 28, 119, 192, 172, 189, 52, 56, -137, 83, 76, 56, 290, -140, -75, 221, -145, -130, -123, 44, -106, -240, -176, -17, -43, -33, -83, -113, -89, -231, -57, 184, 101, -76, 169, -169, -75, 131, 139, -168, -190, 1, -367, -56, -59, -161, 135, -303, 51, -241, -184, -135, 178, -87, 215, 159, -159, 231, 34, 123, 193, 128, 15, -19, -15, 89, 182, -127, -3, -122, -8, 229, 105]
2559A05l13P9K87k21K34j9j02m6R9j9k50M3J23R3j82N43m47K76l00K4k76L44K7
2582A02r4j1j24J92m0q7l10J06L49j87J10q9K8K51q7m91N35O6n9O3k68L1R1j29
2606e2j56K15j40J68j45N1J13j77J07J40J81k66J1k6l9l21Q8J05J34J07K13k75
2628C6N1j76j5O2KJ26j44O0k53nM45j26o2j13J53q5k19K43K65j28k70n6K9L10
2652A30k58N6j06L42k28K32m82K76O8J47q0j92l3L30l22K66Ql21J87J17r9j07
2674f9l00M18K83q7l00K00Q3k53M3n9j66J6M79k36k47J07J22k02J41L3J9k53R3
2697a35L08k77L6j60K71j0r9K95j72k80j3K82q2k41p9O06m36L23m30L52o5J52
2719A46kj94k03M15J66l19K0J90o9l19L55m39K47K7p5J46n1L48m20J10j31O0K30
$$ y = [105, -208, -129, 158, -63, 171, 152, 50, 4, 103, 84, -166, -123, 0, 93, -89, 454, 7, 283, -17, 7, -269, 75, 102, 8, -3, -127, 65, 25, -62, -372, -266, 83, -104, 6, -83, -55, 196, 109, -382, 153, 219, 160, 223, -45, -14, 77, -52, -208, 7, -133, 35, -110, -59, 54, -123, -16, 124, 305, 39, 50, 24, -15, -336, -248, -143, -9, 98, 311, 36, 87, -89, -104, -42, -40, 86, -58, 2, -251, -256, 189, 63, 1, -112, 41, -44, -263, -20, 245, 117, -153, -209, -180, 130, -128, -72, -178, 164, -64, 168, -314, -38, 30, 177, 97, -95, -128, 202, -120, 146, 154, -167, 20, 137, 38, -69, -369, 49, 332, 245, -55, 145, 228, -25, 18, -41, -207, -191, 288, 52, -195, -88, 34, -168, -27, 6, 25, -228, -135, 173, -104, -68, -228, 43, 33, -66, 229, 57, -223, -236, 46, -36, -277, -356, 250, -186, 137, -293, 59, -6, 146, 144, -50, -253, 162, 328, 9, 29, 219, 150, -169, 186, -253, -6, 21, -54, 92, 41, 389, -31, 79, -52, 8, 238]
2742B38l26j4K02l2J54j48L1o4j51L28n25nL36J52k53r6L2J48j02J45J49l67Q0
2765h8nn4R0K85k56P2K02Mk6k86O0o4j25J14R8K3r5J15K21k80j06j93L93j1l00
2790b12L09L2q2J69j16J6j84J99NO2k13Kk25K55P1l84K70m05M4L66k8j53M81n98
2814c19J62M05k30J36k0o9J44R9k59l0Oo2K26k02j42L91r5j08j16L81j70j54l2
2837e8J08l9Rn5l1J33j94K35n2N0k59L44j12R5k15N1k03R2M7L49m08J19j65J83
2861B4%m75L34r1N05k52L9O0K7j66L5L8Q6j38j20R1k00p7J39K9Q9J76j20j17K57
2886A73l62K03j06L19k22L71m52K78j14N4J13k17j91J91n1J45j25j81Nj5L33k9
2908A20j78J45k5N3j70J45j63R8Oj50J37j91K76j41r6j90M29j91L48j47L1k32
$$ y = [238, -88, -102, 100, 68, 222, 74, 105, 41, -110, 218, -307, -312, 24, 176, -77, -173, -141, 7, -95, 50, 199, -168, -88, -93, -147, -57, 228, -28, 44, 246, 250, 224, -62, -2, -66, -191, -77, 21, 44, -51, 64, 285, 5, -101, -294, 99, 88, -212, 97, 129, 47, 216, 100, 116, -68, 131, 136, 198, -15, -13, -238, 17, 88, -296, -26, -431, -387, -21, -49, -202, 279, -319, -157, 248, 18, 154, 134, 65, 209, 308, 49, 19, 25, -37, 189, -13, -155, 236, 141, 33, -83, 298, 128, -26, -58, 50, 11, 20, -35, -66, 67, -127, 108, 56, 106, -153, 191, 79, 174, -41, 10, -193, -101, -54, 295, -113, 6, -159, 24, 24, -451, -117, -208, 297, 45, 84, 144, 171, 5, 40, 78, 164, 26, -94, -3, -203, -280, -141, -112, -23, 153, 33, -84, 173, -189, 14, -92, 227, 5, 376, -76, 202, 88, 142, 255, 38, -153, 38, -13, 132, 7, -174, -169, -184, 149, 120, -58, 87, 62, 115, -55, 90, -73, 25, 31, -119, 18, -173, 103, -38, -134, -324, 105, -86, 262, 115, 146, -86]
2930h6J58Ml5P5k47k13L67N3m37L06O8k7j27J92%N2M2Mk09n3J54j54K10j02l16
2955c21M06j81K63k49J0J62k65j5L73P6j76k18M27kk82L8k39K05q9L02l24o3K36
2978G4Q9r2r0l72L53m9K72j27m30N31k6l61M24k76Q7O8Qj43j18M62l46J35J06
3001A79l69K74p3j73L35j97l5J35j4j97J29o2J91l48q0Q20p53N09p3J19l52K2
3023a3j47J29p4Q3M16m35K48k50j16L22M4J5k33r7J63P0j51j29K54j66J7K78l49
3046a21L29j63K53l5l63R8p5R4j46j0j0O2k6k0K72j88Q8j90J33J47l70K89k0j53
3070a25K56O7m33K33j32o1pJ13K45j74P4l3K68l50L50k32j36m1J18K3J61Q7n13
3093b42M15K7j61K47%k26j20J80K48m22J31k19j11m6J42J29n6L1P1J10l63K65
$$ y = [-86, 72, 76, 41, 116, -131, -344, 23, 76, -361, -55, 13, -14, -141, 51, 51, 103, 145, 149, -60, -113, 41, -113, 97, -5, -321, 85, -96, 167, -82, -72, 90, -175, -190, 183, 259, 83, -135, 292, 290, 8, 46, -193, 12, -77, 225, -99, -162, 74, 163, 71, -19, -391, -38, -87, 185, 58, -372, 159, 133, -228, 196, -80, 7, 75, 83, -60, -178, 284, -62, 73, 179, -190, 84, 11, -162, 173, -24, -59, 76, 62, -135, -6, -68, 123, -225, -305, 515, -238, 271, 198, 317, -35, -13, -160, -31, -105, -22, 394, -41, 207, -43, -159, 163, 207, 222, -11, -108, 55, 125, -26, -155, 99, -67, -50, 228, -121, 208, 45, 298, 263, -100, -2, -77, 17, -129, -139, -149, -87, -113, -133, 139, -49, 39, -151, -18, 129, -241, 48, 28, -125, 131, 198, -235, -2, -134, -195, -202, -89, 156, -18, 56, 23, 291, -59, 291, 59, -77, -118, 0, 23, 184, 271, -242, 173, 200, 39, 286, 286, 60, -60, 120, 368, -54, 77, -142, -253, -299, -157, -28, -84, -53, 18, 128, -235, 30]
3115C0N0j25J39l92M88k67J65J0j94k9O6L96k47L10l65k56K65j6J60j81J2j69
3137a50K88q7j81L92k96K06k06j46pJ77j07J23J28j14k07L93k10r3J6K58n61M18
3159C4k6j75J21j57L65n7p4K19m80J21K75J9j89p9J61R2j72K67q4ql48J51J87
3182A63j05j33J50J73n01K96J12om33Q0j0K37o1q4j60M43j40j74J10K02j3j99
3204e3L5J05k80M90l56R8l12K55j26J62M21o06J15o9R6k4J11L9j06P7l63J74L01
3227A84k28P1Lj69P6K96j93KR1or3o4o0n1Q3K01j67J77j27k44L98k33j06J40L44
3252C25m35j43M69k55J7mK89k41J44M6k57J93k0K75m46J54k50K38J87o17L15r2
3274a08J83J32n14K48Q4Q1K92j97j75j7j4j48Q1LP9l00J83J55n40P34j03l59K19
$$ y = [30, 80, -45, 94, -298, 190, -77, 88, 98, -96, -125, -59, 337, 90, 400, 35, -221, 44, 28, 188, 7, 19, -150, 138, 51, -130, 262, -34, 172, -34, -180, -187, -10, -117, 6, 134, 20, -187, 206, -4, -97, -81, 177, -384, 34, 8, -167, -46, -203, 162, 105, 31, 250, -230, -109, 166, 185, -4, -83, 78, 170, -2, 265, 181, 173, -175, -24, 163, 58, -75, 75, 248, -253, 43, 155, 149, -284, -204, -214, 23, -38, -122, -282, 161, 21, -153, -43, 159, 146, -53, -18, 87, -193, 297, -59, 39, -273, -18, -144, 18, 439, -167, -52, -121, -25, -49, 62, 101, -5, 72, -291, -117, 184, -44, 27, 30, -139, -63, 233, 40, 42, 133, 127, 34, -30, -90, -141, -58, 143, -24, 153, 26, -218, 180, -53, -159, -19, 325, -110, -253, 216, -39, -22, -26, 263, 22, 166, 212, -45, 148, 128, 403, -43, 111, -139, 99, 286, -331, -16, -108, 75, 207, -307, -59, 25, 106, 398, 201, 26, 9, -5, -153, -72, -69, 10, -290, -107, 48, -492, 242, 139, -220, -1]
3297apJ26j77K9p3j9K90l92L66j01J02j57nn9J95k2qj24j07L2Q2J11l63M75j28
3322F5l12L41R4l58K55j04q2jj44M32j77q4%qK35k73j00J55J54Q7j12L62n89K45
3346H1J19k09m8L2K7m5J02Q2J40j73K51l18k06K88OL9j56J60j89nj38L0M19k50
3370C9j7K4J1Q5l95N27l61R9N6L2k30L86k64k52L05k14J33k8j1o0K01L3J51k10
3394D0L7l34K82L3p4K78k78j30O8j46J37M9N2p8n5L13j32O3k03kq1L72l41J07
3418b3L14m01P4J76P6m69K23J36l40J75J29j42l19J58M5L62l66L24K2m49nK32
3440f8j08K41j80M2J04j17J26J28O9k08l6K10k97J45J2J7ol72J71P9p7j20L97
3463A52k34Q2LJ33k62q4M05j5L41m20l54K71k0j03O7O0lm0j45K08R0N2m9j42N1
$$ y = [-1, -8, 118, -59, -30, -103, -122, 168, -224, 142, 41, 143, -14, -19, -78, 117, 95, 87, -37, -144, -112, -30, 81, -282, 193, 65, -247, 94, 188, -170, 85, -19, -101, -102, -246, 186, 9, -75, -75, -83, 152, -121, -221, -66, 88, 175, 63, 425, -164, 81, 200, -9, -57, -25, 2, -43, 59, 141, 281, 108, 359, 41, -165, 123, 129, 168, 12, 172, -17, -22, -160, -130, 289, 39, 22, 46, 57, 142, -253, 274, -87, 12, 68, 100, -130, 256, -8, -260, 45, -169, -36, -64, -75, -135, 66, 99, 250, 40, 77, -257, 25, 58, -16, 262, -16, -146, -78, -224, -87, -38, 14, -64, -119, 194, 62, 125, -78, -80, -161, 211, -130, -23, 291, -110, -36, 140, 216, -253, -30, 106, -234, -59, 70, -72, -391, -233, -188, 174, -192, 132, 154, -295, -300, -68, -176, 65, -115, -73, 31, -86, 40, 168, 237, 29, -7, 203, -94, 51, 63, 80, 74, -298, -127, -48, -125, -245, 152, -82, 0, 3, 136, -126, -210, 195, 180, 521, 101, -253, 18, -2, -105, -38, 22, 19, -21, -166, 42, 132, 184, 135, -7, 44]
3488D4kM6J20J26o40J79j5J61RQj87K1Q8Lk3P4P8k2k83L66m72J83OJ20rk40K21
3515d0L8K45m73M77n13J56N3K18l12j67J75J5J26o2K84k1k85J92L6ok53L59n47
3538c05M22r1q9r1K8J52o3kq6J89k56n0j44J93j64L18j78M45n36M66n04L60m8
3561c4n0j45J19J88o1k77K01J19j88J32Q3J09l61L63k04L72n19K88m0j29K05j70
3583AN7q8K8K2l3P5j69k54M48k25N9q6J44J62l59J30J9o3L38k60j3l1L85m83K19
3608B3N4K05j33j91o1J14Q2J69m63J46K15k73M0L68n48o5M08p6M7l05K73j79K99
3631A49n1l5k42K49P9k6l50J48R3K33l29J07j99N1L44m97K94J28m9l37L41j35
3653c4Q6n0j10k08L85L5j54P9j20K89k39j72K85l8N5M5k1q3m5J84j11o9K00p5
$$ y = [44, 42, 88, 208, 334, -306, -127, -142, 19, 28, 36, -151, -130, -42, -39, -62, 12, 90, 68, -215, 151, -321, -138, -132, -12, -21, -261, -40, -2, 243, -230, 247, -266, -110, -57, 161, -151, -318, -143, -128, -2, -64, 220, 199, -86, 106, 142, 136, -117, 242, -305, 117, 26, -63, -154, -126, 26, -37, -39, -125, 64, -192, -242, -386, -193, -357, -39, -217, 228, -308, 158, -346, 14, -34, -84, -229, -110, 78, 17, -260, -59, 60, -128, 4, 87, 196, -165, 198, -6, 366, -153, 135, 95, -34, 171, 1, 58, -30, -2, 20, -13, 62, -107, -361, 87, -138, -79, -165, -21, 141, -218, -88, -69, -132, 206, -54, -67, -98, 287, -196, 23, 77, 282, 149, -42, -103, 11, 93, 262, -201, -55, 160, -113, -73, 295, -253, -318, 90, 14, 61, -244, 29, -150, 149, 98, 63, -179, 70, 149, 123, -227, -79, 14, 247, -82, 25, -174, -123, 221, -276, 18, 146, 97, -240, 101, -34, 52, 2, -108, -316, 69, 104, -50, 29, -91, 198, -41, -213, 72, 34, 89, 134, 113, 30, -15, 169, 58, -11, 189, 114]
3677A14K3rm56K3L38N9j06J94M7n96N95j14k34J97j8J02k43j13L66l56J59J55
3699A27Nk73j15M59m39K61m31M61j36j22R5J03J43k92J0p1K23K1K10l13K42r6
3721G2R7o8k04K28k10J68l98J77J88l54K17j41K69N7j74mJ3M3M6m7k14M23J56
3744C40k98j14K7J5K82k08k49J68N5J91k88j2O0l2J04j52J33oN5o7j62N0O6J88
3768A46r9L93k80J9m36k6L79o9l3O9l04L08k36R0o4L8J0M5q4K4N68n46o1M32l5
3793B48l32j85J68O8K19j67O5J81l12J57k94L78J09k59K09k40Q8j85J84j09K92
3814B83k94k9J76m01L21j27Q7j60K39k11J58J96m14mM35j54k96K67j23l06M52
3835I5jq3j53K06j97l3K41j1j47K35k51j42J55p5j25M1K93j96Q9J41r9K78k76
$$ y = [114, 137, 128, -328, -305, 33, 92, -14, 180, 227, -369, 226, 112, -122, 75, 57, 159, -84, -197, 169, -187, -28, 127, 132, -141, -256, 203, -236, 25, -406, 55, -81, -203, -108, -5, 138, -154, -144, -215, 8, 29, 239, -74, 168, 72, 169, 101, -103, 125, -85, 83, -315, -138, 50, -304, -87, -228, 41, 98, -76, -80, -67, -24, 22, -25, -239, 184, 340, 42, -72, -45, -30, 252, 44, -205, -37, 18, 209, -79, -91, -31, -63, 41, -111, 22, 16, 71, 4, -158, -108, -42, 146, 47, 440, 160, 179, -257, -283, 96, 27, -6, 63, -241, 67, -169, -79, -143, -105, -95, -50, -134, -110, 458, -88, -149, 283, 248, -84, -269, -101, -33, 186, 19, 84, 265, -47, 110, -184, 194, 303, 44, 253, 13, 101, -84, 100, -9, 283, -11, -40, 136, -265, 56, -71, 16, -144, 95, -116, 42, 238, -176, -180, 255, 101, -195, 72, -51, -357, 95, 94, 11, -142, 64, -133, -166, 75, 64, -83, 152, -99, -241, -86, -161, -286, -245, 48, -148, -59, 82, -17, 261, -15]
3858a5J65r1J28o2j21j23K37l7k26l61L20N2L47j02NQ9m9r1P8O5k55j89qJ63k80
3883c61L70K58l49K26k35J13k11L49k65J36M7p1J75l20J51l2j2M03k63k24R3J1
3905a1P0L0j06J30Jj25K52n44K45J59j66j56M83p9M4j6K13n19j2K9k19K94oJ8
3929IJ1j66R2Q8K58n35M9K27j74J00o2k38J11J35J88P6k63J04J17j66K51m1j31
3952D0J56J19o7l43K9j6K02j82jr9M94j93k47K4K50k68N65p73J73j38R7K80k22
3975a20K09m07P86l02j68J41j47R5o6kJ9l05K67J04l72K07J3K5j5j79K87l1o5
3998b6K95m64Q9J78k21J93r0J92J96n40J90J4o0j50Q5n7L01l20L43K62l40l35
4020b65L0K04J47k14j36L58K8l70J08J98k06n0K08j41K06l39J57L9K68k62O4l41
$$ y = [-15, 150, 59, 187, 125, 4, -119, 118, 81, -145, -506, -186, -134, 213, 111, 116, 205, 156, 65, 143, 208, -47, -236, -244, -81, -361, 9, 267, -82, 144, -91, 22, -189, 160, -105, 31, 78, 7, 182, -138, 13, -19, -31, 372, 109, -115, -22, -11, 59, 89, -17, 113, 114, -11, 241, -303, -58, 101, -65, -221, 262, 183, 227, 211, 424, -95, -107, -78, -297, -3, -9, 9, 20, -146, -54, 34, 292, -243, -194, 33, -141, -41, -103, -341, -230, -95, 93, 169, -94, 10, 127, -39, 212, 171, 40, 196, 315, 248, -95, -66, -82, 120, -62, -63, -162, 332, 139, -108, -84, 166, -102, 463, -310, -137, -275, -178, 102, -120, 89, -318, 468, 166, -2, 139, -8, 87, 21, 19, 38, -267, 0, 104, -268, -61, -48, -23, -38, -217, 70, 39, -26, 269, -195, -106, 72, -149, 44, -46, 146, 342, -198, -8, 6, -54, -204, -119, -176, 125, -195, 148, 410, 70, -265, -235, -31, 116, -98, -234, 124, 152, -218, -110, 88, -118, -168, 40, -101, 105, -234, -77, -38, 230, -32, 32, -309]
4042c09N74m45R7l2K2q0J83J13j28k48K60l5K82l47p8K22K2M1j05j27j03n7M11
4065A33m9P0k72J39M5k27J55P3k96L17j43L87j09j03K8j90J10M6P3j96o4K50K2
4088A99m79K46k4rJ46j1l5n0j4NJ68k9k38J66j46L70l44k5J80J58k40L8kj40M8
4113f2R8J47j83N7m6J06k27L07N8m00K98N6l65K45Jl83K78J8j48K58j94K56l29
4136a54L17j40k14O0J56j13j38K85k12L51m88N05n30M13o8J31p3j35J64j08j43
4157a34M2K5K8K86l36j5J69k4mM0rp0k87N7J53M90o43K93j35K0K81l18K40j57
4181hK20j69J21L4m00K37l4N3m79K76J02k6K30LJ57l08J30l01KJ94M61j88k22
4204H5k39L87oj5k25n4K42M8l10K70j53J29l54J42j06K74M0p0j06j51J25k80M60
$$ y = [-309, 265, -180, -83, -115, -93, -173, 10, 123, -5, -253, 7, -28, 254, -93, -171, 51, 73, 114, 9, -118, -221, -278, 133, 84, 154, -118, 21, 66, -161, -6, 67, -229, 88, -55, 332, 223, 120, 148, -42, 68, 114, 187, -9, -73, 177, 199, -280, -34, -58, -67, 79, 68, 33, -17, -31, -26, 142, 113, -125, 41, -105, 265, -79, -104, 76, 234, -6, 32, 30, -110, -62, 36, 183, 0, 57, 11, 117, -110, 197, 255, -145, 153, 209, -156, 89, 90, -293, -15, 3, -145, 113, -81, 175, -154, 163, 23, -191, -131, 25, -88, -226, 59, -153, 198, -290, 215, -315, 98, 30, 161, 88, -47, 117, 9, -134, -92, -67, -39, 247, -89, -104, 65, 41, 37, 77, 68, -2, -289, -232, -79, 411, -232, 61, -74, -54, 227, -91, 149, -8, 212, 43, 164, 198, -202, 35, 1, 54, -425, -149, -47, -73, 157, 160, 317, 9, 139, -162, -160, 34, 495, 307, 85, -154, 233, 227, 212, -13, -67, 175, 223, -87, 183, 30, 159, -195, -53, -159, 115, 155, 85, -21, -172, -47, -327, 133]
4227A33l85L61M0k94MR0j12K00k27J98j59K34J57k68k0J24k12M59n28K74l48K87
4249Hj55L13j02Q6j39J9Jj82L28k62J87j11M53l93J76j20R3j13K5j57j85K04L53
4272C27k68%J18l99j13M57k44L28l36K68l01P1Q0K24k25k06O6J50j54J2J86j8
4294B3l37L47j37k76N90m80K01m0L93k02q0R5J35k27q6K93k79J77J7JL8k54JJ99
4318A12j29p6n8K71l69p1J90K71K1r6M5k27k7J46n4k9l8P6n0K04j16J33k36k29
4342c36K68k62K44K7k11M49o39O45m34L02m32L90k8%q2n4Q9J36k06j6n2j18L55
4365C5N8j5p6L1l6k25K55K2O8k50p5K92l22K62k47M38p4q4k0J8k06J47n3N3j59
4390a63M10L3l33R8j45k46L11k12L96j49M6O0j51K6Pr9K48l20K73J78n10J56K39
$$ y = [133, -252, 109, 149, -145, -141, -51, -163, 37, -190, 8, -151, 83, 240, -28, -48, 76, -136, 323, -205, 69, -279, 8, -147, 166, 64, 150, 11, 30, 31, -151, 177, -85, 102, -9, 444, 51, 227, 107, 200, 87, 112, -45, -230, -26, 327, 59, 59, 177, -222, -335, 122, -122, 206, -130, 138, -163, -92, -12, 212, -13, -219, -153, -3, -157, -145, 41, 23, -314, 33, -104, -380, 210, -270, -69, -109, 284, 82, 2, 97, 232, 5, -81, 212, -67, 110, 127, 128, 166, -88, -87, 112, -17, -93, -151, 120, -249, -320, -130, 141, 162, 66, 111, -116, -143, 3, -51, -80, -118, -42, -92, 112, -4, 129, -107, -336, -68, -330, -86, -59, -270, 179, -460, 185, -249, 53, -379, 11, -17, -17, -99, -153, -64, 72, -134, -150, -202, -320, 35, 93, 78, 2, 33, -3, -228, 27, 49, 117, -133, -208, 84, -238, 24, -223, 215, 141, 57, 37, 55, -151, -4, -57, -4, -163, 247, 280, -53, 45, -100, -346, -35, -247, 149, 0, 46, 106, -45, -19, -12, -111, 137, -183, 90, 268, -242, -86, 153]
4413A53l17j05q5L10p3Q2K08L2m61L44L3l09L18m30N51m83P4oL21M8k31n69O08
4436A3L23m36o3K38K88l41o5J84m4K89m42N04m53j13K48l00K62j93K33j40j39
4457a47j97L01J89j2J27j10k83K92k41M1Q7n3p5O3k54L35QJ14J0k26P8j53M05
4480B99k79L8J68k08O6k40Q6J15j56O0K19J70m01J5m4j24L2jK4K48J71o16K90
4503f8L8j32M33l91K86j7l13J98j0K08k11J54J3o1j15l17J95L46O9n87K1J66J51
4526E6jj14r1J81K4k80M3J76M75m93J45o8k50K31J80j95j08K41o6j83J33P1k43
4549a36J03J62R9m24L47Rj22n3j0k8P0K49Q8n86J90j9J79j07k42M8J84K16m05
4572a88L26j6o1K8l6J08P1j78k47K92j47j04N55l76q1k4J10k22L26P6l39q1K41
$$ y = [153, -164, -269, -354, -44, -117, -35, 173, 205, -256, 88, 121, -188, 130, -300, 251, -232, -158, -164, 157, 205, -26, -595, 13, 336, -100, -163, 75, 363, 22, -43, 141, 97, 386, -56, 448, -5, -118, 130, -170, 92, -101, 132, -8, -147, -344, -43, 146, 134, 261, 151, -132, 160, -81, -40, 47, -6, -81, -18, -272, 63, 71, 185, 195, -31, 47, -106, 299, 20, 58, 226, 18, 84, -156, -70, 45, -111, -51, 168, 338, -63, -48, -92, -216, -184, -185, -161, 87, 258, -358, -68, -30, -162, 271, -120, 166, 149, -164, 34, 24, 232, 21, 175, 188, 127, 12, -305, -110, 236, 305, -282, -261, -95, 56, 55, -59, -150, 31, 55, -225, -182, -6, 469, -24, 121, 53, -197, 34, 214, 19, -89, 152, 86, -97, 36, 107, -136, -33, 129, 228, -196, 151, 160, 38, -15, -25, -53, 17, 266, 354, -232, -42, -61, 118, 11, -231, -183, 1, 217, -188, 138, 122, 61, 89, 53, 161, 232, 54, -193, 99, -48, -152, 403, 27, -54, -78, 32, -190, 136, 212, -127, -208, 33]
4595C3k41M65j05k66M42l04j37Q4K19l9j28l22jJ6K23L59l71K21p9K7j5N8J0J09
4619B58k90M3qJ8J22j77K65j81J70m1j42j13J48N7m19L05M5N7k82K69n2j75J98
4642G5l18K61k4J58l2Nl02K58j92j49K87J67j43o4J03r3r5j75J84J39L35n49J94
4665C0N2l9J74k02J61k51L79l8k22L9P7j87j8L40j16m28K46J2R5j35J40N1m1k69
4689a50J94L61N5m61L4J60j33Nm5j20j20L36q1r0N1l21K08K52o8j04K17oj78J44
4713A40j76j80J72kL5j31J34J50q5L9j23J26j60m9L00l68K08J30R7k73J99l55
4735a72M5j97K40O9J09L1j17J72m29L39k72J55O1J70l00J62j40K10J16k69M0J27
4757A50k91L68R8l94K16R1l67J5n9J77r5K79m9j19J04k12Q6J6J66j54k7R4k18
$$ y = [33, -208, 257, 152, -114, 328, 24, -113, -29, 190, 151, 23, -299, -300, -284, -61, 298, -73, 148, 69, 96, 81, 139, 149, 258, -32, 11, 3, 21, 143, -34, 231, 50, 220, 179, 37, -76, 72, 129, -290, 15, 60, 117, -165, 104, 52, -123, 75, -243, 18, -6, 152, 120, 125, -177, 81, -111, -260, 27, 194, 51, -13, 90, -3, -98, -273, -89, 50, 385, -164, 30, 82, 43, 217, 15, 176, -75, 304, 266, 44, 83, 160, -27, -45, 295, 179, -249, -3, 9, 104, -31, 109, 160, 119, -150, 44, 405, 460, -1, 33, 193, 60, 65, 20, -100, -220, 116, 35, -55, -4, -325, -117, 135, 67, -37, 180, 174, -4, 140, -36, -216, -44, -46, -11, -142, -8, 142, 57, 96, -27, 99, -61, -110, 190, -178, 30, 160, 257, -16, 183, -172, -127, -324, -84, -15, 94, 125, 8, 180, -249, 90, -182, -27, 34, 204, -96, 66, -74, 136, 252, -17, 23, 150, -141, 227, 325, -69, 147, 238, -129, -114, -173, 4, -91, 188, 139, 20, 124, -88, -2, 14, 180, 26, -1, 93, -125]
4780a25J37o6K95l50J43j21l3K28k07J3K60k70p0M19l27j87J64K55K7k77J46j18
4802f4n4j42M86k27O4Q1J45p4J4k46K70l57M4K09J1l2q5k26L57k71J14k55o4K96
4826fl1j4Q3k21J12K01k07N00n05L5K1J66Mr7j11k31M27j48r1K24k61k1J66%J52
4851A47K2l14M51j22q0k46K12R0l80L3K84J0r5j12Q3k8k36L71J00k94O4J34k54
4874a60J70j69K12J70j07l24J28O1qJ46r2q7j9O6k1L45k41J48J0j68j8Q9l67K96
4898F0q7L1K1k07K98m9l58K8J66N5Q2r2R8J6J69j60j17q2K36j37K96l6qj48j30
4923e5P5K58l49K07l11K55J40k3j52j62Q6m6J94k18q9K09J90l74K69l12L86j71
4945GK26n71K35K97j61K6n5j0J68k35K51K1k71R5j89R8q2M7qJ76n6kL60k64P3
$$ y = [-125, 12, -54, 241, -109, 34, -87, -120, 108, -99, -86, 174, -96, -166, 253, -74, -261, -97, 158, 185, -92, 54, -64, -118, -260, 226, -1, 63, 144, 289, 215, 229, -17, 253, -104, -60, 149, 160, 128, 43, -183, 174, -97, 17, -238, -302, -6, -37, -51, 32, -189, -77, 124, -83, 417, -88, -53, -32, 134, 138, 41, -70, -301, 126, -22, -113, 111, -150, -171, -5, -5, 147, 169, -145, 306, 184, 104, -142, 70, 160, -220, -187, 97, 107, 12, -100, -17, -45, -281, 90, 190, -104, -40, 94, -160, 10, -159, 53, 223, 116, -208, -80, -19, -27, 119, 27, -60, -79, -13, -34, 311, 70, 218, 228, 60, 42, 131, -236, 60, -27, 4, 25, -182, 116, 67, -291, -263, -97, -42, 40, -52, 46, 62, 231, 71, -46, -128, 108, -29, 267, 231, 223, 75, -55, 20, 278, -71, 136, -175, 80, 220, 197, 45, -117, -31, -77, 117, -101, -190, 19, 209, -165, 104, -208, 178, 7, 233, -338, -103, 194, 33, 59, 4, -6, 162, -73, 178, 199, -72, 23, -166, -68, -150, -103, -111, 65, 9, 7, 367, 103, 176]
4970A76P5n85J03P6J82J40k15q2j01K19P8r3m7M2J28j12m3K20k46L7K88l34K20
4993A26j04MK07k22k6J64k36p6J6K92J75l27J65k68K71l21L49k98K31j9K1n69
5015d45O17r2j67K39m0j45M8NK25q4l37K23rj42K9L8J15m99M29j78K58m11M38
5038A15k74K67j38P5J89l92j34J66K36k5J82j84K9j58J21k95K89O5k26K16l99
5059b75M59j45l6q5P4k25J79K58k92J33j90J92J01L75m54n0k38L55j14K5k71K60
5081C6lj51q6M86n28M85j54Pj30j50K16q7K12m40J95J51k58L46j82nn4K03j94
5104h5K74J39k15K35n13K95Q3m69l6R4L38j27k44M04l43J78j07J55N9j22k13L14
5126I4j97P8j77O31m70K2J05m0K61l62j7K17k03K53k28r9K67rM5l22J01o9r3O49
$$ y = [176, 251, -334, -231, -155, 27, 167, -48, -130, -231, -12, 66, -27, -74, -32, 96, -16, -59, 161, -85, -48, 240, -94, 126, 22, 26, 233, 11, -15, 149, -87, -163, -147, 145, 320, -7, 158, -110, 161, -160, 189, -109, 122, 103, 124, -445, 172, 80, -87, 152, 112, -33, 15, 20, 245, 161, -176, 47, 38, -104, -75, -37, 78, -421, 8, -170, 88, -323, 115, -159, 108, -30, 45, 234, -158, -292, -126, 110, 85, 267, 83, 112, -46, 75, -220, 69, 134, -92, 124, -275, 184, 39, 3, -82, -8, -233, -54, 204, -88, 45, -145, 47, 148, 523, 69, 19, -219, 136, 22, 47, -224, 36, 33, -118, -204, 282, -246, 239, 85, 92, -38, -188, 28, -59, 153, -287, -92, 59, -199, 147, -35, -40, -94, 109, -85, 189, 328, 113, 348, -165, 130, 213, -256, -292, -198, 140, 13, -231, 173, -170, 8, -99, 56, 115, -7, -220, 94, -103, -25, -202, 429, -41, -19, 86, 46, 307, -55, -72, 145, -58, 195, -33, -132, 135, 126, 171, -151, -50, -119, -212, 437]
5150D37m3o42L99j18k0Q3k49K23j03Q1K58j42k27K14k88J94lL31l58j64m6J12
5172g1K00n4l20K85q9r1O0K53P3k78R9j52j23K35k37K87K95p18L55J19M3l49J48
5195c0n3k4l00M62K54l11j09J73Q5j21j45K78k48K08r4M0J39o6m68L67n0J8N3
5218E8k14j02K48K58l48nPK33L0k12K13j80Q8r8n2J51K08l49J50l50K36n5j02
5241a87Q8N8K10r8l27L40Q1j66j41R2K4K87m35K95p0q6o5J84ml44N91k65J11o58
5265d85L53k06K27n5O3J70k39L64m22M61o31L75l30M57J67m00L6qL46l15L14l43
5287a01M00j26m1N9k91J4J5J13o2k01K58J76l46N1P2K40n30L31M31m95J9k15K25
5310dN2j16K49k05n4J34L1j91J28K21k33k48N54p3k47r3J3L64j94q4j78J20P1
$$ y = [437, 394, -248, 151, 33, 13, 96, -153, 70, -33, 48, 306, 164, -63, 151, -137, 57, 54, 385, 27, -137, -183, -71, 129, 75, -245, 40, -49, -140, -80, 173, 246, -32, 67, -85, -208, 27, -210, 77, 372, -346, 9, 128, 171, -178, -30, -83, -107, -407, 55, 309, -2, -111, 62, 147, 26, -119, 159, -89, 119, 25, 65, 204, 138, -330, 37, -13, 5, 58, -156, -258, -10, 248, -100, -105, -98, 135, 165, -47, 166, -14, 74, -24, -76, 75, 283, -66, 84, -266, -30, -85, -187, -99, -41, 169, 71, -256, 84, 165, -1, -142, -50, -26, 261, -174, 121, 51, -35, -100, 84, 80, -264, 327, 62, 173, -485, -132, -338, -111, -166, -103, 67, -172, 192, -230, 231, -400, -25, -355, 102, 269, -131, -95, -103, 243, -72, 242, -101, 299, 173, 132, 191, -100, -86, -71, 42, -20, -221, 37, 213, -133, -82, -10, 230, -300, 31, 462, -33, -14, -229, -4, 48, -68, 181, -24, -78, 56, 87, -104, 24, 245, 12, -236, 318, 245, -2, -95, -82, 282, 88, 4, -174, -54, 17]
5333A7j6L3j99J39K09r1O8j70k39L60l11K78j53j98L34K1L02n23J55J06k74p9
5355b31J7j5O6K17J21k82k91M66l54L47j03k33M24j90K76m34j37L93P5J12r7j47
5377@k00Q0L32m45K84NL86k12k34J82q5o6RJ57q2N0qj8K8q2k0N0k57j11R2M64
5403B99j17k80L36k77k38K67L1p4%j5J0J69Oj11l44L27L84k18k51J40k47J76K41
5426B14o6j06j71Q2mj76L04r5m8j44N07m07J80j47J25K19j13n4l54L46o3N0n9
5449B0K08j95n13P37j74k71J91K7K88o79J35K70N1r7R4Kj81J31J09j73n8q3rJ
5473a69J30O0M5j7m1J03k45J45j8K83j84J0k19J95O0m48R6K80J56k07k15N29p15
5496c86N02j06k04O01o23K77n0j74M25k39n0K5M8l9k00K65J28m33J68O1J54j67
$$ y = [17, 1, 34, -165, -26, 183, 92, 160, -10, -249, 111, -200, 78, -75, -273, 61, 82, 384, -139, 16, 122, -152, -231, -214, -229, -163, 54, 175, -107, -398, 68, -286, 61, -42, -275, 149, -41, 235, -199, -336, 57, 132, 244, 147, 0, -200, -120, 212, -233, 51, 56, 442, 230, -4, 178, 93, 27, 36, 193, 111, 161, 153, 135, 163, 81, 61, 111, -146, -257, -165, 299, 182, -98, 238, -39, -277, -10, 21, -53, -53, -68, -58, 111, 117, 6, -338, -11, 373, 155, -96, 44, -203, -27, 214, 148, 42, -129, -47, -51, -227, 77, -18, -66, -210, 297, -110, 70, -77, 48, 267, 154, 100, -254, 92, 29, 79, 20, 228, 33, -480, 257, 83, -188, 3, 30, 318, -361, -226, 44, 95, -2, 92, 94, -87, 44, 153, -20, -78, -161, -170, -169, -39, 21, 66, 49, 8, 111, -134, 11, -7, 276, 92, 102, -117, 78, 138, -310, -214, 66, 222, 15, -200, 329, -386, 116, 10, -194, 407, -216, 61, 11, -163, 262, 23, -27, -2, 46, 7, -193, 72, 200, -233, -65, -4, 150, -17]
5518a7qM4J34j02l00J70j15N50l13j53J59k31K49l35J10K01K2m1j5N5n7L2j01
5541f2q2J74l78M17k10K27j04N4j85J76R4j58O9r9K13jk03q5j10L27O5j97J84
5564A26k74K43k15j06M7P5K59j49Q0j10j80K44M5J10j64j11L6J69j43J0K2J00
5586A14q9j30K2j83K16j33R3K63o8J56l94QQ6j48J64k2j2j72J33J19p4J01R0j99
5610e9R4j13j79J87L24j52j34J65J94n08N15j54k45K9k27L51K2M9k31J97l48J41
5632h2K47m09J98j80M69K5n6k20j84L51k09k82M98m8l71N79m92m8N74n91K45K6
5654D0l77L35j2j18Mj22K49P3J3R2j6J61k36J34k18j75L83j01n4J22l13J32j29
5677a33K65m76M61j46k00J09k5J09R4M8j84K00j47L48n18J51k92K17pJ88j4j08
$$ y = [-17, -25, 19, 153, 51, -249, -79, -194, 356, 43, -110, 49, -182, 67, -268, -158, 43, 65, 24, 9, 64, 7, 39, -62, -144, 30, -348, 69, -141, 86, -18, 36, -149, 27, 121, -37, 32, -67, 146, 145, -58, -143, -253, 74, 139, -58, 126, -148, 95, -120, -226, -179, -104, 155, 6, 86, -24, -204, 40, 85, 195, 31, -80, -44, 125, -18, -8, 14, 114, 25, -105, -83, -266, -50, -183, -90, 173, 105, 261, -133, -125, -39, -187, -23, -45, -57, -229, -96, 23, -51, 50, 140, -59, 35, -78, -257, -70, 254, 102, -32, 133, 327, -181, 334, 180, -65, -36, -263, 88, 110, 159, -72, 125, -223, -82, 165, -244, -46, -226, 243, 268, 212, -8, -192, 159, -50, -332, 166, 118, -253, 326, -166, -214, 360, -231, 14, 40, -337, -2, -14, -132, -128, -250, -1, 72, 85, 177, 161, 322, 86, 220, 2, -173, 210, 109, 55, 177, -136, -4, -133, 132, -344, 117, -29, -229, -120, -145, -36, 58, 106, -78, 122, -25, 323, -195, -44, -336, -119, -126, 62, 48, -60]
5699f0J50j59L71m55J23j30J51Op4j30M78n25L29Q6k38k5J95j01L16k90J03J6
5721A37k22J50L5l68K70L60l80j4pJ6J45k03K88l95L31m31K12j0R4J16l70J58
5743h8OK08k66K55rM0k52NJ55o4J39o2N0k40J63j56J83j27N9M91m78J28q0k9R1
5768A22j52J27K00j27l01R9K3LJ20j36m3J85P0M8k27J60r5rK4j94Q5j07j1L4j42
5793b44o1o7L04p4K0J14j08L55rk29l38P8P9n1L13p2k09n7K41K18k37Q9o9l5R5
5818D6j96K18m61K5L86j4J81m08L89k03Q2q8K01k01q0j06L22l75K64P4J23k92
5840a13J60l4j07P0k5K40k3o3j48P3j92P1lJ88Qj22r8j92J14M14l56K63j13l62
5864c50L3J54J31O1J35q7j57J03k51J95K88n13K1L45p3j64j07l3Q1M50j78kK9
$$ y = [-60, 90, -69, 302, -153, -30, -160, -9, -3, -77, -207, 271, -254, 75, 161, -77, -102, 93, -8, 308, 18, 121, 137, -85, 65, 100, -268, 2, 362, -18, -32, -39, -23, 122, -81, 207, -188, 143, -288, -76, -86, 8, 124, -246, -88, -82, 126, -140, 115, 106, 146, -106, -101, 54, -10, 129, 67, 117, -123, 40, -116, 67, -60, -1, 490, 12, 140, 60, 31, 122, -30, 97, 297, 170, -131, -32, -9, -6, 114, -22, -65, 120, 190, 238, 11, 171, 76, 67, 91, -103, -18, -125, -136, -102, -244, -305, -372, -68, -142, -122, -8, -116, 239, 230, 1, -337, -259, -180, -231, 82, 10, -199, -256, -15, 203, -34, 55, -14, -49, 46, -150, 68, -393, -368, 18, 4, 185, -223, 166, -37, 45, -43, 158, -43, -123, -229, 93, -282, -18, 56, 179, -113, 47, 13, -94, -24, -49, 191, 168, 105, -43, 30, -162, -91, -94, 94, 102, -20, -118, -310, -196, 218, -138, 125, 12, -350, -317, -163, -32, 29, 164, 77, -80, 23, -228, -33, 255, -258, -237, 108, 35, -129, -236, -269, -188, 262, 84, 82, 111]
5887A11J15k34p6K6L04j70J07L08m68L69n29L45j47J09L9j09j60k18M20l45P5
5908a28J96Ll99K54k1Q0j13K58k16J46l13n4K22J21Rj16Q4N2k09J11R2K03j46
5931A16p9K33l17J28l77M94k75J67j96K54J07m7J46k1l60J03J82n93L91j92K07
5952G1J10m79L22j04J79k7J02q0k74J77j85K25l62J40K62O7k36K94k14J63k09
5973e8P3k56K94J66l16Q5M6Q4j01qO1K5j0k56K47k79J11J32l03L06j82K00j39
5996g8K9O1j98J18l04N30j20Onj33K43r4j5k14K11K18j74j10K17P0m33L1K78j81
6020d7J84n7J17l5m38J93J05J01k75j94K92K53n5j14K11q1r2j34K99p1J9k48J64
6043I7j58M31k55l47K69L9k6R8l58J68R3l99L78j75K09r8PJ77l05K90P8k76M8
$$ y = [111, 226, -8, -84, -58, 246, 76, 183, 491, 23, 392, -137, 208, 61, 170, 209, 100, -60, -278, 142, -203, -128, 68, 71, -328, -74, -95, -15, -128, 130, -86, 60, -253, -307, -85, 36, 45, -71, 13, 65, -144, -33, 59, 262, 116, 37, 270, -47, 81, -296, 198, -77, 90, -106, 148, 255, 208, 354, 333, -27, 76, 258, -335, 56, -136, 71, 181, -298, 24, -80, 99, 72, 174, 94, -180, -3, -188, 37, -325, -185, 77, 144, -92, 202, -12, 151, -58, 15, -241, 53, 219, -97, -12, 34, 118, 17, 9, 70, 95, 85, -171, 76, -203, -92, 40, -263, 43, -139, 61, -78, -49, 12, -186, -68, -372, 158, 38, 44, 39, -94, 149, 55, 40, -174, 37, 255, 81, -29, 188, 258, -175, -144, 134, -47, 137, 80, 197, 162, -276, -83, 22, 123, -152, -346, -54, 199, 144, 30, 241, 160, 68, -66, 233, 162, 181, -67, 97, -61, 370, 115, -232, 37, 76, 50, 148, -210, -42, 51, -348, 30, -145, 64, -34, -27, 150, -155, 135, 213, -63, -15]
6066a5J04j7n8K5j83K50q5K03k19m1N8n7J35p9k99R2K55P1j92L16l58j20J89j97
6090b22L20j69Q4Q4J5%j85K20r9J72l92k0Q8J35K40l93J2l6M03l91L42j57M5k29
6114a33p8L43k99K69l2p0M4j79L4K04o5j2m8L45l17M8R4k63J27M1j59o3q6K48
6138gJ16k77J75l3J89k50m4L25j4j91j48K55L4k5k35j3K04j98K32j31k60M32j64
6161b8J62k07J96k96J0M24k11K40k66j14J25k75K00M9r2K15J6j61j94N8Q5pq0
6184a51J02k1Q4J78m69M31l33J4L7J62j16J15K03m41LL51k6k99R6k02N06l17J14
6207B1k22J26k31M41R6m41J62m8J74J13n6J38l14J15j08M2Q7j18N5j85K89j45
6229iQ8j67J08k7N6k49N59l85K6K34k49J31K47m55K49K77l27Q2k14J78k06J71
$$ y = [-15, 89, 72, 14, 39, -144, 106, 21, 224, 5, -36, 22, -35, 100, 21, -278, -186, 69, 140, -52, 264, -94, -214, -25, -222, 98, -71, 13, 97, 112, 112, -73, 147, 48, 220, -172, -192, -104, 31, 271, -122, -110, -146, 257, -134, 208, 51, 96, -133, -211, 132, -167, 102, 70, 0, 44, -135, -101, 103, 38, 26, -22, 323, 6, 54, 148, -115, 12, 53, -106, -169, -255, -7, 109, -168, 7, -26, 163, -87, -131, 194, 180, -11, -159, 96, 130, 105, -130, -143, 61, -137, 95, -36, -296, 136, -28, 134, -73, 123, -173, -163, 261, 50, 290, 24, -90, 35, -240, -40, 9, -83, 132, 148, -13, -207, -149, -64, -71, -151, -49, -70, 14, 192, -277, 154, -179, -165, -128, 34, -82, 33, 236, -205, -202, 149, 123, -176, -80, -282, 224, -93, 21, -201, -75, -306, 135, 231, -210, -48, -96, 78, 191, 135, 273, -41, 74, -34, 8, 95, -23, 32, -153, 136, -9, 79, -88, 20, -7, 49, -200, 359, -26, 0, 234, -15, 116, 363, -92, 157, 434, 107, 189, -25, 153, -53, 118]
6251A18j75L21M1m28K57k14P4J63k85J56R5k15L42l84L35p8k26j6L06N9k1j75
6273E0J36l0j25j97M02m22L75j59k7r6J13l9L7k10K13P2q2J39j34l4k02K33O5
6296G8o4p0k55K71k54K19j85L01J04j00j28J09j47J49J65k38k2l8J18m00N22l8
6318I7k28J4J66p0l48M23k38J56K8K07q7j77K01M0M9l92jL26q4O8jk40j14K67
6342F2K0r1K6j32K82k32O4j53L13k54Q6%O0J80m19R2M51o92L80k58J64K76j59
6365F6j01k91L49m9j23l1J69k2L4k44K46j4Q6m87K70O1J04J7M29p57M3J5L54j44
6389b0j12k10O62k34J38o8l7j3j41N0j72K46r2M9j43p8J66J08k66L07r0J51l02
6412a01L75J98m45j11R9p6o0L0J67O6j18l2j22K37J7L8j90oOQ0K13j1j36J68k71
$$ y = [118, -57, 264, 305, -123, 134, -80, -6, 157, -128, 28, 123, -92, 250, -134, 201, 123, -103, -119, 187, 246, 225, 50, 186, 156, 31, -166, 236, -186, 189, 30, 3, -93, 20, -19, 18, -192, 21, 93, 11, 150, 16, -18, -220, 13, 78, 14, -56, -311, -40, -294, -75, -260, 41, 145, 45, -83, 26, -121, 28, 193, -45, -67, -105, 13, -387, 135, 97, -131, -117, 49, -21, -369, 54, -184, -28, 0, 207, 120, -57, 144, 184, 233, -159, -160, 166, 82, 150, 149, -91, -205, 62, 82, -9, 17, -115, 167, -65, -1, -154, 159, -95, -9, -9, 51, 231, -188, -96, 355, -337, 43, -215, -51, 225, 66, -35, -326, 23, -26, -149, -180, -11, -33, 1, -243, 3, -11, 75, -412, -142, -81, 23, 40, 469, -288, -245, -230, 124, -20, -132, -342, 320, 86, 224, 156, 119, 106, -35, 15, -157, 89, -3, 46, -97, -175, -9, 99, -167, 140, 50, 201, -101, 274, 472, 27, -84, 15, -61, -121, -91, 76, 142, 24, -8, -130, 107, 124, 162, -28, -34, -28, 52, 265, 254, 118, 286, 15]
6437A5O7k98K56K38j76l89M09l06L24J4k61M7P8j71K49k70K35J18n81M23J44j03
6459F2j39J2j60K96M1L31n67J10J72j73k00L2K88k96j24J49P3L0j59J18K52j36
6481A2P8j23K3J71j97j28j73L38rj50l6M40m14J05J01j19J35j34N3J31j32L7j06
6504i7k1q2J0Q0J08J16J38k11r3J5L68m40K44j28Q6j97K27j70l4J4p1J90kj74
6528a24J19k18P0K71j80kJ09K30l47j0n5O65n27K38k65J81l73K79J79r2j65P2
6550E5J4l64J23M8J33l5j97N6K18J55k71k19M48j20m2j81J92l6j68K88J27k1l04
6573a01K23O1k26K71K7j11j33K34n5l31J81l67M79m16K75n8L8k96K04J79j34m75
6595e31N93n00L49o3P5k04N30k09J39M5k50O17o95j99J20L8q5M19j68K2j38K77
$$ y = [15, 82, -216, 40, 278, 102, -287, 122, -184, 140, 154, -107, -60, 18, -153, 96, -174, 61, 179, -402, 21, 165, 62, -77, -65, -225, 71, 112, 443, -124, -14, 158, -15, -215, -183, 105, -191, -315, -166, -93, -63, -222, -104, 148, 12, 90, -33, -10, 161, -36, -164, -337, 1, -8, -158, -194, 246, -168, -63, 38, -81, 54, -80, -27, 104, -28, 9, -97, -118, -200, -190, -110, -2, 114, 252, 41, -52, -37, 331, -109, 135, 7, 93, -104, 123, -47, -81, -67, -138, 52, 50, -124, -5, -223, -153, 118, -62, -64, 45, 275, -72, -82, -137, 528, 1, 239, -26, 155, -218, 61, 240, 148, -17, 55, 69, -295, -172, -124, 9, -26, -223, -167, 51, 206, -65, -284, 164, 44, 2, -179, 13, -23, -191, 97, 224, 203, -101, 122, 183, -43, 228, 255, 144, 11, 245, 190, -141, 40, -327, 152, -264, 11, -47, -9, -305, -101, 78, -56, -531, 62, -438, -89, -152, -77, -281, 249, 40, 179, 224, -26, 591, -104, -303, -183, -145, -230, 189, 21, 43, -95, 182]
6617A82q6j71Q2Q9k4k26K06M4m18K58l9M86k72l65K81j76K22K2n4m23O58k99R0
6640F7l04K03j13J04Q2p5M2k4o3K99k06K75l04j20L75j96j13K88n02J32J31K28
6662B06k51J50j91J33j01j0J49k10K62p1j8j04L03m02Q8J9j97K69k05J16J78k47
6684a34N5pL37j75J96j38k04K35k69J07J5k01LK64k4l4pQ6k00J14l4K5J19k92
6708a63J49r2R6O3L7N8l20l0L96l16J63J31l5o2j30O5n0j95L79l00L36l87M32
6731B25l31J61j92J71K6J35j86l4j60K5O6q7k11L03Q5n2N9R7q6jr0K88l17P2l5
6756f9R2J60l51k06J18L93j70o3J59j91J95j67K69l29R0R6k90J69K85lN6j19K8
6779A52J09l08K02Km18R6J24J26oJ72L4n10L52K3k63P7J29j26J88k06p0k36L89
$$ y = [182, 96, -75, 7, 96, 72, -154, 52, 96, -322, -64, -103, 383, 111, -254, 27, -149, 73, 95, 41, -382, 276, -23, 67, -237, -34, -147, -43, 39, -36, 6, -18, -81, 218, 12, 287, -17, -137, 238, 42, -71, 217, -285, -153, -22, 206, -45, 105, -86, 47, -54, -64, 85, -125, 137, 66, 48, -56, 247, -155, -67, -48, -245, 24, -181, -65, 113, -134, -79, -86, 251, 76, 272, 134, -70, 165, -104, 3, 18, -183, -180, 84, 60, 26, 19, 105, -95, 19, -15, 10, 129, -163, -14, -106, -10, 53, 90, 148, -172, -202, 194, -122, 41, 172, 137, 75, -55, 10, -40, -235, 144, -156, 180, -207, 225, -106, 55, -137, 34, 60, 195, 9, -25, -185, -160, -94, -181, -392, -89, -4, -56, 3, 100, 14, 13, -77, 211, -106, -34, -69, 23, 183, -168, -374, -256, 137, -33, -96, 63, -128, 67, -100, 169, -160, -70, 26, -264, -95, 190, 187, 243, 124, 152, 261, -47, 155, 157, -261, -165, -41, 85, 79, 251, 285, -225, 127, 150, -113, -36, 93, -33, 155, -51, -121, -357, 32]
6802C2k23n1QQ2K14J32j98J23l6J66m08r3J29k0j0L38n51P02l63N2J1j72P5r3
6826a54K43j25K09J4p6n4J25p6N0k6o4j28Kj86K64L6M0Jl40J35K03J42q2l14N66
6851D05l55k81L22r6m0M6l7J2l00M60j75j78L38j1j29K76l59J68J3l9o0m20L26
6874a14P9K12l24J91l83M44o6M2j4k14K35n2O8j18J62Q7k78j34K09j15J37j51
6896i7J12j94K86o6j2k1j00L2L98l30k19L37j24P3J29p8l25J04j1J32L33l50k53
6919b44K95o0k1K89k33j69K57n3l9k35K3K50J8o8j41K64k69o6k7K55j29n3J81
6942B5n5J63Pk11j95J89Q5K65k48NJ11k6j91J55m2Oj24K68p9j07k74n3N08Jk05
6967b2K0Rj22K86m12J61L28j53j07j60J45M84k18j72q4q0K1J43m61L44KJ20r0
$$ y = [32, -191, -242, -234, -152, 62, 194, -4, 119, 83, 249, -159, -252, -123, -143, -153, 185, -366, 336, -27, 25, 36, -136, -61, -154, 89, -36, 173, 187, 111, 57, 182, 106, 156, 130, 66, -62, -60, -246, 18, 54, 94, 95, -245, -110, 93, 235, 153, -161, 405, 50, -231, 91, -5, -45, 1, -36, -24, -324, 136, -39, -217, 121, 110, -19, 257, -102, 66, 79, 40, -20, -440, -114, -35, 177, -147, 44, -339, 105, 39, 81, 67, -147, 88, 36, 104, -14, 148, 235, -43, -177, 32, -83, 54, -97, 15, -179, 107, 41, 29, 8, -92, -60, 338, 8, -211, 126, 2, 75, 204, 126, -199, -95, -106, 26, 359, 9, -244, 51, -9, -30, 259, 26, -143, 114, 61, 22, -213, -190, 60, 78, 10, -131, 133, -136, -202, -229, 26, -103, -156, 25, -30, 133, 140, -71, -266, -77, 8, 273, 25, 30, 141, 115, -76, 79, 37, 43, -81, 187, 108, 1, -273, -326, 182, 183, -22, -2, 7, -115, 171, -241, -80, 248, 95, -12, -172, -27, 457, 239, 67, -17, -97, -76, 67, -394, -50, -48, 72, -18]
6990a8j89L35J31n4o2r6j19R9l7o5R5R4O4m42Q9j28K53K03k42j09L52Nr5P9k23
7015h0k5J23J62q7k22r3K26k38J08J74k14K30n7K27k45q2K3K1k10J41K49k64J93
7038F0j43M39k31J65n81K00K06j89j45K20l1m9O7r9k58M69ol9j82J77j72oJ8J51
7062D1O3l25O3j14N18j90p1L3JJ59j07J8M5o7Oqk33L56R9k55M4l31M3j43L69J38
7088A52Pl68Q6J40m4j7J15j96J73Q9m1l79M14j53k0K39m01K00Q6j23j3J48l0J16
7112A80N2j70q5r0J99j03P2L2K8j13L1K09m17L26Q6n20L30p2J29n2J2m4r5J54
7136G9J44k31L35m95L23j79J87k00J63j47j35L49j33j71j51J8L02P9o0J50l4K03
7158C96m76L35k90K73m90K00N8j1L4J07M0j45j82J98l3K8j22J20K8k12L6K50J0
$$ y = [-18, -207, 128, 259, 205, 143, 47, -72, 27, -10, -75, 20, 114, 178, -264, -175, -303, -50, 153, -89, -198, 154, 159, 64, 143, -80, -105, 18, 180, 93, -129, -222, 4, -234, -126, 48, -166, 64, 7, 234, -11, -93, -70, -49, -259, -118, 131, -133, 60, -83, 356, 125, 290, -291, -91, 115, -74, -219, 1, -30, -79, -12, -111, -369, 100, 94, 55, -127, 50, -122, -128, -110, 41, 104, -221, -158, -272, 246, 56, -15, 18, 19, 178, 71, 89, 134, 67, 73, 65, -168, 188, 287, 32, 76, -255, -212, -355, 14, 152, 159, -209, -123, 17, -27, -44, 71, -125, 48, 137, 96, -283, 131, -22, -42, 197, -204, -4, 82, -41, -54, 94, 64, 180, 232, 62, -23, -113, 86, -17, 55, 87, 115, 2, 33, 242, -175, 151, 237, -283, 47, -25, 104, 52, 64, 20, -75, 79, 223, -8, 327, -168, 155, -24, 163, -37, 126, -21, -156, 193, 60, -111, -262, -244, 58, 137, 77, 227, 193, 396, -80, 255, -35, 238, -252, -52, 6, -5, 29, 136, 176, 31, -151, 47, 14, 42, -80, 40, 68, -144, -108, 142, 152]
7181A52r3K46j54j73m4lK68l0k09K13m38K50k77M47j52j57q7J86o6k10K60K98
7203B27k76l47O59q7l44K90o5o0j6k5m27P60l60K60k64j70J64l41N11j55k73L52
7225A3l28J11K28k07N8Q8k3J5NO2Kl26O21k22q1j05j08L47N1l94K83O1l07l7O9
7250a24J27K1NP6L1j39PK7p4J50M2j82J20l33K81R6k55J02J00k6Q5j47j05j5N4
7275g6J94k98L22j16m12K31J78J14j66J46r1J32l58L89j82l79J70M27Pl30k96
7296c94J82K3j6L03l1j34k21L35n7J33J80j89Nj41l6K49l06k9J21P1j73K41j14
7319BJ69L0l7j87O9%p0K00j24J20k73r1K34J08l94K01J11n6K08n88L62r4K50k23
7343g3M63n29J27J2k22K39j10J92l18L09p6k35J97K04R5j66j21J71k18R8J27o1
$$ y = [152, 59, 305, 151, -22, -66, -69, 199, 169, -40, 173, -265, -15, -292, 155, 3, -154, -241, -55, -121, -331, -71, 227, -49, -396, 263, 176, -168, 122, 57, -3, -19, -44, -471, 289, -71, 189, -75, -245, -81, -422, 89, -66, -339, 13, -315, -204, 24, -183, -125, -37, -60, -45, -40, 22, 24, -302, 319, 97, 16, -89, -197, 150, 201, -193, 90, 151, -156, -193, -124, 3, 24, 29, 105, 136, -3, 4, 31, -43, 107, 149, -33, 87, -246, 35, 131, -124, -22, 78, 52, 137, -10, -115, -130, -76, 118, -180, 142, 26, -386, -155, 23, 137, -29, 117, 26, 158, -200, 189, 7, -372, -202, 225, 232, -98, -394, -212, -189, -205, 98, 67, -67, -288, 47, -10, 123, 303, 114, 119, -22, -58, 191, -115, -144, -23, 48, -125, 116, 2, 171, 201, 164, -23, 46, 46, -24, 176, 52, 172, -101, -192, 42, 150, -244, -43, 68, 12, 220, -368, -6, -100, 150, -73, 390, -139, -12, 0, -222, 17, -93, 99, -219, 90, 14, -221, -24, 180, 275, 109, -12, 159, -59, 39, 166, 105]
7365A05j88m5K03j65NK97l80n2M36k97M7P2j69L35j08j81J99o4L2MQ5Ll04J4P3
7390d3K28j39J50J43m91j29M36j74M4l03K93R2l26L22O1j22l0K3k16J51L0K03
7412B03l38J34j41J22J23l51L92M8k85J14o1l26M38Ok92L13l22P27m97k8K55j08
7434A26nj56J32R6j80O5r2K0P9J10j86K61l37Q7L3k77K98K99j50l39L08j66NO6
7458I7m8l59L87r3o5k7m4J14P6L83l35j66L55j79N5l52J73Q5l31K74J52k46K20
7481A26J43m55J97k75L45o8k34L51j78qJ6j22J24J40j01l1rL17k45P7q6K39m82
7504b19Q3K52J6J49l64R2n3L8K32l87R9p8K08j26o9J07p9L54j58J71k20J22l22
7527a52L68j2m20J11oN37n50k4J02k60K79k4l14L65k81M01l68Q6M8K46r5r8k2
$$ y = [105, -83, -128, 75, -90, -85, 212, -168, -220, 216, -81, -34, 38, -131, 204, 96, -85, 114, 50, 82, 86, 171, 174, -130, -116, -43, 185, 46, 196, 339, -152, -281, 155, -19, 25, -278, 15, 107, -219, 103, 164, 42, 12, 35, -181, -30, 0, 203, -135, -1, -142, -20, 103, -248, 144, 192, -93, 21, -40, -366, 72, 78, -214, 99, -223, 504, 7, -21, 234, 126, 121, -35, 97, 193, 13, 78, -14, 6, 85, 195, 9, 270, -67, 20, 53, -224, 74, 373, 223, -116, 192, 26, 31, 97, 49, -310, 77, -16, -81, -108, -152, -38, 38, 421, 86, -80, 275, 96, 151, -201, -28, 57, -274, 0, 152, -94, 126, 269, -186, 11, -264, 81, 13, -221, 130, -48, -56, -40, -162, -38, 102, 1, -30, -39, 278, 33, 110, 24, 263, -219, -136, 116, 132, 281, -83, 9, -44, -6, 226, -161, -62, -140, 68, -58, -127, -20, -99, 255, 97, 268, 48, 170, -152, 216, 204, -216, -105, -111, 426, -124, -148, -46, -306, -27, -51, -365, 0, -281, 120, -248, -162, -114, 132, 37, -61, -83]
7550h3J26J03l48q8M55j98N8J7p8j74K8K18K9K26l46J36j73K78m14L3R7j50L29
7573H1l8K33j67o8k3K25n45K44J30j01%J05k70J32J53Q8l16J50J89m93K68J40
7595A17k0j93OO8J76K7j42j85K6K87m90K07o2L0K05j03J91p7J7j88L6M5L9m62
7619d45L31J1K06l61L46J36l08N1J79J08j0j67j4K49k57m0k20L73%J58l35J94
7641A85j28L2Q6n5j37k7j7J54l32N28o30K76L7j84M58l18K38l08Q9j82K72m9R3
7664H1km12O39m81J89K43n18J24K62Q5m10J94k06J21L7K08k57J50k24k05L82N7
7686E7l25J93L69l50l8J44k19K92j22j70J10j82K60J58K0r9o8j09mK39n59J46
7708b57J99J68j79K21j2k88j4J67K21J2k21pM2M9r6O8l58K70k24J62m6K81k39
$$ y = [-83, 43, 146, -202, -290, 165, -33, 25, 42, -36, -210, -182, 36, 65, 291, -55, 81, -92, 186, -228, -195, -98, -248, 81, 43, 276, 109, 41, 18, 243, -302, -58, 72, -29, -29, 76, -194, -62, 91, 179, -137, 13, 202, -291, -23, 117, 97, -96, -90, -22, 154, 181, 39, -146, -120, 167, -323, -116, -178, -148, 57, -46, 145, 68, 85, -103, -67, -22, 17, -445, -114, -103, 103, -258, 88, 224, -84, -33, 146, 254, 244, 77, 63, 312, 55, 15, -205, 168, 168, 326, -9, 185, 57, 89, 175, 120, -17, -44, -61, 93, -239, 289, -341, -65, -28, -212, 246, -72, 166, -142, -53, -235, 37, -12, 81, 79, -333, 306, -175, 14, 257, -261, -137, 125, 210, -200, -6, -212, -91, -54, 154, -103, 47, -177, -382, 0, 57, -268, -75, 294, -56, -94, 50, -169, 123, 1, -169, -59, -241, 19, 177, 197, 98, 30, -79, -83, 156, -403, -257, -58, 110, -69, 152, 140, -148, -162, 5, 226, 238, 17, 10, 52, 101, 5, 73, -285, -15, -239, -77, -123, 158, -81]
7731h1j95K87R0j66M8j29J06j26q9K88l59K48j84J53L7M58n26K96K18m58M6J28
7753I0l21K36p2J83l73N21m5j72j50K08l48J15J82k11J12j9k70M42j84J54p3J7
7775B2Q8l9J95l81R7n3R7Q5j38N4j65j81N39j01k54J70J61j60j39J80N1Pr8J53
7799A90Q9l33L07k66Q9k32L09J44j11k31j7M41l12J80r7J73o26K76J84K9k24k
7821d0k3K0j17J57j09P6O8J74k58k09L89R5k04k59K70q8L78j64k07r5J86N0p0
7844B0R2o0j40RQ5j45J61j49K10k64Q9pL64l15J86j66j38J8K20Q5j87m46L44N3
7868h1J00R8k0J49l95K9O4r7K87k43k45J24qK59p5k55R6K40l45J45n4K97k35K37
7892G2l74N65m22M01j56k9r1j72J05l8J75k44L38P0Pk73J36k61K37K82l59J41
$$ y = [-81, -276, 11, 101, -65, -17, -146, -40, -166, -255, 33, -326, -78, -262, -109, -72, 386, -140, 156, 374, -84, -38, 90, -231, 5, -67, 116, -257, 264, 219, 47, -103, 105, -243, -128, 54, -157, -45, -64, -334, 108, -76, 78, 5, 22, 110, 71, 266, -115, -18, -71, 26, 111, -27, 27, -138, -319, 220, 119, -135, 35, 196, 36, -103, 77, 128, 135, 37, 190, 279, -54, 253, -13, 76, -156, 153, 297, 186, -45, -62, 379, 67, 247, 150, 323, -303, -27, 157, 186, -38, -40, -63, -43, -160, -3, -112, -36, 32, 206, -52, -261, 128, 223, 19, -240, 30, -58, 320, 156, -51, -146, 40, 90, 20, 112, 52, -88, -79, 6, -139, 22, -127, 83, -181, -92, -99, 265, -50, 136, -30, -168, -150, 70, 155, -32, -478, -134, -81, 19, 117, 97, 246, -149, -120, -56, -153, 134, -109, -354, -230, -238, 21, -54, -309, -213, 27, -318, -173, -227, 70, -165, 72, -302, 263, -159, 242, 86, 57, -34, -206, -101, -139, 36, -208, 130, 200, 207, -66, 70, -191, 46, 328, -31, 110]
7914A10r1o6j98o0R7K24k22M52m20LK74j46M6m56P28k21J3j75J9K49l7j37J23
7937A09k02L99m52J46K6L3k32l14J81L80j20Q9J26J51l95K82l01j08K27j30j0
7958a15L53k95j6J92k47K47q0K6j08K25n53O0M29k36Q8J7L43n03J77J23l43O2
7980a54K04Q3R7j15O2m0j41j36K99j77J59j96K93l81J81j8n0P8Q1l0J7j58L35
8003B93k43p4J76k40L11l37R0m0R0J19m36L42J38k30j49J46j65J58ml8j3K82p2
8026A04l57L53l10K23J94k57q2K3J64L71m81R6M0p2l32K07L3l4L51m30J10R7J4
8049B5L9Q8j27j20M0K05j77K0Q8J7Q4j48J36j43k33J97k20K03J39j01j02K24j09
8072B5Rj60J91l82Q6M12ol31J37K09n03M53k07Q6k14L54n0O4k89M28o22K98pk16
$$ y = [110, 19, -47, -245, -305, -208, 16, -206, 246, -174, -171, 103, -43, 3, -453, 275, 54, 67, -108, -89, 160, 123, -14, 109, -93, 306, -146, 0, 26, 59, -173, -487, -306, 74, -46, 43, 169, 320, -75, 207, -94, -202, 25, -105, -115, 238, -57, -73, 119, -128, 119, 39, 65, -43, 182, -371, -311, 118, -118, -30, -13, 330, -173, 4, 127, -216, -154, 50, 133, 230, 115, 177, 137, -4, -140, 159, -18, 141, -55, 238, -143, 38, 20, -30, 48, 129, 99, 116, -42, 293, 50, -24, 152, -88, 223, -114, -24, -64, 26, 145, -291, 51, 189, -41, -190, -44, -209, -51, -55, -93, -106, 176, 104, -253, 100, -210, 13, 207, -50, -132, -109, 55, 426, -55, 41, 81, 9, -323, -116, -83, -117, 234, -196, -86, 11, 25, 64, 152, 25, -95, -55, 150, -27, -7, 81, 98, 182, 34, 170, 27, -206, -9, -229, -26, 113, 12, -90, 134, 25, 34, -126, 65, -317, -231, 181, 175, -156, -19, 190, -313, 140, -67, 19, -195, 159, 109, 173, -116, 312, -310, -12, -19, -235]
8096b35K08Q2k8p9q4M7Q0K26J18n82K10J46k48J03J45k43K55o1k09m5L53j82n
8119b8Q3L62m78R6o8J75l2k34K95k10J40j18j20J67j15J28q9J35K04l58K02j10
8141B7K83k79K96l48r1K18m22M44l46L74k69J52q8j63L11r1J35J20j58p0m9K36
8163B22l15j24L67k51R6n3Nj60J88L26l65L31n07R8Q4R1l74L66O2j90l0N04j25
8186B46p2k11J19K2k20
$$ y = [-235, -27, 55, 27, -52, -136, -89, -9, 217, 335, -247, -37, 109, -139, -36, 109, -134, 121, 60, -149, -194, 159, -23, -28, 55, 417, -61, 35, -33, 142, 110, -124, 171, -39, 101, -17, -137, 30, -85, 43, -46, 89, 293, -65, 137, 27, 310, 31, 327, -21, -112, 106, -316, 128, -218, 156, -113, 39, -49, -212, 99, 8, 143, 263, 105, 35, -14, 222, -93, -217, 150, -101, -5, -58, -53, -213, -25, 301, -64, 267, -240, -142, -58, 33, -341, 25, 87, -103, -133, 371, 246, 174, -37, 82, 104, -116]
8191a16
$$ Imaginary data points
##PAGE= N=2
##DATA TABLE= (X++(I..I)), XYDATA
0@%%%%%%%Qj6J6j6K4l2L2m0N0n8P2q8J04j20J38j62J90k19K51k87L26l70M20m72
31b49N29n96O69p47Q33r28J031j145J272j410J561j727J911k116K345k606K899
48A526l231L618m068M603n252O058p093Q472j0417J3397j8595L0299j05511J0162
62g6032J37175m2330J5597L8463K4733l0380k932L610k2145p3532m3931J344K5040
75d5320J7219J3743k3792l2820K1584P1311K4051j2591J4172K5307k1369l3894
87A7601J0336K5765m3958q8051l0014M2020L0988j802J2289L5882J8416k733J5942
100D2681K7303l381l2474l4066k3891n706J4997Q569k4216l0460J2229L8305R206
113i04n741K5276K8321j7952k5811K8133L6329k8971n6315j4820P656q596q986
$$ y = [0, 0, 0, 0, 0, 0, 0, 0, 8, -8, 8, -8, 16, -16, 16, -24, 26, -32, 40, -48, 56, -64, 74, -88, 102, -117, 134, -153, 173, -197, 223, -249, 280, -316, 353, -394, 439, -489, 542, -603, 669, -741, 820, -907, 1004, -1112, 1233, -1373, 1526, -1705, 1913, -2155, 2448, -2804, 3254, -3839, 4633, -5784, 7613, -10982, 19317, -86194, -76032, 61143, 18813, 34410, 72873, 97606, 67226, 64294, 67904, 45759, -27773, -71704, -70360, -45320, -28101, -14358, -38150, -70970, -49386, 21925, 45976, 33385, 47557, 72864, 51495, 17601, 27937, 53702, 9744, -78307, -108321, -66301, -35313, -37115, -24826, 11056, 29472, 26739, 42681, 69984, 66603, 34129, 63, -23828, -29534, -14537, -5968, -30184, -60644, -48415, -10110, -904, -6645, 18631, 46952, 29000, 3189, 31322, 67651, 38680, -17635, -32455, -24799, -33395, -42381]
126d2381J2503J3011l605M360K5532K2601P864M102j1483k8833r596J9733K263
139A6071l3229k2628J2352R142j0054O132K9555J1035j9459o104K8335K3506j1179
152C3475k1356r530n169p608l733P23m014p752J47Q208J2045J7737J3938o546
166B0565j5867Q13J7988K546k2180j5001L824n111j5093N235K1900K601j8899
179a6679q85K3691J6274j685l655k350p717o457J964L93q942p726k040n399k01
194b1414J8503J7617p841j3271Q657J7724j225j0127N40j26j4843j2058P047J1608
208G91m813j0850q02Q084Q242Q255M267k571m477j34R57j551j488o22p729j2967
224a7408j841J3656R220n527p478O903R941l74m37O651J378j2175r701L623O632
$$ y = [-42381, -29878, -16867, -20472, -16112, 9420, 32021, 39885, 43987, 32504, 3671, -5925, 13808, 16071, -17158, -39786, -27434, -18292, -28346, -22214, 7341, 18376, -1083, -7187, 21148, 44654, 33475, 12119, 2589, -2580, -10188, -13921, -13198, -17212, -24964, -24817, -16609, -4564, 13173, 27111, 20565, 4698, 5511, 23499, 26045, 3865, -11136, -7312, -12423, -27516, -22281, -381, 2220, -16679, -17564, 6127, 22401, 20716, 17061, 14711, 6994, 537, 2501, 2894, -6048, -13774, -15814, -21213, -21414, -2911, 14706, 6865, -6406, 2251, 19975, 18750, 8623, 9163, 9037, -5806, -17864, -10817, 791, -4022, -14872, -15674, -7590, 652, 8907, 13174, 10603, 6126, 5992, 6949, 5398, 3910, 3288, -4441, -17408, -19249, -5593, 3627, -1900, -9378, -2475, 7466, 7092, 6655, 13306, 14684, 2509, -7192, -3569, 3063]
239C063l432p297l619n6K799P536O440q82k157K541J545k152J899N019o090j4903
255i746k662R495L288o683k186N958J831k472M827Q978N23p567l269J257J414
270B986j24k441n419m837J848M905J338m38K685K500j928j173O194M950m950q729
286b633j212M329m87m303o14J824j217j909L898O675J435k792j815Q65J233J783
302E060p19m424m604j0K001o59p64L048J894l802m11O924N330l478n584M15K475
319B692k230j494P72o27l929j285L044K849J742N32j081j564J969L558O10m236
335A322k182j01n50j881J082K692j333l817Q9N443L602j269k012M83n9j99O4K65
353A639n63k908k197L50J729J825P38j260j252J319L533J189j770j163O82k241
$$ y = [3063, -369, -7666, -11285, -11341, -8542, -1006, 5434, 4552, 2395, 4936, 6481, 4329, 6228, 11247, 5157, -9746, -12408, -2913, 375, -6308, -8494, -2536, -705, -3177, 1650, 10628, 11151, 3584, 315, 1572, 2986, 2862, 421, -4998, -9835, -7987, -3082, -1744, -2182, 503, 3003, 1075, -98, 6096, 11046, 6096, -2633, -3845, 484, -3, -4306, -4920, -3096, -4313, -6222, -2324, 4351, 5786, 2994, 1179, 2044, 3277, 5060, 4341, -83, -4687, -4697, -2696, -3355, -4119, -1071, 823, -2979, -3390, 3534, 8864, 5386, -198, 217, 2692, 462, -1032, -260, -887, -4816, -6101, -3057, -208, 1534, 2066, 985, -579, 1390, 4948, 5558, 1322, -860, -961, -1511, -3392, -2310, 382, -951, -4768, -4679, 764, 4366, 3097, 1085, 1568, 1509, 1310, 1374, 1639, 1076, -1832, -4029, -3679, -1950, -125, 613, -647, -1899, -580, 2953, 4142, 2372, 1209, 1891, -350]
369c50j739J053K404j699l869l61L499J952n21O41M70m38q31J268J110l80j687
386E22j629j820M96K027J267j913j930J729K207M68m69J333K20k122j495J579
402D70J444j559k312o35P59M15J022M86J36o0o9N53J065J45l34j179j658jJ221
421i1N11j726j083R20R07q5P12J586K76j385j395J405J301n60j537o27j64l19
439a354R25K96k24j18K33J52M09J030Q00j041j579J11J148j86r78r68Q18o30m78
458a634J234Q50M27q45j97P25O22P8l27j098m41J80J78m61K61P6j37m93O32J381
478A011L77p76q67N70P00m88j94n89j96l59m14N54J100k89m16k85M78M52L87N17
498A273n52p02k14j6K15j43J08n39n62L2J348Q42o20n33L70J95N1k71M37l60j002
$$ y = [-350, -2089, -1036, 1368, -331, -4200, -4561, -1062, 890, 369, 1010, 1480, 1042, 211, 1479, 2589, 2209, 522, -1107, -2927, -2431, -404, 863, -1050, -2980, -1251, 956, 1424, 955, 2288, 2508, 386, -1109, 470, 1914, 355, -1957, -2592, -1833, -1418, -396, 90, 226, 166, 97, 650, 1715, 1860, 1526, 347, -1311, -1312, -91, 420, -1306, -2389, -1469, -562, -647, 65, 1651, 1927, 542, -853, 552, 1853, 1293, -244, -871, -1035, -1354, -429, -133, -357, -475, -242, -90, 319, 1349, 2149, 1108, -471, -360, 788, 602, -376, -1344, -526, -1156, -1634, -400, 450, 877, 32, -165, 560, 1182, 1260, 933, -165, -606, -426, -248, -709, -448, -372, -509, -1002, -370, 1011, 1388, 612, -255, 315, 1015, 527, 333, -256, -452, -811, -1225, -671, 429, 140, -276, -561, -83, 369, 756, 1273, 721, 19, -195, -211, 4, -139, -31, -570, -1132, -1100, 248, 1090, 470, -63, 307, 502, 553, 282, 719, 359, -643]
519f43l05L71O42j86k62j77J38K30N11J59k55j55K84m29O6O46m02m09p33J07J016
540B14k0k25j03J70J21m8N53J85q1o76n45p6K83M73p96K75n0k2N4L85K52q3K14
563D54m81J98K98N39p11q83k19M94j34K12O4K7k07K61L53J30K85n35m4l93J85
584a07M41l26l94j5nP2L10K06J26l38k55K96L64J13p1p68K30P7O9k09r5j14J83
607b10N0K94j03M56j81l80P4k4L64j97k48k85L4L51k56L29k52J33m7M8K89O2K17
630E18o70j4L3o3J15J40j77j85L09oj14K46q5k25J62M01q6J83j67j55n09M4K3
653b82N38k27l52J83J9M2L06k22P9j26o2K01J46l11K41n0k34k50K44J91R4m22
675b54J76O2J44J6J58j30l38R1J98M6J41j51Jk80k40L86K5K24p4p3J8r2l0j66
$$ y = [-643, -948, -577, 65, -121, -383, -560, -422, -192, 319, 478, 223, 68, 352, -77, -11, 635, 233, -176, -909, -802, 214, 194, -31, -134, 36, 157, 109, 662, 847, 766, 90, -455, -531, -248, 225, -571, -296, -346, -368, -314, 71, 323, 240, 454, -27, 171, 469, 1008, 297, -586, -805, -311, -445, -233, -169, -142, -349, -88, 265, 395, 680, 145, 101, -292, -107, 334, 8, -386, -401, -406, -334, -24, 182, 308, -30, -285, 11, 375, 488, 417, -351, -121, -44, 25, -184, -279, -393, -210, -160, 134, 31, 487, 306, -74, 0, -24, 340, 143, -105, -390, -356, -5, -261, 68, -184, -51, -98, -50, 239, 301, 518, -152, -166, -133, -196, -81, 59, -118, -303, 6, 0, -114, 132, 47, -178, -16, 385, 299, 482, 315, 160, -349, -305, -282, 256, 29, -323, -140, -121, -79, 227, 5, 84, -42, -104, 97, 243, -68, 173, 123, -111, -361, -117, 74, 168, -254, -78, -16, 128, 144, 302, 172, -166, -75, 123, 169, 310, 159, 160, -120, -360, 26, 51, 275, 201, 128, 146, 54, 24, -142]
699a42L21l24j20J55k1k4K57j58l14L89R5q0L64n12J94L3p7j35M97m62n5K82k46
722h3j8O0RL7k8ML8l90N8L22p8OJ98l9l58L01j78J94o5q1K34k68k2J59j80K26
748E8k10J08j61P1J45Lj70K6J23l3J2k60N58k92P3J3J25k59J00n6m5k31M03j26
772b5q8K01R6j79j47K22J33k34J4L3mP6j78L22m46L22j07J09J99k53l2n8rj74
796b07Q6N09o36L11p4k3Q8P0P5r4j53P5j41L04O9l3q9P7j16J38n55K47O6Rj34
821a31j42M48n26L27M4N4J87j74J20o48N09j64J4J16L6R4j84J07j02L1j95K98
843A19J44m20j02K80o3J3j75K94k44J66j32l9Q0j38J35J58K87m71K22q8J28o8
865H6K45n21J81J06m5k49K02J16k38J76k81K19j71K06JK4q1M4m21N89k57K18l94
$$ y = [-142, 179, -145, -265, -110, -131, -155, 102, -56, -370, 19, 114, 34, 398, -114, 80, 113, 36, -99, 398, -64, -119, 163, -83, -101, -41, -32, 5, -23, -19, 19, -371, -313, 9, -69, -63, 135, 96, -262, 39, -139, 55, -10, -91, 143, -125, -147, 12, -168, 58, -152, -44, -205, -134, 11, 14, -156, -130, -7, -40, -28, -288, 270, -22, 51, 64, 189, -70, 30, -26, -71, -302, 101, -25, -113, 88, 184, 5, -142, 80, 213, -21, -7, 26, 22, 98, -80, 242, -204, 118, 11, 120, 319, 66, 34, -24, -33, -207, -121, 388, -248, 63, -11, -34, 54, 124, 199, 105, -48, 27, -114, 190, 259, 226, 137, 214, 98, 236, -319, -72, -6, 3, -131, -273, 175, -351, -24, 20, 74, 261, 87, 207, -441, 68, -96, -82, 34, 70, 164, -20, 87, -15, 16, -179, 119, 263, -157, -259, 21, -42, -29, -204, 90, -154, 12, -120, -159, -79, -217, -82, 76, 363, -108, 114, 26, 154, 86, 331, -190, -9, 97, 52, -197, 5, 121, -117, 59, -222, -3, -174, 32, 33, 57, -24, 20, -401, 188, -69, 149, -245]
888b45K78J13L12m62M51l81kJ23j36J28j61k05J51P9j77J56J84m05M8L04j68%
910a5K60m63L32o1r0J4J90k63L5J16j95J24Q0q2J15j87j7m9J19J01R7o4j97K99
934A99j48k21L58j11m3J0J4j16mj3L4J77k30J84p1k03L1K30p3l7r3lM0K32j85
959d2J36q5k60N15k44K41j84j43L33j58O8j22P8j74J46q0l51K18K20O5j80j36
981a39MJ01m1o8J64Q1M5r3L6k50k7L92j58J15j22J6J52O5k46J9k5k30K25j46n6
1006a86K26N1Q3l99m6K77N2J33k35j64OK29K56r7Q2j36K8m8r9PQ8k90J29K52l04
1031a05j5n4J78m7m2J78j46j70L18l3k47K19J31Q2k31Lj7J01j05O0k08M99m92
1054a43R8Q5J21l49J56n3k40R4J44M7n9k31J42K96n9l5o8K55j47m4P8j33K7K63
$$ y = [-245, 33, 146, 458, -4, 447, 66, 64, 187, 51, 179, 18, -187, -36, 43, -134, 22, 206, -199, -151, 153, -15, -15, 245, -218, 114, 53, -37, -23, 167, -96, -61, 55, -140, -16, 64, -18, 97, -90, -107, -156, -37, 64, 161, 97, -100, 199, 51, -170, 188, 77, 34, 44, 58, -58, -62, -75, -41, 136, -94, 90, 19, -184, -153, 77, 4, -33, -126, -129, -89, 143, -42, 94, 9, -251, 264, 20, 261, 77, -66, 267, 109, 177, 55, 133, -41, 105, 25, -326, -108, 112, 177, -3, -139, -135, -34, -75, -143, 21, 102, 147, 54, 90, -160, -187, 205, 47, 162, 40, 56, 208, 273, 27, 46, 21, -209, 16, -130, -186, 40, 91, 174, -225, -271, 6, 58, 191, -44, -208, -202, 27, 283, 186, 268, 132, 160, 112, 13, 20, 108, -182, -53, 199, -105, -120, -174, 4, -43, -85, 93, -53, -223, 95, 62, -185, 34, 165, 247, 16, 19, 2, 103, -2, 58, -150, 349, -143, -45, 40, 161, -188, -32, -85, -325, -231, -87, -40, -99, -330, -188, 108, 49, 14, -54, 201, 54, 10, 88, -45, -18, 245]
1078B45l13J72Lk63K11k51L57J48l86Q3Qm1N3j28p9J03n1k36L7L46R2j52jJ38
1102I5n2O1P1j81j6l2kj41L50j88j43M24n07M69p8j52J15J75l06q2K26k28J59
1125C7M0J83l41K13j18L05k19m0Lk5j84L75k95J4j55M4J35R5Q6k45M97k99Q8j76
1149A8n5J58Ql68N00j84o5R7j30j12M27k65J76O8j23k72j29K66j23J34j48ro6
1172a97K6J20j4L9j79J35j4O5K29k48O7J17k85K47Q2Q8N2n27J11L28N5l77L41
1195B61R8l76J33k89K02J21k59l2l9J81j40R5J48k0k55K0K47n0J17Q1l81J16j5
1218c6o0R7JJ87k4l78L06l3Q6j80N6j04r4L66k63K21j74l61L15k9J27l90M67J58
1242B61q7k94J14m2K20l9j4O9m20J38o3K80N3j46k61K58j07N7L77j87k12j28L26
$$ y = [245, -68, 104, 107, -156, 55, -196, 161, 309, -77, 6, 14, -27, 26, -102, -181, -78, -129, -365, -328, 18, 110, -42, -43, 95, 43, 104, 175, -6, -22, -54, -56, -197, 153, -35, -178, 246, -261, 208, 130, -22, 93, 268, -38, -120, 106, -122, 37, 77, 260, -81, 132, 14, 319, 100, 60, 63, 38, -146, 229, -66, -52, -207, -163, -28, 67, 153, -92, 405, 106, 194, 18, -37, 121, 129, -239, 261, 77, 12, 109, -21, -133, 294, 29, 205, 273, 150, -122, -251, 15, -108, 26, -122, -131, -197, -171, -51, -65, -26, -205, -70, -84, -19, 210, -38, 29, 146, -139, 108, 190, 278, 330, -197, -86, 242, 297, -80, 261, 359, -17, 116, -173, 29, 150, -109, -141, -180, 1, -139, -44, 104, 84, -171, -151, 96, 46, 163, 244, -137, -21, -36, -96, 1, 2, 189, 165, -213, 93, 60, 146, -34, 22, -82, -176, 190, -73, 148, -26, -387, -72, -101, 26, -364, 103, 261, 174, -120, -6, -48, 172, 133, 119, 188, -232, -94, -157, 123, 176, 30, -231, 27, -80, -23, 354, 167, -45, -173, 153]
1265A53k98L65k56K04l14q0L18j40J6L9N1j55K71k16P9lJ32j43P9l67M50Q0l22
1288e7M0J67K3k02K38l91J43j11K7J34J11j18o5L6M1N8l4k15L0P3p4J92k13J64
1312cj69K52n5N6R1k40j74Q7K16l12K55K25k94r2M62n31J61M9K17j21K85k71j90
1335i6M23l09M6k57J18L2m82L62L47j97j15J03n7L7R4P9k22J4L63m20K19q6L9
1358C5j47R4j61R1K33j38k39RK90k17L11K4p9L6J91k66Rj26L46k42n7J95m29L11
1382G4j82K20j4o2j93M13k95j4j28K91k09M07l65J02j29j54L05k7J14J63m39L15
1404A93l98k50N19j97j92K44K76k98K05p3k37L82N7p20N41k19mj6j7K41k45K87
1426G9J68l05r4K15J47l37M74k62l27K89l0J00R8l2r4J5q9K55K09l44k46K89j50
$$ y = [153, -145, 220, -36, 168, -146, -226, 92, -48, -32, 7, 58, -97, 174, -42, 37, 34, 166, 23, 102, -265, 185, 265, -57, -17, 150, 173, -29, 209, -182, -39, -150, -123, 11, 122, 4, -61, -25, 16, 74, 40, -175, -145, -72, -146, 46, -167, -3, -172, 80, 25, 81, 172, -68, -242, -155, 61, -251, 4, 229, -65, -157, 305, -226, -65, -16, 201, 80, 365, 94, -96, 327, 18, 64, -193, -75, -43, -525, -163, 184, -13, -128, -25, -82, -45, 49, 128, -94, -80, 283, -137, 82, -4, 35, -112, -18, -179, -88, 145, 7, -232, -223, 67, -150, 161, 185, 106, 142, 333, 67, 76, -50, 296, 54, -3, 192, -237, 74, -108, 112, 98, 36, -157, 256, -39, -53, -181, 110, -99, 308, -57, 45, -84, -238, 67, 40, 154, 317, -122, 193, -205, -455, 64, -133, -325, -81, 195, -103, 102, 29, -208, 174, 231, -489, 52, -167, -171, -187, -204, 37, -208, 79, 247, -58, -152, 63, 210, -127, 347, 85, -242, 47, 17, 117, 215, 183, 89, 104, 15, 270, 479, 135, -111, 178, 28]
1449B8l2J7j81J47J00J02p3k62L41Q9o06M63q4j80J99j20M3p7K9O4J83j13n9k1
1473cj4N8j6q0k8M46k35k5N8j68q4K42m11p1M05r8L11k72m9k20J89r5k7K07l9
1498a9J25l02M16j35J60m30K14L5k27N5K67m00K96J59l25L77k73n7K60j87j18
1519a09J15k73K63l2J50j32j30J85j00k4K99j58j27J69R4r4J09m29J19j7K59l8
1541I9j21L38m17l1Q8K64m77J31K18n1L2p5j07M15o9n14K83k82L38k73K57j18
1563g2JL00m32pK91l03J00P2j52J48R8J1Nj21K29k66J84L3j87j58J70J81k73J51
1587Ck12K26o2k2J10P8m1k66K24n3j65M67m69L53k86R9L67p71J66J66N15n66K17
1610G8k69K87l30J97Q5j44j28K05l10J05K39J84J04m52L65m21L63m52M78j5j26
$$ y = [28, -4, 13, -168, -21, 79, 181, 108, -154, 187, 276, -330, 133, 49, -131, 68, -52, -9, -86, -57, 7, 190, 77, 18, -3, -17, 41, 25, -55, -83, 363, 128, 103, 161, -7, -91, 151, -260, -331, 74, -24, 287, 15, -34, -254, -65, -160, -187, 20, -19, 106, -196, 220, 85, 245, -185, 29, 64, -163, -108, 159, -241, 55, 214, -111, 266, -7, -64, 196, 9, -109, 6, -267, -4, -36, 114, -18, -148, 37, -63, -87, 212, 54, -73, 96, 190, 96, 205, -224, -105, -122, 137, 99, -22, 316, -101, -132, -44, 220, -257, -126, 92, 41, 73, -2, -109, 306, 237, -277, 6, -276, 62, -211, 46, -72, -71, 229, -203, -210, 81, -222, -122, -50, -202, -54, 44, 55, 60, -61, 168, -98, 86, 119, -68, -226, -56, 125, -148, 3, -209, 17, -45, -67, 43, 121, 80, -186, 38, -15, -180, 287, -182, 171, -115, -16, 351, -420, -254, -88, 427, -139, 78, -191, 96, -234, -37, 48, -96, -224, -19, -329, -224, 15, 199, 303, -149, 216, -205, 158, -294, 184, 169, 43]
1631D3j33J02N5j9k43R8m5Q5R1m2J67n89N98l71k6L97k56r3m5M80k54J57K73l75
1655E5q3K12j11NJ94m16L69j37L8O1k29J99k10N16n51J71K2m00L70kJ61k38J06
1678A02J05M0p2j16j1J56m69N15k00M9q6J35k53J86j59k2Q8j38N2j30J60J65j59
1701f2o1J04J58r3K06n5n68L90K59j68m34M10k30J62K7k85J00K58o8j63L30k09
1723Hj55J15l14M51L0J25l98K24j66L53o5l93m2K25J18K46n62O0J95j35N1O4o3
1746b8k9J51j37J15j03K04l27L67j13Q1j52N3K91m08N0K6j76Q3L17j86O6j54k75
1769b84N25l58j01J97k6R1R7j01R9o8j68J45j9K2j52K97l10J85l11L07q8J64j75
1792c2J3rj97P1J70l3R7J53j93l8P3l33J78p1K25j5l4q4K98j55j4J94k04k0k24
$$ y = [43, -90, 12, 67, 48, -195, -97, -142, -57, 34, -8, 159, -430, 168, -203, -229, 168, -88, -181, -226, 254, 0, 157, 430, 55, -28, 184, 73, 78, 272, -144, 225, 88, 126, 187, -42, 157, -53, 463, -88, 83, 105, -295, 75, 73, 234, -4, 102, 207, 247, 175, 59, 48, 204, -265, 250, 50, 99, 13, 148, -105, 81, -78, -100, -12, -150, -98, -228, -68, 97, -62, -123, -19, 139, 46, 252, 197, -371, 19, 278, 110, -324, 86, -144, 18, 45, -240, -140, 118, 50, -113, 217, 8, -147, -32, -346, 105, 135, 260, -138, 86, -80, 273, 208, -185, -227, -2, 116, 362, -200, -140, 55, -80, -29, 35, -28, -57, 94, -43, 72, -31, 173, -154, 213, 100, 181, 29, 82, 373, -35, 15, 41, -135, -52, 265, 79, 145, -9, -284, 241, -117, -218, -21, -47, 44, 141, 40, 139, 71, -97, 48, 29, 51, -101, 196, -114, 71, -240, 67, -21, 143, -32, -19, -28, -225, -154, 16, -17, 80, 233, 40, 2, 75, -258, -80, -151, 74, 59, 25, -59, 239, 84, 70, 264, 60, 40, -184]
1817a84J7N3K38j11L9j46J65R2k27J77k81M04j75N7q4j97J62Q5l38L17j06r2J38
1840CKj47q9J10J62Q4k62L34J95k20m35K35j95L28K24n58J72K01k36M29l78PP5
1863D1Kn0j37Q1k49J87J30K19lk58r8J34j4J30o3m06K91J98j95K69J29j39k71
1886g2J06j55K12k48K25j96k07K47J98M7m21L22q3mm2L3M18m17j54J55J23l18
1908b31K49pL1j65n2J67k33L62j54J37m3j14J74j75L72j97l57J29m3J23Q3Q0l12
1931a76L08O3l46J12m4N5J75j59P6J11q3j61J97j02p6K16k23m3J37J24J30r3j8
1954A80l87Q5N3N8L3K9m7j71J01l6J56R7K26l81K36l8R3l85J04l83K74j16M73
1977B54l93j34L14J27KN0k26j23L79l12L57m91K09j98K23j65j19K65j12K74q9
$$ y = [-184, -167, -114, 124, 13, 52, -94, 71, 163, -64, 113, -168, 236, 61, 118, 34, -163, -1, 84, -254, 63, -43, -135, 3, 5, -142, -231, -121, 41, 125, -137, 197, 392, 172, -263, -28, -223, 105, 329, -229, -57, 144, -92, 337, -41, -34, 41, 43, -7, -144, -63, -312, -125, 5, 224, 221, -37, -135, -1, -15, 115, 52, -354, -63, 135, -60, 209, 338, 199, -72, 34, -121, 91, -157, 68, -128, -335, -88, 110, 157, -264, 58, -25, -29, -71, -38, 380, -37, -191, -36, 87, -231, 18, 11, 42, -123, -175, -8, -241, 121, -33, 104, 61, -53, 121, -54, 318, 121, -236, -107, -150, -27, 56, 136, -176, 132, 195, -151, -39, -83, -28, 147, -12, 64, 175, 92, -69, 128, 26, -50, 166, -57, -100, 37, 161, 291, 198, 180, -207, -122, -69, -11, 22, 51, 4, -167, -66, -102, 54, 151, 377, -4, 232, 194, 287, -98, 6, -377, -103, -219, 254, -139, -273, 41, 168, 170, 220, -6, -129, 250, -62, 295, -196, 13, -185, 38, -127, -246, 19, -93, 181, 92]
1998I2p4p6K21j80K75m27L55j53L0j24J43Jj28j28L61j97O6o8o2L4J46o9k1j64
2022a47R4J75l34M08o8j99j13M43J13l44J65j75q2J91j81J55j62K99l27J08pj69
2044a57Q0K43n9o2j71Q8Q8j89K20m5K06n02K50k51M88m02Q4K7o8J06J25k49j02
2067b52R6O2J53q9n5K37j40n5L18k73N5j47J55L2r2l27K59R5P7j85N0M8k17J88
2091gJ91krk67K52k61m1K50j72K63l84K92l25L48k58J09k0q0J98M05l83J34l95
2114a62K30N5j7k38M25l49o1J98j99P4j19L29l88J01K6L7j9L8M8j29K73k02k7
2137g6J97j14J54k62j54K89J05j56m2R6j52P0o1L28l20j61J59L21k62L67p7j67
2159H2oj78K17o9k99L93p9m4m3K74j61l09L27j95K11N6k34P0k10L53k46r7j3L99
$$ y = [92, 18, -58, 163, -17, 258, -169, 186, 33, 63, -61, 82, 83, -45, -173, 188, -9, 57, -11, -73, -39, 107, 38, 17, -147, -53, 122, -212, 196, 128, -71, -184, 259, 372, 28, 193, 18, -64, 127, -54, 101, -61, 238, -89, 19, 12, -157, -77, 166, 107, 45, -126, -38, 50, -139, 81, 36, 242, -260, -10, -261, 227, -175, -91, -64, -132, -26, 99, -150, -252, -156, -94, 59, -30, -85, 152, 12, -43, 275, 2, 57, -90, 65, 97, 5, -322, -63, 32, 109, -76, -26, 22, -195, -7, 184, 182, 173, -94, 158, -103, -144, 106, -66, 197, -187, 105, -220, 128, -130, -21, -41, -121, 77, 482, 99, 233, -162, 68, 123, 106, -132, 293, -56, -117, 81, -118, -44, -163, 166, -222, -121, -95, -58, -77, -39, 9, -120, 153, -49, -76, 121, 7, 161, -101, -255, 34, 139, -17, -59, 37, -115, -45, -106, 222, -98, -259, -100, 221, -41, 326, 249, 82, 76, -102, 115, 46, -253, 140, 61, 17, -26, 248, 87, -222, 105, -90, 121, 177, -57, 13, -197, 156, -90, -187, -200, 199]
2183A99l69n1L35K8n2l17j02K57L80l16j57k4N55n75J48nrJ21o7j16J93K54l05
2206Ek7K92K2k81m2Q4rl2J97j36q6p4L63l11J21nJ28k71l0l0J29j33m9L22k84
2231a37L19J1r6j04O0lM0m38L93R9l7m6J23L2j46K10k19j64L15n56K14L34k38
2254c4J5J2N0k38R4K50n0k68N5R2j32J60k20P2O50m45k78K41J42L4j34k64m1N9
2278a78l1K06l0k10J47K04k75L00k02R7M45n56J06J22k10o5K69j53K20j47J03
2299A62pj12K3j97j5K54k58J96L04m06jJ19l0l40J14K41l47K32L72k71K5N8k87
2322a71r0J74j05L90m18M25Qk73k1j32L38m7k85O5K28j0q7p8L04j05j43j80K39
2345B6m9o7l3P7J23k5N8J3L1k82j4J54P0J65j65j38J56j81j7J01J1K15k41k71
$$ y = [199, -170, -221, 114, 142, 90, -227, -329, -72, 308, -8, -165, -189, 366, -209, -61, -66, -75, 46, -21, -137, 56, 310, 5, -22, 270, 292, 11, -31, 53, 44, 12, 209, 73, -13, -87, 276, -35, 86, 81, 209, -62, -92, -122, 7, -126, -175, 147, -137, 182, 193, 97, -7, 53, 50, 90, -348, 45, 144, 107, 61, 184, 216, 70, 280, 61, -103, 212, -344, -130, 204, -34, -19, -7, 43, -195, -101, 149, 99, -169, -114, -22, -154, 6, -214, -142, 508, 63, -215, 26, 168, 202, 68, -196, -237, -178, -209, -3, -33, -243, -96, 108, -167, 133, -69, 28, 473, -83, 23, 145, -65, -130, 139, -14, 206, 59, 162, 155, 43, 66, -131, -146, 108, -150, 46, 350, -56, -57, 62, 32, -308, -194, 47, -300, -68, 304, 33, 58, 116, -171, -261, -87, -192, 198, -220, 205, 213, -60, -81, -213, 125, 78, -207, -142, 86, 76, -11, -89, 215, 110, -33, -213, 26, -23, -90, -123, -46, 77, 52, 110, 123, 154, -128, -142, 12, 82, 247, 82, -56, 100, -81, -98, 3, 14, 229, -12, -283]
2369b83R2L36o9K09l43r6K33k70J15J4K30q6J57l90M96l07k60J69K57n7k12J42
2391G7j13j86Q4P1K20k73J57R8k12lK17j44K0M0j10K62p2j7j01L9n5j88J43k05
2415b51J91q4J83l6Lk27P6K01J23j62j41K15m1k35L04RL8l64K56k45O6J43N1L73
2439D46k32j19K5l62K80k3K03m87L00K50k50j03L55n35K21J60j97J68k00L95O4
2460C59l1k88J26k77K60k70p9K46K08k95r9P7j27P0M6p0k71P79m15K2R9j07J3
2483b4j00J30pL65l86M4k08N09m54K52J22k14J13j39Q6o4K91k14n27J78L70k3
2505A00j24J24Nk44N1J46j23j55M29k13n1O9O2r2J62j58K3J01j07O0K02o3k10
2528fj83J81j57R9j78J43L58l49K83K01n87j48N89k29K11k81J12J19j54j9l1j19
$$ y = [-283, -191, 145, 76, 285, -58, -154, 79, -191, -76, -62, 168, 82, 239, -151, 345, 38, -222, -53, 204, 147, -65, 77, -36, -222, -138, -67, 153, -120, 37, 135, -77, -80, 137, -7, 13, 53, -57, 205, 133, 116, 15, 54, -1, -189, -46, -251, -60, -144, 39, 3, 6, -221, -145, 56, 179, 17, -124, 91, 50, -185, 119, 128, 166, -198, 58, -187, -121, 22, 73, 446, 214, 95, 120, -242, 38, 15, 218, -269, 31, 281, 31, -72, 283, -252, -31, 129, -68, 100, -100, 295, 359, 328, 40, 166, -111, 149, -121, -200, 46, 254, -41, -140, -63, -190, -120, -74, -144, -415, 364, -51, -29, 70, -37, -24, -124, 6, -1, 364, -22, 22, -186, 323, -131, 121, 243, 29, 142, 3, 89, 25, 316, 102, -425, -247, 123, 100, -24, 100, 105, -139, -88, 58, -65, -220, 209, -4, -55, 14, 76, -16, 146, -12, 11, 112, 5, 65, 267, 204, -6, -189, -8, -165, -66, -244, -101, 257, -92, 191, 392, -195, -343, 246, 17, 228, -53, 59, 178, 24, 5, -26, -145]
2550a45J97J25j86k6R5k8J6M1L1rk14J20p8J65k54J14J77m86L88j64K40J02k26
2573ej79J8QoL32J0k25N6k61L86k13J41k97L11k6rj7r2J28j57K35Nr9j77L4R1
2599hK3R1L2l52K14J58j17j59nK07J17j82k23N86j90m36J81J59k58J43N0j27K51
2622A55l9J48n86L18j49K6J30O2k57%L06j13q5J29o1j92J74k96K61J03j5J64l05
2645a22L38k54j7J72m2n6K4J94r0Q9k81L2j02R2k32K58J22o1Kk19n8L74j47K29
2669B45k37mK38j26l7k97MnJ25k72M6L55M7k91M47l58P8K60l25Q4j1Nj66P0j33
2694b58M21j25n7P7P5k94N5O3k28K52L1oL39l11k62J60J61l80M65Q1r0k03j11
2717a45J37L50q5l70r5K80j30N4j9J92l91K22p9L4P6n3r8L81j82j72K45j30k04
$$ y = [-145, 52, 177, -9, -35, 60, 32, 48, 89, 120, 111, -103, 17, -61, 104, -150, -36, 141, -345, 43, -121, 119, 221, -5, -184, -166, -158, -164, 168, 178, -47, 9, -252, 134, -79, 62, -235, 76, 50, 41, 24, -68, 60, -97, 138, 143, 44, -133, -99, -8, 15, 106, 138, -214, 0, 158, 41, -118, -123, 84, 201, 19, -204, 382, 192, -244, -63, 96, -162, -19, 31, -96, 155, 116, 264, -322, -4, -153, -127, 3, 65, -192, -192, 114, 1, -84, 45, -16, -208, -34, -330, -69, 34, 19, 183, -122, 216, -38, -55, 117, 75, 19, 43, 237, 147, 236, -45, -13, -115, -23, -255, 3, 125, 64, 66, -153, -211, 163, 16, 245, 8, 4, 242, 116, 79, -218, -214, -219, -94, -366, -320, 35, 82, -209, 238, -120, -42, 218, -107, -23, -34, -29, -195, -125, -258, 163, 38, -19, 58, 133, -161, -106, -43, -271, -19, 12, 6, 345, 34, -228, -68, 93, -287, 178, 259, 169, -34, -145, -8, 342, 257, -113, -208, 72, -58, -4, -23, 169, -222, 0, -79, -45, 31, -22, -120, 261, 79, -93, 152, 22, -182]
2740a82oJ90k19K78O7k45k77M74j24n0k60N45k64j53k3O8J64N1l25K10P9m6K93
2763B45Kl84L11r2P2j83L2J0o4q4J91M0R1l2k14r2K42j57L76m63M42p4m14L61
2787A62j15Q3j5q1Q6j91J02j86J87M0j24K38l25j4k3J11K50N4o7j36P0q3j77N2
2811a02J36N0j1j26k56M30k34R0L35k97k69K51Q1j76J93l11J8J18K21k59R4mk14
2834b42K51P8l6j2k08M8M82j14k81M3J8j15K44l51K58l54L64j95R1o8J18j08J06
2857A7K64m56J76j38q5M18rp4j12J82j2k63J93j1r3k80L02k65K5J2o6L04o9k36
2881b76J12M04k18K3o8m8J57o5l5l4J56k64J60q3K7Q5J54l0r2rj24J01j22l5o9
2906a93K28J02M9j98J46j30j18k9N0J03j16P4J35j98J66N8qk40J76q5r6L3MJ19
$$ y = [-182, -188, 2, -217, 61, 128, -117, -394, 80, -44, -94, -354, 191, -73, -226, -249, -181, -17, 34, -291, -81, -2, -48, 245, 247, -137, 174, 82, 154, -29, 3, 13, -51, -135, 56, 96, 187, 155, -59, -151, 91, -66, 310, -153, 289, 215, -199, 162, 47, 130, 115, 34, 120, -71, 31, -155, 32, 72, -52, 186, -139, -153, -176, -65, 185, 239, 172, 36, 106, 23, -154, -102, 34, 84, 73, -53, -309, 121, -113, -23, 312, 15, -254, -3, 78, -98, 95, -216, -198, -80, 141, -118, -24, -28, -242, 9, 87, 51, 39, -169, -121, 361, 247, -34, 9, 27, -88, 156, -195, 63, -291, 73, -122, -31, -99, 19, -89, 17, 281, -175, 1, -137, -222, 196, 187, 113, 1, 183, 171, -92, 101, 90, -3, -283, 19, -246, -221, -209, -275, 29, -40, -276, -164, 240, 22, 45, -23, -71, 86, 21, -14, -48, 108, -156, 4, -79, -52, 33, 187, 157, 65, 56, -68, 33, -89, -124, -193, 35, 137, 186, -12, 134, 4, -114, -143, -93, 10, -106, -32, 103, -95, 71, 129, 121, -119, 57, -28, -124, -91, -87, 32]
2930C2M5j58K65j7k27j42L39J89m71J94L14m41J88L8J95k30k6r8J80l34O8K15
2952A18l17P4J28q4J47n6N2J30K12j23l07J69k42j61L34l12K86K54j08K39n26
2973i3n9K47j41k6j17J06J14k04K50l6M7j69J99kj87pn1m3PK50L2j38K9r1J97
2998A14J29j10l22J58K67l67n7L39J64n34Q5J56k19J19q2pJ01j02J40j09L41j45
3020E9L17j03k42j12J94J42l84K98M7k96J11m9l73Q6N75l63J6p3J80j60J45O4
3042G9k53L13j46j57K22K04k03j89J03K60m65K81j2R2j32J34L4m0l52J37L3j04
3064a61J19o0L2j58J61J23k51lK18n0k08K82J24R7k03j14K19jj25P3l59K63j11
3087i3R9Q7j88j75L89k06K01J09l30l62O37j72J22km46M20n2M6k49M77n27Q2K3
$$ y = [32, 77, -81, 184, 167, -60, -202, 137, 326, -145, 49, 363, -78, 110, 148, 343, 113, 87, -11, 169, -165, -97, 118, -199, -125, 3, -81, 66, 10, 62, 192, 404, 281, -26, 143, -99, -260, 74, -238, 48, 302, 194, 433, -93, -152, 95, -46, -72, -189, -83, 31, -173, 77, 41, 88, -81, 118, 116, -71, -78, -129, -172, -165, 85, 117, -21, 8, -83, 114, 243, 133, -189, -31, 236, -131, -188, 151, 315, -219, -134, 22, -197, -78, -160, -167, -66, -168, -28, -137, 204, 59, 376, 273, 31, -81, 113, 255, -129, 169, 216, -80, 31, -18, -391, -305, 270, -93, -77, -150, 30, -130, 15, 79, -174, 139, -7, -164, 58, 262, 59, -130, -27, 233, -232, 49, 37, 129, -3, 131, 165, 125, -227, -90, -57, -161, -42, -102, -70, -228, -67, 56, -195, -198, 20, -30, -238, 44, 168, 265, 62, -52, 167, 166, 41, 114, -245, 18, -93, 6, 93, -95, -270, 119, -87, 114, 223, -107, -469, 168, -4, 118, 116, -330, 90, 38, 84, -165, 312, -215, -133, -110]
3110a10K81l0p8k38MJ59P0lm2O6l99L06j05J78k4j45L4%K89j32k83%K84k15j24
3135b57L25K1j55N9mO1l0j83L07r5J84n16J61o6j05K36P3Mk84O19l12j71K22J20
3159B14k41J15q5m20M39k99M2J40PJ86k10p2K45l14L59j82J05j12q2K05p3M13
3181C80l87l8j1K27k10j56J27R3J34n0k73L30k79k44L26M37l33k90r8K43m9P0
3203e1k4K30j23m5R2n01N09m40N11l54K88j03m6j01m9J66j69K96m3j51J81n7N
3226B1j26K34k55J3K17J19j95k67M71j2r8R6l19K24l1k99P0K98j46j76M16m77
3248b22R0L93j94J23j28L23n45L80k86j54K2J42L68l46pJ84j41j26K31r8mk19
3270b14N7N0J30o9j15J22K89m67L3J51J87J31j00k37j41L74j28m26L77N9k26O80
$$ y = [-110, 171, 141, 63, -175, -171, -12, 58, 55, 13, 79, -320, -14, -119, 59, 35, -110, -76, -76, 213, 81, -202, -202, 82, -133, -257, 68, 89, -66, -7, -11, 50, 20, -163, 144, 49, 233, -283, -122, -188, -293, -57, 16, 20, -264, 355, 43, -128, 94, 214, -27, 88, 3, -417, 22, -277, -235, -95, -88, 98, -112, -184, 61, -253, 106, -76, 29, -83, -165, 40, -33, 380, -7, -45, -56, 171, -39, -195, -68, 25, 159, 109, -164, 166, -113, -357, -31, 406, 73, -217, -315, -72, -121, -51, -75, 155, 32, -13, 79, -422, 87, -353, 158, -196, 92, -11, -57, -158, -207, -41, -210, 86, 43, -108, 73, 16, 21, -105, 129, -126, -113, 104, 223, 28, -239, 232, 220, 122, 218, -101, 123, 92, -207, -137, 161, 15, -161, 255, -222, -132, 261, 67, 190, 62, 385, -160, 220, -66, -220, -198, -56, 312, -34, -41, 143, 2, -124, 107, 9, 5, -214, -157, -107, 23, -46, -161, -39, 250, -217, -184, -33, 154, 285, 185, -52, -193, 181, 53, -373, 4, 63, -163, 517]
3292E17k76l54J25J4j35m5J36lJ39j35j32M83n10L33j65p7L49m88K85N4q7J08
3314A36ml44P6K82k10j66r6J91qK31l76J51J77K5j42N8J15j32K12J20k55N1J18
3337B10j23k49r2J98Q8R5k70M07k13J1k51K36m4k53J98j49O9J45K54j26k74K15
3359H2j54K24m43M07M2l2k97j86N73J32j64k3l9k62J54m5K1j94J56K14k3nk15
3382g7J51m35J50N24j57j57p1K87j41n3l8J30P0m56N8M73j50k33L08k99L60m8
3404A96k38J55k21L90k30k08J88j10o2M9p5l4N8O4l8j54M3K93%j19j25L6K86J13
3428B57o18L97K93l02K23n48J15L48k23MP4q8q5J08M0j45K79j26n9L19k73j15
3450a25N25n72J97m0k84J03J45M03n40P6r0M29j69N1n5j35j1OJ84k31L75j12k53
$$ y = [517, 241, -113, 12, 26, -109, -154, -18, -21, 118, -17, -149, 334, -176, 157, -8, -85, 264, -224, 61, 115, 28, 136, 132, -212, -136, 146, -64, -230, -326, -135, -143, 88, -288, -137, 40, 65, -77, -19, 96, -36, 176, 296, 41, 92, 210, 87, -162, -254, -56, 32, 127, -143, 264, 51, 62, -189, 47, 3, -250, -52, -201, -132, 13, 267, 141, -133, 82, -72, 152, -291, 116, 158, 126, -171, -357, 216, 348, 184, 161, 122, -140, 14, -31, -10, -204, -48, 166, 143, 138, -77, 74, -361, -211, 313, 156, -1, -72, 215, 74, 21, -17, 113, 183, -273, -215, 258, 108, -125, 183, -116, 244, 196, -42, 113, -108, 282, 52, -156, 32, -78, -140, -91, -166, -200, -142, -78, -116, -270, -227, 66, 66, -53, -178, -142, 144, 257, -361, 36, 329, 27, 250, -298, -183, 165, -58, -54, 20, -68, -153, -45, -5, -150, 129, 3, -56, 263, -10, -125, 400, -172, 25, -15, -299, -196, -51, 352, -188, -112, -202, 227, 58, 109, 54, -81, -92, -86, 98, -133, 242, 130, -123]
3473a23K18q1l7p9MP9N1j91J45J92K93q33L71J06Ql8m3Rj0n9j48J07j24k01L59
3498b5l7p2j16K83j66J42j57r7K23K1m9J6j96L11N0j52k06J91K08k5J5j32j18
3521h8Q1K15k23r8j45K09O8k95J27l5K79k17n5J49J80j57R0k30K28j63K15j11
3543B4j65N2J89l63K31K12j76k37J90k4L63o08K50M67m98O8N7r6q8M2J34l11K74
3566a3j13K04l2R8m10L80Q6r1j85n7K91l09Q7J32O2j69O0l9O7j31L6K21j45j81
3590a51L67m28J55j32L97l14l4J87J86j22r9R2k23J18L40k39n9m8N2M0J21l55
3612a49K3K99k94R8n2M5j92N32m36K19n9j37j8L58k25n0j7R3q7Mj09J73J36J46
3636C01l5k17j95k81O72m05M1K65q5l7j92O34j83l29j15J28J57q7l41L61j73J89
$$ y = [-123, 95, 14, -23, -102, -98, -19, 32, -159, -14, 178, 471, -362, 9, 115, 123, 85, 42, 51, 41, -18, -166, -59, -183, -384, -25, -62, -134, -250, 33, -133, 9, -148, -245, -22, -1, -50, -34, -230, 81, 131, -21, -227, -36, 172, 147, 162, 30, -88, -7, 208, -15, -113, -258, -49, 19, -276, -149, -184, 95, -122, -177, -28, 152, -5, 85, -145, 83, -80, 135, 24, -141, -89, 100, -263, -32, 180, 4, -233, -43, -67, 296, -312, -62, 405, -93, -25, 32, -64, -152, -110, 24, -287, -13, -126, 78, 46, 144, -266, 114, 200, 109, -76, -133, 158, -151, -64, 68, 130, -39, 21, -18, 49, -82, -46, 175, 30, -151, 216, -212, -57, -189, 208, -106, -140, 47, 233, 111, 12, 104, -119, -1, 339, 100, 41, -7, 45, 85, 206, -149, -126, 173, -121, -23, -75, -30, -222, 310, -126, 93, 34, -103, -121, 237, 12, -38, -55, 38, -49, -45, -154, 19, 155, 301, 266, 49, -146, -427, 245, -160, -119, 146, 61, 24, -168, 466, 283, -46, -161, -33, 124, 37, -304, 57, -116, 73]
3658G3q8J65k53J96Ol33N48j53l23K65l79J95K46j50L3j94J65k49J71J65r4J2
3680B4n4J76R4m57j0Q1k9M55j50p3R4j82K26k18J63m62M04j34J05K5J60k02R0
3703A26kP9j41j83K70o8j25L10l56j60L40R4k10R5J51R4o9j78J12k84P1J11k2
3726E5L5L9l89K30QJ38j07l7J41k75M67n37K80L1N8j23J81m32L22j04p9L48k91
3749d1K30qm8k59K16J64k57P9rJ36Q8k90qK18o17K97m4J70j48M1K04k8p0lo5J40
3775H8J3p4K77p30K94k16K15K01k38J06J60J06n3l88J11J57j87K41k03j0N4K19
3797A43q8P0J03m0k55J5r8J66P7m5j5k9m7l32N31J80m18M07m09lM07m49j29K79
3821B1L9J1n6j31p9O8N86n61K05j45l4mq3J8M6K31k3K40m31K27k41L60j06p1k20
$$ y = [73, -15, 150, -103, 93, 99, -234, 314, 161, -162, 103, -276, -81, 165, 15, 48, -146, 19, -230, -59, 106, 12, 24, -30, 146, 240, -217, -227, -146, -175, 280, 130, 57, 151, -31, 195, -23, 140, -322, 82, -52, 53, 78, 238, 36, 126, 124, 203, 62, -121, 149, 81, -44, 266, -90, -250, 90, 184, -26, 69, 220, 314, 245, 67, 179, -105, -34, 77, 55, 90, 129, -260, -30, -22, 116, 9, -28, 113, -162, 305, -232, 48, 79, 137, 14, 195, -237, 85, -19, -98, 250, -41, 189, 181, 133, -126, 90, 254, -3, 76, 67, 203, 291, 1, -7, 211, -406, -109, -153, 17, -131, -90, 114, 86, 16, 13, -52, 88, 101, 27, 304, -426, -132, -348, -133, 68, -170, -64, 96, 202, 149, -239, -128, 29, -158, 83, -120, -130, -76, 143, 55, 125, 228, 188, -67, -52, -150, 16, 93, 48, 33, 4, -43, -375, 156, 336, -82, 325, -84, -87, 320, -129, -258, 21, 60, 71, 15, -116, -195, -127, 459, -102, 103, -42, -76, -80, -163, -145, -99, 132, 109, 349, -82, 145, -96, 264, 158, 87, -133]
3846a33J64j16M1o3J40J47o8K08m77L06k49L73m65L87l79J53N3m06M21P3m34L20
3868dP2MK5j02J69J06j70j00k55Q2M12L7k02j01J55k15m8mJ22O4J20m57J78RK22
3893A19L9j97kk63L61J69l52p4J82J93m59M95l22j07L76m34K93K75k78QP4J3k09
3916a00P0K08J21j36J8K2J8q0j65M2M2K23n19L59k53K18J5j5k11J79p7o5K28O7
3940B09l22Q1K86l03njJ58Oml31k4K98l15M28n4k89J00K76m6l7o2n3L13k75j26
3965i2pj05J77N10n43O7J69N2k43J88j10K62k75j56k04K15p2M55j30l12P9R3n
3988A3J34Q7m83j4J14J54L8J08q5k49K91J8m79K55j28K19J67l33Q5j55J74J81
4010A12p7jL9j34K30l17j21N39k28O5J26l92k24M08j04J18L56k16o2k95L65j41
$$ y = [-133, 31, -85, -44, -107, 33, 180, 112, 320, -157, 149, -100, 273, -192, 195, -184, -31, 22, -384, 37, 110, -324, -4, 68, 72, 97, -5, 164, 270, 100, 0, -255, -173, 239, 276, 74, -27, 128, -87, -135, -139, -17, 47, 167, -290, -112, -103, 119, 158, -39, -41, -304, 57, 226, -126, -200, -18, 175, -284, 211, -111, -218, 158, -276, 17, 292, 14, 22, 96, 109, -100, -30, 178, 299, 163, 181, 203, 221, 141, -24, 18, 60, 283, -236, 123, -130, 88, 103, 88, -123, 56, -21, -86, 142, 209, -113, -32, 254, -49, -54, -55, 103, 109, 105, -226, -250, 48, -267, 161, 107, -182, -82, 194, 148, 111, 49, -4, 309, 34, -92, -99, -204, -27, 483, -60, 7, 176, 228, -15, 173, 63, 325, 50, -106, -310, -95, -167, 288, 158, -154, -75, 18, 13, 147, 234, -249, -263, -149, 5, 43, 151, 66, -183, 108, 126, -353, -98, -226, -7, 160, -173, -88, -243, -69, 112, 35, 34, 73, -61, 169, -148, -269, 270, 42, 107, 233, -159, -383, 25, -79, 39, 395, 179, 117, -178, 187, 46]
4032D6K9P8j34k90L55r1k90K87j58N36l42J68m13P5J53K6J46j28P0j75N9J15k56
4055a34P4J39l0j8K13k67K27j98rj68Q9K5j44K28K87k76j22K24l02j18J48J10
4077b2J70n1q4r7J61j56L01k20l4L94n37J42J09r4J2l37K74o4J67Q7q0n4k6J90
4101A51pl56L99l07L53j86J21J74n68K24kJ76j43ql63N43j03k12J06k5N8K93j88
4124A30r9L10k94qk45M7P3O1M86o25K9K93K6n2J97k58K2J06l72N9K07n4k57L4
4148a84oR6N8o7N16l95P1l77K00L6J30j99N8j19k16K99N8J59Q4m23L99j58L8j6
4172D2J18j92L2J16q0K31j28j70O6k9P6Nj92L10j50j98J45n5J03N9j18jj59j58
4196c27M30k90J85L45j96k75L00j85J30l41K81j39K69n68L42N8o7m6J70j0p0q3
$$ y = [46, 75, 153, 19, -271, 84, -7, -297, -10, -168, 368, 26, 194, -219, -144, 9, 35, 181, 53, 123, -52, 7, 122, -134, -60, 79, 49, 31, 244, -23, 204, 6, -3, -171, -82, -57, -201, 27, 314, 38, -84, 140, -162, -280, -132, -22, 148, 97, 13, -84, 77, -79, 222, 2, -32, 362, -175, -33, 76, -18, -6, -343, -69, -133, 34, 121, 41, -13, -39, 151, 144, -212, 187, -120, 233, 47, 168, 342, -226, -2, -4, 172, 29, 21, -342, 201, 98, -114, -8, -33, 25, 318, 130, 31, 341, 47, 39, -206, -159, -86, -25, 461, -164, -135, 158, 184, 132, 329, 71, 93, 199, -173, -114, 93, 39, -218, -184, -190, -94, -36, -103, 413, 18, 89, -288, -88, -52, 78, -121, -63, -182, -398, -99, -41, 118, 202, -221, 178, 20, 58, 42, 160, -32, 0, 116, 36, 267, 139, -31, 35, 6, 82, 87, -105, 205, 55, -143, 2, -53, 50, 109, -9, -10, -169, -327, 103, -187, -2, 343, 147, -128, 172, -13, 117, -224, 57, -82, 187, -381, -39, 19, -48, -94, 76, 66, -4, -87]
4218h7j14K83j19K57k74K58k55j88K47o7J99J2k70K83k6q9K40j19k14N3k17K83
4240G6M5n8j22O3Kk31M7J68m5j02J97q7J22j58m8K66l41L15l65K22p1m6K04Q8
4264A41j57K14p8k16m1L3Q8r7j09K09O4q6J59k91j48J47J14kk37J99N5j87N91
$$ y = [-87, -201, 82, -37, 220, -54, 204, -51, -239, 8, -59, 140, 152, -118, 165, 139, 50, 290, 171, -43, 10, -207, 76, 121, 63, -59, 4, 6, -225, -178, -10, -55, -157, 40, -47, 75, -83, -131, 135, -206, 109, -256, -34, -105, -151, 53, 141, -16, 198, 120, -96, -137, -104, -16, -113, -222, -13, 51, -35, 124, -167, -315, -168, -54, -56, -293, -94, -39, -226, 365]
$$ [...]
8191e9
##END NTUPLES=NMR FID
##END=
