##TITLE=1H_DE-57K
 CDCl3
 8 sc, 
 26.6.2024
##JCAMPDX= 6.0         $$ Bruker NMR JCAMP-DX V2.0
##DATA TYPE= NMR FID
##DATA CLASS= NTUPLES
##ORIGIN= UXNMR, Bruker Analytische Messtechnik GmbH
##OWNER= root
$$ XWIN-NMR		Version 3.5
$$ Wed Jun 26 15:37:25 2024 Russian Standard Time (UT+4h)  she@DPX200
##.OBSERVE FREQUENCY= 200.1313
##.OBSERVE NUCLEUS= ^1H
##.DELAY= (6, 6)
##.ACQUISITION MODE= SIMULTANEOUS
##.ACQUISITION SCHEME= undefined
##.AVERAGES= 8
##.DIGITISER RES= 18
##SPECTROMETER/DATA SYSTEM= spect
##.PULSE SEQUENCE= zg30
##.SOLVENT NAME= CDCl3
##.SHIFT REFERENCE= (INTERNAL, CDCl3, 0, 15.7039)
##AUDIT TRAIL= $$ (NUMBER, WHEN, WHO, WHERE, WHAT)
$$ ##TITLE= Audit trail, XWIN-NMR		Version 3.5
$$ ##JCAMPDX= 5.01
$$ ##ORIGIN= Bruker BioSpin GmbH
$$ ##OWNER= she
$$ F:/spectra/data/she/nmr/H-F/1/audita.txt
$$ ##AUDIT TRAIL=  $$ (NUMBER, WHEN, WHO, WHERE, WHAT)
(   1,<2024-06-26 15:36:22.73 +0400>,<she>,<DPX200>,
      <created by zg, POWCHK disabled, PULCHK disabled
       configuration hash MD5:
       00 E9 B6 7A A2 85 ED C7 34 08 36 98 17 FE 4E 26
       data hash MD5: 16K
       58 BE BC BA 7A 21 52 29 8C 01 AF C4 1B 5A 34 45>)
$$ ##END=
$$ 
$$ hash MD5
$$ 21 6E 25 9F 81 4C 14 4F 4B 7A 34 62 44 01 B7 8E
##$RELAX= 
##$RELAX= 
##$RELAX= 
##$RELAX= 
##$RELAX= 
##$RELAX= 
$$ Bruker specific parameters
$$ --------------------------
##$DU= <F:/spectra>
##$EXPNO= 1
##$NAME= <H-F>
##$PROCNO= 1
##$TYPE= <nmr>
##$USER= <she>
##$AMP= (0..31)
100 100 100 100 100 100 100 100 100 100 100 100 100 100 100 100 100 100 
100 100 100 100 100 100 100 100 100 100 100 100 100 100 
##$AQSEQ= 0
##$AQ_mod= 1
##$AUNM= <au_zg>
##$AUTOPOS= <>
##$BF1= 200.13
##$BF2= 200.13
##$BF3= 200.13
##$BF4= 200.13
##$BF5= 200.13
##$BF6= 200.13
##$BF7= 200.13
##$BF8= 200.13
##$BYTORDA= 1
##$CFDGTYP= 0
##$CFRGTYP= 5
##$CHEMSTR= <none>
##$CNST= (0..31)
1 1 145 1 1 1 1 1 1 1 1 1 1 1 1 1 1 1 1 1 1 1 1 1 1 1 1 1 1 1 1 1 
##$CPDPRG= <>
##$CPDPRG1= <>
##$CPDPRG2= <>
##$CPDPRG3= <>
##$CPDPRG4= <mlev>
##$CPDPRG5= <mlev>
##$CPDPRG6= <mlev>
##$CPDPRG7= <mlev>
##$CPDPRG8= <mlev>
##$CPDPRGB= <>
##$CPDPRGT= <>
##$D= (0..31)
0 1.2 0 0 0 0 0 0 0 0.06 0 0.03 0 0 0 0 0.0002 0 0 0 0 0 0 0 0 0 0 0 0 
0 0 0 
##$DATE= 1719401782
##$DBL= (0..7)
120 120 120 120 120 120 120 120 
##$DBP= (0..7)
150 150 150 150 150 150 150 150 
##$DBP07= 0
##$DBPNAM0= <>
##$DBPNAM1= <>
##$DBPNAM2= <>
##$DBPNAM3= <>
##$DBPNAM4= <>
##$DBPNAM5= <>
##$DBPNAM6= <>
##$DBPNAM7= <>
##$DBPOAL= (0..7)
0.5 0.5 0.5 0.5 0.5 0.5 0.5 0.5 
##$DBPOFFS= (0..7)
0 0 0 0 0 0 0 0 
##$DE= 6
##$DECBNUC= <off>
##$DECIM= 32
##$DECNUC= <off>
##$DECSTAT= 4
##$DIGMOD= 1
##$DIGTYP= 9
##$DL= (0..7)
0 120 120 120 120 120 120 120 
##$DP= (0..7)
150 150 150 150 150 150 150 150 
##$DP07= 0
##$DPNAME0= <>
##$DPNAME1= <>
##$DPNAME2= <>
##$DPNAME3= <>
##$DPNAME4= <>
##$DPNAME5= <>
##$DPNAME6= <>
##$DPNAME7= <>
##$DPOAL= (0..7)
0.5 0.5 0.5 0.5 0.5 0.5 0.5 0.5 
##$DPOFFS= (0..7)
0 0 0 0 0 0 0 0 
##$DQDMODE= 0
##$DR= 18
##$DS= 0
##$DSLIST= <SSSSSSSSSSSSSSS>
$$ [...]
##$SUBNAM2= <"">
##$SUBNAM3= <"">
##$SUBNAM4= <"">
##$SUBNAM5= <"">
##$SUBNAM6= <"">
##$SUBNAM7= <"">
##$SUBNAM8= <"">
##$SUBNAM9= <"">
##$SW= 18.0517328524113
##$SWIBOX= (0..15)
0 0 2 0 0 0 0 0 0 0 0 0 0 0 0 0 
##$SW_h= 3612.71676300578
##$TD= 16384
##$TD0= 1
##$TE= 0
##$TE2= 300
##$TE3= 300
##$TEG= 300
##$TL= (0..7)
0 120 120 120 120 120 120 120 
##$TP= (0..7)
150 150 150 150 150 150 150 150 
##$TP07= 0
##$TPNAME0= <>
##$TPNAME1= <>
##$TPNAME2= <>
##$TPNAME3= <>
##$TPNAME4= <>
##$TPNAME5= <>
##$TPNAME6= <>
##$TPNAME7= <>
##$TPOAL= (0..7)
0.5 0.5 0.5 0.5 0.5 0.5 0.5 0.5 
##$TPOFFS= (0..7)
0 0 0 0 0 0 0 0 
##$TUNHIN= 0
##$TUNHOUT= 0
##$TUNXOUT= 0
##$USERA1= <user>
##$USERA2= <user>
##$USERA3= <user>
##$USERA4= <user>
##$USERA5= <user>
##$V9= 5
##$VALIST= <valist>
##$VCLIST= <CCCCCCCCCCCCCCC>
##$VD= 0
##$VDLIST= <DDDDDDDDDDDDDDD>
##$VPLIST= <PPPPPPPPPPPPPPP>
##$VTLIST= <TTTTTTTTTTTTTTT>
##$WBST= 1024
##$WBSW= 4
##$XGAIN= (0..3)
0 0 0 0 
##$XL= 0
##$YL= 0
##$YMAX_a= 107377
##$YMIN_a= -144434
##$ZGOPTNS= <>
##$ZL1= 120
##$ZL2= 120
##$ZL3= 120
##$ZL4= 120
##$ABSF1= 10
##$ABSF2= 0
##$ABSG= 5
##$ABSL= 3
##$ALPHA= 0
##$AQORDER= 0
##$ASSFAC= 0
##$ASSFACI= 0
##$ASSFACX= 0
##$ASSWID= 0
##$AUNMP= <proc_1d>
##$AZFE= 0.1
##$AZFW= 0.1
##$BCFW= 1
##$BC_mod= 2
##$BYTORDP= 1
##$COROFFS= 0
##$CY= 11.3945322036743
##$DATMOD= 1
##$DC= 2
##$DFILT= <>
##$DTYPP= 0
##$F1P= 15.6554695791079
##$F2P= 12.8336369535428
##$FCOR= 0.5
##$FTSIZE= 0
##$FT_mod= 4
##$GAMMA= 1
##$GB= 0.15
##$INTBC= 1
##$INTSCL= 1
##$ISEN= 128
##$LB= 0.24
##$LEV0= 0
##$LPBIN= 0
##$MAXI= 10000
##$MC2= 0
##$MEAN= 0
##$ME_mod= 0
##$MI= 1.114404
##$NCOEF= 0
##$NC_proc= 0
##$NLEV= 6
##$NOISF1= 3.799351
##$NOISF2= 2.8
##$NSP= 1
##$NTH_PI= 0
##$NZP= 0
##$OFFSET= 15.70392
##$PC= 1
##$PHC0= -25318.33
##$PHC1= 13.38748
##$PH_mod= 1
##$PKNL= yes
##$PPARMOD= 0
##$PSCAL= 0
##$PSIGN= 0
##$REVERSE= no
##$SF= 200.130013532006
##$SI= 16384
##$SIGF1= 3
##$SIGF2= 2
##$SINO= 400
##$SIOLD= 16384
##$SREGLST= <1H.CDCl3>
##$SSB= 0
##$STSI= 0
##$STSR= 0
##$SW_p= 3612.71676300578
##$SYMM= 0
##$S_DEV= 0
##$TDeff= 0
##$TDoff= 0
##$TI= <>
##$TILT= no
##$TM1= 0
##$TM2= 0
##$TOPLEV= 0
##$USERP1= <user>
##$USERP2= <user>
##$USERP3= <user>
##$USERP4= <user>
##$USERP5= <user>
##$WDW= 1
##$XDIM= 8192
##$YMAX_p= 0
##$YMIN_p= 0
$$ End of Bruker specific parameters
$$ ---------------------------------
##NTUPLES= NMR FID
##VAR_NAME=  TIME,          FID/REAL,        FID/IMAG
##SYMBOL=    X,             R,               I
##VAR_TYPE=  INDEPENDENT,   DEPENDENT,       DEPENDENT
##VAR_FORM=  AFFN,          ASDF,            ASDF
##VAR_DIM=   8192,          8192,            8192
##UNITS=     SECONDS,       ARBITRARY UNITS, ARBITRARY UNITS
##FACTOR=    0.0002768,     1,               1
##FIRST=     0,             0,               0
##LAST=      2.2672688,     0,               0
##MIN=       0,             -144434,         0
##MAX=       2.2672688,     107377,          0
$$ Real data points
##PAGE= N=1
##DATA TABLE= (X++(R..R)), XYDATA
0 0 0 0 0 0 0 0 0 0 0 0 0 0 0 0 0 0 0 -7 8 -8 8 -8 8 -11 16 -16 16 -24 24 -31 32 -39 42 -48 55 -59 67 -75 83
39 83 -96 106 -116 130 -144 157 -173 193 -213 234 -258 284 -313 344 -382 421 -467 520 -579 651
59 651 -734 837 -963 1126 -1342 1645 -2099 2856 -4346 8379 -42823 -113382 -963 67991
73 67991 46011 41669 87521 107377 101943 69971 23301 4775 18672 -25114 -110483 -121633 -66710
86 -66710 -65080 -93917 -69125 -10303 27892 43731 44252 54664 85931 99851 61811 12962 13766
99 13766 33655 -2137 -60405 -60713 -27283 -29031 -56553 -61169 -29372 2679 -92 -18795 -8824
112 -8824 34566 57548 27392 4948 41987 71264 37083 -446 4703 15781 -3729 -42757
124 -42757 -64839 -52822 -30430 -36084 -57880 -41228 16280 42164 21812 24400 62726 74732
136 74732 45752 14202 6144 12917 1509 -37034 -64133 -46957 -18488 -28393 -50689 -25259 21186
149 21186 24417 5203 11474 36466 48687 32534 4537 263 20073 18353 -16083 -33262 -8248
162 -8248 6347 -20293 -41656 -25236 -2721 -4102 -19014 -21309 4577 30776 23370 5543 19121
175 19121 47927 42658 8266 -5508 9028 7193 -23316 -48543 -43833 -23200 -19782 -34659 -30941
188 -30941 4891 32880 26582 14498 31047 53872 42251 8035 -3796 5791 3062 -21467 -43331
201 -43331 -37513 -15543 -13207 -28770 -25048 6387 24908 10484 -1806 15428 33813 24465 3855
214 3855 -465 14245 21112 2916 -16696 -8983 7548 -3583 -31171 -34185 -12996 -5768 -21520
227 -21520 -26469 -5273 19579 22835 12643 17110 39412 46841 22814 -264 3398 9141 -11538
240 -11538 -41095 -43903 -26394 -19644 -29528 -29255 -6003 21748 25570 13445 17674 38012 39325 14272
254 14272 -4067 3491 10248 -5478 -25971 -25257 -8631 -3339 -16888 -24725 -8893 8839 2170
267 2170 -14280 -7851 14355 20802 6376 2460 19328 31899 21023 1949 -913 8452 3383
280 3383 -21880 -37856 -26570 -13373 -20875 -30765 -15170 12524 22354 14515 14571 30599 40239 26057
294 26057 2735 -2521 4896 -2155 -26360 -36234 -20489 -6413 -13668 -21327 -8266 12652 17201
307 17201 4814 303 13695 23409 11651 -4964 -128 15710 13139 -5401 -11549 827 5847
320 5847 -8564 -23548 -19915 -6513 -5864 -18152 -18674 2480 19752 14951 7026 18570 34324 28460
334 28460 7345 -2734 1435 361 -18068 -35120 -30592 -14202 -11054 -19867 -14702 9190 24548
347 24548 17063 8642 17692 28908 20732 1227 -7371 274 3311 -10657 -23237 -15294 410 -1734
361 -1734 -15338 -14486 1564 8355 -2059 -9314 942 14774 14218 3066 3055 17886 23727 8740
375 8740 -5222 -1320 5489 -6078 -24182 -26911 -14809 -9017 -16313 -18479 -3168 16728 19737 10944
389 10944 13621 27499 28400 10498 -3876 -1526 2606 -8928 -24849 -25636 -12213 -5157 -11933 -15657
403 -15657 -1201 14869 12328 1158 3815 16837 18358 4716 -3820 3254 10954 4126 -9457
416 -9457 -10221 1265 2623 -11028 -19142 -9767 14 -5158 -13811 -7485 9092 14656 7529 4652 14759
431 14759 23685 15353 -509 -3361 3488 -515 -17153 -24697 -15493 -6074 -9837 -15301 -6562 10675
445 10675 17486 9899 5991 15224 21513 10511 -4578 -4854 3252 -144 -13668 -17964 -7801 752
459 752 -3409 -11314 -6343 6839 8081 -2139 -5276 6147 13759 6185 -1983 2189 12781 11378
473 11378 58 -6158 149 3463 -6563 -18791 -15881 -4965 -4686 -12250 -10174 4615 15558 12424
487 12424 7216 12160 20688 17100 2557 -6230 -2352 -1249 -13131 -23032 -17464 -5237 -3493 -9251
501 -9251 -6233 7304 15893 10232 3047 6987 14886 10079 -2977 -6660 1964 5220 -4113 -11475 -5700
516 -5700 2663 650 -9040 -11097 -2188 2563 -4849 -10301 -1236 10620 10622 3605 5188 14662 17511 7499
532 7499 -2572 -2057 1156 -5996 -18981 -21051 -10616 -4682 -9202 -10646 1284 14262 14760 8665
546 8665 8814 15810 15668 3824 -6096 -4186 398 -5461 -15291 -14328 -3664 721 -4740 -7898 -455
561 -455 7914 5179 -2496 -1829 7494 9879 2248 -2495 4935 12208 7200 -2633 -3517 2032 437 -9571
577 -9571 -15434 -9913 -3046 -5267 -10681 -5397 7598 13185 7895 5438 11908 16331 9207 -1891 -4546
592 -4546 -439 -3085 -12679 -17300 -9410 -840 -2501 -7053 -1978 8457 11069 3820 853 5960 10150
607 10150 3830 -4786 -3581 3565 4046 -4583 -7894 -1376 3457 -1954 -8929 -6133 1433 1291 -4845
622 -4845 -6169 2401 9490 6441 587 4114 11922 10068 -39 -4754 -1061 -171 -7665 -14757 -11609
637 -11609 -2903 -1361 -5631 -4231 6047 13037 9313 4037 6706 11211 7305 -2498 -7008 -2777 -1103
652 -1103 -7044 -12839 -8719 187 1330 -4142 -3525 4674 8322 3144 -1701 1882 8289 6079 -1278
667 -1278 -2410 3749 6560 410 -6238 -3605 1459 -1715 -9315 -10349 -3514 -10 -3822 -6029 813
682 813 9436 10112 4942 4892 11050 11320 3198 -4571 -3639 -1599 -5974 -13500 -13707 -5453 -1030 -3740 -4846
699 -4846 2405 10083 9218 3789 3459 9096 8789 957 -4576 -2247 2092 -1271 -7913 -7617 -806 1428
715 1428 -3759 -6855 -1798 3347 1140 -3929 -2148 5175 7842 3030 709 5411 9845 5895 -1875
730 -1875 -2971 346 -1048 -8640 -12596 -7997 -2326 -3260 -6158 -2173 6407 10349 6090 3503 7798
745 7798 10484 4495 -3295 -4183 -1016 -2076 -7884 -10024 -4551 1115 -751 -4143 -1194 5336 6144 623
761 623 -1736 3071 5979 2299 -2273 -580 4435 4691 -1043 -3896 -315 2275 -2559 -8126 -6708 -928
777 -928 -866 -4809 -4418 2640 8094 6132 2915 4829 9481 7143 -849 -5030 -2882 -1645 -6679 -11141
793 -11141 -8000 -1342 75 -2265 -928 5404 9427 6094 1672 2781 6313 3725 -3076 -5405 -1393
808 -1393 454 -3097 -6527 -3336 1830 1311 -3326 -3948 863 3333 -441 -3423 161 5517 5144 960
824 960 1269 5342 6585 1402 -3815 -2833 -304 -3059 -8938 -9363 -4044 -491 -2387 -3126 2585 8709
840 8709 8402 4228 3730 6926 6847 439 -5102 -4037 -1173 -3812 -8555 -7545 -1634 776 -1772 -2616
856 -2616 1541 5903 4620 369 284 4163 5295 863 -2134 587 3762 1021 -3578 -3747 -165 -346
872 -346 -4692 -7273 -4071 137 -592 -3469 -742 5152 7042 4034 2391 5658 7616 3578 -2308 -3449
888 -3449 -1436 -2318 -6786 -8864 -5131 -282 -1038 -3087 -105 5468 7060 3345 1522 4214 5925 2172
904 2172 -2450 -2504 674 474 -3548 -5384 -1785 1399 -1316 -4480 -2652 1551 1933 -1366 -1807 1694
920 1694 4978 3232 627 1764 5155 4431 -405 -2881 -891 -15 -4033 -7577 -5827 -1532 -856 -2610
936 -2610 -1631 3376 6850 5297 2398 3443 5986 4090 -1522 -3714 -2128 -1158 -4192 -6937 -4342 -111
952 -111 538 -1446 -1237 3153 5358 2525 -421 1277 3954 2403 -1493 -2177 1009 2116 -610 -3169
968 -3169 -1883 811 -497 -4259 -4691 -1229 677 -1457 -2760 1073 5294 5072 2192 2375 5195 5257
984 5257 1260 -3005 -3083 -1168 -3438 -7399 -6994 -2760 -217 -1474 -1304 2505 6323 5617 2885 1996 4422
1001 4422 4150 -183 -3639 -1701 94 -1889 -4803 -3678 -386 696 -1854 -2970 -300 2302 1380
1016 1380 -1613 -899 3113 4240 1657 356 2754 4547 2039 -1862 -2599 -774 -1721 -4694 -6601 -4210
1032 -4210 -1067 -1295 -2667 96 4868 6116 3458 2621 4499 5102 1957 -1768 -2918 -1505 -1571 -4467
1048 -4467 -5923 -2244 443 -595 -2372 -218 3275 3300 887 -166 1772 3440 1629 -1303 -680 2642
1064 2642 2275 -1557 -2635 -292 261 -2048 -4753 -3357 -943 -250 -1770 -1583 1925 4816 3724 1427
1080 1427 2962 4757 3182 -763 -2611 -1754 -1399 -3875 -5459 -4032 -1138 88 -1362 -736 3162 4936
1096 4936 2849 1083 1902 3231 2029 -1381 -2523 -1044 -22 -1518 -3454 -1895 649 586 -2256 -1904
1112 -1904 895 1555 19 -1319 651 2967 2669 483 486 2727 3564 420 -2060 -1766 -103 -2006 -4579
1129 -4579 -4269 -1837 -223 -907 -1465 1450 4387 4338 2159 1833 3821 3359 67 -2613 -1918 -1010 -2828
1146 -2828 -4411 -4171 -1409 108 -1004 -1114 789 3410 2870 679 776 2881 2733 48 -972 76
1162 76 1116 265 -2162 -2242 -239 -195 -2228 -3792 -1430 452 -223 -1560 127 2710 3446 2202 1584
1179 1584 2786 3900 1755 -1617 -2019 -974 -1726 -4286 -4864 -2565 -822 -1000 -1448 334 3051 3765
1195 3765 2435 1265 2564 3313 1198 -1540 -1231 147 -417 -2998 -2815 -935 239 -924 -2129 -1148
1211 -1148 823 917 -649 -1005 1189 2786 1567 320 1623 3365 2466 -171 -1252 -763 -432 -2299
1227 -2299 -4471 -3513 -1205 -905 -1592 -860 2101 3944 2588 1699 2375 3365 2055 -715 -1985 -1200 -618
1244 -618 -2520 -4002 -2194 -87 382 -786 -185 1816 2527 921 -405 468 1693 1268 -706 -968 936
1261 936 1373 -361 -1689 -732 756 -616 -2276 -2343 -669 6 -971 -1616 310 2527 2674 1369 1393 2847
1279 2847 2651 187 -1861 -1238 -764 -2359 -3603 -3409 -1097 291 -578 -330 1611 3249 2826 1450 1159
1296 1159 2057 1810 -230 -2072 -1094 -223 -1125 -2391 -1697 -204 555 -875 -1475 164 1661 828 -603
1313 -603 101 1855 1800 700 -10 1048 2121 778 -1295 -1609 -578 -760 -2766 -3039 -1798 -8 -543
1330 -543 -866 533 2472 3325 1767 1287 2180 2897 635 -1529 -1560 -468 -1478 -2781 -3200 -1591 -87
1347 -87 -207 -1008 -28 1967 2024 659 -96 1409 2054 583 -656 -74 762 586 -750 -1665 -712 -58 -1163
1366 -1163 -2065 -1877 -227 -333 -902 -447 1246 2575 1919 865 1648 2284 1519 -380 -1439 -622 -559 -1817
1384 -1817 -3138 -2157 -458 -185 -652 -264 1861 2474 1591 670 1017 1802 1156 -777 -1471 -110 -80 -994
1402 -994 -1606 -1068 327 43 -936 -693 513 1194 66 -750 227 1462 1007 14 -7 1488 1493 -45 -859
1421 -859 -326 -55 -801 -2114 -2173 -675 -415 -1012 -751 631 2127 2049 1237 1038 1765 1428 -324 -1338 -1174
1440 -1174 -469 -1687 -2527 -2111 -78 538 -4 -251 819 2162 1629 475 287 1263 1157 -630 -1333 -473
1458 -473 509 -36 -830 -1033 183 -171 -1168 -1285 -635 343 61 -348 -339 1442 1956 874 566 1454 1556 279
1478 279 -665 -1055 -611 -1126 -2139 -2426 -1216 -138 173 -435 463 1895 2081 1166 688 1116 1177 18 -1225
1497 -1225 -1516 -535 -579 -1502 -1652 -890 110 -359 -868 -76 769 834 -320 -202 953 1229 616 -73 419
1516 419 1410 876 -143 -804 -397 34 -1385 -2209 -1449 -404 -294 -210 102 1097 1879 1794 789 1347 1400 525
1536 525 -760 -960 -819 -461 -1230 -1953 -1213 -21 202 -193 -299 1158 1224 328 -75 287 833 205 -594
1555 -594 -728 413 381 -494 -647 -152 142 -272 -1167 -1171 -39 257 -353 -666 235 974 1203 242 513 1350
1575 1350 1071 146 -1070 -885 -319 -1013 -1833 -1550 -479 -95 -66 127 963 1567 1415 639 483 912 832 -538
1595 -538 -1329 -759 -165 -714 -1320 -801 35 622 53 -363 409 1180 844 -177 155 925 773 60 -296 244
1615 244 654 150 -899 -621 -120 -465 -1320 -1505 -582 264 -119 -422 573 1170 1488 910 697 691 941 129
1635 129 -914 -1094 -656 -824 -1726 -1674 -731 300 196 -73 593 1489 1273 807 319 572 758 153 -976
1654 -976 -543 -159 2 -1023 -445 114 20 -530 -852 -641 103 398 -36 -139 883 1617 715 244 830 1145
1674 1145 719 -579 -951 -853 -735 -822 -1717 -1127 -184 20 -80 53 1182 1456 1180 320 930 949 133 -1011
1694 -1011 -789 -379 -323 -871 -991 -669 270 156 -27 -125 631 584 -22 -117 270 399 696 -29 -66 454 492 -38
1716 -38 -711 -94 156 -475 -1020 -970 -662 35 -472 -18 577 1118 1215 683 770 853 486 -238 -861 -749 -474 -604
1738 -604 -1280 -822 -48 331 -5 363 1014 1013 822 213 82 708 207 -419 -625 -388 -131 -122 -739 -266 33
1759 33 42 -512 -586 -39 668 167 -256 258 625 756 292 78 576 826 245 -922 -788 -379 -486 -1110 -1274
1780 -1274 -384 201 74 -121 554 1408 1291 756 28 769 253 -158 -677 -691 -658 -266 -1011 -759 42 -19 253
1801 253 44 368 702 704 143 -2 341 770 7 -82 -116 272 32 -644 -755 -735 -148 -833 -850 -751 56 188
1823 188 -194 509 922 927 816 306 381 765 440 -756 -1096 -693 -588 -1066 -1093 -391 23 -52 76 -116 1071
1844 1071 1075 528 143 329 652 269 -279 -500 82 53 -287 -401 -534 156 -371 -554 -247 -182 80 -72 -242
1865 -242 404 929 433 -37 25 589 606 -80 -846 -293 -311 -694 -1169 -364 -208 -74 -136 -37 591 831 513 428
1887 428 285 396 369 -189 -663 -597 -139 -400 -746 -492 130 162 168 374 502 445 117 -107 81 643 172 -297
1909 -297 -228 -135 201 -154 -656 -229 81 -200 -559 -661 -389 385 -104 -96 384 686 871 338 361 109 400 -40
1931 -40 -745 -776 -738 -365 -761 -784 -221 304 275 417 421 958 795 390 43 303 320 -131 -746 -692 -220 85 -458
1954 -458 -150 -79 403 -311 -281 220 47 343 -18 20 290 744 520 231 417 382 316 -495 -606 -543 -474 -510 -745
1977 -745 -303 -127 73 138 529 784 1000 713 579 284 476 45 -535 -803 -219 -616 -679 -673 -610 203 285 496
1999 496 167 308 383 -83 154 292 347 197 23 60 398 170 -178 -508 -203 -11 -450 -705 -606 -226 72
2020 72 -63 20 435 899 1183 497 199 523 510 -314 -393 -630 -426 -591 -735 -293 -244 46 54 290 314 754 471
2043 471 18 186 133 126 -186 -428 -82 -14 -213 -351 -466 13 62 15 -88 74 260 40 -305 -143 634 251
2065 251 130 -55 56 536 -209 32 -282 -233 -122 -703 -626 -220 201 -52 224 251 373 779 158 -36 97
2086 97 -168 -63 -400 -529 -377 -397 -442 -407 160 416 328 35 398 41 344 178 -112 234 474 28 -74 -165
2108 -165 164 -58 -320 -472 -295 -9 -515 -454 -222 213 335 236 268 575 415 267 390 125 195 -16 -335
2129 -335 -836 -680 -603 -392 -714 -403 -106 150 5 363 550 697 677 167 237 164 33 -187 -398 -367 -220 -235
2151 -235 -424 -275 128 186 -173 -186 83 337 150 52 94 162 407 165 198 159 121 115 -290 -586 -2 -463 -718
2174 -718 -808 98 82 267 -144 226 416 545 452 161 528 216 90 -459 -494 -277 -535 -408 -224 -153 540 48
2196 48 -21 271 400 3 -94 435 -70 108 -158 46 49 317 -204 213 51 133 -42 -238 -275 -215 31 26 178
2219 178 202 332 263 78 56 498 54 -35 -225 -189 -120 -468 -331 -439 -13 44 292 -22 281 260 624 94 54
2242 54 249 -49 -334 -392 -276 -161 -113 -539 -272 178 194 43 -115 71 245 422 382 22 180 143 156 125 106
2265 106 250 76 -205 -354 -208 -221 -325 -164 -319 184 -29 87 420 495 447 770 399 85 170 148 -245 -369
2287 -369 -544 -289 -155 -356 -212 40 135 194 575 203 185 372 74 236 256 150 115 -5 -260 -117 -85 -548
2309 -548 -411 -302 -122 -171 -493 -181 224 70 183 498 398 474 173 336 218 80 -123 -330 -204 -175 -443
2330 -443 -180 -285 173 195 181 69 233 351 409 302 -29 -28 79 -86 -184 -316 -86 -145 -118 22 52 83 41 -58
2354 -58 36 -11 109 -23 195 174 133 240 -164 -25 120 81 3 -7 -32 -68 201 -60 -155 164 264 -293 176 239
2378 239 346 43 19 97 248 84 -72 -182 77 19 -308 -106 -174 -11 3 66 416 17 168 256 89 323
2400 323 3 -161 -145 -105 -147 -383 -28 -173 -172 -453 -190 113 57 65 15 -168 384 235 197 72 33 85 -43 135
2424 135 -141 -203 -105 -395 -57 -99 227 48 228 242 241 19 212 67 -84 254 37 -60 -319 19 -502 -161
2446 -161 42 -19 -87 -103 107 -136 260 216 -355 167 325 115 20 99 74 -66 110 -54 -222 -267 -191 -308 -318
2469 -318 -292 -96 -173 59 21 129 323 246 63 561 548 -128 121 9 -35 -460 -333 -343 -417 117 93 -177 29
2492 29 336 433 6 -74 -244 -70 211 7 -3 105 264 113 -11 40 -2 -64 -225 -235 -119 152 -412 5 -241
2515 -241 -81 172 112 211 185 79 241 86 22 91 -411 -292 -117 -321 -37 118 68 65 136 -142 272 13 336
2538 336 -24 10 94 97 7 -244 -145 -119 61 98 109 -208 -308 -150 336 -181 -30 193 114 60 63 119 47 -75 -231
2563 -231 -212 99 -171 -160 -262 343 276 -386 60 321 40 -129 145 241 -45 -127 -334 -104 -140 74 -114 -213
2585 -213 -115 -117 -46 -49 191 0 104 -13 281 40 264 112 1 -32 149 -35 -89 10 -83 -24 192 -81 147 -288
2609 -288 -212 106 329 266 -141 320 -142 62 126 27 -54 85 -167 -171 -298 -419 24 95 -204 -318 140 309 120
2632 120 303 282 -118 237 116 168 -162 28 -218 -21 -49 -8 -95 -3 -57 142 -97 -117 -121 166 267 112 79 -106
2656 -106 -80 343 142 57 84 79 -119 -219 -2 -61 -22 73 -92 71 -316 -38 20 184 -102 6 8 225 86 61
2680 61 54 -289 -112 -355 -249 -35 27 254 49 120 113 6 110 -194 136 -216 -255 -256 131 165 1 -348 -85 38
2704 38 -94 -65 -53 -267 -73 73 -231 16 109 138 -284 283 -63 2 -95 38 -130 -3 10 -182 189 151 126
2727 126 11 85 62 89 130 -27 169 -103 130 -83 52 71 -167 -217 -202 92 -87 293 -270 -390 47 137 241
2750 241 187 86 -215 27 134 -55 178 6 -318 147 -176 76 -105 -118 -93 90 -4 122 -22 35 137 210
2772 210 126 7 -86 139 75 -210 183 68 93 -204 -80 -50 0 33 60 -199 -106 128 83 -124 52 271 68
2795 68 25 -64 336 2 -76 236 153 -65 -109 -163 -61 -231 44 79 -110 292 331 52 134 -125 -100 266 207 -194
2819 -194 -118 185 -31 -192 -280 105 177 35 168 26 -115 -8 167 65 233 -21 121 -98 -20 301 -195
2840 -195 -311 -146 108 -96 106 -310 72 60 100 10 88 67 62 -31 240 162 15 -197 -148 -207 -96 123 136 -61
2864 -61 4 281 309 -80 -291 153 6 -185 27 170 -69 -136 -129 93 -129 -10 -161 -228 44 -61 20 -65 110
2887 110 49 -68 -133 81 251 140 129 -461 96 -36 -13 79 173 230 -119 -19 -220 -188 170 41 -327 -182 309
2910 309 98 76 4 66 207 -63 -93 -161 -54 115 91 -109 -101 -133 95 85 -73 173 34 65 -123 450 361 26
2934 26 -417 148 69 -86 -9 144 107 -136 -152 325 6 -111 210 -127 -218 147 85 31 11 -201 83 159 109 71
2958 71 90 -231 -160 -444 31 8 74 -155 -138 209 192 194 177 204 285 143 -22 -46 250 349 -49 45 -400 96 84
2983 84 -73 -21 140 199 -38 -91 24 217 -89 143 7 4 183 40 56 22 104 -15 -200 -111 -208 -27 -66 -263
3007 -263 276 190 144 -237 -87 261 287 -207 25 -63 -85 106 -446 19 -9 157 4 -251 87 225 84 -161
3029 -161 -165 114 65 233 83 -107 135 -192 117 180 112 68 -113 5 55 122 224 -28 111 -2 275 -247 -95
3052 -95 160 194 298 -6 -234 -85 14 -194 245 -42 87 23 -61 242 48 242 -39 -108 135 194 41 -388
3074 -388 -254 -135 -56 137 -211 -49 363 40 139 249 59 95 -67 -106 85 -15 -20 -131 -77 134 -171 212
3096 212 -33 -16 -17 68 -146 47 -2 -249 -248 88 26 105 103 -100 93 302 22 -152 -262 -373 94 -22 -202 -71
3120 -71 -102 -40 -5 -170 -144 222 -33 204 -24 148 -49 68 162 -17 147 78 -12 -38 -53 -76 -7 -87 -61 95 347
3145 347 -93 -61 123 92 11 95 189 205 -118 -315 -133 113 -415 24 -125 218 41 -128 59 -69 114 -16
3167 -16 -249 23 339 -59 -130 -114 120 5 88 -130 -35 234 213 -50 28 -46 -287 -57 187 63 -132 124 56
3190 56 -17 317 335 -163 131 -64 338 117 -106 106 -14 -67 -14 -155 159 30 78 -148 -104 -53 195 143 -116
3213 -116 70 17 0 87 -18 -173 167 -67 -51 55 -109 228 -19 -105 191 -75 -79 -214 -92 -44 155 49 127
3236 127 63 96 -275 65 64 -13 91 -243 -125 -20 -202 -28 100 110 68 -18 -130 -68 -154 -22 46 -65 -56 11 -160
3261 -160 126 -3 50 236 105 10 257 70 225 -252 -123 -42 64 132 -308 -26 -120 271 -196 114 -193 -72
3283 -72 -92 -248 -62 12 161 -334 -167 95 -94 270 -330 -36 -131 -128 -157 12 212 -7 -88 -67 -128 230 -35
3306 -35 142 137 -93 -22 -89 143 -169 -112 -189 -345 -64 271 31 -182 -154 201 -244 23 -150 200 -35 101 248
3329 248 205 -14 407 199 -312 15 22 258 122 -315 -151 111 -116 -8 -34 237 76 -97 -49 -184 29 -11
3351 -11 71 -211 99 245 -185 -303 -93 227 202 -14 -239 -217 -129 -240 -297 90 -11 11 -22 109 34 63 44 174
3375 174 94 -52 -73 14 17 118 324 117 -289 -188 216 311 7 99 74 251 247 -283 9 74 164 58 51 19 45
3400 45 11 -113 121 320 -350 83 -242 261 266 81 70 -384 17 -76 -16 -83 168 138 88 -189 136 180 26 -20
3424 -20 169 280 46 -7 -192 276 12 52 -41 -60 94 -244 60 -19 123 42 27 25 -173 197 -122 -88 8 108
3448 108 63 -32 -136 -299 -154 128 -39 -77 108 38 23 -81 43 32 374 23 176 102 -52 234 -49 155
3470 155 164 84 -210 -130 62 -118 -128 2 105 216 -95 27 -118 -228 -140 -98 -372 -45 279 54 -155 160
3492 160 155 -137 -1 -182 -134 104 18 98 200 47 201 -42 4 60 62 -358 68 -146 -47 -267 -74 -21 75 213
3516 213 6 -6 -99 -281 -79 -54 -108 -156 23 136 -15 1 155 -243 -146 92 -45 64 -78 -69 -219 3 113
3539 113 44 106 -153 68 -104 -37 -235 74 18 -128 206 79 -138 39 -49 -194 115 -123 17 -105 -14 -83
3561 -83 380 -48 176 244 -190 -132 -166 210 499 84 9 -244 -176 17 200 -41 -218 -34 -206 128 115 -100
3583 -100 278 225 22 126 343 196 33 -26 274 -162 -20 -16 96 -34 -58 -129 52 179 118 213 66 60 187
3606 187 85 -116 -15 39 70 -241 -288 -104 -116 -107 -142 -58 35 269 -185 -144 282 97 140 71 40 80 215 112 -116
3631 -116 17 156 160 -37 100 -148 35 162 60 143 -3 -89 -164 -72 289 206 -285 -208 -16 -109 -6 242 -162
3654 -162 -41 -2 81 -108 279 -50 28 -223 -111 34 288 -27 -80 -100 181 -149 210 -57 -80 69 127 207 196
3677 196 96 55 279 -168 -18 142 115 158 121 -49 50 98 -185 0 -160 -206 -46 -240 263 -93 -79 -50 114
3700 114 -199 -46 364 -17 150 90 -223 273 352 -21 -102 77 -321 -209 -92 -140 13 293 -87 -108 -140 29
3722 29 -4 -155 314 -110 86 9 -188 30 193 -14 121 -285 161 108 147 -172 -94 64 192 43 63 -113
3744 -113 182 -161 58 33 -10 -21 -111 92 144 257 -115 -52 -3 361 215 45 51 120 -89 -49 236 -75 37 121
3768 121 -201 -38 -154 -17 -241 -23 372 219 -120 -45 -19 -187 -29 -1 122 82 241 -75 -84 -84 -168 -201 -8
3791 -8 -262 9 -183 84 -219 264 157 -131 -25 -173 -64 100 -274 149 -227 75 -38 61 336 -157 382
3812 382 147 85 127 149 5 157 -107 37 256 -216 -20 -23 153 -64 -33 -89 137 -90 75 -126 1 -47 -96
3835 -96 -69 -8 -198 129 140 346 -132 110 44 -31 -187 -20 212 43 105 -180 -212 -53 175 -160 -167 -139 31 133
3859 133 -109 259 175 -212 -275 33 183 130 -66 -7 56 -81 28 -64 206 -212 -124 -8 38 -65 76 92 -136
3882 -136 98 195 -84 -156 -132 216 33 67 -257 34 93 116 16 -341 -348 41 -88 -87 64 140 21 -1 -65 -29 -163
3907 -163 113 63 18 12 -208 234 119 -33 298 -69 -171 -6 -248 -114 -324 137 94 15 202 1 -81 -239
3929 -239 -118 -289 -4 -109 520 -184 -519 82 73 -79 -216 21 -106 -213 192 45 -13 -182 -24 -329 -178
3950 -178 -100 199 -17 -12 -8 -158 -198 201 -224 193 112 -99 -69 -115 -143 -72 -24 -144 49 -236 82 60 -76 -201
3974 -201 65 -188 329 -145 216 4 27 13 78 -145 -109 -80 205 43 -254 -239 215 287 -379 -182 -14 -118
3996 -118 20 82 -204 -195 198 -336 239 17 -59 -4 -130 -113 13 117 234 57 65 121 112 -57 199 -69 199 -112
4020 -112 71 -41 101 105 40 24 97 132 -204 113 -73 383 84 -60 -157 47 120 106 -63 -143 123 -60 -199
4043 -199 144 117 -80 -184 -156 198 -5 40 10 -1 -47 -19 -128 95 -276 90 234 178 6 102 -22 94 -223
4066 -223 -142 120 87 4 -10 32 60 23 -117 16 70 -96 -106 -134 53 -234 68 -37 218 -54 -159 -195 -179 -263
4090 -263 -147 -106 126 256 47 -67 -42 8 278 -138 75 172 52 193 -182 22 -90 -52 130 170 -316 -243
4112 -243 58 56 89 199 192 113 80 -7 77 32 151 -39 30 26 3 -70 291 -57 -39 38 62 233 169 103 93 -116 9
4139 9 259 221 44 -20 -17 101 -176 36 94 -241 -128 79 -65 234 79 -5 53 -50 122 17 -80 10 22 154
4163 154 65 -176 195 116 -44 24 -100 -20 20 -34 126 -24 -37 34 35 90 231 13 36 28 235 47 24 -13 -102 -144
4189 -144 88 189 120 180 -73 -63 58 241 183 -138 -100 25 170 -145 139 97 97 -51 -158 -132 208 103 336
4212 336 138 -125 243 -78 103 -177 137 140 -150 -16 -137 -146 135 -41 55 244 272 308 220 121 86 -115 301
4235 301 -53 277 195 79 -177 -51 154 -16 -65 -98 39 140 -135 -45 -207 96 -252 149 -144 146 2
4256 2 169 53 14 -38 125 -16 47 223 131 -141 11 71 76 331 56 108 199 -167 99 -60 -193 -14 -2 -138
4280 -138 -349 -60 -37 -225 -218 247 -109 85 -296 -56 -158 -121 -80 -95 373 -284 61 -34 -54 118 106 -60 -89
4303 -89 -52 -67 79 -137 -17 103 -74 331 -50 294 206 10 14 -101 -86 46 91 73 -190 -119 122 186 -56 -128
4327 -128 198 -31 -10 44 231 -40 54 -12 301 31 -24 -150 -71 85 -166 -134 -197 409 65 -209 -119 -156 -110 12
4351 12 85 10 -156 18 70 -326 83 -4 19 -142 -78 -14 -6 156 -198 -73 -164 165 -89 1 37 -131 210 -211
4375 -211 -9 -89 -48 -226 -70 -212 149 -36 -55 -45 -56 53 16 138 -11 -161 -116 -230 81 132 -239 -138 73
4398 73 84 222 365 -109 -178 -43 191 -150 10 116 -94 151 34 16 -53 15 -220 233 39 -18 43 -177 -231
4421 -231 98 33 37 -23 119 14 -321 -86 -63 105 -44 130 -18 187 46 123 -224 -19 -36 -86 11 -79 30
4444 30 -69 155 -167 305 247 160 228 128 -109 24 -85 -167 253 82 -20 -67 53 -228 33 -51 -46 130 26
4467 26 263 159 -102 190 8 8 -147 -10 92 99 -116 -194 196 -139 62 -48 -103 80 133 63 31 112 -96 -54
4491 -54 -73 -102 -471 269 121 275 -112 -9 -316 -61 -182 -124 7 -164 -137 44 122 590 61 126 -16 -172
4513 -172 128 115 -104 -76 -72 -254 109 -146 -48 53 14 -31 10 124 312 136 -193 -215 196 25 -147 -33 -88
4536 -88 -125 295 -5 44 -7 -96 58 126 -82 -181 76 -140 -285 2 150 -158 -33 45 -71 -449 -176 65 -122
4559 -122 -25 76 -264 -91 -42 71 11 24 -101 104 48 14 -46 -100 86 146 53 17 -133 -36 148 27 -39 100
4583 100 225 -49 220 165 -126 -190 3 70 -128 169 -175 153 -178 241 207 -141 -222 158 80 -41 -54 133
4605 133 191 103 -10 -123 112 100 -14 -22 131 67 106 4 -85 162 125 -37 -146 -14 278 215 55 119 23 127
4629 127 -313 170 130 -25 49 -78 -71 14 -15 -235 122 -215 -127 -106 -109 -35 376 216 -34 -108 24 80 204 1
4653 1 -171 13 75 -76 -120 92 -35 271 -27 -16 31 -67 204 26 91 -71 -98 197 233 -17 5 12 -50 -214 -135
4678 -135 -211 -207 -222 -86 -194 170 37 -40 32 25 91 -126 386 73 -146 14 -146 -31 133 252 313 -25 55 50
4702 50 63 -116 -117 103 -168 -92 -147 -216 -170 85 187 -127 66 -114 -242 -272 104 120 -172 5 -20 -114 -198 -237 29
4727 29 -14 -16 -35 107 276 34 -16 -118 -46 -29 -87 -224 -271 82 -250 53 -57 24 -89 -216 21 3 222 134
4751 134 176 213 -69 -34 -158 162 32 80 -130 -228 -72 -2 32 -54 -82 -36 -164 -16 117 120 62 -74 -60 -53 167
4776 167 56 -8 -171 -176 171 -31 215 -171 13 -121 91 -323 23 -72 183 193 -327 -299 187 17 -9 -79 -105
4799 -105 94 54 65 -401 140 -107 253 92 7 -28 -17 -84 -167 225 -104 80 33 39 -5 8 139 45 128 61 32
4824 32 -7 40 -179 25 67 92 -212 17 20 161 -216 -212 42 129 -195 122 -23 115 165 174 -243 -219 300 -258 -74
4849 -74 153 -72 -244 -35 59 239 -16 -107 34 20 203 -263 109 110 -19 -187 282 68 3 98 -91 117 191
4872 191 -324 15 88 185 60 45 147 252 -76 25 78 -47 35 -161 -10 -194 143 186 199 67 123 -78 -55
4895 -55 -206 -38 134 -6 104 83 268 144 -99 92 -75 93 -54 -232 58 -80 -152 -120 -119 -18 266 -55
4917 -55 -135 153 36 -99 41 20 -163 -49 -97 51 -183 -114 -93 -81 -37 -75 40 -31 63 -208 -203 -26 144 192 -100
4942 -100 -128 69 -125 -152 -75 -176 192 -224 38 -94 122 -38 -16 41 39 271 27 -82 134 -52 10 24 159
4965 159 -225 145 219 -168 254 9 104 159 -4 -74 -29 57 0 -165 127 86 74 -17 -179 -121 -97 -50 36 31 -78
4990 -78 103 183 -427 -215 128 303 -75 -312 116 0 -118 -126 -145 87 -17 -93 109 -112 50 -7 104 -55
5012 -55 42 -54 205 214 72 -330 -32 154 213 135 61 144 150 92 328 153 282 109 1 30 95 -61 -54 58 -9 95
5038 95 -147 43 24 33 -25 -122 72 127 60 -282 -99 -11 -226 -1 -320 -269 159 248 -199 41 -20 -52 85 38 74
5063 74 256 97 139 6 193 84 401 68 -22 -35 50 38 -42 -68 89 27 -195 -207 -98 -2 125 68 18 25 -135
5088 -135 -38 -7 205 161 -99 -50 223 -99 -37 -53 23 224 -20 -87 81 57 98 -66 7 156 69 -6 166 109 -107
5113 -107 -132 -80 -139 293 178 -171 158 -53 -52 -216 -189 -169 49 244 -149 -117 89 156 115 -104 -240 233 121
5136 121 -130 86 215 96 86 -43 205 82 -86 194 -56 20 39 -479 270 -16 -35 283 -186 -106 -22 42
5158 42 -18 9 9 49 31 -152 78 -13 75 -34 45 -31 -87 -69 -230 -76 -18 251 -123 -228 -117 91 11 30 68 133
5184 133 7 249 -204 105 147 -77 -147 -111 37 179 208 -210 292 286 -34 168 -32 180 10 8 154 -60 140
5207 140 241 -22 -211 77 49 160 -86 -104 -16 98 -110 -104 -69 121 -13 248 52 -111 -69 -237 157 130 296
5230 296 405 -17 -44 -212 246 -139 65 -106 -142 -175 -371 44 74 12 -125 83 236 16 108 87 -10 73 -88
5253 -88 -26 137 -162 -12 179 15 124 118 200 134 -51 -85 -105 -303 14 216 50 -158 181 30 -58 77 115
5276 115 161 233 -239 -194 43 -114 81 -103 148 146 -151 -43 -25 279 -141 79 78 -106 23 -101 28 -220 171
5299 171 31 189 -36 115 18 61 23 -99 -188 -106 36 179 -112 -109 112 202 6 22 -11 259 49 118 48 121
5323 121 266 61 80 -193 149 -17 104 -149 -10 153 -179 36 -243 72 228 223 -165 51 84 -288 -93
5344 -93 -91 -127 78 -138 2 -19 54 -11 -30 185 1 -173 115 -104 -32 326 -110 43 21 107 64 -93 -127 71
5368 71 77 236 24 114 122 225 -81 -289 15 -129 311 -30 95 29 -102 175 -81 124 263 105 77 -94 -118
5391 -118 80 63 -99 -174 -76 -110 132 -66 81 110 42 99 70 -85 -251 27 -57 -56 -25 11 -45 -246 29 -18 -22 -107
5417 -107 154 -94 139 -92 120 -93 -251 37 -133 133 -327 -222 46 -117 148 -28 -158 -36 240 -33
5437 -33 -6 34 58 135 -187 311 148 -57 -86 -281 -53 45 -159 -7 123 -85 -258 17 36 35 -125 -17 -121
5460 -121 37 66 307 -154 112 236 216 78 119 -84 95 -6 72 12 -2 121 -134 136 180 88 -25 -157 -53
5483 -53 89 76 -151 -96 -120 -8 31 161 39 130 68 -95 8 -178 73 -240 -26 39 -38 -192 179 -211 -8
5506 -8 -203 170 -190 25 312 21 128 -28 131 166 64 15 74 -103 134 -29 -132 145 -236 122 116 115 -40
5529 -40 -61 62 -87 -272 106 -54 -234 -176 -77 211 -186 -199 99 -71 -101 -76 -15 154 8 231 7 -31 -91
5552 -91 -138 -326 116 -9 -173 0 24 -23 -76 -208 2 -59 94 -53 26 334 -56 -225 -215 38 52 8 63 -170
5576 -170 130 -86 145 -84 -105 26 144 83 -28 -33 123 -78 -347 74 16 -27 -104 -366 -50 -31 85 -97 105
5599 105 180 -116 76 183 -2 -149 243 35 3 377 -85 61 -20 -119 38 96 152 -173 217 110 26 366
5621 366 -153 192 200 -93 17 -7 15 -112 21 -15 -120 -36 -62 -86 -72 69 -127 323 -212 55 -63 -217 -311
5644 -311 -126 -352 206 -49 160 311 -127 100 182 95 55 61 -245 -51 -35 -81 29 21 -92 -57 111 210 -72 164
5668 164 -4 -94 -35 117 -15 -48 -245 -3 45 193 119 -274 39 155 7 -33 170 -60 35 43 -17 142 -12
5691 -12 14 -296 -177 44 -82 -225 -145 -25 101 -167 29 211 -195 90 95 -32 -12 -61 100 -164 -16 -164
5713 -164 -70 -92 -171 67 101 38 29 -20 -30 -117 -97 5 -275 -127 126 18 -148 139 -32 139 51 -79 -26 -3 92
5738 92 265 10 -5 31 59 -147 59 -112 -3 277 -104 104 -310 66 175 -8 108 -141 288 182 -148
5759 -148 274 -125 -96 139 167 -18 -119 52 158 143 -99 125 432 213 -256 35 24 31 84 -98 110 145 249
5782 249 -124 178 -79 -222 36 -39 275 -95 114 -7 157 -197 42 8 101 38 153 -106 152 -21 95
5803 95 -273 342 -57 -95 -263 -272 190 -144 33 59 47 -153 -85 13 -113 175 116 -159 66 119 30 41 43 -30 89
5828 89 -128 89 -257 -61 -214 -222 -47 -104 106 -87 127 31 -121 152 -111 -57 -29 -110 52 -98 77 133 -120
5851 -120 -101 -252 -169 -185 91 157 9 216 307 167 -48 145 -232 -104 226 -13 61 64 -97 -38 77 -43 -308
5874 -308 -79 -38 -38 -218 -70 216 51 -194 -86 -22 -266 -65 -132 25 -268 246 -76 -196 -35 -40 95 -248
5896 -248 -8 248 212 71 -73 7 174 -55 -132 65 261 -79 -261 -82 -109 139 98 -19 -122 48 10 165
5918 165 40 -36 70 -1 -40 123 153 143 39 29 -9 -151 2 -127 -191 -308 -43 -13 -80 -91 -160 -6 33 -69
5942 -69 -65 84 -18 19 108 8 -112 40 -274 -191 66 -125 65 53 -322 -134 157 40 -187 245 25 -160
5964 -160 -72 -61 -10 13 -177 -86 240 198 36 203 143 61 41 -51 -132 70 88 309 -106 -278 -98 206 41 210
5988 210 -91 -18 -329 37 104 -171 152 128 126 112 85 123 -197 -38 157 -15 298 106 3 78 -138 14 210
6011 210 60 47 -146 8 -21 -172 -192 102 -183 84 -219 170 -257 194 -32 -3 -137 -6 -212 -153 -67 120
6033 120 36 -11 -12 35 114 -18 -184 -6 101 -151 60 -12 -189 -148 176 209 -81 139 -65 -78 44 159 133 231
6057 231 -265 -51 -2 -131 129 161 144 262 118 -31 -332 71 97 -293 163 -84 17 -108 -257 -79 205
6078 205 53 47 -80 368 158 135 180 251 104 240 -116 232 76 192 152 70 -109 -38 233 -142 -167 130 70
6101 70 -150 358 -86 -255 23 -22 237 141 18 -35 -316 -203 172 72 -79 -59 137 -232 -129 -95 110 -235
6123 -235 -1 -26 -140 -38 214 142 192 164 -104 -133 169 -67 -256 49 -43 32 -119 152 -64 -195 60 -224
6145 -224 220 155 75 -26 38 -139 -29 -107 161 -73 51 220 -250 110 283 -156 173 119 38 62 -73 218
6167 218 -57 -151 -111 201 56 63 219 -24 -155 -37 300 -97 153 182 189 -20 16 -176 81 -81 -305 -154 0
6190 0 90 156 117 13 86 17 67 316 62 322 102 -87 -86 -25 225 231 -211 71 268 -171 103 -110 74 182
6214 182 201 -57 154 -91 194 93 -136 167 -19 54 -23 168 -145 174 339 -256 109 137 149 -189 166 -29
6236 -29 -171 82 150 -10 -120 -60 83 -155 -286 -105 -66 -158 -133 95 55 89 -207 -401 -49 271 234 13 -188
6259 -188 -91 100 176 23 -128 34 175 -297 -15 -15 90 4 -181 38 87 -186 226 169 202 43 -75 106 15
6282 15 26 -19 259 168 172 19 188 -99 167 -24 -10 -36 424 153 -270 -59 -7 0 187 -103 80 -160 -117 32
6306 32 -131 -131 8 114 35 -61 -50 -253 9 123 -9 -48 -81 -29 -8 280 215 -131 226 51 90 23 -207 -16
6330 -16 87 -228 210 -223 -41 88 55 175 -143 93 -175 196 27 107 202 46 1 -120 99 184 -24 332
6352 332 -171 59 33 -188 -19 -67 -133 0 -77 83 202 148 104 163 -5 -200 375 319 114 9 -22 187 -10
6375 -10 31 -3 262 -167 -204 36 42 112 162 34 -42 230 -155 -151 -159 136 16 121 159 140 8 -84 -98 167 -107 -133
6401 -133 -172 1 138 -400 80 -89 137 134 -172 -97 15 98 12 -225 124 -76 -136 32 -247 105 72 222 37
6424 37 -51 -21 139 99 222 -163 -151 169 109 -253 -173 44 145 -28 -110 -104 -60 165 -32 -133 -146 119 -37 72
6448 72 -189 195 -37 -134 38 -112 -128 -85 -75 -175 50 -399 -22 72 45 -201 -145 135 167 57 219 -63 74
6471 74 -181 57 -182 239 240 -176 64 -154 -137 -25 97 -41 120 -189 146 -365 319 -328 -274 -60 100 78
6493 78 44 159 -175 -97 166 -128 -20 48 -197 -185 179 233 23 -77 124 40 273 -226 20 -271 107 176 7
6516 7 -280 -30 74 -292 123 -12 -51 150 -222 212 258 -195 99 -137 91 -118 65 -1 42 -71 -127 -108 -277
6539 -277 111 223 -166 9 89 -70 -235 -232 -279 -212 134 117 -123 34 174 -124 29 -95 -89 240 -125 66 -148
6562 -148 155 -86 -315 -333 -168 268 -226 158 144 42 104 239 12 -94 -392 27 -90 -29 -296 178 175 12
6584 12 142 209 94 -148 88 -52 37 105 254 226 96 -146 -61 104 -44 60 -99 -105 87 22 129 -42 -137
6607 -137 -56 -70 26 60 -85 -148 150 62 6 280 84 -3 -37 283 -24 251 -234 34 -75 74 125 283 -94
6630 -94 -188 -92 -218 -24 -71 109 -8 124 -89 -23 -189 162 -137 -254 25 -153 343 6 -104 -65 113 -31
6652 -31 -94 64 37 -154 292 -94 56 67 -176 60 -94 -438 -124 145 -262 140 -30 23 -52 -53 -108 -12 41 -115
6676 -115 89 -29 -147 92 -86 111 -86 -9 -76 -282 224 79 -145 34 108 -72 133 -36 6 -89 21 54
6698 54 132 -80 -117 -116 34 -308 -92 -39 -141 117 80 54 15 -125 240 138 -90 -17 203 -75 -77 -64 -108 122 96
6723 96 -424 8 251 -14 -134 -118 -199 -38 162 -150 185 -35 26 92 113 101 -54 230 -157 200 -55 6 79
6746 79 -178 -137 38 -223 128 -54 -208 41 -14 35 125 73 -16 -92 99 -194 6 60 -221 -96 -70 -81 285 21
6770 21 2 -71 31 438 -383 -19 38 40 20 73 88 37 86 50 -88 146 459 9 83 -108 45 32 24 -58 -101 -22
6796 -22 58 34 -122 -30 -68 55 28 -237 35 -3 84 132 -38 -28 -51 -61 -65 -115 -62 151 -56 307 310 -205 89 246
6822 246 -254 -214 -26 22 140 172 -234 22 -30 -139 -157 -49 15 -90 123 -223 -187 430 -70 -13 61 -201 19
6845 19 13 7 19 -24 -135 -225 30 358 -53 112 -25 -82 125 -78 -76 232 144 -142 149 246 90 -108 -4 168
6869 168 1 35 -145 106 -86 -64 -7 75 58 280 -57 57 181 108 145 -84 102 17 1 91 199 -174 51
6892 51 193 147 63 -114 -121 -202 -48 216 -110 -122 166 49 212 -116 61 8 -70 -40 112 138 -178 155 -250 -21
6916 -21 19 -296 -197 -84 96 102 146 -14 -227 12 26 92 -135 45 -153 -119 -72 -127 57 205 345 -430 -14 -170
6940 -170 -103 -207 -110 -51 109 -110 195 -67 7 -19 221 8 -123 -140 158 207 -225 162 86 160 -145 -200 141
6963 141 25 -9 -47 -139 216 2 37 100 -62 161 40 12 114 -116 169 -257 41 321 -81 112 31 -5 115
6986 115 39 -217 -197 -34 67 -80 169 -129 -72 150 37 -170 -228 -149 113 114 -67 42 190 -50 -286 -72
7008 -72 -140 66 -153 -40 239 159 -281 43 210 -451 222 -101 32 -65 -166 24 98 -226 309 271 -23 118
7030 118 -42 59 125 72 -126 -240 -151 -223 -58 -2 -118 83 -2 18 -140 -186 133 152 -6 99 -1 151 104
7053 104 -38 224 -47 -185 -130 -129 11 255 56 -144 -165 138 100 9 70 -89 61 173 119 -135 16 -99 -313
7076 -313 -186 -83 157 -61 -229 114 8 10 -21 -238 366 147 -83 -81 -103 -118 81 -89 -93 -97 -111 -57 160 -238
7100 -238 99 -52 -43 -16 -196 59 -238 179 81 11 -126 -77 353 266 -171 -43 218 39 228 197 260 -130 -48
7123 -48 -79 -145 43 -46 84 23 118 132 -139 44 -4 264 66 73 -129 -179 -48 -365 79 80 -80 -75 -146 -104 54 160
7149 160 193 97 -44 46 123 -201 -126 -220 79 -1 -113 -182 -68 -16 148 -211 144 95 47 -26 268 308 157 -146
7173 -146 17 32 0 -80 10 -69 10 116 -69 310 28 1 58 -413 155 -137 -31 32 -207 60 40 -3 -49 157
7197 157 -83 225 -26 -298 -114 74 -127 -109 -142 13 193 -27 -241 -79 23 -93 -139 -162 -191 -202 266 108
7219 108 76 66 82 58 155 -45 17 -39 -35 -262 170 -29 66 87 314 -11 -7 -99 -77 -141 -139 8 110 -58 181 -38
7245 -38 -56 222 356 135 -135 270 -105 -278 -31 80 167 -106 137 -231 256 -55 84 -87 -136 -160 -35 203
7267 203 -22 174 193 220 -51 -200 -276 -191 203 -206 25 -40 -127 202 -19 -69 39 -107 -84 155 105 166 -344
7290 -344 161 37 -85 146 37 58 123 -84 -130 0 -171 81 50 -308 191 -241 -109 -7 39 -85 -57 -208
7312 -208 166 55 3 158 129 -4 26 -201 27 -89 123 49 115 -114 -76 196 199 -92 133 116 -41 123 -114
7335 -114 -116 48 -370 -27 41 -63 213 144 -84 67 127 -27 -47 29 -18 89 36 198 -79 182 -42 315 -222
7358 -222 129 129 -182 157 -4 248 29 49 39 -162 -117 46 -2 -7 -103 -117 -265 -164 -44 -108 58 -101 13 189
7382 189 -2 161 236 -85 42 -81 107 -13 -186 45 -92 -62 -13 -150 94 84 -103 -123 137 -82 -7 1 2
7405 2 -29 -299 -69 99 -72 0 35 152 -135 -147 -97 -202 38 -179 125 84 -93 39 -50 -84 -45 43 -125 99
7429 99 -84 -133 -108 -165 403 -348 -213 10 -54 -255 -311 -9 -258 -20 82 -25 117 -51 83 371 317 95
7451 95 104 322 -24 80 -85 -127 111 18 125 98 -35 -102 -301 142 184 -71 82 193 -175 146 142 179 -107 21
7475 21 6 -233 -70 -53 67 184 -51 72 104 -143 117 -93 42 -353 -196 156 -195 67 88 -330 220 -100
7497 -100 -343 321 -31 -97 60 20 -74 300 51 24 -41 78 -85 92 48 -139 58 95 37 121 -64 153 -217
7520 -217 -98 145 -258 124 -105 -30 -37 -52 0 -169 -27 56 165 192 143 76 -49 -21 155 -34 -366 167 112 -6
7544 -6 23 -31 -174 -54 127 -17 62 17 209 -245 -116 94 178 363 -112 -138 -70 32 52 116 64 20 -173 9
7568 9 60 74 -5 99 -80 -60 112 -72 -55 -103 -150 187 147 -150 6 -89 23 26 166 50 63 43 162 59 353
7593 353 19 89 -261 43 46 -148 -97 78 195 233 178 -12 -130 -74 -59 -131 263 45 -107 100 -73 -80 -6 -159
7617 -159 -145 -92 155 -217 -15 -242 -29 139 -10 -260 -2 -72 -41 286 193 89 4 -95 51 -149 59 -260
7639 -260 -159 70 140 105 -64 15 -10 296 -60 -1 -136 -60 62 100 370 257 -53 -66 -99 -224 -212 -32 -74 1
7663 1 18 -76 21 34 -29 -485 115 -211 -139 -30 87 -16 396 -226 159 -63 -25 226 -308 -3 32 -146 253
7686 253 -53 -160 13 241 73 12 -3 -224 -324 -64 -18 -87 86 21 95 -13 182 -59 -86 76 -90 -58 -90
7709 -90 -15 132 -43 342 -22 73 84 370 -43 57 -176 -9 -317 -51 130 -116 108 -79 -96 106 -84 -63
7731 -63 30 192 -149 103 38 -126 -84 -58 -158 -241 139 -167 55 -38 307 203 -475 3 -125 -159 -47 49 -109
7754 -109 -75 -113 -296 -195 -14 -50 -122 -104 -236 44 45 -42 -192 -155 183 -225 236 -57 110 -63 -37 104 133 -308
7778 -308 7 495 15 58 -116 -106 -25 61 57 66 -41 40 -184 -270 -112 -133 -195 101 -8 25 -51 242 -96 -29 54
7803 54 -46 255 72 -93 92 -28 30 -137 -257 -75 -272 -130 87 9 -144 -189 -108 -61 -127 9 44 34 -97
7826 -97 13 -47 -9 -139 240 92 184 -49 51 -4 73 -181 -318 21 101 -184 -161 242 106 22 -183 -340 191
7849 191 9 11 -40 160 270 107 21 -84 -62 221 56 -149 -139 -59 105 -115 137 39 34 118 72 -14 -220 -64
7873 -64 -8 0 66 24 -340 216 272 112 15 167 320 -222 133 25 -188 147 -233 -140 217 -102 0 -107 -45
7896 -45 -40 35 -2 50 120 -223 -77 1 -77 -61 -327 -175 -233 310 55 -25 93 178 172 -73 -27 5 -158 132 -131 -164
7922 -164 -101 225 -275 -134 207 308 -80 -144 479 -51 -135 236 -39 -191 -136 -282 -338 -187 -136 -154 -103 -116 -75
7945 -75 85 -16 -34 69 201 70 248 -219 44 8 197 175 76 -78 124 156 42 51 -295 230 -160 43 51
7968 51 -326 -8 228 177 -274 -65 -255 25 -349 249 250 -108 -132 -148 49 379 71 301 241 -4 -150 -98 112
7991 112 184 227 -40 -150 -110 71 22 148 -175 -115 -93 -225 -147 71 93 -95 96 -279 -25 254 -122 78 379
8014 379 22 143 136 -217 71 -144 186 298 11 -185 -48 -228 113 225 -196 -35 -45 82 91 -13 99 -126
8036 -126 45 57 -83 -108 56 80 156 -333 12 -42 137 29 -118 127 -132 60 -27 3 116 136 157 -79 15
8059 15 -50 156 -169 87 145 188 19 124 112 204 18 -101 188 263 142 19 175 -88 47 80 271 150 -128
8082 -128 -115 -44 146 186 -93 -8 -233 258 -88 178 153 -17 -196 150 -54 57 -78 -136 91 236 66 -88
8104 -88 142 57 64 -236 47 37 -22 -31 48 -85 87 -62 -76 170 -203 84 -138 81 96 -123 -176 -17 -38 12 -52
8129 -52 -133 -84 -96 213 -35 -147 179 33 2 -39 -8 -130 -73 -131 -176 -22 85 -1 313 -138 10 38 -114 -21
8153 -21 281 97 58 -115 14 52 208 275 -53 99 128 -32 83 -120 139 181 -7 -190 -39 -224 -191 -92 -53
8176 -53 89 230 121 149 89 -282 106 -207 -84 16 28 -122 -68 -16 -144
8191a44
$$ Imaginary data points
##PAGE= N=2
##DATA TABLE= (X++(I..I)), XYDATA
0 0 0 0 0 0 0 0 0 0 0 0 0 0 1 -8 8 -8 8 -16 16 -16 24 -25 32 -40 46 -53 61 -72 80 -93 105 -121 137 -157 177
35 177 -198 222 -249 278 -310 346 -383 427 -472 523 -577 637 -702 775 -852 939 -1035 1141
53 1141 -1258 1391 -1542 1710 -1905 2132 -2399 2720 -3113 3609 -4257 5144 -6436 8505 -12373
68 -12373 22149 -108034 -144434 -25114 -79444 -60812 4575 65560 66314 72916 60668 74674
80 74674 93237 67936 -8563 -14203 29825 15359 -49976 -51607 -20842 -19380 -43611 -58125 -53987
93 -53987 -24785 -7975 -23888 -35364 5798 59708 58121 27864 49677 91031 77269 26241
105 26241 27 1655 -6731 -47917 -89721 -90713 -57081 -38443 -55092 -52382 10587 65076 51702
118 51702 33991 61528 83404 60453 17613 -4964 -2445 -1092 -28562 -63720 -59187 -19351 -8809
131 -8809 -38427 -37394 6821 25733 5480 -4930 14298 39677 39515 14985 2082 22275 40319
144 40319 15871 -22948 -17153 6958 -12429 -50791 -49594 -23420 -12814 -22499 -28900 -7660 31463
157 31463 45017 26754 22793 50419 59365 20985 -12544 -6794 -519 -23302 -51289 -56051 -34028
170 -34028 -12148 -18147 -26856 -1163 36520 39106 15454 15466 39665 40868 10311 -11432 -5136 6969
184 6969 -3293 -29277 -34685 -11480 1128 -17318 -31986 -13564 12795 7576 -12571 -4282 24365
197 24365 33380 17668 7138 18366 33689 23224 -6276 -16622 -2946 -4067 -33460 -51616
209 -51616 -33250 -11520 -15506 -23582 -7413 23238 39936 31518 21087 32891 46053 26915 -7663
222 -7663 -16546 -4546 -9595 -36086 -46346 -27545 -8913 -10454 -18990 -8441 18190 29080 12890
235 12890 2817 19053 33429 18232 -4372 -1574 15022 11687 -9521 -19446 -9360 498 -11545
248 -11545 -31686 -29291 -7836 -2296 -16234 -16577 9622 30908 25245 14423 23066 37815 33203
261 33203 8152 -10234 -6998 -4744 -24308 -46212 -40302 -17044 -9890 -18988 -13119 13849 31864
274 31864 25165 13660 18966 31142 24885 -38 -12844 -2933 4566 -11359 -27636 -19014 -387
287 -387 -2151 -17789 -18300 -1106 9817 831 -10112 -589 19993 22011 7019 4166 21659 28369
301 28369 9889 -8798 -7237 -203 -11146 -31368 -36070 -20593 -7536 -11817 -15938 2294 28004
314 28004 31058 17191 15961 28852 28431 6730 -12193 -11775 -5466 -13428 -30008 -30610 -11854 1682
328 1682 -6131 -12115 3161 21096 17535 2482 2271 15276 18759 4716 -6798 496 12931 7217
342 7217 -10591 -14083 -1164 1402 -15330 -26671 -15335 -844 -3466 -12400 -5671 15138 25858
355 25858 18519 10645 19741 29163 16859 -6069 -13866 -6450 -9686 -27084 -35058 -22300 -6627 -4986
369 -4986 -9454 -608 19870 28615 17290 7814 16558 23037 9805 -8595 -10747 -1018 -2006 -15671
383 -15671 -21621 -10989 1728 -2381 -13956 -10247 5778 9858 -1774 -5931 7642 19267 13194
396 13194 2458 5314 16958 15971 90 -10998 -6002 -717 -12035 -27087 -23264 -7536 -3151
409 -3151 -10303 -8334 8868 22804 19967 10705 13195 22523 18748 -449 -12268 -6670 -2756 -14205
423 -14205 -25191 -19006 -4365 -922 -7683 -6765 6992 17600 11442 836 4452 15387 12863 -1355
437 -1355 -6449 2859 7973 -1949 -12604 -8585 1392 -53 -12119 -16236 -4848 3479 -2667 -9206
451 -9206 380 15315 16495 6520 5437 14965 17977 5586 -8204 -8844 -2933 -7763 -21094 -23160
465 -23160 -9519 26 -4224 -6858 5056 19038 19040 9182 6565 13400 14435 1412 -11213 -9014
479 -9014 -1324 -5403 -16314 -15405 -2470 3601 -2514 -7712 -514 9965 7861 -1847 -2758 7855 12566
494 12566 4047 -2708 4063 12621 6967 -5534 -8209 -1937 -1308 -11701 -19655 -13168 -2380 -2296 -8009
509 -8009 -2209 13589 20854 13233 7405 12889 16996 8455 -6071 -11481 -6999 -7086 -17018 -21976 -11892
524 -11892 753 611 -4541 1049 13106 16462 8559 2098 5911 10785 4615 -6534 -6843 2104 3577
539 3577 -5859 -11071 -3789 2708 -2207 -11105 -9490 -463 1962 -3955 -5638 4312 14188 11678 4350
554 4350 6491 14736 12610 -598 -8744 -6138 -3756 -11307 -19753 -16317 -4936 -266 -4259 -3291 9300
569 9300 18304 14187 5525 6518 12136 8478 -3186 -9199 -5043 -922 -6854 -13754 -9593 1408 3033
584 3033 -4265 -5971 2317 7923 2929 -3152 65 8314 8319 1082 -1245 5962 10253 2961 -6465 -5750
600 -5750 -275 -3110 -12029 -13811 -6057 442 -2368 -4898 1930 12841 14247 6707 3681 9390 10635
615 10635 819 -9028 -7815 -3257 -5699 -13130 -12543 -2892 3873 785 -2691 3293 11821 10915 1717
630 1717 -291 5290 6751 -806 -6957 -3307 2613 774 -6782 -7293 38 3197 -2957 -8362 -3605
645 -3605 3538 2192 -2991 -1620 7183 10900 5207 821 4573 9452 4747 -5072 -8295 -4035 -3773
660 -3773 -10187 -14451 -7938 990 1179 -2098 1649 10937 14457 8738 3202 5683 8819 2181 -7275
675 -7275 -8895 -3714 -2778 -9225 -12066 -5145 2265 1756 -2948 -727 7116 8667 2596 -1329 3515 7544
691 7544 4010 -2393 -1965 4011 4426 -2600 -7045 -3528 133 -3794 -10315 -8329 -1139 1707 -2293 -2405
707 -2405 5276 11934 10035 4054 4832 9258 7134 -2096 -7692 -5797 -3307 -8010 -13351 -10136 -1401
722 -1401 1424 -1533 -950 5771 11443 7916 1934 2536 6931 4850 -2958 -5847 -1829 1619 -2526 -7400
738 -7400 -4971 950 1609 -4296 -6015 -253 3858 -32 -3717 -8 6916 7556 2499 1581 5666 7772
754 7772 1993 -4956 -5442 -1735 -3931 -10020 -10845 -4350 1095 -266 -1631 3137 9970 10098 4529 2366
770 2366 5621 5898 -909 -7341 -6178 -1915 -3113 -7710 -6839 -223 3817 1044 -1745 1334 6367 5006
786 5006 -824 -1973 2944 5038 406 -3403 192 4596 2693 -3368 -4721 -831 74 -4719 -8542
801 -8542 -4786 854 928 -2157 72 6826 9711 5737 2843 4086 6390 2209 -5406 -7460 -4444 -3498
817 -3498 -7972 -9912 -4520 2321 2509 84 2181 7875 8999 4269 507 1954 4248 988 -4982
832 -4982 -5314 -904 276 -4067 -6134 -1872 1961 175 -4075 -2629 1883 3730 -90 -1526 2647
847 2647 7065 5320 1038 1354 4825 3829 -2206 -5596 -4123 -2274 -4923 -8653 -7045 -726 1892 -129
863 -129 -242 5521 9734 7326 3017 2756 5399 3146 -3282 -6370 -4311 -1891 -4404 -7376 -5171 507
879 507 2083 -1105 -1758 2765 5915 3265 -685 1129 4452 4099 -273 -2056 1127 3016 -393 -4871
895 -4871 -3634 -455 -1394 -5685 -6162 -1963 1681 250 -1520 1813 6730 7033 3551 1692 4055 5111
911 5111 -244 -5208 -4702 -2057 -3291 -7332 -6480 -2024 1460 782 -944 2374 6800 6134 1957 594
927 594 2798 3529 -737 -4077 -2752 272 -461 -4177 -3770 -170 1509 -998 -3228 -793 2664 1970
943 1970 -1622 -1025 3602 5060 1922 -215 2084 4435 2025 -2962 -4043 -1772 -1367 -5194 -7185 -3944
959 -3944 667 574 -978 1499 5998 7442 4509 1692 2810 4035 666 -4542 -5746 -2961 -2012 -4991
975 -4991 -5707 -2005 1792 1491 -200 974 4437 5115 1943 -592 1059 3322 1534 -2078 -1891 1676
991 1676 1428 -2062 -3703 -1534 4 -1728 -4944 -3739 -229 1451 -493 -688 3518 6792 4805 2123
1007 2123 2514 4349 2590 -1963 -4870 -3692 -2603 -4308 -6841 -5058 -216 1733 344 469 4383
1022 4383 6824 4273 1053 1664 3087 2014 -1869 -3871 -1788 79 -2050 -4299 -2797 593 510 -2272
1038 -2272 -2522 371 2102 945 -688 399 4116 4268 1448 714 2945 3663 -76 -3727 -3358 -1493
1054 -1493 -2768 -5513 -5364 -2030 820 467 -362 2367 5701 5911 2156 1188 3360 2961 -1049 -3944
1070 -3944 -3320 -1534 -2218 -3985 -3766 -435 1531 345 -1329 910 3728 2534 15 -334 2077 2610
1086 2610 812 -1147 -29 1757 754 -2157 -2805 -627 -188 -2658 -4425 -2379 493 415 -841 405
1102 405 3410 4861 3366 1119 2203 3461 823 -2937 -4072 -1925 -1773 -4155 -4661 -1843 1009 1052
1118 1052 295 1228 4191 4886 2169 356 1213 2386 76 -2920 -2913 -620 -666 -2441 -3198 -1176 812
1135 812 63 -1843 -1066 1797 2487 218 -739 1887 3632 1936 153 694 2212 1436 -1384 -2817 -2068
1152 -2068 -907 -2777 -4616 -3086 -37 935 -247 -41 3242 5110 3825 1976 1450 2833 1538 -1663
1168 -1663 -3674 -2394 -1187 -3216 -4421 -2659 227 736 -391 -160 2278 3544 1907 253 978 2415
1184 2415 2026 -537 -1416 629 1176 -899 -2241 -1920 -535 -930 -2859 -2927 -1083 668 293 -861 1256
1201 1256 4070 3897 1715 1356 2674 2299 -431 -2852 -2643 -1638 -2427 -3855 -3981 -1067 1004 98 -413
1218 -413 1980 3929 3301 1106 753 2050 1802 -167 -2067 -1601 146 -526 -2462 -2150 -77 964 -925
1235 -925 -1758 -231 1123 918 -805 -73 1718 2650 1125 320 1367 2594 837 -1528 -2198 -980 -1137
1252 -1137 -3140 -3952 -1806 -126 133 -293 726 3104 3998 2235 1117 1592 2108 76 -2463 -2582 -1412
1269 -1412 -1236 -2510 -2771 -903 1281 951 -224 453 2394 2452 278 -272 525 1504 678 -1129 -886 665
1287 665 1009 -1126 -2068 -814 537 -1045 -2468 -1967 107 495 -273 24 1959 3353 2254 1015 1323
1304 1323 1971 1089 -1455 -2500 -1670 -1414 -2166 -3435 -2104 359 1242 14 518 2467 3447 2220 479
1321 479 899 1435 655 -1291 -2034 -986 -185 -1410 -2134 -1304 225 534 -1066 -879 418 1474 776 -337
1339 -337 643 2207 2092 653 524 954 1280 -251 -1628 -2013 -941 -1455 -2929 -2349 -603 298 351 154
1357 154 1287 3357 3051 1631 840 1561 1659 -547 -2282 -1791 -560 -1306 -2613 -2031 -346 722 145
1374 145 -468 695 1770 1619 208 49 1005 1136 23 -907 -30 842 319 -1139 -965 -254 -144 -1319
1392 -1319 -2286 -1123 188 317 -670 164 2153 2689 1370 415 1325 1705 446 -1435 -1713 -1000 -1203 -2220
1410 -2220 -2584 -1188 699 355 -119 927 2219 2227 1180 48 854 1042 -110 -1978 -1642 -143 -337
1427 -337 -1276 -1557 -223 821 443 -440 -89 825 747 -98 -665 502 1440 816 -136 81 630 784 -734
1446 -734 -1518 -856 -291 -1269 -2088 -1374 -371 403 76 227 1892 2607 1765 775 765 1189 240 -1213 -2367
1465 -2367 -1238 -855 -1397 -2094 -1318 591 973 179 444 1550 2249 862 -167 268 591 486 -734 -596
1483 -596 -246 584 -476 -1303 -870 99 -322 -1031 -1186 -85 741 96 -24 801 1970 2271 951 381 1194
1502 1194 1310 -524 -1686 -1454 -923 -1365 -2243 -1640 -131 459 573 466 1365 2239 1985 648 83 702
1520 702 807 -783 -1511 -912 -295 -264 -980 -849 177 337 -269 -569 75 865 617 -367 -234 860 1212
1539 1212 289 -20 629 1165 291 -892 -1366 -617 -625 -1585 -1768 -530 109 324 -6 398 1792 1851 1242 422
1559 422 727 801 -396 -1555 -1473 -748 -761 -947 -1340 -138 922 516 -60 443 1522 1373 -28 -459 244
1578 244 515 -290 -982 -757 574 290 -322 -638 62 184 -262 -618 -642 417 573 82 -176 691 1392 1007
1598 1007 308 234 590 487 -733 -1418 -996 -207 -799 -1643 -863 454 820 193 408 1465 1837 927 101
1617 101 107 477 88 -1109 -1482 -910 -451 -517 -901 -473 502 531 -285 98 468 1215 542 -110 150 1144 542
1638 542 -274 -332 175 412 -264 -989 -748 0 -754 -1290 -1024 252 438 376 287 1108 1899 1494 610 245 647
1659 647 180 -610 -1487 -1278 -954 -1017 -1314 -1076 -123 798 424 132 728 1448 729 8 -6 416 626 -455
1679 -455 -733 -596 419 -41 -854 -606 16 92 -456 -1144 -231 416 310 -3 160 1052 1296 880 311 678
1699 678 746 34 -947 -1126 -648 -733 -1210 -1476 -469 413 440 248 496 1102 1181 501 174 234 340 -417 -1247
1720 -1247 -1016 -474 -222 -750 -545 115 534 395 -173 223 780 391 -52 -418 140 308 -80 -545 -147 484
1740 484 457 -195 -550 -275 -42 -554 -939 -498 37 169 414 345 752 1290 938 58 214 315 -183 -714 -1129
1761 -1129 -661 -321 -566 -1134 -414 730 728 561 773 1196 1351 509 36 119 202 -85 -648 -886 -180 -15 -514
1782 -514 -600 -130 258 226 -461 -386 348 519 291 -141 532 783 685 245 112 331 -64 -461 -1120 -1063 -570 -981
1804 -981 -1091 -661 -31 470 586 423 935 1315 763 265 103 241 16 -546 -1175 -926 -429 -572 -747 -615
1824 -615 91 491 141 -64 187 748 424 -309 32 470 465 128 -95 207 141 49 -697 -772 -251 -404 -963 -1128
1846 -1128 -244 25 182 -15 453 1245 1165 590 14 239 258 6 -861 -1094 -454 -595 -563 -640 -44 461 451
1867 451 433 701 696 780 3 -110 -64 189 -119 -793 -457 -247 200 -481 -379 188 171 -170 -241 -317 123 97 -288
1890 -288 270 400 671 552 91 401 437 230 -362 -600 -629 -360 -335 -1037 -271 206 497 235 318 1007 1010 485
1912 485 218 56 -143 -235 -647 -1044 -593 -399 -335 -799 -153 441 258 191 133 369 508 125 -274 20 277
1933 277 -14 -330 -482 -145 94 -522 -518 -389 -154 -162 -538 -196 143 333 261 398 420 935 924 240 -12 -68 130
1956 130 -518 -688 -860 -714 -514 -831 -398 313 417 318 286 656 679 480 209 -33 38 81 -199 -922 -152 166
1978 166 -385 -541 -253 -21 208 -154 -330 -24 156 491 42 498 876 761 82 178 352 189 -560 -775
1998 -775 -976 -569 -370 -470 -458 92 39 507 234 565 812 1039 440 -33 335 229 -33 -696 -439 -122 -320
2019 -320 -553 -183 39 407 330 154 92 323 410 -104 -47 175 244 189 218 -48 172 195 -35 -392 -277 -159 -277
2042 -277 -661 -313 115 122 -153 -90 526 915 625 215 252 211 -11 -506 -596 -444 -229 -390 -366 -441 -44 531 234
2065 234 375 751 818 625 -32 -126 146 -158 -503 -488 -241 33 -258 -57 33 78 295 129 -104 207 180 -11
2087 -11 70 113 554 301 -19 -157 49 72 -213 -505 -509 -286 -194 -583 -167 143 337 506 164 518 520 592 127
2110 127 -176 -1 30 -684 -656 -323 -220 -483 -247 -242 51 256 225 -190 483 513 478 404 -24 81 347 -231 -336
2133 -336 -136 14 155 -389 -463 -211 -311 -330 -496 149 180 588 465 435 609 718 38 -107 190 98 -263 -564
2155 -564 -665 -423 -455 -639 -379 46 273 237 116 316 634 621 392 88 257 -351 -60 -424 -536 -230 133
2176 133 -484 -196 -166 503 -100 12 56 -184 37 77 52 7 435 301 142 242 100 159 -169 -213 -283 -484 -380
2199 -380 -466 -52 345 -8 189 275 423 412 186 -144 82 -197 -137 -360 -526 -247 -223 -538 -419 -224 70 22
2221 22 206 179 149 272 -109 -47 78 259 -15 -44 -24 71 -62 -288 -124 219 212 -100 32 -46 294 303 198 -161
2245 -161 273 352 234 204 54 103 -333 -384 -372 -210 -210 -348 -393 -186 182 474 348 -54 636 10 400 107 -168
2268 -168 -85 -37 -148 -373 -261 -334 92 -58 -10 62 19 -405 -48 206 247 275 23 -231 359 233 91 127 -14
2291 -14 -288 -182 -77 -352 -89 -229 -307 -247 -131 196 179 248 317 434 284 50 -65 52 -33 -397 -349 -338 -510
2314 -510 -143 -113 -172 -11 368 172 -57 347 505 129 -5 -126 -18 19 -216 36 15 -124 -211 -149 -338 -293
2336 -293 -145 21 42 11 -89 251 212 194 406 306 41 144 -130 233 -154 14 -165 -344 -39 -409 -385 -118
2358 -118 -1 21 300 180 96 509 402 120 88 -27 93 -214 -76 -347 -146 -81 -226 103 -21 -81 142 289
2380 289 21 197 -55 -174 40 227 175 129 101 30 94 -165 -332 -253 -78 -89 -332 226 153 313 92 164 185
2403 185 173 165 138 -120 53 -155 -380 -329 -278 -121 -30 -345 -243 118 275 266 403 234 -92 183 149 30 -148
2426 -148 26 -199 -168 178 -502 -164 -200 -42 -135 -55 190 10 -129 -51 -70 242 253 -12 265 284 178 -185 -42
2449 -42 -106 -415 -235 -268 -121 -154 -133 137 61 204 247 135 221 144 -169 242 -40 -280 -14 -272 -335 -40 52 -41
2473 -41 -53 -215 -57 62 -139 140 -3 23 -100 132 348 36 -54 223 95 62 -154 -310 -149 -152 -75 57 -235
2496 -235 -152 107 141 -147 498 -95 264 17 25 309 109 107 -77 48 46 -470 -211 -27 172 55 -21 268 173
2519 173 89 -48 146 100 -86 -25 120 -86 -152 39 98 -283 -131 280 -119 38 208 -135 -230 36 32 133 283
2542 283 25 -20 -51 -17 60 -248 -182 -59 -103 -44 101 -338 162 37 163 344 195 127 365 150 37 345 -28
2565 -28 -42 -452 -170 3 164 -241 -10 -10 54 -5 200 225 156 8 -206 116 -205 96 -42 -117 94 35 106 -148
2589 -148 -195 -116 -124 -157 -132 -63 -65 -154 156 140 273 353 213 173 184 -147 -9 -234 -133 -124 -111 98 88 -14 -5 381 115
2616 115 116 294 303 274 -40 92 38 26 -78 -12 76 -116 -215 120 -63 433 -135 -295 -96 -42 -30 -79 39 120 71
2641 71 -101 28 51 -47 -184 -164 132 9 -86 -69 -39 -205 -13 169 -155 284 254 143 263 257 -78 310 -86
2664 -86 -3 -165 21 -49 -118 25 105 206 -109 41 49 183 -4 346 244 77 97 52 -123 -45 -53 12 -160 -149 -90
2689 -90 112 -262 86 86 69 133 -77 -153 132 333 -273 -103 227 80 -40 -61 48 151 35 -160 -30 61 34
2712 34 186 9 -33 -48 84 -189 8 51 -4 12 -336 -119 -3 302 -18 -386 142 -11 -49 -4 -116 -13 10
2735 10 -51 51 280 -144 108 265 -128 25 300 -25 -155 -191 53 24 -420 -31 69 172 -98 -135 65 260
2757 260 228 59 -92 223 -181 -187 -246 -255 -145 -51 -185 187 -46 172 18 4 -64 6 154 -18 108 63 -43 -28
2781 -28 174 -146 -67 -80 -155 165 365 -265 -2 -62 -247 -141 95 0 -119 128 253 36 97 -24 -199 114
2803 114 -11 -114 -178 -396 -290 -155 224 267 22 258 -255 90 268 30 106 38 -148 150 -169 -163 -231 75
2825 75 -65 -7 146 270 -136 -182 38 -66 19 111 -172 -62 -114 -105 133 -4 -97 74 -104 -159 8 120 -140
2848 -140 -57 202 -68 76 -207 -131 150 -47 106 190 -76 -150 -62 -209 -132 -106 -260 111 -90 -49 91 109 -225
2871 -225 -4 51 -361 70 -158 42 89 -5 167 159 359 -367 79 -363 -189 -209 -62 -38 -147 -35 -311 165
2893 165 51 218 196 -42 104 -138 114 52 -28 -154 132 -55 -150 -236 -129 7 121 90 164 127 252 -226 -64
2916 -64 -159 138 166 -131 36 169 -18 -5 -213 250 -371 146 -249 -113 151 280 6 42 39 66 0 36 271
2939 271 160 -11 -190 -238 119 31 -151 -4 -145 -92 -150 -53 -49 66 215 104 -94 55 339 204 138 78 -315
2962 -315 128 -19 66 38 -131 -77 -116 -177 12 246 127 -123 -304 24 -93 102 -215 497 52 202 -15 -273
2984 -273 -189 39 63 -5 274 -109 -36 35 -10 22 20 139 -10 -18 337 120 112 -95 -163 -99 13 -235 12 10 -284 144
3010 144 -147 180 -215 25 127 139 15 -2 190 -306 7 90 244 -88 133 177 -29 -70 44 -297 205 51
3032 51 -12 -27 327 -262 -161 169 54 -82 -12 -39 33 64 -119 -235 88 159 -91 -78 -70 167 57 50 117 176 -192
3057 -192 -260 -97 77 -75 227 145 -203 -44 16 -153 51 -230 -91 181 178 -139 -185 143 241 127 137 172 73
3080 73 -111 -76 -213 105 -77 -165 -28 -124 147 -119 -45 70 97 61 -86 -190 132 130 -81 -25 -283 -71 50
3103 50 -153 -291 50 252 95 -144 -43 117 12 51 -66 -154 -66 -63 85 -9 281 76 -121 100 204 -218
3125 -218 133 -83 -101 -131 -114 -41 -187 211 281 -14 -140 229 95 -91 -354 -55 -189 -157 -243 -122 -97 13 22
3148 22 -167 155 99 282 117 -57 123 37 -33 -226 -294 274 66 -162 -297 98 2 -247 80 140 155 2 -107
3171 -107 -235 -60 167 -128 -56 -63 307 290 119 -122 -337 -11 -146 -148 -239 21 69 -50 -38 64 -48 -259 -17
3194 -17 172 -45 -136 63 -96 -125 -82 -62 -11 -95 116 147 -332 24 -50 115 -3 -282 -152 -199 -189 -108 9 167
3218 167 -14 163 -209 -353 -53 28 -45 3 -6 -124 1 93 163 -134 -56 2 -176 186 240 56 -205 104 38 118
3242 118 106 -78 -165 74 -37 18 21 179 -82 201 230 11 44 -180 -269 6 -93 95 135 -172 -167 -31 80 -239
3266 -239 -10 21 151 -69 243 106 -5 112 87 74 149 67 -302 -87 64 237 -29 -157 157 41 28 -8
3288 -8 -42 43 -77 -193 255 302 253 188 153 -86 -55 26 53 -12 -86 193 22 -25 -30 53 -51 30 -180 34 135 218
3314 218 63 -374 313 217 -23 -248 99 39 -139 -54 209 -59 108 -243 -60 -52 100 117 -168 -187 32 -4 -285
3337 -285 6 13 70 2 -224 -295 -100 199 -72 -335 57 -23 -141 -146 54 -76 14 61 -21 171 51 -351 -35 -417
3361 -417 181 -122 -51 173 106 87 -290 -33 -154 5 -60 -167 65 61 15 63 39 104 -28 -206 -310 -99 -94 257
3385 257 -86 -149 -18 46 198 -15 282 -233 64 -71 -42 -137 193 -148 -143 -211 -4 -19 -32 -188 147 250 131
3408 131 -9 33 70 241 138 -115 260 67 -53 -176 -238 -87 51 66 -307 -212 -52 133 218 -271 164 123
3430 123 330 -153 -77 -9 96 64 161 256 22 -56 -97 -78 177 74 6 120 125 -108 -95 186 -18 145 -22 -149
3454 -149 -89 -175 -97 50 -52 -259 141 -42 -222 -159 -259 16 3 -39 -159 40 -125 -97 157 -4 -79 -198 -64
3477 -64 40 308 -406 -131 -86 146 24 80 -131 -36 88 30 167 209 30 8 271 66 -28 -251 -196 120 189
3500 189 -342 53 -128 31 24 218 277 17 -109 -15 207 -144 -98 119 150 210 93 -222 26 54 -292 -126 110
3523 110 370 95 10 -86 429 -280 -160 130 144 378 5 468 53 22 76 47 -141 -103 279 -318 -278 36 129
3546 129 217 41 -149 -228 -86 -170 -43 -243 265 243 -31 78 92 -141 -109 -305 -23 68 155 -200 279 -202 49
3569 49 192 22 138 -50 -384 68 -103 79 -101 -67 -467 111 -66 86 147 -127 285 -69 121 121 -36 72
3591 72 -250 184 224 -273 -90 -81 -366 77 149 -336 -127 -406 -184 192 -353 -47 109 102 -13 245 -124 18
3613 18 44 -194 -20 -176 -82 -116 -117 -307 272 146 6 -122 21 283 73 -133 69 -75 -13 -44 -106 -66 -137 -99
3637 -99 165 -228 -52 -4 289 48 -277 -92 -27 -254 -298 225 -54 129 -144 50 27 -266 -115 -125 216 25
3659 25 146 -17 110 80 122 -40 164 -106 144 154 130 -108 -81 96 85 -191 114 -201 -36 -101 -21 -12 -42 -40 156
3684 156 -81 123 68 41 15 240 17 -287 -125 -96 46 142 -136 73 -171 -133 -120 168 42 12 9 108 56 -50
3708 -50 -127 -235 96 60 163 -138 124 -119 -123 -60 218 -189 -13 69 -260 230 175 44 147 -170 -257 185 -144
3731 -144 -1 -102 -42 201 173 60 275 -222 219 53 -72 26 198 -8 -43 132 220 85 -58 140 -143 105
3753 105 31 -89 -258 368 -149 -9 -394 213 -93 -161 175 63 113 128 97 46 90 31 -162 131 17 74 80 85
3777 85 215 -245 3 243 60 -237 49 227 8 -39 149 19 93 -301 -2 122 142 -62 -122 -66 -3 -174
3799 -174 -254 -182 120 155 115 176 126 22 33 -154 29 68 62 -552 -183 -19 -86 -185 -83 -239 -51 -169 75 34
3823 34 286 180 -230 -124 133 -53 241 -351 188 -122 -179 149 -346 -28 -139 308 -42 -154 181 -52 -47
3844 -47 46 -218 182 -55 -127 -121 147 331 -7 15 88 -191 -7 118 256 12 -93 97 -236 98 343 -98
3866 -98 -150 116 121 -148 56 20 104 128 47 -415 130 -79 -101 -44 -53 -70 -97 -22 -49 301 -28 59 -52 249 -259 -143
3892 -143 239 -6 -95 -64 -25 -332 -49 -105 -39 -191 -117 143 104 -40 108 -25 1 -61 -39 -93 -80 190 -23 168
3916 168 94 110 17 -58 185 -270 178 150 -265 408 96 174 -127 121 165 157 98 -59 -294 -93 -96 -215 -71 116
3940 116 20 -115 212 69 95 35 102 -4 -12 -55 -104 205 73 42 -32 -50 -173 248 298 -194 -79 27 144 68
3964 68 61 32 -29 -18 -165 -26 -163 82 162 -151 -164 -19 -68 110 24 -90 32 -132 -128 -53 -126 93 131 239 -128
3989 -128 -61 0 -98 -116 -131 317 -26 274 31 250 -51 -148 15 217 164 66 96 115 -210 26 -226 8 296
4012 296 -236 -85 75 209 -70 -1 -30 -65 146 -73 -323 -144 -37 74 138 -230 141 67 163 133 -199 -156 67
4035 67 -112 -267 -127 -126 103 200 -178 158 85 -87 -33 -151 -11 54 -183 56 28 -116 27 -7 -72 49 213
4058 213 227 -71 400 -106 -263 67 -138 -53 202 114 -53 1 80 -51 -328 232 -24 -34 257 56 -19 -167
4080 -167 96 105 47 81 69 23 3 -12 -43 24 51 -239 180 43 68 -161 148 160 -5 31 -143 298 88 -3 -52
4105 -52 -7 -90 -492 100 87 -117 78 -30 126 -150 -62 145 45 70 -137 22 165 -147 -101 166 168 53 -113
4128 -113 -282 251 -98 191 -69 -11 -153 -82 -75 -47 117 12 117 51 64 -198 -52 -281 -173 -143 -73 33 -167
4151 -167 386 14 -16 -72 -34 204 -230 -166 84 22 174 206 -113 -115 -177 -253 -149 163 22 -164 -108 -3 -190 -163
4175 -163 18 178 72 115 157 149 61 -182 -174 -149 -225 128 154 197 33 52 135 11 133 24 111 -96 -18 -360 -98
4200 -98 73 -313 24 113 101 -169 -48 -275 -403 39 252 -120 217 48 295 -99 -154 -54 179 33 -108
4221 -108 -95 50 -84 -163 -40 -239 -73 -285 -58 120 -161 -44 84 -23 228 233 116 -124 -86 -30 17 -243
4243 -243 -164 -146 -133 49 -60 23 -209 46 -56 -151 -162 -26 -92 37 90 66 -3 -88 -126 -30 196 -172 -89 -7 -163
4268 -163 28 -133 -25 21 -14 -176 -284 152 35 -75 -7 -117 175 101 260 -239 -137 74 169 -65 -213 69
4290 69 87 -22 239 29 -94 29 -179 -4 -61 163 -23 178 114 139 -128 23 53 -127 117 -38 55 -78
4312 -78 143 43 42 64 234 299 255 26 146 18 106 -101 -146 -84 124 34 106 160 -146 274 -10 -1 80 206 -35
4337 -35 -99 -211 40 103 -252 -404 58 -86 -223 -55 -110 164 181 19 -111 26 -65 159 -33 24 181 -267
4359 -267 -92 -20 3 80 -32 -78 -47 9 -75 124 1 10 98 25 -7 211 172 -5 -148 -34 -7 52 106 -126 107
4384 107 25 -301 90 -92 -82 -30 65 -138 -353 92 -174 -138 126 -289 -30 -248 -307 -139 -33 -22 -143 220
4406 220 262 -223 -179 11 229 0 -145 -58 173 -28 -136 -202 167 -8 140 -96 169 79 65 261 -6 230
4428 230 -337 78 127 118 178 -213 -115 3 155 -111 173 66 21 -51 -188 143 -111 79 145 64 -105 37 23
4451 23 79 -136 -56 18 97 26 -13 -241 -160 16 -161 -136 18 12 35 54 -23 19 62 200 -46 -92 230 -161 98 188
4477 188 -142 237 38 -236 301 173 -33 31 -173 304 -137 -187 -16 -43 42 2 -190 72 22 -54 40 237 92
4500 92 31 -145 76 -127 -178 -41 18 -295 -44 -148 222 -198 12 -80 322 153 272 -189 171 -194 81 -18
4522 -18 38 104 9 -80 -252 10 24 24 -255 -169 255 55 -156 190 167 5 -387 -205 80 188 -135 -62 -207 249
4546 249 -9 312 16 -43 359 -28 -151 -61 -159 96 131 -177 -21 -207 17 -115 157 361 4 -148 -209 15
4568 15 58 -60 22 -124 27 370 70 35 40 -81 -7 61 -106 30 -33 35 -142 -221 -9 -120 -168 -66 184 33
4592 33 186 80 67 -16 -36 -121 -98 -199 -40 69 114 -175 201 44 -22 149 116 -2 21 25 -160 -49 -76 -366
4616 -366 352 78 45 -241 145 161 16 277 67 159 63 -21 -5 -111 62 -44 -101 8 -27 -175 -299 -80 -67
4639 -67 -42 34 -33 57 127 282 32 -59 112 -41 -195 183 -152 -302 221 -73 -118 -7 -4 -52 2 -35 -112 -9 13
4664 13 -77 -156 -161 -167 176 53 -203 266 91 28 115 -65 76 -137 -401 -84 1 32 14 -113 -91 -7 300 -105 -95
4689 -95 -154 -203 -84 -110 6 -39 -61 94 -43 25 13 -387 -99 123 129 112 -22 -85 127 -159 174 11 157 370
4713 370 194 -22 -64 52 27 53 -48 2 -72 -191 -114 9 214 -64 -144 -54 -218 -137 157 121 62 51 313 -61
4737 -61 -247 296 -87 -276 -109 189 37 -155 169 -41 -34 -159 -258 70 179 14 -195 66 -37 -9 102 -166
4759 -166 -195 -21 21 -81 -17 156 -104 189 -181 125 -20 311 30 -56 -6 -1 38 -226 23 -129 124 -104 136
4782 136 -188 82 -224 -284 19 402 -81 -266 -65 212 166 234 -206 -54 -150 54 -127 -104 15 195 124 -106
4804 -106 146 87 110 135 -86 -5 188 -10 -261 150 165 130 198 -66 164 -123 172 -71 -11 238 -132 131 -77
4827 -77 29 159 -182 -5 -318 -99 -47 129 52 -216 -22 64 -62 61 -47 91 -65 -138 -83 225 337 -107
4849 -107 104 -80 57 197 -48 -123 140 -97 362 -246 129 -142 -137 34 69 -55 -101 248 46 14 -162 27
4871 27 -178 161 -144 324 262 81 -9 0 -165 7 -49 -72 36 32 110 -60 233 29 -2 14 101 148 296 3 21
4896 21 58 -24 -55 154 90 142 252 -118 11 213 126 -73 91 43 2 -186 142 -151 -273 -17 -175 26 95
4919 95 72 -138 103 9 114 -16 31 -256 239 -248 96 91 175 121 -123 -227 12 48 112 -127 -67 -394 53 -33
4943 -33 -78 -14 -39 67 -18 -323 -111 -49 93 -80 36 89 106 -152 61 118 -41 -242 -381 156 125 32 141 -31
4967 -31 93 -104 -99 -181 74 -31 -70 -125 -16 87 252 -44 535 97 -107 17 -13 239 -195 -46 -38 -188 140
4990 140 -66 -154 -88 -436 -60 199 166 -125 68 194 222 -85 -143 -41 -132 201 102 -113 -67 41 35 274 -13
5013 -13 57 -44 175 201 -117 44 233 -43 41 -124 123 206 147 114 234 -244 -19 57 285 -193 181 -226 63
5036 63 -14 -103 163 8 90 -278 -93 145 -22 -55 13 76 103 -82 73 -101 -61 -80 -318 -35 -156 103 -60
5059 -60 115 -70 58 156 120 169 -5 -85 219 71 -136 -189 156 -81 190 142 274 -9 -15 -39 -128 171 242 -294
5083 -294 24 -2 -87 195 -118 -83 93 -100 -3 -23 73 -115 18 37 47 127 349 0 -138 17 -206 61 -100
5106 -100 -261 -49 144 102 -210 365 -29 43 57 95 -36 -122 -5 84 39 51 0 93 -121 -219 71 19 -210 103
5130 103 -240 173 -414 -129 81 -447 16 -65 45 283 180 -55 85 -46 -106 -17 25 123 -141 23 298 33
5152 33 19 72 -114 -143 102 -10 136 -122 113 -59 -68 -128 27 252 181 -16 -153 62 22 -192 -40 -177 -125
5175 -125 -92 179 14 149 -36 42 52 -38 113 -41 169 -77 263 -44 273 -89 36 67 263 151 213 -238
5197 -238 -84 -247 -89 -45 73 -83 -132 163 175 346 182 140 -217 -123 -109 -69 39 -71 92 156 192 15 145
5220 145 77 179 -96 -115 106 -263 -215 43 -68 73 -245 147 -179 30 -12 -94 148 36 -274 197 248 -124
5242 -124 214 -24 160 121 -85 138 116 -47 136 -164 250 5 -89 -199 -174 -150 19 195 -140 110 68 232
5264 232 -27 -63 36 86 148 165 105 -59 98 8 -14 -4 -214 -45 220 -25 -112 5 -271 -86 161 -207 -311
5287 -311 -127 246 172 0 237 9 -60 -110 -34 203 86 -139 98 -122 -184 -179 -3 8 268 -127 -175 182 -165
5310 -165 51 141 74 168 -64 -67 154 54 190 -183 35 -119 151 4 80 -199 -118 125 -172 -154 -115 118 -138
5333 -138 -222 36 131 -395 155 -83 -276 -114 23 90 -100 -273 103 193 87 -243 5 145 -42 -67 -125 -107
5355 -107 24 -14 -190 -47 40 214 5 1 257 155 -23 24 -111 -159 -297 -56 82 151 -128 -200 -197 67 -26 -104
5379 -104 59 44 7 5 -17 6 -107 -44 84 -17 71 -131 -78 27 -176 86 -74 -16 -49 70 -68 34 2 7 390
5404 390 -69 -144 117 33 37 43 -60 -261 -14 -220 -108 -50 60 -45 -223 -98 -175 67 -214 -36 -231 -267 -152
5427 -152 311 -53 3 47 40 -150 119 247 -4 152 160 -75 187 20 -24 -79 -3 117 105 -62 323 119 -145
5450 -145 25 204 63 146 -122 177 50 127 -94 -148 -196 -35 332 197 3 33 46 -149 188 -203 182 18
5472 18 -1 -4 -196 93 127 320 210 -133 44 269 46 -113 141 -30 18 -61 -104 -98 -2 -68 -80 75 -82 45
5496 45 87 144 147 86 36 92 -115 -52 -23 361 -80 186 -160 -185 60 -130 137 107 -145 135 -79 298 29 36 -104
5521 -104 -110 237 16 -60 37 52 -180 33 29 -318 80 47 141 -62 3 83 249 110 -61 -47 -165 22 -153 -183
5545 -183 -69 336 30 42 -250 -86 -78 214 -22 -102 -145 -223 -341 -104 -208 -48 -99 275 79 -283 -214 -201 86
5568 86 -235 -138 -118 -25 17 -148 112 115 -58 222 137 -100 -177 -35 -213 -106 46 192 43 162 81 -201 -65
5591 -65 -99 -20 -158 -50 17 -31 144 -21 3 29 210 55 87 95 -161 353 74 40 7 -54 -148 71 -96 -62 -67 27
5617 27 -1 74 -66 100 -63 -59 -281 157 86 135 -79 -111 75 -41 -23 85 189 -76 -170 101 -31 12 38 55
5641 55 3 -210 137 -120 187 -152 -260 129 10 44 73 -122 53 247 -167 152 67 -120 -83 -79 -33 140 -212
5664 -212 -39 49 314 7 -370 24 -169 48 111 -112 -288 70 169 219 -112 191 -179 -62 196 121 0 -9
5686 -9 -10 165 -116 -89 105 19 225 56 -15 108 -3 109 36 45 -96 68 248 -16 126 -24 -206 14 -37 140
5710 140 267 -207 67 36 -44 115 101 138 174 47 189 -94 -65 -108 457 -4 -68 -18 66 498 78 264 75
5733 75 108 297 126 -68 -190 24 -150 118 116 -67 -128 149 263 -49 35 -41 66 -42 63 -171 -233 77 104
5756 104 188 -89 -113 146 -68 -123 188 497 -31 -111 150 57 236 -163 137 -70 116 -213 -310 164 196 -64
5778 -64 176 117 168 151 49 27 134 -154 -98 71 69 147 101 0 -18 99 101 323 -111 71 29 51 25 67 -207 286
5804 286 -14 -256 -35 91 -155 66 -90 -263 133 83 -56 77 168 -7 -79 -96 15 1 181 16 27 236
5826 236 -2 -301 -212 202 -29 -93 -58 -83 -44 155 -114 -272 -144 -59 -161 -165 231 13 -17 -306 110 -312 -111
5849 -111 -76 246 172 -58 21 67 219 -7 267 -80 -6 -135 243 196 -62 -166 197 127 192 -14 341 254 -101
5872 -101 246 53 159 -40 -27 348 -78 137 -48 55 129 0 -189 -115 170 -7 87 235 0 39 26 -156
5894 -156 104 -34 -136 -145 9 153 120 -18 40 -105 -156 171 -168 64 -14 61 108 58 -176 -80 340 -49 -194
5917 -194 253 -78 -53 21 55 -103 -112 -206 159 216 -172 -4 237 209 81 -181 -196 142 -105 85 113 225 -54
5940 -54 109 -50 222 67 225 71 -7 225 -213 -132 408 -24 94 -62 54 -4 16 -36 239 219 -62 -119 -100
5963 -100 -31 -118 42 57 -27 -15 130 -215 36 -115 -200 -321 44 -31 -5 -293 52 10 30 -55 -86 88 34 288
5987 288 -178 -23 161 110 198 -29 342 28 11 35 -133 -33 202 86 276 -233 249 -151 6 -103 -185 -36
6009 -36 -135 -272 -134 144 -258 -134 115 16 -281 74 29 137 -184 82 -109 206 132 -181 -186 434 -168 104
6031 104 112 128 107 77 -206 -177 -106 53 -140 21 -63 -222 275 128 71 126 301 16 165 156 182 19 121 -215
6055 -215 -156 -137 131 83 -199 201 -173 -67 28 -108 -221 50 116 -447 -3 -107 -224 -288 37 99 37 -55 -10
6078 -10 -31 -8 270 -24 211 110 -142 -173 41 -59 82 347 181 -248 -135 -24 180 -281 -273 3 65 55 241
6101 241 15 63 225 69 18 -183 114 352 78 -86 97 -130 -269 38 -52 48 82 17 61 6 89 77 -44
6124 -44 108 158 -9 -52 100 43 -135 -47 137 50 -89 -1 -155 156 -93 -158 -70 -46 92 287 -322 206 86
6147 86 141 -186 -120 5 58 28 -68 -25 237 -90 58 185 -114 -241 -79 -114 -234 71 -35 -52 -3 62 245 -183
6171 -183 223 35 -231 -154 -86 23 194 17 20 -34 -131 42 54 176 -119 -93 -28 -3 201 24 -138 7 -94
6194 -94 200 -54 24 131 129 191 -11 95 124 -173 -90 -51 -162 174 -292 38 2 -137 -23 -90 -262 -53 60
6217 60 5 -58 92 -271 31 24 228 -293 -185 243 262 -25 100 -248 -173 -40 -191 32 -12 209 -91 -26 56
6240 56 62 118 -148 32 125 260 45 94 1 -175 -1 -19 128 -22 78 18 178 -281 -321 63 202 -59 -286
6263 -286 -121 15 -207 38 69 0 -309 65 -31 249 -82 307 176 -301 6 72 -12 -45 2 -71 76 289 -54
6286 -54 31 44 -95 -53 -342 87 -132 77 -57 149 -98 -217 -178 -308 190 -131 -36 -150 27 -77 116 -25
6308 -25 -54 163 4 50 30 -73 -36 -3 99 -150 262 -44 -281 78 103 236 -28 -14 3 -92 134 -311 198
6331 198 65 145 -110 -121 40 -111 -39 -158 30 53 -10 -140 39 -260 150 -143 -164 -26 16 135 -134 258
6353 258 -314 27 46 53 -56 -135 126 -242 118 51 -135 -197 97 -211 154 -72 -285 232 297 -161 -102 -264 324
6376 324 20 -3 -109 -141 -155 308 350 62 -94 -153 263 150 -19 78 -133 96 -105 125 -18 139 112 -60
6398 -60 -66 19 -125 108 -51 -191 129 64 275 -39 -49 17 -184 -18 43 62 -51 -192 229 -220 -119 50 -148
6421 -148 -205 -116 155 -156 -32 -103 28 -87 -120 167 -168 -447 103 -89 -249 262 75 -192 -82 -323 111
6442 111 98 327 -3 82 10 -33 -153 109 129 37 271 -153 -8 -208 408 143 -104 33 106 -82 -10 0 96
6465 96 -28 63 48 87 138 -177 51 6 182 257 80 238 -96 -49 -49 -209 -197 -20 -8 124 -132 182 -61 33
6489 33 51 -25 322 -221 32 21 175 -65 58 204 -145 185 -182 2 -20 108 -132 -72 -70 -197 90 179 -15
6512 -15 28 -203 3 25 54 164 -175 39 -18 160 76 -144 -158 -395 51 41 -6 384 212 122 28 -14 87 32
6536 32 -349 63 243 107 172 -62 106 16 161 96 -245 82 -187 209 25 160 -358 -223 -119 -42 -164 -16
6558 -16 48 -354 -274 -121 -80 -42 314 -240 65 -85 -297 -217 23 -117 -147 44 -248 -13 185 121 -62 -14 -51
6581 -51 106 13 -94 253 -72 217 43 188 60 -169 95 -176 -45 -71 197 -76 -262 104 -110 -13 2 -108
6603 -108 -53 89 -12 319 180 209 -151 74 334 198 -59 131 95 77 -15 171 135 120 -196 -390 47 -130
6625 -130 85 -171 -100 59 200 162 72 -13 -118 53 -69 124 -65 -16 -46 -138 247 -146 215 -144 -30 -20 -82
6648 -82 207 -210 -165 81 371 120 -77 129 17 -110 -44 16 231 161 53 -63 -8 -146 -148 126 5 -207 293
6671 293 114 145 -242 -134 8 4 -1 -167 127 -66 -69 60 51 -193 -184 -67 -172 159 -316 -211 -77 -46 -7 7 -8
6696 -8 -18 -154 -95 141 54 71 -81 -16 -241 -44 130 -33 216 -94 -159 143 88 -251 -97 -155 23 7 -122 -74
6720 -74 2 -35 -182 310 -27 -282 175 -75 245 13 5 76 -29 18 31 106 133 -26 86 -180 36 -183 -72
6743 -72 253 21 -31 417 22 -172 298 -241 150 -108 25 110 389 -81 -108 -206 -263 11 97 1 -257 215 34
6766 34 -127 -47 -122 7 -63 -256 139 126 -179 43 46 -27 -111 -36 37 130 -172 313 147 217 168 -31 -13 22 -51 195
6792 195 114 -219 -24 -76 174 16 -28 -82 207 -199 -121 245 309 -151 -125 -2 -188 92 -180 26 -58 -43 -189
6815 -189 -163 48 134 -163 -119 -141 72 -136 40 26 151 -141 209 318 -125 233 157 37 -224 -5 105 -97
6837 -97 -193 146 249 -19 -308 -112 14 23 -52 62 170 -26 -273 0 7 139 39 -44 -70 -120 69 -34 102
6860 102 238 127 -120 -253 437 -16 -149 32 -144 -287 -120 -93 -319 -118 -182 188 78 110 46 134 -214 26
6882 26 149 -138 -3 28 208 -194 -90 -42 305 -7 46 257 13 143 267 -122 -94 29 125 28 -274 95
6904 95 -41 -9 47 -62 225 -174 68 -153 -166 -57 107 -41 96 -234 -142 -15 -189 84 64 120 95 72 180
6927 180 -57 -337 101 -157 208 30 115 -38 104 -199 151 -92 63 18 -51 90 -244 -239 -2 9 -191 86
6949 86 -107 -10 -21 -66 271 77 -10 -205 36 -208 -315 440 127 -120 -106 199 -315 -126 11 -80 132 94 40
6972 40 -290 42 -223 -257 40 125 -1 142 -109 -191 19 81 52 -259 151 -54 -35 -38 -31 33 171 -219 -50 262
6996 262 222 223 -205 -50 82 -438 -124 271 19 66 114 138 -69 -155 -119 168 171 114 47 138 186 -105 -79 12 -131
7021 -131 -257 -73 85 55 -151 48 -40 -192 136 35 -85 -169 -14 115 -95 -211 -235 217 -26 -329 146
7042 146 -11 -25 -343 91 -24 -18 203 120 -153 -140 32 -107 -86 -133 -95 -39 42 -159 -185 -132 -131 203 -136 -37 -210
7067 -210 -25 56 84 209 192 -85 -123 71 81 -282 -327 66 -148 -219 -78 273 61 18 -14 -42 197 -71 124
7090 124 118 26 -6 219 -107 -137 182 75 140 79 193 -104 125 271 53 82 -94 -99 -119 -214 143 -72 -115 105
7114 105 153 9 274 10 86 -131 -64 -25 -258 54 -61 -203 112 71 -254 -106 22 233 -190 -82 -108 172
7136 172 -71 -140 -81 37 153 -58 -62 68 99 -15 -171 143 -237 -125 -298 -47 -162 97 44 7 -106 -296
7158 -296 -132 -11 126 13 150 279 -148 -131 144 163 188 18 202 -42 14 30 344 127 -30 5 189 -239
7180 -239 104 -129 -93 -4 -223 64 78 198 -1 205 36 50 214 120 -52 -163 -93 -73 283 252 -116 -196 107
7203 107 23 -38 -8 -34 -39 73 -119 -19 188 -10 66 374 -165 -22 104 221 -91 43 -224 53 116 125 -146
7226 -146 -110 186 -14 137 -155 28 -49 -129 -72 -39 -77 257 21 -75 -24 -173 -118 196 191 -257 219 -119 -45 68
7250 68 131 -58 -236 -243 206 168 -163 -264 -389 -2 42 55 1 -124 67 -240 -28 -90 -167 -151 -222 252 302 38
7274 38 139 41 408 -111 83 4 37 -18 -122 87 16 126 -186 40 -181 -105 -202 64 -173 -289 -244 168 71
7297 71 354 150 216 -56 103 -210 131 91 96 140 -123 -196 -175 9 81 103 -7 -89 -28 -101 -191 -114 -422 316 -61
7322 -61 38 127 -33 116 -124 -109 -9 -294 -54 -145 -121 -263 45 117 -54 -53 138 -186 -122 222 3 -8 -25 -122
7346 -122 75 268 241 -226 72 -167 -53 -121 -87 -1 52 -132 -277 -106 -329 62 237 292 -139 -13 -101 -102 104
7369 104 -163 -64 204 -133 -11 104 -89 -418 232 402 166 -226 145 -85 -36 232 246 8 124 -245 124
7390 124 -24 -163 180 -137 110 -40 42 19 175 20 100 -142 262 153 7 112 234 116 33 95 -77 -203
7412 -203 -245 -383 -119 -73 141 101 210 -208 -218 192 -2 267 226 -115 48 -96 102 213 16 -162 -124 -49
7434 -49 119 -187 -32 -171 148 408 -71 -158 -21 -186 -48 -283 -125 -78 6 49 -167 -63 140 263 153 -180
7456 -180 -89 244 81 -163 30 -40 -17 47 11 -23 212 9 -308 241 -99 6 37 -138 -131 58 177 -63 -65 157
7480 157 -89 169 27 348 109 -36 28 -194 201 -187 -105 -136 158 102 -199 41 32 -70 -13 -24 113 -74 87
7503 87 -52 -32 -325 -213 -7 -24 147 88 -79 127 97 14 69 -112 -74 -30 -46 2 -361 -205 -115 221 -2 -222
7527 -222 10 -119 -126 -118 12 32 40 -163 -118 -216 -16 167 -47 -192 159 -119 -6 130 -8 -37 233 -126 -69 -111
7551 -111 -336 68 -44 182 196 98 14 19 227 -195 213 45 -114 -48 -154 182 -77 -195 -107 142 63 68 24 265
7575 265 100 -191 -21 -6 -49 -18 -37 90 122 60 314 -169 5 202 -143 230 -16 -277 167 -64 -428 -160
7597 -160 -217 162 35 188 206 90 -116 202 2 67 44 -16 158 0 -56 66 -39 160 -34 -227 83 186
7619 186 158 4 -194 55 3 -12 147 -109 -51 122 -168 -36 -46 -98 46 121 -85 -2 142 -291 -5 123 285
7642 285 31 -114 124 -77 -84 -81 -446 -133 -178 229 -128 15 46 386 -276 -87 14 -245 -21 -106 141 -360
7664 -360 123 20 25 110 -115 75 -1 -127 180 -70 -155 466 42 90 154 -96 -59 -150 179 158 94 147 285 34
7688 34 -26 268 -67 56 -39 -19 -283 125 31 226 238 -32 18 46 57 -126 30 23 73 104 -195 26 -73 316 -8
7713 -8 -34 46 -48 166 92 385 328 -160 16 46 -241 -134 -12 -172 -70 114 -13 76 69 221 -167 -61 3 -143
7737 -143 -95 46 -149 -178 173 -97 21 -20 83 -40 28 -223 38 55 69 72 235 33 161 358 4 66 38
7760 38 85 -51 31 117 -43 209 -63 262 22 70 -90 62 40 -194 300 139 -97 -114 52 53 -245 -139 -125
7783 -125 129 -133 -117 -12 -193 -21 -114 70 -8 -326 42 147 26 -215 154 -40 67 -62 245 -130 -215
7804 -215 -58 -4 -61 -35 199 -72 360 193 158 91 -177 102 -68 114 -7 70 225 76 26 -53 160 -62 51
7827 51 -140 127 -164 -21 311 91 -209 129 -66 202 -155 185 22 72 4 -85 286 88 67 118 182 -171
7849 -171 58 296 130 125 10 150 106 -88 -34 -52 -11 -194 54 -185 43 117 -121 97 -10 138 -151 -115 290
7872 290 5 101 14 236 172 -126 77 139 -90 113 -7 105 -46 66 65 263 -148 223 128 170 165 -103 -343
7895 -343 190 233 -40 82 -110 -103 144 153 230 -70 -1 -126 141 88 -33 193 -242 -45 7 -72 28 -143 -15
7918 -15 -26 291 -50 -91 -8 -14 166 30 66 -45 -168 -61 -19 -155 228 -111 178 13 -134 146 -126 -60 -62 -119
7942 -119 142 -42 -134 6 -16 12 71 -248 -109 -9 -151 63 85 -14 -90 149 117 246 23 218 -102 152 -201
7965 -201 60 105 147 173 -152 77 -78 17 143 89 -52 -229 147 31 65 -115 -331 115 23 123 -143 -187 -221
7988 -221 -215 -52 -130 -80 -118 -11 93 16 -61 35 -309 71 186 -55 -120 22 44 -199 -201 -61 4 -27 -57 121 -248
8013 -248 -37 48 316 -52 78 128 110 -56 217 -246 38 120 -16 216 -254 -7 75 -92 120 -63 -29 -181
8035 -181 121 -7 64 93 -138 93 214 28 56 47 -185 -199 -10 119 -20 158 -69 99 -236 -84 20 -113
8057 -113 -166 57 -9 -125 -225 309 57 98 218 283 51 -56 -104 -2 -86 342 171 -132 64 37 -102 46
8079 46 -104 113 210 14 -235 -8 -53 134 75 -102 73 -122 291 40 142 -39 157 -122 134 -95 -60 8
8101 8 297 364 -127 109 189 -5 -4 -76 252 -35 -91 -245 -57 -429 9 240 20 154 211 -29 -51 -11 26 -169
8125 -169 154 121 -130 -111 -72 7 -3 19 -198 -119 50 -45 -13 -80 -253 107 -38 205 19 61 50 -97 -74 139
8149 139 -198 30 79 -283 304 -42 -70 -81 69 -30 17 219 -24 -148 -43 2 -159 -154 -247 142 55 -63 8 -121
8173 -121 -99 225 190 63 -239 8 -186 0 114 -38 -156 -173 -92 -34 -145 215 -400 112
8191A12
##END NTUPLES=NMR FID
##END=
