##TITLE=1H_DE-56k_TFA_CD
 CDCl3
 8 sc, 
 24.6.2024
##JCAMPDX= 6.0         $$ Bruker NMR JCAMP-DX V2.0
##DATA TYPE= NMR FID
##DATA CLASS= NTUPLES
##ORIGIN= UXNMR, Bruker Analytische Messtechnik GmbH
##OWNER= root
$$ XWIN-NMR		Version 3.5
$$ Mon Jun 24 16:28:38 2024 Russian Standard Time (UT+4h)  she@DPX200
##.OBSERVE FREQUENCY= 200.131
##.OBSERVE NUCLEUS= ^1H
##.DELAY= (6, 6)
##.ACQUISITION MODE= SIMULTANEOUS
##.ACQUISITION SCHEME= undefined
##.AVERAGES= 8
##.DIGITISER RES= 18
##SPECTROMETER/DATA SYSTEM= spect
##.PULSE SEQUENCE= zg30
##.SOLVENT NAME= DMSO
##.SHIFT REFERENCE= (INTERNAL, DMSO, 0, 15.7039)
##AUDIT TRAIL= $$ (NUMBER, WHEN, WHO, WHERE, WHAT)
$$ ##TITLE= Audit trail, XWIN-NMR		Version 3.5
$$ ##JCAMPDX= 5.01
$$ ##ORIGIN= Bruker BioSpin GmbH
$$ ##OWNER= she
$$ F:/spectra/data/she/nmr/H-F/1/audita.txt
$$ ##AUDIT TRAIL=  $$ (NUMBER, WHEN, WHO, WHERE, WHAT)
(   1,<2024-06-24 16:27:44.53 +0400>,<she>,<DPX200>,
      <created by zg, POWCHK disabled, PULCHK disabled
       configuration hash MD5:
       00 E9 B6 7A A2 85 ED C7 34 08 36 98 17 FE 4E 26
       data hash MD5: 16K
       8A 2B CE 63 58 20 19 F0 79 A8 8E 1D A5 B7 D0 F0>)
$$ ##END=
$$ 
$$ hash MD5
$$ CA 91 05 94 70 4A 72 0A 05 B0 C9 11 DB 8B 49 89
##$RELAX= 
##$RELAX= 
##$RELAX= 
##$RELAX= 
##$RELAX= 
##$RELAX= 
$$ Bruker specific parameters
$$ --------------------------
##$DU= <F:/spectra>
##$EXPNO= 1
##$NAME= <H-F>
##$PROCNO= 1
##$TYPE= <nmr>
##$USER= <she>
##$AMP= (0..31)
100 100 100 100 100 100 100 100 100 100 100 100 100 100 100 100 100 100 
100 100 100 100 100 100 100 100 100 100 100 100 100 100 
##$AQSEQ= 0
##$AQ_mod= 1
##$AUNM= <au_zg>
##$AUTOPOS= <>
##$BF1= 200.13
##$BF2= 200.13
##$BF3= 200.13
##$BF4= 200.13
##$BF5= 200.13
##$BF6= 200.13
##$BF7= 200.13
##$BF8= 200.13
##$BYTORDA= 1
##$CFDGTYP= 0
##$CFRGTYP= 5
##$CHEMSTR= <none>
##$CNST= (0..31)
1 1 145 1 1 1 1 1 1 1 1 1 1 1 1 1 1 1 1 1 1 1 1 1 1 1 1 1 1 1 1 1 
##$CPDPRG= <>
##$CPDPRG1= <>
##$CPDPRG2= <>
##$CPDPRG3= <>
##$CPDPRG4= <mlev>
##$CPDPRG5= <mlev>
##$CPDPRG6= <mlev>
##$CPDPRG7= <mlev>
##$CPDPRG8= <mlev>
##$CPDPRGB= <>
##$CPDPRGT= <>
##$D= (0..31)
0 1.2 0 0 0 0 0 0 0 0.06 0 0.03 0 0 0 0 0.0002 0 0 0 0 0 0 0 0 0 0 0 0 
0 0 0 
##$DATE= 1719232064
##$DBL= (0..7)
120 120 120 120 120 120 120 120 
##$DBP= (0..7)
150 150 150 150 150 150 150 150 
##$DBP07= 0
##$DBPNAM0= <>
##$DBPNAM1= <>
##$DBPNAM2= <>
##$DBPNAM3= <>
##$DBPNAM4= <>
##$DBPNAM5= <>
##$DBPNAM6= <>
##$DBPNAM7= <>
##$DBPOAL= (0..7)
0.5 0.5 0.5 0.5 0.5 0.5 0.5 0.5 
##$DBPOFFS= (0..7)
0 0 0 0 0 0 0 0 
##$DE= 6
##$DECBNUC= <off>
##$DECIM= 32
##$DECNUC= <off>
##$DECSTAT= 4
##$DIGMOD= 1
##$DIGTYP= 9
##$DL= (0..7)
0 120 120 120 120 120 120 120 
##$DP= (0..7)
150 150 150 150 150 150 150 150 
##$DP07= 0
##$DPNAME0= <>
##$DPNAME1= <>
##$DPNAME2= <>
##$DPNAME3= <>
##$DPNAME4= <>
##$DPNAME5= <>
##$DPNAME6= <>
##$DPNAME7= <>
##$DPOAL= (0..7)
0.5 0.5 0.5 0.5 0.5 0.5 0.5 0.5 
##$DPOFFS= (0..7)
0 0 0 0 0 0 0 0 
##$DQDMODE= 0
##$DR= 18
##$DS= 0
##$DSLIST= <SSSSSSSSSSSSSSS>
$$ [...]
##$SUBNAM2= <"">
##$SUBNAM3= <"">
##$SUBNAM4= <"">
##$SUBNAM5= <"">
##$SUBNAM6= <"">
##$SUBNAM7= <"">
##$SUBNAM8= <"">
##$SUBNAM9= <"">
##$SW= 18.0517599122864
##$SWIBOX= (0..15)
0 0 2 0 0 0 0 0 0 0 0 0 0 0 0 0 
##$SW_h= 3612.71676300578
##$TD= 16384
##$TD0= 1
##$TE= 0
##$TE2= 300
##$TE3= 300
##$TEG= 300
##$TL= (0..7)
0 120 120 120 120 120 120 120 
##$TP= (0..7)
150 150 150 150 150 150 150 150 
##$TP07= 0
##$TPNAME0= <>
##$TPNAME1= <>
##$TPNAME2= <>
##$TPNAME3= <>
##$TPNAME4= <>
##$TPNAME5= <>
##$TPNAME6= <>
##$TPNAME7= <>
##$TPOAL= (0..7)
0.5 0.5 0.5 0.5 0.5 0.5 0.5 0.5 
##$TPOFFS= (0..7)
0 0 0 0 0 0 0 0 
##$TUNHIN= 0
##$TUNHOUT= 0
##$TUNXOUT= 0
##$USERA1= <user>
##$USERA2= <user>
##$USERA3= <user>
##$USERA4= <user>
##$USERA5= <user>
##$V9= 5
##$VALIST= <valist>
##$VCLIST= <CCCCCCCCCCCCCCC>
##$VD= 0
##$VDLIST= <DDDDDDDDDDDDDDD>
##$VPLIST= <PPPPPPPPPPPPPPP>
##$VTLIST= <TTTTTTTTTTTTTTT>
##$WBST= 1024
##$WBSW= 4
##$XGAIN= (0..3)
0 0 0 0 
##$XL= 0
##$YL= 0
##$YMAX_a= 69132
##$YMIN_a= -80930
##$ZGOPTNS= <>
##$ZL1= 120
##$ZL2= 120
##$ZL3= 120
##$ZL4= 120
##$ABSF1= 10
##$ABSF2= 0
##$ABSG= 5
##$ABSL= 3
##$ALPHA= 0
##$AQORDER= 0
##$ASSFAC= 0
##$ASSFACI= 0
##$ASSFACX= 0
##$ASSWID= 0
##$AUNMP= <proc_1d>
##$AZFE= 0.1
##$AZFW= 0.1
##$BCFW= 1
##$BC_mod= 2
##$BYTORDP= 1
##$COROFFS= 0
##$CY= 11.3945322036743
##$DATMOD= 1
##$DC= 2
##$DFILT= <>
##$DTYPP= 0
##$F1P= 15.6554695791079
##$F2P= 12.8336369535428
##$FCOR= 0.5
##$FTSIZE= 0
##$FT_mod= 4
##$GAMMA= 1
##$GB= 0.15
##$INTBC= 1
##$INTSCL= 1
##$ISEN= 128
##$LB= 0.24
##$LEV0= 0
##$LPBIN= 0
##$MAXI= 10000
##$MC2= 0
##$MEAN= 0
##$ME_mod= 0
##$MI= 1.114404
##$NCOEF= 0
##$NC_proc= 0
##$NLEV= 6
##$NOISF1= 3.799351
##$NOISF2= 2.8
##$NSP= 1
##$NTH_PI= 0
##$NZP= 0
##$OFFSET= 15.70392
##$PC= 1
##$PHC0= -25314.27
##$PHC1= 8.387479
##$PH_mod= 1
##$PKNL= yes
##$PPARMOD= 0
##$PSCAL= 0
##$PSIGN= 0
##$REVERSE= no
##$SF= 200.130013532006
##$SI= 16384
##$SIGF1= 3
##$SIGF2= 2
##$SINO= 400
##$SIOLD= 16384
##$SREGLST= <1H.CDCl3>
##$SSB= 0
##$STSI= 0
##$STSR= 0
##$SW_p= 3612.71676300578
##$SYMM= 0
##$S_DEV= 0
##$TDeff= 0
##$TDoff= 0
##$TI= <>
##$TILT= no
##$TM1= 0
##$TM2= 0
##$TOPLEV= 0
##$USERP1= <user>
##$USERP2= <user>
##$USERP3= <user>
##$USERP4= <user>
##$USERP5= <user>
##$WDW= 1
##$XDIM= 8192
##$YMAX_p= 0
##$YMIN_p= 0
$$ End of Bruker specific parameters
$$ ---------------------------------
##NTUPLES= NMR FID
##VAR_NAME=  TIME,          FID/REAL,        FID/IMAG
##SYMBOL=    X,             R,               I
##VAR_TYPE=  INDEPENDENT,   DEPENDENT,       DEPENDENT
##VAR_FORM=  AFFN,          ASDF,            ASDF
##VAR_DIM=   8192,          8192,            8192
##UNITS=     SECONDS,       ARBITRARY UNITS, ARBITRARY UNITS
##FACTOR=    0.0002768,     1,               1
##FIRST=     0,             0,               0
##LAST=      2.2672688,     0,               0
##MIN=       0,             -80930,          0
##MAX=       2.2672688,     69132,           0
$$ Real data points
##PAGE= N=1
##DATA TABLE= (X++(R..R)), XYDATA
$$ [...]
1841C8l72j86J77N10k8K09l97j98m59L44K20j8K75N2j57K1l3l19L18k0J24Jm29
$$ 38 -334 -520 -343 167 139 348 -49 -247 -706 -362 -142 -160 115 167 10 31 -2 -321 -3 -23 101 102 -327
1864c27n8M91M9K3K30j1k01l98o1k7O25j9J88o15k14m8L25jN65Q2l77n32n0J48
$$ -327 -385 106 155 178 408 397 196 -202 -263 -290 335 316 504 -111 -325 -373 -48 -49 516 598 221 -311 -361 -213
1888b13M0M20K18j29k52l57j51K93K63L72n4m02j22l64J46K83J84J22N8n12l21
$$ -213 -173 247 465 336 84 -273 -424 -131 132 504 450 48 -74 -438 -292 -9 175 297 355 -157 -478
1909d78l0K59L13j02J98k51Rm63N82r6K80L68o13K08n42r0J71M71J96k30l6o66
$$ -478 -508 -249 64 -38 160 -91 -82 -545 37 -59 221 589 -24 184 -358 -448 -277 194 390 160 124 -542
1931e42K23P5K00N83J8j1m80k42m4K17K20L00J44n35j23j46P2N5K97O2j23o8o1
$$ -542 -319 -244 -44 539 557 546 66 -176 -220 -3 217 517 661 126 3 -143 -71 -16 281 343 220 152 91
1954I1j96k84L13J67J27o4k79k64L16Q1j23M78m86L33m21q1L95PQ5k43j93M49
$$ 91 -105 -389 -76 91 218 154 -125 -389 -73 8 -115 363 -123 210 -211 -292 103 110 195 -48 -241 208
1976B08j72q5L75J73m06j36J4O7k00N82l16J40j61l78K81J08K65j21o9l1j81j27
$$ 208 36 -49 326 499 93 -43 -29 38 -162 420 104 244 83 -295 -14 94 359 238 169 138 -43 -170
1998a70k6J39L36k42K16j81%k79q7M38P6n6j09j64o3j13L93J71M6j12l32j65j16
$$ -170 -196 -57 279 37 253 72 72 -207 -294 144 220 164 55 -109 -172 -285 108 279 325 213 -119 -284 -400
2021d00P62o03N14k63J95n38K5K67j30L72K34k46m39j27J51j29M59K16j14J50
$$ -400 362 -241 273 10 205 -333 -308 -41 -171 201 435 189 -250 -377 -226 -355 104 320 206 356
2041C56p77M13M9l28M10o3r0J18l86m3J84N6N88j53l31J38m92M20J2K15o4O8r5
$$ 356 -421 -8 41 -287 123 60 -30 88 -298 -341 -157 -101 487 334 3 141 -351 69 81 296 232 300 205
2064B05j59j85K32K3Q4o9k0J2n87N55j09J89Q8n2l84j6L24k92K56J39m57L97r5
$$ 205 46 -139 93 116 200 131 111 123 -464 91 -18 171 259 207 -177 -193 131 -161 95 234 -223 174 79
2087G9l99J8K96K35l55K97k27L23k85k36K73j70j48K81mp3n06M58N7nJ72j67r
$$ 79 -320 -302 -6 229 -126 171 -56 267 -18 -254 19 -151 -299 -18 -22 -95 -601 -143 -86 -91 81 -86 -95
2110i5K32k59m7L18k33J65%l7L2j23n5L7N2j1J7M8J59j40k4R4p4p3j4o0J01m4
$$ -95 137 -122 -169 149 -84 81 81 44 76 -47 -102 -65 -13 -24 -7 41 200 60 36 130 56 -17 -31 -91 10 -34
2136c4Q9Jn6P2J1K8N3l79j11M39Pj04r2R3r6k61M44r5j35K29R3j00J08l24J50
$$ -34 55 56 0 72 83 111 164 -215 -326 113 120 16 -76 17 -79 -340 104 9 -126 103 196 96 204 -120 30
2161C0n76K12N13k8k16M8P6O2l00j28L59Q6k48l1J27j41K78j45K0Q2K0J75k79
$$ 30 -546 -334 179 151 -65 -17 59 121 -179 -307 52 138 -110 -141 -14 -155 123 -22 -2 80 100 275 -4
2184dK16K6o3M5j17Lk66K49R0m04K32L68k28j04j32r8K01N8JK2J27l11k28R4K7
$$ -4 212 238 175 220 103 106 -160 89 179 -225 7 375 147 43 -89 -187 14 72 73 95 222 -89 -317 -223 -196
2209a96L8K91ML7j32l3o7N5J63R3k49j86J44r7j51L50j07L31k30j08o9J08J15
$$ -196 -158 133 137 174 42 9 -58 -3 160 253 4 -182 -38 -135 -286 64 -43 288 58 -50 -119 -11 104
2232A04r6L27l44K09l02j32K82Q7j69K91m26L20j73%m9Q6K27l91N2J96j83n6J59
$$ 104 8 335 -9 200 -102 -234 48 135 -34 257 -169 151 -22 -22 -71 15 242 -149 -97 99 -84 -140 19
2255A9k1L74k19j47l6q2K71MO0j7o4k41J35ok68J0J18J73j17Q2J15k71K86l60
$$ 19 -2 372 153 6 -30 -112 159 163 223 206 142 -99 36 30 -238 -228 -110 63 -54 28 143 -128 158 -202
2279b02L81l2k3j23l38L07r2J86r4M5M2P2k38k7J92K01m39J60M5j76R5J88k03
$$ -202 179 147 124 1 -337 -30 -122 64 -30 15 57 129 -109 -136 56 257 -182 -22 23 -153 -58 130 -73
2302g3J9n0K20j62k08M77m50K85k48J09L69k38R6j26r5J00j82K33j25L09l2j53
$$ -73 -54 -104 116 -46 -254 223 -227 58 -190 -81 288 50 146 20 -75 25 -157 76 -49 260 228 75
2324G5K6k67N4K18n7J19k21J22j62j58K21j24J71L99m06L2j53k84M25K74J56m87
$$ 75 101 -166 -112 106 49 168 -53 69 -93 -251 -30 -154 17 416 10 42 -111 -395 30 304 460 -27
2346b7j37j26J89k71K83J20o5J27j33j47R4L72l35R2J15j58j95J08j11J65J26
$$ -27 -164 -290 -101 -372 -89 31 -34 93 -40 -187 -93 279 -56 36 151 -7 -202 -94 -205 -40 86
2367H6l1K11l05o2j61L4M25p1j43J20j68%J20j09L14p8J60l29K1l33K73rJ61K32
$$ 86 55 266 -39 -101 -262 -228 197 126 -17 103 -65 -65 55 -54 260 182 342 13 34 -299 -26 -35 126 358
2391C58r3l42Nj15M25k19J62o4M0k36J08j90J56L13j72l97J13P9k67N66r7k08
$$ 358 265 -77 -72 -187 238 19 181 117 157 -79 29 -161 -5 308 136 -261 -148 -69 -336 230 133 -75
2413g5K40n13K11K00k60M35k86L5j27r7J25O2M0j3J28r3k81L64l9l81N82l75K50
$$ -75 165 -348 -137 63 -197 238 -48 -13 -140 -237 -112 -50 -10 -23 105 12 -269 95 56 -325 257 -118 132
2436A32j93L8j63L60k0rP9l62j56P9M33J05l64J33k51J3J40p7L43J81m21J07k42
$$ 132 -61 -23 -186 174 154 145 224 -138 -294 -215 218 323 -41 92 -159 -146 -6 -83 260 441 20 127 -115
2459a15K18j65L01k02J33k74Q7k64J00M3K01J44o9n05L18l47L60J73J1%J87m03
$$ -115 103 -62 239 37 170 -104 -17 -281 -181 -138 63 207 138 -367 -49 -396 -36 137 148 148 335 -68
2481f8j13J55J25J74J41l90l95J34J53j70K34K84%l1k79l4n2J02K76l87J03rl60
$$ -68 -181 -26 99 273 414 24 -371 -237 -84 -254 -20 264 264 233 -46 -80 -132 -30 246 -141 -38 -47 -407
2504d07PL00K73K56j69l58j13Nk8N12n2j12J59l24K4j92O4L94R1j04o6l45J19
$$ -407 -400 -100 173 429 260 -98 -211 -206 -234 278 226 114 273 -51 -27 -219 -155 239 330 226 160 -185 -66
2527f6M3M4Rn8j53M12m52l25O72j0K02N6k88j78j35j17K69M0M4J80m00K19o9K33
$$ -66 -23 21 30 -28 -181 231 -221 -546 126 116 318 374 86 -92 -227 -344 -75 -35 9 189 -211 8 -61 172
2551A72mm6j64J48k75K0J91kK47m13Q9L0k18K04RL3j24J30R7l14M33j04J3j30
$$ 172 168 122 -42 106 -169 -149 42 40 287 -126 -37 -7 -225 -21 -12 21 -103 27 124 -190 243 139 152 22
2575B2J04l59K71J15k71M64j68k26j83J09j17K20P9l93N24j84p7k83L18J8L13
$$ 22 126 -233 38 153 -118 346 178 -48 -231 -122 -239 -19 60 -333 191 7 -70 -353 -35 -17 296
2596B96k07j32j12mK89p0Q1j25J22n08O17o69M57j0K60q0j29k10j7m0R4J96J01
$$ 296 89 -43 -155 -159 130 60 141 16 138 -370 247 -422 35 25 285 205 76 -134 -151 -191 -97 99 200
2619B00r1k0j39k72L62lJ60m7j69L0j71r2J39N7M50k17m10k11J99K85M0J4j09
$$ 200 109 89 -50 -322 40 37 197 150 -19 11 -160 -252 -113 -56 394 177 -233 -444 -245 40 80 94 -15
2642a5K33k81l62L58M07k53J51k80j16MJ28Pk6K55j94j33J24o2J00J67j4j81N4
$$ -15 218 -63 -425 -67 340 87 238 -42 -158 -154 -26 -19 -45 210 16 -117 7 -55 45 212 198 17 71
2665G1k05o3J25J25r4K50L00n61P3J5n7L33k57K09k98j57L28q0j12K74m4l8m42
$$ 71 -134 -197 -72 53 -41 209 509 -52 21 36 -21 312 55 264 -34 -191 137 57 -55 219 175 137 -305
2688c05K69J40j03J08n1J19m1j54k30J21K47k7k65L75k84l3K83k03K31j65j67
$$ -305 -36 104 1 109 58 177 136 -18 -248 -127 120 93 -172 203 -81 -114 169 -34 197 32 -135
2709a35J08n0j16K70P7J50k44j48j09M7J37J93J30n01J65q3k20J15K63j27N57
$$ -135 -27 -77 -193 77 154 304 60 -88 -197 -150 -13 180 310 -191 -26 -109 -329 -214 49 -78 479
2730D79o07K34j72k7M8J57m4j87N1K27n66M42L43l43O4j09j42J31K8j60K09Jm7
$$ 479 -128 106 -66 -93 -45 112 68 -119 -68 159 -407 35 378 35 99 -10 -152 -21 7 -153 56 57 10
2753A0K0J45j76j07J07N3N1k3n7J8J24k79P4J69Lp6k57J59j82L11m2O7k35K27
$$ 10 30 175 -1 -108 -1 52 103 80 23 41 165 -114 -40 129 132 56 -201 -42 -224 87 45 112 -123 104
2777A04j85N9k5j89M53K2k11p7K60k15l8Q6p5L28j79p5j60K78J70l83K95Pm14
$$ 104 -81 -22 -47 -236 217 239 28 -49 211 -4 -42 44 -31 297 118 43 -117 161 331 -52 243 250 -164
2800a64Q5L8n6K47k61M11k87J57j58j1J00k75J00K39l61K61k60k4K29k8J69k08
$$ -164 -79 -41 -97 150 -111 300 13 170 12 1 101 -174 -74 165 -196 65 -195 -219 10 -18 151 -57
2822e7J98K51j81k07j75K41J38m01L02K32k64r6K0K0o2p8o1L95j18j64J61k74
$$ -57 141 392 211 4 -171 70 208 -193 109 341 77 -19 1 21 -41 -119 -180 215 97 -67 94 -180
2844a80K04j07R2p5K00p3k9m2j78J56j54L11J30k64J4k82M86k02j11K14j60K10
$$ -180 24 -83 9 -66 134 61 32 -10 -188 -32 -186 125 255 -9 5 -277 209 7 -104 110 -50 160
2866A60j96j57M26m42J34p4J77J1j06P3J20lnj72mk23M21k38J57K26j39j63j94
$$ 160 -36 -193 233 -209 -75 -149 28 39 -67 6 126 123 118 -54 -58 -281 140 -98 59 285 146 -17 -211
2889b11J77k4P1J46j40p6J69j19k5M1Q6o9j68L64m97%j23L42O3j18J33J57k41
$$ -211 -34 -58 13 159 19 -57 112 -7 -32 9 95 26 -142 222 -275 -275 -398 -56 7 -111 22 179 -62
2912f2K56l45L97j37j23N0j84Q1K31j59p9J30JO8l05K88j47N9K60j82p7k69N05
$$ -62 194 -151 246 109 -14 36 -148 -67 164 5 -74 56 57 125 -180 108 -39 20 280 98 21 -248 257
2935B57m83L17M7j90K56p3k43o7Q2J01j30k8L31n6j92Q7j50P4q1K13L8l92K27
$$ 257 -226 91 138 -52 204 131 -112 -179 -97 4 -126 -154 177 121 -71 16 -134 -60 -141 72 110 -282 -55
2958e5r8K19j14L4kN0j90J8K48Q3j39J01k82n2Q9K69k54K73k50p3J67o7j2J76
$$ -55 -153 66 -48 -14 -16 34 -156 -138 110 193 54 155 -127 -179 -90 179 -75 198 -52 -125 42 -25 -37 139
2982A39o3k53Q2J13J21n3m07M33PM9j19l47M67l38K41r8o5l0J51M0j90K60k05
$$ 139 76 -177 -95 18 139 86 -321 112 119 168 49 -298 169 -169 72 -26 -91 -121 30 70 -120 140 -65
3005f5j78kP4J99O8J8k02L4j35J28Q2L4q2L47k69K70m22L30k44O4N3K73m55J45
$$ -65 -243 -245 -171 28 96 114 -88 -54 -189 -61 21 55 -27 320 51 321 -101 229 -15 49 102 375 -80 65
3029F5k5k48J17J29j91K02Q8j21m6L4p8L2o8L16p2k27K34k97L87k95N8J57k49
$$ 65 40 -208 -91 38 -153 49 137 16 -30 4 -74 -42 -110 206 134 -93 141 -156 231 -64 -6 151 -98
3052i8O3R4j19J16m3mJ56l05J67o8k94J64J29j95M93j58n78L03M67m44J69M88
$$ -98 -35 59 -60 56 13 9 165 -140 27 -41 -335 -171 -42 -237 256 98 -480 -177 290 -154 15 503
3074E03o79J51J89m03L99k03Q9K47j72j52k5LJ23l19K26nOn1M7Q3J02j86K22J08
$$ 503 -176 -25 164 -239 160 -43 46 293 121 -31 -56 -53 70 -249 -23 -28 -22 -73 -26 57 159 -27 195 303
3098C03l0l28N0n7K42k78j3K5K90k35j44L69r9Qn9Q7j74k16L48k51p7L32R3p1
$$ 303 273 -55 -5 -62 180 -98 -111 -86 204 -31 -175 194 95 103 44 131 -43 -259 89 -162 -239 93 186 115
3122A15j22J13q9j34k75O48l77Q6K24n7j33j34J59k90L43O5L55o89L83l15R0M4
$$ 115 -7 106 17 -117 -392 256 -121 -35 189 132 -1 -135 24 -266 77 142 497 -192 191 -124 -34 10
3144A0N4j43Q2L5k16j5J74n4j10J73P9J25j98j72J6K33j45L18j54k78K98l94K8
$$ 10 64 -79 3 38 -178 -193 -19 -73 -183 -10 69 194 -4 -176 -160 73 -72 246 92 -186 112 -282 -254
3167b54K40J41j89J4j8N3lN9Jj09j18O9J57k5K40L9k13n7J33k86L27K8k19N5N0
$$ -254 -14 127 -62 -48 -66 -13 -16 43 44 -65 -183 -114 43 18 258 297 84 27 160 -126 201 229 10 65 115
3192A15k82J07j48qJ16j56L87r1m5N5J5J84n2j94M2j34J99k67J51P0j49K57l24
$$ 115 -167 -60 -208 -216 -100 -256 131 40 -5 50 65 249 197 3 45 -89 110 -157 -6 64 -85 172 -152
3215a52K01M3j15J2J55k22J7M5k24K55m9j23K79j24L32k47j94P8L5K06j78m9n9
$$ -152 49 92 -23 -11 144 -78 -61 -16 -240 15 -34 -157 122 -2 330 83 -111 -33 2 208 30 -19 -78
3238g8j08j7M82j95L9R8j26j37O5Pj84O7K3J42j2l16L09O8mj01K3N8o2O0j46P4
$$ -78 -186 -203 279 84 123 221 95 -42 23 30 -154 -87 -64 78 66 -250 59 127 123 22 45 103 41 101 -45 29
3264B9o7k41J37J8M10j06J75l21j05K33j41k0o0J25j0P8k61J79J95m96J88j72
$$ 29 -38 -279 -142 -124 286 180 355 34 -71 162 21 1 -59 66 56 134 -127 52 247 -249 -61 -233
3286b33K68k07J61o9j15J38q0K55m36R7L44k17K91r6l48K51kO1m2J8r2R2j55Q1
$$ -233 35 -172 -11 -80 -195 -57 -137 118 -318 -221 123 -94 197 101 -247 4 2 63 21 39 -53 39 -116 -35
3310c5J4k22J10j13M90j32l64J41j24O6K45r1J29J0Oj24J11j49mk4K28j70K78
$$ -35 -21 -243 -133 -246 244 112 -252 -111 -235 -169 76 -15 114 124 130 6 117 -32 -36 -60 168 -2 276
3333B76k54l00L48j71No5K17k18J84J71j15k22mO49m76L15k40k82J29OJ00n7L3
$$ 276 22 -278 70 -101 -96 -161 56 -162 22 193 78 -144 -148 501 25 340 100 -182 -53 -47 53 -4 29
3356B9r5j0k35K75l9J67j69L36m68M39j75K37m95M7J24o4j24J79J69j92N2L0K2
$$ 29 -66 -76 -311 -36 -75 92 -77 259 -209 230 55 292 -203 -156 -32 -96 -220 -41 128 -64 -12 18 40
3379D0K50k21k79K45M9J51k94K30k85q7Q8J13m8N9n2j26K31j80Q4K19l75J60P7
$$ 40 290 69 -210 35 84 235 -59 171 -114 -201 -113 0 -48 11 -41 -167 64 -116 -32 187 -188 -28 49
3402D9P4k81K07M6l39L15O3j46J65O9j22q4J22K9j69j29J77M6k58J57J02Lj77
$$ 49 123 -158 49 95 -244 71 134 -12 153 222 100 16 138 167 -2 -131 46 92 -166 -9 93 96 -81
3425h1K2P1j32N7k4R7K9p6j4K4q3K55j41k19M9J30K5r6J3J18K72l59m5m7L66k22
$$ -81 -59 12 -120 -63 -87 10 39 -37 -51 -27 -110 145 4 -215 -166 -36 -11 -107 -94 24 296 -63 -108 -155 211 -11
3451a1R6j7j24J23J14j82J15R8j79q5r7J37j5j5k2MR5l0k98K05R8k4R8n0J86m62
$$ -11 85 68 -56 67 181 -1 114 212 33 -52 -149 -12 -27 -42 -64 -60 35 5 -293 -88 10 -14 84 34 220 -242
3477b42J86K36p5k68K4j75K03L8J27j08j0J46q9m1j6L42k53j68J39K02j31L1l16
$$ -242 -56 180 105 -163 -139 -314 -111 -73 54 -54 -64 82 -7 -48 -64 278 25 -143 -4 198 67 98 -218
3500b18M39l77P0m6J11k07L18j16j45J44q1jP2K76l46Q3j08Q3r8K35J58j20k31
$$ -218 221 -156 -86 -132 -21 -228 90 -26 -171 -27 -108 -109 -37 239 -107 -24 -132 -49 -147 88 246 126 -105
3523a05M0J25k34L16J13r6q6m0Nj83J27J87n9l18j26o4K09J86J10n9k09K91J22
$$ -105 -65 60 -174 142 255 159 73 33 38 -145 -18 169 110 -208 -334 -398 -189 -3 107 48 -161 130 252
3546B52k98n6J42K49n29J04K21P7p9p7j10K03O9R0j54l34qL07J76k87p9J48R5
$$ 252 -46 -102 40 289 -240 -136 85 162 83 6 -104 99 168 258 104 -230 -238 69 245 -42 -121 27 122
3569A22o9k83N09j68j18p0K5l7M33J5j94k20k38L94k79M0L47j51j23K04j66m4
$$ 122 53 -230 279 111 -7 -77 -52 -89 344 359 165 -55 -293 101 -178 -138 209 58 -65 139 -27 -71
3591g1L7q8N4n1jK12p4j24K07l17K49j48OL29k80PJ91j45n9K69k33LQ2q5K39j2
$$ -71 -34 -122 -68 -119 -120 92 18 -106 101 -216 33 -115 -109 220 -60 -53 138 -7 -66 203 -30 -27 55 -30 209 197
3617A97j70m4j25L34p8r6j62K30m46J79L9L77k28kP0r4m4R3p7K6J4r2R1J12N4
$$ 197 27 -17 -142 192 114 18 -144 86 -360 -181 -142 235 7 5 75 -19 -63 30 -47 -21 -7 -99 -8 104 158
3642A58p9r6j78L01j84L1q3L8O0k25K52O7k99J56J60J67n25M27m7j05J66l05J41
$$ 158 79 -17 -195 106 -78 -47 -130 -92 -32 -257 -5 62 -237 -81 79 246 -279 148 101 -4 162 -143 -2
3665bm7J48j40%J36j42J11n9l08M01k08Ol4J35k80L12j79N5m8J44lk78L73l90
$$ -2 -49 99 -41 -41 95 -47 64 5 -303 98 -110 -104 -138 -3 -283 29 -150 -95 -143 1 -2 -280 93 -297
3689b97M17J56l47K1L18l61J4K37k09m9j1P0m0K27j73k3J61j39n1J94j29J53J68
$$ -297 120 276 -71 -50 268 -93 -79 158 -51 -100 -111 -41 -81 146 -27 -50 111 -28 -79 115 -14 139 307
3712C07k60k44L24j15j19J37m9J55m8m0j19K17M1l92L07J24k62L16l24j3L5k3
$$ 307 47 -197 127 12 -107 30 -19 136 88 48 -71 146 187 -205 102 226 -36 280 -44 -57 -22 -45
3734d5M5J8j13L0k89L74j52J91r0j26L32k49K95k31j22J41j33J46J39j37R8N9
$$ -45 0 18 -95 -65 -354 20 -132 59 -31 -157 175 -74 221 -10 -132 9 -124 22 161 24 122 181
3756A81k24K21k26n0J13l1KJ99j32J35r2k21K23j70P5n6j75L07o6M1k00K8J6j95
$$ 181 -43 178 -48 -98 15 -16 -14 185 53 188 96 -125 98 -72 3 -53 -228 79 13 54 -146 -118 -102 -297
3780b97K31J35j2J2j18R4j30j1J00J22q7L5j19J46n7l36L70j71j27M39k89j34
$$ -297 -66 69 57 69 -49 45 -85 -96 4 126 39 74 -45 101 44 -292 78 -93 -220 219 -70 -204
3802b04K65l0k5L6m3J28K3k12J87j97P8j25N3J56k97k05M60Nj04M7K02nr1k55
$$ -204 61 31 6 42 -1 127 150 -62 125 -72 6 -119 -66 90 -207 -412 48 53 -51 -4 198 193 102 -153
3826a53M15j43o8j01j25K81k74K94l16L08k45m9Q8J76O6l51J91k30J55J00j52
$$ -153 262 119 51 -50 -175 106 -168 126 -190 118 -127 -176 -88 88 154 -197 -6 -236 -81 19 -133
3847a33l1K91k71J00L8N7k48K70k07K77j34o9j19P8J06q1J76k48L69m00K77j89
$$ -133 -164 127 -144 -44 -6 51 -197 73 -134 143 9 -60 -179 -101 5 -76 100 -148 221 -179 98 -91
3869i1j70K84L7k16K08J35k34R6k41M29l63J82j02l9r6L91k65M0o1J57j5Q7M1
$$ -91 -261 23 60 -156 52 187 -47 49 -192 237 -126 56 -46 -85 -181 210 -55 -15 -76 81 66 153 194
3892A94m02K9K64J5n6j89K12k14K44l73J42K85j23q8k3J62o2j28L31l72M40j43
$$ 194 -208 -179 85 100 44 -145 67 -147 97 -276 -134 151 28 -60 -83 79 17 -111 220 -152 288 145
3914A45J57l27j6J32k41J6n1M50k31j00L3N6j32K65k09JJ64k4q9m7o1o2KQ9M53
$$ 145 302 -25 -41 91 -150 -134 -185 265 34 -66 -33 23 -109 156 -53 -52 112 88 -1 -48 -109 -171 -169 -80 373
3939C73l57n1j13jJ62Qk29n1J60K35k27K75O7m78J07rJ09n6n6J30M0j08K70k46
$$ 373 16 -35 -148 -149 13 21 -208 -259 -99 136 -91 184 251 -227 -120 -129 -20 -76 -132 -2 38 -70 200 -46
3963d6P2l27M98m06M91j87l1K22n09J33K14o8Rk35M43j80J6j36K29j88L8p8K33
$$ -46 26 -301 197 -209 282 95 64 286 -223 -90 124 56 65 -170 273 93 109 -27 202 14 52 -26 207
3986B07R0q4J16l62N6NJ40j67l8M0l4r6j44M05J8l51M8K7N8o2L49k48j14j0L1
$$ 207 297 213 329 -33 23 28 168 1 -37 3 -31 -127 -271 134 152 -199 -151 -124 -66 -128 221 -27 -141 -151 -120
4011a20J31L9j29n2P3nRL29l85j17M04p4k1o4J19j67K8j39K14n9l2J1j94L46j09
$$ -120 11 50 -79 -131 -58 -63 -54 275 -110 -227 177 103 82 18 137 -30 -2 -141 73 14 -18 -7 -201 145 36
4036C6q5l2J01P2j15q7K38k21k0R0j72K51J19q5j47j85K68K82k01J7l15J42j05
$$ 36 -49 -81 20 92 -23 -110 128 -93 -113 -23 -195 56 175 90 -57 -242 26 308 107 124 -191 -49 -154
4059a54K26l02M91k79l4K39k48M4J39j58j40K68K3k37J77Nj68J48O3k82JJ11J29
$$ -154 72 -230 261 -18 -52 187 -61 -17 122 -36 -176 92 115 -122 55 60 -108 40 103 -179 -178 -67 62
4082F2j26J04Oj23O1J0q1J76K3J00k95J12l47L51L0n1k1k4J70m13K63J11j66p7
$$ 62 -64 40 46 -77 -16 -6 -87 89 112 212 -83 29 -318 33 63 12 -9 -33 137 -276 -13 98 -68 -145
4106a45K35j96p8K54j35k4K40k14Q9j2j41J60p4k03M08o9O7k06r2q4M8J52j76
$$ -145 90 -106 -184 70 -65 -89 151 -63 26 14 -127 33 -41 -244 164 95 162 -44 -136 -220 -172 -20 -196
4129a96K58mp6Q4L3j08J40j34J17J70k31p5J61l07K69k71L09j76J65O5m81L20
$$ -196 62 58 -18 66 99 -9 131 -3 114 284 53 -22 139 -168 101 -170 139 -37 128 193 -288 32
4151C2L6j9J2K03k34j81j28K66j73J38j57L67r2L2k18n3L25R5j71j10j2J85N7
$$ 32 68 49 61 264 30 -151 -279 -13 -186 -48 -205 162 70 102 -116 -169 156 251 80 -30 -42 143 200
4174B00j09o0J25m60%M98l9j4j69m9J64N1k27M9j6J48L4q9j74J48N8k25J95J6
$$ 200 91 31 156 -304 -304 194 155 141 -28 -77 87 138 -89 -40 -56 92 126 37 -137 11 69 -156 39 55
4198E5k25L7l5K59k13K58N1L6k70p5Q4l0J78l96M52j07J3O1J33j78K79m18K44
$$ 55 -170 -133 -168 91 -122 136 187 223 -47 -122 -38 -68 110 -286 166 59 72 133 266 88 367 -51 193
4221A93l26J62L2L5q4j57O8M9o8j4L21j90J64l91L36j95K1J07L35j07n76L10j61
$$ 193 -133 29 61 96 12 -145 -77 -28 -96 -110 211 21 185 -206 130 -65 -44 63 398 291 -285 25 -136
4244a36k6J25M5k22J99L9j36O1J16KL65n96K22n0j48J14R7J79l97K05j16J93M0
$$ -136 -162 -37 8 -214 -15 24 -112 -51 65 67 432 -164 58 8 -140 -26 71 250 -147 58 -58 135 175
4267A75m2L1q8l8j02J70k55o0J55J48R4j6k83J34k26L85l31J95j97K24P7j08l28
$$ 175 133 164 76 38 -64 106 -149 -209 -54 94 188 172 -111 23 -203 182 -149 46 -151 73 150 42 -286
4290b86K38J46J84j68J02l18L91J5k26L2k79R3L72m65J4L47l93L51j84O5J04j40
$$ -286 -48 98 282 114 216 -102 289 304 78 110 -169 -76 296 -169 -155 192 -201 150 -34 31 135 -5
4312eJ17O1k85K22p4J43r0j22L14k80m8j89L42n38L37j3K59k46K20j59l0K56l28
$$ -5 112 173 -112 110 36 179 89 -33 281 1 -47 -236 106 -432 -95 -108 151 -95 125 -34 -64 192 -136
4335a36L30j95o3n7NO2J04l26N53k22j69K3l3M6q3K88J30k28k69L04m0j4P5n7
$$ -136 194 -1 -64 -121 -116 -54 50 -276 277 55 -114 -91 -124 -78 -161 127 257 29 -240 64 24 10 85 28
4359B8j18M38m11J14l49L21Q1k07QL08j46k92K73J28k53Q7K07m89K02J7j1K44
$$ 28 -90 348 -63 51 -298 23 104 -103 -95 213 67 -225 48 176 -77 10 217 -272 -70 -53 -64 180
4381A80k45o7J38J37p5R2j4Q3l43K25K23l70m2J1J54k60J58M6j1J69k70j15L12
$$ 180 -65 -132 6 143 68 160 146 229 -114 111 334 -36 -78 -67 87 -173 -15 31 20 189 -81 -196 116
4404A16l05K40J73j43k38JK71j93M5Q5l35L14Q6q7J0P0k62M2K30m2O1l16L22j55
$$ 116 -189 51 224 81 -157 -156 115 -78 -33 52 -283 31 117 30 40 110 -152 -110 120 78 139 -177 145 -10
4428a0M6k86K71J33k44N9M3k23J37m4K29j65Q7J36j75j44J17P8QN3J34l12l00
$$ -10 36 -250 21 154 -90 -31 12 -211 -74 -118 111 -54 33 169 -6 -150 -33 45 53 106 240 -72 -372
4451c72N1K28J40n6Q8j13kl26M82j99J02j22K86l09O9j4j73J35K39l24K93k15
$$ -372 -321 -93 47 -9 79 -34 -36 -362 120 -79 23 -99 187 -122 -53 -67 -240 -105 134 -190 103 -112
4473a12j6J2j09J31l0P0Q5J9j85j15K12l8K4K6j15L61o5j50k77N4l0K4L19l85
$$ -112 -128 -116 -225 -94 -124 -54 31 50 -135 -250 -38 -76 -52 -26 -141 220 155 5 -272 -218 -248 -224 95 -290
4497b90K34j53K45LJ79J16l60K3m4L21j10j71J1O4j69J75k19J99l5p4J22j56J71
$$ -290 -56 -209 36 39 218 334 -26 -3 -47 274 164 -7 4 68 -101 74 -145 54 19 -55 67 -89 82
4520H2r0k5k1K43k52P2K9j5j01n2J15j86q8M91J49l2k03qj15M2J16k09m5K69k67
$$ 82 -8 -33 -54 189 -63 9 38 23 -78 -130 -15 -201 -289 202 351 319 116 108 -7 35 151 -58 -103 166 -101
4545a01L21l50L15Q9l98k4K6l0j77L44J80j67NL31m86o0J71O7KN2J36m42M30j62
$$ -101 220 -130 185 274 -124 -148 -122 -152 -329 15 195 28 33 364 -122 -182 -11 56 58 110 246 -196 234 72
4569G2j40K13k22O22m52j06L02l66J33k65L57k08N9J58k00j17J47K30N4m66K22
$$ 72 -68 145 -77 545 93 -13 289 -77 56 -209 148 -60 -1 157 -43 -160 -13 217 271 -195 27
4590B7j17L68l20J5k1j97K86j78j07pL05J00k69J56m2m6O6l48K51K61m8k64L51
$$ 27 -90 278 -42 -27 -48 -245 41 -137 -244 -251 54 154 -115 41 -1 -47 19 -329 -78 183 135 -129 222
4613B22j79j16J79N6l8j91l0K7j48L79k26J75m85L85J91j98l1j09Q8N5p8N2l1
$$ 222 43 -73 106 162 124 -67 -97 -70 -218 161 -65 110 -375 10 201 3 -28 -137 -49 6 -72 -20 -51
4636e1J10l0N7j6j38j47K33M6j37j0L50k54j4J74j64k08K86nj38J77l4m6n3j25
$$ -51 59 29 86 70 -68 -215 18 64 -73 -83 267 13 -1 173 9 -199 87 82 -56 121 87 41 -12 -137
4660a37J79L0j2j55L10l08J31R6j85J51j31J68J18n20K99J43kl03J84L25m19J48
$$ -137 42 72 60 -95 215 -93 38 134 -51 100 -31 137 255 -265 34 177 175 -128 56 381 -38 110
4682A10j61J83q4k96K90k32R0O8k68J61R8J2R5J33m53L59l0J9l8j50k60N30Ml58
$$ 110 -51 132 48 -248 42 -190 -100 -32 -300 -139 -41 -29 66 199 -254 105 75 94 56 -94 -354 176 180 -178
4706a78J59k91K45l30L52J60m01J81K40J3n1k36j37K47J96j68J19l57K64j75k3
$$ -178 -19 -310 -65 -395 -43 117 -284 -103 137 150 99 -137 -274 -27 169 1 120 -237 27 -148 -171
4727a71K4m1l5J97L7k68L75K0j24o0J17l27J97K74o3r9O4o0k08K05J39j82J59
$$ -171 -147 -188 -223 -26 11 -257 118 138 14 -46 71 -256 -59 215 152 53 117 57 -151 54 193 11 170
4750A70j24l56J24K35J9L8o3K22l24L8K85m6j70m7Q8j97p8K31K31n31N73k56l37
$$ 170 46 -310 -186 49 68 106 43 265 -59 -21 264 218 48 1 89 -108 -186 45 276 -255 318 62 -275
4773b75K57q5o1J52J94r0k91J18j57K85p5j28P0l4Q0J00P6l63M33j82P4J1k77
$$ -275 -18 -103 -164 -12 182 92 -199 -81 -238 47 -28 -156 -86 -120 -40 60 136 -227 206 24 98 109 -168
4796a68J51j55L28j68J85J97m24J90j51J37J43k46q2m61K93K09j22K50j61J55
$$ -168 -17 -172 156 -12 173 370 -54 136 -15 122 265 19 -63 -524 -231 -22 -144 106 -55 100
4816A00l25J53k6k2L45m22J21K34j21j10P7J60j06J11k14k48K09J46Q9L0j95J51
$$ 100 -225 -72 -98 -120 225 -197 -76 158 37 -73 4 164 58 169 -45 -293 -84 62 151 181 -14 137
4838A37j5j04j37M6l0J7J69J23J19k54m5l95O53l03P4m2m4P0J37j67P4l30K44
$$ 137 122 18 -119 -73 -103 -86 83 206 325 71 26 -369 284 -19 55 13 -31 39 176 9 83 -247 -3
4861cj29mm6R8K97k71J80J96l86MP8J12K6n1l34L35k09qQ5R4R5l54M33J13k37
$$ -3 -132 -136 -182 -84 213 -58 122 318 -68 -64 14 126 152 101 -233 102 -107 -115 -30 64 159 -195 238 351 114
4886A14l89N16j71O6k35J59k15J58n5k1K10j69K1P1m7L8k00L79m49jK79j19P8
$$ 114 -275 241 70 136 -99 60 -155 3 -52 -73 137 -32 -11 60 13 51 -149 230 -219 -220 59 -60 18
4909A8k58J69J54r8O6p7n9L12k03K17l49J43O7l06R6L4L88l15k1J14j59m4Q0j2
$$ 18 -240 -71 83 -15 51 -26 -85 227 24 241 -108 35 102 -204 -108 -74 314 -1 -22 92 -67 -111 -31 -43
4933d3J54j04k64N12K0l96K79j53J02k59K24J13l73l9J75k14K19J77j53nn4O6
$$ -43 111 7 -257 255 275 -121 158 5 107 -152 72 185 -188 -227 -52 -266 -47 130 -23 -28 -82 -16
4955a6L9P0j4K63l50pJ03J82j66l30Q2N03j49n07N20k83J61J8k83K83j68R0j69
$$ -16 23 93 79 342 -8 -15 88 270 104 -226 -144 359 210 -297 223 -60 101 119 -164 119 -49 41 -128
4978a28K54k79J19r5k21L26J64j16p9k95J09K31j22K83j23p7K5q2M25j60l07K02
$$ -128 126 -153 -34 -129 -350 -24 140 24 -55 -350 -241 -10 -132 151 28 -49 -24 -106 319 159 -148 54
5000E4Q8k93L03Q9k15j08oK23m72N35l56K44j55P1o9N6M4j40nP6R2p3J43l3j8
$$ 54 142 -151 152 241 26 -82 -88 135 -337 198 -158 86 -69 2 -67 -11 33 -107 -112 -36 56 -17 126 93 75
5025G5J5j85J81m1J4Ml06L77k96K08qm5j1k67K46Q0J46k84J18J58q0j58m4P0j04
$$ 75 90 -95 86 45 59 63 -243 134 -162 46 38 -7 -18 -285 -39 41 187 -97 21 179 99 -59 -103 -33 -137
5050a37OJ96m0Mj27L25M6j2k96J5K1p5J96k32J43j34j68K51j95p5L34k05R6O8
$$ -137 -131 65 25 29 -98 227 273 261 -35 -20 1 -74 122 -110 33 -101 -269 -18 -213 -288 46 -159 -63 5
5074EO4k04K9M37n23J23n1K91n8J51k49l6j23k8L30p1j08k22J33j36j6L30j28
$$ 5 69 -135 -106 331 -192 -69 -120 171 113 264 15 -21 -144 -172 158 87 -21 -243 -110 -246 -262 68 -60
5097f0J62j72M8K77m3l71J55K27n49J38o6J48j32L11n7n7M3k9J25j15Q3k70K67
$$ -60 102 -70 -22 255 212 -159 -4 223 -326 -188 -254 -106 -238 73 16 -41 2 -27 98 -17 66 -204 63
5120F3Q8P5k06J4J45k9m5R6l51n8K22l3r6L61j86p5nj48L20j93j85n9L33j21L4
$$ 63 151 226 20 34 179 150 105 201 -150 -208 14 -19 -115 246 60 -15 -20 -168 152 -41 -226 -285 48 -73 -39
5145c9o5L5L00m4Q4k41j51L34k48J78j83J7P0n0R2l02K81Kj42K3J36k04K74k81
$$ -39 -104 -69 231 187 271 30 -121 213 -35 143 -40 -23 47 -3 89 -213 68 70 -72 -49 87 -117 157 -124
5169a24J60j5N3l30J19K16j09J25m3k4J12j00J08k29j4J7j16P6K54j09L6K7j62
$$ -124 36 21 74 -256 -137 79 -30 95 52 28 140 40 148 -81 -95 -78 -194 -118 136 27 63 90 -72
5192g2k79Q6L82n09L16L13k31O6k1R7k96jL63j99K13n47M36K3j01J75l10O3K07
$$ -72 -351 -265 117 -392 -76 237 6 72 51 148 -148 -149 214 15 228 -319 117 140 39 214 -96 -33 174
5215A74l52j7O1K49J57l53J87N4l08K26k72L97j91l7K84k74n5Q8K00j36j41J14
$$ 174 -178 -195 -134 115 272 -81 106 160 -148 78 -194 203 12 -25 259 -15 -70 18 218 82 -59 55
5237E5j90K57M7j98K54j28j88Q2j67J13j09K49n6K7k35K34j15K98j64J68j65n9
$$ 55 -135 122 169 -29 225 97 -91 -9 -176 -63 -172 77 21 48 -187 47 -68 230 66 234 69 10
5259A0L5j44J26j10J16R1k71J67J19r0n7j07J97j81K93k04M7l0k15J95J46o9m48
$$ 10 45 -99 27 -83 33 124 -147 20 139 49 -8 -115 82 -99 194 -10 37 7 -208 -13 133 64 -384
5282c84L10L3o9J73M5K05l76R9l7m2K06l58J35J8K2j97jK44K6l7N9j27M6K50n32
$$ -384 -74 -41 -110 63 108 313 -63 36 -1 -43 163 -195 -60 -42 -20 -217 -218 26 52 15 74 -53 -7 243 -289
5307b89L70k44o9K35J86r9J00l54K27l15L23j28Q2%Q2j86j5p1K15j90K39k09Q4
$$ -289 81 -163 -232 3 189 90 190 -164 63 -252 71 -57 25 25 107 -79 -94 -165 50 -140 99 -110 -26
5330b6p8p2L68l16L29j45k3k2L21l45J03l63N75m05M7K28m15K16j1M72j37l26
$$ -26 -104 -176 192 -124 205 60 37 15 336 -9 94 -269 306 -99 -52 176 -239 -23 -34 438 301 -25
5352b5n3l26L80n9L10j63k10J78m2K61l07J57j80P5k33M03j10K18k59j66M9k8
$$ -25 -78 -404 -24 -83 227 64 -146 32 -10 251 -56 101 -79 -4 -237 166 56 274 15 -151 -102 -130
5374a30K11N3k38KK06j77L40j28j7k61J09J81m25M32j02J77k56K5LJ51j18r8L05
$$ -130 81 134 -104 -102 104 -73 267 139 122 -139 -30 151 -274 158 56 233 -23 2 5 156 38 -60 245
5397B45j13n9R7j27N5m03M49l12J91nj62J87j04K61k58N0p6J60qj84J81J67m65
$$ 245 132 73 170 43 98 -305 144 -168 23 18 -144 43 -61 200 -58 -8 -84 76 68 -116 65 232 -233
5420b33K94k02l3L37j13m4k01K16k6j82Q3P8J21Oj21O3l1j15J02m15N97j38J9
$$ -233 61 -141 -174 163 50 6 -195 21 -5 -187 -104 -26 95 101 -20 43 12 -103 -1 -416 181 43 62
5443F2J89k35j26L19k73J18k1k14J10r4k7J36J1n6J2J87Q0j32P5j25j21L02k92
$$ 62 251 16 -110 209 -64 54 33 -181 -71 -165 -192 -56 -45 -101 -89 98 178 46 121 -4 -125 177 -115
5466a15K44k48K5K97m5j56j24K73k71J2K67j65j44P6J53j1K3j21j03L40l60L8
$$ -115 129 -119 -94 203 158 2 -122 151 -120 -108 159 -6 -150 -74 79 68 91 -30 -133 207 -153 -115
5488a15K8j0P9P6j05J7j48L07l88L74j94J2J40k12R4pJ35m78M95l08n3K85o9K71
$$ -115 -87 -97 -18 58 -47 -30 -178 129 -259 115 -79 -67 73 -139 -45 -52 83 -395 100 -208 -261 24 -45 226
5512B26m3q1j25%L7n7P3O9k35M24r0j71j24K60R1j51R6n2L7l14O1N6KL6P8n0j51
$$ 226 183 102 -23 -23 14 -43 30 99 -136 288 198 27 -97 163 254 103 199 147 184 -130 -69 -13 -11 25 103 53 -98
5539i8l9K41o0m1j08K65qj07k59L40j89l18K11J48j2k14L06P4k57O0Q6j03J16
$$ -98 -137 104 44 3 -105 160 152 45 -214 126 -63 -381 -170 -22 -34 -248 58 132 -125 -65 21 -82 34
5562C4j40K23J6k85L03j12k58L41j53J39P8k51j14p8J25J49J58k61J37j14LJ70
$$ 34 -106 117 133 -152 151 39 -219 122 -31 108 186 -65 -179 -257 -132 17 175 -86 51 -63 -60 110
5584A10j23r0J69j39J61P4J26m99K26K71j63O2p1Q5j67m5j10l9J96k26K77j06
$$ 110 -13 -103 66 -73 88 162 288 -211 15 286 123 185 114 199 32 -13 -123 -162 34 -192 85 -21
5606b1l6o1J20P1J28o12M44K53l56P4j43J16J91J01k59k5j49J74j52n7L84k89
$$ -21 -57 -118 2 73 201 -411 33 286 -70 4 -139 -23 168 269 10 -15 -164 10 -142 -199 185 -104
5628a04O9N6n7K04k24j50N6j8P5L14l48j11L71r1L4j27k10M31k48J0NJ16J76l51
$$ -104 -35 21 -36 168 -56 -206 -150 -168 -93 221 -127 -238 133 42 76 -51 -261 170 -78 -68 -63 53 229 -122
5652a22K38j8k7n8m8L1j5n1L08l31J90k33L76l18o7N39l02k8j47J8k1O8Q0l0K12
$$ -122 116 98 71 13 -35 -4 -19 -70 238 -93 97 -136 240 -78 -145 394 92 64 -83 -65 -86 -18 62 32 244
5677B44o4j68K30n2o8k55J40n03K89K57k2k76P6J14J91l95J96J92j05J0Lk5O3
$$ 244 180 12 242 190 122 -133 7 -496 -207 50 28 -248 -172 -58 133 -262 -66 126 21 31 34 9 72
5700G2j36O3j48J45O0Q2l9j77p7K55j8j68r7nJ15L63j72J18m03j07K09j00LR0
$$ 72 -64 -1 -149 -4 56 138 99 -78 -155 100 82 -86 -183 -188 -73 290 118 236 -167 -274 -65 -165 -162 -72
5724g2Np8J74J74j37k97K31m2K4J00j57K80l26J83K47j73rj77m0K6N2l7j0J35
$$ -72 -67 -145 29 203 66 -231 0 -42 -18 82 -75 205 -121 62 309 136 127 -50 -90 -64 -12 -49 -59 76
5748G6L9J25l33J18N4P7k7k6j38NJ54k42M0J55J3L4j06J11j69k4J85q6n1k0j50
$$ 76 115 240 -93 25 79 156 129 103 -35 -30 124 -118 -78 77 90 124 18 129 -40 -64 121 35 -16 -36 -186
5773a86K87n8Q4m7j07R3Mj3J12m4k63Pj9J63k64J03K65J14k93r2J19J73l7k19
$$ -186 101 43 127 80 -27 66 70 57 169 125 -138 -131 -150 13 -251 -148 117 231 -62 -154 -35 138 101 -118
5797a18M3K15k88n1M75j85j21J73l81K57j57m3K90K7J27k73j69M17m23J66J11
$$ -118 -75 140 -148 -199 276 91 -30 143 -238 19 -138 -181 109 136 263 -10 -179 238 -185 -19 92
5818I2j03J57k55J15N3pL8k12p3L57P2J04m73j15L94p0j9j27j18N09k98N7l8L6
$$ 92 -11 146 -109 6 59 52 90 -122 -195 162 234 338 -135 -250 144 74 55 -72 -190 319 21 78 40 76
5842G6J96k01R1j65Q4J49jk03n1J12j3J73k88J1J67k55P2K68l99J14J28Q1k35
$$ 76 272 71 162 -3 81 230 229 26 -25 87 74 247 -41 -30 137 -118 -46 222 -177 -63 65 146 -89
5865h9l6K00L6J2k7m4p1J41j46q5r2K13jj39p7J44K16l56K96K2k05JJ72K1l85
$$ -89 -125 75 111 123 96 52 -19 122 -24 -109 -201 12 11 -128 -205 -61 155 -201 95 117 -88 -87 85 106 -279
5890b79J32L23o2l16j29K42J49j06K34k03j4P9J47q1l80L36J5j53M5K01m2J52
$$ -279 -147 176 114 -202 -331 -89 60 -46 188 -15 -29 50 197 116 -264 72 87 -66 -21 180 138 290
5912B90m68K23p0n3J84k23J90j8K5o1J48j34O2pr5k2K5K90rm07K66j87o5J30Q6
$$ 290 -178 45 -25 -78 106 -117 73 55 80 19 167 33 95 88 -7 -29 -4 286 277 -130 136 -51 -116 14 100
5937A00j45K74k77q8K6J5L53m83K38Kj17L59l50O4k2M2J61l04j44N45n47M68k11
$$ 100 -45 229 -48 -136 -110 -95 258 -225 13 15 -102 257 -93 -29 -51 -9 152 -152 -296 249 -298 170 -41
5960d1r6R2JJ73o1J22k69P1R1q1k50L93m22J02J72j8k8P6O5k21J47o5L7J65k41
$$ -41 -137 -45 -44 129 68 190 -79 -8 83 2 -248 145 -277 -175 -3 -21 -49 27 92 -129 18 -47 -10 155 -86
5985h6J9K34r8J26k83p5Q4J83J92j21k73K84j38k3Qr0L37n72L01l0j15k51M58
$$ -86 -67 167 69 195 -88 -163 -79 104 296 175 -98 186 48 25 33 -57 280 -292 9 -21 -136 -387 71
6008G1l12L68J23j67j8k86K03q6r9l0J51p0J06J53k39M17m27K57J46n50L55n6
$$ 71 -241 127 250 83 65 -221 -18 -104 -203 -233 -82 -152 -46 107 -132 285 -142 115 261 -289 66 10
6030A0P7P1j49J08o6L1J81k6j61j51L7m5j03J52l0m3N4O0j9K12l78J70l60K28
$$ 10 87 158 9 117 51 82 263 237 76 -75 -38 -83 -186 -34 -64 -107 -53 7 -12 200 -178 -8 -368 -140
6054a40R1MJ18r3K26j4j74OJ95j75J33m38J50K09p1R7k37P2K33l83r4L86k44p5
$$ -140 -49 -45 73 -20 206 192 18 24 219 44 177 -261 -111 98 27 124 -113 -41 192 -191 -285 101 -143 -218
6078b18L09K3j76k4Rk16N4L08j54k3L24j59J09m67M17l85J98O8K24r1j80J64l93
$$ -218 91 114 -62 -86 -77 -293 -239 69 -85 -108 216 57 166 -301 116 -269 -71 -3 221 130 -50 114 -279
6101b79K14M7r3K01m26M34Mn0K4j80J27M5p8j58j2J82k0K72qk10r8J17M4j37J44
$$ -279 -65 -18 -111 90 -336 98 102 52 76 -104 23 68 -10 -168 -180 2 -18 254 246 36 -62 55 99 -38 106
6126A06l48K03J47k46o6M22j25k41m6K25j34J74L3o6j44J46j17M6j7q0K28o8j06
$$ 106 -242 -39 108 -138 -204 218 93 -148 -194 31 -103 71 104 38 -106 40 -77 -31 -48 -128 100 32 -74
6149g4K91l48J53k83L21k50P7K01j98j23M73l16o1K95r2P1j98j58J43K70rn85
$$ -74 217 -131 22 -261 60 -190 -113 88 -110 -233 240 -76 -137 158 66 137 -61 -219 -76 194 185 -400
6171d00K14M26k37q3j29M18n42N56j51k63L13m08K89l4l95N91m88K40j78j04L75
$$ -400 -186 240 3 -80 -209 209 -333 223 72 -191 122 -286 3 -31 -426 165 -323 -83 -261 -365 10
6192A0M3L6l15K77k03K38j07M4l0K6o4J21N8j73p7j33J55q0J56k6j38L36r2oJ85
$$ 10 53 89 -226 51 -152 86 -21 23 -7 19 -45 76 134 -39 -116 -249 -94 -174 -18 -44 -182 154 62 56 241
6217B41n2j69K35m68L9J1J57p9O1l0j68lM38l42J69K17j23l99J92p8K48j19p2
$$ 241 189 20 255 -213 -174 -163 -6 -85 -24 -54 -222 -225 213 -129 40 257 134 -265 -73 -151 97 -22 -94
6240i4Q5M3j55j70J84J0O1K62R0m28J50o4j26o6L00j21j12L95l31Nk2M5J54n7
$$ -94 -9 34 -121 -291 -107 -97 -36 226 316 -112 38 -26 -152 -218 82 -39 -151 244 -87 -82 -104 -59 95 38
6264C8P7Kj4n5P1j69K42r5q3mJ37m1j97L3J78k67r9K43K19k98J78k21J49n6j09
$$ 38 115 117 103 48 119 -50 192 97 14 10 147 106 -91 -58 120 -147 -246 -3 216 -82 96 -125 24 -32 -141
6289a41J73L4m0j12Q0j19J82L01j82l79N29m51O6K52k00j62J13Q0j34J32j53K95
$$ -141 32 66 26 -86 -6 -125 57 358 176 -203 326 -125 -59 193 -7 -169 -56 24 -110 22 -131 164
6311A64k25K11k20k27M09nm17K66L99m55NJ09K2J0q5L9L58k89J2j87P8R3j65J9
$$ 164 -61 150 -70 -297 112 107 -310 -44 355 -100 -95 14 36 46 -39 0 358 69 81 -106 -28 65 -100 -81
6335h1J50j77q7r0N48n24L88j95j12L2K55k52K40k45lK9L15j50Q0j11J92l29J07
$$ -81 69 -108 -195 -285 263 -261 127 -68 -180 -148 107 -145 95 -150 -153 -124 191 41 121 10 202 -127 -20
6358b0j04K5J14LJ6k09J96j54M00k80L6q5J53k8J30r9M3R2j88j1k2r9l9o9J63
$$ -20 -124 -99 15 18 34 -175 21 -133 267 -13 23 -62 91 63 193 94 137 229 41 30 8 -91 -130 -199 -36
6383c6P3l91L43k2Jj52L63l45J25j24K0J19P7k57L58j55Oj4j29L79k18m5j03J77
$$ -36 37 -354 -11 -33 -32 -184 179 -166 -41 -165 -145 -26 51 -206 152 -3 3 -11 -140 239 21 -24 -127 50
6407E0j60K26r9j41oN3J42j45l2J24p2L01k91K03l42L05pk22J07K75O8l65R2k9
$$ 50 -110 116 17 -124 -130 -77 65 -80 -112 12 -60 241 -50 153 -189 116 109 -113 -6 269 337 -28 64 35
6431C5kk94p2J36J11M62m27J6k4p1J57k16K46N0QK0m32M53l85K50q6OJ11k04K45
$$ 35 33 -261 -333 -197 -86 376 -51 -35 -59 -130 27 -189 57 107 115 135 -297 156 -229 21 -65 -59 52 -152 93
6456I3l11K06J79l30K3L14l8J57l73J15j46K49k49K94j53j6k01j62J17K45l3q0
$$ 93 -218 -12 167 -163 -140 174 136 293 -80 35 -111 138 -111 183 30 14 -187 -349 -232 13 -20 -100
6478a00K43n32N28L0M3l16L03j13P9j20k08J76m6L9m04N35j67J01J19j88J30q9
$$ -100 143 -389 139 169 212 -104 199 86 165 45 -163 13 -33 6 -398 137 -30 71 190 2 132 43
6500D3k12M93l07J32j03j72K10k03O6k4R4k4k42L31Q0j80j81J74J79j93M6J01
$$ 43 -169 324 17 149 46 -126 84 -119 -53 -77 17 -7 -249 82 162 -18 -199 -25 154 -39 7 108
6522A08j26J02o8l7P4j87K15K06k46L1n3m1q2M4K19k6R6j80j01K17j42n1R7j71
$$ 108 -18 84 16 -21 53 -134 81 287 41 72 19 -22 -104 -60 159 133 229 49 -52 165 23 -28 69 -102
6546a02J88N8j41m1r0M06j39k69J7K2l05N70R7l14L7rJ55J1l45L58k94K48J12
$$ -102 86 144 3 -38 -128 278 139 -130 -113 -91 -396 174 271 -43 -6 -15 140 151 -194 164 -130 118 230
6569B30l93K38J92l5j03j08p2J19K85n42L24J72m70K73lk93m7L09M3k18J85l7
$$ 230 -163 75 267 232 129 21 -51 68 353 -189 135 307 -163 110 107 -186 -233 76 119 -99 86 49
6591D9r5J44k2l56J47K57q4n4k7lj65l4J74J82l53Q9O4R7K03l53R1K28q3l36M51
$$ 49 -46 98 76 -280 -133 124 40 -14 -41 -44 -209 -243 -69 113 -240 -151 -87 10 213 -140 -49 179 96 -240 211
6616B11l8m5k22J5j44M6J3M1K09lj33J40k51Q8K42m00R9j1L91j72j04Mm3K80j23
$$ 211 173 128 -94 -79 -223 -177 -164 -123 86 83 -50 90 -161 -73 169 -231 -132 -143 248 76 -28 -24 -67 213 90
6641I0k57J54l6PK25j81O9m6l11J31n7K88Q1j86l0L25k96j28J00K29l91M54q6
$$ 90 -167 -13 -49 -42 183 2 71 25 -286 -155 -212 76 157 -29 -59 266 -30 -158 -58 171 -220 234 148
6664A48N2l48K39n8K6n1l7on8K34L8l50J63Jp5P4j8J25j38j33L79m08J80J63j67
$$ 148 200 -148 91 33 59 8 -29 -35 -93 141 179 -171 -8 -7 -82 -8 -26 99 -39 -172 207 -201 -21 142 -25
6689b5J04R9j33J6K49r8l55K8L17k54mj51O9J21Q0j19k6J42K01l74J78j27j76
$$ -25 79 178 45 61 310 212 -143 -115 202 -52 -56 -207 -138 -17 63 -56 -82 60 261 -113 65 -62 -238
6712b38J88O8j9PK4o8K72l42K10l06N06k83J39j17J72J2m35L23rj79K24J9j7k96
$$ -238 -50 18 -1 6 30 -38 234 -108 102 -204 302 19 158 41 213 225 -210 113 104 -75 149 168 151 -145
6736a45J21J87k11O2J50j31p9P1L28k72j00k8K91o51K96r9N3K67j15p2L70k06
$$ -145 -24 163 -48 14 164 33 -46 25 353 81 -19 -47 244 -407 -111 -210 -157 110 -5 -77 293 87
6758H7o9j55Q1pL1j12M8j12K54P7J06J5j86j56n3O7j71M0O5J48k96L65j55j12
$$ 87 18 -137 -56 -63 -32 -144 -96 -208 46 123 229 244 58 -98 -151 -84 -255 -215 -150 -2 -298 67 -88 -200
6782b00K63K01l72J28n6K64k52J32m8l4k96N53m79oJ79K5J63k18j08K67j55N4
$$ -200 63 264 -108 20 -36 228 -24 108 60 26 -270 283 -196 -202 -23 2 165 -53 -161 106 -49 5
6804EJ57l69K60N9j7j77J05Q1rJ31q1j25l92M86K9M1k51J52lK3k11J53J32j71
$$ 5 162 -207 53 112 95 -82 23 104 95 226 145 20 -372 114 143 184 -67 85 82 105 -106 47 179 8
6828HJ25o7R6n9l54K43K34J35m20mR1l5Q2l0j2P9l03R0j06m0J21j00K29L67m86
$$ 8 133 66 162 103 -251 -8 226 361 -59 -63 28 -7 75 45 33 112 -191 -101 -207 -247 -126 -226 3 370 -116
6853a16m2J42k96j84O09O4p9m2j13M37q11L07J75j87R8L28j29q7M9k05P5j34Q3
$$ -116 -158 -16 -312 -496 113 177 98 56 -57 380 -431 -124 51 -136 -38 290 161 74 123 -82 -7 -141 -58
6876e8L69l44N5k73J66K11k64J55j5K4k3K31k23K54o16L74l16L66l30K04J55l33
$$ -58 311 -33 22 -251 -85 126 -138 17 2 26 3 234 11 265 -351 23 -293 73 -257 -53 102 -231
6898b31K70j37J11K8R1J2k9j00n0k01J45p3K53Kp6M4p6o6K89n2j33J48l12J25
$$ -231 39 -98 13 41 132 144 115 15 -35 -236 -91 -164 89 91 15 59 -17 -83 206 154 21 169 -143 -18
6922a8j4j6J7K23q8k42J50J12k00p3L12j49j4o7p9K47Rj47l8J84l4q3J25M8p5
$$ -18 -32 -48 -31 192 104 -138 12 124 -76 -149 163 14 0 -67 -146 101 110 -37 -75 109 75 -8 117 165 90
6947I0l49L90j19q1j12L28j91nj53L19K15m16K62j09n4r2j2OK01j48L12k19J1
$$ 90 -259 131 12 -69 -181 147 -44 -49 -202 117 332 -84 178 69 15 -77 -89 -83 118 -30 282 63 74
6970G4R5j29j42P5K90l69K30J17j63J22k81j79M41j81k2N3k2j00J80P4l12K66
$$ 74 169 40 -102 -27 263 -106 124 241 78 200 -81 -260 181 0 -22 31 9 -91 89 163 -149 117
6992A17K3l87N60l92P8k12J07J46L4q2J69J66k29j06lJ09p8J05L8j95Q6k11M41
$$ 117 140 -247 313 -79 -1 -213 -106 40 74 -8 161 327 98 -8 -11 98 20 125 163 -32 54 -157 284
7015B84l85L1J65m2k56K50j30m5j38L10k71M37j87j89L42m29K30k1L7J36M2l05
$$ 284 -101 -70 95 53 -203 47 -83 -128 -266 44 -227 210 23 -166 176 -253 -23 -44 -7 129 171 -134
7037a34j34N17n36M16k14K5L28l47J96J04j40k61K70Nj34Q0j7j7n3J9J34M3j59
$$ -134 -268 249 -287 129 -85 -60 268 -79 117 221 81 -180 90 95 -39 41 24 7 -46 -27 107 150 -9
7060iP0q8Q7n7k10J65J06m26N13K7j51j8J7K29l9k36r1K89k43K12k67m6K49o2
$$ -9 61 -27 60 3 -207 -42 64 -362 151 178 27 9 26 255 216 -20 -111 178 -65 147 -120 -166 83 21
7084B1l5K18q8j16k6M6j44kJ02L27j60j09j93L89l35P7R7j79m8L14k36q2J47m0
$$ 21 -14 204 116 0 -26 20 -124 -126 -24 303 143 34 -159 230 -105 -28 69 -110 -158 156 -80 -162 -15 -55
7108e5K39j31M9j33lk8J37j04P4l8pj1j27Kj78J52L34k48L43m23j8N41k22m4k99
$$ -55 184 53 102 -31 -34 -62 75 -29 45 7 0 -11 -138 -136 -314 -162 172 -76 267 -156 -174 367 145 101 -198
7133a98O9J64k05k1L18P4k28k11J13R3J62l21J75K07n1k72K9L19k44m1M36p13
$$ -198 -129 35 -170 -191 127 201 -27 -238 -125 -32 130 -191 -16 191 140 -132 -103 216 -28 -69 367 -346
7155c46K52J81Q2q8L33k52l35K16k3j56K50j07J82k09J74J2m1k8j5k84K44k43
$$ -346 -94 87 169 81 414 162 -173 43 20 -136 114 7 189 -20 154 166 125 97 82 -202 42 -201
7177b01L69K0k06j09j35J11j49J67J76j69j8L45l42j06J86j78J64O3J19J47l62
$$ -201 168 188 -18 -127 -262 -151 -300 -133 43 -126 -144 201 -141 -247 -61 -239 -75 -12 107 254 -108
7198a08K28m5k46L93k31N2J29r6q6p3L92l93J43K5l9o1P7k04n3K25j43n4N5j03
$$ -108 120 75 -171 222 -9 43 172 76 -10 -83 309 -84 59 84 45 -16 61 -143 -196 29 -114 -168 -113 -216
7222b16L36j05m01J48K36n3k37K17L72l58j04L9O8Q5q7L33j57J95o25K17K28Q8
$$ -216 120 15 -386 -238 -2 -55 -292 -75 297 -61 -165 -126 -58 27 -60 273 116 311 -314 -97 131 219
7244B19m01M44j20j79j90K6M41j63k8j72L31O3n60J90O8k2M3J45o6j6k66K37J84
$$ 219 -182 262 142 -37 -227 -201 240 77 49 -123 208 271 -289 -99 -31 -53 -10 135 69 53 -213 24 208
7267B08l51J57j24J64j29N0q5K17k11K27p2r6J8Q9n57N88j67J84m8k73J4L56j00
$$ 208 -143 14 -110 54 -75 -25 -110 107 -104 123 51 -45 -27 62 -495 93 -74 110 62 -211 -197 159 59
7290E9J20k03r8J35Nl14L13K7j55L57k74k21M17K04p23K97J9J76k09M7J30J34
$$ 59 179 -24 -122 13 18 -296 17 44 -111 246 -28 -249 168 372 -351 -54 -35 141 -68 -21 109 243
7312B43n7k27j55R1l9pL54j57r5O5j14J84J09m24L64l65M3K15J24q0j14R6k13
$$ 243 186 -41 -196 -105 -144 -151 203 46 -49 16 -98 86 195 -229 135 -230 -187 28 152 72 -42 54 -159
7335a59Nj45J78O6K5k8J79J82k38K7j95N7J31l24J77NR2r6M8ml44N09j08L16q08
$$ -159 -154 -299 -121 -55 -30 -58 121 303 65 92 -103 -46 85 -239 -62 -57 35 -61 -13 -17 -361 148 40 356 -452
7360d52K97L23k49j46L48lj17q0j81K25L34k57qJ18M7l18J34L9K9j8k4j17J13
$$ -452 -155 168 -81 -227 121 118 1 -79 -260 -35 299 42 34 152 199 -119 15 54 83 65 41 -76 37
7383C7j85M7K13j10N5m2k29J64J23J20m95M33j38j4K4j13J69j68j84J04P0M02
$$ 37 -148 -101 112 2 57 15 -214 -50 73 193 -302 131 -7 -21 3 -110 59 -109 -293 -189 -119 283
7405B83j49N1J39l83j30K84o9j9K3L6J84k74j03J63R7j57O0JJ6k99J52L40p4j82
$$ 283 134 185 324 -59 -189 95 26 7 30 66 250 -24 -127 36 133 -24 36 37 53 -246 -94 246 172 -10
7429a0L77k13K0p4N9o66N72j93lJ08j11K36k60N05k68j36oj38L89j88k61K46j01
$$ -10 367 154 174 100 159 -507 65 -128 -131 -23 -134 102 -158 347 79 -57 -63 -201 188 0 -261 -15 -116
7452a16N4L7j8M5L0J0l3J70l17K97r5J61K3j66lj60L13j42k39J59j88oL95l00
$$ -116 -62 -25 -43 2 32 42 9 179 -138 159 64 225 248 82 79 -81 232 90 -149 10 -178 -184 211 -89
7476h9M0mj10M1K36j9j39j00J08N2l22L61j04P8J30m16L35Q6j20LJ13l33K61K05
$$ -89 -49 -53 -163 -122 114 95 -44 -144 -36 16 -306 55 -49 29 159 -257 78 164 44 47 160 -173 88 293
7500B93o8p8j33J25J38Kl93j19K72N1J49m73J07N52k52n04L33J94j61o2L9K87
$$ 293 225 147 14 139 277 279 -114 -233 39 90 239 -234 -127 425 173 -331 2 196 35 -27 12 299
7522B99j56j62J73j13LJ1R8q6p6L66k64m2j75K09j67R0L4k16K9J99L75m66M2j53
$$ 299 143 -19 154 41 44 55 153 67 -9 357 93 51 -124 85 -82 8 42 -174 -145 54 429 -37 5 -148
7546a48L07k3J46l08q9PJ58j6k5j53L85m44K37l0J00N1P7k30Q5K03l95J73l71
$$ -148 159 136 282 -26 -115 -108 50 34 9 -144 241 -203 34 4 104 155 232 2 87 290 -105 68 -303
7569c03P6J88J03q2j16n4M05j63p6J78k71J70J80k25K71j51L4p7j05l2J52l50
$$ -303 -227 -39 64 -18 -134 -188 217 54 -22 156 -115 55 235 10 281 130 164 87 -18 -50 102 -248
7591b48K54k37K48J05j52L3j29K34N7l17O9m9O5l9K27k53J76j02K40k82R4l37
$$ -248 6 -231 17 122 -30 3 -126 108 165 -152 -83 -132 -67 -106 121 -132 44 -58 182 -100 -6 -343
7613c43M08j66J79K4l33L36J41j72j54Q6M4j08J54j27J78M7r7J84n36K11R4K45
$$ -343 65 -101 78 102 -231 105 246 74 -80 6 50 -58 96 -31 147 194 97 281 -255 -44 50 295
7635B95j28K10k25l01J12N3K8j80l1K83L5k18k5J45K3J07r8j6j41J31n4K5P6j07
$$ 295 167 377 152 -149 -37 16 44 -136 -167 116 151 -67 -92 53 76 183 85 69 -72 59 5 30 106 -1
7659aj56J36p7J59M4j98J41r0Q5j0L56q5j81M1k66R0L47m66P0j10L05l14K19n4
$$ -1 -157 -21 -98 61 105 -93 48 -42 43 33 389 304 123 164 -102 -12 335 -131 -61 -171 134 -180 39 -15
7683a5J23l14Q9J20j04M3J64k2O6j97L71m14J94j5P6j86k73K97q2Q9P8R2j62j48
$$ -15 108 -206 -117 3 -101 -58 106 84 150 -47 324 -90 104 89 165 -21 -294 3 -79 10 88 180 18 -130
7707a30J67q8km1O3oK27j59J56L42o90J65j09K39q3r5n5Q8j30R3Lj10P6J52k41
$$ -130 37 -51 -53 -94 -31 -37 190 31 187 529 -161 4 -105 134 51 -44 -99 -11 -141 -48 -45 -155 -79 73 -168
7732a68k5L68j78q8L41p1m25K66Q3n5j42R6Q6k55K19j90P7J08J24k93N2L07j67
$$ -168 -193 175 -3 -91 250 179 -246 20 103 48 -94 2 88 -167 52 -138 -61 47 171 -122 -70 237 70
7755G0j6R3l36K77%k54j17J35J70M1j07rj52K25j11K2l5m03O79k29J94jk3Q5j69
$$ 70 54 147 -189 88 88 -166 -283 -148 22 63 -44 -53 -205 20 -91 -69 -104 -507 172 -57 137 136 113 198 29
7780B9J03k5j18J2N8p0j1j3j8j18J68K32j45j74J84j55K51l49lQ9j17O4R5j31
$$ 29 132 107 -11 1 59 -11 -22 -35 -53 -171 -3 229 84 -90 94 -61 190 -159 -162 -73 -190 -126 -31 -162
7804a62J65j13K93J2k22L4P1p9r3P7jJ83K93l31nk40J67j27Q0k50L43k07K19N5
$$ -162 3 -110 183 195 -27 7 78 -1 -94 -17 -18 165 458 127 122 -118 49 -78 2 -248 95 -112 107 162
7828A62k69r2M68m24r6P10m93R1J4p5k26M6K73q6Mm8J65k26p1L70k54q2jM20k92
$$ 162 -107 -199 269 -155 -251 459 -34 57 71 -4 -230 -184 89 3 7 -41 124 -102 -173 197 -57 -139 -140 280 -12
7853a2J30K8l09R8P9n2J38n00N10J15M3k87q7L5P4J51j72J1K18r0l31K20n0j42
$$ -12 118 146 -163 -65 14 -38 100 -400 110 225 268 -19 -106 -71 3 154 -18 -7 211 121 -210 10 -40 -182
7877a82J27J12o2L23k39J10j77K20j70J72Q0k19n0j37j55R4Q5Po8J31J45j25K5
$$ -182 -55 57 -5 318 79 189 12 232 62 234 314 95 45 -92 -247 -153 -68 -61 -129 2 147 22 47
7900D7n9N6N4J16k38r6m0K53j19J5r8O3j4M4RjQ7L4J66k08R1k30J03j15j19J09
$$ 47 -12 44 98 214 -24 -120 -160 93 -26 -11 -109 -46 -60 -16 -7 -8 79 113 279 71 162 -68 35 -80 -199 -90
7926i0J48k97K83q3N0J77k1k32nQ2J93j04k73L25j13j50m8J06K86j03l37K45j52
$$ -90 58 -239 44 -39 11 188 167 -65 -70 12 205 101 -172 153 40 -110 -158 -52 234 131 -206 39 -113
7949a13J65K64k89R0k55p0K34j01K83j62l40K68p9O3M8j42Qj61L85n9Q4p6q7k4
$$ -113 52 316 27 117 -138 -208 26 -75 208 46 -294 -26 -105 -42 6 -136 -128 -289 96 37 121 45 -42 -66
7973f6J0k86M92j02K1k63J6K73l56R4K52%l60J43K34Lj92J33j88M9QK82j81j7
$$ -66 -56 -342 150 48 69 -194 -178 95 -261 -167 85 85 -275 -132 102 105 -87 46 -142 -93 -85 197 16 -1
7997am1k60K09K2L14l85r8M32k60L53k91J20j94r3J41J94O8l99J22p9o3j11K62
$$ -1 -42 -302 -93 -71 243 -142 -240 192 -68 285 -6 114 -80 -173 -32 162 230 -169 -47 -126 -189 -300 -38
8020c8J27Jj75j34K46K5K4J43j59P0J40l82LO3K94j35l53K79j76O6j83M17l2l25
$$ -38 89 90 -85 -219 27 52 76 219 60 130 270 -112 -109 -46 248 113 -240 39 -137 -71 -254 163 131 -194
8044a94K56j2J81l13K81P0J5m59M7N26m91J23l39M26J24k68j3M8qP3kj48L25l33
$$ -194 62 50 231 -82 199 269 284 -175 -128 398 -93 30 -309 117 241 -27 -40 8 0 73 71 -77 248 -85
8068h5K03j30nJ77k78L8k16K44J88Kj00j23K11k02o7J20j7J97j30Q6K5j90J97
$$ -85 118 -12 -17 160 -118 -80 -296 -52 136 138 38 -85 126 -76 -143 -23 -40 157 27 113 138 -52 145
8091A45k31Q8J42j24j09J31j58K4j30K41l1j4N7J77j92J35l15j43M67k72L07k35
$$ 145 -86 2 144 20 -89 42 -116 -92 -222 19 -12 -26 31 208 16 151 -164 -307 160 -112 195 -40
8113d0m1J46K43l11J36l63M33j20k01N4k74K35k72P5J36L14j92k91J86qJ24J89
$$ -40 -81 65 308 -3 133 -230 203 83 -118 -64 -338 -103 -375 -300 -164 150 -42 -333 -147 -155 -31 158
8135A58j1l3j99L0k98L66Q5K19j60j50k9J77k23J25j78M55l63k7J26k32K29P0
$$ 158 147 114 -85 -55 -353 13 98 317 157 7 -22 155 -68 57 -121 334 -29 -56 70 -162 67 137
8157A37O2p0J84n75K24k13N07l69J20J7r3K4k95J62J63K29M5j95j70J62k33k88
$$ 137 199 129 313 -262 -38 -251 256 -113 7 24 -69 -45 -340 -178 -15 214 259 64 -106 56 -177 -465
8179d65O80j33j33RJ04O1L1l27k6J36L3m3
$$ -465 215 82 -51 -42 62 123 154 -173 -199 -63 -30 -73
8191g3
$$ Imaginary data points
##PAGE= N=2
##DATA TABLE= (X++(I..I)), XYDATA
0@%%%%%%%%%%%%%%%qJ6j6J6j6K4l2L2m0M8n6O4p2Q8j02J16j32J50j68J89k16K42
$$ 0 0 0 0 0 0 0 0 0 0 0 0 0 0 0 0 -8 8 -8 8 -8 16 -16 16 -24 24 -32 32 -40 48 -54 62 -70 80 -88 101 -115 127
37A27k69L00l38L77m18M66n16N71o30O96p69Q47r34J028j132J249j377J522j685
$$ 127 -142 158 -180 197 -221 245 -271 300 -330 366 -403 444 -490 538 -594 655 -722 800 -885
56h85J868k079K321k604K945l360L875m540N431o700Q668j2133K0045p4713L620
$$ -885 983 -1096 1225 -1379 1566 -1794 2081 -2459 2972 -3728 4940 -7193 12852 -61861 -58241
71e8241J08638o2262l458O2567m4228q3946O3142L5847n1111L2537O9647p5374
$$ -58241 50397 -11865 -15323 47244 3016 -80930 -17788 18059 -33052 -515 69132 -6242
83f242n9756O2147J0954n0660N6946M9254o9503k6212N1946l2851l6162P7045
$$ -6242 -65998 -3851 7103 -43557 13389 62643 -6860 -33072 18874 -13977 -50139 26906
95B6906L3194o9218J000L7684n2045k1681P6016Q595n1222K7846J8107o8747l990
$$ 26906 60100 -9118 -8118 29566 -22479 -44160 31856 40451 -10771 17075 35182 -33565 -37555
108c7555P0236j0266l4385M4319k18o8921J0607N2459k5634j1434N0802j7087
$$ -37555 32681 22415 -11970 32349 32131 -36790 -26183 26276 642 -10792 40010 22923
120B2923o0096K4096L0791l6057R148N0816k9413m5021K9956Q429l5868K7311
$$ 22923 -37173 -13077 17714 -18343 -9195 41621 12208 -32813 -2857 5572 -30296 -2985
132b985M1046l8019k4725L4241j2252l4959L8163L1290l7301p090K7692k8442
$$ -2985 38061 42 -24683 9558 -2694 -37653 510 31800 -5501 -12591 15101 -13341
144a3341k2994M5005J4717l5489J2086K2284l8254j5563M2293L350k3730K3682
$$ -13341 -36335 8670 23387 -12102 -16 22268 -15986 -31549 10744 14094 -9636 14046
156A4046Q310m3420r18L6590j0855j3592L2352p4m0630N726K3528j8299J661L5146
$$ 14046 22356 -21064 -21982 14608 3753 -9839 22513 22439 -18191 -12465 11063 -7236 -5575 29571
170B9571j2845l4249J4671J1201k4309J0623L3300j7330k2505J6609l939k4930
$$ 29571 16726 -17523 -2852 8349 -15960 -5337 27963 10633 -11872 4737 798 -24132
182b4132K1125K7190k1074j0697J8421j5087k2794K4752J7725j9024K630J5537
$$ -24132 -3007 24183 3109 -7588 10833 -4254 -27048 -2296 15429 -3595 -965 14572
194A4572k3832j7094K4912P719j4746J3875J1024k7624r984K1585j738r854K1452
$$ 14572 -9260 -26354 -1442 6277 -8469 5406 16430 -11194 -21178 407 -1331 -11185 10267
207A0267O469k5778k749J4668j1291k972K6154R33k2669M089Q518j6525J604K4649
$$ 10267 16736 -9042 -11791 2877 -8414 -11386 14768 15701 -6968 -2879 5639 -10886 -9282 15367
221A5367l755j4538J0004k12k0459P216K1499p748p859J2511n765j8497R171J3552
$$ 15367 11612 -2926 7078 6866 -13593 -6377 15122 7374 -485 12026 6261 -12236 -3065 10487
235A0487j0331J023J4230j1324j6576J1478O843j0703O719J1672j3637r512J1509
$$ 10487 156 1179 15409 4085 -12491 -1013 5830 -4873 1846 13518 -119 -9631 1878
248A878j964j0240J1832R752j4603m501J0036o518p246J4054M517j3481J998Q160
$$ 1878 -86 -10326 1506 11258 -3345 -7846 2190 -4328 -11574 2480 6997 -6484 -4486 3674
262C674j1160m088J4382P54j0208N884M249j2355K72J3708m045o926R002L84j1781
$$ 3674 -7486 -11574 2808 3562 -6646 -762 3487 -8868 -8596 5112 1067 -5859 3143 3527 -8254
277h254L886J0291o238k195R982m003j0970O971O828p223J526R130p412p811Q395
$$ -8254 -4368 5923 -315 -2510 7472 3469 -7501 -530 6298 -925 601 9731 2319 -5492 2903
292B903J977p845O089P364r093m829P143j877n436Q558M310r703j380O217n666
$$ 2903 4880 -2965 3124 10488 1395 -3434 3709 1832 -3604 4954 9264 -439 -1819 4398 -1268
307a268m649R392K712p925J952K546q270j586J0187n69n880M798J013r126j46
$$ -1268 -5917 3475 6187 -1738 214 2760 -5510 -7096 3091 2522 -3358 1440 2453 -6673 -6819
322f819P364k259j704O861j703r260K115N227l889N01P864k746p007L379J145
$$ -6819 545 -1714 -3418 3443 1740 -7520 -5405 -178 -4067 -3566 4298 1552 -5455 -2076 -931
337i31m978L734P687l465m509L567j341n158M676O046l790q94M156m278n258N424
$$ -931 -5909 -2175 5512 2047 -2462 1105 -236 -5394 -718 5328 1538 644 4800 522 -4736 688
353F88M031l672J842L659n486l928M788O18l689M626L460o248k077L304k427j912
$$ 688 4719 1047 2889 6548 1062 -2866 1922 2540 -1149 3477 6937 689 -1388 1916 -511 -2423
369b423N409K381n548k72K313m487j299N280J025l449J762M98n498l96N097q19
$$ -2423 2986 5367 -181 -453 1860 -2627 -3926 1354 2379 -1070 692 1190 -4308 -4704 393 -426
385d26k369L744J5n091K96K813j815J12M872j331m281J382J817l165Q56M601j407
$$ -426 -2795 949 964 -4127 -3831 -1018 -2833 -2721 2151 820 -3461 -2079 -262 -3427 -2571 2030 623
402F23k518K595m57l376K210L704k121j028K838j427k597K399J851k161P07K862
$$ 623 -1895 700 243 -3133 -923 2781 660 -368 2470 1043 -1554 845 2696 535 1242 4104
418D104k406k744K472Q67k050J746J785k995j035K537p97k044K138R21k929Q3
$$ 4104 1698 -1046 1426 2293 243 1989 3774 779 -256 2281 1484 -560 1578 2499 -430 -347
434c47J721j637j017K956k69l268N07J603k067k33K613m11k628J428K73k339J143
$$ -347 1374 -263 -1280 1676 1407 -1861 -1354 249 -1818 -2051 562 151 -2477 -1049 -776 -3115 -1972
451a972K687j039j817J277p12j831J959K115j431j28J648k053k176K255J997q02
$$ -1972 715 -324 -2141 -864 -1576 -3407 -1448 667 -764 -892 756 -1297 -3473 -1218 779 -23
467b3J010R01k637j262J789P69m59K395J140k825j774R54k77Q20L117N74k644
$$ -23 987 1888 -749 -2011 -222 547 88 2483 3623 798 -976 -22 -299 521 3638 4212 1568
484A568j198K81j563L50L487J321j780m79j779k617M07L809J007o55k92j981k856
$$ 1568 370 651 -912 -562 2925 4246 2466 1987 208 -2409 -2002 1807 2814 2159 1867 -114 -2970
501b970J20K212Q11J064J384k792l264k81J155J047J829J781j797l115o49k55
$$ -2970 -2850 -638 173 1237 2621 -171 -3435 -3716 -2561 -1514 315 2096 299 -2816 -3465 -3720
517c720L47K859K819j236k257r79j676j20L027K976n98m37p98k736j176K785K391
$$ -3720 -3373 -514 2305 1069 -1188 -2167 -3843 -3963 -936 2040 1442 1005 207 -2529 -3705 -920 1471
534A471J012O35j483l145j012J776J930R26J877p89k767j798K62J051K038K055
$$ 1471 2483 3118 1635 -1510 -2522 -746 1184 2110 3987 3198 431 -1367 -1105 -54 1984 4039
550D039k18k896j412mk80J770K582m99j496j535j257j004J611K898j32j072j089
$$ 4039 3821 925 -487 -491 -771 999 3581 3082 1586 51 -1206 -2210 -599 2299 2167 1095 6
567Fj792r56J385K028N85j91q46k339j709J115K443P35O20q74k174j446N13J636
$$ 6 -1786 -2742 -1357 671 1256 1065 219 -2120 -3829 -2714 -271 464 1084 210 -1964 -3410 -2897 -1261
585a261J204J002j40j800j714K85P87J575J954k06k210j252k14N68J755J992N92
$$ -1261 -57 945 805 -995 -2709 -2424 -1637 -62 1892 1686 -524 -1776 -1990 -1422 333 2325 2917
602B917j605j673j323N0J894K665J041j526j869j795m73J426K755J086n54j290
$$ 2917 1312 -361 -1684 -1634 260 2925 3966 2440 571 -1224 -1697 -271 2484 3570 3016 1726
618A726k562j593Q77K692J706N42j181k974k021j04K187J850J523%k716k762p75
$$ 1726 -836 -2429 -1552 1140 2846 3388 2207 -767 -2788 -2892 -705 1145 2668 2668 -48 -2810 -3585
635c585R00K365K717K46k281k477j560k45J838L235J281p16k451k410r57J074
$$ -3585 -2685 -320 2397 2643 362 -2115 -3675 -3920 -2082 1153 2434 1718 -733 -3143 -4100 -3026
651c026L184K019K46j342k631k102L16K470K495J665l29k334k929p15J899K505
$$ -3026 158 2177 2423 1081 -1550 -3652 -3336 -866 1629 3294 2965 631 -2298 -3013 -1114 1391
667A391J828O18j838k616j326J14J868K588J553j433k293j965n66J187K394J776
$$ 1391 3219 3837 1999 -617 -1943 -1829 39 2627 4180 2747 454 -1511 -2077 -890 1504 3280
683C280o73j418k139j392M01K061K056N99j179k083j947l85J827J756P01r4j709
$$ 3280 2607 1189 -950 -2342 -1941 120 2176 2775 1596 -487 -2434 -2819 -992 764 1465 1371 -338
700c38k121p57J001J792J463O11j495k238j162P36J708J596P93q80j895j308Q8
$$ -338 -2459 -3216 -2215 -423 1040 1651 156 -2082 -3244 -2508 -800 796 1589 709 -1186 -2494 -2406
717b406J123K046J254m00j803j380o78J107J981J645l31j104j635j230P18J809
$$ -2406 -1283 763 2017 1617 -186 -1566 -2244 -1137 844 2489 2158 1054 -581 -1811 -1093 716
733G16J957N59j306j924j453J41J574J978Q01n95j731j602p05P82J729J769K18
$$ 716 2673 3232 1926 2 -1451 -1310 264 2242 3043 2448 717 -885 -1590 -808 921 2690 2908
750B908j688k202j322M38J761J685R99q89k509j680o82J136K429J833k01k200
$$ 2908 1220 -982 -2304 -1866 -105 1580 2579 1690 -819 -2499 -3181 -2045 384 2217 2016 -184
766a84k336j136O52K124K175N48q53k234j934n7J112K668J494l32j786k429o29
$$ -184 -2520 -3656 -3004 -880 1295 1843 990 -1244 -3178 -3235 -2123 545 2039 1707 -79 -2508 -3137
783c137J106J939K030M50r54k454j610Q5J720K334J532l08k391j510j009J062
$$ -3137 -2031 -92 1938 2388 1434 -1020 -2630 -2545 -825 1509 3041 2733 342 -1168 -2177 -1115
799a115J949K083J12r34k092j868L87J582K099R14q88j789j879l56R72J741J199
$$ -1115 834 2917 3029 2095 3 -1865 -1478 104 2203 3117 2229 440 -1439 -1795 -823 918 2117
816B117K00j211j779j300L29J515J281O91j032j393j459P2O77J458J273l36j411
$$ 2117 2317 1106 -673 -1973 -1644 -129 1152 1843 811 -582 -2041 -1969 -1292 166 1439 1103 -308
833c08j345p63O00J288J360o6n46j196q76n9J456J140M81n35j226j106K61J140
$$ -308 -1653 -2416 -1816 -528 832 766 220 -976 -1852 -1911 -455 685 1166 631 -595 -1701 -1440 -300
851c00J155R11m47j409j001k06R10J032J021M80j451j071q38M88J235J026N29
$$ -300 855 1766 1319 -90 -1091 -1297 -387 645 1666 2146 695 -376 -1214 -726 509 1535 2064
868B064o85j317j241J2J243J113Q10m32j375j279o25R93J298R17M50j627j055
$$ 2064 1379 62 -1179 -1167 76 1189 1999 1567 192 -1087 -1712 -719 579 1496 1946 319 -736
885g36j216M82P23J682O48o10j578j180n30N50J957R77J46j527j062j098N38J253
$$ -736 -1952 -1470 -747 935 1583 973 -605 -1785 -2315 -1765 192 1169 1315 -212 -1274 -2372 -1834 -581
903e81J191R71o43j556j180k76R32K040N55m8p21j343j138N60J208J558N83o98
$$ -581 610 1581 938 -618 -1798 -2074 -1142 898 1453 1405 684 -659 -1797 -1237 -29 1529 2112 1414
921A414j571j143r2Q94J882M73k04o38j177n42k26J797Q67J13l91j454q90q6Q81
$$ 1414 -157 -1300 -1392 -498 1384 1857 1653 1015 -162 -704 -930 867 1734 1847 1456 2 -888 -974 -93
940i3J014O34k21r31j089o14M25J051O90Q8n23j410m15K1P90N88L21J28j071p19
$$ -93 921 1555 1334 403 -686 -1300 -875 176 866 954 431 -979 -1394 -1373 -583 5 326 454 -617 -1336
960a336j92K83J059M34j03p43o99j18N16P63M77K69m05m85n90J87M51O32J70k17
$$ -1336 -1528 -1245 -186 248 145 -598 -1297 -1415 -899 -136 341 610 205 -280 -870 -683 -232 400 570 353
980C53n06m32L53K74O05L56m46k02n05r6o1J064N84j47n38o79j93L26N74M45n1
$$ 353 -153 -585 -232 42 647 1003 557 355 -150 -246 -307 757 1341 1194 656 -23 -216 110 684 1129 1078
1001A078k16n44o09k16O18M38L98m8j167m65j61M86P31L38K59o82q94m75K23M07
$$ 1078 862 318 -291 -507 111 549 947 899 -268 -733 -894 -408 323 661 920 238 -656 -1131 -908 -501
1021e01P85M34m34n35r27j58O79L69N32K71o24q36l16J60P67Q57K75m48p15l71
$$ -501 284 718 284 -251 -1178 -1336 -657 -288 244 515 -109 -945 -1261 -1101 -334 523 798 350 -365 -736
1041g36j64J94P11O10K81m80n13p28K15N49Q11K64k30j67o24j23o5O80L90K24
$$ -736 -900 -706 5 615 896 416 -97 -825 -610 -61 750 1014 784 617 -7 -130 -195 485 875 1099
1061A099j87n88n58j36J67Q35N7j4q8q28l32N33K92K58J19k85p56q4k03M47m6
$$ 1099 912 324 -234 -370 -203 632 689 675 587 -241 -573 -40 252 510 629 344 -412 -496 -699 -252 -298
1082b98N27k99j14j04n55K34n5O28j33K26l50k17O6K53o8J22J13R5k03j65j07
$$ -298 229 -70 -184 -288 -843 -609 -664 -36 -169 57 -293 -510 -444 -191 -259 -137 -24 71 -132 -297 -404
1103d04L39o8J51jL30j65N8j93nR5K94j12j7M7J80k13j54K62K35l07J10r1n5j13
$$ -404 -65 -133 18 17 347 182 240 47 42 137 431 319 302 349 529 316 162 424 659 352 462 371 316 203
1127B03k22L94k65p7J02J08R2r3o12J28J42O0J4k25j29NL4O9j53N5J91L0J62k98
$$ 203 -19 375 110 33 135 243 335 242 -370 -242 -100 -40 -26 -251 -380 -375 -341 -272 -425 -370 -179 -149 13 -285
1151b85n27K94K42K36m70O76m88M3J86p6k94J19L44J07j7l04j27J71K36P1l4O8
$$ -285 -812 -518 -276 -40 -510 166 -322 -279 -93 -169 -463 -344 0 107 90 -214 -341 -170 66 137 103 171
1173A71O9k28k6J25R1L31k05J69k45k4l39J08L63K05M61l76m53k2k69J04M33J69
$$ 171 240 12 -14 111 202 533 328 497 252 228 -111 -3 360 565 1026 650 197 175 -94 10 443 612
1195F12n2l41J46q09J20K24P42k13K26o62m99l26M56J96K50J99l93j54o29Q4K31
$$ 612 560 219 365 -444 -324 -100 642 429 655 -7 -506 -832 -376 -180 70 269 -124 -278 -907 -823 -592
1216e92O01P9K22q60l24k34N14L01O96j92j61l87k20l87L68P18L44N7p12k03o5
$$ -592 9 88 310 -550 -874 -1108 -594 -293 403 211 50 -337 -557 -944 -576 142 486 543 -169 -372 -437
1237d37j12N00P46N3R4r27m06N5M70N13O18k70m01l86o14L21M09L03L61j67o86
$$ -437 -549 -49 697 750 844 -83 -489 -434 36 549 1167 897 496 110 -504 -183 226 529 890 723 37
1258C7l30k27L12N79L56j02p59j9l01J33M89O2L30m38n58j64j01N52J37K69k36
$$ 37 -293 -520 -208 371 727 625 -134 -153 -454 -321 168 230 560 122 -436 -600 -701 -149 -12 257 21
1279B1N0l45k69J33K58J55J46n54j88q8L4N93K94J74j81n71o2k12M16N65L59n87
$$ 21 71 -274 -543 -410 -152 3 149 -405 -593 -681 -647 -54 240 414 233 -338 -400 -612 -196 369 728 141
1301A41o9p45L29N84r6M66p3k80o18R6K80L73K51J59o52m23j55L16M49J20J5J82
$$ 141 72 -673 -344 240 144 610 537 257 -361 -265 15 388 639 798 146 -277 -432 -116 333 453 468 650
1323F50o90j98P9j6R03J99p9p19o15m35M09M69N08lj35o42m50k34L71P44M80l19
$$ 650 -40 -238 -159 -175 728 927 848 129 -486 -921 -512 -43 465 462 327 -315 -765 -999 -628 116 596 277
1345B77k89q36l95O42N08O81M03q94n02o03K57N24O57L15k8q26m90l65M95O90
$$ 277 -12 -848 -1243 -601 -93 588 991 97 -405 -1008 -751 -227 430 745 717 -109 -599 -964 -469 221
1365B21L85N73p99o39l19o5O83Q03P8J8p21o14j23J85P02N90L30o50p57m43J94
$$ 221 606 1179 380 -259 -578 -643 40 843 921 939 218 -396 -519 -334 368 958 1288 638 -119 -562 -368
1386c68O49N23J14l5n89r71jL60N81L04R0o00n42m30J23O07L84K61k94m76l64
$$ -368 281 804 918 883 294 -677 -678 -318 263 567 657 57 -485 -915 -792 -185 199 460 166 -310 -674
1407f74k12P00L76r1L37n47p31m0J65Q08L14l7j71n62j04K1N85K67K31m59r1n55
$$ -674 -886 -186 190 99 436 -111 -842 -882 -717 91 405 368 197 -365 -469 -448 137 404 635 176 85 -470
1429d70R2J03R13k8M8l83q10P7K82M54M70R3o64l06l02N6O57O58J51n61l62m34
$$ -470 -378 -275 638 610 658 275 -535 -458 -176 278 748 841 177 -129 -431 -375 282 940 1091 530 168 -266
1451b66k49O19L32M78m50o90k50n11O75O01M68l28l94n29n82K11N87N63K25m10
$$ -266 -515 104 436 914 464 -226 -476 -987 -312 289 757 429 35 -494 -1076 -865 -278 285 510 100
1471A00m20q63K63O15J84P12q5m00o66n46L88N37O71M92n99n77n87l7M81O05M97
$$ 100 -320 -1183 -920 -305 -121 591 506 106 -560 -1106 -718 -181 490 982 383 -194 -781 -818 -337 268 765
1492G65O8o26p51r1M24K84P72p9l15o21j21k21N36M87L28O9n31q84N8J56M75O68
$$ 765 833 207 -544 -635 -211 73 845 766 451 -170 -291 -512 24 511 839 908 377 -507 -449 -293 182 850
1514H50L1l28q45l89J54O07L44K72l20j50p10k67L65O38L72j63m86j32o18L01
$$ 850 881 553 -292 -681 -527 80 424 696 376 226 -484 -751 -386 252 624 461 -25 -157 -775 -474
1534d74L92J38M78r2n11m40l59N37K70N02j10l28k65k81J53M27M04J05m30k35
$$ -474 -82 56 534 442 -69 -509 -868 -331 -61 441 331 3 -262 -543 -390 37 441 546 116 -119
1554a19l99K83K52M86J42k69l07n02L22m1M17K70j17l50j40j90J09P59n9J65o93
$$ -119 -518 -235 17 503 645 376 69 -433 -111 -152 265 535 418 68 -72 -262 -153 606 547 712 19
1575A9k67J51r5L90J16P1N5l91o09K6N74KL48m2l87k02m62K09P04J98L14k61r88
$$ 19 -248 -97 -192 198 314 385 440 49 -560 -534 40 42 390 348 -39 -241 -703 -494 210 408 722 461 -527
1598e27o5o4N40O9M53m22j17l29l56K77P19M23Nk87o30j93k7N95L51L63l67n12
$$ -527 -592 -656 -116 -47 406 -16 -133 -462 -818 -541 178 601 606 319 -311 -504 -531 64 415 778 411 -101
1620a01m78lM97P7O14j61l44q6m87M28K49L82K08k28p60k0l4L03J84J07J17k32
$$ -101 -579 -582 -85 -8 606 445 101 15 -472 -44 205 587 795 567 -193 -213 -247 56 240 347 464 232
1642B32l28k21j44M19M84L0l91Q2n17j03L66M2N04k43k26l06k12L43j1N13k54
$$ 232 -96 -317 -461 -42 442 472 81 163 -354 -457 -91 -49 455 212 -14 -320 -532 -189 -200 313 59
1663E9j09k92o5l0J74L67J00K18l24l82j01J49K42L37j22r5j60m26J37K55L53
$$ 59 -50 -342 -407 -437 -263 104 204 422 98 -284 -385 -236 6 343 221 126 -34 -460 -323 -68 285
1684B85Q0k44R8m40n8M05j2Q5j89J21m0j28J24jR6J51k90j01j62M95k9J2p4k2
$$ 285 365 121 219 -221 -279 126 114 199 10 131 91 -37 87 86 182 333 43 -58 -220 275 246 258 184 162
1708A62k21j76J86K5K22j51J79l34l0j17J84K00J97m70L07n28l1K24O2L71j30
$$ 162 -59 -235 -49 -24 198 47 226 -108 -138 -255 -71 129 326 -144 163 -365 -396 -172 -110 261 131
1729A31J22m08j47lK64P8j71K09k76j80J3k0K7P81o9P0o29j14q6J65L96L61K7
$$ 131 253 -155 -302 -305 -41 37 -134 75 -201 -381 -368 -388 -361 420 351 421 -208 -322 -408 -243 153 514 541
1752E41l78Jn08K26RN21k38J6j3j26k29L20p4N2J38n6m13l0M40m25M84J29l19
$$ 541 163 164 -344 -118 -109 412 174 190 177 51 -178 142 68 120 258 202 -211 -241 199 -226 258 387 68
1775F8J11o49L72p6K56K81r4l59J69l02k24K28J24J22J96j26m66J87j31J41R1
$$ 68 179 -470 -98 -174 82 363 269 -90 79 -223 -447 -219 -95 27 223 97 -369 -182 -313 -172 -81
1796h1J18J65k32l22J6K52l08K94J22o4R4k56J10K16j72L27N5k02n3j84j09J44
$$ -81 37 202 -30 -352 -336 -84 -392 -98 24 -40 54 -202 -92 124 -48 279 334 132 79 -105 -214 -70
1818g0J50l5K25O5k46j5k6j98K52K50k39J44l13J55k31L23p9l6lk9j53R7L62l16
$$ -70 80 45 270 335 89 74 48 -150 102 352 113 257 -56 99 -132 191 112 76 73 44 -109 -12 350 34
1842C4N8M9k70J76k6l11K56q9M5N1Qj68j18J69j95K15o1j33L12k68J2J48o0K68
$$ 34 92 141 -129 47 21 -290 -34 -123 -78 -27 -19 -187 -305 -136 -331 -116 -177 -310 2 -266 -254 -106 -166 102
1866A02m2j36k41M37J73m12K13j90J84j40oK22j03L00k82m8r6M26r5M%m08L73
$$ 102 60 -76 -317 120 293 -119 94 -96 88 -52 -58 164 61 361 79 31 -65 361 266 270 270 -138 235
1889B35j97k86L13J53J72m79r5J10j71R1J27l6K22p4j04j13J5K11R2j09k13J66
$$ 235 38 -248 65 218 390 -89 -184 -74 -245 -154 -27 -63 159 85 -19 -132 -117 94 186 77 -136 30
1911C0j62j2n2J28R0J72m92J61r1k01L46M75k34L9l97J86j95J56M32j82j84k63
$$ 30 -132 -144 -196 -68 22 194 -298 -137 -228 -429 -83 392 158 197 -200 -14 -209 -53 379 197 13 -250
1933b50J72l15L18L5K60j56ML1m9l03L25j53N94k29j23l69L2q0M15L71k12M5n07
$$ -250 -78 -393 -75 -40 220 64 68 99 50 -253 72 -81 513 284 161 -208 -176 -256 159 530 318 363 -144
1956a44J78R7j90J87Q8j45L6j33k99J81J82m2n5J08k8m10Q9J42o0L60j08l21J48
$$ -144 34 131 -59 128 216 71 107 -26 -325 -144 38 -4 -59 49 21 -389 -300 -158 -218 142 34 -287 -139
1979a39p0kK46O4n0j66p7L08k24N6k58N23j91j05J06k29J73K51M8k39L5k33K86
$$ -139 -209 -211 35 99 49 -117 -194 114 -110 -54 -312 211 20 -85 21 -208 -35 216 264 25 60 -173 113
2002A13R2j16L3l33j1L20K18l82K14K45j01j1l31j1k31L05P2r3L65k65l30O6K13
$$ 113 205 89 122 -211 -222 98 316 -66 148 393 292 281 -50 -61 -292 13 85 -8 357 92 -238 -172 41
2025D1jK06N9j54l78J47o8K61K99j14q3m21j19k0K60L78n2J17m72j11k24K63K70
$$ 41 40 246 305 151 -227 -80 -148 113 412 298 215 -206 -325 -345 -85 293 241 358 -114 -225 -449 -186 84
2048H4mJ58P6m02l66J73J36J98L2K8J57o85l1J89M20J19Qj7j37l12J9R4M64q0
$$ 84 80 238 314 -88 -454 -281 -145 53 85 113 270 -415 -446 -257 163 282 290 273 136 -176 -157 -63 401 321
2072C21O8j45m34j32J09M46q6L40k41k26k94K23K9L73j1j98J0l70M1k7L61J94
$$ 321 389 244 -190 -322 -213 233 147 487 246 20 -274 -51 -22 351 340 142 152 -218 -177 -204 157 351
2094C51o6Rl87qJj5P2L53l1o53L12l68L92J16l2K35j97l62j0J06o4N07R8m37K5
$$ 351 285 294 -93 -101 -100 -115 -43 310 279 -374 -62 -430 -38 78 46 281 84 -278 -288 -182 -246 261 359 -78 -53
2119e3l6J15j07M14k88m9l14J84n9J16M55j86J88l78m4l55P11k80J82k6Pk10l52
$$ -53 -89 26 -81 333 45 -4 -318 -134 -193 -77 378 192 380 2 -42 -397 314 34 216 190 197 -13 -365
2142c65K51K8N16k96j27j42J48o4O1K30j01K3Q9n10N5J59K72j20j47L79j30m72
$$ -365 -114 -86 430 134 7 -135 13 -51 10 240 139 162 251 -259 -204 -45 227 107 -40 339 209 -263
2164b63r9K71L64J14k91l9k49j98L07L77J19j84l75O0j89J59J29J04M35l08k61
$$ -263 -362 -91 273 387 96 57 -192 -390 -83 294 413 229 -146 -86 -275 -116 13 117 552 244 -17
2185a7k27PR5L76j03L6j51q8j04j35K94M39l4k86l68K0j1Q2M27J77l6l03k81K4
$$ -17 -244 -237 -142 234 131 167 16 -72 -176 -311 -17 422 388 102 -266 -246 -257 -175 252 429 393 90 -191 -167
2209a67P0N5J21J51Ll21jm7R9J80K93k72q5l40M6j09L13L79l79L72n72k99j6L89
$$ -167 -97 -42 79 230 233 -88 -89 -136 -37 143 436 164 79 -261 -215 -324 -11 368 -11 361 -211 -510 -526 -137
2233a37K70J05j09k44K11m03R4j3M87j67k76J72l17k2M23j1J3L19o49N37m52J19
$$ -137 133 238 129 -115 96 -307 -213 -226 261 94 -182 -10 -327 -349 74 63 76 395 -254 283 -169 -50
2255e0j10M95k20l6l00L66k25J85RJ5K3n6N3m6J76r0L3j39j98p5J62J54j8J54
$$ -50 -160 335 115 79 -221 145 -80 105 114 129 152 96 149 103 279 189 222 83 -115 -190 -28 126 108 262
2279B62n7j89j16J07L29m66K21j87K40k83k36K41L48o0j28J61k72j17r7M98j62
$$ 262 205 16 -100 7 336 -130 91 -96 144 -139 -375 -134 214 154 26 187 -85 -202 -299 199 37
2300C7Q9k8j24k05l2L2L88J14k80L0N9k90m0K73K0Ok4j01k44L1J94L99m5J35l60
$$ 37 126 98 -26 -231 -263 -231 157 271 -9 21 80 -210 -250 23 43 49 25 -76 -320 -289 -95 304 259 394 34
2325C4k44r6nN15j08L93k61l12j26J01J77o1M76m55J77m40M8n6K38K44K1l53o
$$ 34 -210 -306 -311 204 96 489 228 -84 -210 -109 68 7 483 28 205 -235 -187 -243 -5 239 260 -93 -99
2348i9J25o8j32K06Q9j33K11k49j09j94K04J26KJ4K48n71J07mK8J72J90l29P9
$$ -99 26 -42 -174 32 121 -12 199 -50 -159 -353 -149 -23 -21 -7 241 -330 -223 -227 -199 -27 163 -166 -87
2371h7L1j84K10K12j97p6J0L1l28L96P8k87J34J66j45r0k20M40m9L4j63j38K58
$$ -87 -56 -240 -30 182 -15 -91 -81 -50 -378 18 96 -191 -57 109 -36 -126 -346 94 45 79 -84 -222 36
2394C6p0J3K8K13k73K05o5pp7K84j18J17m57L53l52P5L34k54K62l17J01p3K70
$$ 36 -34 -21 7 220 -53 152 87 80 3 287 169 286 -171 182 -170 -95 239 -15 247 -70 31 -42 228
2417B28l79K50l9k21L36n38M77k24j04K81j18k52L17j86K68Q3j91Mk39j4J59N8
$$ 228 -151 99 60 -161 175 -363 114 -110 -214 67 -51 -303 14 -172 96 179 -12 -8 -247 -261 -102 -44
2439d4J63l8K3p2k23M8K80N9J5Pm21O1J42J06l9J43j88Q1l6j8j68J2k9J07L85
$$ -44 119 81 104 32 -191 -143 137 196 211 218 -203 -142 0 106 67 210 22 103 67 49 -119 -107 -136 -29 356
2464C56m8k58m5Mj11K37J44j49j77J29q1r3R8j13J40k11L01l47r7J75k06N60j24
$$ 356 308 50 5 9 -102 135 279 130 -47 82 1 -92 6 -107 33 -178 123 -224 -321 -146 -352 208 84
2487H4N0j39l3k46K74r7L19j74m9K76o63M16k70O6R6J53Pj9j81R8j7P3j96J04
$$ 84 134 -5 -38 -284 -10 -107 212 38 -11 265 -398 18 -252 -186 -90 63 70 51 -130 -32 -49 24 -172 -68
2511f8K71k01K08k78n2L01j37p4K55k67L9J10j25J95k15K89j48j01J56n7j13K24
$$ -68 203 2 210 -68 -120 181 44 -30 225 -42 -3 107 -18 177 -38 251 103 2 158 101 -12 212
2533B12j50j32l2L4J47j32J12K9m04O69n48L33l40J92o4Q0Q2j04j4k1K12k11L6
$$ 212 62 -70 -102 -68 79 -53 59 88 -316 353 -195 138 -202 -10 -74 6 88 -16 -30 -51 161 -50 -14
2556a4L68m38RO5j39L75k0k65m5j7J91n9P8k76K38l5q1J59K93k90j19N3j89M19
$$ -14 354 -84 -75 -10 -149 226 206 -59 -104 -121 70 11 89 -187 51 16 -65 94 387 97 -22 31 -158 261
2580B61k97J07l85J91J52K02m46K62n7J87j85K3J0n7n2K58j23q9M13j78k10J16
$$ 261 -36 71 -314 -123 29 231 -215 47 -10 177 -8 15 25 -32 -84 174 51 -38 375 197 -13 103
2602A03j01r4J56L4J03q2j49J87k71O8K78p6j01p6Q9q5K28j29l9L05l5m25L5K8
$$ 103 2 -92 64 98 201 119 -30 157 -114 -46 232 156 55 -21 68 -17 211 82 43 348 313 -112 -77 -49
2626d9jj82L89K20m28j27j59N81k56j58K10R2p3m42K67K43o6r2M10k81k80O2j68
$$ -49 -50 -232 157 377 -51 -178 -337 244 -12 -170 40 132 59 -383 -116 127 61 -31 379 98 -182 -120 -288
2649b88L74J66J8Q7l87j03N5J84l3L0J97j98Mk86R0K10qk25m2l9O0rn0J44K67
$$ -288 86 252 270 357 -30 -133 -78 106 73 103 300 102 106 -180 -90 120 112 -113 -155 -194 -134 -143 -193 -49 218
2674B18q5k15J09j43L1J55l2J65j16l58J05k27M21l2Q6j37J04k65J18o7K63l6
$$ 218 133 -82 27 -116 -85 70 38 203 87 -271 -166 -393 28 -4 82 -55 49 -216 -98 -165 98 62
2696F2k20R0L0j12l9J98lk12J45K74k56J71o4K5N7j89j87L63K4k53J54P6k32P1
$$ 62 -158 -68 -38 -150 -189 9 6 -206 -61 213 -43 128 64 89 146 -43 -230 133 157 -96 58 134 -98 -27
2720b7k03L72j95O2J9KK14k04kn5l4O5q2P4Q3j86L8q9J33j16M4j53L38j76K28
$$ -27 -230 142 -53 9 28 30 244 40 38 -17 -51 14 -68 6 89 -97 -59 -148 -15 -131 -87 -240 98 -78 150
2745A50k22k0K0J6k5r5K14r1L43k88j58M40n53o6L68j56L39J84n65J10o2P8M1
$$ 150 -72 -92 -72 -56 -81 -176 38 -53 290 2 -156 284 -269 -335 33 -123 216 400 -165 -55 -117 -39 2
2768Bl6l3K74k52Kj98LJ58M11j24k3k43P3R2j95J98p5j64K17l46J63j74M45R0
$$ 2 -34 -67 207 -45 -43 -241 -238 -80 331 207 184 -59 14 106 -89 109 34 -130 87 -259 -96 -270 175 265
2792B65k41K4Q4l58K82M4j54k76J78L09l05L35m01j4L28j5l39M4%K21p3M7J49
$$ 265 24 48 132 -226 56 100 -54 -330 -152 157 -148 187 -214 -228 100 85 -254 -210 -210 11 -62 -15 134
2815A34j20k52K19j7lJ69J41k85R4l5j7j01J48N1q5J42l77K26n9j27J54J0j23
$$ 134 14 -238 -19 -36 -39 130 271 -14 80 45 28 -73 75 126 41 183 -194 32 -27 -154 0 10 -113
2838a13N9j15K0K4K98J3r0j91O9l3J53M9j30P3p9K56j46j45J33oN1k02j03K88
$$ -113 -54 -169 -149 -125 173 186 96 -95 -26 -59 94 143 13 86 7 263 117 -28 105 99 150 -52 -155 133
2862A33j77L27o6j51O1j09j37lK82l26J56J51k44k67K14K79l49J48K83k4Qm02
$$ 133 -44 283 217 66 127 18 -119 -122 160 -166 -10 141 -103 -370 -156 123 -226 -78 205 181 189 -213
2884b13j4J46L80J12j12k74m9j04J23J03L09j07k40n9m1R9K1J99j18k36J24j38
$$ -213 -227 -81 299 411 299 25 -24 -128 -5 98 407 300 60 1 -40 59 80 279 161 -75 49 -89
2906h9J03k28L95Q4k35j42J57J51k43O3k37K15J89l66J75j54K58j48J08j40J83
$$ -89 14 -214 181 265 30 -112 45 196 -47 16 -221 -6 183 -183 -8 -162 96 -52 56 -84 99
2927I9L0m83M51k71K19K16j42p7l84L94j83K79l3k72O9L7p7kJ97q3J98l49P7N1
$$ 99 129 -354 97 -174 45 261 119 42 -342 52 -131 148 115 -157 -88 -51 -128 -130 67 -16 182 -167 -90 -39
2951c9l97L08L02j92O1J01j47J88k71K31l06L67j37m27K02J52l4L08m47P1j83
$$ -39 -436 -128 174 -18 43 144 -3 185 -86 145 -161 206 69 -358 -156 -4 -38 270 -177 -106 -289
2972b89Q4L25p6J79l4j03l07L86m2O4k52K92j45k31Pj1NJ54K04q9l0j97K76n11
$$ -289 -205 120 44 223 189 86 -221 165 123 187 -65 227 82 -149 -142 -153 -148 6 210 121 91 -106 170 -341
2996c41J21J64j16L35j96N2j89K05l4p1j1J88m32P0J73J37K23k65M3j00m5J15
$$ -341 -220 -56 -172 163 -33 19 -170 35 1 -70 -81 107 -325 -255 -82 55 278 13 56 -44 -89 26
3018B6m1J9Qj61q5L85j84o2J80RNr9J27j15j27K69j23j56J43k29k0L11l8m6K43
$$ 26 -15 4 12 -149 -234 151 -33 -95 85 94 99 0 127 12 -115 154 31 -125 18 -211 -231 80 42 -4 239
3043B39J4j80L86l57l17K73J33k70j95K14Q2j15Q2k50K63k4k55N25j25k49L25
$$ 239 253 73 459 102 -215 58 191 -79 -274 -60 22 -93 -11 -261 2 -22 -277 248 123 -126 199
3064A99l73N05l46r1R0m2P1J8q6l8J09nQ5l17L84j80R6j6l60K88P3m6j16N6Q2
$$ 199 -174 331 -15 -106 -16 -58 13 31 -55 -93 16 11 96 -221 163 -17 79 63 -297 -9 64 18 -98 -42 40
3089D0q5l1L90j62o2r4j58O2l3K96p5n7j86P1K75l09L50n5j57J49k18L4K65r6
$$ 40 -45 -76 314 152 90 -4 -162 -100 -133 163 88 31 -155 -84 191 -118 232 177 20 169 -49 -15 250 154
3113A54l4K17j25m89L67p0J9n7J37nl01K03l00K88J12k09q2M95l44R7j7K5j80
$$ 154 120 337 212 -277 90 20 39 -18 119 114 -187 16 -284 4 116 -93 -175 320 -24 73 56 81 -99
3136i9J03R2J87m39J90k08L84l67K34N9l38mJ22J04j28L37j64k48M43o0jn19L58
$$ -99 4 96 283 -156 34 -174 210 -157 77 136 -202 -206 -84 20 -108 229 65 -183 260 200 199 -320 38
3159C8J47o56M75J46Nr7j25k6J22Q2j25j38K8J9L06l40J81j10J41jJ1j46P3J47
$$ 38 185 -471 4 150 155 58 -67 -93 29 111 -14 -152 -124 -105 201 -139 42 -68 73 72 83 -63 10 157
3183A57l42K05L6L0K8l97M42j89P9p4J12J67n44J92j16L39l5l36J91M8K34m02
$$ 157 -185 20 56 86 114 -283 159 -30 49 -25 87 254 -290 -98 -214 125 90 -246 -55 -7 227 -175
3205a75L53k49m7J15J66k26k66M72k15j10J85O5l72K00o9J92K12j09n1n6KN8k76
$$ -175 178 -71 -118 -3 163 -63 -329 143 -72 -182 3 68 -304 -104 -173 19 231 122 71 15 17 75 -201
3228b01j91L09K27n7k1o7p6N9l61L16O1P8O4o0m0l1J9q4L80n54K11O5j71PK27
$$ -201 -392 -83 144 87 66 -1 -77 -18 -379 -63 -2 76 140 80 40 9 28 -56 324 -230 -19 46 -125 -118 109
3253A09o2j83J4R9l7j7R8j10M7j91L54k38J11q0M25l62K07k10j7j3J41l0j92J44
$$ 109 47 -136 -122 -23 -60 -77 21 -89 -42 -233 121 -117 -6 -86 339 -23 184 -26 -43 -56 85 55 -137 7
3277GJ85k82j58L49j23PK52j66m05L21R9r5L92m50P3k1J04L7r1r7m3J40J99k01
$$ 7 192 -90 -248 101 -22 -15 237 71 -334 -13 86 -9 383 -67 6 -15 89 126 35 -62 -105 35 234 33
3301C3L05r4k54J26j56K46j17j26Q3J51k94M4j11Q4J15J27j8P8k99J23K19k26
$$ 33 338 244 -10 116 -40 206 89 -37 46 197 -97 -53 -164 -80 35 162 144 222 -77 46 265 39
3323C9q3Mj94L00KL09l89JK21k27n1J58l16J13Q7pn2LJ12J00j28J28k45j06K23
$$ 39 -44 -40 -234 66 68 377 -12 -11 210 -17 -68 90 -226 -113 -26 -33 -85 -82 30 130 2 130 -115 -221 2
3348BK54m92K85R1j92l0j83Q4K34M0m4J01j38k30K78j18K54o64M87J95j80P1P
$$ 2 256 -236 49 140 -52 -82 -265 -181 53 93 49 150 12 -218 60 -58 196 -468 19 214 34 105 112
3371A12j37K3J76l31j09K5K37j09J92n6K3qqq1Q2k41M09Q8l69l5K43j62L29j23
$$ 112 -25 -2 174 -157 -266 -241 -4 -113 79 23 46 38 30 -51 31 -210 199 287 -82 -117 126 -36 293 170
3395A70m30K2K45p2k27K05J97j64j3P9P3k76J98j6O5J08l03K4J91l50J32Q2K95
$$ 170 -260 -238 7 -65 -292 -87 110 -54 -67 12 85 -191 7 -9 56 164 -139 -115 76 -274 -142 -60 235
3418B35J9k36j80q3K28j6J71n2r2N8k29J59J46Q3o0J19m10l2M00j68K51l94K20
$$ 235 254 18 -162 -245 -17 -33 138 86 -6 52 -177 -18 128 211 151 270 -140 -172 228 60 311 -83 137
3441A37k64J01LJ44j98K39q8J48k45k47L50R7l82J51M19j45l23k4K76O4k07N9
$$ 137 -127 -26 -23 121 -77 162 74 222 -23 -270 80 177 -205 -54 365 220 -103 -127 149 213 6 65
3463F5N8q2QQ9K7k78K26k62K38j31k35K74O9J06k11k1k34L98K2j50j78k0L52l98
$$ 65 123 41 49 138 165 -113 113 -149 89 -42 -277 -3 66 172 -39 -60 -294 104 126 -24 -202 -222 130 -268
3487b68RL27k72L61j61o9p3m0J62j6p4J9J96n4n7O9j17K05j48K14k4l61M70m42
$$ -268 -259 68 -204 157 -4 -73 -146 -186 -24 -40 -114 -95 101 47 -10 59 -58 147 -1 213 189 -172 298 -144
3511a44R4l0NJ82j85J93Q3L3k15k4J18j69o6k8K04J70O6l76N5P4l49P54l27k05
$$ -144 -50 -80 -75 107 -78 115 198 231 16 -8 110 -59 -125 -153 51 221 287 -89 -34 40 -309 445 118 -87
3535h7J0j39L12r0K38j38j53L24k40L44m98J42M3M0J18k55K55l75J21j16J63K66
$$ -87 -77 -216 96 6 244 106 -47 277 37 381 -117 25 68 108 226 -29 226 -149 -28 -144 19 285
3557B85l78L50m67J84O6p8l8j05r3J21J54J06J72n66M14j29k82MJ14l6P3K31n3
$$ 285 -93 257 -210 -26 40 -38 -76 -181 -274 -153 1 107 279 -287 127 -2 -284 -280 -166 -202 -129 102 49
3580D9J41J14m04J76Qn1J02o4m20K54k4pK61k23l8J52oO3r2L49j15k05k5K8k60
$$ 49 190 304 -100 76 84 33 135 71 -349 -95 -119 -126 135 -88 -126 26 20 83 -9 340 225 20 -5 23 -237
3605b37L97m37J89M46n88L0L00J62j42m5lj61j36K33J65m11K6K27O5Q1j93L40
$$ -237 160 -277 -88 358 -230 -200 100 262 120 75 72 -89 -225 8 173 -238 -212 15 80 161 -32 308
3627C08l88J50K25m38K62k48k16N30j5K67o36K57k82K88J61m40L30J10k73N3j14
$$ 308 -80 70 295 -143 119 -129 -345 185 170 437 -199 58 -224 64 225 -215 115 225 -48 5 -109
3648a09K35l3j12M3j66k84N69j63PJ18k94M06l47L93M6k00n5kK10j06r6O7q1K6
$$ -109 126 93 -19 24 -142 -426 143 -20 -13 105 -189 217 -130 263 309 109 54 52 262 156 60 127 46 72
3672G2j09J72k94J4J01o8J22N1p5pn4k9R7j11Ql2J61r5m0Q4L13l64k03M19k4o9
$$ 72 -37 135 -159 -145 -44 -112 10 61 -14 -21 -75 -104 -7 -118 -110 -142 19 -76 -116 -32 281 -83 -286 133 109 40
3698D0k90J67K08j43P4rJ14L9Nm27O7K75n4j98J37J16L1k54P3P5p3l12O02l59
$$ 40 -250 -83 125 -18 56 47 161 200 205 -222 -155 120 66 -132 5 121 152 -102 -29 46 -27 -339 263 -96
3722i6l31L17J98k28J4J04P1K2K23k63j97J83j09L0K17Mq3l45J54R9M8j12Q6j27
$$ -96 -427 -110 88 -140 -126 -22 49 71 294 31 -166 17 -92 -62 155 159 76 -269 -115 -16 32 -80 6 -121
3746a21m3P3r5M5J23L39j45l00K11L9k00L4J03k49L35N1j39J1m0j36j25l9L89
$$ -121 -164 -91 -186 -141 -18 321 176 -124 87 126 -74 -40 63 -186 149 200 61 72 32 -104 -229 -268 121
3769A21nm46K69J05Q4j35O0k17K59j43q2p0K65K9Kj61K21j42J09M4j22k2J61m76
$$ 121 116 -330 -61 44 128 -7 53 -164 95 -48 -130 -200 65 94 96 -65 156 14 123 167 45 23 184 -292
3793b92L33K00k60J51k42R7l40K47J22kJ18k97K74R2j43l8l05L10k36K85l21K80
$$ -292 41 241 -19 132 -110 -13 -353 -106 16 14 132 -165 109 201 58 20 -285 25 -211 74 -247 33
3815C3q3K90p5k52J22N2k09J63k97K78p3l43K43k86j1N83j88q8R3J35k99L32k09
$$ 33 -50 240 165 -87 35 87 -122 41 -256 22 -51 -394 -151 -437 -448 135 -53 -141 -48 87 -212 120 -89
3838h9j01K58lp5p2J09l7K4J55l17J66J18J0k23J30q5N5J34m52J98K60j12j31
$$ -89 -190 68 65 -10 -82 27 -10 14 169 -148 18 136 146 -77 53 -32 23 157 -295 -97 163 51 -80
3861h0R0k30N23m10J5J8k26M38j24Q5p8L02k08rk77J18J07k12K59m9k3p9QL53
$$ -80 10 -220 303 -107 -92 -74 -300 138 14 99 21 323 115 106 -171 -53 54 -158 101 52 29 -50 -42 311
3885C11l24j0M35m77L4Q6j9q7kJ45k84Q3J29P4p8Rn3M0J0j4j96K57j88M1K50j10
$$ 311 -13 -23 412 -65 -31 55 36 -51 -53 92 -192 -109 20 94 16 25 -28 12 22 8 -188 69 -119 -78 172 62
3911F2k29J55L2k92J44J02k12M73l29K89l03Rqo9L84O6n11M49l88P0J48N3j03
$$ 62 -167 -12 20 -272 -128 -26 -238 235 -94 195 -108 -99 -107 -176 208 274 -237 212 -176 -106 42 95 -8
3934hl1N7q0J87k3k07M2K10q1j94M04l78j38O9J63k61K60l5J97k27j42J00k5K02
$$ -8 -39 18 -62 125 102 -105 -63 147 66 -128 276 -102 -240 -171 -8 -269 -9 -44 153 -74 -216 -116 -141 61
3958F1j92J76K1J60l41Q2J10j09J69k06k3m2K56j51J23P0k12k3p1L56l25P8l68
$$ 61 -131 45 66 226 -115 -33 77 -32 137 -69 -92 -134 122 -29 94 164 -48 -71 -142 214 -111 -33 -401
3981d01L67j04Q1k7J40j04j10L02l8j31J30k14p8L04L1L4j17j22N6ML6j35L9Q4
$$ -401 -34 -138 -57 -84 56 -48 -158 144 106 -25 105 -109 -187 117 148 182 65 -57 -1 3 39 -96 -57 27
4005B7Q0m9j61J26J29k99N8O0J34q6N0k67L76l47K86j48J59j59K66n33O1R5R6
$$ 27 107 58 -103 23 152 -147 -89 -29 105 19 69 -198 178 -169 117 -31 128 -31 235 -298 -237 -142 -46
4028d6q0k63L19j3j90K85r3j14L55m10L31j29Q9k49L78k10r7J45P7m3P8j85L5
$$ -46 -126 -389 -70 -83 -273 12 -81 -195 160 -250 81 -48 41 -208 170 -40 -137 8 85 42 120 -65 -30
4051c0J05j05q5N7r5J97j33J84j66K30J06k0m65J37L05j57L5n9r8M4J18k71N1
$$ -30 75 -30 -115 -58 -153 44 -89 95 -71 159 265 245 -220 -83 222 65 100 41 -57 -13 105 -166 -115
4074a15RO0p8k30K53k6O2M9O2j27l4J55J24n6k60M26m05M48l47j16K94k21J87
$$ -115 -106 -46 -124 -354 -101 -127 -65 -16 46 -81 -115 40 164 108 -152 274 -131 317 -30 -146 148 -73 114
4097A14j7Lj15q6J80l7K33N8m38J62J5r5L4j06p0j09J70K09k43L5J27j2R0O5n1
$$ 114 97 100 -15 -101 79 42 275 333 -105 57 72 -23 11 -95 -165 -274 -104 105 -138 -103 24 12 102 167 116
4122A16N8l11n4OK47j88J09j0M6qk08L11j84J03k44J02q5J65J44k36j05K75L23
$$ 116 174 -137 -191 -185 62 -126 -17 -27 19 11 -197 114 -70 33 -211 -109 -194 -29 115 -121 -226 49 372
4145C72m23P2J42j42K31j01k30J67l7M0j72K12k58K02k78N18l68J93r9k0k29K29
$$ 372 -51 21 163 21 252 151 -79 88 51 91 -81 131 -127 75 -203 315 -53 140 41 21 -208 21
4167B1m0%k72Q2J00k4J79l8J92l81K56o8J00k90K41j11K75j93L48m18J84j43m3
$$ 21 -19 -19 -291 -209 -109 -133 46 8 200 -181 75 7 107 -183 58 -53 222 29 377 -41 143 0 -43
4190d3J23k94M9O0k22N9K62J19J44l28Q5o6Nl0Q7k58K81M7l35L85k15K30J01l19
$$ -43 80 -214 -165 -105 -327 -268 -6 113 257 -71 14 -52 -47 -77 10 -248 33 80 -255 130 -85 145 246 -73
4214g3L73k79nj43K22P9j81L1J37r0l56L41j11L7k09J57J98l12j04N67m15K93
$$ -73 300 21 16 -127 95 174 -7 24 161 71 -285 56 -55 -18 -227 -70 128 -184 -288 279 -136 157
4236A57j5K59m55o1J60o8K78l56K54j64l1j46J94n0R8Q7j40j3J17j47l1R2j4j17
$$ 157 142 401 -54 -115 45 -23 255 -101 153 -11 -42 -188 6 -44 54 141 1 -12 105 -42 -73 19 5 -112
4260a12J58J31j03l40K12J45R3k85l1K02k79K03J29j68K5j6L3j92J80J06K01j54
$$ -112 46 177 74 -266 -54 91 184 -101 -132 70 -209 -6 123 -45 -20 -36 -3 -195 -15 91 292 138
4282A38l43J43N7L9j69L3n6J94R9m2M5r4k50N7K11j84J77k44J29K18j16p2P4j4
$$ 138 -205 -62 -5 34 -135 -102 -158 36 135 93 138 44 -206 -149 62 -122 55 -189 -60 158 42 -30 44 30
4306C0Q7k3k8o1O4p6lJ77m21K66M7l51M24k55K35l03L09L8j41j06k83J42J82R1
$$ 30 117 94 66 5 69 -7 -10 167 -254 12 59 -292 132 -123 112 -191 118 156 15 -91 -374 -232 -50 41
4330D1l4n6l3l4m7J10L6k14k1M28m12oJ99KM4j14L20l61K62o0k84M08n8l3o2o6
$$ 41 7 -49 -82 -116 -163 -53 -17 -231 -252 176 -236 -242 -43 -41 3 -111 209 -152 110 50 -234 174 116 83 21 -45
4356d5J29M3j15K48k48M8J49k18M3O0m16K26l5P9K4L0K1J84m82K45j67j57M03
$$ -45 84 127 12 260 12 60 209 -9 34 94 -322 -96 -131 -52 -28 2 23 207 -275 -30 -197 -354 49
4379D9p8J2j22q4J65l6L43j70j26K39k99J92j31L3K96j66k4r3j05M28l50Q8n4
$$ 49 -29 -17 -139 -223 -58 -94 249 79 -47 192 -107 85 -46 -13 283 117 93 0 -105 323 -27 61 7
4402GN1J24j53Q8m2o6L61l36k30R4K16o3j00K33j97K56l14K22r0M8k12K76j31
$$ 7 58 182 29 117 75 9 370 34 -196 -102 114 51 -49 184 -13 243 -71 151 61 109 -103 173 42
4425D2k17K20J44m0k50J40oJ73p8m03L26O3m17M04k50J00L70o0j63j05L43k51
$$ 42 -175 45 189 149 -101 39 33 206 128 -275 51 114 -303 101 -149 -49 321 261 98 -7 336 85
4447H5J12m28J87K55k04r7j61J02K51m1Rr9J21k95J49K63J2j01j06k35L04m3k65
$$ 85 197 -231 -44 211 7 -90 -251 -149 102 61 70 -29 92 -203 -54 209 221 120 14 -221 83 40 -225
4470b25l0L57k7k72J13J85p5j37J01R0j10Rq6L4K12K4k60P0j6J00l69M09l36K86
$$ -225 -255 102 75 -197 -84 101 26 -111 -10 80 -30 -21 -107 -73 139 163 -97 -27 -43 57 -312 97 -239 47
4494D7j33j92L84Nj57K71j22p9j28L3N3j67J91J52j61j8J22jK25l55K07l28K08
$$ 47 -86 -278 106 111 -46 225 103 24 -104 -71 -18 -185 6 158 -3 -21 101 100 325 -30 177 -151 57
4517E7j96M33m10J7K8J42j71QK47J97n82K43N2j39m7jR5J78M8Q3n40k8L99l2o2
$$ 57 -139 294 -116 -99 -71 71 -100 -92 155 352 -230 13 65 -74 -121 -122 -27 151 199 282 -258 -286 113 81 19
4542A9k18L11j25r7J28j04j4o1J50L9K35l66N6K68n38K86j48J80K50m96J19J75
$$ 19 -199 112 -13 -110 18 -86 -100 -161 -11 28 263 -103 -47 221 -317 -31 -179 1 251 -245 -126 49
4564D9J29l16K85j19p8p2K34Kn7L6j65K5J50J6j41o0o8K70k98J97k10R5p5M31
$$ 49 178 -138 147 28 -50 -122 112 114 57 93 -72 -47 103 119 -22 -82 -150 120 -178 19 -191 -96 -171 260
4588B60l76J21N4l00J53R0l76K12M02j83k30J91j59L33j33j29q1l1K02q6k3J07
$$ 260 -116 5 59 -241 -88 2 -374 -162 240 57 -173 18 -141 192 59 -70 -151 -182 20 -66 -89 18
4610A8k0j20K16m96M54J64n9m46K60M1J79k15J23P0m66M81k87k9J78k28J29J72
$$ 18 -2 -122 94 -402 52 216 157 -289 -29 12 191 -24 99 169 -297 184 -103 -132 46 -182 -53 119
4632A19k82J39o6J32k19L29j63n1j47L48k23J44j33L77J9l41K77k37K31l4k21
$$ 119 -163 -24 -90 42 -177 152 -11 -62 -209 139 -84 60 -73 304 323 -18 259 22 253 219 -2
4653bJ06j69j36L98j96O0J16j92N1j02K54k51j09P1L1P1j16J88M6j10K7j54J51
$$ -2 104 -65 -201 197 1 61 177 -15 36 -66 188 -63 -172 -101 -70 1 -115 73 119 9 36 -118 33
4676C3j63K15J18k62R0k22K75m46M25J15k85J62J67m61L11O2n3L2j71J99j84J37
$$ 33 -130 85 203 -59 31 -191 84 -362 63 178 -107 55 222 -239 72 134 81 113 -58 141 -43 94
4698I4r6K0M2j22P6j53J92r3J26j06Q5q2Q9j93Q1J70l53J11J24k78L03J5j38N1
$$ 94 -2 18 60 -62 14 -139 53 -40 86 -20 65 -17 72 -121 -40 130 -223 -112 12 -266 37 52 -86 -35
4722c5pK08m10R1L5n2M86k39L46l55j56k3J02%K72l85K82k15o9kL55m72K73k3
$$ -35 -42 166 -244 -153 -118 -170 316 77 423 68 -88 -111 -9 -9 263 -122 160 -55 -124 -126 229 -243 30 7
4746GJ0P0K44l95j11K64o0M97l35l8k10O9J01j88j25P0K65l90R3M04j33k04l8
$$ 7 17 87 331 -64 -175 89 29 526 191 153 -57 12 113 -75 -200 -130 135 -255 -162 242 109 -95 -133
4769a33m2J22j57Q8N13k93k08O7oj15n7Q7O1j78L17k16J29K57j39j33R8J19l31
$$ -133 -175 -53 -210 -122 391 98 -110 -43 -49 -164 -221 -134 -73 -251 66 -150 -21 236 97 -36 62 181 -150
4792a50k23K95Q9Q2j59N7q1L4R7R3k37R1j60L09o0J86j51j93R0j15J95K04m07
$$ -150 -373 -78 11 93 -66 -9 -90 -56 41 134 -103 -12 -172 137 77 263 112 -81 9 -106 89 293 -114
4815a14K02j96K10m6n9R2r6j10L1J07j49J79l7M5j32L33q1j98m5M3J87j78m5n25
$$ -114 88 -108 102 56 -3 89 -7 -117 -86 21 -128 51 14 59 -73 260 179 -19 -64 -21 166 -12 -57 -582
4839e82N69M6j07q8K29o6j54K35j85K01k98L84p2j76R3q8K33k58MJ44j40Q6J8
$$ -582 -13 33 -74 -162 67 1 -153 82 -103 98 -200 184 112 -64 29 -59 174 -84 -80 64 -76 10 28
4862B8j65K99k06K01k11noJ2K04m0N2j06k79L10N4j64k60K7K98j55j64K74J83
$$ 28 -137 162 -44 157 -54 -59 -65 -53 151 111 163 57 -222 88 142 -22 -282 -255 43 -112 -276 -2 181
4885A81k23O2N2J7K01l78j30K61J6J23l15J25o4J31J73j52J64l43J01m6n6K61
$$ 181 -42 20 72 89 290 -88 -218 43 59 182 -133 -8 -72 59 232 80 244 -99 2 -44 -100 161
4907A61Nk64k3j14L32j8j2L62k50k08J5k08J11J70N1q4N1J6J56M4q0j15j40L59
$$ 161 166 -98 -121 -235 97 79 67 429 179 -29 -14 -222 -111 59 110 26 77 93 249 293 213 98 -42 317
4931C17m03p4j09J83M5R8j14j00J46L9K2l40J67P2P4o9r5q3P0M69l41q8J12q6
$$ 317 -86 -160 -269 -86 -41 57 -57 -157 -11 28 50 -290 -123 -51 23 -46 -141 -224 -154 315 -26 -114 -2 -88
4955h8K40p3J40l41k9L93m2J3j2l21J71J40K8q0l25K1L90m03L10j94J89o3j41
$$ -88 152 79 219 -122 -151 242 200 213 201 -120 51 191 219 139 -186 -165 225 -178 132 -62 127 64 -77
4978g7K60j65j94L35J2k80R4k0L2K73n65J35J73n53P76k16M6m1K20n5k54Q9L0
$$ -77 183 18 -176 159 171 -109 -15 -35 -3 270 -295 -160 13 -540 236 20 66 25 245 190 -64 25 55
5001E5k00N9m5nK13Rl4LR6l34J08K9PJ61l23J65j52M02l12J6j46M91q9j97k34
$$ 55 -145 -86 -131 -136 77 86 52 55 151 -183 -75 -46 -39 122 -201 -36 -188 214 -98 -82 -228 263 174 -23 -257
5026b57L20j01j78n2J72K94k61J12N9r5%j07P6K25j97J49j45n3M0j08J21o5J50
$$ -257 63 -38 -216 -268 -96 198 -63 49 108 13 13 -94 -18 207 10 159 14 -39 1 -107 14 -51 99
5049I9m1N9k27k76L50R9l2j07J68k00P4O4L3k01O0R5J82l8J4k16J24j30J81m7
$$ 99 58 117 -110 -386 -36 63 31 -76 92 -108 -34 30 63 -138 -78 17 199 161 175 -41 83 -47 134 87
5073H7n1j44N6m0R8j17NK26J37l43l2L22m68M20n34M59j26j8J63J8j10R6j29j19
$$ 87 36 -108 -52 -92 6 -111 -106 120 257 -86 -118 204 -264 156 -378 81 -45 -63 100 118 8 104 -25 -144
5097a44lJ24J73p1J83k82J1K65l99j17K36j49L62j77j66N6J08okj39L47l02p7
$$ -144 -147 -23 150 79 262 -20 -9 256 -143 -260 -24 -173 189 12 -154 -98 10 4 2 -137 210 -92 -169
5120a69K48j06l2K17k19rJ12K24m61m3J8K97q9K9R8j13j39j52J63J08N9j55j65
$$ -169 79 -27 -59 158 -61 -70 42 266 -195 -238 -220 77 -12 17 115 2 -137 -289 -126 -18 41 -114 -279
5143b79L35o3N6N1j09R6j14M21m12J06j50j12j17K09j27nJ90r1K75k13j70J85
$$ -279 56 -7 49 100 -9 87 -27 394 -18 88 -62 -174 -291 -82 -209 -214 -24 -115 160 -53 -223 -38
5165c8J22j66L84l59L0K31k43K04n00O51m79r0L10J28r2j65J34j06M4l85M59j97
$$ -38 84 -82 302 -57 -27 204 -39 165 -335 316 -163 -253 57 185 93 -72 62 -44 0 -385 74 -123
5187a23O3K85j11P0o07L81M5N8k09L10m63K31J50O9k15m6L32J8n3o0j47J77k73
$$ -123 -60 225 114 184 -423 -42 3 61 -148 162 -301 -70 80 149 -66 -112 220 238 185 125 -22 155 -118
5210a18l2J75n9n1J11N6K87m29K3p0L53j23m03L74j11q9m3J28j26L69m7l12K98
$$ -118 -150 25 -34 -85 26 82 369 -60 -37 -107 246 123 -280 94 -17 -106 -149 -21 -147 222 175 -137 161
5233A61j40K3m7j7M38l88j67J36N0J13J5j4j66o0PR3O1j28j87J42J08o3p1J54
$$ 161 21 44 -3 -20 418 30 -137 -1 49 162 177 163 -3 -63 -56 37 98 -30 -217 -75 33 -30 -101 53
5257E3l29J79K21l3%k33K28M8j93O2k88K61O7R8k77J7J49j95L45k62P5L94q1q9
$$ 53 -276 -97 124 91 91 -142 86 134 -59 3 -285 -24 43 141 -136 -119 30 -165 180 -82 -7 387 306 217
5281B17q4K1k34R6k10J01J9J55J3j56L0j94M25o0n0j58K86l28L02j43j25m5J35
$$ 217 133 154 -80 16 -194 -93 -74 81 94 -62 -32 -226 199 139 89 -69 217 -111 191 48 -77 -122 13
5304A3j5o6l5k2J9J5j18j7j4K01O7J62j59rQ7k35K99j26N1j16K9L40k01q6l2m2
$$ 13 -2 -68 -103 -125 -106 -91 -209 -226 -240 -39 28 190 31 22 109 -126 173 47 98 -18 11 351 150 64 32 -10
5330a0K95j91k22J19j14J91J80m1j23k90L27l32K95O2k91j7L35j71L71o19L68
$$ -10 285 94 -128 -9 -123 68 248 207 84 -206 121 -211 84 146 -145 -162 173 2 373 -246 122
5351A22J47k54Q9l05L84j48o5pJ54j86j70L60l31K10R5j35O5J50l87J42j01K48
$$ 122 269 15 104 -201 183 35 -30 -37 117 -69 -239 121 -210 0 95 -40 25 175 -212 -70 -171 77
5373G7j30nJ91j49J12k23J31p9j17K72J6J12k48J80k88K07j55n0K94p0R1k49L29
$$ 77 -53 -58 133 -16 96 -127 4 -75 -192 80 96 208 -40 140 -148 59 -96 -146 148 78 169 -80 249
5396B49m86J87J06l5o8M2J79l26K98o9k37L06m36K37j50J75K02l24J5j42L0L77
$$ 249 -237 -50 56 21 -47 -5 174 -152 146 77 -160 146 -290 -53 -203 -28 174 -150 -135 -277 -247 130
5418A30k0P0k37L4Q4L7N2k30J97o9J64l58J39O8j03K71k65J52l34K23k87L68R
$$ 130 110 180 -57 -23 61 98 150 -80 117 48 212 -146 -7 61 -42 229 -36 116 -218 5 -282 86 95
5441I5j89J95q0k84K09r4J16J34k8j2j90J33J79k29P5j57J48m6k03K19p2J06l7
$$ 95 -94 101 21 -263 -54 -148 -32 102 74 62 -128 5 184 -45 30 -127 21 -25 -228 -9 -81 25 -12
5464a2l17K55p9M8P8J01o2l7K07l23N19p06J54NN00k32k80J80o1j38L75o3l9j08
$$ -12 -329 -74 -153 -105 -27 74 12 -25 182 -141 378 -328 -174 -169 331 99 -181 -1 -62 -200 175 112 73 -35
5488c5l1L03l23K6m4J05K87j70j43J42r7O0j30N2j5k6j81O6K33j67L1J21J7k40
$$ -35 -66 237 -86 -60 -104 1 288 118 -25 117 20 80 -50 2 -13 -39 -220 -154 79 -88 -57 64 81 -159
5512a59K71K83m15O9l5l27K95J32m2L57k19j82O7M2k64K76P2m07L11j06J45l48
$$ -159 112 395 -20 49 14 -313 -18 114 72 429 210 28 95 137 -127 149 221 -186 125 19 164 -184
5534a84j12N63l65K01l12M25k52q5K10oj71q3l0J75J69j12p5r3K53p1k7j01j14
$$ -184 -296 267 -98 103 -209 216 -36 -121 89 83 -88 -171 -201 -26 143 31 -44 -137 116 45 18 -83 -197
5557a97J53P2l0mm5j60J38R2m4L0j06l2M89l01j18M0k2M9J72J13l14J44Nk4j63
$$ -197 -44 28 -2 -6 -51 -211 -73 19 -25 5 -101 -133 356 55 -63 -23 -45 4 176 289 -25 119 124 100 -63
5582f3Q6l87N59m7j74K02o2k10K5J82l1N6j25J01j0m20L77n4p6m5O0j34%P0R6
$$ -63 23 -364 195 148 -26 176 114 -96 -71 111 80 136 11 112 102 -318 59 5 -71 -116 -56 -190 -190 -120 -24
5607b4J64k15k3R3J22N4k22K6j0j67J84L21j79P8j09k85J62m6j04L13j82J84P0
$$ -24 140 -75 -98 -5 117 171 -51 -25 -35 -202 -18 303 124 202 93 -192 -30 -76 -180 133 -49 135 205
5630B05j09j16Q2J03j20r1J27j51M3L48l20J2q7K31k02l9K9K03l54J83j04K98
$$ 205 96 -20 62 165 45 -46 81 -70 -27 321 1 13 -74 157 -45 -84 -55 148 -206 -23 -127 171
5652A71l08J56K90m36J68K2R3k06KL8J30j50J75n22N28j46j05J29J26r1k32K75
$$ 171 -137 19 309 -127 41 63 156 -50 -48 -10 120 -30 145 -377 151 5 -100 29 155 64 -168 107
5674A07j03R4NM0j43j83J71M3k0K45k30Q0K2q8m10K41l6M75k78P0J88m45N4j18
$$ 107 4 98 103 143 0 -183 -12 31 11 256 26 106 128 40 -370 -129 -165 310 32 102 290 -155 -101 -219
5698b19L29k56q2M19r9k12K31j36K7J80j90o1l8n0L5M4M4k56J62K56k52O3n4K03
$$ -219 110 -146 -228 191 92 -120 111 -25 2 182 -8 -69 -107 -157 -122 -78 -34 -290 -128 128 -124 -61 -115 88
5722H8j40p1L05k66J34K46l12O9J7j73J19k05R6J35m9J2j88R1Q9n3M7J15O5k35
$$ 88 -52 -123 182 -84 50 296 -16 53 70 -103 16 -189 -93 42 -7 5 -183 -92 -3 -56 -9 106 171 -64
5746f4K60j58Nj62J71k16k2K27k28L35l30K53n0J47k04q7K28R5k23L95m36nL54
$$ -64 196 38 43 -119 52 -164 -186 41 -187 148 -182 71 21 168 -36 -123 105 200 -23 372 -64 -69 285
5769B85l99O1j78OJ15J08n2p1K08J41k77P1J17l05L02m81L61J40j87j09N2J26
$$ 285 -114 -53 -231 -225 -110 -2 -54 -125 83 224 -53 18 135 -170 132 -349 12 152 -35 -144 -92 34
5791C4N0j85r0K66j72J06k73K78J05m5j12k9J05K3J54k62j40pK35J97k01k0PJ12
$$ 34 84 -101 -191 75 -97 9 -264 14 119 74 -38 -67 38 61 215 -47 -187 -194 41 238 37 17 24 136
5815A36k62J12k70P5R7J25J49o5J86k41rj07L33j22k59K06j25J59l3l09K03j37
$$ 136 -126 -14 -284 -209 -112 13 162 97 283 42 33 -74 259 137 -122 84 -41 118 85 -224 -21 -158
5837a58K00o7J6L9R6j29K12n4k7m2n5J58l48K92k31J31k42Q0J69p4j51%N01m92
$$ -158 42 -25 -9 30 126 -3 209 155 128 86 31 189 -159 133 -98 33 -209 -129 40 -34 -185 -185 316 -176
5861a76J69j2Q6ll16K14j06j25J03P7k0J52j45j5L65ql16k2J34k3k6k54L49J7
$$ -176 -7 -19 67 64 -252 -38 -144 -269 -166 -89 -109 43 -102 -117 248 240 -76 -98 36 13 -13 -267 82 99
5885I9m8k1N6k27K30n6j91j54L20J19m8L43n44J22l6M6j05L6J36N3j16j81M01
$$ 99 51 30 86 -141 89 33 -158 -312 8 127 79 422 -122 0 -36 10 -95 -59 77 130 14 -167 234
5908B34m28J91k52M06k81J51%K25m34J68j4L5M4j34M7j05j3m3J25Q0mj09K5K61
$$ 234 -194 -3 -255 151 -130 21 21 246 -188 -20 -34 1 45 -89 -42 -147 -160 -203 -78 2 -2 -111 -86 175
5932A75o3k37n5J70P7J59k27n0O8l1qL17n51j9j01K88J85J8j05j84L9J32r0K91
$$ 175 112 -125 -180 -10 67 226 -1 -51 17 -14 -22 295 -256 -275 -376 -88 97 115 10 -174 -135 -3 -93 198
5956A98l51J92M5K5j08j83L71k97O5L30j41m1l2J3j5P9j05Q7k20O5J44l68N01
$$ 198 -153 39 84 109 1 -182 189 -108 -43 287 146 105 73 86 71 150 45 132 -88 -23 121 -247 254
5979B54l76M5o0k13Q3L86m31J52K55k98J77K24l37M22m14J5K23k26J88M7l74L68
$$ 254 -122 -77 -137 -350 -267 119 -312 -160 95 -203 -26 198 -139 283 -131 -116 107 -119 69 116 -258 110
6001A10j8o9n%m6L2K7K8J99L5m64L69k64J4J34p2o9K84k72r1KJ3M03j45J18l04
$$ 110 92 23 18 18 -28 4 31 59 258 293 -171 198 -66 -52 82 10 -59 225 -47 -138 -136 -123 280 135 253 -51
6027e1n6L69j75l54J99J71n9Q5k03J02l10M59o0N8N9j08k77L92pj17k24j9R1j03
$$ -51 -107 262 87 -267 -68 103 44 129 -74 28 -282 177 117 175 234 126 -151 241 234 117 -107 -126 -35 -138
6051a38J89N0j98N0J03Q3Jj23J3j24J78pJ95m18J2K76j66Q2m4j77K51J07j54J39
$$ -138 51 101 -97 -47 56 139 140 17 30 -94 84 77 272 -146 -134 142 -24 58 14 -163 88 195 41 180
6075A80k05m5N3J85j09j47M5K4j27O3N6Q8r1j62K49j31k4L02o3j12J04j47J11
$$ 180 -25 -70 -17 168 59 -88 -43 -19 -146 -83 -27 61 -30 -192 57 -74 -98 204 141 29 133 -14 97
6098I7j07K05l8k90L07j27j03J75j5r4K2J90j71r6K35k80k64K88k32L41q5J50
$$ 97 -10 195 157 -133 174 47 -56 119 104 10 32 222 51 -45 190 -90 -354 -66 -298 43 -42 108
$$ [...]
8191A07
##END NTUPLES=NMR FID
##END=
