##TITLE=1H_DE-56k_TFA_2
 CDCl3
 8 sc, 
 25.6.2024
##JCAMPDX= 6.0         $$ Bruker NMR JCAMP-DX V2.0
##DATA TYPE= NMR FID
##DATA CLASS= NTUPLES
##ORIGIN= UXNMR, Bruker Analytische Messtechnik GmbH
##OWNER= root
$$ XWIN-NMR		Version 3.5
$$ Tue Jun 25 16:15:31 2024 Russian Standard Time (UT+4h)  she@DPX200
##.OBSERVE FREQUENCY= 200.1312
##.OBSERVE NUCLEUS= ^1H
##.DELAY= (6, 6)
##.ACQUISITION MODE= SIMULTANEOUS
##.ACQUISITION SCHEME= undefined
##.AVERAGES= 8
##.DIGITISER RES= 18
##SPECTROMETER/DATA SYSTEM= spect
##.PULSE SEQUENCE= zg30
##.SOLVENT NAME= CDCl3
##.SHIFT REFERENCE= (INTERNAL, CDCl3, 0, 15.7039)
##AUDIT TRAIL= $$ (NUMBER, WHEN, WHO, WHERE, WHAT)
$$ ##TITLE= Audit trail, XWIN-NMR		Version 3.5
$$ ##JCAMPDX= 5.01
$$ ##ORIGIN= Bruker BioSpin GmbH
$$ ##OWNER= she
$$ F:/spectra/data/she/nmr/H-F/1/audita.txt
$$ ##AUDIT TRAIL=  $$ (NUMBER, WHEN, WHO, WHERE, WHAT)
(   1,<2024-06-25 16:14:33.21 +0400>,<she>,<DPX200>,
      <created by zg, POWCHK disabled, PULCHK disabled
       configuration hash MD5:
       00 E9 B6 7A A2 85 ED C7 34 08 36 98 17 FE 4E 26
       data hash MD5: 16K
       4C 12 A3 CD C5 15 14 5E 08 7B CD 0A 46 00 13 1A>)
$$ ##END=
$$ 
$$ hash MD5
$$ DD 7C 4A 9F C9 EB 65 DF E7 23 42 4E FA D5 F6 EA
##$RELAX= 
##$RELAX= 
##$RELAX= 
##$RELAX= 
##$RELAX= 
##$RELAX= 
$$ Bruker specific parameters
$$ --------------------------
##$DU= <F:/spectra>
##$EXPNO= 1
##$NAME= <H-F>
##$PROCNO= 1
##$TYPE= <nmr>
##$USER= <she>
##$AMP= (0..31)
100 100 100 100 100 100 100 100 100 100 100 100 100 100 100 100 100 100 
100 100 100 100 100 100 100 100 100 100 100 100 100 100 
##$AQSEQ= 0
##$AQ_mod= 1
##$AUNM= <au_zg>
##$AUTOPOS= <>
##$BF1= 200.13
##$BF2= 200.13
##$BF3= 200.13
##$BF4= 200.13
##$BF5= 200.13
##$BF6= 200.13
##$BF7= 200.13
##$BF8= 200.13
##$BYTORDA= 1
##$CFDGTYP= 0
##$CFRGTYP= 5
##$CHEMSTR= <none>
##$CNST= (0..31)
1 1 145 1 1 1 1 1 1 1 1 1 1 1 1 1 1 1 1 1 1 1 1 1 1 1 1 1 1 1 1 1 
##$CPDPRG= <>
##$CPDPRG1= <>
##$CPDPRG2= <>
##$CPDPRG3= <>
##$CPDPRG4= <mlev>
##$CPDPRG5= <mlev>
##$CPDPRG6= <mlev>
##$CPDPRG7= <mlev>
##$CPDPRG8= <mlev>
##$CPDPRGB= <>
##$CPDPRGT= <>
##$D= (0..31)
0 1.2 0 0 0 0 0 0 0 0.06 0 0.03 0 0 0 0 0.0002 0 0 0 0 0 0 0 0 0 0 0 0 
0 0 0 
##$DATE= 1719317672
##$DBL= (0..7)
120 120 120 120 120 120 120 120 
##$DBP= (0..7)
150 150 150 150 150 150 150 150 
##$DBP07= 0
##$DBPNAM0= <>
##$DBPNAM1= <>
##$DBPNAM2= <>
##$DBPNAM3= <>
##$DBPNAM4= <>
##$DBPNAM5= <>
##$DBPNAM6= <>
##$DBPNAM7= <>
##$DBPOAL= (0..7)
0.5 0.5 0.5 0.5 0.5 0.5 0.5 0.5 
##$DBPOFFS= (0..7)
0 0 0 0 0 0 0 0 
##$DE= 6
##$DECBNUC= <off>
##$DECIM= 32
##$DECNUC= <off>
##$DECSTAT= 4
##$DIGMOD= 1
##$DIGTYP= 9
##$DL= (0..7)
0 120 120 120 120 120 120 120 
##$DP= (0..7)
150 150 150 150 150 150 150 150 
##$DP07= 0
##$DPNAME0= <>
##$DPNAME1= <>
##$DPNAME2= <>
##$DPNAME3= <>
##$DPNAME4= <>
##$DPNAME5= <>
##$DPNAME6= <>
##$DPNAME7= <>
##$DPOAL= (0..7)
0.5 0.5 0.5 0.5 0.5 0.5 0.5 0.5 
##$DPOFFS= (0..7)
0 0 0 0 0 0 0 0 
##$DQDMODE= 0
##$DR= 18
##$DS= 0
##$DSLIST= <SSSSSSSSSSSSSSS>
$$ [...]
##$SUBNAM2= <"">
##$SUBNAM3= <"">
##$SUBNAM4= <"">
##$SUBNAM5= <"">
##$SUBNAM6= <"">
##$SUBNAM7= <"">
##$SUBNAM8= <"">
##$SUBNAM9= <"">
##$SW= 18.0517418723606
##$SWIBOX= (0..15)
0 0 2 0 0 0 0 0 0 0 0 0 0 0 0 0 
##$SW_h= 3612.71676300578
##$TD= 16384
##$TD0= 1
##$TE= 0
##$TE2= 300
##$TE3= 300
##$TEG= 300
##$TL= (0..7)
0 120 120 120 120 120 120 120 
##$TP= (0..7)
150 150 150 150 150 150 150 150 
##$TP07= 0
##$TPNAME0= <>
##$TPNAME1= <>
##$TPNAME2= <>
##$TPNAME3= <>
##$TPNAME4= <>
##$TPNAME5= <>
##$TPNAME6= <>
##$TPNAME7= <>
##$TPOAL= (0..7)
0.5 0.5 0.5 0.5 0.5 0.5 0.5 0.5 
##$TPOFFS= (0..7)
0 0 0 0 0 0 0 0 
##$TUNHIN= 0
##$TUNHOUT= 0
##$TUNXOUT= 0
##$USERA1= <user>
##$USERA2= <user>
##$USERA3= <user>
##$USERA4= <user>
##$USERA5= <user>
##$V9= 5
##$VALIST= <valist>
##$VCLIST= <CCCCCCCCCCCCCCC>
##$VD= 0
##$VDLIST= <DDDDDDDDDDDDDDD>
##$VPLIST= <PPPPPPPPPPPPPPP>
##$VTLIST= <TTTTTTTTTTTTTTT>
##$WBST= 1024
##$WBSW= 4
##$XGAIN= (0..3)
0 0 0 0 
##$XL= 0
##$YL= 0
##$YMAX_a= 83925
##$YMIN_a= -107538
##$ZGOPTNS= <>
##$ZL1= 120
##$ZL2= 120
##$ZL3= 120
##$ZL4= 120
##$ABSF1= 10
##$ABSF2= 0
##$ABSG= 5
##$ABSL= 3
##$ALPHA= 0
##$AQORDER= 0
##$ASSFAC= 0
##$ASSFACI= 0
##$ASSFACX= 0
##$ASSWID= 0
##$AUNMP= <proc_1d>
##$AZFE= 0.1
##$AZFW= 0.1
##$BCFW= 1
##$BC_mod= 2
##$BYTORDP= 1
##$COROFFS= 0
##$CY= 11.3945322036743
##$DATMOD= 1
##$DC= 2
##$DFILT= <>
##$DTYPP= 0
##$F1P= 15.6554695791079
##$F2P= 12.8336369535428
##$FCOR= 0.5
##$FTSIZE= 0
##$FT_mod= 4
##$GAMMA= 1
##$GB= 0.15
##$INTBC= 1
##$INTSCL= 1
##$ISEN= 128
##$LB= 0.24
##$LEV0= 0
##$LPBIN= 0
##$MAXI= 10000
##$MC2= 0
##$MEAN= 0
##$ME_mod= 0
##$MI= 1.114404
##$NCOEF= 0
##$NC_proc= 0
##$NLEV= 6
##$NOISF1= 3.799351
##$NOISF2= 2.8
##$NSP= 1
##$NTH_PI= 0
##$NZP= 0
##$OFFSET= 15.70392
##$PC= 1
##$PHC0= -25313.41
##$PHC1= 9.587481
##$PH_mod= 1
##$PKNL= yes
##$PPARMOD= 0
##$PSCAL= 0
##$PSIGN= 0
##$REVERSE= no
##$SF= 200.130013532006
##$SI= 16384
##$SIGF1= 3
##$SIGF2= 2
##$SINO= 400
##$SIOLD= 16384
##$SREGLST= <1H.CDCl3>
##$SSB= 0
##$STSI= 0
##$STSR= 0
##$SW_p= 3612.71676300578
##$SYMM= 0
##$S_DEV= 0
##$TDeff= 0
##$TDoff= 0
##$TI= <>
##$TILT= no
##$TM1= 0
##$TM2= 0
##$TOPLEV= 0
##$USERP1= <user>
##$USERP2= <user>
##$USERP3= <user>
##$USERP4= <user>
##$USERP5= <user>
##$WDW= 1
##$XDIM= 8192
##$YMAX_p= 0
##$YMIN_p= 0
$$ End of Bruker specific parameters
$$ ---------------------------------
##NTUPLES= NMR FID
##VAR_NAME=  TIME,          FID/REAL,        FID/IMAG
##SYMBOL=    X,             R,               I
##VAR_TYPE=  INDEPENDENT,   DEPENDENT,       DEPENDENT
##VAR_FORM=  AFFN,          ASDF,            ASDF
##VAR_DIM=   8192,          8192,            8192
##UNITS=     SECONDS,       ARBITRARY UNITS, ARBITRARY UNITS
##FACTOR=    0.0002768,     1,               1
##FIRST=     0,             0,               0
##LAST=      2.2672688,     0,               0
##MIN=       0,             -107538,         0
##MAX=       2.2672688,     83925,           0
$$ Real data points
##PAGE= N=1
##DATA TABLE= (X++(R..R)), XYDATA
$$ [...]
$$ plain form
1554 668 -451 -611 -421 -518 -1213 -1737 -1309 -276 768 777 391 593 1116 1282 663 -491 -925 -558 -4 202
1574 202 -9 -275 419 1149 966 196 -713 -1054 -583 -561 -944 -1332 -903 167 1086 1109 585 220 758 908
1594 908 302 -740 -1027 -541 176 307 44 -147 272 878 701 -11 -1103 -1195 -720 -348 -719 -888 -321 665
1614 665 1445 1337 558 227 286 468 -91 -744 -1105 -327 460 526 264 95 246 676 333 -464 -1158 -1458 -523
1635 -523 -108 -250 -324 -42 1058 1372 1095 559 -320 -208 100 -179 -914 -1077 -505 355 784 335 44 17
1655 17 438 299 -605 -1326 -1221 -645 253 -44 -80 311 1013 1672 1087 151 -431 -349 -116 -459 -960 -1176 -395
1676 -395 575 922 505 -84 46 402 -5 -732 -1324 -1129 -494 415 557 450 645 1158 1491 1038 52 -663
1696 -663 -482 -370 -354 -822 -1022 -229 615 883 278 -321 -224 277 -193 -678 -1140 -972 -140 728 802 614 713
$$ packed form
1554F68j119j60J90r7o95n24M28J033J044Rl86K02N23J66o19j154m34L67N54K06
1574B02k11k66O94P30j83p70r09l41M71K2l83l88M29J070R19K3n24l65N38J50
1594I08o06j042k87M86P17J31k63j91M19O06j77p12j092r2M75L72l71j69N67R86
1614F65P80j08p79l31N9J82n59o53l61P78P87O6k62j69J51M30l43p97o94l00R35
1635e23M15j42p4K82J100L14k77n36q79J12L08k79p35j63N72Q60M29m49k91k7
1655A7M21j39r04p21J05N76Q98k97l6L91P02O59n85r36n82Q2K33l43n01k16P81
1676c95R70L47m17n89J30L56m07p27n92J95O35R09J42j07J95N13L33m53r86p15
1696f63J81J12J6m68k00P93Q44K68o05n99R7N01m70m85m62J68Q32Q68P4j88R9
$$ plain form
1717 713 1129 1272 752 -290 -953 -778 -453 -279 -672 -851 -137 514 671 201 -300 -586 -133 -173 -350 -812
1737 -812 -572 413 997 885 587 305 843 832 356 -553 -1179 -1015 -221 -297 -451 -377 -156 542 635 323 -601
1758 -601 -505 -101 97 -344 -740 -92 612 1191 1231 370 359 444 172 -60 -792 -1271 -965 -222 44 -110 -352
1779 -352 156 599 654 86 -784 -746 -363 120 139 -365 -33 901 1330 1008 420 62 9 158 -463 -1006 -1456
1800 -1456 -753 -10 245 49 119 246 618 479 -95 -712 -803 -53 33 181 -102 141 796 1434 1035 179 -557
1821 -557 -472 -360 -615 -1041 -1285 -511 117 607 623 363 460 569 620 -139 -795 -670 -186 186 250 -2 53 828
1843 828 924 765 -93 -602 -677 -605 -492 -1088 -967 -495 591 658 521 219 221 728 539 -5 -782 -593 -387 206
1865 206 476 9 45 476 839 428 -300 -636 -634 -348 -401 -664 -829 -270 665 838 536 217 164 497 368 -118
$$ packed form
1717G13M16J43n20j042o63J75L25J74l93j79P14O51J57m70n01k86M53m0j77m62
1737h12K40R85N84j12k98k82N38j1m76r09o26J64P94p6j54P4K21O98R3l12r24
1758f01R6M04J98m41l96O48P04N79M0q61j1Q5k72k32p32m79L06P43K66j54k42
1779c52N08M43N5n68q70L8L83M83J9n04L32R34M29l22n88l58n3J49o21n43m50
1800a456P03P43K55j96P0J27L72j39n74o17r1P50Q6J48k83K43O55O38l99q56p36
1821e57Q5J12k55m26k44P74O28M90J6k60R7J09N1p59o56J25M84L72O4k52N5P75
1843H28R6j59q58n09p5P2J13n96J21M72J086O7j37l02KN07j89n44p77J89K06N93
1865B06K70m67L6M31L63m11p28l36KK86n3k63j65N59R35J73l02l19n3L33j29m86
$$ plain form
1887 -118 -471 -749 -74 223 186 165 50 290 514 120 -556 -929 -775 -386 -274 -476 -230 237 700 954 654
1908 654 99 -160 214 223 -254 -545 -476 87 435 593 106 -188 -4 25 65 -651 -1001 -716 -350 176 53 185
1930 185 451 965 866 450 -269 -232 -39 32 -301 -388 -294 169 514 490 285 -130 -81 -19 -351 -944 -965 -722 -100
1953 -100 175 163 405 442 681 1010 201 -107 -560 -230 -63 -248 -307 -283 395 674 573 241 -142 -288 -100
1974 -100 -473 -705 -926 -422 0 492 488 502 402 773 702 135 -198 -408 -219 -115 50 -418 -288 174 738
1995 738 678 71 -197 -231 -179 -342 -445 -637 -472 389 629 731 452 373 575 645 95 -435 -669 -327 -122 -51
2017 -51 -255 -260 375 566 417 15 -636 -528 -163 -6 -464 -396 -85 524 879 550 270 304 409 202 -117 -649
2039 -649 -756 -208 -20 144 -165 -46 275 579 353 -223 -585 -339 -146 -104 -72 -286 284 591 796 507 157
$$ packed form
1887a18l53k78O75K97l7k1j15K40K24l94o76l73J54L89J12k02K46M67M63K54l00
1908F54n55k59L74Rm77k91O9N63L48J58m87k94J84K9M0p16l50K85L66N26j23J32
1930A85K66N14r9m16p19L7J93P1l33q7R4M63L45k4k05m15M9O2l32n93k1K43O22
1953a00K75j2K42L7K39L29q09l08m53L30J67j85n9K4O78K79j01l32l83j46J88
1974a00l73k32k21N04M22M92mJ4j00L71p1n67l33k10J89J04J65m68J30M62N64
1995G38o0o07k68l4N2j63j03j92J65Q61K40J02k79p9K02P0n50n30k34L42K05P1
2017e1k04nO35J91j49m02o51J08L65J57m58O8L11O09L55l29k80L4J05k07l19n32
2039f49j07N48J88J64l09J19L21L04k26n76l62K46J93M2L2k14N70L07K05k89l50
$$ plain form
2060 157 39 96 300 -370 -719 -627 -178 329 202 75 -36 191 501 155 -262 -643 -294 -23 -92 87 214
2081 214 325 771 761 550 84 -292 -151 -304 -478 -777 -570 -225 241 380 118 110 230 268 96 -235 -621
2102 -621 -356 21 288 220 122 329 713 660 498 -150 -274 -343 -398 -386 -907 -650 -133 374 395 256 297 230 265
2125 265 -22 -249 -577 -372 -4 213 297 2 369 641 466 247 -358 -532 -527 -299 -374 -557 -323 51 479
2146 479 457 202 204 185 289 43 -492 -374 -335 34 285 196 289 142 384 318 82 -524 -717 -357 -405 -275 -456
2169 -456 -300 227 524 617 184 73 148 191 149 -205 -502 -172 328 446 327 114 275 330 25 -48 -641 -430
2191 -430 -437 -24 4 -138 -63 87 433 441 140 -242 -124 94 -42 -152 -203 36 261 557 117 166 -39 -65 -71 -183
2215 -183 -467 -551 -235 51 2 -65 41 331 628 355 75 -316 -181 2 75 -152 -169 123 402 393 172 9
$$ packed form
2060A57j18N7K04o70l49R2M49N07j27j27j11K27L10l46m17l81L49K71o9J79J27
2081B14J11M46j0k11m66l76J41j53j74k99K07L45M66J39k62qJ20L8j72l31l86
2102f21K65L77K67o8r8K07L84n3j62o48j24o9n5J2n21K57N17N07K1j39M1o7L5
2125B65k87k27l28K05L68K17Q4k95L67K72j75k19o05j74NK28p5j83K34L74M28
2146D79k2k55Kj9J04k46n35J18L9L69K51q9R3j47K42o6k36o06j93L60m8J30j81
2169d56J56N27K97R3m33j11P5M3m2l54k97L30N00J18j19k13J61N5l05p3n93K11
2191d30pM13K8j42P5J50L46Ql01l82J18K18j36j10n1K39K25K96m40M9k05k6oj12
2215a83k84q4L16K86m9o7J06K90K97k73k80l91J35J83P3k27j7K92K79rk21j63
$$ plain form
2237 9 51 15 -95 -331 -554 -582 -127 110 223 49 122 357 364 204 -54 -346 -383 -173 -61 -134 -103 197 343 600
2261 600 182 -201 21 -250 -290 -442 -547 -598 -144 357 529 329 132 468 405 219 -172 -530 -346 -102 -88
2282 -88 -182 -90 270 376 431 89 -288 -235 -122 -201 -546 -486 -146 -37 514 352 210 211 312 332 122 -71 -267
2305 -267 -261 -189 -13 -54 -35 73 374 266 -9 -220 -482 -248 -128 -197 -291 -157 132 605 482 376 94 51 71
2328 71 -104 -142 -327 -412 -45 91 200 -61 135 222 132 -67 -302 -400 -7 53 239 59 -10 191 513 538 134
2351 134 -54 -10 -184 -213 -161 -580 -95 51 165 76 -32 -19 -6 203 -3 -389 -496 -71 34 98 -27 57 320
2374 320 592 364 48 -227 -126 -22 -137 -162 -211 -369 8 -31 176 -26 -16 59 -81 -93 -241 -188 -105 74 306
2397 306 51 149 302 493 237 99 -194 -137 -223 -160 -140 -218 51 284 421 297 106 22 103 2 -202 -462 -369
$$ packed form
2237IM2l6j10k36k23k8M55K37J13j74P3K35Pj60k58k92l7K10J12p3L1L00J46K57
2261F00m18l83K22k71m0j52j05n1M54N01J72k00j97L36o3j86l91l58J84K44J4
2282h8r4R2L60J06N5l42l77N3J13p9l45O0L40J09N51j62j42JJ01K0k10j93j96
2305b67OP2J76m1J9J08L01j08k75k11k62K34J20o9r4J34K89M73j23j06k82m3K0
2328G1j75l8j85q5L67J36J09k61J96Q7r0j99k35r8L93O0J86j80o9K01L22K5m04
2351A34j88M4j74k9N2m19M85J46J14q9j08J3J3K09k06l86j07M25J05O4j25Q4K63
2374C20K72k28l16k75J01J04j15k5m9j58L77l9K07k02J0P5j40j2j48N3Q3J79K32
2397C06k55R8J53J91k56j38k93N7q6O3K0p8K69K33J37j24j91q4Q1j01k04k60R3
$$ plain form
2420 -369 -103 191 255 393 235 329 376 116 -136 -305 -422 -280 -88 -358 -164 -137 211 311 170 56 -258
2441 -258 -85 113 -112 -413 -136 -94 114 341 201 149 220 265 44 -363 -423 -258 -51 -43 -65 -2 -64 252 267 102
2465 102 95 22 -12 -179 -160 -229 -361 -25 345 126 200 -17 24 76 4 -218 -347 -218 26 -39 115 -234 122 241
2489 241 320 72 -143 -33 -199 -123 -93 -200 -118 142 207 332 139 -96 141 16 -17 -316 -415 -175 -81 132 -43
2512 -43 149 33 105 256 304 -169 -128 -255 -15 218 -20 75 218 406 414 -51 -307 -245 -154 -153 -293 -496 -25 95
2536 95 262 192 145 136 182 220 -127 -222 -154 -143 -132 -8 -67 102 197 358 68 -63 -103 -283 -96 -253 -172 -216 -261 74
2562 74 323 368 196 120 110 18 -235 -98 -305 -68 -109 -26 196 38 161 317 198 -78 -325 -261 -233 -70 -219
2585 -219 -93 -15 307 355 257 190 184 141 203 188 -315 -209 -34 84 6 54 15 84 171 0 17 -314 -288 -113 -47 -41
$$ packed form
2420c69K66K94O4J38j58R4M7k60k52j69j17J42J92k70J94K7L48J00j41j14l14
2441b58J73J98k25l01K77M2K08K27j40n2P1M5k21m07o0J65K07Qk2O3o2L16J5j65
2465A02pp3l4j67J9o9j32L36L70k19P4k17M1N2p2k22j29J29K44o5J54l49L56J19
2489B41P9k48k15J10j66P6L0j07Q2K60O5J25j93k35K37j25l3k99r9K40R4K13j75
2512d3J92j16P2J51M8m73M1j27K40K33k38R5J43J88Qm65k56O2R1Jj40k03M71J20
2536I5J67p0m7rM6L8l47r5O8J1J1J24n9J69R5J61k90j31m0j80J87j57Q1m4m5L35
2562G4K49M5j72p6j0r2k53J37k07K37m1Q3K22j58J23J56j19k76k47O4K8J63j49
2585b19J26P8L22M8r8o7om3O2j5n03J06J75J18p8M8l9O9Q7j71J7l31K6J75O6O
$$ plain form
2611 -41 -108 99 10 142 148 1 6 70 42 -26 -274 -142 -151 176 249 179 -50 226 118 122 -247 -339 -240 -164 16 -38 0
2638 0 101 104 234 262 82 -22 22 121 -245 -155 -180 -92 74 219 63 -32 -123 108 -68 -58 -295 -218 -48 53 138
2663 138 117 -136 210 157 114 -187 -403 -220 -39 78 -166 -223 9 224 171 162 -170 -37 76 -34 -314 -131
2685 -131 -187 107 249 210 199 121 195 143 -85 -203 -335 -64 -78 -108 -139 -1 63 86 353 80 -83 -122 123 40
2709 40 -201 -144 101 95 121 230 60 92 212 171 -109 -296 -327 -109 -249 -154 52 47 121 126 247 56 -129 -142 19
2734 19 -52 -171 -105 -195 26 5 189 -120 -148 37 95 46 -240 -234 -346 -37 50 -9 -34 44 225 178 141 31 3 -120
2760 -120 121 -113 -42 30 117 465 289 -129 -14 -82 -117 102 -205 -328 -204 -96 105 8 65 129 258 203 -26
2783 -26 -223 -126 19 -115 24 -80 7 97 333 73 190 -44 -77 -71 -186 -98 -270 -31 194 120 -67 -143 164
$$ packed form
2611d1o7K07q9J32Oj47NO4k8o8k48J32rL27P3p0k29K76j08Ml69r2R9P6J80n4L8
2638@J01LJ30K8j80j04M4R9l66R0k5Q8J66J45j56r5r1K31j76J0k37P7J70J01Q5
2663A38k1k53L46n3m3l01k16J83J81J17k44n7K32K15n3rl32J33J13j10k80J83
2685a31n6K94J42l9j1p8P4n2k28j18j32K71j4l0l1J38O4K3K67k73j63l9K45q3
2709D0k41N7K45oK6J09j70L2J20m1k80j87l1K18j40R5K06nP4NJ21j91j85j3J61
2734A9p1j19O6r0K21k1J84l09k8J85N8m9k86Oj12L09Q7n9k5P8J81m7l7j10k8j23
2760a20K41k34P1P2Q7L48j76m18J15o8l5K19l07j23J24J08K01r7N7O4J29n5k29
2783b6j97R7J45j34J39j04Q7R0K36k60J17k34l3Oj15Q8j72K39K25p4j87p6L07
$$ plain form
2806 164 96 28 95 -258 -143 61 49 155 83 27 248 166 325 -90 -289 -102 -50 -66 -136 -179 32 143 83 18
2830 18 17 117 -129 -129 73 -215 -108 -14 160 242 -37 117 146 30 292 -230 -301 -346 -96 121 -169 144 -41
2853 -41 305 166 141 101 212 69 32 -88 -302 -157 40 169 130 62 32 245 38 246 -194 -122 -212 53 -132
2876 -132 -151 -60 235 202 86 91 -204 -109 -207 -136 -62 -146 -72 86 60 74 133 -48 181 128 -4 -181 -125 -270 109
2901 109 25 93 -73 28 306 239 -52 -29 41 -234 -104 -236 -215 -83 67 22 127 9 109 -51 62 58 -292
2924 -292 -330 -175 -17 211 22 -47 182 124 -8 2 -86 -139 -20 261 114 -92 25 -13 246 1 74 21 -224
2947 -224 -108 -132 -164 -279 131 -79 236 197 19 38 149 260 -66 -182 -150 -114 -74 -37 56 -51 -48 49 128 -94
2971 -94 9 69 3 -106 -287 -118 146 103 86 302 54 -67 79 223 -96 -36 -136 -99 109 90 241 -51 13
$$ packed form
2806A64o8o8O7l53J15K04j2J06p2n6K21q2J59m15j99J87N2j6p0m3K11J11o0o5
2830A8jJ00k46%K02k88J07R4J74Q2k79J54K9j16K62n22p1m5K50K17k90L13j85
2853d1L46j39k5m0J11j43l7j20k14J45J97J29l9o8l0K13k07K08m40P2r0K65j85
2876a32j9R1K95l3j16Nk95R5r8P1P4q4P4J58k6J4N9j81K29n3j32j77N6j45L79
2901A09q4O8j66J01K78o7k91K3P0k75J30j32K1J32J50m5J05j18J00j60J13ml50
2924b92l8J55J58K28j89o9K29n8j32J0q8n3J19K81j47k06J17l8K59k45P3n3k45
2947b24J16k4l2j15M10k10L15l9j78J9J11J11l26j16L2L6M0L7R3j07LR7P9k22
2971i4J03O0o6j09j81J69K64m3j7K16k48j21J46J44l19O0j00L7K08j9J51k92O4
$$ plain form
2994 13 175 -76 18 -118 -82 -153 -139 -80 -169 121 99 406 50 167 156 155 47 -60 -102 -217 -121 -123 115 -67 18
3019 18 140 78 62 -84 -225 43 11 -70 146 327 -108 288 138 -36 -37 32 -20 39 0 -69 -186 17 -49 -5 -15
3044 -15 -84 144 124 34 -58 -116 -175 16 44 -104 251 27 285 176 39 109 -68 -64 2 -98 -208 -355 97 260
3068 260 105 13 90 2 242 66 -269 -65 -31 -35 71 297 65 -82 130 -2 64 -90 -111 91 19 1 -174
3091 -174 -206 15 85 197 57 -30 -67 -39 5 -105 15 -238 63 175 4 156 -73 161 193 -7 -245 -117
3113 -117 -27 -17 69 -20 -25 124 155 10 39 1 -81 -33 -252 -230 44 46 -78 166 -80 40 164 12 -37 -88 -20 -105
3139 -105 5 -48 -106 142 -155 231 96 36 -37 -99 -145 58 4 75 55 158 152 114 -75 30 -33 95 -7 -97 -222
3164 -222 -292 -115 -78 74 -99 37 54 7 153 125 -1 -56 -117 -144 -336 -5 25 22 171 254 3 -62 -6 -2 -81 -287
$$ packed form
2994A3J62k51R4j36L6p1J4N9q9K90k2L07l56J17j1jj08j07m2j15R6kK38j82Q5
3019A8J22o2j6j46j41K68l2q1K16J81m35L96j50j74jO9n2N9l9o9j17K03o6M4j0
3044a5o9K28k0r0r2n8n9J91K8j48L55k24K58j09j37P0j77MO6j00j10j47M52J63
3068B60j55r2P7q8K40j76l35K04L4mJ06K26k32j47K12j32O6j54k1K02p2j8j75
3091a74l2K21P0J12j40q7l7K8M4j10J20k53L01J12j71J52k29K34L2k00k38J28
3113a17R0J0Q6q9nJ49L1j45K9l8q2M8k19K2K74Kj24K44k46J20J24j52m9n1O8q5
3139a05J10n3n8K48k97L86j35o0p3o2m6K03n4P1k0J03ol8j89J05o3J28j02r0j25
3164b22p0J77L7J52j73J36J7m7J46k8j26n5o1k7j92L31L0lJ49Q3k51o5N6Mp9k06
$$ plain form
3190 -287 -295 -80 72 -16 69 26 -49 248 -31 -5 -13 70 -107 -58 -180 -13 -77 24 82 34 -122 -35 -120 -74 -134 -152
3216 -152 18 -162 177 -205 -33 43 70 79 57 -19 -100 -17 -35 90 47 -99 -20 334 89 -154 -43 -159 -112 19
3240 19 9 27 -104 27 112 100 23 44 -15 65 -60 -190 -342 -122 178 -44 104 90 199 68 30 86 -140 -122
3264 -122 -56 -8 -113 66 -44 91 142 213 -102 -276 44 128 -87 -59 -30 -59 -10 104 -16 -63 22 72 41 108 -66
3289 -66 -85 -102 -71 65 -34 54 -24 71 119 169 -127 -87 62 104 32 -1 -52 -41 138 183 0 97 23 43 33 -142 144
3316 144 -124 34 188 -26 40 192 84 51 62 -23 -6 86 -83 64 113 12 -16 302 68 36 62 38 40 148
3340 148 -335 54 -51 108 -1 46 -5 46 76 -68 -14 48 -70 90 -147 -133 -165 58 162 -17 135 -18 75
3363 75 0 8 63 -57 -45 72 115 283 41 35 38 170 150 39 -71 95 56 -78 -43 -42 -50 25 226 -39 -188 -104 -160
$$ packed form
3190b87qK15J52q8Q5m3p5K97k79K6qQ3j77M9j22J67o4J01N8m8j56Q7q5M6o0j8
3216a52J70j80L39l82J72P6K7Rk2p6q1Q3j8J25m3j46P9L54k45k43J11j16M7J31
3240A9j0J8j31J31Q5j2p7K1n9Q0j25j30j52K20L00k22J48j4J09j31l8N6k26J8
3264a22O6M8j05J79j10J35N1P1l15j74L20Q4k15K8K9k9M9J14j20m7Q5N0l1O7j74
3289f6j9j7L1J36r9Q8p8R5M8N0k96M0J49M2p2l3n1J1J79M5j83R7p4K0j0j75K86
3316A44k68J58J54k14O6J52j08l3J1q5J7R2j69J47M9j01k8L18k34l2K6k4KJ08
3340A48m83L89j05J59j09M7n1N1L0j44N4O2j18J60k37J4l2K23J04j79J52j53R3
3363G5p5QN5j20J2J17M3J68k42oLJ32k0j11j10J66l9j34L5JqP5K01k65j49Q4n6
$$ plain form
3390 -160 84 -20 -64 -54 -72 -103 81 -114 14 -60 95 54 29 -154 -41 4 5 45 -113 -114 1 -58 7 49 -114
3415 -114 -92 30 -122 -103 19 127 164 31 142 -72 115 -50 -32 -13 -180 -117 39 2 44 143 213 -76 108
3438 108 167 -137 -196 -142 86 31 -109 -76 153 53 174 120 -13 133 -133 -11 61 34 -97 -112 176 28 44
3461 44 239 -19 107 -11 -181 -14 -47 -209 23 -31 15 68 -167 40 117 -149 10 -101 -2 -102 -242 -21
3483 -21 106 23 126 51 226 13 112 -46 -22 -60 38 -30 12 26 114 141 81 45 -179 -289 -22 -70 37 -76 -71 56
3509 56 49 27 4 -60 -122 106 -93 -105 -18 -117 -88 -106 -85 -15 -235 88 -46 -23 -22 -3 -157 37 -2 6 37 -104 16
3536 16 56 -165 -30 -44 30 -221 -130 -188 -82 118 -67 -82 134 -93 146 34 222 -101 -65 -77 -144 177 109 -163
3560 -163 234 71 -9 41 -124 -62 -17 106 -74 -161 2 -131 -24 174 178 -19 -16 -44 -26 -26 -86 37 -27 93 -19
$$ packed form
3390a60K44j04m4J0j8l1J84j95J28p4J55m1k5j83J13M5JM0j58jJ15n9O5M2j63
3415a14K2J22j52J9J22J08L7j33J11k14J87j65J8J9j67O3J56l7M2R9P0k89J84
3438A08N9l04n9N4K28n5j40L3K29j00J21n4j33J46k66J22P2k7j31j5K88j48J6
3461D4J95k58J26j18j70J67l3j62K32n4M6N3k35K07P7k66J59j11R9j00j40K21
3483b1J27q3J03p5J75k13R9j58K4l8R8o8M2J4Q8K7o0l6k24j10K67m8J07j13NJ27
3509E6pk2k3o4o2K28j99j2Q7r9K9j8K1P0k20L23j34K3JJ9j54J94l9QL1j41J20
3536A6M0k21J35j4P4k51R1n8J06K00j85j5K16k27K39j12J88l23L6j2o7L21o8k72
3560a63L97j63q0N0j65O2M5J23j80q7J63j33J07J98Mj97Lk8J8%o0J23o4J20j12
$$ plain form
3585 -19 9 -90 79 95 270 -5 -86 40 105 -163 14 117 16 285 108 227 66 174 49 32 -51 -84 -80 -1
3609 -1 76 75 41 52 20 43 -16 -141 -24 -121 42 28 -9 -184 -63 135 52 -18 -68 -121 -18 27 7 -85 40 -24 134
3636 134 231 10 71 33 169 -138 -49 -113 -65 -103 -15 80 56 274 17 -109 -53 -43 55 -130 23 78 40 30 -75
3661 -75 48 -90 -1 -230 -60 -75 122 71 -102 83 -100 19 125 -143 -195 -77 -126 15 86 -60 -151 -5 92
3684 92 -14 -129 141 -69 122 -45 -81 103 32 0 -61 -82 -92 -34 31 23 -87 -93 115 -12 -156 -112 -27 37 -155
3709 -155 31 -35 160 165 -36 89 28 134 -43 55 -76 -106 13 -84 21 185 -3 14 -76 92 86 -219 -59 -192
3733 -192 -204 -49 52 -71 -77 -85 176 9 76 15 -41 74 -14 -133 28 55 -39 335 1 111 -37 73 51 -71
3757 -71 -41 -23 12 164 172 -28 21 -38 78 11 76 -130 -21 -50 -24 48 117 -101 55 51 -34 72 89 48 52 -159 -76
$$ packed form
3585a9K8r9J69J6J75k75q1J26O5k68J77J03j01K69j77J19j61J08j25j7q3l3MP9
3609aP7jl4J1l2K3n9j25J17r7J63j4l7j75J21J98q3p0n0n3J03M5k0r2J25o4J58
3636A34R7k21O1l8J36l07Q9o4M8l8Q8R5k4K18k57j26N6J0R8j85J53N5l8j0j05
3661g5J23j38Q9k29J70j5J97n1j73J85j83J19J06k68n2J18m9J41P1j46r1J46R7
3684I2j06j15K70k10J91j67l6J84p1l2o1k1j0N8O5qj10oK08j27j44M4Q5O4j92
3709a55J86o6J95Nk01J25o1J06j77R8j31l0J19r7J05J64j88J7r0J68ol05J60j33
3733a92j2J55J01j23oqK61j67O7o1n6J15q8j19J61K7r4L74l34J10j48J10k2j22
3757g1L0J8L5J52Qk00M9n9J16o7O5k06J09k9K6P2O9k18J56mq5J06J7m1Mk11Q3
$$ plain form
3784 -76 17 54 -193 -89 -54 281 177 -43 57 -100 52 44 90 -15 -79 75 150 95 12 -51 -90 -8 48 44 93 -85
3810 -85 179 -74 -49 82 77 161 27 51 -108 -21 -44 -102 144 4 -97 -170 35 -48 25 -85 5 -53 111 -26 -27
3835 -27 109 44 272 -163 23 80 185 113 -73 -100 -20 136 25 64 -57 -42 -139 129 12 11 -11 63 210 -7
3859 -7 -3 -59 -33 6 87 120 -15 -68 191 57 255 -126 50 44 6 105 88 -127 -52 71 63 -128 -55 -32 -28 -29 41 56 81
3888 81 -7 129 -33 -41 -38 148 -68 -20 -75 244 -187 -102 -76 -22 18 -217 36 -9 -39 -169 -72 28 -15 18 35 -16
3914 -16 80 0 95 -100 2 -129 -21 119 -261 -42 -7 -10 -46 -75 165 -27 -175 141 13 -52 11 -8 -72 66
3938 66 2 42 -101 76 -116 150 -19 11 52 -98 -39 60 -77 64 66 141 19 -81 -202 -137 8 -83 -75 -16 68
3963 68 -65 -36 -63 94 -88 115 -63 36 -29 -187 23 224 54 192 144 13 -249 -171 -55 -19 133 34 94
$$ packed form
3784g6R3L7k47J04L5L35j04k20J00j57J52qM6j05o4J54P5n5q3o3l9Q2N6mM9j78
3810h5K64k53K5J31nQ4j34K4j59Q7k3n8K46j40j01p3K05q3P3j10R0n8J64j37j
3835b7J36o5K28m35J86N7J05p2j86k7Q0J56j11L9j21J5r7K68j17jk2P4J47k17
3859gMn6K6L9Q1L3j35n3K59j34J98l81J76ol8R9j7k15P5J23qj91P3K3MjP0J5K5
3888H1q8J36j62qLJ86k16M8n5L19m31Q5K6N4M0k35K53m5l0j30R7J00m3L3J7n1
3914a6R6q0R5j95J02j31J08J40l80K19L5ll6k9K40j92j48L16j28o5O3j9o4J38
3938F6o4M0j43J77j92K66j69L0M1j50N9R9j37J41KP5j22j00j21O5J45r1QN9Q4
3963F8j33K9k7J57j82K03j78R9o5j58K10K01j70J38m8j31k62P8J16L6J52r9O0
$$ plain form
3986 94 -27 6 28 19 33 94 -145 99 -55 89 -33 -125 -250 11 -39 -12 -24 -1 72 -73 165 -41 42 10 -100
4011 -100 49 -13 -156 56 100 -52 -32 171 2 231 82 2 -90 -117 -63 7 4 -122 121 52 -48 -95 -184 62
4035 62 68 -14 -93 187 -187 -31 -75 -76 -50 -32 -131 -18 128 10 -75 -96 46 -87 35 239 -84 -57 -81 91 -9
4060 -9 -5 -26 -91 54 25 -26 -114 143 -112 -66 -53 -99 69 -14 -171 -27 12 11 103 -50 93 180 59 -118 -93 -103 -92
4087 -92 18 73 -45 35 -77 -86 14 -26 37 -98 44 -72 -87 -19 334 9 -78 52 -65 139 44 37 -45 52 91
4112 91 -64 -257 50 151 32 101 5 128 -90 -89 -52 -41 155 23 126 -132 -18 -87 6 -132 80 64 71 -79
4136 -79 -65 -187 21 -34 172 104 -241 75 28 -4 202 -66 -61 50 -57 -99 -26 30 109 -191 21 0 -118 67
4160 67 -177 -78 -101 6 25 18 81 131 -136 67 -62 -64 -109 10 -33 6 -69 -162 -10 84 16 -132 91 177 -61 74
$$ packed form
3986I4j21L3K2rJ4O1k39K44j54J44j22r2j25K61n0K7j2K3P3j45K38k06Q3l2j10
4011a00J49o2j43K12M4j52K0K03j69K29j49q0r2k7N4P0lj26K43o9j00m7q9K46
4035F2Oq2p9K80l74J56m4jK6J8r9J13J46j18q5k1J42j33J22K04l23K7k4J72j00
4060iMk1o5J45k9n1q8K57k55M6J3m6J68q3j57J44L9jR2j53J43Q7j21j77K5j0J1
4087i2J10N5j18Q0j12rJ00m0O3j35J42j16j5O8L53l25q7J30j17K04r5pq2R7L9
4112I1j55j93L07J01j19O9r6J23k18JL7J1J96j32J03k58J14o9R3j38K12j6Pj50
4136g9J4j22K08n5K06o8l45L16m7l2K06k68NJ11j07m2P3N6P9l00K12k1j18J85
4160F7k44R9k3J07J9pO3N0k67K03j29km5J19m3L9p5r3J52R4o8j48K23Q6k38J35
$$ plain form
4186 74 79 12 -12 -145 16 110 35 -83 92 -89 -99 -32 -131 -74 -189 -224 11 -155 77 -63 31 36 -15 -25 35 -91
4212 -91 8 -30 7 9 -101 -79 -38 -97 39 187 52 15 -20 -213 -51 -89 114 -1 -63 -40 -58 173 42 -155 63
4237 63 58 -173 30 -41 87 155 -8 41 -105 -16 147 -124 28 14 -24 64 -177 108 -44 122 11 185 15
4260 15 -137 94 -49 74 -90 -23 -69 8 114 -91 -41 52 -105 -14 -80 61 42 105 84 97 105 148 -53 3 76 17
4286 17 -111 -231 -60 -68 -36 50 121 -36 -3 24 116 12 43 -120 -60 61 -167 106 -81 96 -42 -76 183 -94
4310 -94 110 -142 42 33 39 -27 3 91 133 5 62 -56 36 119 114 -53 -92 -149 72 -19 -17 -123 -66 78 42 -24 54 43
4338 43 116 18 80 32 52 -75 22 17 238 -23 64 167 -82 -48 -115 -25 -6 -61 -75 46 70 191 -78 7 34 -23 42
4365 42 -100 -24 51 154 99 -105 45 -91 18 95 -174 63 -104 -41 -163 23 -41 -56 20 -3 124 2 -72 -46
$$ packed form
4186G4No7k4j33J61R4p5j18J75j81j0O7r9N7j15l5K35j66K32j40R4Nn1j0O0j26
4212i1R9l8L7Kj10K2M1n9J36J48j35l7l5j93J62l8K03j15o2K3j8K31j31j97K18
4237F3nk31K03p1J28O8j63M9j46Q9J63k71J52j4l8Q8k41K85j52J66j11J74j70
4260A5j52K31j43J23j64O7m6P7J06k05N0R3j57R1o6J41j9O3k1J3QM3k01N6P3n9
4286A7j28j20J71qL2Q6P1j57L3K7R2j04L1j63O0J21k28K73j87J77j38l4K59k77
4310i4K04k52J84rOo6L0Q8M2j28N7j18R2Q3nj67l9n7K21r1Kj06N7J44l6o6P8j1
4338D3P3r8O2m8K0j27R7nK21k61Q7J03k49L4o7R0J9n5j4J21K4J21k69Q5K7n7O5
4365D2j42P6P5J03n5k04J50j36J09P7k69K37j67O3j22J86o4j5P6k3J27j22p4K6
$$ plain form
4389 -46 -12 6 -95 -21 -77 -113 18 142 53 32 47 -35 103 -130 16 -4 37 62 196 112 -36 234 13 113 -33
4414 -33 -97 -19 44 58 28 -36 -14 -71 67 11 0 -132 82 -17 -81 -56 3 152 163 252 -98 19 -190 -47 -123 -62
4440 -62 -15 35 -28 93 113 45 146 44 62 93 -98 -102 -131 -43 -41 133 89 -199 29 -120 -134 -75 -120 -119 176 75 -94
4467 -94 -24 5 29 -28 50 17 70 -16 50 -28 -9 72 -79 78 24 167 -65 1 55 -135 51 -19 -21 -154 -40 -177
4493 -177 124 130 49 80 9 -128 -82 -46 -25 -140 -85 -65 -52 -34 186 45 -85 2 -41 -56 -207 13 -12 -94 -168 -127
4519 -127 -9 -32 82 -4 -68 53 38 -184 -52 -46 -18 113 123 -150 -27 3 -63 166 -1 -8 -238 -26 -51 12 21
4544 21 12 36 104 59 46 -91 135 -238 -32 -91 -43 31 -130 14 86 -94 -42 -139 175 -7 -74 -121 -194 -21 -110 -38
4570 -38 43 31 186 -129 -78 156 -109 78 -67 54 55 95 -70 -138 -20 20 -56 -175 -10 6 -43 106 45 -130
$$ packed form
4389d6L4J8j01P4n6l6J31J24q9k1J5q2J38k33J46k0M1K5J34q4j48K70k21J00j46
4414c3o4P8O3J4l0o4K2n7J38n6j1j32K14r9o4K5N9J49J1Q9l50J17k09J43p6O1
4440f2M7N0o3J21K0o8J01j02J8L1j91mk9Q8KJ74m4k88K28j49j4N9m5JK95j01j69
4467i4P0K9K4n7P8l3N3q6O6p8J9Q1j51J57n4J43k32O6N4j90J86p0kj33J14j37
4493a77L01Oq1L1p1j37M6L6K1j15N5K0J3J8K20j41j30Q7m3j5j51K20k5q2p4M1
4519a27J18k3J14q6o4J21j5k22J32OK8J31J0k73J23L0o6K29j67pk30K12k5O3R
4544B1rK4O8m5j3j37K26l73K06n9M8P4j61J44P2j80N2r7L14j82o7m7p3J73q9P2
4570c8Q1j2J55l15N1K34k65J87j45J21JM0j65o8J18M0p6j19J65J6m9J49o1j75
$$ plain form
4594 -130 46 86 -110 -57 -7 -121 114 -27 -52 -30 -36 4 -193 133 40 -67 15 130 263 -147 30 -115 55
4617 55 -103 -30 68 80 103 -13 -12 -90 86 -45 33 41 -24 86 -255 90 25 -16 46 95 -24 -109 -63 -27 -33 -5 -39 -22
4645 -22 92 -135 43 -72 19 -77 -145 -76 -43 13 43 -31 170 -26 -179 -37 121 6 -16 -181 -122 20 20 83 27
4670 27 -75 -36 116 -30 -131 -39 -105 190 -148 -23 35 45 78 -63 170 -48 -5 5 60 -27 82 69 29 46 1
4695 1 -17 -133 17 -42 -93 34 16 -77 -51 69 -109 14 128 -214 -18 133 56 1 97 98 93 58 -201 71 18 45
4721 45 -97 -40 -105 -70 48 37 -221 14 -40 -10 -61 139 87 149 4 -54 -28 35 -18 -143 199 78 14 139 -84
4746 -84 90 29 -118 158 40 2 55 -114 -96 189 -128 35 10 116 35 -98 -57 -39 -53 -4 5 46 -45 87 115
4771 115 20 -81 -14 -61 -140 -3 41 -101 88 103 -41 -63 27 189 131 26 83 47 -114 -83 -14 145 17 65 -10
$$ packed form
4594a30J76M0j96N3N0j14K35j41k5K2oM0j97L26r3j07Q2J15J33m10J77j45J70
4617E5j58P3R8J2K3j16Jp8J76j31P8Qo5J10l41L45o5m1O2M9j19q5M6L6oK8l4J7
4645b2J14k27J78j15R1r6o8O9L3N6L0p4K01j96j53J42J58j15k2j65N9J42%O3n6
4670B7j02L9J52j46j01R2o6K95l38J25N8J0L3j41K33k18M3J0N5q7J09j3m0J7m5
4695Aj8j16J50n9n1J27j8r3K6J20j78J23J14l42J96J51p7n5R6Jnl5k59K72n3K7
4721D5j42N7o5L5J18j1k58K35n4L0n1K00n2O2j45n8K6O3n3j25L42j21o4J25k23
4746h4J74o1j47K76j18l8N3j69J8K85l17J63k5J06q1j33M1J8j4M9RM1r1J32K8
4771A15r5j01O7m7p9J37M4j42J89J5j44k2R0J62n8j05N7l6j61L1O9J59j28M8p5
$$ plain form
4796 -10 -139 11 105 92 115 -1 -91 151 -25 -201 -174 28 92 -36 -5 151 93 -18 -69 82 -77 -77 90 -8
4820 -8 -116 -64 175 -26 -38 61 -16 -41 -84 -43 -35 41 -8 -178 107 78 -99 186 -116 19 46 122 80 64 -73 7
4846 7 -53 55 196 -91 15 -203 -56 26 47 37 180 46 -256 -48 -114 134 73 34 69 54 -167 -10 104 124
4870 124 135 -344 42 -137 6 55 93 -66 48 -162 8 31 1 -26 55 124 133 -82 67 26 -212 224 -71 88
4894 88 -64 180 -218 -37 -27 132 -63 86 88 34 56 70 27 -36 149 231 8 -45 132 -20 -57 -116 82 -9 -110
4919 -110 24 56 15 211 83 -32 43 -132 -44 80 -163 122 50 -28 -77 0 -125 -183 25 112 -27 -14 82 80 9
4944 9 -28 -153 125 4 1 6 -110 -92 101 22 -119 -51 -83 -64 -9 -100 104 5 -177 39 14 -70 166 67 77 45 74
4971 74 -155 143 -74 2 -70 96 -122 91 -26 -86 -38 38 117 -19 18 -106 108 -102 -70 49 56 -67 -229 -36
$$ packed form
4796a0j29J50R4j3K3j16r0K42j76j76K7K02O4j28L1J56n8j11n1J51j59%J67r8
4820hj08N2K39k01j2R9p7k5m3M1QP6m9j70K85k9j77K85l02J35K7P6m2j6j37Q0
4846Go0J08J41k87J06k18J47Q2K1j0J43j34l02K08o6K48o1l9L5j5k21J57J14K0
4870A24J1m79L86j79J43M9L8j59J14k10J70K3l0k7Q1O9Rk15J49m1k38M36k95J59
4894H8j52K44l98J81J0J59j95J49Kn4K2J4m3o3J85Q2k23n3J77j52l7n9J98r1j01
4919a10J34L2m1J96j28j15P5j75Q8J24k43K85p2p8m9P7j25n8K08Q7j39J3R6kp1
4944Il7j25K78j21lNj16J8J93p9j41O8l2J9N5r1K04r9j82K16k5q4K36r9J0l2K9
4971G4k29K98k17P6p2J66k18K13j17o0M8P6P9j36L7j24K14k10L2J19Pj23j62J93
$$ plain form
4995 -36 41 23 50 -93 -89 -7 89 -27 -86 43 -34 -100 0 136 95 37 30 31 -135 42 -26 -22 60 -210 35 210 -125
5022 -125 61 -131 83 -75 27 87 -8 -21 17 152 25 96 -157 46 -92 -46 -24 68 -81 17 6 126 19
5045 19 63 174 144 32 -7 61 104 78 -7 -119 135 -86 92 -16 -93 -35 -179 -154 110 166 18 -40 -39 71 -112
5070 -112 -5 26 -131 -14 -176 57 -46 -38 -68 108 -70 -12 -16 11 77 -73 128 33 113 -5 70 111 -40 -69 -28
5095 -28 34 -157 14 21 39 28 -30 -80 -39 -60 -187 -129 20 -141 -135 -4 125 -283 -97 -7 140 50 -208 -9 -76
5120 -76 18 -98 -49 153 -98 -132 31 43 -68 -9 17 152 -52 -38 -161 -15 -78 -35 144 -206 130 -119 125
5143 125 -10 -139 212 49 -54 -44 10 -92 113 16 -41 -39 46 -26 90 -88 -105 59 -96 22 -15 12 8 81 -14
5168 -14 29 33 117 4 -11 7 -41 -20 -80 -156 85 76 -64 -105 85 -94 164 -157 -203 -1 30 -123 -94 35 -8 -66
$$ packed form
4995c6P7j8K7j43MQ2R6j16n9J29p7o6J00J36m1n8pJj66J77o8MQ2k70K45J75l35
5022a25J86j92K14j58J02O0r5j3L8J35j27P1k53K03j38M6K2R2j49R8j1J20j07
5045A9M4J11l0j12l9O8M3k6q5j12K54k21J78j08p7N8j44K5K64N6j48n8JJ10j83
5070a12J07L1j57J17j62K33j03Ql0J76j78N8mK7O6j50K01r5Q0j18P5M1j51k9M1
5095b8O2j91J71PJ8j1n8n0M1k1j27N8J49j61OJ31J29m08J86R0J47r0k58J99o7
5120g6R4j16M9K02k51l4J63J2j11N9K6J35k04J4j23J46o3M3J79l50L36k49K44
5143A25j35j29L51j63j03J0N4j02K05r7n7KQ5p2J16j78j7J64j55J18l7K7mP3r5
5168a4M3MQ4j13j5J8m8K1o0p6K41rj40m1J90j79K58l21m6K02L1j53K9J29m3n8
$$ plain form
5194 -66 -66 -102 -227 -110 -106 -31 -39 42 -78 -38 -57 23 -40 125 -7 74 -61 -14 -2 10 -9 -78 121 -144 -19 150 -14
5221 -14 -74 -227 -1 140 219 52 -65 -44 -11 51 -40 31 51 56 -89 59 40 -89 -63 -73 -47 12 -40 68 7 104
5247 104 -66 -134 149 41 -32 -142 -120 115 4 23 10 -111 22 -53 68 109 -86 -25 -177 138 -24 -26 -96 -75
5271 -75 50 -13 -12 141 49 -10 -54 -101 14 36 172 -20 -182 -118 56 -42 23 -11 -62 -3 26 116 -14 75 65 -80
5297 -80 104 75 -48 -62 -31 -35 -56 11 -60 -26 -2 -72 -125 82 -76 16 28 -163 55 -79 -55 116 69 104 -52 -39
5323 -39 -166 1 -90 -176 -136 55 78 -119 75 57 -138 15 116 142 73 -34 -135 -52 67 238 -12 -45 233
5346 233 88 -49 5 -24 -253 -66 -61 38 69 17 72 44 -12 28 51 7 -95 -10 -1 -65 -21 16 86 162 -201 34 39 -108
5374 -108 100 -20 126 -133 -10 70 36 107 -2 92 -51 30 -99 -23 71 -99 -58 -30 -18 94 -20 49 -32 -63
$$ packed form
5194f6%l6j25J17MP5qQ1j20M0j9Q0o3J65j32Q1j35M7J2J2j9o9J99k65J25J69j64
5221a4o0j53K26J41P9j67j17K1L3O2r1P1K0Nj45J48j9j29K6j0K6N9n2J08o1R7
5247A04j70o8K83j08p3j10K2K35j11J9j3j21J33p5J21M1j95O1j52L15j62kp0K1
5271g5J25o3JJ53r2n9m4m7J15K2J36j92j62O4J74r8O5l4n1N9K9R0j30Q9j0j45
5297h0J84k9j23j4L1mk1O7p1L4K4p0n3K07j58R2J2j91K18j34K4J71m7L5j56J3
5323c9j27J67r1q6M0J91K3j97J94j8j95J53J01K6o9j07j01Q3J19J71k50l3K78
5346B33j45j37N4k9k29J87NR9L1n2N5k8n6M0K3m4j02Q5Ro4M4L7P0P6l63K35Nj47
5374a08K08j20J46k59J23Q0l4P1j09R4j43Q1j29P6R4j70M1K8J2J12j14O9q1l1
$$ plain form
5398 -63 118 28 -57 -9 48 138 -91 -26 73 70 107 100 1 -12 -77 -17 -143 -27 -55 57 21 -60 39 41 33 22 24 40 36 -12 81
5429 81 -111 -36 14 188 8 93 -44 -2 46 -26 22 -22 72 64 263 -67 -125 -138 -65 133 -97 145 68 78 -172 -42
5455 -42 39 2 -145 50 133 -143 -113 -3 -41 32 -2 -165 28 -245 -82 93 -67 -68 -65 -3 61 -36 16 78 -71 -48
5481 -48 183 -67 43 59 43 -39 206 26 86 -137 76 -121 -73 -71 1 -29 -22 70 108 71 -192 -47 33 42 -25 -31 29
5508 29 -143 -167 -15 123 64 -43 35 -4 -102 -129 -16 -178 96 -16 74 30 -65 -66 27 127 -16 251 -28 22 71
5533 71 81 -182 48 -29 -192 83 112 28 -78 -10 177 -83 42 -104 82 -259 -87 -140 32 190 47 27 -55
5556 -55 -22 20 -33 92 -81 65 16 31 155 63 16 -27 16 -62 -25 -61 -88 -51 -36 -16 50 1 -34 -42 -54 -31 -45 -226
5584 -226 -56 106 -65 -58 -23 -33 -109 56 10 40 -41 -19 14 -1 83 112 -54 -30 -107 4 120 4 -75 -123 149 73
$$ packed form
5398f3J81r0q5M8N7R0k29O5R9lL7pr9j3o5O0j26J16k8J12l6q1R9Kqj1KJ6mm8R3
5429H1j92P5N0J74j80Q5j37M2M8p2M8m4R4qJ99l30n8j3P3J98k30K42p7J0k50J30
5455d2Q1l7j47J95Q3k76L0J10l8P3l4j63J93k73J63J75j60jLO2O4r7N2O2j49K3
5481d8K31k50J10J6j6q2K45j80O0k23K13j97M8KP2l0PR2L8l7k63J45Q0Ro7oO0
5508B9j72k4J52J38n9j07P8l9r8k7J13j62K74j12R0m4r5jR3J00j43K67k79N0M9
5533G1J0k63K30p7j63K75K9q4j06O8J87k60J25j46J86l41J72n3J72J58j43k0q2
5556e5L3M2n3J25j73J46m9J5J24r2m7m3M3p8L7l6k7L7J5K0O6m9l5qj2K3j4j81
5584b26J70J62j71PL5j0p6J65m6L0q1K2L3j5Q4K9j66K4p7J11J16j16p9m8K72p6
$$ plain form
5610 73 145 84 93 -1 -103 49 84 132 7 137 -126 -63 31 81 -155 -34 -99 -118 133 17 -28 139 87 -74 -26
5635 -26 121 -176 -257 107 -106 53 -52 45 -20 14 -65 -6 59 113 55 -39 -88 14 -71 -159 -4 -12 -38 220 -108 -41
5661 -41 -244 144 -63 -54 -30 -157 -36 24 106 32 -91 118 -7 -91 10 -15 15 -66 54 100 -47 97 -189 41
5685 41 -79 10 -25 59 141 99 1 13 -55 0 75 -53 -103 107 -117 -39 193 87 109 -97 -97 41 60 75 -31 23
5711 23 -43 61 -158 123 56 -46 112 167 55 176 140 -41 -125 -33 -50 -121 -227 71 33 -106 22 -38 174 -3
5735 -3 91 117 42 6 6 -109 70 -93 75 21 -93 -7 -188 68 -43 -133 -125 -78 -2 -57 -135 -54 1 -20 -85 108 114 -101
5763 -101 -3 -74 13 -140 51 85 88 -102 -72 159 104 132 192 -79 -42 -25 107 58 -61 -107 -77 -135 -34 111 -169
5788 -169 79 -10 -9 27 61 -151 -29 -98 -40 -4 -15 5 -31 73 -42 -42 66 188 12 -44 -46 -41 -79 -68 90 91 -13
$$ packed form
5610G3P2o1Rr4j02J52L5M8j25J30k63O3R4N0k36J21o5j9K51j16m5J67n2j61M8
5635b6J47k97q1L64k13J59j05R7o5L4p9N9O5N4n8r4m9J02q5q8J55qk6K58l28O7
5661d1k03L88k07RK4j27J21O0Q2p4j23K09j25q4J01k5L0q1J20M6j47J44k86K30
5685D1j20Q9l5Q4Q2m2r8J2o8N5P5j28n0K10k24P8K32j06K2k06%J38J9J5j06N4
5711B3o6J04k19K81o7j02J58N5j12J21l6j81q4R2j7p1j06K98l8j39J28o0K12j77
5735cR4K6p5l6%j15J79j63J68n4j14Q6j81K56j11r0QM7P6n5p8Q1N5k1o5J93Ok15
5763a01R8p1Q7j53J91L4Lj90L0K31n5K8O0k71L7J7J32m9j19m6L0n8J01J45k80
5788a69K48q9JL6L4k12J22o9N8L6j1K0l6J04j15%J08J22j76n6kNl8J1J58Jj04
$$ plain form
5815 -13 94 -76 -30 -100 -167 133 179 207 27 94 225 18 53 -6 59 -4 -66 168 -189 -197 -69 -189 -101 97 -138
5840 -138 -187 121 -128 32 78 -57 116 37 137 -87 119 217 -156 -179 -14 -50 123 70 -32 -31 -45 -37 71 -15
5864 -15 -30 176 -82 -145 -161 -34 59 -79 40 -194 -134 -104 16 155 143 94 61 87 -65 -99 18 -8 74 59 -17
5889 -17 110 -21 -165 3 90 108 -41 -154 180 51 33 136 -98 94 36 35 73 35 -36 -146 14 69 -22 -19 -144
5914 -144 -43 -16 17 16 -33 -51 -85 77 -20 -9 133 -45 20 -200 67 73 -51 -119 77 24 49 -158 -17 35 -69
5939 -69 36 -50 -60 27 103 -75 -20 92 156 44 66 78 -31 -42 130 23 49 -18 70 -85 -7 116 48 22 11 -119
5965 -119 42 -93 -59 -103 -15 142 -97 -213 -155 163 -191 -29 11 57 -26 -4 -137 -8 -20 -36 68 -25 168 127
5989 127 -3 70 96 40 -107 -17 93 124 35 66 29 -54 -46 -98 -18 -120 18 31 -77 130 65 -267 129 -9 54
$$ packed form
5815a3J07j70M6p0o7L00M6K8j80O7J31k07L5n9O5o3o2K34l57qJ28j20Q8J98k35
5840a38m9L08k49J60M6j35J73p9J00k24K06R8l73k3J65l6J73n3j02Jj4QJ08q6
5864a5j5K06k58o3j6J27R3j38J19k34O0L0J20J39j2m9l3K6j52l4J17k6Q2j5p6
5889a7J27j31j44J68Q7J8j49j13L34j29j8J03k34J92n8jL8l8p1j10J60N5r1Lj25
5914a44J01K7L3jm9j8l4J62r7J1J42j78O5k20K67Oj24o8J96n3K5k07J41N2j04
5939f9J05q6j0Q7P6j78N5J12O4j12K2J2j09j1J72j07K6o7Q8j55P8J23o8k6j1j30
5965a19J61j35L4m4Q8J57k39j16N8L18l54J62M0M6q3K2j33J29j2j6J04r3J93m1
5989A27j30P3K6n6j47R0J10L1q9L1l7q3Qn2Q0j02J38J3j08K07o5l32L96j38O3
$$ plain form
6014 54 163 -38 -41 -76 -17 -111 28 -128 222 90 -56 103 76 72 72 44 103 -48 50 73 105 15 -26 9 80 65 43
6041 43 -36 75 20 47 171 105 6 137 -81 98 75 49 -27 -51 92 -30 154 -61 -16 126 63 87 175 35 -60
6066 -60 -38 -122 70 -24 -2 -44 -6 85 24 -106 -132 -28 92 -35 64 154 65 -106 -77 109 98 31 -37 76 96 -130
6092 -130 -4 23 -88 -82 -35 -144 131 141 101 -13 -53 55 23 60 -171 -2 81 22 15 -43 63 -4 36 -68 182
6117 182 -16 101 97 42 -155 -98 -97 -49 87 -8 21 36 75 -13 -99 250 162 53 -82 -91 177 -24 -35 2 -60 151
6143 151 -103 -125 28 3 47 153 -27 -278 -131 101 141 77 -93 126 -50 -13 9 -29 -139 -63 -50 197 112 -1
6167 -1 -43 67 85 -99 -170 -55 150 -143 22 -50 -143 97 231 -191 -230 -137 123 -82 45 -43 -34 -24 132 13
6191 13 72 45 -14 111 -167 61 -43 16 2 78 13 -21 -172 80 -91 11 132 66 131 -1 -99 78 31 -25 35
$$ packed form
6014E4J09k01ll5N9r4J39j56L50j32j46J59k7m%k8N9j51R8K3L2r0m1L5P1j5k2
6041D3p9J11n5K7J24o6r9J31k18J79k3k6p6k4J43j22J84k15M5J42o3K4Q8j40r5
6066f0K2q4J92r4K2m2L8R1o1j30k6J04J20j27R9R0q9j71K9J86j1o7o8J13K0k26
6092a30J26K7j11OM7j09K75J0m0j14m0J08l2L7k31J69Q3n9pn8J06o7M0j04K50
6117A82j98J17mn5j97N7JM8J36r5K9J5L9q8q6L49q8j09j35rK68k01j1L7o2K11
6143A51k54k2J53k5M4J06j80k51J47K32M0o4j70K19j76L7K2l8j10P6J3K47q5j13
6167am2J10J8j84p1J15K05k93J65p2r3K40J34m22l9R3K60k05J27q8RJ0J56j19
6191A3N9k7n9J25k78K28j04N9j4P6o5l4j51K52j71J02J21o6O5j32r8J77m7n6O0
$$ plain form
6216 35 -25 133 -4 -77 131 125 -5 87 87 -47 -14 -38 -72 -68 121 131 8 117 -95 -87 -1 -26 36 -67 -5 50 93
6243 93 60 41 -27 112 32 -239 -5 92 54 31 4 2 32 36 109 -124 -93 26 17 -48 60 52 161 133 96 98 -57 59
6271 59 4 -18 -117 37 -173 70 -169 -140 -73 53 -107 79 129 107 -8 -42 14 -43 60 -139 -78 93 -26 -50
6295 -50 59 143 131 -13 20 -124 -46 -17 -130 106 -73 55 -109 -61 71 215 73 -97 83 -3 -12 -120 -50 115
6319 115 -155 62 -120 181 93 43 8 -11 -49 178 -6 147 -102 75 17 -59 17 54 -107 -288 20 197 96
6342 96 -114 91 -178 8 153 5 -119 40 -15 149 99 155 -107 29 -100 37 -139 -88 -31 -47 26 13 -146
6365 -146 -201 36 -89 15 48 89 -17 100 53 14 162 -70 -52 -1 -122 79 45 -151 -101 52 45 -16 -6 -33 -112
6390 -112 -101 9 -101 11 136 43 -112 100 16 5 -16 -28 -98 37 -28 5 -51 6 89 173 -41 49 -256 -60 212
$$ packed form
6216C5o0J58j37p3K08oj30R2%j34L3k4l4MJ89J0j23J09k12QQ6k5O2j03O2N5M3
6243I3l3j9o8J39q0k71K34R7l8k3k7kL0MP3k33L1J19ro5J08qJ09k8l7Kj55J16
6271E9n5k2r9J54k10K43k39K9O7J26j60J86N0k2j15l4N6n7J03j99O1J71j19k4
6295e0J09Q4j2j44L3j44P8K9j13K36j79J28j64M8J32J44j42j70J80q6rj08P0J65
6319A15k70K17j82L01q8n0l5j9l8K27j84J53k49J77n8p6P6L7j61j81L08J77j01
6342I6k10K05k69J86J45j48j24J59n5J64n0N6k62J36j29J37j76N1N7j6P3j3j59
6365a46n5K37j25J04L3M1j06J17m7l9J48k32J8N1j21K01l4j96N0J53po1J0k7p9
6390a12J1J10j10J12J25r3j55K12q4j1k1j2p0J35o5L3n6N7Q3Q4k14R0l05J96K72
$$ plain form
6415 212 -2 40 43 11 107 106 175 -47 14 -63 10 92 19 1 79 -53 -5 -106 0 -174 8 -163 -47 5 -55 -81
6441 -81 13 -64 132 117 -19 -121 -90 35 -46 -151 -371 3 115 -79 -24 149 10 -27 -3 64 37 -40 -6 -7 154
6466 154 61 25 53 -25 39 -82 102 -78 -124 -19 99 -71 -203 -76 -152 -75 -70 4 6 -134 70 30 67 -84 -15
6491 -15 -18 -157 -118 38 30 19 -52 21 -43 -137 -49 -38 23 22 88 184 -79 -15 20 147 69 6 -203 121 -144 40 18 -221
6519 -221 -84 -57 -92 -4 200 83 101 131 -59 89 -35 -138 -74 -25 136 -96 8 142 39 119 -31 -2 -89
6542 -89 -87 -60 -47 -46 136 -145 -12 -65 16 49 52 45 -25 -1 37 54 -15 59 -100 -67 -25 72 193 -39 85 110 128 -247
6570 -247 -44 -93 23 96 -13 -68 -26 -39 -56 174 -148 -118 69 144 -10 94 -95 -30 38 -15 7 86 -40 32 96
6595 96 20 111 160 163 43 28 198 111 -53 137 -66 -26 151 -32 -110 64 -137 -25 -17 28 22 7 -108 -62 125 -76
$$ packed form
6415B12k14M2Ll2R6jO9k22O1p7P3Q2p3j8P8j32M8j01J06j74J82j71J16N2o0k6
6441h1R4p7J96j5j36j02L1J25q1j05k20L74J12j94N5J73j39l7K4O7k7p7L4jJ61
6466A54r3l6K8p8O4j21J84j80m6J05J18j70j32J27p6P7NP4Kj40K04m0L7j51O9
6491a5lj39L9J56qj1p1P3o4r4Q8J1O1jO6R6k63O4L5J27p8o3k09L24k65J84k2k39
6519b21J37K7l5Q8K04j17J8L0j90J48j24j03O4M9J61k32J04J34j03Q0j50K9q7
6542h9KK7J3JJ82k81J33n3Q1L3Lpp0K4L8J7o9P4j59L3M2R7J21k32J24K5J8l75
6570b47K03m9J16P3j09n5M2j3j7K30l22L0J87P5j54J04j89O5O8n3K2P9j26P2O4
6595I6p6R1M9Lj20j5J70q7j64J90k03M0J77j83p8J74k01J12QM5oj5j15M6J87k01
$$ plain form
6621 -76 80 13 -59 189 81 -63 -43 25 -41 31 -111 -242 21 0 4 245 10 179 -44 -60 -59 104 -4 -32 -3
6646 -3 56 68 95 10 -27 -164 -16 -15 -41 -56 1 -17 82 -120 -18 84 82 -97 -160 -54 54 -43 187 45 -56 -10
6672 -10 -39 76 -51 -138 54 -10 21 168 112 -207 149 -116 99 39 89 9 35 8 -31 -51 214 83 -123 22
6696 22 89 165 -47 -32 82 -151 -26 -40 108 79 -21 118 -205 115 -91 131 77 44 -13 132 167 2 -194
6719 -194 -18 29 -28 89 117 -126 57 -29 93 -115 61 30 64 -30 -42 37 89 16 -103 28 80 3 135 39 -24
6744 -24 -122 -41 -130 39 49 192 -31 -84 -34 -128 -71 -132 40 79 -47 -65 21 -103 40 -54 87 42 217 -72 -80 27
6770 27 16 -1 -16 26 -70 80 43 26 -13 78 -27 178 35 -49 65 -177 -9 52 26 132 -137 92 38 -5 106
6795 106 -47 -149 -181 19 -5 -80 4 37 -42 174 -145 -12 -20 -149 -95 -71 214 74 85 -142 120 97 -83 32
$$ packed form
6621g6J56o7p2K48j08j44K0O8o6P2j42j31K63k1MK41k35J69k23j6JJ63j08k8K9
6646cN9J2K7q5l7j37J48Jk6j5N7j8R9k02J02J02kj79o3J06J08r7K30j42j01M6
6672a0k9J15j27q7J92o4L1J47n6l19L56k65K15o0N0q0K6k7l9k0K65j31k06J45
6696B2O7P6k12J5J14k33J25j4J48k9j00J39l23L20k06K22n4l3n7J45L5j65j96
6719a94J76M7n7J17K8k43J83q6J22k08J76l1L4r4j2P9N2p3j19J31N2p7J32r6o3
6744b4r8Q1q9J69J0J43k23n3N0r4N7o1J72L9j26j8Q6j24J43r4J41m5J75k89qJ07
6770B7j1j7j5M2r6J50l7j7l9R1j05K05j43q4J14k42J68O1k6J06k69K29n4m3J11
6795A06j53j02l2K00k4p5Q4L3p9K16l19J33qj29N4K4K85j40J1k27K62k3j80J15
$$ plain form
6819 32 -62 -61 -25 -45 -134 -85 -153 -33 50 3 -93 -89 113 98 -94 -127 116 129 -19 -352 117 40 114 23 94 11 -176
6846 -176 -11 145 164 132 26 11 -47 -82 91 120 -28 -12 -133 -23 115 73 -292 3 -41 65 101 -40 7 6
6870 6 33 -39 -117 -23 -124 -18 94 66 -38 38 83 -138 37 -60 58 88 42 -180 -44 -57 -92 36 -15 -164 80
6895 80 75 -2 12 37 62 103 60 214 -74 -22 -46 -77 96 136 -159 -3 -164 -118 102 -73 -32 -166 -31 110 -34
6920 -34 -306 49 -21 -171 11 63 25 36 -49 101 -15 -90 44 33 171 -157 56 -27 -88 -62 78 61 -7 -21 79
6945 79 -33 96 203 114 -9 90 -60 17 80 -75 -173 66 19 67 126 -69 -14 -110 32 -14 4 -146 144 -91
6969 -91 7 105 55 76 -135 -12 89 44 22 -172 136 -26 -82 13 159 78 156 131 -101 28 62 -193 -7 97
6993 97 -61 -128 207 43 -84 14 -148 -54 -122 -161 -92 -127 -16 112 -132 56 94 81 104 -31 -81 63 -209 3
$$ packed form
6819C2r4JL6k0q9M9o8J20Q3m7r6MK02j5j92l3K43J3j48l33M69p7P4r1P1q3j87
6846a76J65J56J9l2j06j5n8l5J73K9j48J6j21J10J38m2l65K95m4J06L6j41M7j
6870FK7p2p8R4j01J06J12k8j04P6M5k21J75r7J18L0m6k22J36j3l5J28n1j49K44
6895H0np7J4K5K5M1m3J54k88N2k4l1J73M0k95J56j61M6K20j75M1j34J35J41j44
6920c4k72L55p0j50J82N2l8J1q5J50j16p5J34j1J38l28K13q3o1K6J40j7o8j4J00
6945G9j12J29J07q9j23R9j50P7O3j55r8K39m7M8N9j95N5r6J42m6J8j50K90k35
6969i1R8R8n0K1k11J23J01m5k2j94L08j62n6R5J46q1P8k5k32J29L4k55J86J04
6993I7j58o7L35j64j27R8j62R4o8l9O9l5J11J28k44J88L8j3K3j35n0J44k72K12
$$ plain form
7017 3 133 -75 16 -5 -75 26 11 131 -57 179 -40 159 43 -22 -157 -71 168 -93 102 -71 -31 -144 -19
7040 -19 78 167 -153 -107 -62 130 30 28 -38 -37 37 -166 -75 -124 -82 -58 -14 120 153 -77 -1 -98 21 13 -59 -38 -46 -205
7068 -205 -32 87 33 -37 -135 65 36 -224 16 162 5 -50 70 -93 31 58 6 45 98 22 137 -10 116
7091 116 -80 62 -74 -93 130 95 -65 -33 -10 88 -106 213 92 18 140 108 102 -56 155 178 -88 -54 39 78
7115 78 103 -79 127 -126 156 -25 15 -92 -67 -86 -89 -2 -211 -44 -188 1 -10 49 76 -106 41 136 -128 49
7139 49 6 48 147 10 46 15 110 65 18 15 -24 11 78 -189 24 -44 -78 -152 -20 71 -62 -59 112 -21 -49 -6 -97 126
7167 126 -50 39 16 137 -157 81 41 34 -56 -12 71 85 -220 1 -98 15 -46 154 -82 -192 79 -153 110 64
7191 64 -47 -22 -175 -31 15 -211 -1 87 27 14 -35 18 -143 106 -123 4 55 -66 163 -1 -151 70 50
$$ packed form
7017CJ30k08R1k1p0J01j5J20j88K36k19J99j16o5j35Q6K39k61J95j73M0j13J25
7040a9R7Q9l20M6M5J92j00ko6JP4k03R1m9M2K4M4J34L3k30P6r7J19qp2K1qj59
7068b05J73J19n4p0r8K00k9k60K40J46j57n5J20j63J24K7n2L9N3p6J15j47J26
7091A16j96J42j36j9K23l5j60L2K3R8j94L19j21p4J22l2oj58K11K3k66L4R3L9
7115G8K5j82K06k53K82j81M0j07K5j9lQ7k09J67j44J89j1N9K7j82J47R5k64J77
7139D9m3M2R9j37L6l1R5m5m7ll9L5O7k67K13o8l4p4J32R1j33LJ71j33k8M3r1K23
7167A26j76Q9k3J21k94K38m0pr0M4Q3J4l05K21r9J13o1K00k36j10K71k32K63m6
7191F4j11K5j53J44M6k26K10Q8o0j3m9N3j61K49k29J27N1j21K29j64j50K21k0
$$ plain form
7214 50 51 190 77 108 52 -75 162 -113 -204 88 115 14 128 -49 87 143 -47 29 8 181 42 99 -69 8
7238 8 4 15 62 -46 -18 82 -15 36 16 17 -28 -58 -130 -122 9 -26 -95 -5 -19 -47 145 22 154 -67 -14 -127 -46 70
7266 70 66 77 -36 20 -119 -1 -48 -167 158 18 17 113 117 -79 59 187 247 145 0 -193 48 -64 -84 -118 -208
7291 -208 -48 156 15 109 -5 54 11 24 10 -124 48 -127 -85 22 -134 221 177 -59 136 34 61 57 -55
7314 -55 -47 -22 95 -22 93 48 -16 -110 17 30 -34 -35 110 -95 93 -26 -31 90 -49 99 -57 9 50 17 -132
7339 -132 -106 59 -91 -237 16 25 40 -118 154 -86 89 142 44 -116 -169 -16 -94 -83 -23 -117 -63 40 -99 85
7363 85 -54 73 198 95 212 151 -34 -118 -23 -39 129 -74 19 211 56 88 -195 6 92 149 102 -145 -30
7386 -30 40 0 194 -193 -25 -115 162 137 100 197 35 10 -121 -28 10 -118 45 -21 -8 59 13 132 189 -190 13
$$ packed form
7214E0JJ39j13L1n6j27K37k75r1K92K7j01J14j77J36N6j90P6k1J73j39N7j68P7
7238HmJ1M7j08K8J00r7N1k0Jm5l0p2QJ31l5o9R0j4k8J92j23J32k21N3j13Q1J16
7266G0mJ1j13N6j39J18m7j19L25j40jR6Mj96J38J28O0j02j45j93K41j12k0l4r0
7291b08J60K04j41R4j14N9m3J3j4j34J72j75M2J07j56L55m4k36J95j02K7mj12
7314e5QK5J17j17J15m5o4r4J27J3o4jJ45k05J88j19nJ21j39J48j56O6M1l3j49
7339a32K6J65j50j46K53RJ5j58K72k40J75N3r8j60n3J53p8J1O0r4N4J03j39J84
7363H5j39J27J25j03J17o1j85q4R5j6J68k03R3J92j55L2k83K01Q6N7m7k47J15
7386c0P0m0J94l87J68r0K77k5l7R7j62k5j31R3L8j28J63o6J3O7m6J19N7l79K03
$$ plain form
7411 13 97 0 -37 68 -76 -39 18 12 115 -114 6 47 141 -7 18 -28 40 52 -106 9 49 93 -19 -176 -16
7436 -16 -100 -131 44 52 -58 -102 63 -23 -120 175 -17 43 74 -37 32 17 -117 -54 -22 102 70 63 26 -81 31 217
7462 217 81 -212 242 5 -74 93 -158 -78 95 193 -59 -33 -52 -48 44 154 118 -97 -178 -4 65 93 13 -12 -61
7487 -61 -22 102 11 109 8 -73 -152 -13 90 -72 -55 -109 97 39 -42 85 8 -7 45 -1 -22 0 12 -11 171 138
7513 138 10 3 -163 23 78 -52 132 -91 3 -80 -5 -17 -45 -25 -29 -92 -68 186 92 -52 103 54 7 -107 -49 -164
7539 -164 -23 16 44 -102 -197 55 95 195 -10 3 48 -146 -69 -91 168 45 23 -125 -19 79 -90 -108 143 -3
7563 -3 -116 -62 18 90 11 -128 -61 0 -184 -108 13 81 -4 -115 -107 -79 264 -195 30 36 42 117 -148 68 148 -35 88
7590 88 44 -80 126 134 91 176 149 -3 -41 -197 -126 -90 2 -92 35 -27 -99 82 -18 -64 58 -138 -13 -72 74
$$ packed form
7411A3Q4r7l7J05j44L7N7oJ03k29J20M1R4j48K5m6O8J2j58J15M0M4j12j57J60
7436a6q4l1J75Qj10m4J65q6r7K95j92O0L1j11O9j5j34O3L2J24l2pl7j07J12J86
7462B17j36k93M54k37p9J67k51Q0J73R8k52K6j9MR2J10l6k15q1J74O9K8q0k5m9
7487f1L9J24r1R8j01q1p9J39J03j62J7n4K06n8q1J27p7j5N2m6k1K2J2k3J82l3
7513A38j28pj66J86N5j30J84k23R4q3P5j2k8K0mo3K4K54r4j44J55m9m7j14N8j15
7539a64J41L9K8j46r5K52M0J00k05J3M5j94P7k2K59j23k2j48J06R8j69j8K51j46
7563cj13N4Q0P2p9j39O7O1j84P6J21O8q5j11QK8L43m59K25OOP5k65K16Q0j83J23
7590H8m4j24K06Qm3Q5k7j52l8j56P1L6R2r4J27o2p2J81j00m6J22j96J25n9J46
$$ plain form
7615 74 -152 170 -98 -174 45 127 -143 38 -17 56 -82 104 -106 -53 168 87 177 -88 61 -63 -111 47 -12
7638 -12 97 -31 -45 156 -77 63 6 12 -73 -91 -95 94 40 -1 -274 5 -46 -4 51 60 -30 -55 -62 110 44 81 92 -101
7666 -101 -17 -34 -78 -6 20 -132 127 26 71 -1 -114 29 -94 24 45 -51 39 28 68 33 94 72 -41 -53 -180
7691 -180 21 17 -21 137 -79 61 153 -138 -37 -5 154 36 49 107 -147 150 -24 -82 -21 40 136 26 264 -70
7715 -70 -4 -74 -47 78 220 37 18 -7 -11 -127 140 -127 -13 155 60 -83 -32 135 105 -88 -54 -141 -203 6 13
7740 13 29 -49 -29 -132 222 94 -41 -127 -25 -52 44 126 -7 0 19 152 109 188 154 -114 -72 -83 40 17 -10 66
7766 66 -130 -105 -97 34 75 4 24 81 51 81 3 30 183 21 144 -19 -57 -71 -67 73 -17 21 -7 72 -187 46 37
7793 37 21 -57 35 69 65 -9 122 -76 16 -3 -85 22 -143 144 286 36 -30 -16 -122 38 42 -14 181 -85 -2 -58
$$ packed form
7615G4k26L22k68p6K19Q2k70J81n5P3j38J86k10N3K21q1R0k65J49j24m8J58n9
7638a2J09j28j4K01k33J40n7Oq5j8mJ89n4m1k73K79n1M2N5Rr0k5pJ72o6L7J1j93
7666a01Q4j7m4P2K6j52K59j01M5p2j13J43j23J18K1r6R0j1M0l5O1k2j13j2j27
7691a80K01ml8J58k16J40R2k91J01L2J59j18J3N8k54K97j74n8O1O1R6j10K38l34
7715g0O6p0K7J25J42j83j9k5mj16K67k67J14J68r5j43N1J67l0j93L4q7o2K09P
7740A3J6p8K0j03L54j28j35q6J02k7R6Q2j33PJ9J33m3P9l4k68M2j1J23k3k7P6
7766F6j96K5QJ31M1p1K0N7l0L0p8K7J53j62J23j63l8j4MJ40r0L8k8P9k59K33r
7793C7j6p8R2L4mp4J31j98R2j9q2J07j65K87J42k50o6J4j06J60Mn6J95k66Q3n6
$$ plain form
7819 -58 -80 169 30 -24 71 -66 91 -115 75 49 39 160 -23 8 -184 -137 -20 -58 -51 48 42 45 -242 -54 136
7844 136 40 17 -79 46 52 64 9 76 -60 -109 -31 -24 -10 187 -30 -84 129 -112 166 -17 -41 -57 68 -162 98
7869 98 -114 -60 8 50 49 18 16 -18 68 27 -51 0 6 137 64 -45 39 -3 -83 -95 48 84 18 -88 35 -68 -26 166
7897 166 -68 -104 53 -31 158 -54 206 -75 -67 32 24 -47 7 42 14 -216 157 165 -64 -38 6 75 -58 -19 -41 4
7923 4 -63 66 -17 21 159 -58 67 29 70 40 12 34 -47 111 110 -40 163 53 165 -30 -8 87 14 22 -82 -92
7949 -92 43 61 -289 -11 -72 102 -49 116 47 -4 31 -49 -46 -221 -9 88 -12 165 64 -54 50 -25 -105 73
7973 73 15 134 219 -71 -25 -115 63 -145 -80 -61 58 22 -16 -73 -30 45 65 6 -11 -167 -3 31 -21 193 155 -116
7999 -116 -89 5 195 -18 -193 56 -70 -65 -132 -50 96 109 -14 147 36 28 50 -113 -20 -159 -266 25 15 8 -85
$$ packed form
7819e8k2K49j39n4R5j37J57k06J90k6j0J21j83L1j92M7J17l8PR9oLk87J88J90
7844A36r6k3r6J25OJ2n5O7j36m9P8PJ4J97k17n4K13k41K78j83k4j6J25k30K60
7869I8k12N4O8M2jl1kl4Q6m1p8N1OJ31p3j09Q4m2q0j2J43L6o6j06J23j03M2J92
7897A66k34l6J57q4J89k12K60k81QR9qp1N4L5k8k30L73Qk29K6M4O9j33L9k2M5
7923Do7J29q3L8J38k17J25l8M1l0k8K2q1J58jj50K03j10J12j95K2R5p3Qj04j0
7949i2J35J8l50K78o1J74j51J65o9n1L5q0Lj75K12R7j00J77j01j18J04p5q0J78
7973G3n8J19Q5k90M6r0J78k08O5J9J19l6l8n7M3P5K0n9j7j56J64L4n2K14l8k71
7999a16K7R4J90k13j75K49j26No7Q2J46J3j23J61j11qK2j63R3j39j07K91j0pr3
$$ plain form
8024 -85 95 -23 -46 66 43 21 -16 48 -130 83 8 -66 -172 132 6 163 21 13 -8 -21 67 147 -180 160 -26
8049 -26 125 -30 41 103 -9 83 13 30 -2 76 -151 82 -19 53 4 -104 6 -90 -12 -143 28 -119 -26 139
8073 139 29 12 -36 14 -46 -7 -28 45 -56 26 -96 127 -50 54 -10 -51 -27 -101 -155 -185 -24 91 -95 -9 -76
8098 -76 -113 93 14 22 -2 -53 129 77 60 -27 -69 101 62 2 7 90 -6 -19 -39 -55 -207 -115 -81 5 -177 -99 -88 -126 -26
8127 -26 -44 -6 -40 -6 -204 -90 -1 10 -57 123 101 -82 -31 -168 -76 -137 201 57 -79 -40 -24 -26 -82 -110 7 -115
8153 -115 -36 85 -124 -106 -37 -4 -124 193 -35 123 -13 -30 -123 -71 -22 -99 8 -41 81 55 1 41 -21 -109 21
8178 21 25 -20 -26 99 -83 70 106 -64 132 -19 61 10 -183
$$ packed form
8024h5J80j18k3J12k3k2l7O4j78K13p5p4j06L04j26J57j42qk1j3Q8Q0l27L40j86
8049b6J51j55P1O2j12R2p0J7l2P8k27K33j01P2m9j08J10r6P8j31J71j47R3J65
8073A39j10j7m8N0o0L9k1P3j01Q2j22K23j77J04o4m1K4p4n4l0J61J15j86Q6o7
8098g6l7K06p9Qk4n1J82n2j7q7m2J70l9o0NQ3r6j3k0j6j52R2L4Q6j82P8J1l8J00
8127b6j8L8l4L4j98J14Q9J1o7J80k2j83N1j37R2o1L38j44j36L9J6kn6k8J17j22
8153a15P9J21k09J8O9L3j20L17k28J58j36j7r3N2M9p7J07m9J22k6n4M0o2q8J30
8178B1Mm5oJ25j82J53L6j70J96j51Q0n1j93
8191a83
$$ Imaginary data points
##PAGE= N=2
##DATA TABLE= (X++(I..I)), XYDATA
$$ plain form
0 0 0 0 0 0 0 0 0 0 0 0 0 0 0 0 0 -8 8 -8 8 -8 16 -16 16 -24 24 -32 32 -40 48 -56 63 -71 80 -88 102 -114 128
37 128 -144 160 -180 199 -221 245 -273 301 -333 368 -404 447 -493 543 -599 658 -727 804 -890
56 -890 988 -1101 1232 -1387 1575 -1802 2090 -2469 2988 -3749 4977 -7294 13245 -66269 -107538
71 -107538 -16011 -2798 -5062 -4732 45809 83925 79385 28674 1454 1129 5040 -19332 -47603
84 -47603 -51457 -13770 24309 37256 29021 21101 11202 4297 -5763 -23441 -47386 -61243 -55801
97 -55801 -26499 6558 21900 25974 41645 59090 56889 28205 -8104 -24684 -15595 -10405 -24509
110 -24509 -37565 -24671 10968 40747 35725 7301 -8529 -5078 -6637 -22860 -41826 -45566 -25513
123 -25513 3592 18651 19948 23925 36747 47374 37829 5388 -24243 -30091 -20388 -12401 -13208 -17183
$$ packed form
0@%%%%%%%%%%%%%%%qJ6j6J6j6K4l2L2m0M8n6O4p2Q8j04J19j34J51j68J90k16K42
37A28k72L04l40L79m20M66n18N74o34P01p72Q51r40J036j142J257j385J531j694
56h90J878k089K333k619K962l377L892m559N457o737Q726j2271K0539p9514m1269
71a07538R1527J3213k264L30N0541L8116m540n0711k7220l25L911k4372k8271
84d7603l854L7687L8079J2947q235p920r899o905j0060j7678k3945j3857N442
97e5801K9302L3057J5342M074J5671J7445k201k8684l6309j6580R089N190j4104
110b4509j3056J2894L5639K9779n022k8424j5830L451j559j6223j8966l740K0053
123b5513K9105J5059J297L977J2822J0627r545l2441k9631n848R703P987q07l975
$$ plain form
137 -17183 -9721 12983 30767 26502 8023 -7923 -12065 -10852 -18445 -32224 -31311 -10832 14257
150 14257 28195 25197 17257 20121 28805 22936 -1477 -26986 -34647 -21413 -5941 -4471 -7626 135
164 135 16451 26313 18960 -1552 -15982 -14542 -9164 -14358 -23802 -22287 -2599 23086 33128 24246
178 24246 13356 11609 14301 9641 -7554 -26043 -28675 -15246 -1969 1104 -1002 3287 15581
191 15581 22278 11458 -8627 -20480 -18032 -9290 -6550 -12640 -12614 3460 24888 33061 24074 10014
205 10014 4201 5373 593 -13694 -26080 -24617 -10536 3074 5079 83 1979 12206 16913 7009
219 7009 -11037 -22042 -17333 -5705 -878 -3066 -1876 9498 24934 29970 19008 4031 -1855
232 -1855 -1193 -4585 -15711 -25875 -22211 -6292 7536 8508 2275 166 6731 11843 4874 -10941
$$ packed form
137a7183P462K2704J7784m265j8479j5946m142J213p593j3779R13K0479K5089
150A4257J3938k998p940K864Q684n869k4413k5509p661J3234J5472J470l155P761
164A35J6316R862p353k0512j4430J440N378n194r444J515J9688K5685J0042q882
178B4246j0890j747K692m660j7195j8489k632J3429J3277L073k106M289J2294
191A5581O697j0820k0085j1853K448Q742K740o090K6J6074K1428Q173q987j4060
205A0014n813J172m780j4287j2386J463J4081J3610K005m996J896J0227M707r904
219G009j8046j1005M709J1628M827k188J190J1374J5436N036j0962j4977n886
232a855O62l392j1126j0164L664J5919J3828R72o233k109O565N112o969j5815
$$ plain form
246 -10941 -19574 -13365 -1331 5045 3389 3677 12650 23752 24223 12044 -2993 -9297 -6683 -6799 -15062
261 -15062 -22808 -18520 -3146 9494 10724 3368 -627 3412 7243 2076 -9120 -15120 -8129 4664
275 4664 10771 7936 5901 11525 19177 17596 4103 -10858 -15493 -10785 -7442 -11189 -16719 -12914 1009
290 1009 12524 11752 3029 -1796 959 4504 689 -8383 -11828 -3574 9306 15045 10726 5752 7877
305 7877 13115 10272 -2931 -16365 -19652 -13085 -6609 -6988 -9834 -5896 5547 14429 12199 2486 -4011
320 -4011 -1368 2586 -40 -7378 -8796 -429 11839 16983 11632 4207 3450 6310 3848 -7712 -19467
335 -19467 -20669 -11874 -3545 -2218 -3789 -186 9673 16276 12261 937 -6260 -4220 920 110 -5744
350 -5744 -7077 1306 12715 16349 10197 1924 -747 817 -1505 -10934 -19900 -19227 -9120 663 2677
$$ packed form
246a0941q633O209J2034O376j656K88Q973J1102M71j2179j5037o304K614j16q263
261a5062p746M288J5374J2640J230p356l995M039L831n167j1196o000O991J2793
275D664O107k835k035N624P652j581j3493j4961m635M708L343l747n530L805J3923
290A009J1515p72q723m825K755L545l815r072l445Q254J2880N739m319m974K125
305G877N238k843j3203j3434l287O567O476l79k846L938J1443Q882k230r713o497
320d011K643L954k626p338j418Q367J2268N144n351p425p57K860k462j1560j1755
335a9467j202Q795Q329J327j571L603R859O603m015j1324p197K040N140q10n854
350e744j333Q383J1409L634o152q273k671J564k322r429q966O73J0107R783K014
$$ plain form
365 2677 1001 3535 11337 16044 11139 -103 -7550 -6242 -530 366 -3590 -5151 1930 11638 14347
380 14347 7202 -1684 -4841 -3301 -4539 -11073 -17570 -15508 -4724 5259 7666 4669 4997 10482 14164
395 14164 9072 -1971 -8770 -6900 -788 1199 -1731 -3492 1756 9693 11278 3642 -5768 -8429 -5899
410 -5899 -4856 -9365 -13749 -10586 127 9665 11006 6957 5058 8102 10489 5832 -3837 -9579 -6968
425 -6968 -422 2356 -267 -2255 1499 7366 7855 304 -8627 -11377 -7481 -4187 -5986 -8701 -4841
440 -4841 4801 13109 13259 7509 3484 4392 6297 2035 -6188 -10889 -6847 864 4185 1333 -1165 1123
456 1123 5829 5157 -2082 -10487 -12671 -7668 -2627 -2365 -4120 -532 8198 14922 13732 6397 1191 1109
472 1109 1980 -1215 -7704 -11091 -6413 1924 5925 3359 -180 598 3797 3005 -3709 -11319 -12361 -6571
$$ packed form
365B677j676K534P802M707m905j1242p447J308N712Q96l956j561P081R708K709
380A4347p145q886l157J540j238o534o497K062J0784R983K407k997L28N485L682
395A4164n092j1043o799J870O112J987k930j761N248P937J585p636r410k661K530
410e899J043m509m384L163J0713R538J341m049j899L044K387m657r669n742K611
425f968O546K778k623j988L754N867M89p551q931k750L896L294j799k715L860
440d841R642Q308J50n750m025R08J905m262q223m701M042P711L321k852k498K288
456A123M706o72p239q405k184N003N041K62j755L588Q730O724j190p335n206q2
472A109Q71l195o489l387M678Q337M001k566l539P78L199p92o714p610j042N790
$$ plain form
488 -6571 -785 557 -254 2301 9618 15028 12481 4699 -1666 -2166 -640 -3187 -8298 -10375 -5158 2934
504 2934 6969 4192 -58 -308 2434 1698 -4442 -11131 -11023 -4649 1607 3163 2455 3885 9551 13599
520 13599 10425 2165 -4343 -4563 -2455 -3350 -7457 -8714 -3727 3872 7365 4341 -260 -1435 502
535 502 545 -4314 -9681 -9281 -2511 4250 5720 4119 4395 8506 11225 7597 -424 -6521 -6487 -3482 -2966
552 -2966 -5861 -6881 -2131 4445 7046 3553 -1436 -2788 -576 -223 -3834 -7747 -6643 109 6535
567 6535 7792 4846 3929 6412 7892 4204 -3319 -8423 -7551 -3554 -2059 -3779 -4618 -1002 4964 6714
583 6714 2802 -2626 -3673 -1404 49 -2393 -5079 -3525 2722 8447 8814 4846 2619 3472 4444 728
599 728 -5911 -9835 -8046 -3142 -690 -1628 -2389 434 5014 6536 2291 -3200 -4448 -1704 639 -786
$$ packed form
488f571N786J342q11K555P317N410k547p782o365n00J526k547n111k077N217Q092
504B934M035k777m250k50K742p36o140o689J08O374O256J556p08J430N666M048
520A3599l174q260o508k20K108q95m107j257M987P599L493l024m601j175J937
535E02M3m859n367M00O770O761J470j601K76M111K719l628q021o097L4L005N16
552b966k895j020M750O576K601l493m989j352K212L53l611l913J104O752O426
567F535J257k946r17K483J480l688p523n104Q72L997J495j720q39L616N966J750
583F714l912n428j047K269J453k442k686J554O247N725L67l968k227Q53R72l716
599G28o639l924J789M904K452r38p61K823M580J522m245n491j248K744K343j425
$$ plain form
615 -786 -2768 -1044 4513 9150 8571 4054 443 232 657 -1867 -7613 -10729 -8048 -2179 1345 594
631 594 -405 1864 5733 6419 2014 -3224 -4761 -1722 1222 611 -1158 146 5073 8888 7485 2184
647 2184 -1968 -2411 -1914 -3903 -8232 -10220 -6985 -583 3077 2514 1306 2943 5869 6209 1843 -3316
663 -3316 -4483 -1828 1516 1252 -312 339 4384 7300 5542 271 -4188 -4354 -3106 -4239 -7318 -8414
679 -8414 -4941 1275 4778 4077 2243 2708 5316 5385 1583 -3334 -4381 -1143 1867 1629 -287 -207 2967
696 2967 5563 3541 -1701 -5451 -5288 -3301 -3424 -5314 -5638 -2346 3104 6139 4844 2464 2010 3894
712 3894 4047 375 -3670 -4217 -893 2429 2251 35 -573 2021 3694 1811 -2991 -6344 -5454 -2569
728 -2569 -1581 -2778 -3242 -51 4709 6800 4822 1307 499 1727 2246 -583 -3851 -4166 -491 2909
$$ packed form
615g86j982J724N557M637n79m517l611k11M25k524n746l116K681N869L524p51
631E94r99K269L869O86m405n238j537L039K944o11j769J304M927L815j403n301
647B184m152m43M97j989m329j988L235O402L660n63j208J637K926L40m366n159
663c316j167K655L344k64j564O51M045K916j758n271m459j66J248j133l079j096
679h414L473O216L503p01j834M65K608O9l802m917j047L238L010k38j916Q0L174
696B967K596k022n242l750J63J987j23j890l24L292N450L035j295k380m54J884
712C894J53l672m045n47L324L322j78k216o08K594J673j883m802l353Q90K885
728b569R88j197m64L191M760K091j978l515q08J228N19k829l268l15L675L400
$$ plain form
744 2909 2925 387 -701 745 2234 556 -3831 -6620 -5261 -1668 62 -880 -1108 1632 5569 6794
760 6794 3998 101 -1209 2 705 -1309 -3883 -3604 126 3632 3455 792 -895 181 1273 -334
776 -334 -4245 -6341 -4482 -586 1496 971 502 2362 5537 6294 3205 -950 -2460 -1226 -195 -1601
792 -1601 -3709 -3010 421 3806 3715 963 -1188 -614 387 -676 -4123 -5841 -3687 245 2726 2166
808 2166 1435 2618 4984 5416 2140 -1921 -3339 -2083 -380 -1398 -3486 -2655 883 3739 3125 365
824 365 -1823 -1494 -35 -748 -3427 -4723 -2481 1756 4021 3075 1644 2479 4157 4278 1249 -2707 -3881
841 -3881 -2249 -407 -1070 -2634 -2524 388 3290 2492 -340 -2481 -2105 -192 -307 -2252 -3184 -769 2896
858 2896 4725 3656 1789 1544 2893 2860 -150 -3516 -4364 -2436 -492 -428 -1754 -1697 573 2690 1852
$$ packed form
744B909J6k538j088J446J489j678m387k789J359L593J730r42k28K740L937J225
760F794k796l897j310J211P03k014k574K79L730L506j77k663j687J076J092j607
776c34l911k096J859L896K082n25m69J860L175P57l089m155j510J234J031j406
792a601k108O99L431L385r1k752k151N74J001j063l447j718K154L932K481n60
808B166p31J183K366M32l276m061j418J256J703j018k088Q31L538K856o14k760
824C65k188L29J459p13k679j296K242M237K265r46j431Q35J678J21l029l956j174
841c881J632J842o63j564J10K912K902p98k832k141L76J913j15j945r32K415L665
858B896J829j069j867k45J349l3l010l366q48J928J944O4j326N7K270K117q38
$$ plain form
875 1852 -1052 -2991 -2082 -115 567 -824 -1488 583 3801 5184 3778 834 403 1313 1236 -1497 -4091
892 -4091 -4688 -2456 -35 261 -1209 -1265 673 2258 1567 -1097 -2966 -1984 448 1222 495 -236 1577
909 1577 4102 5065 2955 105 -1276 -705 -513 -2387 -4583 -4637 -1940 825 1346 -85 -543 916 2373
926 2373 1596 -1070 -2891 -1780 629 1765 1054 328 1674 3990 4500 1972 -972 -2399 -1662 -1341 -2752
943 -2752 -4321 -4130 -1094 1574 2181 719 -68 1187 2425 1383 -1155 -2771 -1704 761 1953 1339
959 1339 351 1120 3308 3535 1011 -1905 -3231 -2153 -1641 -2528 -3561 -2879 -36 2382 2940 1252 363
976 363 1074 1815 1220 -1119 -2585 -1430 958 2031 1261 210 639 2119 2461 239 -2682 -3621 -2183
993 -2183 -945 -1423 -2230 -1797 883 3196 3210 1347 -217 553 1292 856 -1073 -2326 -1363 1164 2383
$$ packed form
875A852k904j939R09J967O82j391o64K071L218J383j406k944m31R10p7k733k594
892d091n97K232K421K96j470n6J938J585o91k664j869R82K432P74p27p31J813
909A577K525R63k110k850j381N71J92j874k196n4K697K765N21j431m58J459J457
926B373p77k666j821J111K409J136p11p26J346K316N10k528k944j427P37L21j411
943b752j569J91L036K668O07j462p87J255J238j042k538j616J067K465J192o14
959A339r88P69K188K27k524k916j326J078N12q87j033O82K843K418N58j688q89
976C63P11P41n95k339j466J155K388J073p70j051M29J480L42k222k921r39J438
993b183J238m78q07M33K680K313J4j863j564P70P39m36j929j253R63K527J219
$$ plain form
1010 2383 1232 -278 -104 1214 1406 -858 -3076 -3436 -2001 -38 -219 -744 -515 1546 3361 3057 902
1027 902 -813 -355 672 516 -928 -2105 -838 1386 2426 1192 -475 -608 134 333 -1227 -3400
1043 -3400 -3483 -1444 658 711 147 427 2101 3311 2928 354 -1384 -1048 90 135 -1031 -1837 -625 1921
1061 1921 2587 1141 -782 -1179 -427 -467 -1613 -3428 -3234 -945 1086 1866 1157 950 2177 3301 2441
1078 2441 119 -1644 -1689 -365 8 -915 -1378 -413 1592 2368 831 -1148 -1615 -1086 -619 -1578 -3021 -2700
1096 -2700 -575 1681 2302 1573 1375 2015 3082 2026 -372 -2376 -2025 -362 -177 -883 -1393 -446 1471
1113 1471 2248 842 -1216 -1973 -1219 -628 -1375 -2330 -1766 251 2403 2645 1679 1001 1475 2410 1433 -865
1131 -865 -2512 -1949 -514 248 -484 -1163 -279 1146 1849 376 -1629 -2131 -1271 -175 -659 -1483 -1092 744
$$ packed form
1010B383j151j510J74J318J92k264k218l60J435J963j81n25K29K061J815l04k155
1027I02j715M58J027j56j444j177J267K224J040j234j667j33P42J99j560k173
1043c400q3K039K102N3n64K80J674J210l83k574j738L36J138M5j166q06J212K546
1061A921O66j446j923l97P52m0j146j815J94K289K031P80p09k07J227J124q60
1078B441k322j763m5J324L73r23m63R65K005P76j537j979m67N29M67r59j443L21
1096b700K125K256O21p29j98O40J067j056k398k004L51J663J85p06n10R47J917
1113A471P77j406k058p57P54N91p47r55N64K017K152K42r66o78M74R35r77k298
1131h65j647N63J435P62p32o79Q84J425P03j473k005n02Q60J096m84q24L91J836
$$ plain form
1149 744 2669 2900 1632 595 750 1330 779 -1155 -2521 -1945 -304 754 84 -773 -464 836 1165
1166 1165 -263 -2062 -2255 -1160 144 221 -609 -110 1605 3001 2862 1186 -163 -7 432 -19 -1610
1183 -1610 -2568 -1727 35 935 516 -503 -326 805 925 -229 -2008 -2280 -907 609 1037 496 471 1793
1201 1793 2972 2495 440 -1026 -1120 -662 -751 -1771 -2618 -1527 396 1352 634 -228 -297 588 986 -381
1219 -381 -1780 -1922 -349 1274 1454 786 682 1661 2470 1942 -152 -1621 -1868 -1229 -969 -1812 -2318 -1242
1237 -1242 847 1808 1322 389 -239 428 685 63 -1411 -1598 -145 1579 1742 921 902 1413 1757 1044 -769
1256 -769 -2369 -2273 -1359 -918 -1540 -1721 -710 1046 2250 1569 69 -148 545 754 137 -1334 -1276 127
1274 127 1583 1756 752 314 764 1192 372 -1237 -2571 -2332 -1159 -429 -850 -946 61 1393 2234 1605
$$ packed form
1149G44J925K31j268j037J55N80n51j934j366N76J641J058o70q57L09J300L29
1166A165j428j799j93J095J304P7q30M99J715J396j39j676j349J56M39m51j591
1183a610r58Q41J762R00m19j019J77J131J20j154j779k72J373J516M28n41k5J322
1201A793J179m77k055j466r4M58q9j020q47J091J923R56p18q62o9Q85L98j367
1219c81j399j42J573J623J80o68j04R79Q09n28k094j469k47O39K60q43n06J076
1237a242K089R61m86r33o28O67K57o22j474j87J453J724J63q21j9N11L44p13j813
1256g69j600R6R14M41o22j81J011J756J204o81j500k17O93K09o17j471N8J403
1274A27J456J73j004m38M50M28q20j609j334K39J173P30m21r6J007J332Q41o29
$$ plain form
1292 1605 132 -344 241 738 115 -943 -1010 525 1626 1560 502 -83 -32 316 -188 -1579 -2534 -2077 -767
1311 -767 182 63 -345 385 1552 2122 1219 21 -934 -275 335 202 -769 -723 571 1729 1681 332 -636
1330 -636 -669 -204 -528 -1683 -2353 -1577 -117 897 875 215 630 1381 1790 853 -801 -1230 -499 217 249 -179
1350 -179 -354 918 1862 1299 116 -1021 -1033 -638 -742 -1542 -2463 -1278 366 1344 1032 489 822 1324 1231
1369 1231 295 -1139 -1481 -707 318 298 -228 -118 819 1778 1251 54 -1202 -1315 -800 -923 -1514 -1795 -867
1388 -867 772 1756 1564 925 631 1020 1128 159 -1207 -1617 -984 327 534 20 83 718 1515 1061 -286
1407 -286 -1562 -1584 -893 -596 -971 -1198 -299 1192 2074 1720 694 261 808 672 -77 -1188 -1587 -667 433
1426 433 644 -165 -294 360 905 710 -581 -1629 -1393 -650 -122 -257 -542 123 1365 2164 1612 561 2
$$ packed form
1292A605j473m76N85M97o23j058o7J535J101o6j058n85N1L48n04j391r55M57J310
1311g67R49j19m08P30J167N70r03j198r55O59O10j33r71M6J294J158m8j349r68
1330f36l3M65l24j155o70P76J460J014k2o60M15P51M09r37j654m29P31P16L2m28
1350a79j75J272R44n63j183j137j2L95j04q00r21J185J644R78l12n43L33N02r3
1369A231r36j434l42P74J025k0n26J10R37R59n27j197j256j13N15j23n91k81R28
1388h67J639R84j92o39k94L89J08r69j366m10O33J311K07n14O3O35P97m54j347
1407b86j276k2O91K97l75k27Q99J491Q82l54j026m33N47j36p49j111l99R20J100
1426D33K11q09j29O54N45j95j291j048K36P43N28j35k85O65J242P99n52j051n59
$$ plain form
1445 2 255 278 -341 -1374 -1539 -523 480 722 -4 -257 35 631 328 -763 -1670 -1439 -295 458 380 16
1465 16 714 1621 1825 1309 184 -457 -519 -145 -643 -1368 -1331 -542 582 693 133 -282 -255 266 23 -650 -1333
1486 -1333 -1010 221 1097 1008 565 905 1609 1848 1010 -432 -1081 -913 -466 -619 -1286 -1091 -228 853 977
1505 977 126 -513 -364 100 -117 -806 -1184 -742 467 1538 1340 898 1061 1508 1240 328 -978 -1712 -1226
1524 -1226 -791 -711 -1227 -1002 136 1147 1220 456 -437 -417 189 28 -669 -1222 -500 765 1548 1360 802 735
1544 735 961 946 8 -1174 -1848 -1558 -766 -412 -844 -516 341 1106 1082 412 -576 -351 -187 94 -326 -764
1564 -764 -405 789 1492 1188 448 283 543 417 -469 -1398 -1818 -1159 -393 -71 -325 -244 340 1303 1148 146
1584 146 -395 -524 52 236 -379 -534 67 882 1498 1108 98 -178 14 33 -557 -1310 -1656 -771 -87 506
$$ packed form
1445BK53K3o19j033j65J016J003K42p26k53K92N96l03j091r07K31J144P53p8l64
1465A6O98R07K04n16j125o41o2L74m98p25L7P89J124J11n60m15K7N21k43o73o83
1486a333L23J231Q76q9m43L40P04K39q38j442o49J68M47j53o67J95Q63J081J24
1505I77q51o39J49M64k17o89l78M42J209J071j98m42J63M47k68r12j306p34M86
1524a226M35Q0n16K25J138J011P3p64q93K0O06j61o97n53P22J265P83j88n58o7
1544G35K26j5r38j182o74K90P92L54m32L28Q57P65k4o70r88K25J64K81m20m38
1564g64L59J194P03l04p40j65K60j26q86r29m20O59P66L22k54Q1N84R63j55j002
1584A46n41j29N76J84o15j55O01Q15O16l90j010k76J92J9n90p53l46Q85O84N93
$$ plain form
1604 506 68 -257 552 1122 891 -72 -615 -649 84 317 107 -287 123 844 1332 815 -168 -506 -680 -191
1624 -191 -682 -1328 -1316 -269 450 931 576 197 532 833 643 -242 -959 -881 -215 373 234 201 267 827 1262
1645 1262 511 -649 -1062 -851 -448 -676 -1123 -1122 110 915 1194 756 335 443 701 317 -441 -1322 -864 -41
1665 -41 422 444 207 363 733 924 280 -804 -1314 -924 -767 -654 -903 -700 240 1171 1353 860 321 361 560
1686 560 296 -440 -953 -773 -1 652 611 140 196 592 578 -22 -974 -1308 -893 -449 -417 -401 -357 470 1378 1614
1708 1614 826 235 12 512 14 -468 -984 -723 -43 628 297 42 -3 580 384 -192 -1067 -1354 -864 -351
1728 -351 4 -122 63 700 1409 1413 650 26 114 113 -35 -280 -872 -670 321 454 420 -12 -304 57 -37 -300
1750 -300 -1028 -1285 -700 194 389 395 309 842 1184 1162 312 -441 -590 -118 -42 -376 -835 -455 218 777 356 -233
$$ packed form
1604E06m38l25Q09N70k31r63n43l4P33K33k10l94M10P21M88n17r83l38j74M89
1624a91m91o46J2J047P19M81l55l79L35L01j90q85p17P8O66N88j39l3O6N60M35
1645A262p51j160m13K11M03k28m47JJ232Q05K79m38m21J08K58l84p58q81M58Q23
1665d1M63K2k37J56L70J91o44j084n10L90J57J13k49K03R40R31J82m93n39M0J99
1686E60k64p36n13J80P72O53m1m71N6L96j4o00r52l34M15M44L2J6M4Q27R08K36
1708A614p88n91k23N00m98m82n16K61O80O71l31k55m5N83j96n76q75k87M90N13
1728c51L55j26J85O37P09Mp63o24Q8jj48k45n92K02R91J33l4m32k92L61r4k63
1750c00p28k57N85Q94J95Oq6N33L42k2q50p53j49M72P6l34m59L80O73N59m21n89
$$ plain form
1772 -233 -461 -420 -163 -618 -943 -902 -221 516 765 601 520 738 905 726 32 -783 -776 -426 -259 -324 -512 -265
1794 -265 465 706 359 -151 -663 -531 -323 -514 -775 -699 128 826 1128 836 516 591 710 352 -449 -1019 -1145
1815 -1145 -581 -79 -18 -120 98 424 871 515 -196 -603 -382 -216 -350 -446 -533 217 944 1100 939 319 315
1836 315 466 42 -572 -1095 -1033 -367 -71 -87 -272 -76 792 973 610 -358 -602 -570 49 194 -343 -306 244
1857 244 1185 1075 777 44 -18 48 -256 -813 -1117 -991 -466 164 132 -76 -25 537 938 396 -165 -348 -223
1878 -223 47 36 -74 -148 258 900 954 372 -339 -199 -247 -168 -867 -1027 -819 -107 394 304 253 97 518 542 344
1901 344 -292 -471 -316 330 426 72 144 356 830 769 -47 -477 -775 -253 -436 -571 -761 -542 10 622 484
1922 484 406 198 351 480 7 -409 -853 -339 199 538 349 251 505 621 495 -230 -797 -732 -614 -395 -730
$$ packed form
1772b33k28M1K57m55l25M1O81P37K49j64q1K18J67j79o94q15PL50J67o5j88K47
1794b65P30K41l47n10n12J32K08j91k61P6Q27O98L02k92l20P5J19l58q01n70j26
1815a145N64N02O1j02K18L26M47l56p11m07K21J66j34r6q7P50P27J56j61o20m
1836C15J51m24o14n23O2O66K96j6j85J96Q68J81l63r68k44L2O19J45n37L7N50
1857B44R41j10k98p33o2O6l04n57l04J26N25O30l2k08N1N62M01n42n61j83J25
1878b23K70j1j10p4M06O42N4n82p11J40m8P9o99j60K08P12N01r0n1j56M21K4j98
1901C44o36j79J55O46R6l54P2K12M74o1q16m30k98N22j83j35j90K19N52O12j38
1922D84p8k08J53J29m73m16m44N14N38L39j89r8K54J16j26p25n67O5J18K19l35
$$ plain form
1943 -730 -625 -282 406 990 708 251 6 272 159 -163 -465 -514 -275 388 667 348 320 358 699 373 -325
1964 -325 -990 -865 -569 -247 -274 -459 -45 323 815 571 397 -109 46 33 -66 -564 -640 -139 406 700 454
1985 454 237 391 375 329 -407 -916 -785 -548 -197 -247 -245 79 500 954 489 163 -143 -60 105 -27 -436 -389
2007 -389 -174 383 560 321 49 64 387 -46 -396 -895 -799 -434 94 140 -123 85 639 870 697 -29 -277
2028 -277 29 -45 -141 -301 -159 16 347 549 259 -67 -144 -75 -213 -508 -722 -659 -187 301 365 197 181 595
2050 595 605 196 -193 -638 -278 14 -99 -322 -216 21 336 551 58 -277 -299 -255 -137 -334 -714 -493 152
2071 152 602 556 310 338 505 526 105 -332 -723 -317 -289 -72 -120 -103 277 414 372 137 -405 -482 -430 -307 -293
2094 -293 -392 -124 511 686 746 449 85 261 214 -120 -581 -809 -435 -172 -67 -25 -89 157 351 502 -19 -507
$$ packed form
1943g30J05L43O88N84k82m57k45K66j13l22l02m9K39O63K79l19k8L8L41l26o98
1964c25o65J25K96L22k7j85M14L68M92k44j74n06J55j3r9m98p6N01N45K94k46
1985D54k17J54j6m6p36n09J31K37L51n0KL24M21M54m65l26l06Q3J65j32m09M7
2007c89K15N57J77k39k72J5L23m33l50m99R6L65N28M6k63K08N54K31j73p26k48
2028b77L06p4r6j60J42J75L31K02k90l26p7O9j38k95k14O3M72M88O4j68j6M14
2050E95J0m09l89m45L60K92j13k23J06K37L15K15m93l35k2M4J18j97l80K21O45
2071A52M50m6k46K8J67K1m21m37l91M06K8K17m8J7L80J37m2k35n42p7N2J23J4
2094b93r9K68O35J75O0k97l64J76m7l34m61k28L74K63J05M2o4K46J94J51n21m88
$$ plain form
2116 -507 -479 -210 -147 -240 -333 -116 329 895 630 383 208 93 29 -102 -735 -898 -377 -127 -69 30 115 337 268
2139 268 149 -225 -300 -657 -272 -106 -162 -175 95 344 688 553 332 -128 -235 -132 -356 -632 -653 -245 27
2160 27 121 80 -22 109 522 198 -145 -658 -407 -336 62 239 -44 115 416 537 659 15 -175 -197 -176 -195
2182 -195 -529 -773 -255 102 10 140 71 25 126 228 -340 -405 -476 -79 245 156 23 263 470 592 459 -149
2204 -149 -380 -220 -187 -91 -272 -452 -76 463 545 397 2 8 -90 39 -152 -483 -476 -26 389 248 235 -14 409
2227 409 383 48 -419 -482 -688 -321 -9 -269 -86 37 425 537 362 -81 -116 -93 67 -151 -323 -399 254 586
2249 586 398 11 235 252 364 -11 -412 -684 -358 -116 15 -72 -1 189 408 532 345 -115 -75 -63 -117 -233
2271 -233 -163 -109 41 333 535 174 159 1 301 -89 -399 -572 -445 -188 88 -119 73 206 502 445 259
$$ packed form
2116e07K8K69O3r3r3K17M45N66k65k47j75j15o4j31o33j63N21K50N8R9Q5K22o9
2139B68j19l74p5l57L85J66n6j3K70K49L44j35k21m60j07J03k24k76k1M08K72
2160B7R4m1j02J31M13l24l43n13K51P1L98J77k83J59L01J21J22o44j90k2K1j9
2182a95l34k44N18L57r2J30o9m6J01J02n68o5p1L97L24q9j33K40K07J22j33o08
2204a49k31J60L3R6j81j80L76N39Q2j48l95Or8J29j91l31PM50M15j41j3k49M23
2227D09k6l35m67o3k06L67L12k60J83J23L88J12j75m43l5K3J60k18j72p6O53L32
2249E86j88l87K24J7J12l75m01k72L26K42J31q7P1J90K19J24j87m60M0J2n4j16
2271b33P0N4J50K92K02l61j5j58L00l90l10j73J27K57K76k07J92J33K96n7j86
$$ plain form
2292 259 -159 -326 -184 -6 -48 -162 24 28 550 251 153 84 2 91 -193 -415 -531 -372 -28 54 187 195 390
2315 390 473 526 87 -198 -229 -51 -84 -51 -141 -198 303 418 345 -21 -157 -144 -132 -141 -472 -292 -307 82 254 366
2339 366 231 97 193 446 218 -316 -265 52 171 163 -108 -31 164 238 133 -176 -165 -277 -62 -208 -367 -151
2361 -151 50 198 299 403 141 -22 420 217 -39 -315 -232 -184 174 49 154 2 44 362 92 -231 -310
2382 -310 -363 -357 -252 -54 -368 91 364 437 283 297 -134 97 100 -338 -395 -360 127 215 80 93 -24 -7 410 -16
2406 -16 -163 -285 -467 -164 -110 -82 -49 160 485 544 284 171 52 46 -135 -242 -512 -436 -43 248 253 60 166
2429 166 42 196 97 -232 -700 -261 -108 42 17 17 156 377 526 320 -8 -191 -146 -76 -294 -475 -275 -30
2451 -30 183 206 6 -81 136 107 211 -73 -441 -220 84 36 81 8 154 337 295 -9 -74 -237 -236 -105 73 -291
$$ packed form
2292B59m18j67J42J78m2j14J86MN22k99r8o9q2Q9k84k22j16J59L44Q2J33QJ95
2315C90Q3N3m39k85l1J78l3L3r0n7N01J15p3l66j36J3J2rl31J80j5L89J72J12
2339C66j35j34R6K53k28n34N1L17J19qk71P7J95P4j05l09J1j12K15j46j59K16
2361a51K01J48J01J04k62j63M42k03k56k76Q3M8L58j25J05j52M2L18k70l23p9
2382c10n3OJ05J98l14M59K73P3j54J4m31K31Lm38n7L5M87Q8j35J3j17J7M17m26
2406a6j47j22j82L03N4K8L3K09L25N9k60j13j19oj81j07k70P6L93K91Nj93J06
2429A66j24J54r9l29m68M39J53J50k5%J39K21J49k06l28j83M5P0k18j81K00K45
2451c0K13K3k00q7K17k9J04k84l68K21L04m8M5p3J46J83m2l04o5j63JJ31J78l64
$$ plain form
2475 -291 -149 122 257 209 86 -37 149 155 0 -86 -371 -522 90 335 47 20 137 260 252 61 -378 -357 -208
2498 -208 -72 -225 -357 -138 50 75 336 6 -124 -125 160 -42 -165 -241 -123 244 250 46 117 141 174 147 -160
2521 -160 -321 -376 -240 -10 -11 -13 44 185 335 158 87 -126 -121 -75 -27 -209 -312 -7 66 230 321 -3 178 98 -154
2546 -154 -223 -449 -460 -76 -51 127 61 -22 174 273 308 0 -187 -152 -234 39 -101 -53 107 192 623 336 189 -87
2570 -87 -7 -30 -304 -288 -247 -214 -44 -40 -2 16 -11 229 283 -109 -191 -253 -221 -106 34 -11 56 448 240 340 116 -21
2596 -21 -90 -17 -199 -390 -227 -159 93 17 70 1 87 66 98 -28 -289 -166 -161 66 134 -32 33 328 -15 83 -75
2621 -75 -191 -93 -26 60 -254 -228 -87 259 112 -48 60 55 142 38 61 -264 -89 58 54 88 25 267 135 262
2645 262 37 -178 -284 -179 30 23 -338 8 70 347 255 286 56 -107 3 -18 17 -326 -63 1 156 174 -38
$$ packed form
2475b91J42K71J35m8j23j23J86Oj55q6k85j51O12K45k88k7J17J23qj91m39K1J49
2498b08J36j53j32K19J88K5K61l30j30jK85k02j23p6J18L67Ok04P1K4L3k7l07
2521a60j61n5J36K30jkN7J41J50j77p1k13NM6M8j82j03L05P3J64R1l24J81q0k52
2546a54o9k26j1L84K5J78o6q3J96R9L5l08j87L5q2K73j40M8J60Q5M31k87j47k76
2570h7Q0k3k74J6M1L3J70ML8J8k7K40N4l92q2o2L2J15J40m5O7L92k08J00k24j37
2596b1o9P3j82j91J63O8K52p6N3o9Q6k1L2j26k61J23NK27O8j66O5K95l43R8j58
2621g5j16R8O7Q6l14K6J41L46j47j60J08nQ7j04K3l25J75J47mL4o3K42j32J27
2645B62k25k15j06J05K09pl61L46O2K77r2L1k30j63J10k1L5l43K63O4J55J8k12
$$ plain form
2668 -38 17 49 108 -46 -158 -251 -99 -61 -34 -80 -19 151 299 315 203 -58 -182 -61 -36 -215 -290 -147 82 136
2692 136 14 18 129 225 145 -116 -448 -361 -254 108 215 227 55 228 535 183 78 -79 -78 78 -63 -68 -8 -272
2716 -272 49 187 213 -52 -56 2 75 40 -191 -342 -189 38 151 113 156 326 278 259 -80 -89 -216 -293 -58 -76 -323
2741 -323 -65 101 200 102 -2 -39 -34 55 -158 -149 -343 -103 263 129 81 48 203 175 214 24 -301 -69 -33 -15 -210
2766 -210 -167 -6 175 -2 26 -174 -154 -36 -19 -73 -155 -83 94 48 265 170 87 154 135 126 -50 -126 -207 53 23 4
2792 4 -281 -124 -44 73 38 -140 -188 -59 25 -26 -45 27 103 227 321 111 17 -93 6 106 -183 -206 -194 -31 240
2817 240 33 113 35 124 42 -143 -93 -89 -82 -61 22 81 23 109 336 115 188 -36 -163 -17 -216 -149 -205 -61 29 37 265
2844 265 39 78 202 73 74 -87 -280 -110 -109 -24 -63 22 255 149 462 174 -52 -142 48 -106 -80 -161 -197 43
$$ packed form
2668c8N5L2N9j54j12r3J52L8K7m6O1J70J48J6j12k61j24J21K5j79p5J43K29N4
2692A36j22MJ11R6q0k61l32Q7J07L62J07J2j72J73L07l52j05j57JJ56j41nO0k64
2716b72L21J38K6k65mN8P3l5k31j51J53K27J13l8M3J70m8j9l39rj27p7K35j8k47
2741c23K58J66R9r8j04l7NQ9k13Rj94K40L66j34m8l3J55k8L9j90l25K32L6J8j95
2766b10M3J61J81j77K8k00K0J18J7n4q2P2J77m6K17r5q3O7j9rj76p6q1K60l0j9
2792Dk85J57Q0J17l5j78m8J29Q4n1j9P2P6J24R4k10r4j10R9J00k89k3J2J63K71
2817B40k07Q0p8Q9q2j85N0MPK1Q3N9n8Q6K27k21P3k24j27J46j99O7n6J44R0QK28
2844B65k26L9J24j29Jj61j93J70JQ5l9Q5K33j06L13k88k26r0J90j54K6q1l6K40
$$ plain form
2868 43 125 290 -29 47 102 120 -321 -254 -206 -154 -2 12 62 -42 9 102 144 -240 -167 -274 -113 -282 -183 -136 -304
2893 -304 -42 92 262 -24 0 19 64 -46 -222 -151 49 68 -108 -64 63 -47 117 166 -163 -202 -145 26 21 -37
2917 -37 -133 43 -72 222 175 86 7 -75 126 -77 -101 -45 -195 46 296 39 94 49 139 -112 -21 -350 -197 91
2941 91 46 95 80 92 43 219 123 107 -340 96 -18 32 -87 16 35 139 -18 89 -9 -41 -57 156 -133 -157 -259
2966 -259 -95 95 160 71 82 271 94 199 108 -91 -69 -113 153 -222 -74 -126 146 68 86 195 114 -30 -226
2989 -226 -25 -335 -240 -208 36 80 109 136 20 277 46 86 -181 -124 113 -114 -98 -26 97 231 267 242 -97 -197
3013 -197 -133 -252 -119 -179 -97 -43 131 -75 -7 -77 232 199 41 -15 -259 -228 58 -74 -105 20 22 104 267 -53
3037 -53 -52 -1 -38 4 -142 -160 -248 120 248 193 130 -37 71 34 -56 -88 -83 -103 166 -54 -212 -56 -122 161 241 143
$$ packed form
2868D3Q2J65l19P6N5J8m41O7M8N2J52J4N0j04N1R3M2l84P3j07J61j69R9M7j68
2893c04K62J34J70k86K4J9M5j10j76P1K00J9j76M4J27j10J64M9l29l9N7J71nn8
2917c7r6J76j15K94m7q9p9q2K01k03k4N6j50K41K50k57N5m5R0k51R1l29J53K88
2941I1m5M9j5J2m9J76r6j6m47M36j14N0j19J03J9J04j57J07r8l2j6K13k89k4j02
2966b59J64J90O5q9J1J89j77J05r1j99K2m4K66l75J48n2K72p8J8J09q1j44j96
2989b26K01l10R5L2K44M4K9K7j16K57k31M0k67N7K37k27J6P2J23J34L6k5l39j00
3013a97O4j19J33o0Q2N4J74k06O8p0L09l3j58n6k44L1K86j32l1J25KQ2J63l20
3037e3JN1l7M2j46j8q8L68J28n5o3j67J08l7r0l2Nk0K69k20j58J56o6K83Q0r8
$$ plain form
3063 143 -145 -160 -16 -107 -82 -272 96 21 211 230 -22 -58 -76 -40 81 -107 -167 33 211 113 119 144 34 59 -72
3088 -72 -107 -76 -16 -131 -44 -2 -41 -12 106 117 198 118 -24 51 48 -99 4 -6 -14 124 -112 47 -19 109 55 -54
3114 -54 10 -165 -150 -40 177 -14 -69 53 130 238 224 -40 -35 -80 11 -31 -36 32 172 82 94 48 -48 17 36 60 -75
3141 -75 -134 -74 142 139 8 198 12 52 73 17 -160 -135 -229 -34 -91 18 -94 -31 -19 -65 -39 -76 -86 152 -80 -48
3167 -48 -33 -14 -76 97 76 102 28 23 1 82 19 -63 -69 -92 -92 -65 34 -136 137 211 -89 28 19 -35 33 -127 -129 18 136
3196 136 52 165 9 86 0 51 -9 -44 -250 -12 0 -49 -18 -191 69 231 161 -80 9 102 9 -64 -24 -91 -192
3221 -192 -85 116 175 80 -55 135 -68 -194 -190 -2 -19 109 94 59 38 -167 35 142 83 -8 -106 -25 -33 -93 -81
3246 -81 12 -59 32 42 90 -173 -16 -100 -54 -191 -187 -45 48 -97 -58 -10 -64 58 -7 -141 -3 -90 -180 72 -22 -94
$$ packed form
3063A43k88j5J44r1K5j90L68p5J90J9k52l6j8L6J21j88o0K00J78r8OK5j10K5j31
3088g2l5L1O0j15Q7M2l9K9J18J1Q1q0j42P5lj47J03j0qJ38k36J59o6J28n4j09
3114e4O4j75J5J10K17j91n5J22P7J08j4k64Nm5R1m2nO8J40r0J2m6r6O5J9K4j35
3141g5n9O0K16lj31J90j86M0K1n6j77K5r4J95n7J09j12O3J2m6K6l7j0K38k32L2
3167d8J5J9o2J73k1K6p4nk2Q1o3q2ok3%K7R9j70K73P4l00J17rn4O8j60kJ47J18
3196A36q4J13j56P7q6N1o0l5k06K38J2m9L1j73K60J62p0k41Q9R3r3p3M0o7j01
3221a92J07K01N9r5j35J90k03j26MJ88j7J28j5l5k1k05K02J07n9r1r8Q1qo0J2
3246h1R3p1R1J0M8k63J57q4M6j37MJ42R3j45L9M8n4J22o5j34J38q7r0K52r4p2
$$ plain form
3272 -94 -48 93 194 231 2 130 48 -36 -157 -3 16 -30 -21 21 -18 125 35 -69 196 96 -188 -210 -29 40 60
3297 60 161 53 93 222 83 -130 107 -100 -42 23 -50 -119 77 42 231 99 76 192 -135 25 -155 -53 -135
3320 -135 -1 -77 54 -168 -65 108 64 -8 -49 7 -85 -104 24 -120 -65 91 -17 -2 55 123 13 -39 105 -63
3344 -63 -12 164 108 50 114 91 -32 68 41 12 27 -101 29 -9 -58 -136 -113 -85 206 199 25 58 219 20 -119 -135
3370 -135 -119 20 -24 -11 -54 -91 30 -16 -51 -144 -64 -22 9 -89 104 12 -26 -314 109 33 29 61 91 -204 -62 -196
3396 -196 -141 -167 -7 104 14 -23 -81 -23 28 70 -66 -58 68 -64 -14 89 -16 -17 197 269 3 -131 -11 -83 62
3421 62 -168 -120 -46 81 12 22 37 4 -117 -30 -10 -205 -184 61 -18 5 -37 -75 70 -25 264 21 -125 -113 -230
3446 -230 45 -162 -102 -108 148 216 189 68 75 -167 -14 -73 -63 -104 -71 -51 44 273 117 52 263 149 -68 -142 28
$$ packed form
3272i4M6J41J01L7k29J28q2q4j21J54J9m6RM2l9J43r0j04K65j00k84k2J81O9K0
3297F0J01j08M0J29j39k13K37k07N8O5p3o9J96l5J89j32k3J16l27J60j80J02q2
3320a35J34p6J31k22J03J73m4p2m1N6r2j9J28j44N5J56j08J5N7O8j10n2J44j68
3344f3N1J76n6n8O4k3j23J00k7k9J5j28J30l8m9p8K3K8K91pj74L3J61j99j39j6
3370a35J6J39m4J3m3l7J21m6l5r3Q0M2L1r8J93r2l8k88M23p6mL2L0k95J42j34
3396a96N5k6J60J11r0l7n8N8N1M2j36QJ26j32N0J03j05jK14P2k66j34J20p2J45
3421F2k30M8P4J27o9J0J5l3j21Q7K0j95K1K45p9K3m2l8J45r5K89k43j46J2j17
3446b30K75k07O0oK56O8k7j21Pk42J53n9J0m1L3K0R5K29j56o5K11j14k17p4J70
$$ plain form
3471 28 42 93 -77 56 7 132 90 -85 -32 23 -174 114 15 -41 -48 -108 103 5 -44 -128 -36 92 -139 -34 71
3496 71 -17 -66 -70 159 85 -88 105 -95 42 -73 -118 -14 94 25 3 -142 -136 47 -16 -102 103 32 23 129 -4
3521 -4 25 33 36 34 -1 85 -21 23 50 2 152 -57 26 -15 128 -103 15 -23 5 100 118 -12 21 -53 -102 -88 -113 -82 133
3550 133 84 -81 107 -116 132 185 7 -117 39 -78 155 50 -153 218 68 -59 -66 20 -60 29 -32 11 -57
3573 -57 -75 -76 -119 33 60 76 107 111 148 -31 -146 -216 25 -44 124 -37 87 70 121 112 110 -145 -93 69 91 -23 -107
3600 -107 -28 16 -26 171 130 0 153 -41 88 -99 46 174 38 27 170 86 -11 27 -44 -74 80 -76 -99 -126
3624 -126 -36 170 -18 -10 38 95 4 -29 4 -92 -187 -161 -109 -85 70 -21 248 -41 116 -9 -48 120 -29 8 -108
3649 -108 -48 30 -210 -61 -218 18 42 -107 8 -18 76 -21 -3 -60 -29 42 -57 67 81 -84 -77 61 21 -121 51
$$ packed form
3471B8J4N1j70J33m9J25m2j75N3N5j97K88r9n6po0K11r8m9q4R2J28k31J05J05
3496G1q8m9mK29p4j73J93k00J37j15m5J04J08o9k2j45OJ83o3q6K05p1rJ06j33
3521dK9QLkl5Q6j06M4K7m8J50k09Q3m1J43k31J18l8K8R5J8j30L3p4m9J4k5L1K15
3550A33m9j65J88k23K48N3j78j24J56j17K33j05k03L71j50j27pQ6q0Q9o1M3o8
3573e7j8jm3J52K7J6L1ML7j79j15p0K41o9J68j61J24j7N1rkk55N2J62K2j14q4
3600a07P9M4m2J97m1j30J53j94J29j87J45J28j36j1J43q4r7L8p1l0J54j56k3k7
3624a26R0K06j88QM8N7r1l3L3r6r5K6N2K4J55r1K69k89J57j25l9J68j49L7j16
3649a08O0P8k40J49j57K36K4j49J15k6R4r7J8n7L1P1r9J24J4j65PJ38m0j42J72
$$ plain form
3674 51 -10 46 29 -18 3 -22 61 129 -12 -8 -157 -27 -116 -212 13 -29 -142 -105 -28 -90 12 -170 -34 -134 -64 100
3700 100 -171 84 18 109 144 7 -32 -189 -58 66 89 -7 244 13 -191 23 17 23 76 -29 -108 68 -183 -69
3724 -69 -138 174 209 116 -89 46 137 -14 94 -21 35 -66 -48 57 42 42 224 -11 222 89 -76 -87 -31 -50
3748 -50 -116 -53 61 -12 133 143 18 111 -92 -131 157 59 -61 3 144 -42 11 -164 -120 44 21 53 -180 -95 80
3773 80 -141 -72 -27 125 -67 22 134 -11 -35 -63 101 -32 -131 -77 -56 3 -80 107 29 -33 55 95 25 42 -82 -75
3799 -75 -81 -73 -11 -197 -71 76 89 194 -38 192 -98 -69 -19 0 18 -154 -20 7 -21 -114 100 -22 -96 37 -139
3824 -139 59 91 72 131 -120 117 243 64 23 3 10 -78 42 -74 -114 -68 -92 -69 -136 -162 1 174 -58 70 -179
3849 -179 -185 -203 -41 63 -73 -20 -165 11 -63 59 -173 45 8 22 182 -95 27 -8 13 8 122 -51 57 -104
$$ packed form
3674E1o1N6j7m7K1k5Q3O8j41Mj49J30q9r6K25m2j13L7P7o2J02j82J36j00P0J64
3700A00k71K55o6R1L5j37l9j57J31J24K3r6K51k31k04K14oON3j05p9J76k51J14
3724f9o9L12L5r3k05J35R1j51J08j15N6j01J8J05j5%J82k35K33j33j65j1N6j9
3748e0o6O3J14p3J45J0j25R3k03l9K88r8j20O4J41j86N3j75M4J64k3L2k33Q5J75
3773H0k21O9M5J52j92Q9J12j45k4k8J64j33r9N4K1N9q3J87p8o2Q8M0p0J7j24P
3799g5oQO2j86J26J47J3J05k32K30k90K9N0J9J8j72J34K7k8r3K14j22p4J33j76
3824a39J98L2j9N9k51K37J26j79m1k0Pq8J20j16m0M6k4K3o7k6J63J73k32J28k49
3849a79oj8J62J04j36N3j45J76p4J22k32K18l7J4J60k77J22l5K1nJ14j73J08j61
$$ plain form
3873 -104 -31 101 -82 13 -28 -10 42 77 105 -58 -23 -85 31 -26 17 -166 -36 31 -109 15 -138 16 1 -58 53
3898 53 -121 -66 188 26 50 27 -110 32 33 -50 -71 18 -23 39 -138 79 115 62 -24 -105 191 18 -15 191 -158
3923 -158 -125 3 -2 47 -54 -71 -21 108 -6 -113 65 -98 18 -190 -172 13 20 -7 -57 37 -167 181 -4 49
3947 49 -63 37 35 -147 -30 97 181 40 -115 49 68 21 -138 35 -87 40 3 99 -12 -75 53 5 -18 61
3971 61 -15 38 13 -15 -14 -73 -78 97 -111 -106 88 99 -23 23 116 31 90 -80 -118 -60 63 92 105 145 -80 104 3
3998 3 6 -77 -57 -108 -152 -72 26 -36 -5 -34 73 -30 -107 -188 -131 48 68 3 50 151 -60 131 42 32 -42 -8 39 -20
4026 -20 -82 -56 -23 -79 42 136 58 29 117 104 89 44 -91 83 -3 10 4 -76 -44 235 13 112 -204 -168 -2 108 10
4053 10 -133 34 40 63 -112 109 135 29 39 -56 -30 90 232 132 -46 -32 26 156 100 42 28 98 -142 -53 208
$$ packed form
3873a04P3J32j83R5m1J8N2L5K8j63L5o2J16n7M3j83J30O7j40J24j53J54j5n9J11
3898E3j74N5K54j62K4k3j37J42Jq3k1Q9m1O2j77K17L6n3q6q1K96j73l3K06l49
3923a58L3J28nM9j01j7N0J29j14j07J78j63J16k08J8J85Pk7n0R4k04L48j85N3
3947D9j12J00kj82J17J27Q4j41j55J64J9m7j59J73j22J27l7R6j11o3J28m8k3P9
3971F1p6N3k5k8Jn9nJ75k08NJ94J1j22M6R3q5N9j70l8N8J23K9J3M0k25J84j01
3998CLq3K0n1m4Q0R8o2L1k9J07j03p7q1N7J79K0o5M7J01k11J91q9j0p4L4M7n9
4026b0o2K6L3n6J21R4p8k9Q8j3j5m5j35J74q6J3oq0L2K79k22R9l16L6J66J10r8
4053A0j43J67OK3j75K21K6j06J0r5K6J20J42j00j78J4N8J30n6n8j4P0k40Q9K61
$$ plain form
4078 208 -47 190 -35 53 21 28 108 -8 86 -23 39 -40 -40 -57 -56 101 81 -77 -39 147 36 102 -128 115 55 44
4104 44 -3 -13 144 -152 51 39 176 -103 -115 80 -35 -36 83 49 81 -3 32 59 -66 177 -91 -170 141 10
4128 10 15 -1 -67 -107 163 132 24 -149 -35 31 -81 30 -48 28 68 -183 66 22 -90 68 124 5 49 -56 -119
4153 -119 -180 86 -25 -63 -30 30 -95 27 148 76 -114 51 -60 2 110 -14 46 89 30 309 -118 34 -146
4176 -146 -97 -126 -81 -103 -49 10 16 33 9 155 -119 -27 95 27 -41 35 -17 37 -45 23 -31 169 113 -140 -89 75 133
4203 133 25 107 50 75 -53 -61 -17 73 129 -145 48 -104 11 -85 54 -41 68 -53 -122 -120 47 -60 65 128 -126
4228 -126 -42 30 -98 -16 -10 39 -71 -20 24 49 140 -134 -51 26 -113 -105 57 41 145 83 108 25 13 34 -48 54 -48
4255 -48 -58 122 -63 237 -38 53 -99 80 -58 52 -34 42 -5 -71 -86 51 92 142 102 80 -14 -12 109 -125 -34
$$ packed form
4078B08k55K37k25Q8l2PQ0j16R4j09O2p9%j7JJ57k0j58L8J86j11O6k30K43o0j1
4104D4m7j0J57k96K03j2J37k79j2J95j15jJ19l4L2q4L5K7j25K43k68p9L11j31
4128A0Nj6o6m0K70l1j08j73J14O6j12J11p8P6M0k51K49m4j12J58N6j19M4j05o3
4153a19o1K66j11l8L3O0j25J22J21p2j90J65j11O2J08j24O0M3n9K79m27J52j80
4176a46M9k9M5k2N4N9OJ7k4J46k74R2J22o8o8P6n2N4q2O8n4K00n6k53N1J64N8
4203A33j08Q2n7K5j28qM4R0N6k74J93j52J15r6J39r5J09j21o9KJ67j07J25O3k54
4228a26Q4P2j28Q2OM9j10N1M4K5R1k74Q3P7j39QJ62j6J04o2K5q3j2K1q2J02j02
4255d8j0J80j85L00k75R1j52J79j38J10q6P6m7o6j5J37M1N0m0k2r4KJ21k34R1
$$ plain form
4280 -34 137 -55 -143 -33 -207 102 -125 -84 -67 -113 -94 -27 4 91 -38 21 29 171 61 72 99 -24 173 -188 7
4305 7 -175 -80 -69 -227 80 11 45 18 226 -70 -32 17 -7 -45 -89 55 57 158 -17 38 -119 -51 36 -148 -76 -142
4331 -142 51 8 -54 56 121 127 100 13 -92 -154 -51 0 97 184 51 128 -31 -109 -115 -99 -46 39 -51 40 57 -72 -44
4358 -44 -68 -36 83 195 20 78 15 -34 -128 207 75 232 -19 96 -39 -150 -121 52 -151 -40 105 -15 -99
4381 -99 -93 114 -174 11 -157 110 -57 55 56 5 -21 -50 -107 131 34 194 -34 8 167 80 -118 67 93 82 96
4406 96 -240 72 53 90 46 -62 -19 99 14 42 189 50 -164 -2 22 90 175 3 60 -24 47 -91 -31 125 34
4431 34 -17 92 -97 11 88 -70 125 41 139 -94 51 -146 -184 20 -38 124 79 -174 -59 17 -58 -76 102 -163
4455 -163 172 37 -122 84 -5 130 -49 -123 -1 -120 138 63 -53 -45 72 -70 -35 216 245 3 -19 -41 187
$$ packed form
4280c4J71j92q8J10j74L09k27M1J7m6J9O7L1Q7j29N9QJ42j10J1K7j23J97l61J95
4305Gj82R5J1j58L07o9L4k7K08k96L8M9k4l8m4J44KJ01j75N5j57O8Q7j84P2o6
4331a42J93m3o2J10O5Ok7q7j05o2J03N1R7Q7j33P7j59p8oJ6N3Q5r0R1J7j29K8
4358d4k4L2J19J12j75N8o3m9r4L35j32J57k51J15j35j11K9J73k03J11J45j20q4
4381i9OK07k88J85j68K67j67J12Jn1k6k9n7K38r7J60k28M2J59q7j98J85K6j1J4
4406I6l36L12j9L7m4j08M3J18q5K8J47j39k14J62K4O8Q5j72N7q4P1j38O0J56r1
4431C4n1J09j89J08P7j58J95q4R8k33J45j97l8K04n8J62m5k53J15P6p5j8J78k65
4455a63L35j35j59K06q9J35j79p4J22j19K58p5j16QJ17j42L5K51K9k42k2k2K28
$$ plain form
4478 187 8 88 -215 105 -73 -34 29 121 98 -77 32 72 100 -109 110 66 -30 -14 0 -167 34 -5 113 -43
4502 -43 61 -85 75 115 65 -15 -17 -16 91 32 -99 90 27 -18 87 -12 -259 2 -76 -155 19 -35 72 182 -30
4527 -30 -48 -79 42 6 27 109 -77 96 111 -26 -47 -88 -252 -34 58 -230 -13 -73 119 -4 -21 40 -114 -107 -60
4552 -60 38 -130 -53 -39 -93 130 -129 -5 274 60 -159 98 -17 24 71 -94 -6 60 -142 12 5 4 -12 -155 163
4577 163 97 -143 -26 -15 107 -4 307 -11 98 24 -192 -68 -125 274 41 18 -37 6 -62 5 95 -50 -150
4600 -150 -60 -8 -60 -128 158 -80 -128 -178 -7 45 -183 -38 -144 58 -53 162 64 -72 41 -65 108 -37 96
4623 96 62 -197 133 -66 -75 45 -71 51 -116 -149 37 -61 -78 -69 -5 47 -96 74 -160 -33 32 -125 13 150
4647 150 84 121 -143 -214 57 91 -48 -52 -99 -23 104 -48 71 56 262 -37 60 -39 -40 -10 14 49 22 -69 -40 5 -36
$$ packed form
4478A87j79Q0l03L20j78L9O3R2k3j75J09M0K8k09K19m4r6J6J4j67K01l9J18j56
4502d3J04j46J60M0n0q0kJJ07n9j31J89o3m5J05r9k47K61p8p9J74n4J07J10k12
4527c0j8l1J21l6K1Q2j86J73J5j37k1m1j64K18R2k88K17o0J92j23j7O1j54PM7
4552f0R8j68P7J4n4K23k59J24K79k14k19K57j15M1M7j65Q8O6k02J54pjj6j43L18
4577A63o6k40J17J1J22j11L11l18J09p4k16J24n7L99k33k3n5M3o8O7R0j45j00
4600a50R0N2n2o8K86k38m8n0J71N2k28J45j06K02j11K15r8j36J13j06J73j45J33
4623I6l4k59L30j99rJ20j16J22j67l3J86r8j7RO4N2j43J70k34J27O5j57J38J37
4647A50o6L7k64p1K71L4j39mm7P6J27j52J19j5K06k99R7r9jL0K4L5k7r1K9M5m1
$$ plain form
4674 -36 -137 -3 -62 22 88 -110 -89 -24 -102 -11 -62 -150 -137 -25 -12 -19 79 -66 -20 -83 51 56 -31 -86 -26 74 -6 -80
4702 -80 17 103 -97 -43 -18 -35 88 -53 46 106 -1 -133 23 -61 -72 -85 125 97 98 -59 84 8 -12 -26 -106 -188
4728 -188 312 59 -171 -97 -104 158 -19 50 -13 54 109 189 -73 30 -51 -61 81 89 -151 -108 -102 -57 49 -19 4 52
4754 52 98 -13 -102 -86 -49 22 -136 89 -3 -60 47 122 -117 -136 117 -17 -75 -58 39 46 60 104 109 -106 144 -33
4780 -33 -35 -37 30 -116 54 -132 99 8 55 -93 -44 -82 106 75 -28 83 69 -68 63 43 128 16 -2 -34 -23 115
4806 115 13 90 26 -105 46 -42 -125 120 -76 -73 -57 -90 182 1 6 122 192 -28 -117 115 81 -82 -18 28 -186
4831 -186 155 -98 73 50 83 73 -85 72 8 170 128 132 -73 222 -85 -32 156 53 -40 -119 116 -9 121
4854 121 34 -34 -234 -47 104 91 98 44 -82 -60 -1 1 65 251 -44 -50 0 -70 -134 -17 13 165 160 53 89 93 17 -141
$$ packed form
4674c6j01J34n9Q4O6j98K1O5p8R1n1q8J3J12J3pR8j45M6o3J34Nq7n5O0J00q0p4
4702h0R7Q6k00N4K5j7J23j41R9O0j07j32J56q4j1j3K10k8Jj57J43p6k0j4q0q2
4728a88N00k53k30P4pK62j77O9o3O7N5Q0k62J03q1j0J42Qk40M3OM5J06o8K3M8
4754E2M6j11q9J6L7P1j58K25r2n7J07P5k39j9K53j34n8J7R7PJ4M4Nk15K50j77
4780c3kkO7j46J70j86K31r1M7j48M9l8J88l1j03J11j4j37J31k0Q5j12j8l2J1J38
4806A15j02P7o4j31J51q8q3K45j96LJ6l3K72j81NJ16P0k20q9K32l4j63O4M6k14
4831a86L41k53J71k3L3j0j58J57o4J62m2Mk05K95l07N3J88j03r3p9K35j25J30
4854A21q7o8k00J87J51j3Pn4j26K2N9KO4J86k95oN0p0o4J17L0J52nj07L6Mp6j58
$$ plain form
4882 -141 -83 39 20 26 -63 90 52 -62 27 46 9 -52 49 28 -100 -103 -74 -141 -174 18 -30 -61 -79 67 -18 -68 -85
4909 -85 -18 65 56 -17 0 59 -13 95 32 131 -43 54 104 -181 17 97 6 146 202 43 125 -7 -23 26 94 -62 -21
4936 -21 17 32 4 19 -25 52 -44 -113 80 49 -121 -124 5 -157 -45 -22 9 -140 10 -92 -198 -92 -72 -71 69 -102
4962 -102 -31 122 78 -47 -177 94 33 37 60 -38 23 -90 -103 45 -3 47 12 -16 24 -35 -32 -46 13 156 94 142 -141
4989 -141 51 49 32 -3 -33 101 -134 -8 -88 -74 37 56 229 -98 -56 19 -39 162 -18 170 -66 -68 53 26 83
5014 83 37 -13 -125 -47 185 -40 8 -34 -55 -146 132 50 -87 -56 -99 37 -104 107 -180 -40 -35 34 144 -73 -25
5039 -25 -123 48 -43 -47 122 -39 -186 86 -15 -86 -75 122 -66 -190 -11 62 75 -201 100 27 137 -118 -62 41
5063 41 -37 -74 48 -136 94 60 -24 68 80 32 104 52 193 37 -123 -15 -3 88 -32 -135 -44 -47 -30 14 -36 -92
$$ packed form
4882a41N8J22j9Oq9J53l8j14Q9J9l7o1J01k1j28lK9o7l3J92m8l1j8J46q5n0j7
4909h5O7Q3rp3J7N9p2J08o3R9j74R7N0k85J98Q0r1J40N6j59Q2j32j6M9O8j56M1
4936b1L8J5k8J5m4P7r6o9J93l1j70lJ29j62J12K3L1j49J50j02j06J06K0JJ40j71
4962a02P1J53m4j25j30K71o1MK3r8O1j13j3J48m8N0l5k8M0n9Lj4N9J43o2M8k83
4989a41J92kj7l5l0J34k35J26q0J4J11J9J73l27M2P5n8K01j80J88k36kJ21k7N7
5014H3m6n0j12P8K32k25M8m2k1r1K78q2j37L1m3J36j41K11k87J40NO9J10k17M8
5039b5r8J71r1mJ69j61j47K72j01p1J1J97j88j24J79P3J3k76L01p3J10k55N6J03
5063D1p8l7J22j84K30l4q4R2J2m8P2n2J41j56j60J08J2R1j20j03R1lJ7M4n0n6
$$ plain form
5089 -92 -54 -98 61 -7 94 -116 62 -79 6 -21 -71 -28 86 18 76 -102 -157 53 -71 -130 57 -38 -59 -203 11
5114 11 92 -14 -42 -92 -63 32 -114 23 235 15 23 67 24 -36 -30 18 77 -84 -52 -176 102 -133 -51 -37 -67 5 91
5141 91 -53 -67 5 -15 89 -69 243 -133 -55 78 27 -102 -63 -10 6 103 33 47 -15 -91 104 16 -17 -33 -162 120
5167 120 -136 162 -105 6 -57 -117 -57 42 11 26 -48 167 100 20 -17 82 -59 -54 -40 -66 -102 19 -102 55 -232
5192 -232 197 44 -86 -19 -98 -81 65 75 -82 -41 -142 -7 53 139 13 5 58 59 26 98 -50 37 -7 90 -20 10
5218 10 75 -5 -4 97 107 142 118 -42 -192 -33 72 6 201 81 73 -58 6 -36 -198 -32 -21 258 151 -105 -75
5243 -75 41 30 -36 -25 22 -124 -37 -67 -154 -74 -41 -65 37 30 -90 -43 -30 -8 -120 -201 98 -74 -30 58 -88 -27 -16
5270 -16 180 -70 -43 108 -115 -10 67 -81 -130 -35 -106 -75 -97 28 1 -260 104 106 30 11 -5 59 -62 -21 28 42
$$ packed form
5089i2L8m4J59o8J01k10J78j41Q5k7n0M3J14o8N8j78n5K10j24n9J87r5k1j44K14
5114A1Q1j06k8n0K9R5j46J37K12k20QM4m3o0OM8N9j61L2j24K78k35Q2J4l0P2Q6
5141I1j44j4P2k0J04j58L12l76P8J33n1j29L9N3J6R7p0J4o2p6J95q8l3j6j29K82
5167A20k56K98k67J11o3o0O0R9l1J5p4K15o7q0l7R9j41NJ4k6l6J21j21J57k87
5192b32M29j53j30O7p9J7J46J0j57M1j01J35O0Q6j26qN3Jl3P2j48Q7m4R7j10L0
5218A0O5q0JJ01J0L5k4j60j50J59J05o6J95j20qj31O4m2j62J66J1K79j07k56L0
5243g5J16j1o6J1M7j46Q7l0q7Q0L3k4J02pj20M7J3K2j12q1K99j72M4Q8j46O1J1
5270a6J96k50K7J51k23J05P7j48m9R5p1L1k2J25k7k61L64Kp6j9j6O4j21M1M9J4
$$ plain form
5296 42 131 44 39 -23 -142 43 10 1 -102 62 -15 63 172 -14 -37 -156 -222 -17 64 -143 77 20 24 -65 67 101
5322 101 25 -122 -87 151 -53 6 141 28 -182 47 -7 80 -120 4 19 48 -43 8 93 -40 -104 141 79 34
5346 34 12 -32 22 -4 172 55 29 122 -144 67 -29 86 85 -116 -30 -103 -156 -44 -35 -9 59 93 133 -93 53 -69
5372 -69 40 -10 -111 23 3 -33 1 174 -122 -15 133 -92 21 99 26 11 25 -117 -4 -43 16 -186 134 72
5396 72 148 315 97 -83 117 -21 199 -156 34 -33 -122 -82 -10 -16 52 179 144 -124 54 94 104 -29 65 -132
5420 -132 165 -103 74 -135 -51 128 18 -14 26 31 68 65 52 20 -12 -50 99 -9 39 -29 88 -64 24 40 -140
5445 -140 149 -128 -20 24 67 -30 14 -68 77 -29 -149 -23 153 -216 -89 -185 -69 -22 -24 -29 86 -58 -91 71
5469 71 -146 -106 64 11 -67 8 -86 -75 23 104 -29 34 120 100 -2 115 -114 -33 -4 214 -10 -2 -18 70 25 -134
$$ packed form
5296D2Q9q7no2j19J85l3rj03J64p7P8J09j86k3j19o6K05Q1k07K20n7Mq9J32L4
5322A01p6j47L5K38k04N9J35j13k10K29n4Q7k00J24J5K9r1N1Q5j33o4K45o2m5
5346C4k2m4N4k6J76j17k6R3k66K11r6J15jk01Q6p3n3J12RK6O8L4M0k26J46j22
5372f9J09n0j01J34k0l6L4J73k96J07J48k25J13P8p3j5J4j42J13l9N9k02L20o2
5396G2P6J67k18j80K00j38K20l55J90o7q9M0P2oO8J27l5k68J78M0J0j33R4j97
5420a32K97k68J77k09Q4J79j10l2M0NL7lj3l2l2l8J49j08M8o8J17j52Q8J6j80
5445a40K89k77J08M4M3r7M4q2J45j06j20J26J76l69J27r6J16M7knJ15j44l3J62
5469G1k17M0J70n3p8P5r4J1R8Q1j33O3Q6k0j02J17k29Q1K9K18k24Qj6Q8m5j59
$$ plain form
5495 -134 26 -53 28 106 134 -29 -149 -54 -99 43 -49 -2 71 96 -111 -38 -66 -42 -45 -40 -41 63 52 -63 -178 131 46
5522 46 115 103 -186 15 145 23 30 0 -133 46 -74 -166 47 42 63 171 -11 60 -14 -73 56 -15 5 -21 -22 -28 48
5549 48 56 -34 143 -51 -40 41 147 10 -47 -59 152 -36 248 55 -47 203 -145 5 15 -79 107 117 105 23
5573 23 -37 18 70 9 44 -162 24 258 119 -96 57 139 -362 163 72 -75 52 96 34 4 120 86 -93 -29
5597 -29 222 121 87 -51 -77 -24 -201 -114 17 40 10 -44 -31 62 0 105 120 -4 5 36 -81 -116 -88 -67 80 52
5623 52 26 59 -58 -64 140 -114 215 68 -78 -85 64 63 -114 45 -39 76 62 3 -18 20 8 -111 -20 33 10 55
5649 55 -27 128 245 15 138 124 -63 -71 98 -36 -51 -88 -44 -34 -197 -171 109 76 132 47 -45 206 90 -53 -8
5674 -8 -94 -47 93 25 76 -88 -178 25 -150 -78 42 95 -13 164 156 -153 59 65 83 9 -67 -22 -40 -199 -133 -60 -184
$$ packed form
5495a34J60p9Q1P8K8j63j20R5m5J42r2M7P3K5k07P3k8K4lNjJ04j1j15j15L09q5
5522D6O9j2k89K01J30j22Pl0j33J79j20r2K13nK1J08j82P1p4n9J29p1K0k6joP6
5549D8Qr0J77j94J1Q1J06j37n7j2K11j88K84j93j02K50l48J50J0r4J86J0j2q2
5573B3o0N5N2o1L5k06J86K34j39k15J53Q2n01N25r1j47J27M4o2l0J16l4j79O4
5597b9K51j01l4j38k6N3j77Q7J31K3l0n4J3R3o2J05J5j24RL1j17l5K8K1J47k8
5623E2k6L3j17oK04k54L29j47j46pJ49jj77J59q4J15j4n9k1L8j2j19R1N3k3M5
5649E5q2J55J17k30J23j4j87qJ69j34j5l7M4J0j63K6K80l3N6q5r2K51j16j43M5
5674hq6M7J40o8N1j64r0K03j75P2J20N3j08J77ql09K12OJ8p4p6M5j8j59O6P3j24
$$ plain form
5701 -184 5 31 121 122 150 33 -88 32 68 16 68 22 31 -38 125 -61 -59 67 19 -61 -110 66 -15 -83 -146 -154 -262
5728 -262 -156 65 11 -122 80 36 -21 120 135 136 16 -4 -29 -161 87 93 -173 82 -65 79 27 74 35 -98
5752 -98 86 -83 -16 -68 -1 84 37 121 87 28 90 117 -130 -122 116 87 106 85 18 -12 66 -40 -25 172 -150 -32 -7
5779 -7 -28 37 135 61 -116 131 -31 -76 29 -5 -10 -57 116 -88 -60 26 -88 -34 -27 5 87 98 -4 97 -178 96
5805 96 121 -133 -49 -181 172 51 -16 29 -2 51 -3 -18 -38 -22 -7 -33 -68 -78 25 0 8 37 220 37 111 -38 86
5832 86 18 -68 34 125 -12 66 70 -114 -15 -163 -88 -46 9 -26 78 42 153 258 227 -192 -121 199 -108 53 -74
5857 -74 -52 46 76 -50 78 65 -78 -48 -75 -2 0 93 14 135 66 -2 87 126 -126 85 86 -32 52 125 54 -146 -13
5884 -13 101 146 111 38 17 -112 19 -208 13 102 22 17 -35 59 11 66 56 -103 -17 84 59 36 -250 -66 -83 -136
$$ packed form
5701a84J89K6R0JK8j17j21J20L6n2N2m6Ro9J63j86KJ26m8q0m9J76q1o8o3qj08
5728b62J06K21n4j33K02m4n7J41J5Jj20k0k5j32K48Ok66K55j47J44n2M7l9j33
5752i8J84j69O7n2O7Q5m7Q4l4n9O2K7k47QK38k9J9k1o7l0P8j06J5J97l22J18K5
5779gk1O5R8p4j77K47j62m5J05l4nm7J73k04K8Q6j14N4PL2Q2J1j02J01k75K74
5805I6K5k54Q4j32L53j21o7M5l1N3n4j5k0J6J5k6l5j0J03k5QK9J83j83P4j49J24
5832H6o8q6J02R1j37P8Mj84R9j48P5M2N5l5J04l6J11J05l1m19P1L20l07J61j27
5857g4K2R8L0j26J28j3j43L0k7P3KR3p9J21o9o8Q9L9k52K11Jj18Q4P3p1k00J33
5884a3J14M5l5p3k1j29J31k27K21Q9q0nn2R4m8N5j0j59Q6J01k5k3k86J84j7n3
$$ plain form
5910 -136 115 16 9 53 83 -45 -164 89 61 -84 -40 47 -5 121 154 98 -35 26 -78 -70 -31 98 157 63 66 90 -90
5937 -90 -87 -122 -97 -66 -95 -71 97 44 -34 -19 -64 20 16 26 51 -214 144 52 -56 -213 -38 -4 -125 98 129 -147 -8
5964 -8 6 -99 58 -54 63 4 -62 -6 17 12 -40 -242 36 34 -11 101 66 -70 9 18 -154 -83 61 -117 -38 -41 -2
5991 -2 14 -14 -43 5 -68 1 9 49 161 -101 60 -26 -146 -87 85 166 34 138 -92 72 12 -208 15 79 1 167
6017 167 171 147 -103 89 -52 -98 33 -157 22 -133 48 -61 -101 -29 114 51 -130 50 -63 -28 64 -3 53 105
6041 105 44 -40 41 108 185 -92 -11 151 -49 68 118 26 69 51 110 -30 -114 47 -71 -67 6 83 86 6 -102 -1
6067 -1 3 22 -11 -24 1 32 -133 107 -154 -41 175 137 -48 17 131 -29 -64 54 34 -194 106 40 -88 -67 -55
6092 -55 56 49 -72 -25 -119 -28 132 122 -27 24 6 67 64 147 -111 77 -79 95 -49 173 -42 4 -34 -182 -62
$$ packed form
5910a36K51r9pM4L0j28j19K53k8j45M4Q7n2J26L3n6j33O1j04QL9J29N9r4LK4j80
5937i0Ll5K5L1k9K4J68n3p8J5m5Q4mJ0K5k65L58r2j08j57J75L4j21K23L1k76J39
5964hJ4j05J57j12J17n9o6N6K3nn2k02K78km5J12l5j36P9Rj72P1J44j78P9lL9
5991bJ6k8k9M8p3O9QM0J12k62J61q6j20N9J72Q1j32J04k30J64o0k20K23O4p8J66
6017A67Mk4k50J92j41m6J31j90J79j55J81j09m0P2J43o3j81J80j13L5R2o7N6N2
6041A05o1q4Q1O7P7k77Q1J62k00J17N0r2M3j8N9j40q4J61j18MP3P7Lq0j08J01
6067aMJ9l3j3K5L1j65K40k61J13K16l8j85O5J14j60l5J18k0k28L00o6j28K1J2
6092e5J11pj21M7r4R1J60j0j49N1j8O1lQ3k58J88j56J74j44K22k15M6l8j48J20
$$ plain form
6117 -62 47 -1 99 -115 56 -40 68 100 -23 -7 -19 21 81 92 34 -37 -75 -97 65 21 -43 89 -81 110 171
6142 171 -32 -30 13 12 183 108 -32 -40 106 -52 125 -152 40 -67 -54 -37 116 48 13 -23 233 -70 71 -41
$$ packed form
6117f2J09m8J00k14J71r6J08L2j23J6j2M0O0J1n8p1l8k2J62m4o4J32j70J91O1
6142A71k03KM3jJ71p5j40qJ46j58J77k77J92j07J3J7J53o8l5l6K56l03J41j12
$$ [...]
8191H0
##END NTUPLES=NMR FID
##END=
