##TITLE=1H_DE-56_NaOH_2
 D2O
 8 sc, 
 5.7.2024
##JCAMPDX= 6.0         $$ Bruker NMR JCAMP-DX V2.0
##DATA TYPE= NMR FID
##DATA CLASS= NTUPLES
##ORIGIN= UXNMR, Bruker Analytische Messtechnik GmbH
##OWNER= root
$$ XWIN-NMR		Version 3.5
$$ Fri Jul  5 14:26:15 2024 Russian Standard Time (UT+4h)  she@DPX200
##.OBSERVE FREQUENCY= 200.1314
##.OBSERVE NUCLEUS= ^1H
##.DELAY= (6, 6)
##.ACQUISITION MODE= SIMULTANEOUS
##.ACQUISITION SCHEME= undefined
##.AVERAGES= 8
##.DIGITISER RES= 18
##SPECTROMETER/DATA SYSTEM= spect
##.PULSE SEQUENCE= zg30
##.SOLVENT NAME= DMSO
##.SHIFT REFERENCE= (INTERNAL, DMSO, 0, 15.7039)
##AUDIT TRAIL= $$ (NUMBER, WHEN, WHO, WHERE, WHAT)
$$ ##TITLE= Audit trail, XWIN-NMR		Version 3.5
$$ ##JCAMPDX= 5.01
$$ ##ORIGIN= Bruker BioSpin GmbH
$$ ##OWNER= she
$$ F:/spectra/data/she/nmr/H-F/1/audita.txt
$$ ##AUDIT TRAIL=  $$ (NUMBER, WHEN, WHO, WHERE, WHAT)
(   1,<2024-07-05 14:24:56.14 +0400>,<she>,<DPX200>,
      <created by zg, POWCHK disabled, PULCHK disabled
       configuration hash MD5:
       00 E9 B6 7A A2 85 ED C7 34 08 36 98 17 FE 4E 26
       data hash MD5: 16K
       26 D7 2F E4 93 5F 46 4B 41 3F A6 CD D6 87 6A 22>)
$$ ##END=
$$ 
$$ hash MD5
$$ 61 B8 F1 FC EF 80 37 19 F3 52 F4 16 CC 83 3B 2A
##$RELAX= 
##$RELAX= 
##$RELAX= 
##$RELAX= 
##$RELAX= 
##$RELAX= 
$$ Bruker specific parameters
$$ --------------------------
##$DU= <F:/spectra>
##$EXPNO= 1
##$NAME= <H-F>
##$PROCNO= 1
##$TYPE= <nmr>
##$USER= <she>
##$AMP= (0..31)
100 100 100 100 100 100 100 100 100 100 100 100 100 100 100 100 100 100 
100 100 100 100 100 100 100 100 100 100 100 100 100 100 
##$AQSEQ= 0
##$AQ_mod= 1
##$AUNM= <au_zg>
##$AUTOPOS= <>
##$BF1= 200.13
##$BF2= 200.13
##$BF3= 200.13
##$BF4= 200.13
##$BF5= 200.13
##$BF6= 200.13
##$BF7= 200.13
##$BF8= 200.13
##$BYTORDA= 1
##$CFDGTYP= 0
##$CFRGTYP= 5
##$CHEMSTR= <none>
##$CNST= (0..31)
1 1 145 1 1 1 1 1 1 1 1 1 1 1 1 1 1 1 1 1 1 1 1 1 1 1 1 1 1 1 1 1 
##$CPDPRG= <>
##$CPDPRG1= <>
##$CPDPRG2= <>
##$CPDPRG3= <>
##$CPDPRG4= <mlev>
##$CPDPRG5= <mlev>
##$CPDPRG6= <mlev>
##$CPDPRG7= <mlev>
##$CPDPRG8= <mlev>
##$CPDPRGB= <>
##$CPDPRGT= <>
##$D= (0..31)
0 1.2 0 0 0 0 0 0 0 0.06 0 0.03 0 0 0 0 0.0002 0 0 0 0 0 0 0 0 0 0 0 0 
0 0 0 
##$DATE= 1720175095
##$DBL= (0..7)
120 120 120 120 120 120 120 120 
##$DBP= (0..7)
150 150 150 150 150 150 150 150 
##$DBP07= 0
##$DBPNAM0= <>
##$DBPNAM1= <>
##$DBPNAM2= <>
##$DBPNAM3= <>
##$DBPNAM4= <>
##$DBPNAM5= <>
##$DBPNAM6= <>
##$DBPNAM7= <>
##$DBPOAL= (0..7)
0.5 0.5 0.5 0.5 0.5 0.5 0.5 0.5 
##$DBPOFFS= (0..7)
0 0 0 0 0 0 0 0 
##$DE= 6
##$DECBNUC= <off>
##$DECIM= 24
##$DECNUC= <off>
##$DECSTAT= 4
##$DIGMOD= 1
##$DIGTYP= 9
##$DL= (0..7)
0 120 120 120 120 120 120 120 
##$DP= (0..7)
150 150 150 150 150 150 150 150 
##$DP07= 0
##$DPNAME0= <>
##$DPNAME1= <>
##$DPNAME2= <>
##$DPNAME3= <>
##$DPNAME4= <>
##$DPNAME5= <>
##$DPNAME6= <>
##$DPNAME7= <>
##$DPOAL= (0..7)
0.5 0.5 0.5 0.5 0.5 0.5 0.5 0.5 
##$DPOFFS= (0..7)
0 0 0 0 0 0 0 0 
##$DQDMODE= 0
##$DR= 18
##$DS= 0
##$DSLIST= <SSSSSSSSSSSSSSS>
$$ [...]
##$SUBNAM2= <"">
##$SUBNAM3= <"">
##$SUBNAM4= <"">
##$SUBNAM5= <"">
##$SUBNAM6= <"">
##$SUBNAM7= <"">
##$SUBNAM8= <"">
##$SUBNAM9= <"">
##$SW= 24.0689651099613
##$SWIBOX= (0..15)
0 0 2 0 0 0 0 0 0 0 0 0 0 0 0 0 
##$SW_h= 4816.95568400771
##$TD= 16384
##$TD0= 1
##$TE= 0
##$TE2= 300
##$TE3= 300
##$TEG= 300
##$TL= (0..7)
0 120 120 120 120 120 120 120 
##$TP= (0..7)
150 150 150 150 150 150 150 150 
##$TP07= 0
##$TPNAME0= <>
##$TPNAME1= <>
##$TPNAME2= <>
##$TPNAME3= <>
##$TPNAME4= <>
##$TPNAME5= <>
##$TPNAME6= <>
##$TPNAME7= <>
##$TPOAL= (0..7)
0.5 0.5 0.5 0.5 0.5 0.5 0.5 0.5 
##$TPOFFS= (0..7)
0 0 0 0 0 0 0 0 
##$TUNHIN= 0
##$TUNHOUT= 0
##$TUNXOUT= 0
##$USERA1= <user>
##$USERA2= <user>
##$USERA3= <user>
##$USERA4= <user>
##$USERA5= <user>
##$V9= 5
##$VALIST= <valist>
##$VCLIST= <CCCCCCCCCCCCCCC>
##$VD= 0
##$VDLIST= <DDDDDDDDDDDDDDD>
##$VPLIST= <PPPPPPPPPPPPPPP>
##$VTLIST= <TTTTTTTTTTTTTTT>
##$WBST= 1024
##$WBSW= 4
##$XGAIN= (0..3)
0 0 0 0 
##$XL= 0
##$YL= 0
##$YMAX_a= 133394
##$YMIN_a= -159669
##$ZGOPTNS= <>
##$ZL1= 120
##$ZL2= 120
##$ZL3= 120
##$ZL4= 120
##$ABSF1= 10
##$ABSF2= 0
##$ABSG= 5
##$ABSL= 3
##$ALPHA= 0
##$AQORDER= 0
##$ASSFAC= 0
##$ASSFACI= 0
##$ASSFACX= 0
##$ASSWID= 0
##$AUNMP= <proc_1d>
##$AZFE= 0.1
##$AZFW= 0.1
##$BCFW= 1
##$BC_mod= 2
##$BYTORDP= 1
##$COROFFS= 0
##$CY= 11.3945322036743
##$DATMOD= 1
##$DC= 2
##$DFILT= <>
##$DTYPP= 0
##$F1P= 15.6554695791079
##$F2P= 12.8336369535428
##$FCOR= 0.5
##$FTSIZE= 0
##$FT_mod= 4
##$GAMMA= 1
##$GB= 0.15
##$INTBC= 1
##$INTSCL= 1
##$ISEN= 128
##$LB= 0.24
##$LEV0= 0
##$LPBIN= 0
##$MAXI= 10000
##$MC2= 0
##$MEAN= 0
##$ME_mod= 0
##$MI= 1.114404
##$NCOEF= 0
##$NC_proc= 0
##$NLEV= 6
##$NOISF1= 3.799351
##$NOISF2= 2.8
##$NSP= 1
##$NTH_PI= 0
##$NZP= 0
##$OFFSET= 15.70392
##$PC= 1
##$PHC0= -25536.52
##$PHC1= 20.98748
##$PH_mod= 1
##$PKNL= yes
##$PPARMOD= 0
##$PSCAL= 0
##$PSIGN= 0
##$REVERSE= no
##$SF= 200.130013532006
##$SI= 16384
##$SIGF1= 3
##$SIGF2= 2
##$SINO= 400
##$SIOLD= 16384
##$SREGLST= <1H.CDCl3>
##$SSB= 0
##$STSI= 0
##$STSR= 0
##$SW_p= 3612.71676300578
##$SYMM= 0
##$S_DEV= 0
##$TDeff= 0
##$TDoff= 0
##$TI= <>
##$TILT= no
##$TM1= 0
##$TM2= 0
##$TOPLEV= 0
##$USERP1= <user>
##$USERP2= <user>
##$USERP3= <user>
##$USERP4= <user>
##$USERP5= <user>
##$WDW= 1
##$XDIM= 8192
##$YMAX_p= 0
##$YMIN_p= 0
$$ End of Bruker specific parameters
$$ ---------------------------------
##NTUPLES= NMR FID
##VAR_NAME=  TIME,          FID/REAL,        FID/IMAG
##SYMBOL=    X,             R,               I
##VAR_TYPE=  INDEPENDENT,   DEPENDENT,       DEPENDENT
##VAR_FORM=  AFFN,          ASDF,            ASDF
##VAR_DIM=   8192,          8192,            8192
##UNITS=     SECONDS,       ARBITRARY UNITS, ARBITRARY UNITS
##FACTOR=    0.0002076,     1,               1
##FIRST=     0,             0,               0
##LAST=      1.7004516,     0,               0
##MIN=       0,             -159669,         0
##MAX=       1.7004516,     133394,          0
$$ Real data points
##PAGE= N=1
##DATA TABLE= (X++(R..R)), XYDATA
$$ [...]
1834A27o63R9P36M23o00o81J8O14P77n22o02l79Q89L36J16j018m18L16P84N00
1854H52p84m38r3O74M85k59p62n06R55O04n45n74l34M23Q72o9q53k78K10R61K10
1875G51n88r60J43Q73O89n38o31n02P56Q87k37j015m06K12J179K38p18p99J77
1894d89Q71M05m91j117J73Q01M32j39p80o16Q70O55L9q33o88M32R44K17k61r28
1914e03j64J061K49k12q65k06M03Q25j1p33n53L12J081L6o48m22k8O67M23m07
1934C05r59k7O39R21m29r85k42N89R69j62p93m59R3R38j12m72l45R4L63P49m32
1955B43o84k1N20O18j76q20m23N44Q89j39m31p06L25M24L96l63q14J16L63Q49
1975G10m62o29j98N68Q42k99p25m43M87M71K58o51n97K07O77N62o83p46J92M75
$$ y = [127, -536, -437, 299, 722, 122, -559, -541, 73, 850, 328, -274, -653, 236, 572, 688, -330, -748, -432, 352, 852, 68, -370, -463, 211, 696, 437, -325, -831, 124, 728, 183, -391, -725, -302, 570, 501, -352, -630, -420, 541, 751, 163, -797, -654, 219, 908, 370, -261, -763, -7, 880, 643, -372, -778, -566, 613, 851, 133, -666, -489, 382, 787, 296, -821, -648, 153, 585, 446, -334, -950, -80, 575, 614, -219, -907, -475, 469, 686, 425, -503, -667, 394, 643, 431, -434, -640, -237, 588, 577, -156, -709, -397, 684, 720, 72, -350, -378, 289, 712, 305, -654, -681, -42, 879, 450, -535, -777, -188, 781, 619, -174, -633, -540, 398, 286, -186, -531, -437, -74, 675, 243, -441, -462, 58, 676, 500, -320, -743, -199, 690, 551, 120, -586, -261, 163, 559, 196, -618, -502, -139, 710, 248, -381, -579, -11, 831, 532, -193, -636, -149, 322, 580, -71, -668, -461, 216, 778, 95, -651, -459, 16]
1995A6N20l47o84l82O36P83j67p09k72Q0P20L19j47q22j24Q30L04r1q07l00M94
2016a50Q01k49m31m53J37P33J68m77o46M08L38K36j53q25l14P50Q50m92n06k87
2036e62L63M69K15l98q38L95Q04j53p9p49j03R15M07p18l67J22J09O64j19n49
2056a72l75N65M86j67l96l52R1M48O29p74l43j8M65N93l46p15j23J80Q76M4o55
2077e9k82L13L88P0k61o89J46M07M18j68o82k98P84N25r6j152j15Q31M45O0o07
2098b2n98K72Q07K86q07m47Q8N68J32N5r15j14N32O48j12p76j41M97N03j07o38
2119b89j88K24O22M6j13q21j81N66N72J35p65l50L95O46k08l50j57K43J08J15
2139B50j37l95K3M85R0j38m91j25M74L80K6q77R2M14K33J11n09m35L5O52K94j23
$$ y = [16, 536, 189, -495, -877, -241, 542, 375, -334, -606, -526, 194, 513, 366, -456, -580, 250, 554, 463, -344, -644, -150, 651, 402, -29, -482, -345, 388, 556, 79, -567, -159, 179, 415, 262, -563, -877, -127, 723, 231, -275, -562, -199, 270, 485, 87, -751, -356, 448, 295, 216, -533, -636, 279, 686, -32, -399, -277, -168, 496, 377, -172, -547, 18, 504, 337, -59, -411, -320, 128, 757, -17, -360, -378, 87, 680, 334, -381, -504, -324, 552, 596, -59, -341, -28, 360, 430, 169, -520, -374, 33, 451, 283, -399, -697, 87, 612, 516, -636, -751, 80, 525, 585, -22, -620, -348, 459, 745, -62, -509, -421, 147, 279, 334, -581, -695, -163, 485, 373, -403, -544, -47, 456, 349, -289, -477, -253, 369, 415, 302, -519, -700, -134, 438, 573, -192, -542, -147, 499, 291, -59, -216, 27, 135, 250, 113, -282, -259, 226, 316, 178, -313, -438, 36, 416, 442, -435, -343, 71, 304, 415, -94, -529, -494, 158, 452, 329]
2161C29o44k29O14L88j19p89O8N02m6R7q6n64K78N54K28n02m34N2M20L91m74o97
2183f63L10M95R1M0k63k85J62L41J70o02k52r8P42LJ27n53p5M81K87k13j92m78
2205d25K29P89k36n37l68M41L87K7l05k17j70O95k53N0m77l9K77N66j65k86m33
2226d50N27L79j94q0p67M78M27M58p03n33J08M09N61k50n86l26P68m2J42m86P8
2247h2n8L53K09m60m72K68N64K37l76m26j75O34R0K2m50j58J06N23K0o72p5L20
2269e8O40k11l61m83J92L73J79l67q3k57L41K39P6n64L8L3O43j12k80l03J41K84
2291A00L00k02n17KN48J30Ln67l0jM58P8m71qN2J27L63l99j21J36j15K90k94o0
2315a98j97N62J62j57m25J64j26N95j14k59l27J43J99J54j98l67J98M95k0m10
$$ y = [329, -315, -544, 70, 458, 339, -450, -382, 120, 74, 171, 85, -479, -201, 353, 581, 79, -355, -303, 117, 508, 34, -663, -353, 142, 233, 273, 10, -275, -113, 228, 398, -204, -456, -554, 188, 191, 318, -235, -310, 171, 458, 245, 53, -425, -196, 593, 357, -180, -548, -107, 280, 307, 2, -215, -385, 310, 57, 107, -370, -409, -132, 434, 269, -17, -450, 77, 456, 262, 182, -585, -107, 320, 778, 75, -458, -350, 59, 620, 370, -216, -542, 226, 184, 326, -160, -82, -140, 213, 422, -38, -510, -242, 322, 559, 183, -243, -418, 216, 306, 328, -122, -280, -174, 349, 369, -303, -378, -58, 582, 371, 10, -473, -281, 92, 271, -96, -179, -436, -95, 144, 220, -344, -306, -273, 370, 258, -22, -325, -184, 100, 400, 198, -319, -317, 231, 361, 364, -203, -233, -234, 224, 302, -169, -177, -125, 2, 365, -34, -155, -19, -134, 156, -138, -198, -395, 167, 329, 172, -253, -89, -215, 380, 266, 7, -320, -177, 22, 176, -22, -389, -191, 304, 284, -126]
2335a26l7lK08P2K72l45j84j10O57j86j73n16N44J62R4K6m82o0L75N7k28j44k93
2358d20K40N12p0m35l04K69N20L10m49n84n4O01P1j77k03q2L92L7O2m11j42J8
2380b99N84Nk22n46K73L05L32k90k32j19L19K19J38q20N8K61L60M1k54k71J9M86
2402C47l91r8L8K6K23J99j52l28L7K17L92l88m6j79J6L32o7k01j9J58L8K7m40
2425b59O3M1L80J4J7l99j08J60R4K57m78K56k86O74j66m30MJ30J76J74l48j6K
2448d8j14L85p0r0k74P9J66K4k36Q6k0L13l54K55j70j51J66L23l74Q7r6J08R6
2471I1N7j00j50q2J92j74J06q4Q4M87n5k25k38J15k40K15J66l30L9N2L61l11m39
2494d63K30K19J35N5o1l72L15k91L53j46l52LO37j68J71l83N2k1J78J59k42m0
$$ y = [-126, -163, -166, 42, 114, 386, 41, -143, -253, 404, 218, 45, -471, 73, 235, 329, 355, -127, -187, 188, 245, 17, -127, -420, -180, 332, 262, -173, -477, -208, 312, 622, 173, -411, -465, 136, 207, 30, -173, -255, 137, 174, 236, -175, -317, -299, 285, 290, 68, -478, -205, 100, 432, 142, -90, -209, 110, 329, 467, -353, -295, -34, 326, 367, 113, -158, -139, 347, -44, -142, -104, -78, 145, 344, 192, -136, -99, 118, 510, 122, 76, -103, -87, 245, 178, -23, -42, 116, 154, 181, -259, -196, -155, 225, 239, 256, -143, -251, -91, 3, 260, -218, 38, -248, 426, 260, -170, -166, -36, 140, 314, -34, -50, -48, -162, 223, 153, 63, -211, -132, 34, 58, -178, -92, -112, 201, -153, 102, -68, -219, -53, 270, -104, -17, -113, -5, 91, 148, 48, -102, -184, 8, -166, -60, -144, -60, 427, 372, 147, -91, 24, -216, -1, 165, -165, -126, -74, 287, -24, -463, -233, -14, 121, 176, 115, -257, 58, -233, 120, -26, -378, -375, 262, 94, 265, -118, -66, -87, 91, 250, 8, -32]
2516c2J81l6J43l03k10j48L11K87j46j17j36j6M53J09m49k06N6M44N2l03j65J10
2538a21L59K5j03j35l55M29M3J2j10j75j38N49p1k45j00J25jK51j52j90L7J29
2560F3J67j32j50N1K97k58K59k73k79J37R7K01k74k38K99J99J66k54k42j75O34
2581B95l12l3R1k29J12J37j03j18K5r3M12j66K3L4j55j4K36l42L5L00k51R3J57
2604A34k50J39j01K6K87l23j87K49P1j1K9M8l39K66K73j75k66Q8j25L29k9j70
2626c7K33l28o2J72K56k97j78K62L58n85Q0J53j77K87l39J46j65l3K40P7k17Q8
2648f6k83L96L9M7j94k43L59J54J10l85j32K56o2K36m84J80mK69k52j79k1K75
2670A6J42J59m48q0l0N93k08o9j21j86J34K36J31k79j71M9J06lL8j71J29JJk36
$$ y = [-32, 149, 113, 256, -47, -257, -405, -94, 193, 47, -70, -206, -222, 231, 340, -109, -315, -259, 185, 237, -66, -231, -121, 238, 263, 160, 25, -330, 99, 142, 154, 44, -131, -269, 280, 209, -36, -136, -11, -12, 239, 87, -103, -66, 63, 230, 98, -52, -1, 296, 38, 297, 24, -255, -118, -21, 180, -94, -332, -33, 166, 332, 78, -164, -339, 295, -17, -50, 41, -188, -76, 61, -42, -160, -135, -228, 184, 18, 41, 75, -80, -94, 142, -200, -165, 135, -116, -23, 134, -116, 23, -78, -52, 235, -88, -275, -26, 45, 34, 63, 111, -228, 38, 311, 136, -130, -42, -167, 162, 133, -37, 196, -132, -194, -22, 234, -63, -241, 21, 379, -206, -126, 27, -150, 137, -202, -56, -221, -254, -14, 63, -154, -66, -349, 47, 86, 133, -61, -304, 55, 209, 319, -66, -198, 58, -4, 232, -252, -72, -76, 193, -59, -238, -259, 16, 158, 317, -131, -211, -241, 352, 144, 75, -46, -232, -98, 138, 269, -10, -181, -132, -26, -29, 9, -162, -33, -32, -31, -267]
2694b67L08k5k76L26j14r3k61M39O3M4k77j14J64j9J07m3l8k73K23K79pm28J24
2717a58K32K74k56j89L5J85j01Rj5q3m7M1Q1K64l64k9J25j88M96k06R7l12j0r7
2741b16QNN3K22R6j05m19M92k63J07K84k18k60J76j1L13j11l43J4L66K17l16j84
2764i3K9j19K81j04k80J51l7L65l29J4K2O6o3pJ99l18J05Q8J36l29P2O8nJ13M7
2789G2j1k89J64M00l44O2m16M64R8j1j96j40J28J61j24J88m55O1L3L19K39m92
2811h9j20K49j09J18l40L32j68L63j78j51rjP0J38j59K10j9m0r1O6K40m20j14
2834b22L76L1k6k55J5qK59k70k38K25J95k65J33l9J0J01J02J7j42k02m6L09K35
2857B95l83J58P5k12o1J13l1m26N02J27J51l25N0Mm5P8j93K3J17L10K5l10j36
$$ y = [-267, 41, 16, -260, 66, -48, -141, -402, 37, 100, 144, -133, -247, -83, -102, 5, -38, -76, -349, -126, 153, 146, -282, -158, 74, 348, 92, -97, -62, 123, 22, 31, 16, -67, -114, -73, 8, 272, -92, -121, 4, -184, 312, 106, 203, -109, -119, -216, -208, -203, -150, 72, 168, 63, -356, 136, -127, -20, 264, 46, -214, -38, -49, 264, 153, -190, -176, 190, 407, 91, -93, -64, -183, 98, -6, -286, -135, -172, 193, -136, -122, -100, -34, -97, -104, 95, -223, -118, -30, 106, -223, -151, -83, -88, 25, 72, 61, -228, -64, 336, -8, 54, -362, 102, 200, 189, -7, -147, -19, 142, 18, 206, -249, -188, -155, 164, 403, -89, -209, 40, -69, 49, -291, 41, -127, 236, 58, -93, -102, -103, -33, 105, -54, 156, 137, 97, 6, 72, 312, -108, -222, 154, 185, 159, -96, -81, -89, 170, -100, -338, -113, 82, -183, -50, -89, -79, 22, 124, 141, -1, -203, -249, 60, 295, -88, 70, 145, -67, -128, -15, -46, -472, 30, 157, 308, -17, 33, 37, -8, 70, -123, -100, 17, 327, 352, 42, -94]
2880i4j16K40J90Rk54q7k24L70l5m6j37J32J68j72J82l70M15l0J47o2m54M50l84
2903a62J10Q3j27J92l55R7K83qo2j42P4L20l35L28l89J77ok27K97q5k07J22r2
2926a14J88j11r1l0K47j71o8j01K45J57o1j16R4p6j21N7k57K92q3K18j20J65p9
2949F4OJ81r3l69J37RM3K72m2J11m99K09j22j16j0j24K64J44R6q2m01L71m0J01
2973A10L5k40J03m8N4K67l05n2l8R3J55p2k35M6J23K04k6r8m38L31J96k41K19
2996A43l34K02K23k7k16kp4J21j48N45o14M4Q6J36M1j93j30L36J31k44j23k3K5
3019i5N3J66j21N6j66J46q3K69l00l86K63R2J19jN5k08K96N6l54J99rk10J62R3
3043I2j15J41m42M00j68L0J79j46Om9J64J39m09P3J66j62M27k86J19l7k11k5O4
$$ y = [-94, -210, 30, 220, 229, -25, -112, -336, 34, -1, -47, -184, -52, 116, -56, 126, -244, 171, 141, 288, 226, -228, 222, -162, -52, 31, -96, 96, -259, -162, 121, 113, 51, -91, -17, 303, -32, 296, -93, 84, 78, -149, 148, 63, -144, -22, -114, 74, -37, -128, -158, 89, -82, -150, -251, -6, 151, 90, -26, 68, -8, -129, -72, -329, -37, -120, 98, -22, 143, 64, 70, 251, 158, -211, -74, -65, -22, 250, 208, 319, -180, 29, -93, -209, -219, -343, -79, 65, 161, 79, -322, 49, 9, 110, 145, -95, 8, -40, 14, 281, -24, -76, -114, -21, 134, 62, -173, -127, -4, 200, 174, 76, -362, -31, 165, -76, 143, -191, 11, 234, 207, -9, -11, -85, 36, -112, 433, -181, -137, -51, 85, 126, -67, -197, 139, 270, 26, -97, -120, -95, -42, 124, 3, 59, -107, 39, -44, 225, -75, -461, -198, -106, 13, 12, 67, -141, 155, 211, -143, 56, 47, -163, -1, 92, -23, 118, -324, 76, -92, -62, 117, -29, -23, -72, 92, 231, -178, -105, 61, -101, 326, 40, 159, 122, -89, -114, -50]
3066e0R6j03O9k23M39j03or4o6O8K07q4j73j27K3K01r4J44l25J99p7j44L70k64
3090a17%L94k62J39m1j93l3j24M74pj16j15j40k30L15J15k59L8K6J37j25K12j41
3113e3N1P9J23k80J76j26K34o7k80J77j61J74j17l9Q5k80K54K40j16j47O8k3L77
3136C49l17k10K22j66O1q8L20l51K69pr3L71k99k20K9K23o5n5k52J60J8J49R4
3159A42l15K21j37q5M08o43J73J32L03P5k37m96M4N63M7j43j42NK97j29l9J25
3181A69k08J4L8P8P0k57J90r4ro2j43L21m6J36j28k36k9J80J41oJ1k18J51K01
3205B64k82k70L06j28K55j93J69jj67K09J43l08k09L6J5K91Pk24Q8j10J7J95j48
3228d5r9M30j65qK3k38J77r5O6k61K46j48P7J32j19n7J05r8J44r6oJ34j88J43
$$ y = [-50, 46, -57, 12, -211, 228, 125, 119, 25, -41, 27, 234, 150, -23, -150, -127, 74, -20, 124, -201, -2, -79, -223, 147, -117, -117, 277, 15, 154, 113, -80, -113, -237, 237, 230, 114, -1, -141, -371, -56, 59, -200, -162, -136, 1, -124, 88, -53, -2, 77, 200, -80, 96, -30, 204, 137, -143, 34, -127, 47, -70, -109, -24, -304, -50, 190, 74, -73, -5, -28, 349, 32, -178, 44, -122, -61, -149, 171, -180, 89, 82, -11, 360, 61, -159, -130, 93, 28, -27, -279, -119, -101, 48, 142, -173, 48, -89, -174, 234, -409, -236, -104, 199, 274, 37, -459, -415, 148, 195, 52, -90, -85, 212, 83, 44, 169, -39, -25, 13, 91, 161, -96, 94, 0, -9, -71, -214, 107, 61, 197, 69, -167, -196, -16, 125, 119, 130, -88, 63, 264, -18, -288, 18, -110, 145, -48, 121, 120, -47, 162, 305, -3, -212, -176, -161, 130, 137, -87, 1, -109, -92, 103, -45, -144, 286, 121, 113, 136, -102, 75, -20, 46, -215, 31, -117, -40, 92, -27, -84, 21, -77, 67, -29, -35, 99, -89, 54]
3252E4j51K74m4n2k59J77j14O3j13J23K2J53l08l1J84L8J23j57p2O5q0l06L32
3275g9L3QJ70j27L1k70j5J62L23k00J57J50l83J12k31K56k36K14n3o7j2j40K15
3298A8j19kJ14j30M3L70k67Mk64J87J08oL7j65J49N8L0j7p8k92J20K64nk40k55
3323c38K84M05j56k41m1J18j19M12k97plK9K34k48K08k40L8K37k88q7Q8k19K93
3346F2Pk81N3L3j23L68jj30o3R0J82m17K22K07l51j4K86rj63L04k16p7R9k50M14
3371B32l28J82r8j49j69L7K53Q5M8m3Q2K30j61l98J52k6K16J2k35j59M1Q3k48
3394c61N09j05o5QM7K0J5r5n2K24j68J14j60j17J46Q3J15q7o4J22J45j62j87K2
3418e3L0Qm7K4O6J79l92K70K1l99L17j47O9J07k20J14o6l6K00j28mR0j08K12o6
$$ y = [54, -97, 177, 133, 81, -178, -1, -115, -52, -165, -42, -20, 133, -175, -206, -22, 16, 139, -18, -90, -25, -105, -411, -79, -46, -38, 132, 5, 36, -234, -249, -87, 236, 36, 193, 343, -40, 72, -159, 97, -139, 75, 22, -45, -57, -197, 18, -101, -103, 11, -119, -76, 294, 27, 31, -233, -46, 62, 56, 93, -72, 77, 135, 165, 148, 70, -222, -102, 162, 157, -83, -338, -54, 351, 195, -46, -87, 31, -88, 324, 27, 20, 17, 46, 280, 32, 240, 0, 38, 275, -13, -100, -12, -231, 62, 69, -212, -159, -126, -249, 119, 118, -12, -75, 15, 197, -220, 2, 209, -142, -156, 130, 121, -42, 262, 46, -31, 68, -182, 232, -96, 86, -12, -161, -330, -293, -40, 45, 93, 50, 132, 362, 201, -197, -45, -71, 145, 157, -78, -237, -196, -113, -361, 148, 43, -22, -14, 33, 53, 68, -27, -79, 145, -23, 91, -69, -186, -40, 43, 158, 71, 7, 129, 274, 112, -75, -53, -23, -15, -62, -38, 28, 207, -185, 85, 106, -293, 24, -123, -54, 53, -167, -53, -119, -155, 45, -83, -87, 3, -105, 107, 41]
3443D1j61R8p1J48k20J37K64q6j08j99J85R9k67Q4Q8p3k23K75J49l51K40j11j5
3466g7n3L18m2q0m49N91j80J49k33J94P3l04L8M6j62L33n3j98o6K85j11J22j76
3489c5L7O0j45n3N8j07O9q4M08k71J00j2o5J19k4p7J44j02QQ0q9j36J16k24J73
3514e2j91l6K26r4L19l22J99j67K23j37N5J41j3o1k90P9J45O5Q7k50N2j54N0O2
3538f4N9J00j50J31J45l20R1K58l56K09lj89K60k36r4L6R7M23m53K12k5J28k72
3561a3j0J4K6L9k80K36J61k33j91L04m8J8pO0j64r3L96l40j86K64OQ7O7o8j2j53
3587a20k5J88m7J9P2n0j5qJ22p4j82OJ85j44J89q2pnJ40nj37j08p6K32o3j02j27
3614b24K70o9j00j08J85J05J71k90J17M0k12J26Q5l66N7K41R7K8m73K65r2Q9m
$$ y = [41, -120, -22, -93, 55, -165, -28, 236, 150, 42, -157, 28, 127, -140, -56, 32, -41, -264, 11, 160, -191, 49, -62, -77, -130, 188, 146, 66, -383, 208, 28, 177, -56, 138, 211, -93, -55, -9, -171, 162, 109, -89, -155, 130, 19, 141, -35, 2, 62, -83, -136, -78, -185, -116, -200, 208, -63, 37, 25, -40, 79, 55, -22, 122, 20, 28, 108, 19, -117, -1, -225, -52, -243, -279, -53, -147, 172, -150, 49, -118, 105, -32, 23, 164, 151, 90, -200, -121, 24, 89, 176, -74, -22, -176, -126, -64, -5, 95, -55, 76, 221, -99, -8, 250, -106, 103, 100, -89, 171, -65, -159, -123, -26, 397, -56, 156, 131, 259, -13, -23, -9, 17, 56, -224, 12, 173, -60, -251, 53, 5, 23, 16, 76, -88, -181, 215, -125, -311, -47, -41, 46, 113, 45, 33, -120, -145, 43, -4, 15, 87, 37, 22, 14, 136, 62, -120, -114, 71, -73, 116, 34, 27, 22, 162, 157, 20, -88, -164, 68, 5, -97, -224, 46, -23, -123, -231, -46, 59, 230, -60, 57, 97, -115, 11, 96, -270, -213, 28, 125, 153, -320, -55, -147, -58, -62]
3637f2j03J95J08k0j68J19j46M3J12k67M54j89M7rm3j82n9O7O1J66p5L5j36M5
3661gm5j74J97Q2l4o4o4J81j37L55m97m3J24j37L06j66P3Q6K7j70M84l58j49J56
3685B6k12K75k35K19M2k26J15lJ0J15o4j02J5L3j54M5K08l07J38M7j87O49m24
3708B3j43K40j24k45p4J66J53j39K91k29J08N5Qj79K4J84p3J4n6l0J1j64R7l0
3732a12J98R7k3k82K5pL16l23OK09j54K03j31j89J61P4j33L7k33J21M17m80K1
3755a82K76k73J84M5J08l94K73p2J42m7l2j56K89m9l15J02K4R0m2j2j40J33nL
3779e0j26K30j39J95k29K93j94r6j22Q9J19J36K9j78j23K04P3l57K98J4J97m4
3801B19k47j9l33N22k26J0m7o1J10j37Q3r2K90j11J66j74j91L58j25Nj71K87j71
$$ y = [-62, -165, 30, 138, 118, -50, 69, -77, -34, 78, -189, 265, 76, 123, 114, 71, -111, -170, -103, -42, 124, 49, 84, -52, -7, -52, -226, -29, 53, 19, -45, -109, 72, -65, 290, -207, -250, -126, -263, 43, -123, -50, 36, 63, -107, 377, 19, -130, 26, -186, 89, -146, 73, 115, -111, 4, 1, 11, 126, 62, -40, -25, 8, -146, -101, 107, -200, -62, -15, -202, 447, 23, -120, 120, -4, -249, -323, -157, -4, -143, 148, -81, 27, 82, 90, -89, -65, 119, 46, 60, 4, -26, -15, -179, -82, -112, 86, 183, 160, -122, -97, -104, 212, -111, -105, 104, -50, 153, 22, -167, -6, 68, -65, -28, -261, -140, 277, -203, -182, 94, -179, 5, 50, 158, -236, 37, -35, 107, 60, 28, -128, 161, 112, -203, -101, -77, 13, -29, -41, -181, -48, -53, -50, -176, 54, -85, 110, -119, 174, -20, -116, -238, -149, -30, 106, 135, -43, -166, 38, 111, -246, 52, 66, 263, 219, -28, -47, -380, 142, -84, -74, -121, -182, -72, -209, -126, -218, 72, -39, 127, -47, -238, 120, -5, 0, -171, 116, -55]
3824e5l0k08N90k72J93j80J47L5j90J52l26P6j58K41j55J42J24k62O6L04j48O8
3846A54j57J40l33L24k81j87M16n4mK12j95j2k09J94j2L3J02J1k75j02J74k0J49
3869F8j55p9J03j50R7J30JJ67k48L8qP5J74j46l3k65K80k74K64L2j77K37q5l64
3893c18L47k9j03K08k75K18k20K39l3p1r0K4J24J66k76K6M21l04j03K98R4n30
3915a87K82k0l35M39j56k53J85j21K4L3O8M6pk03J20n2K9R3L6r0NJ08p2L52k26
3940I8j09k19L20Q1j82Q7j08j43J89q1J41j85J30k01J23K22k41l59O17l04L2L80
3962B88j84j09l6R0o9k19J92j1L1M00k06l79N72k12j45r5K49m4k31J41l67Q0M82
3985B18p5k03j99K50J59J28o7j11J12k38J82m8j76pK00j64J64j06p5M3O2K33k49
$$ y = [-55, -85, -293, 297, 25, 218, 38, 185, 220, 30, 182, -144, -68, -226, 15, -140, 2, 126, -136, -70, 234, 86, 154, -3, 137, -196, 128, -153, -340, 76, 22, 18, 230, 35, 23, -186, 8, -4, 29, 131, 142, -133, -235, -61, -81, 68, -87, -166, -63, -213, -116, 14, 15, 182, -66, -28, -36, 39, 213, 67, 34, -231, 49, -225, 39, 71, -106, 131, 46, -318, 29, 0, -103, 105, -170, 48, -172, 67, 34, -37, -127, -103, 21, 187, -89, -63, 358, 54, -49, 249, 343, -187, 95, 75, -260, 179, 23, -230, -45, -166, -142, -109, -41, 5, -2, -205, -85, -137, -108, -15, 21, -69, -64, 44, -28, 324, 98, -11, -230, 90, 171, -11, 76, -32, -175, 14, -67, 74, -111, 19, -182, -59, 163, -78, -437, 180, -124, -92, 288, 104, -5, -41, 49, -20, -239, -47, -58, -27, 373, 167, -212, 360, 148, 3, -92, 157, 113, -118, 23, -344, -264, 218, 143, -60, -259, -9, 150, 278, 211, 100, 212, -26, 156, 108, -68, -75, 125, -39, 125, 19, -56, -13, 49, 282, 33]
4008C3p1k22M00k46P2Qk0j78L75j77J4K20j84K00k71Q1K04m66N77m17K48l20N5
4031h5K37j16q0j1K4J85k70j50M79j95j92J71J94k23L19k13j31J36RJ02r5k30
4053a35m8KK70j34R3j96OQ0m8J15J37n1q1j73J39P4O1j23p9K2K19J08k47J9O2
4078I2j53j69J1M52k21mK85j22k26M81j82j5k33M6Mj21M42m71L24k93j32l3J68
4101g0J39j53qp7J32R4j36Nj22J04LoQ5j60K93j81m5L15j36j63R5J50p1k00J9
4126i4J53r1j21J43l2J78j22J34j79J22m5j94M43j85k67N4OK2l9P1J03k6j19K41
4150A56k04K51k08J01j0J43l29L00oj13J11l27K53O1k93P4m17M42j01K90j80j80
4172a86K92k28J15k0J50j51J02k9R2q6m2J22j8J9k52K34j80j21K43j01j40K57
$$ y = [33, -38, -260, 140, -106, -34, -26, -46, -224, 151, -26, -12, 208, 24, 224, -47, 34, 238, -228, 349, -68, 180, -140, -85, 152, 36, -44, -55, -31, 154, -116, -266, 213, 18, -174, -3, 191, -32, 287, 74, -57, 79, 88, 190, 95, -135, -183, -181, 89, -45, 48, -148, -142, -62, -110, 5, 142, 91, 10, -163, -24, 50, 111, -12, -91, -69, 150, 258, 11, 30, 92, -61, -230, -219, 233, 12, 8, 293, 171, -55, 426, 244, 229, -4, 42, 46, -75, 367, -104, 220, -73, -205, -238, -70, 69, -84, -92, -169, -37, 57, -79, -74, -196, -92, -89, -95, -10, -170, 123, -58, -103, 212, 76, -87, 8, 158, 87, -113, -94, 59, -32, -153, -10, -42, 136, 14, 148, -31, 91, 46, -148, 295, 110, -157, -103, -97, -75, -114, -43, 60, 34, -85, 156, -48, 203, -5, 96, 86, 229, -100, 200, 194, 81, 192, -135, 118, 179, -114, -40, -457, -15, -116, 174, -6, -186, 106, -122, -7, -27, 123, -28, 74, 45, 137, 51, 9, 131, 113, 132, -120, 114, -66, -187, 56, -45, -185, 72]
4194G2K56k91j50R1k04R7O1L39P5m03q8J14p1N0q9M70k03j39N5o5J38k55K23K5
4218A08j57n2k1J96q4J8qj82J46l07L90k41K31L1k4K50m57ON8J60k74M15l38K33
4242I7K13L6o4k99Q3o6L55q7l61P7J77r2K3k28L39j57K24k46k06J08lj17J18p1
4266a47K64k29n3R3K29n2k1l4L06l22p8q7j34K6K47N7qj03j21K27J56j78j30j16
4290b08L8J75J80k8k53J45k8J21l71Q3L20k8r1l28J77k4j08K60j61l9l2J03J8
4313g9p8L38p2K20k24j14O1k78K36L30r6l93M1k07L54M5j09k3j5K70n9m1j17K8
4337A8l7J68n7q4j77J81M3o1Rj03mO4L29k21j08j4J38K30k43k04K33K16j18L9
4361B37n7l79K47j25J13k1j48J9Q1J73k09m9K73j17J41j44K7j30j60O22l60O6
$$ y = [72, 328, 37, -113, -22, -226, -129, -68, 271, 346, -57, -145, -31, -102, -52, -141, 329, 126, -13, 42, -23, 115, -140, 83, 108, -49, -101, -122, 74, -10, 8, 0, -182, -36, -343, 47, -194, 37, 68, 44, 294, -163, -157, -99, 61, -213, 202, -136, 97, 310, 346, 282, -17, 66, 0, 355, 268, -93, -16, 161, 69, 92, -136, 203, 46, 270, 24, -182, -74, -77, -194, -76, -147, 117, -112, -165, -72, 157, 105, 84, 50, 356, 34, -44, -131, -265, -239, 8, 65, 57, -46, -167, 60, 216, 38, -92, -208, -170, 5, 185, 157, -96, 49, 21, 142, -229, -146, 174, 146, 55, -273, -96, -120, -228, 32, -129, -168, -200, -97, -79, -157, 181, 109, 329, 105, -9, 52, -226, 10, 340, 244, -149, -108, -315, 39, 84, -25, -48, -63, 207, 148, 107, -10, 18, -19, 149, 92, 8, -169, 12, 55, -6, 3, -100, -104, -40, 289, 68, -40, -54, 84, 314, 71, -133, 100, 316, 198, 237, 180, -199, 48, -77, 36, 15, -133, -114, -33, 140, -69, -118, 155, 38, 179, 35, 62, -68, -228, 394, 34, 100]
4383A00%L7n57M14j8l2P4k34L26l03K86J1q4J57k89j36P3K04M1j91J71R3k67M14
4407B90l13K29m48L42k71j37N07k80J24k36K30j03K16l6j92K62J88k44m0k21J29
4428dj89K60r3R1Mk09J38o2K7J1N4L1j80k0J18j74K98l3J1j09j91K35RJ77k47
4453d7q8J72m6L4j4K00j98k73K92J98j05k06K54p8j89j66J04K26n5K56n76K22
4475h3N5l03O1J90K5j1K53n4l5k96J91QK8J6M9l55L82k27J12J80k36J08K53l94
4499h3j19rO6l6L41k67n4K09j61K36J25k00P6j27m5mj28J54n4K9J00j76J85j2
4523D6q5m1K66k99k58M10J01k75L25k72R5J09m20O72m60J49j98K94q9k76K25K59
4545B78l16m4L95l48J4k2J29j74L5kJ60j36k32K87R1j86K69q2j07m25R9K90k73
$$ y = [100, 100, 137, -420, -6, -24, -56, 18, -216, 110, -193, 93, 104, 20, 177, -112, -248, -175, 29, 70, -121, 50, 143, -124, 290, -23, 206, -242, 100, -171, -308, 199, -81, 43, -193, 37, -66, 150, 114, -78, 184, 372, 128, 88, -133, -4, -193, 67, -26, 65, 69, -140, -2, -64, -37, -26, 28, 59, -121, -141, -23, -197, 101, 68, 79, -30, -221, 14, 23, 200, -47, -135, 37, -9, 25, 11, 211, 13, -260, 32, 230, 125, -81, 173, 95, -94, -260, -156, 70, 15, 271, -305, -83, -28, -331, -270, -80, -55, -66, 187, 133, 98, -198, -7, 1, 29, 45, 94, -261, 121, -106, 6, 186, -50, 58, 311, -83, -202, -211, -145, -181, 160, -107, -161, 48, -113, 123, 248, 48, 124, -3, -48, -52, -180, -26, -80, -51, 49, -127, 58, 46, -39, -80, 186, -113, -371, 39, 140, -135, 190, -82, 13, 122, -298, 374, -86, 63, -135, 159, 70, -206, 19, 278, -38, -82, 313, -35, -21, -43, 86, -88, -53, -55, 105, -31, -263, 24, 115, -71, 198, 116, 9, -416, -317, -27, -300]
4568c00L28R1K5j03J16M1j14K16l96R3r3Q8J29j80j15J45j69K94L0j17R5j11M1
4591C4k05J95l90L97o6J32r2k01O0O6q6L14j11J69m08J77R2k33K24k94J61j22
4613a87K16o6N5j22L4P3K58j19J06l21J4j13J7J33r3J32j86J76j86J79R4jp2P1
4637I2J90l18K23l11J89k03K9J2J55K21j50m85L92k49J83J89k17K43m20K37J17
4658A19j93J91J22n32N75m12M5j3J49j23qJ47J10q8Q4Mm1j11j03K24j13j21J38
4681E0j65J21j33J20p5K21O6r3k01K18k39N2pm7L64l76K21j73K17P9m05L50j46
4704A9J90j59k1p1M3l8o7J8J55j79n9Q0j35M9J21k21L03J03k90nK64j15K2r8Q5
4729fm36L79L01k99j23K55Kj83L5j41L59k7o4j76K8k5j3L46k83j46L45j50K24
$$ y = [-300, 28, 119, 144, 41, 157, 198, 84, 300, -96, -3, -96, -8, 121, -59, -174, -29, -198, 96, 126, 9, 104, -7, 34, -171, 24, -366, 31, -35, 97, 5, -196, -136, -70, -156, 158, 47, 216, -192, -15, 77, -156, 68, -226, -65, -187, 29, -37, 18, -104, -70, 3, 261, 142, 248, -73, -59, -172, -155, -22, -115, 17, -169, 7, -179, 0, 94, 93, 21, 92, 282, -36, 187, -124, 65, -138, -109, -97, 58, 279, 129, -356, 36, -213, -30, 159, -58, 185, -235, 2, 119, -74, 117, 239, -293, 282, -130, -85, -98, 51, -72, -80, 67, 177, 89, 173, 177, 136, 25, -78, 146, 33, -88, 50, -115, 6, -127, -7, -82, 139, 205, 112, -89, 129, -110, -58, -65, -112, 252, -124, 97, -76, 141, 220, -185, 165, 19, 209, 50, 29, -42, 1, -37, -104, -86, 69, -110, -169, -89, -224, -175, -54, -275, 28, 131, -159, -164, 100, -15, 7, -91, -6, -442, -63, 238, -61, -184, 71, 73, -110, -75, -216, 143, 116, 52, -124, -96, -121, -134, 212, -71, -217, 128, -22, 202]
4752B02j34k48l2K42k14K90j66N0J40j78J44l52K15j51J76k95L19J02P2l37N5
4773a00P2J30r5k7L19n56Q2J45K6J72j13J60j32j01Q4q8K18j76M7j07k25M42k92
4796a15P8J27J30j40p3o5J39j00J23j19kn2l73K93K42j38Q1J23j86J07K1M2j36
4819GJ64J49k05K24j58Nl80K39L2j16J43k05L87o9p3l9l03M66l84J69j36J33J58
4842B08j65rQ5p5m6J48j09o4j85M5M43k74L02m89K78j0p9J81r4j60J26M4k30j02
4866b31K53N7k88J78r8K79M0j28k61J49j5J0j02J65j06r4J21k27L57k37O5n1J84
4889B0K08l63J83J16k16L5J64j98o1K73k0m06J96K21k27J44l9n4Q1p6J55j67J05
4912G4m23M49J71l25K57l14J3J34J96l80j3K13j13jJ35j23P0j96M18m14O0M5R6
$$ y = [202, 68, -180, -212, 30, -184, 106, -60, -10, 130, -48, 96, -256, -41, -192, -16, -311, 8, 110, 182, -155, -100, -28, 102, 7, -20, 299, -257, -175, -30, -4, 168, 55, 215, 83, -18, 66, -22, 196, 20, 67, -40, -265, 177, -115, -37, 90, 220, 80, 7, -58, 81, -19, 104, -15, -17, -69, -442, -149, 93, -45, 36, 159, -27, 80, 101, 143, 7, 171, 320, 115, 339, 181, 186, -194, 45, 77, -39, 104, -101, 286, 217, 144, 105, -198, 268, -116, 53, -83, 50, 208, 43, 34, 119, 44, -2, 146, 37, -27, -212, -167, 276, 2, 304, -185, 93, 83, 4, 185, 91, -69, 57, 101, -129, -231, 22, 79, -209, -31, -129, 150, 190, 62, -199, -50, -65, -55, -157, 8, -98, -192, -71, -298, 59, -178, -113, -164, 20, 228, -135, 48, 164, -52, -17, 147, -51, -112, 161, 141, -265, -69, 152, -75, 69, 30, -24, 57, -19, 136, -31, 74, -349, 100, 271, -54, 203, -111, -98, 36, 232, -148, -161, 52, -61, -62, 73, -50, 20, -176, 242, -172, -112, -67, 29]
4935B9K0j09J49j42L51j58k17l3N9%j12K50M9q8k45K18j28oK9nK61j26m3L43n92
4960b46p9J10N5j65J16O2K83j7M1j05j61j7L47j1k10Q0q2j18O5K53j99j13R1P9
4984E9J56l11K54k83K27k25n6K51m9Q8k41L97m79J20J57j62N3K30K7p8J4n10M37
5007G6j70Q8J37k66K22j14K6K2l2K65n84O10q1o2k27L28l83J22j26k2L16m1l43
5030b39L14k66M7J70J06j8r7j31J7p3L47l63K1M07m12Q4J15j4J8J52j66p2L1m21
5054d43M96M1k92K27j64J54L5j8k6k49M66n22L59P0N2k31Pn3K08m18J64j40L01
5077B4K13j99j2P9J06m22P5L02p9j55J50Q3j19N8j43j99K85m3K39k14n0n3K02
5100A28j03P5n5l7j77Q0J65J47j12k28l5n6N9P0J71l06M85l69j06K15J66k80l4
$$ y = [29, 49, -60, 89, -53, 298, 140, -77, -110, -51, -51, -163, 87, 136, 48, -197, 21, -107, -113, -84, -89, 172, 46, 3, 346, -246, -325, -215, -160, -325, -209, -147, 136, 119, 160, 55, -106, -123, 224, 213, 3, 83, 1, -117, -52, 201, 2, -111, -20, 59, 215, -96, 158, -125, 102, -123, -179, 72, 23, 111, -130, 267, -212, -92, 65, -97, -44, 186, 213, 135, 149, -361, 76, -94, -6, 131, -135, 87, -27, -1, 21, -11, 254, -330, 280, 199, 137, -90, 238, -145, -23, -149, -171, 145, 104, -239, 75, -191, -144, 26, 132, 114, 17, -114, -97, -170, 177, -186, -165, 242, -170, -86, 29, 15, 33, 185, 19, -53, -22, -443, 53, 94, -198, 29, -135, 19, 54, 36, 10, -239, 227, -295, 64, 134, 186, -45, -38, -91, 117, -301, -137, -277, 24, 237, 38, 26, 105, 211, -211, -136, 166, 87, -68, 82, 165, 46, 104, -39, -238, 47, 4, 243, 29, -21, -74, 128, 25, 100, 45, 8, -169, -89, 76, 223, 111, -117, -152, -208, -149, -79, 92, -214, 271, -98, -204, 11, 177, -103, -137]
5123a37K6O8J68K18l90n9K92k76K05j70j42J22J55j56r1L60j77j6j8N5l8j21R2
5146c0J01j7k38N08m6k57R8r6k20Q3J48n4o0j24L03j03n9j75lO3j7M82j74j91
5170g8K44j05j00K46m8p7j50L17m64M61q3j88J80k47K8k9R4K73l43L3J15q0J66
5193A65j8J82k15k59K8j0J24J65kj87K17m9J5k31p2M20m40R1O3q7k57M07r2K42
5217B00j13O9p0k2k3j72K07o1K68l18J94j66l8J16j43K98m42Q1K0J31n9O7k95
5240b71N7K25Q0j14j02L82l02j58N46k76r4J74k51M9l9j07J52J39k7nl0r7Q2j67
5264a54J80J01O8j74K41j70k54l4L07Q2k34J9k3K46l92M80k50J68m79L22O6J6
5286A32L9o6J7j26p6K57l15N3K51J91n13m3q0J71K54r7j47K25o2J33k21q2J09
$$ y = [-137, -111, -43, 125, 343, -47, -106, 186, -90, 115, -55, -197, -75, 80, -76, -167, 193, 16, 0, -18, 37, -1, -122, -30, 71, 54, -184, 324, 278, 21, 119, 23, -197, -114, 34, -20, -80, -204, 99, -4, -63, -238, -241, -178, -195, 287, 113, -78, 166, 61, -39, 207, 159, 82, -68, 249, -215, 246, 163, -25, 155, -92, -64, -93, 1, 274, -69, -36, 79, -1, 165, 147, 329, 114, -145, -117, -127, -3, 162, 160, -27, 190, 141, 156, -75, -147, 273, -167, -76, -13, -100, -357, 50, -42, 200, 87, 156, 86, 64, 41, -131, 76, 15, 283, -35, 159, -7, -45, 71, -72, 226, -216, -135, -115, 16, -43, 24, -271, -214, 11, 91, -23, -125, 257, -45, -203, 343, 67, -27, 147, -104, -55, -94, -201, -49, 90, 63, 58, 28, -69, 13, -154, 26, 127, 195, 21, 262, 92, -162, -196, 111, 193, -41, -22, -45, 201, -191, 289, 39, 207, -272, 50, 116, 132, 171, 105, 122, -4, -80, 177, -138, -85, 166, 357, -156, -199, -279, -108, 146, 49, -98, 127, 65, 198, -23, -105, 4]
5309Dp1q3J81j53P1j92K00K93o5j65K19j09j75j29M7K29J02k14J57k27J72O0N
5332A57l06k6J88J31j38k7K46j53j83J49J39j71r1P0J58k37J05J0J57m33M25J42
5354C12m83K05J51l09M8J28o9J33j39j2m8J76q6PNj40Ll0K06r6L4j3J65j49L5
5379C4J35k41M9j01J53L9Qk2j8Q4j2M8j01k43K89p7n7j37J77o8J27p1o1J33k80
5404b13k7L71j20K25r6k3k06J82R6o7j25l6P3r7J18K7k89L32j51o1rr6L37k10
5428f5n9K35j68J45j61J58l36Lo1L59L4k25L0K99k15J01l29m9M0L45J38j59j48
5451h8K90k82r9J28j21K10j90J85j34J05j06K99j82J02k8J95l41j52L9K53J49
5472B32j00N0J59l40Q1K65j84j58p9R1j47n9K35m6J44mJ61l48J69k35q0J55j72
$$ y = [4, -67, -150, 31, -122, -51, -243, -43, 250, 185, 20, 239, 130, -45, -174, -127, 102, 204, -10, 147, -80, 92, 152, 157, -149, -175, 13, 144, 6, -21, 225, 72, -111, 38, 177, 6, -85, -15, 143, -94, 11, 21, 178, -255, 170, 312, -171, 34, 185, -124, -76, 52, -17, 116, -23, -35, -83, 93, 7, 14, 19, -121, -118, -148, 58, -38, -4, -17, 148, -1, 34, 169, -72, -23, -124, 29, 68, 76, 54, 36, 120, 108, 156, 55, -188, 101, 24, -33, -170, 7, -61, 66, -5, -66, 67, -213, -240, 131, 11, 236, 140, 117, -89, 93, 189, 122, -3, -39, 34, -63, 55, 82, -207, 125, -26, -87, -96, -192, 145, -65, -124, 111, -57, 88, -73, 85, -251, -248, -309, 50, 84, -141, -111, 188, -27, 74, -255, -304, -264, 81, 219, 60, -88, 202, -80, -179, -51, -172, 38, -152, 33, -101, 4, -102, 197, 15, 117, 89, 284, -57, -209, -170, 83, 232, 132, 182, 341, 1, 82, 347, 163, 5, -74, 17, -130, -189, 46, 0, 144, 140, 301, -47, 122, -113, -193, -38, -210]
5495b10J11N17l33K48l25J82l26L20k34J73n6l28M11k68J31j5L9P5l85K35K83
5516B45j39r5J13j03P5l47O01p05K45K37R5Qj35k00r0K74n7P0l27K53m6O1j52
5539a19K18l02L8N58k78l81L30J76n27K53n2PP5n7J37Ql19J42J9k43K98k7J76
5562A30m00K01O6j23J29M0j36L35l19K75n83K47K64K40p9m17L05m64M52j95J90
5583A58L9l68L0K15k90K90k5m2K79n47J74J54j49J80r5J94l64J63q0O9M8j90L30
5606A73k28L7M9K6n0J92p1j13N2k44K54l7k62L28q0j7j27Q7O3k88K43q7o7K55
5630H8j5L6j55O3M1LP6k00J83k21l29L63j25O8L9J66j63l2K42n7k50K11j08J53
5654G7j63K22j42K28k44J90l20K01k58L16K18n45j02L35J88k16K92k10N3r3n6
$$ y = [-210, -99, 418, 85, 333, 8, 190, -136, 184, -50, 123, 67, -261, 150, -118, 13, -2, 37, 112, -273, -38, 245, 106, 11, 124, 21, 96, -251, 350, -355, -110, 127, 222, 230, 95, -105, -195, 79, 22, 92, -235, 18, -28, 33, -119, 99, -203, -165, 393, 115, -266, 64, 240, -287, -34, -86, -79, -4, -61, 76, 84, -235, -93, -74, -317, -19, -46, 130, -270, -69, -3, -126, 3, 43, -93, 242, -77, 198, -385, -138, 126, 366, 287, -130, 175, -289, 163, -32, 158, 197, -171, -141, 74, -216, 74, 49, 7, 286, -261, -87, 67, -82, 98, 3, 197, -167, -4, -84, -15, 33, -157, 173, -55, -18, 31, 57, 7, 199, 128, 15, 67, -177, 77, 40, -222, 106, 26, 9, -118, -31, 32, -256, -13, -100, -167, 88, 73, 109, -46, 17, 58, 61, 137, -63, 120, -101, -430, -67, -192, -124, -85, 81, -82, -114, 128, 71, -179, 32, -76, 77, -86, 136, -6, 222, -22, 168, -152, 49, -209, 107, 325, -220, -322, 13, 201, -15, 277, 67, 120, 27, -29]
5675b9J8p1J3J17K4k68L40M0k01N4J28k73K48jn3n4L7J35j11m8L00m95N45l51
5699D4p4J16j2k60J40j88M09j41j52J25j85K92j3R2k30K11k85k4M3K57k99K91
5721A57l01L80P0l99K36q1j29O7L0J90m28J18L08j45k5R1j07m6J74l03K35k93
5743b01L25m7n9q4J60J32j33J60j23l00J44K10j33Nr2k0N1o4N7R9k70K61k23J80
5767C5o1J29P9j2k34J26L6p9j3k78L37J24L8l49N3M7J08p1O5k32J5j83M37K6k69
5792a26J54J61Kk00k29K71rN4j1N0k11J49O8k81l2R0J96pQ4m27K16P6K09l50K1
5817h2R9L3L0j42J64j27J12j29r0L60q1j28M8O0k14j07J72j72K50r2J10j08P4
5840D0N1J44k59j37J70j93J96n9P4j26Q4k03K36k55K46j4M1l2k11J82J5L40J22
$$ y = [-29, -11, -82, -69, 48, 72, -196, 144, 184, -17, 37, 165, -108, 140, 139, 86, 32, 69, 204, 93, 45, 345, -150, 395, 44, -30, 86, 74, -186, -46, -234, 175, 34, -118, 7, -178, 114, 101, 193, -37, 174, -111, -135, -92, 165, -134, 157, -144, 236, 306, -93, 143, 62, -67, 0, 30, 220, -208, -90, 218, 73, 48, 139, 32, -14, 160, -143, 92, -201, 124, 77, 18, -66, 94, 226, 93, 253, 130, -170, -26, 184, 51, 56, -36, -56, -5, -69, -12, 87, -183, 78, -145, 35, -26, 103, 182, 170, -64, 62, 98, 19, 6, -272, 65, 189, 227, -122, -69, -22, 86, 15, 80, -152, -137, -320, 117, 143, -126, 28, 189, 191, -9, -238, 33, 24, 78, 67, 117, -94, 55, 123, -158, -190, -100, 96, 89, 173, -254, -38, 38, 247, -103, -82, 17, 50, 80, -62, 102, -25, 87, -42, -132, 228, 147, 19, 67, 127, -87, -194, -22, -194, 56, -36, 74, -34, 40, 91, 235, -24, -161, 9, -184, 12, -47, 27, -99, -15, -218, 18, -237, 9, -5, 36, 4, -207, -25, -10, 330, 452]
5863D52k60k11N0j11k9J75PJ70n37J62K42j09q3J84k75J49R2K8j66P2L36m17R0
5886A1k99N1J63L65k68K39k12r6j67M23k91K96j26m05M81k1l83M06j20j01K1n8
5908i1J75l7j95M54k57J14l68j9P2L00j24O9k72L03k85L39j23J16L2m81L48j14
5930d4r9J17k1K58k89P9M8l32R7L74k31K22m5P9k47p7L28l40J56K7j68l4K36j08
5954a4J04p6j8J04m9o5P2k81J04j43M10k22J8J39N8j42J33J1L2j56l5k66j5J53
5978a44R2J16J61j84j81M7Q9j1O6K56k62oK37l8l55N14m43J2m0P4k03J18L92l39
6002c2K25O7pl66J17o6lm7O7N7J34n4O2k04J56l67J57m2K54Q4j51J51k90j07K33
6027B8o6j32mL7k6P4o6L44k74J06j2L06l63R2j57J61l8P1p6J47k12J35j04j08
$$ y = [452, 192, -19, 31, -80, -109, 66, 73, 243, -294, -132, 110, 1, -82, 102, -173, -24, 68, 96, -70, 2, 338, -79, 11, -288, -237, -74, 291, 23, 262, 50, -46, -213, 210, -81, 215, 89, -316, 165, 144, -239, 167, 47, -54, -33, -91, 84, 47, -148, 306, 49, 163, -205, -224, -152, 148, 24, 93, -179, 124, -161, 178, 55, 171, 203, -278, 70, -44, -143, -26, -47, 211, -78, 1, 49, -283, -186, 188, -43, 179, 134, 213, -34, -111, 217, -123, 33, 60, -108, -142, 94, -14, 90, 14, -4, 100, 51, -14, 58, -223, -119, -262, 148, -74, -56, 83, 141, -1, 132, 143, 175, 19, -16, -282, -297, -144, -52, 64, 225, 41, -140, -93, -4, -15, 51, 307, 45, 39, 276, 238, -117, 397, -46, -34, -74, 0, -203, -85, 307, -32, 193, 260, 253, -113, 4, -62, -65, -112, -45, 12, 146, 92, 154, -50, 106, -261, -104, -146, 108, 192, 41, 192, -98, -205, 28, -38, -170, -174, -137, -163, -89, -155, 189, -85, 21, 9, 315, -48, 44, -113, 48, 10, 81, 5, 152, -60, 75, -29, -137]
6051a37K70R%k85L3K30k72J59j80N6L41r4j10r7j59L69j44k5j91o0J64K57l01
6074a67KK13k25L78Q8l47K8m3m1j54K66j84J44o9j5J37j49K93J05l76Q4l0N3q2
6098i1j35N59l24l3j28L37j19p5k18K28j6j43J55j48K21Nl6J0j13n1K80r0l36
6121b61K73n9K91m75J80J71K27l14o7j41J54K65L7j02k5o2Pn1L11m85q1J84k03
6144b26q2J67Kr0K81j10J65q3J43k03K26l20m6L10j12J80k2Mj07J2l4K40j41j19
6168C5J16k59K14k17J08L2k7M6J1j74L09k01R3M7Mj69k07J53J63L8J24k23j71
6191a55K47k57K16p9J37j67L55p5k87m2R7J32j47J91j17j70J75j13q3N5K19j79
6213d7Q7k04M33j37k09Q6j23j1mp0K39R8j19M8j26L3o2J7p5J91m9k66L83L7j31
$$ y = [-137, 133, 142, 142, -143, -110, 120, -152, 7, -173, -117, 224, 130, 20, -77, -236, 133, -11, -36, -227, -287, -123, 134, -167, -165, 48, -177, 201, 289, -58, -30, -73, -114, -268, -2, -186, -42, -111, -126, 11, -138, 155, 260, -116, -32, -62, -9, -91, -226, 333, 9, -24, -152, 185, 66, -9, -227, 1, -15, -158, -3, -151, 70, 75, 39, 49, -64, -115, 165, 75, -261, 12, -47, 244, -231, -51, 120, 347, 33, -34, -175, -21, 244, 281, 179, 154, 92, 99, 48, 359, -126, -207, -23, -226, -308, -141, -139, -229, 52, -58, 107, 24, 167, -36, 190, -130, -176, 134, 22, 202, 180, 184, 77, 89, 55, 295, 154, 35, 151, -108, 106, -111, -3, 29, 2, 48, 59, -115, 194, -7, 86, 133, 137, -32, -239, -86, 77, 115, 239, 16, -155, 92, -165, 51, -28, 109, -58, 297, 222, -65, -107, -10, 122, -25, 166, 49, -121, 54, -59, -142, -87, 132, -47, 40, -164, 269, 132, -77, 9, -114, -125, -129, -199, 40, 138, 19, 67, -59, -26, -88, -71, -146, 45, -4, -270, 113, 150, 19]
6238A9o6L8J45j60J26j31L52p8k13q0J94n7q7k35J98R3J28m07K10K8J13j27jO7
6262F9j8M3k75L83k65j09K31P9P9j03j98J00P0r8j29J24K4k63K87%M3k4k54K30
6286B6J07P9k81r8L54k36j0J69L5j94J53j93Q7L8K2K60m48J53jj60L7L9J89r5
6310C2J29r3M3K6j27M1j68J3K7J69r5J31J36m11p6Q2R6p3n2J01K30j57J44r3P
6335F2k9l2K79k08l1J23l23R6m1K59k41J26P5l29L65j18KJ22r9nK2k59K78R3l87
6360b00K66J5K7l3o0N8O7p9k04J45J36k61M6J10j73J47J73m17K56Q5j56K41k63
6383g4J59J98m89M35k25J43O3l2j73J52k35J09r2J52k94%K49j30K0JP1J07O2j46
6407C1M2q7P0k2m4k52K72Q4l6j22L4j6n0L01m90J56O8jK16k61o4M8J72Q8k05p9
$$ y = [19, -47, -9, 136, -24, 102, -29, 323, 245, 32, -48, 146, 89, 2, -233, -35, 58, 186, -221, -11, 17, 130, 3, 2, 69, 51, 94, -181, 202, -63, -172, 59, 138, 217, 114, -84, 16, 86, -12, -141, -17, 7, -256, 31, 31, 74, 50, -204, 26, 133, 212, -69, -167, 187, -49, -59, 110, 145, -49, 104, -89, -2, 36, 58, 318, -130, 23, 22, -138, -101, -62, 127, 32, 161, 68, 111, 137, 10, 51, -117, -104, -77, 92, -3, 128, 264, -147, -223, -141, -45, -118, -170, -69, 161, 4, 148, 55, 62, 33, 1, 280, 72, 41, 164, -159, -63, -104, 155, -86, 40, 115, -214, 151, 33, 35, 157, 58, 53, 75, -184, 94, 187, -200, 66, 81, 108, 75, 15, 73, 140, 61, -143, 2, 138, -123, -77, 33, -140, 7, 180, -237, 19, 104, -52, 189, -74, 85, 283, -206, 229, 4, 147, 210, 178, 5, 157, -78, 31, -61, 91, -203, -203, 46, -84, -64, -63, 8, 115, 177, 31, 73, -14, 56, 34, -10, -262, 10, 94, 58, -64, -30, -46, -96, 205, -285, -129, -61, -62, 154, -107, -171, -123, 49, 137, -68, -147]
6433a47J30l2jj15Q7J45P8q3j42J58ln2ko7MM9M0J66j62q7J61j99r8J35j05J83
6459D1J17k2j38qj60M74m53k5q9L09q0k6P5o7j55J14j12RJ69m9M8l84M85J30k81
6484g8m9J00j00P7K5m1M7N4k24K35J25k32ROJ2L19k58j55J01p5R8nr2L19k22l43
6510c47K93j36J08K66j41k8K56k42n9l5J90N6j80J61j3o7j34M6J46k49L96k21
6532F6k11J92r9J26J21l41J68k11J57J07m1J24k00j1N2%P6j08J2j17K58r6j31
6555a07L12m80M24j71n2p3q9L1J00M29l96J29m2r8J12J28j65Q5M0j11j50K34K04
6578B94j97j51K30k03J8K37l0j35m8K6q0J81k50P2K43j52j78Q6Q8o4R3k4J9p7
6602bj12N9n4K98k51K08k2N9j50j22J03k22J11K69k93K3KJ21k01L35m11L27j03
$$ y = [-147, -17, -49, -50, -165, -78, 67, 145, 62, -80, 78, 75, 23, 21, -46, -42, 7, 47, 213, 51, -36, 125, -74, -172, -37, -142, 41, 158, 136, -2, -10, -170, 304, -149, -174, -263, 46, -34, -60, 15, -52, -207, -93, -205, -196, -27, -76, -28, -412, 73, 203, -78, -127, -27, -127, -50, -25, -66, -19, 35, -189, 46, 171, -61, -52, -46, -34, 285, 27, -128, -27, -102, -4, -9, -101, 218, -4, -347, -54, -190, -82, 184, 43, 15, 271, 29, -30, -65, 125, 181, 1, 162, 149, 82, -52, -6, 140, -109, 287, 66, -145, 47, -52, 74, 195, -146, 22, -189, -32, 75, 34, 158, -42, -53, -1, -1, 75, -33, -21, -138, 120, 24, -107, 205, -275, 149, -22, -74, -147, -236, -205, -105, 324, -72, 57, 15, -83, 29, 157, -8, 77, 117, 6, -144, 90, 294, 97, -54, 176, -27, -9, 228, 198, 63, 15, 41, -39, 142, -108, -36, 207, 55, -123, -37, 51, -13, 80, 56, 75, -2, -114, -55, -109, 189, -62, 146, 124, 183, 33, -89, 14, -208, -97, 172, -121, -98, -96, 25, -176, 159, -252, 75, -28]
6625b8l0j04n8L6J46J33nk29j7K55l13q8M92j94K37n36L97R3m09M69k01R8q3k95
6649b34P5o4J97K61l92k13N03ko2J2l61J18J69p1m4L15k71n8M3r3K01J23j77J7
6673hP8r2m5L8j19RQ6j96J13J04r8J46J24j45j81K46j88k35M78l69K39Q1p6Q6
6697G6l45J92J90K1k58J43k03K3J19O3r3J02j99KK13J93k10j65K76p1k28J03j9
6720g5J57J2R9l05M08j60j77J28Q9Oj76j44K21n9J8r2N0MM3o6R2k34J45j44KJ36
6746b2N4J93k19J6j56J06j2M3K6J39r3k2J79k53p9N24n5k19r3Q9J30n56L34l7
6770A7j91K22J3N3n07N67k30k90L54L89j11m01K22J2p7JO2J6j93k29P5L60J2j30
6794A6l8r6J43P2L0j77mP0l56K11K51m42L59k35K24J12k16K55J4lk64O2Q2N3j73
$$ y = [-28, -58, -162, -220, -184, -38, 95, 90, -139, -156, 99, -214, -302, 190, -4, 233, -303, 94, 187, -222, 247, 46, 144, 61, -234, -159, -223, -26, 235, -157, -370, 133, 131, 69, 81, -280, -162, 7, -64, -108, 207, -64, -122, -79, -172, 29, 152, -25, -8, 70, -22, -67, -29, -148, -139, -53, -249, -136, -32, -130, 16, 140, -5, -186, 60, -128, -363, 115, -254, -15, 66, -10, 76, -269, -77, 113, 134, -124, 19, -184, -161, -42, 21, -72, 30, -169, -167, 46, 239, 29, -136, 140, 69, -159, -56, -75, 82, 94, 193, -112, 296, 136, -41, 87, 176, 182, 6, -138, 83, 24, 42, -50, 0, 4, 47, -19, 73, -161, -16, -160, -158, -22, 32, 225, 6, 22, -134, -28, -40, 3, 29, 168, 75, 53, 232, -21, -100, 424, 369, 150, 57, 146, 276, -280, 54, 17, -174, 48, 61, 114, -393, 174, -56, -346, 8, 397, 286, -115, 107, 119, 42, 43, 105, 121, -72, -301, -226, 134, 146, 16, -22, -118, 25, 97, 127, -50, -54, 16, -340, -129, 122, -320, 39, -196, 28, 140, -76, 179, 193, 190, -74, -12, 70, 123, -50]
6819e0L9l69M89q0o3J43m3j31JJ90m3j4m2j36K98j28Nk45K66k33J39J74l79K14
6843Bnk36K44qK77l64K27k37q4Q2Q8O4l7J15K5q2k03J31k7R2j44L15l36J73j53
6868h1l0Pk7J93j35k39L43O1k16J72p9k3j15M94o08O7L23j19N3J3J99m73J36r3
6892a77P3J6K17k72J09p1J07J21n5j39L6P5M4j05J83j40J38j85k07J0K11OJ14
6915A09p2n0k03P0J77J38l16J16J73k25J27k27Q1M07m02k40L34l9k8pJ16o0Q1
6938F0p3k2K49j80j88N35n66M66m87M5J72m0J25k27K8J72l91J08L41j44L10l19
6960b6J28n5K56j43j44J23k7j44m9N2j13J53nr2K50l30Q2Q6J81J55j87q2k58K03
6984A4J68j17N4m21K51J95r5j76K14K19k57j41O3R7k6K40m2l22K1R4r7M1L90l95
$$ y = [-50, -11, -380, 109, 29, -34, 109, 66, -65, -64, 126, 83, 69, 27, -109, 189, 61, 66, -179, 87, -146, -7, 167, -212, 2, -3, -239, 5, -3, 274, -90, 137, -100, -184, -102, -14, 50, 13, 128, 153, 71, -132, -1, -28, 64, -80, 235, -101, 72, -81, -111, -104, -131, 62, -73, -312, 31, 92, -124, 48, -31, -54, -169, 325, -283, -216, 107, -12, 41, 54, 253, -220, -84, -177, -104, -88, 129, -143, -34, -105, 2, 123, 68, -71, -35, 40, 84, -21, 162, 22, 160, -25, -232, -222, -11, -5, 109, 37, -13, -216, -146, 31, 169, -147, -31, 142, -83, 44, -183, -102, 305, -97, -337, -3, -42, -70, -77, 39, -21, 60, -13, -35, 214, 34, -154, 381, -185, 281, -206, -161, 11, -29, 96, -131, -103, 69, -322, -214, 127, -17, 293, -26, 102, 47, 303, 160, 16, 139, 112, -32, -81, -29, -142, 11, 6, -86, 164, -166, -84, 2, 183, 338, 151, 69, -189, 14, 182, 65, 119, -302, -51, 144, 49, -127, 87, 306, 49, -92, -29, 68, 42, 282, 240, -82, -61, 33, -64, -23, 367, -28]
7008b8O1Q2k38K5R2Q5k60R4K24j26J08j74k4M4Q8j5j33J6P5K04m39L83j96J3P6
7033C7L5j01k19J69l0J36j94K66J41n5k36J21j04MPJ1J48m45K40K15J1j23k89
7056b55K31K2J60J67j95k04K9R2r3l02M93pj74n3j7K11k9P5m19J93N8L2M3l5j59
7081a36R6j80P5J72J06q7O0J3j94K7J35o4J20k8j77J36R4j42J28Q9n53L00Lk25
7105b32J82K99k68N8j50J36L0JJ06j84P5p8L3j18Q8j08K45k16J16j25M9j30J10
7128h1K22j30j8J54J8j65n7J51k17P9K11k59Q3J3N4j80J0K43m39J62oK70k4J9
7152A13R4l0Qj12r6J68k36K59k37L0J13K7K1j01kj50L27p1J89l55q0L92m15J49
7176En8q6R4N6j32r7J67N8p4K61l40P3R2q1K07lj80j03L82k67n1L34j90J04k35
$$ y = [-28, 33, 115, -123, -98, -6, 79, -181, -87, 137, 11, 119, -55, -79, -35, 53, 38, -95, -79, -4, 200, -239, 144, -52, -39, 37, 72, -29, -248, -79, -109, 27, -167, 99, 240, 185, -51, 70, -34, -30, -23, -12, 136, -309, -69, 146, 157, 34, -255, -24, -2, 158, 325, 130, -74, -45, 47, -46, -348, 145, 138, -36, -89, -106, 105, 76, 151, -268, -75, -17, 15, 58, 23, -136, -40, -220, -145, 27, 133, 46, 106, 119, -75, -48, 87, 23, 143, 115, -62, 74, 168, 26, 154, 243, -310, -10, -7, -232, -50, 249, -19, 39, -111, 25, 55, 56, 162, -22, 53, -25, 8, -110, -22, -130, 115, -101, 15, -110, -61, -191, -81, 141, 11, -7, 147, 165, 0, -57, 94, -123, -44, 167, -92, -9, 4, 58, -122, -112, 131, -308, -146, -152, 118, 94, 113, 207, 177, 185, 73, -23, 145, -91, 168, -69, -39, 74, 101, 122, 21, 19, -131, 196, 125, 314, -41, -121, 271, -144, 5, -53, -139, -45, 11, -121, -218, -51, 7, -67, 194, -146, -73, 19, -62, 145, 142, -38, -141, 241, -26, -77, 257, 67, 171, -64]
7201f4L35j78P2j73j26K39J07J43l19j7J36j20K45l43P7J7l14L08P2K6p2r5p8
7224a22L05k07j82J00N7%p4R0N0P8m45J6M48l84L24J85j37J24j70L4P0j39l4k63
7248b76J91R2J68k29P4K18j77K1J41k14k27L31k66L5L27j75M3qJ28k72J07nj00
7271g3K76K9k30l2L47l59N3J7J23j54R4j93J04J11qk72K66k03l6RO6J94k09K02
7295A22o5L42n86Q3J45k22J37K19l74J72j2l6J70j62K86k35p3N3M1M2J07k23k0
7318h9K86j32nL1p4j34j0k8K78k25Q9L1P8k90J26J90k74k0J57o0J12k5k12K44
7342D4r7Kj48K58l2JJ6j6J98k56j65J07K75l15N2j8J83j0j90J35k2j74J15K96
7366B39l53Nl8qR1M6J67j87J77j31k31J60o8K22j43J35l6Kk12J24K01k71K39m6
$$ y = [-64, 271, 93, 165, -8, -134, 105, 212, 355, 36, 19, 155, 35, 280, -63, 14, 31, -283, 25, 97, 123, 51, -44, -122, 183, -24, -206, -106, -49, -49, -123, -33, 17, 95, -350, -334, 114, -270, 54, 239, 102, 226, 56, 90, 160, 21, -13, -276, -85, 7, 175, -54, 20, 238, 61, 82, 223, 9, -218, 113, -153, -118, 209, 34, 77, 69, 197, -75, 32, 27, -73, 203, 232, 2, -30, 317, -42, 11, 28, 151, -3, 91, -102, 2, 113, 105, -167, 99, -104, -140, -131, -65, 129, -80, 122, 57, 399, -187, -104, 41, -181, -44, 175, -199, -27, -39, -75, 95, -67, 219, -16, -89, -36, 5, 47, 154, -69, -89, 197, 65, 60, 91, 17, -117, -127, -155, 123, -102, -13, 18, 96, -194, -68, 122, -152, -172, -15, -75, 37, 12, -200, 44, -53, -51, -199, 59, 27, 28, 44, 28, 226, -30, -195, -88, 187, -128, -76, -94, 89, 79, -111, 24, 2, -172, -57, 239, -114, -109, -147, -155, -64, -18, 149, -38, 139, 8, -223, -63, -131, 91, -52, 83, 47, 49, -163, -39, 162, -109, 130, 84]
7390H4j12J53p8j65j31J92Mj60J05j27K12J28j57J5N2oJ14N8j18j73K9l1L01j59
7414C0j6l78L46j9J87j82P7J9K4j80O4j80K66j54K02j06K6r7P6J23Nj63L3Lk6
7439b0J26j48Q8m2K86l30Q5j67Q5l1K4P1l74L29J11j21J19m1p7n9J36J3q4O5l39
7464b95K56k25K59k59O30j81k83J28p0O9J19lk91L8j00J70J9J27M5k47M5Q5L9
7487G5j01j41K77j32J09l7j18K23j55j38L14k95K69M0k94Q9K7Or1L03j12o6O4
7510A16k19J25oJ5l66J37Q2P6L9j37K31k77K08J62k83j21M67l21r5N7J00j60K55
7533H5p5j55j7Q5J78j33K34m65L21K2l10K83j91J74P6k5q9Q5r5K13k5n2q8K42
7557B78l40J96l50K71m41K70j89K09J10q4J45jk42J48P2K1j60J20j56K17l32M3
$$ y = [84, -28, 125, 47, -118, -249, -57, -53, -213, -108, -235, -23, 105, -52, -37, 15, 9, 123, 181, 63, -110, -81, -112, 189, 30, 14, -364, -18, -37, 150, -32, 45, 64, 88, -92, -28, -208, 58, -96, 106, 0, 26, -71, 5, 128, 133, -30, 3, 6, -20, 106, -42, 46, 4, 290, -40, 45, -122, -37, -68, -44, 27, -347, -18, 93, -28, 91, 50, -27, -86, 50, 63, -21, 44, -295, -39, -264, -5, -264, 366, 185, -98, 30, -40, 29, 148, 145, -146, -108, -208, -38, -19, 108, 153, -94, -49, 36, 75, -26, -167, 110, -22, 87, 50, -68, 155, 0, -138, 176, -119, 150, 190, -104, -15, 12, 18, -73, 230, 118, 52, 116, -103, 22, 16, 31, -335, -198, -116, -40, -1, -138, 93, -184, 24, 186, -97, -218, 249, -72, -167, -110, -10, -170, 85, 10, -145, -162, -77, 101, -32, 202, -263, 58, 80, -230, 53, -138, 36, 112, 87, -2, 83, -12, 201, 176, 124, 36, 278, -62, 134, -216, 55, -386, -116, -305, -96, 14, -70, 75, 74, -168, -20, 52, 73, -87, 33, -123, 94, -238, -195]
7579a95K77l4j4M0j2O1Ok19K78k80K09M2m5l11J07L49k63J86k08R3J21m39M17
7602A66l8l83K10K59l10O9J78j82k5J79k53L30l42J52J0j10L48l42q0L11j78J27
7624I6Kj55K5N0J2J42J75m28K0k4k58L12k55K36KJ48M6l34J83J85k66K37L4j25
7648F0j69R6n5J37qj50m7n5L31k33N6p3K2J11J05K34l50N9l58L53k71L99k36k9
7672g1K55Pj48Q6k41k2J77M8j90L25j89k29L3K49J31l09N2J00Q5k06K36K22m75
7695g4o0M03j97j4p6j33k8K48m9q1n1J69j64K15L3l6J15l79Q9l6L59k48P9k1n8
7720EJ04r5j32L1J30j03K18m03L38j60J35R2m17N70o94N19k33J41r1J55J37m09
7742a62R4N5k51L76p4J65k92L35m5j68J98l49J09J42l93M01L2k85J72N4l3j38
$$ y = [-195, 82, 48, 34, 74, 62, 123, 129, -90, 188, -92, 117, 159, 114, -197, -90, 259, -4, 182, -26, 67, 188, -251, 166, 128, -255, -45, 214, -96, -27, 151, -31, -56, 123, -130, 200, -142, 10, 20, -90, 258, -84, -164, 147, -31, 96, 98, -57, -32, 18, 30, 172, 347, -81, -61, -85, -343, -31, -286, -50, -48, 100, 146, -188, -5, 180, -86, 151, 185, 60, -109, -13, -68, 69, 61, -89, -136, -191, 140, -93, -37, -110, -88, 23, 128, 362, 12, 71, -287, 66, -205, 194, -42, -71, 184, 191, 43, 129, -112, -134, 43, 91, -99, 226, 37, -192, -159, 90, 221, -88, -36, 64, 149, -57, 179, 401, -74, -134, 269, 72, 58, -18, -151, -179, 69, 20, -61, -112, 57, -107, 108, 141, 105, 220, -159, -70, -106, 253, 5, 84, 63, 5, 109, 14, -118, -87, 43, -60, 158, -245, 93, -67, 68, 160, -257, 313, -381, 138, -95, 46, -45, 110, 247, -162, -68, -13, -264, 112, 38, 203, -89, 246, 201, 33, 231, -118, -9, 133, -260, 141, 173, -112, 60, 114, 81, -57]
7764e7k24K10J99j92M02m67P3J96kk15j47J09K9j44O5M16l06K03j14Lr4J9l1Q4
7788A5Jn2j34K81Q9m28O1j04M42j02k32K34Pk56L2K98k70j3R2J12J9kJ9k98K70
7813H1j24j11K04p3L6j06Nr8K4K57l79K58Kr9J66M7l20R9J75qm9J7oo7K78j18
7839I1m6J59j99J39k42PO4L0J32j12p2J03k82M16j99J8K32l22R7m7J49m8PJ6N9
7864A50Q9j31Mp7j83q6M34l33L10l46J70J11k02K39q8k86K70k22O6K96J2j39j43
7887h5P5j03R5o6l1Q2n2J82p5k6J61k58J60j9r5j77J54j10K83m2q8k2j49J80J32
7912A06K0J50j95j39N6N1j11L65r2N8j03j84L0Rk15K81j03J76j31j30K1M26m27
7935h1J60J68l79L26q9K3q9k20K00J40M5k00K64l77J89J06O6k26j22J53j10P4
$$ y = [-57, -281, -71, 128, -64, 338, -129, -56, 140, 138, -77, -224, -115, -86, -230, -165, 251, -55, 148, 34, 37, -57, -38, -69, 15, 16, -36, -170, 111, 200, -228, -167, -271, 171, 69, -163, 71, 78, -178, -146, 152, -118, -131, -39, 73, 92, 90, 109, -189, 81, -43, -154, 50, -23, 13, -93, -88, -186, -162, 95, -284, -26, -24, -123, 43, 90, -230, -131, 44, 36, -13, 4, -2, -69, 209, 91, 45, 204, 5, 144, -98, -91, -27, 3, 135, 23, -49, 54, -228, 188, -11, 7, 239, -83, 14, -33, 116, 68, 75, 91, 150, 239, 108, 112, 35, -148, -234, 200, -133, 177, -169, 1, 112, -90, 149, 61, -225, 45, -177, -111, 185, 197, 58, -85, -10, -113, -18, -84, -115, -33, -85, 97, 22, -4, 157, -101, 59, 40, -55, -232, -78, -188, 95, 53, -35, -57, -206, -26, 106, 126, 276, 81, -58, -2, 49, -62, 303, 211, 269, 166, -18, 12, 21, -194, 87, -16, 160, 29, -101, -80, 346, -81, 79, 247, -132, 194, 105, 128, 39, -181, 19, 159, 204, 4, 268, -109, 80, 186, 252, 26, -96, 57, -53, 21]
7957B1P6n6j84J97k37J54p3J55k7O1J1j33R3r4J43r7rL69K4n74J66L44l69j19
7981a58q4L81m2j68j45K53r6O8o9J11j94L12l18J24J19j27j77K03j62J67O8K6
8003I2R1k94K01l7m8j25M23m77K07j41j7K15l23L40k01J10P3l01J67j5K9l06L16
8026b1OK47k73k23M39M3k81M3K4K88l88k9m0j03L69k21J13q2N0p6J61Q4j08l12
8050b90K85R2j92R7K0R3q2r4m1K54m3N5j36q4j33j8r9J11K75q0Op6J81r5J17j99
8076g6L37k13q3k15M41l8l88P3o4K71p2J41k19L3K21P7o3j96K01j56J6N6j15j41
8100a72J36K24Lk30k04L28q8L00k09p9m3j6M19l73K7l9o7P6k28K76k32L75J5r6
8124A03o2j49L5o2J55q8j25K17j85J53J35j35jo5J0M8J19k13K7J40k47J33Q1j62
$$ y = [21, 97, 41, -143, 54, -183, -29, -102, 53, 26, 87, 98, -35, 58, -36, 107, 10, 1, 370, 394, -180, -14, 330, -39, -158, -242, 139, 97, -71, -216, 37, -59, 9, -60, 51, -143, 169, -149, -25, 94, -33, -210, -7, -169, -2, 66, 92, 183, -111, 90, 53, 5, -120, 303, -174, 33, -108, -125, 90, -233, 107, -94, 16, 89, -212, -45, -60, -31, -337, -21, -15, 232, -41, -264, 175, 218, -63, -20, 4, 292, -96, -125, -165, -268, 101, -120, -7, -89, -39, -115, 46, 130, 22, -290, -5, 87, -105, -8, 12, 105, 23, -71, -112, 142, 99, 154, 18, -66, -199, -217, -316, -205, 70, -10, -4, -80, 101, 6, 123, -76, 261, 48, -35, -250, 191, 153, -235, -162, -226, 45, -27, 114, -105, -72, 149, 226, 163, -33, 168, 12, 28, 84, -31, -172, -36, 188, 191, -39, -243, 85, -3, 297, 88, 9, -34, -50, 369, -4, 23, -16, -83, -7, -235, 41, -191, 184, 199, 103, 41, -108, -73, -135, 20, -68, -193, 24, -161, -8, 127, -8, -9, -74, -64, -16, 103, -110, -83, 57, -190, -57, 24, -138]
8148a38P8K00J22k66J04K1PK37p09M19N8l73L19j01L4j70p1M45l62K90j36M5j64
8171a11J88Q0j26j03j57J72K06j60J49k78K68q4L7l44J29Q4p2N7r2J71
$$ y = [-138, -60, 140, 262, -4, 100, 121, 128, 365, -344, 75, 133, -240, 79, -22, 12, -158, -229, 216, -146, 144, 8, 53, -111, 77, 157, 31, -72, -229, -57, 149, -11, 138, -140, 128, 44, 81, -263, -134, -50, -122, -65, -157, 14]
8191A4
$$ Imaginary data points
##PAGE= N=2
##DATA TABLE= (X++(I..I)), XYDATA
0@%%%%%%%%%Oj3J4j4J5k2K8l4M1m9N7o4P7r1J05j21J40j60J83k08K34k65K97l32
33a76L74m20M68n20N80o42P13p91Q74r70J073j186J314j461J624j809K025k274
51a204K569k926L366l924M661n688P227r816J5272m6685Q2040Q8502r2220p7455
65c6281k6278P8072R2922l5055j55282n1566Q5763R8597K1678o0254q9677K9096
77d8265J30601M0532j02640r5465r507O4973P7698j6332j06435k4063R8869Q1560
89I1526j0155p0542p4821J2284R2803K0368r0064o1407L3402P6108N9056k1871
101E6687q7820k1028P7811M5545m6496p1979l6239L8699Q7717J8814p5194m0419
113e3902M9890O2726J2002n3361q2313q029Q1985M3903m9502n6263L162N9685
$$ y = [0, 0, 0, 0, 0, 0, 0, 0, 0, 0, 6, -7, 7, -7, 8, -14, 14, -20, 21, -28, 29, -35, 42, -49, 56, -65, 75, -85, 98, -110, 124, -141, 156, -176, 198, -222, 246, -274, 306, -336, 377, -414, 460, -510, 563, -623, 691, -770, 854, -955, 1070, -1204, 1365, -1561, 1805, -2119, 2542, -3146, 4081, -5735, 9537, -37148, 44892, 133394, 41174, -36281, -62559, 15513, 108435, 73380, -81902, -133468, -47705, 50892, 72570, 12316, -77361, -48265, 82336, 122868, 20228, -75237, -84744, -19771, 57927, 41595, -64840, -88903, 9966, 91526, 81371, 10829, -63992, -51708, 41095, 61463, -28601, -90008, -56606, 19502, 78558, 56687, -31133, -52161, 25650, 71195, 24699, -47280, -83519, -44820, 42897, 61711, -13483, -53902, -4012, 58714, 70716, 17355, -64958, -72987, 8998, 52901, 3399, -52864, -49702, 9983]
125I983P0207r111r1570m6772N1907N7638o371n7831n6227K2514R5878M4687o0066
138B4866o6944M039N5550M6839k8571r0890l5016O9716P3775m019n6591m3797
150e1043K6143Q0200K5045p5044p3573R625O2385M4823k2429p0330j8227P1754
162I329O5310j8553o7913m3908K2419O4972J7222o3055n4616K7174O8704L6439
174F3524k8188o3227j7856N5231M4908l0382o2380k3285L6123O0649J4196n1878
186b565m0507K9984N3436R921m2758n3513m149N3478L7752k9228m6099o13M3812
199H951M2098q334n6346l3381L1709M4747l531m2465l1127J9265N6464K5382l8641
212A4791m6310N413M1646K4182k5235n2253j5388M5950M7655q567m4238k2380
$$ y = [9983, 80190, 71079, -20491, -67263, -15356, 42282, 35911, -21920, -78147, -55633, 40245, 84932, 24866, -42078, -38039, 17511, 64350, 35779, -55111, -90127, -20411, 53364, 49345, -7246, -51043, -24900, 55300, 80345, 5301, -68272, -58647, 3738, 48561, 26132, -44198, -62425, 9329, 74639, 56086, -11827, -55735, -33316, 31656, 48878, -14177, -68793, -41619, 27085, 63524, 35336, -27891, -45747, 9484, 54392, 24010, -38370, -61655, -25532, 35117, 49313, -2565, -43072, -13088, 40348, 50269, 7511, -46002, -50151, 3327, 41079, 11851, -34248, -34861, 8951, 51049, 42715, -13631, -47012, -15303, 29444, 25913, -16552, -47679, -28414, 28050, 53432, 14791, -31519, -26106, 15540, 39722, 14487, -37766, -53154, -7204, 40451, 31884, -12354, -34734]
224c4734K6796M7084O212n0028m5417J4394M9634K2838k7723m3280j300M9510
236A3986L9994k1638n3873k2076L0191M3016P94m6268l4059K6075N4549J8459
248D9150l4844m5019r42M3485K9663k6026n0452j2897L9166M5115j139m2742k7982
261c5464K3660M4890P088m1241m0997O480M4202K6295k2584l9483l827L9578L4179
274D2776j3595m4380k2614K3707L7029K292l6511k6864J9178M2949J5358k7980
286A1345l5751NL3876K2007k1985l8717o793L2694L2930l693l4307j9547K2953
299d983L4477n60l6003k7937J0792L5651J7886k4261l2403O018L6030K1815j7387
312A9135l7817j4507K7077L2482p847l5715j6553K2827L6915J0022l1806l3369
$$ y = [-34734, -7938, 39146, 45358, -4670, -50087, -35693, 13941, 36779, 9056, -34224, -35524, 13986, 53980, 32342, -21531, -43607, -13416, 29600, 30394, -15874, -49933, -23858, 30691, 49150, 14306, -30713, -31655, 11830, 41493, 15467, -34985, -47882, -8716, 36399, 35260, -7482, -35464, -11804, 33086, 40174, -1067, -42064, -35584, 8618, 34913, 12329, -27154, -30981, 8597, 42776, 29181, -15199, -37813, -14106, 22923, 25215, -11296, -38160, -18982, 23967, 39325, 11345, -24406, -24401, 9475, 31482, 9497, -29220, -36013, -3319, 29611, 25918, -8389, -27936, -4983, 29494, 28934, -7069, -35006, -24214, 11437, 29323, 5062, -27341, -21323, 14707, 36522, 19135, -18682, -33189, -6112, 26370, 18523, -17192, -33745, -10918, 25997, 36019, 4213, -29156]
324b9156R073L5981J3362k4582l4091m582L5070L3115j1184l7568j3099K4895
336b766L0934O30l5999l0947J4939L9846J2340k5027k8261J580L3363K7060j8394
349A9298m0570j0497K6370K7126j909l0416k2642K0142L8570P143k8902k6669
361b2956K915K8038J9400j8731l5247k662L0990K4406n519k7235j7639J7592L1600
374B4952j329l1498k0466J0193K7008J5596j7735k8093L507K9980J5563j4971
386A2707k6740j1480J8729K7198m787k9300j0923J9031K4599O251k1830k6072
398b2617O874K8998Q041k0862k2165p78K4601K4239r452l0546o861K2043K0058
411B1573m322k5232k0597J2971L2455N685k3878j8746O588K4448J7097j6130l2702
$$ y = [-29156, -20083, 15898, 29260, 4678, -29413, -33995, 1075, 34190, 23006, -14562, -27661, -2766, 28168, 28798, -7201, -38148, -23209, 16637, 28977, 3950, -24311, -22731, 10632, 37692, 19298, -21272, -31769, -5399, 21727, 19818, -10598, -33240, -13098, 25472, 32615, 3713, -22956, -20041, 7997, 27397, 8666, -26581, -29243, 1747, 26153, 20634, -6601, -24240, -6648, 24952, 23623, -7875, -28341, -18148, 8860, 24456, 6721, -21372, -17865, 12115, 27678, 12707, -14033, -25513, -6784, 20414, 15627, -13673, -24596, -5565, 19034, 25285, 3455, -22617, -15743, 13255, 21296, 434, -21731, -22509, 2092, 26331, 16879, -13667, -20528, 1515, 21573, 17251, -7981, -28578, -15607, 16848, 22533, -1345, -20091, -13503, 10945, 28042, 11912, -20790]
424b0790m335K6351J8810q056k3230j3892J7590L1707J276k8833j8461R305K2260
437I702J1837j7251k8605J341L0150J7255j1333k2477j0562J6170K6081l175k9585
450a0452j5343J4355K2897Q812j5629k3591L116K8461J1542j6930k1819n623J6116
463d088K1938l631k6169r092J8646J9726J426j6985k0205M406K4753P275j8886
476h86j6908K525J7896J7556o817k4475o003J9167J4447n544j8079j3358R421
489a1058K4021N098k0480j3268Q202J7074R401j1736k3382k552K1924J3645j0316
502F573j6555o364J3384K1362k0k3897j3357J1948J7145L931j3600j9285K266
515a6469K5560J1988j4070j8124k806J3751J7479l894k4772j0722J6335J9213
$$ y = [-20790, -25125, 1226, 20036, 11980, -11250, -25142, -7552, 24155, 25431, -3402, -21863, -12558, 9702, 21539, 4288, -24317, -22976, 7174, 24429, 13096, -9381, -19943, -3773, 22308, 19133, -10452, -25795, -11440, 11457, 20269, 4640, -18951, -15835, 12626, 24168, 7238, -14581, -20204, -4088, 17850, 14219, -11950, -21042, -2396, 17330, 18756, 1771, -18434, -14028, 10725, 18000, -886, -17794, -15269, 2627, 20183, 13366, -11109, -17112, 2055, 16502, 10958, -7121, -20479, -11058, 12963, 18061, -2419, -15687, -7485, 9589, 18990, 7254, -16128, -18680, 3244, 16889, 6573, -9982, -16346, -2962, 18400, 18380, -5517, -18874, -6926, 10219, 14150, 550, -18735, -16469, 9091, 21079, 7009, -11115, -13921, -170, 17309, 13415, -11357, -22079, -5744, 13469]
527A3469J810j5258j5842M669K3169Q862j8336j8826N70J6112J5045m654k1911
540a1121o716J8196J7518l153j7367j3875N666K0713O185j7571j5853N792J7505
553E919J1333p562j9618n749J7277J3971p277j6624q177R217J8975L980j7368
566a703j2685Q141J5745M898j0504j6986k110J7679J2017r091j4867k649J1768
579c47J4611r00j8353j0490J0528J3954J768j2498j2190L366J8391Q523j1811
592D552j5328L57J2603J0672m940j7678o823J3885J5175j253j3786r718N915J6457
606A0090N122j5217j4428L385J4493R507o672j5957l363J4942J3833n531j5629
619e425q620P877J5398L278j5238j2054O813J6007O620r255j5204k572J4796J1261
$$ y = [13469, 15279, 21, -15821, -11152, 12017, 20879, 2543, -16283, -15713, 399, 15444, 10790, -11121, -17837, 359, 17877, 14724, -2643, -16518, -10852, 9861, 16046, -1525, -17378, -11586, 5919, 17252, 9690, -9928, -15677, 1600, 15571, 8294, -8330, -16507, -7290, 11685, 15665, -1703, -14388, -6247, 9498, 14396, 3892, -13094, -15204, 2475, 14492, 5401, -9466, -12115, -347, 14264, 13364, -4989, -15479, -4951, 9003, 10771, -1727, -13917, -10551, 7840, 16363, 4552, -10776, -10419, 2184, 12856, 7916, -9762, -16585, -2700, 12475, 11222, -2564, -12282, -6367, 10090, 15212, -5, -14433, -11048, 3445, 12952, 6280, -9677, -13040, 1902, 15735, 10204, -5425, -14045, -6168, 9230, 12508, -2730, -14784, -7971, 8036, 14656, 5401, -9803, -12375, 2421, 13682]
633A3682p566j5410n076J1109J4620J207j4750j0548P204J5060K831j1379j3402
646a2418P40J4787R748q054j3545j695J1335J1445k466j4776q611Q718J3487O72
660I367j1490r609M192J4461O422r795j3071J92J1833Q042n250j3449m633J1128
674a660J2762j934j1957p636O395J2549K247j1447j1287L330J2931O529p184j2071
688h433j194J2494R342m808j3692n416Q784J1273L07j1737q196O051J2978M126
702A1879r924j1520J201J1547P274o728j2443k529J0668J1480k318j2034o772
715a0219P110J1496J341j0929j0435L504J2966N610p222j0754j149J0950R443
728A1712n204j2596m543P660J0787J90j0452q436N922J2329L475q863j0184L13
$$ y = [13682, 6116, -9294, -14370, -3261, 11359, 12566, -2184, -12732, -5528, 9532, 12363, 984, -12418, -11678, 3109, 12857, 4803, -8742, -10437, 898, 12343, 9877, -4899, -13510, -4792, 8695, 9367, -2123, -11732, -7540, 6921, 13343, 3548, -9523, -9331, 2502, 10544, 5294, -8155, -12788, -1660, 11102, 9168, -2789, -10425, -4030, 8519, 10766, -681, -11968, -8638, 4293, 10822, 3638, -8433, -9627, 2867, 12209, 7401, -6291, -11707, -2923, 8350, 8657, -3080, -11276, -5225, 7753, 11879, 1955, -9565, -8364, 3183, 10457, 3729, -8714, -11243, -575, 10905, 8587, -3447, -10219, -3109, 8387, 9728, -1201, -11636, -8132, 4834, 10444, 3222, -7532, -8681, 2269, 11712, 6508, -6088, -10631, -2971, 7816, 8006, -2446, -10882, -4960, 7369, 10844, 1981, -8203, -7890]
742g890J0088P393n686j1686k139J0009R074j758j0161o572O024J0896O91j0080
756a797p985K888J0664N939p213j0021K20J0217O463m259j0038m727P499R908
770G758r47j0204n459N535R557K903q016r631J756J0563M377o408q648j380Q655
785D11R271l462j0600l743O842Q138K41q854q088M183J0996L368p604p895O94
800f102Q834O865n225j1088k286Q805P290j333q720n662N424J0937R95q997p370
815g633K073Q298N348n549j0333n3R918O078k922q616m853O172R580p95r728n565
831h580M301Q500L490n640r364R87R899M424m977q254k538O362Q360j180r654
846c864l595N911P216J580o675q228K081R270L180o126o600o45P339P153k961
$$ y = [-7890, 2198, 9591, 3905, -7781, -9920, 89, 9163, 7405, -2756, -9328, -3304, 7592, 8283, -1797, -9782, -6894, 3770, 9709, 2496, -7525, -7305, 2912, 9375, 5116, -4922, -9649, -2150, 7758, 6811, -3393, -8852, -3317, 6240, 9143, 1127, -8504, -6748, 3815, 8192, 1784, -6864, -8244, 411, 9682, 6220, -4380, -8123, -1281, 6857, 7098, -1756, -9844, -5661, 5335, 8703, 1099, -6796, -6102, 2732, 9597, 4372, -6716, -9002, -197, 7093, 5760, -2960, -8622, -3198, 7739, 8734, -263, -7633, -5560, 2738, 8086, 2537, -7796, -7849, 2069, 8147, 5225, -3391, -8244, -2072, 7508, 6713, -3015, -8580, -4279, 4221, 7711, 2071, -7293, -6306, 3593, 8017, 3040, -5214, -7752, -1390, 6970, 5790, -3864, -7459, -1548, 5668, 7248, 573, -7655, -5574, 3696, 6876, 750, -5850, -6495, 844, 7997, 5036]
861E036r421k591O693O149p62o805o340L395R734K180p408n848J786O660M926
876G384l985r598j124P851N749k360o661m188M721Q534O67q654n063L262O298
891B833L457m770q059j33R294M867m083o878k427M737P667q80q791m478N055P118
907D529J667n184p164J617Q023M081o289o525m04N061O535j268q446l040O335
922d72O127l07o028n454J877Q061K715o709n492J228O132M825k532p985k287O621
938C20N387j988n994l948L420P313J772o692n573L158N631K765l400p303j290
953f422P282N033l184n689k163L911O625J44p171m414L284O164J554m542n596
968e184J99P279M121m304n897n98M294M852p33p083l473N032N594L40m415m647
$$ y = [5036, -4385, -6976, -283, 5866, 5104, -1701, -8041, -4646, 5088, 7268, -140, -5988, -4202, 2458, 7384, 3399, -6199, -7323, 528, 6277, 3917, -2744, -6932, -2211, 6323, 6990, -1664, -6727, -3465, 2833, 6290, 1520, -6539, -6672, 2622, 7489, 3406, -3472, -5899, -1162, 6505, 5625, -3166, -7644, -2589, 4529, 6196, 1012, -6152, -4535, 3488, 7569, 1280, -5245, -5649, -588, 5947, 4679, -3767, -6807, -472, 5655, 5348, -680, -6134, -4257, 3804, 6519, -190, -5682, -4454, 1678, 6503, 3971, -4014, -6301, 320, 5707, 3719, -2275, -6223, -2803, 4510, 6282, -410, -5983, -2825, 2806, 5571, 2171, -5132, -6422, 860, 5893, 2709, -2980, -5143, -1232, 5393, 5537, -1634, -6048, -2764, 3400, 4954, 412, -5184, -4985, 2294, 6415, 2111, -3786, -4384, -90, 4762, 4029, -3054, -6527, -1495, 4099, 4439, 24, -4623]
984d623Q24O854K923n336n733O83N206M034j530o276k589N590N399j660n301l716
1000e251K344O310J734n779m607K066N498L002k862o031j407N460M446k224n650
1015b951k131L667N354J157n851m265L002N160J509l819n455q8O138L662k952
1030B137n685m54M072M678o84n866l664L549N592L70m319m174J113N868K779l877
1046A435n227j12M546L352j299n799k020M249N205l06m985l177K285M823J514
1061D484m357m686J093M915K861k787m545j491M930M423j962m914k403K897M556
1076C014P53m543l691K103N161J421l133m497k58M386L390k275m846j426L949
1091d92M221k71m444l343K709M708P55l912m230J098M648K778k827m380n79M236
$$ y = [-4623, -3799, 3055, 5978, 642, -5091, -4408, 798, 4832, 3302, -2974, -5563, 27, 5426, 3766, -1535, -5251, -2907, 3403, 5137, -642, -5249, -3183, 2315, 5317, 2455, -3576, -4983, 477, 4923, 2699, -2951, -5082, -1415, 3939, 5096, -755, -5020, -2018, 3142, 4651, 832, -4623, -4711, 1427, 5089, 2137, -3548, -4002, 70, 4748, 4064, -1802, -5466, -1917, 3675, 4045, -274, -4448, -3335, 2533, 5312, 1435, -3792, -3904, 642, 3994, 2695, -3104, -5124, -875, 4330, 4024, -961, -4138, -1853, 2970, 4484, 127, -4559, -3466, 1449, 4310, 1523, -3022, -4513, 417, 4840, 2878, -2036, -4439, -1542, 3014, 3767, -776, -4467, -2364, 2797, 4218, 1085, -3412, -3670, 716, 4106, 1831, -3015, -4441, -492, 3729, 3458, -986, -4329, -1620, 3088, 3843, -69, -4299, -3201, 1447, 4225, 1398, -2982, -3561, 675]
1107F75L555j425m816k381L204M379O7m203k947J770M799J501l644l940K00M197
1123I91L080k346m734r61L932L962r51m352k582K625M175M97l817l785J745M201
1139A680K712l087m079j83L886K858j683m241j670L029M088k13m086k673J882
1154a780M636Q73l099l939O56L889K066k077m020q53L608L797j052m332j765K612
1170g80L626L98l868l164J637M092J372k580l477j3L775K701j998m154j125K966
1186e92L374n05l329k558K053M443M37l152l105O70L545K227k461l983j76L635
1202E23K709j237l358j932K566L523j08l812k293J715L377J617k705l642N18L827
1218A288J620j547l337j058K543L772r90l911j528K239L291L87k888l082R36L913
$$ y = [675, 4230, 2805, -2011, -4392, -1188, 3191, 3258, -945, -3892, -2122, 2677, 4178, 534, -3406, -3206, 991, 4071, 1725, -3009, -3970, -38, 3924, 2973, -1379, -3961, -1336, 2839, 3336, -481, -4266, -2521, 1680, 4392, 1305, -2774, -2957, 929, 3787, 2104, -2137, -3807, -778, 3310, 3097, -989, -3662, -1780, 2856, 3729, 630, -3309, -2653, 1236, 3302, 1225, -2795, -3648, -40, 3757, 2705, -1627, -3392, -780, 2846, 3244, -624, -3788, -2151, 1941, 3313, 733, -2744, -2757, 1018, 3719, 1721, -2433, -3558, -592, 2782, 2277, -1052, -3610, -1557, 2886, 3323, 171, -2934, -2264, 1281, 3508, 1047, -2936, -3112, 523, 3232, 1995, -1363, -3295, -729, 2794, 2686, -1126, -3419, -1704, 1673, 3290, 585, -3057, -2539, 1288, 2908, 1361, -1976, -3034, -491, 3281, 2291, -1620, -3148, -909, 2382, 2769, -119, -3201, -2265, 1648]
1234A648J124k289k999k87L358K733j147l928j147K873K631m02k854k628J774
1249a540L439R85k703k507N80K669K135j449l858p65L043K313o71k707j507J423
1265a120L677J31l085k469J183K883J465k029l118%L523J802j468k501j581J991
1281g16L334o01l187j664J858K792N63k178k692M26L442J420k012k799l72K194
1297a92K823o79l403j272K550K214N5k535k332J054L319O76k202k312M08K509
1313F81J788o86l475q55K751K035p38k462j723J532L144M18k492k126R84K407
1329A183J121j171l015r17L218K052j196k281j411J645K973K81l131j831J513
1344i67K272R21k090k305K2L129J562j825k205n30J994K116m04l003r44J871K128
$$ y = [1648, 2772, 483, -2516, -2803, 555, 3288, 2141, -1787, -2934, -61, 2570, 2168, -686, -3314, -1540, 1899, 2884, 181, -2326, -1746, 923, 3058, 1609, -2249, -3014, 29, 2342, 1671, -1036, -2543, -1120, 2557, 2688, -397, -2866, -1683, 1200, 2665, 636, -2482, -2482, 1041, 2843, 1375, -1126, -2707, -716, 2618, 2017, -1170, -2834, -976, 1816, 2379, 201, -2491, -2065, 1377, 2797, 785, -2014, -2386, -192, 2631, 1952, -1451, -2723, -173, 2041, 2096, -439, -2771, -1717, 1602, 2278, 76, -2236, -1828, 681, 2469, 1783, -1692, -2547, 204, 2239, 1501, -961, -2684, -1152, 1992, 2410, -82, -2208, -1224, 1183, 2304, 1133, -1882, -2799, 419, 2471, 1275, -1006, -2417, -772, 2201, 2482, -649, -2480, -967, 1305, 2226, 136, -2169, -2147, 982, 2544, 719, -1486, -2016, -22, 2094, 1690, -1313, -2257, -386, 1742]
1361A742K08j858k063M92K944Q38k191j893J58J692J944p86k317r64K018K064
1377B028o86j899j051M20K531J011k411j970P03K350J029r24k665n47K494J698
1393B111j126k128p60J267K481K62k500j706J207K065R33j816j979k58K457J699
1409B209j656j944k23J847J656j62k470j588J949J657L93j854j726O12K231J347
1425B278j764k111K74J446J745r85j844j018J372K025J56k045j083N77K066P80
1441A869k113j574L80K113Q13o77k061m19J689J608k50j969j196Q95J847P64j915
1458a96j439O66K025P77j310j929k18K096J063p95j737n54J533J650k42k037j089
1475a736J049J935L66j632j426L47J670J297j369j785N4J440J191k70k013q05
$$ y = [1742, 1950, 92, -1971, -1479, 1465, 2303, 112, -1781, -1623, 69, 2013, 1227, -1090, -2054, -36, 2028, 1342, -557, -1608, -1188, 1343, 2354, -57, -2027, -1324, 1026, 2055, 1131, -1534, -2081, 413, 2111, 985, -1143, -1903, -636, 1845, 2107, -393, -2099, -892, 1173, 2106, 290, -1689, -1947, 510, 2209, 553, -1391, -1614, 233, 1889, 1727, -743, -2331, -382, 1275, 1668, -186, -1912, -1300, 931, 2278, 514, -1597, -1323, 123, 1868, 883, -961, -1979, -607, 1418, 1574, -471, -1554, -977, 1089, 1869, -244, -1818, -1438, 675, 1488, 811, -1250, -1669, 20, 1628, 1378, -591, -1787, -892, 955, 1719, -196, -1635, -969, 1056, 1833, 523, -1406, -1624, 472, 1535, 740, -997, -1551, -18, 1632, 1390, -647, -1736, -687, 1248, 1614, -18, -1444, -1097, 573, 1870, 501, -1284, -1230, 210, 1401, 1131, -882, -1687]
1491a687J390J743j35j681j222R42J561P08j255j986M26J669J089q43j803p77
1507a861J299J886j10j900o15P56J448P50j929j300L00J894P11q07j800r8J724
1524C48J241r08j682m46J065J561J86j794j228Q62J602P38j646j123k5J870P87
1541A408q13j300o40J476J360n07j611o49P20J534K13j083j403N40J291Q02j179
1558A59j320k8J729O37n43j682l91J014J441k1j458q88Q01J504L01j314j365M60
1576i64J399Q45j050j201j6J032J166l82j544n25R28J207J56j095j416O65J554
1593G59M65j256r86k02J464Q08m14j477m14J279J266l91j385p32Q65J430l9q58
1611A82j363M18J542M84j126j119n6J134J214n06j396k97Q94P71n5r13j149N54
$$ y = [-1687, -297, 1446, 1311, -370, -1592, -650, 911, 1619, 364, -1622, -1196, 473, 1562, 719, -1084, -1861, -562, 1324, 1214, -686, -1301, -545, 903, 1653, -276, -1576, -1276, 618, 1329, 522, -1278, -1376, 348, 1589, 681, -1001, -1447, -382, 1179, 1365, -429, -1657, -795, 807, 1545, -101, -1224, -1249, 621, 1408, 595, -705, -1345, 131, 1491, 984, -627, -1276, -556, 978, 1191, 108, -1295, -755, 536, 1338, 159, -1161, -1189, 540, 1177, 634, -1048, -1439, -425, 1016, 995, -463, -1351, -550, 954, 1255, -59, -1424, -964, 435, 1280, 230, -971, -987, 45, 1211, 829, -715, -1240, -312, 895, 1051, -44, -1460, -795, 759, 1224, -32, -1018, -1220, 244, 1052, 638, -839, -1253, 26, 1292, 901, -484, -1216, -351, 1079, 1040, 182, -1181, -763, 779, 1263, 137, -982, -1038, 96, 1310, 804, -592, -889, 5, 776, 721, -192, -1341, -787]
1629g87J611K89j007r39L0J036Q26p30j395M0Q63J019l0j324m54O25J453k59r89
1648a22j160N65J300N03q53j216L6J105P05l71j083n63R34J023j15j232o11O46
1666e09J386L44j360q84J99J423O15r72j378K62P91J021k23j266l52Q54J118j94
1684H75q90j338P63J248K10q20p75r2J234N23l24j199o54J173J025l17j305m09
1702a072M83J381K43r73r90L86Q55P07p38r97j74R64R44m43r85n51Q99R73N9j334
1722c63m19L41R49N03o99j282J14J058R12p95r34j63O76Q42k83j011o18Q83Q81
1741E92K40q92q87L60J256M10r80q36n3R04P42n10o40n95J009M73N8r27n77M19
1761d34J366R3p63p29k04R02P75n79j142O0N40R15o47p96Q5K05R13O7o98o59M96
$$ y = [-787, 824, 1113, 106, -833, -803, 233, 1059, 329, -1066, -1026, -163, 856, 826, -498, -952, -327, 1126, 867, -122, -1282, -717, 583, 1086, 233, -983, -947, 158, 863, 492, -591, -1154, -220, 803, 688, -544, -1155, -509, 877, 1221, -139, -1023, -824, 599, 1214, 242, -1136, -874, -83, 938, 715, -551, -903, -49, 1069, 875, -15, -1353, -590, 658, 868, 48, -727, -819, 415, 938, 614, -585, -1239, -66, 959, 642, -663, -1072, -589, 792, 1035, 62, -928, -542, 313, 1020, 282, -715, -889, 75, 1019, 576, -409, -960, -61, 912, 971, -363, -782, -441, 508, 1011, 312, -970, -856, 202, 1114, 319, -615, -778, -102, 740, 457, -554, -1172, -289, 592, 832, -60, -947, -587, 669, 1079, 99, -737, -790, 114, 856, 346, -294, -889, 120, 593, 651, -276, -853, -434, 932, 1025, 262, -467, -671, 231, 1006, 427, -715, -655, -115, 800, 153, -643, -558, -353, 560, 627, -71, -730, -234]
1782b34N34M63n59j002j73J356M24n06j179J7P88J018m98q04o54O53P48J99m85
1801A06q13L6J150M39p08q40j18J157M38l21j103n03P00J129k51o00o20J53R83
1820D14N60r84o61L25N22O03o0j419j35Q43P53m41n62p67O20J147O7p17p82M13
1840b61R65O1l88j074j84J025N45l89p68k29N13P14L14r11p35L86J109J27o09
1859B11r61J89Q47N62m21r19m51R52O98p0r36l90M71P95M0q69m63M67Q11K98q80
1880a9q45M82N78N03n63o80j62P50Q89k59p10q46P04P69q6p50n40K00Q32K82l74
1901A55q83L62J009j85o8p73k44M18N14K57o64n47M62Q15o5q19j31M9O28K63j58
1922C95j053N7P97M58j20p25m20L80N04J25o37l61J86O29O93p33q49J16P49L71
$$ y = [-234, 300, 763, 204, -798, -971, 385, 809, 303, -876, -859, -71, 947, 449, -355, -1009, -356, 392, 591, 106, -707, -671, 479, 918, 210, -630, -748, 409, 847, 526, -577, -1080, -380, 749, 498, -102, -722, -569, 414, 974, -10, -671, -346, 176, 779, 719, -700, -835, 8, 761, 320, -242, -1009, -389, 758, 825, 108, -674, -261, 704, 765, 377, -697, -881, 144, 689, 300, -468, -697, -184, 530, 844, -67, -802, -416, 693, 820, 211, -750, -561, 286, 848, 427, -492, -943, 9, 707, 637, -299, -689, -218, 577, 617, -252, -715, -248, 563, 861, -19, -864, -382, 196, 699, 136, -544, -706, 44, 933, 674, -36, -882, -178, 591, 505, -245, -785, -585, 247, 529, 155, -728, -366, 643, 458, 390, -383, -627, -209, 305, 562, -102, -649, -187, 628, 563, -256, -387, -338, 290, 553, 395, -658, -601, 196, 654, 534, -191, -611, -231, 273, 398, -239, -600, -414, 215, 908, 175, -674, -558, 191, 562]
1942E62j76n65o57O57N27q0l14r32O68J010k7o49n79k84R81O19m26o10k19P93
1962B99N87o72o72n4K84J161l88p05o94P22M92K68n69n65J41O41L07m00m32k82
1982e31M25J023n75l67n36K98O25K07m42l11k14M89M78k73o98j64O90O51k23r59
2002d07l61R48M30J1n67q26M10N49N13p73l63k2O28O24n38m51p06R37N72j43n15
2023e0n97L78N44L81q36m24M53K90P04p70p54J92N47M57r5p57k00M88N82Q5q72
2044b54m41N90M09L73n20p10Q5P32N34n27m31m78L12R35k88p36n3J80P93K09p75
2065f1m58J2Q94K44n50n45J97P73R9l89n66l03N35P13j46o60o71M70O99M05p92
2086a00l97M1O81K19l62n81J57N33P6K2o14k40L94P49k4m38o16J95M81J89kq10
$$ y = [562, 386, -179, -836, -179, 348, 268, -46, -978, -310, 700, 673, 24, -555, -839, 142, 761, 335, -275, -494, 299, 886, 214, -458, -512, -228, 933, 545, -160, -854, -132, 360, 628, 59, -506, -365, 276, 583, 183, -249, -531, -106, 917, 342, -25, -561, -263, 362, 569, 127, -184, -398, 91, 569, 296, -402, -566, 124, 775, 552, -407, -768, 180, 610, 621, 54, -772, -362, 187, 700, -73, -436, -458, 170, 794, 256, -195, -901, 36, 608, 465, -50, -647, -269, 275, 656, -180, -604, -151, 139, 843, 73, -681, -489, 58, 515, 420, -337, -537, -49, 533, 618, -254, -695, -105, 304, 677, 157, -553, -468, 264, 798, 271, -160, -638, -326, 609, 321, -415, -468, -288, 505, 714, -61, -519, -507, 387, 631, 81, -464, -267, 506, 605, 216, -350, -653, -118, 595, 449, -211, -882, -412, 287, 692, -100, -497, -456, 225, 444, 82, -499, -342, 191, 267, 289, -325, -565, -171, 578, 554, 116, -500, -305, 176, 365, 363, -447]
2108d47r4O52K61j37m50j13M74K60L51r88j28M23J95J36k00o28J56N20L09l18
2128B34o45j50N53L43L3r34J29N04O9K81k87m92j8O30J43l05p70L57L37M11j00
2149C23k76n98N73O50o46q0k82J35M00j83j38l74L22M64k8po37j91R71K6k36l76
2171a88m06Q80K08n2n35j24n5O41M6m18k67l30Q53K90o80j32q6K14O76m11l14
2192a90k23L58L41J21m54j65j88M17L36k24n13R2M24K57K21o80k92K27M55l02
2212A8k02j26K43K81n2l80j1r7M82J20l46j89r0M62L61k66l19k17J52L04J71m78
2234a79k12L2N71K1K2n84p4K72O04l99l46l9K50K92O5m15k65J07N20M7m68n2n3
2257b83L07K38l03m93J83M55L38l65m62j89L87O64j24m17m67K25K49J40k09n04
$$ y = [-447, -541, 111, 372, 235, -215, -328, 146, 406, 757, -231, -359, 64, 259, 395, 195, -433, -277, 243, 552, 234, -411, -561, -8, 335, 368, -566, -437, 67, 136, 417, 130, -362, -380, 250, 393, 88, -682, -325, 12, 423, 323, 47, -551, 22, 672, 26, -54, -336, -201, 199, 16, -122, -496, -174, 290, 262, 255, -382, -573, 398, 424, 188, -188, -594, 286, 494, 442, -93, -217, -272, 369, 415, -3, -270, -600, 253, 543, -137, -269, -355, -141, 535, 124, -190, -413, -55, 286, 407, -47, -212, -400, 17, 353, 129, -384, -292, 132, 389, 610, -70, -362, -135, 320, 18, -184, -310, -67, 214, 162, -218, -229, -326, 156, 276, -70, -259, -349, 113, 474, 208, -111, -328, -176, 128, 299, -179, -391, -359, 212, 233, 255, -329, -403, -131, 473, 74, -272, -311, -61, 231, 296, -119, -384, -277, 243, 290, -178, -230, -283, 24, 262, -41, -534, -351, 104, 442, 77, -385, -574, -187, 477, 353, -64, -531, -306, -57, 83, -126, -630]
2277f30M30J75N54m65m95J20K73M57k07j67n62O56L76R7p01k78J52O36J0p6l08
2298D7k96J04N17k85n93K51J5K68K90n59j54K91N99j26m04l16J70J19K72l32j62
2319b84J86o1O93l17j75n04M29K33Oj84l56J75O97k1n72j87N2P4L68oo97J32K0
2342b99N47J34m70j89O2O96j50m02l30K32K65K60o78L21j02pL32M2m22Lj77O75
2364C43K1n22k35K1L09J68r1k21j81M76L38p9n25j65M63J73L6p90K18L25L78K7
2386D87l48l65J42K38Q7l44j1j73N36m1j44r9j73J96J21K42o53j92N10L11N9j52
2408B34l25R6J03K59k95k42l6k8M44k6n33Q9J02K30J19r4n27j6P20j66j10l63
2430c65R9L70k15L57k31k21J62K04mk61j41N33j72K01l39j67o4M80Lj01l00k4
$$ y = [-630, -200, -25, 529, 64, -431, -311, -38, 419, 212, 45, -517, 139, 515, 612, -89, -367, -215, 421, 431, 355, 47, -249, -145, 372, 87, -506, -255, -240, 28, 318, -241, -395, -104, 495, 369, -35, -351, -181, -62, 210, -122, -284, -98, -159, 534, 217, 42, -462, -33, 200, 206, 22, -334, -159, 538, 517, -55, -242, -190, -116, 252, 246, -451, -319, -299, 248, 382, -88, -277, -215, 481, 331, -71, -401, -169, 96, 356, -322, -1, -103, -110, 222, 264, -158, -155, -332, 343, 364, -158, -393, -372, -63, 105, 14, -207, -388, 88, 426, 347, -178, -343, 120, 293, 329, -461, -243, 82, 460, 487, 139, -226, -84, 154, 241, -103, -114, -287, 249, 208, 64, -35, -208, -12, 109, 351, -302, -494, 16, 327, 386, 234, -91, 5, 108, 367, 72, -170, -206, -234, 210, 184, -349, -260, -158, 72, 191, 97, -430, -446, 274, 108, -2, -365, -266, 104, -111, 246, 15, -206, -44, 160, 156, -105, -246, 287, 115, 316, -23, -190, -254, 226, 229, 128, -172, -196]
2452a96K99Q8o7k18l93M96n9M10l03r9J0Q2K09m56L6k8J47J40j62Q7j84J42k2
2475d1K08k75k2K13L22k26l30r5j27K62N65l84k64j14M33J44k74l0J7j7M01q0
2497B86n66JJ11N13l20j79M5N6J50j70j77k06M22J77l6K67n48L91k63N7J50L8
2519A99j46k09K88L0q2j94j02K05K77k72m45K43K39J29J58l49J30l17M7M09j32
2540A06k38L1K67r5k44k41K57RM07j21l71lJ22K08K67l09k14P1K09j8j14P2j29
2563g1N4R2kj05k44k8L07K31n42p8J26L72K03k23m38J29K98m9j04k41K56L94l19
2586A8L7k46q8L26O0k62L65k11l84N59l07m7L10m36L82O3j04j00R7n8K86j20k59
2609a19j62L32J22J2m22J09P9J26L31l90l00j3L40n3P7k13k05K47K52l1r5k25
$$ y = [-196, 103, 191, 124, -94, -487, 9, -50, 360, 57, -42, -32, 50, 259, -197, -161, -189, -42, 98, -64, 23, -161, -19, -41, 167, -108, -130, 83, 405, 179, -151, -246, -373, -111, 454, 70, -194, -308, 125, 269, -5, -35, -18, -35, 366, 286, -280, -279, -168, 345, 25, -154, -109, -53, 97, -73, -250, -456, -34, 143, 107, 374, -174, 217, -46, 11, 161, 199, 53, -156, 132, 162, 80, -114, -216, -11, 266, -6, -451, -208, 31, 160, 318, -31, 99, -218, -171, 238, 106, -132, -101, 166, 71, -173, -414, -157, -148, 259, 138, -233, -236, -114, 94, 361, 52, -162, -91, 118, 100, -14, 58, -71, -17, 75, 73, -32, -276, -304, 3, 234, -308, -386, -260, 112, 315, 92, -346, -217, 81, 32, -72, -313, -57, 337, 18, 55, -191, -279, 47, 107, -155, 210, -1, -385, 174, -133, -180, 130, -306, 76, 139, 35, -65, 32, -26, 260, 140, -119, -281, 51, 173, 185, -237, -128, -49, 77, 408, 18, -282, -295, 45, -8, 69, -144, -349, -102, 150, 119, 24, -201]
2631b01k8J86j94M14l52Q2N9K69k17n7N0R9j6l9l5l54L53K06R1l13J18m39M25
2654A07l56M73k82mN2J11j30K6q9R5n5J80j41k2J77Qm6j82J01k02M70k88O8N7
2678A28r2Q0O9l70J66j53K23J35k50K09m25J84Kp6j5J40P3J60p6J88m73K67r9
2701ek61N16k14o0k77O26l12k0l40L04pJ19K4k38R4j60K16P9o7l36K56M18k07
2724A48k75J18k20L46Mj63k81L88o9n8K17j12K2J19q6n4k42j42J46L02j35j06
2746a33R1Q5o5J91j80k25L21J7J53q9k85N3R7r3J31K0M1j68J00J08k36o0J05R1
2770G0K60m87N2j00L33OM2m65K56K5k5k82M84k72J05k85M67j83m1l64M18J21O7
2793B02m57K03L70k71J72j69j82J22N0o2j31j93K29K9L11j79j12j59K95J4n1k54
$$ y = [-201, -229, -43, -237, 177, -175, -93, -34, 235, 18, -39, 11, 110, 94, 55, 20, -334, 19, 225, 316, 3, 121, -318, 107, -249, 224, -58, -62, -10, 101, -29, -3, -92, 3, -52, 128, -13, -35, 142, 150, 104, -78, 23, -179, 291, 3, 71, 128, 36, 116, 185, -185, -19, -172, 51, 186, -64, 145, -280, -96, -94, -170, -185, -45, 28, 188, 112, 300, -173, 94, -5, -266, 250, 36, -24, -301, 325, 13, -7, -347, -43, -50, 69, 93, -145, -51, -211, 5, 84, 17, -319, -63, 355, 148, -127, -9, -229, 117, 121, -42, -323, 65, -4, -62, 155, 43, 65, 184, 98, 44, -198, -340, -194, 108, -27, -133, -42, 43, -22, 169, -11, -236, 85, 102, 255, 166, -119, -66, 31, -62, 69, 89, 130, -38, 62, 170, -66, -126, -21, 70, 330, -157, -105, -205, 128, 134, 176, -289, -33, -8, -33, -315, 169, -103, 2, -283, 184, 1, -40, -404, 14, 135, 202, -255, -52, 318, 47, 219, 50, -132, -10, 40, -22, -153, -346, -117, -88, 223, 44, -68, -227, 68, 82, 31, -223]
2815b23L3J87L1L5j51j1L44j81m6J63j71rJ95l2k16j49n8L07r7J65l03J12j15
2838a90Q1J69K4L8j12j91L6L14k03K45k35j89K39q5J78j15j52L16l53j30L18J91
2860A94j18ml42K49M25k56l17J19j42L22Lr9k57K1K85j00J4p1j86J79J0J39k61
2883a93L29k89J24J98o6l38PL23k46J57J02l19J03R3L6n1K51k57O0K92l72q0k51
2906c87M41L04j59k25J40k17K55k56K87m66L15J07j77M33m60J49j58M4j8P8M2
2927G2j04J01Lj38o0L85l26Q4j38J01m8K19j73M6K2j48K23l90L28R9k46K86m57
2950b59N53j31j64n3l4L52l67n6R4oJ76k5k44o1M03j88R7p9k83J50J79P8l7k21
2974a26L5J30o5J51l87L07J38j4j33m44K66L29k29K33l30L16j78J34j93J35j27
$$ y = [-223, -190, -3, 28, 63, -88, -99, 245, 64, 18, 181, 10, 1, 196, 164, -52, -201, -259, 48, -49, 116, -187, -75, -190, -109, 60, 84, 122, 10, -181, -145, 169, -34, 211, -24, -213, 26, -59, 119, 4, -148, 168, -185, -315, 3, 194, 76, 72, -270, -21, 404, 148, -169, -50, -192, 130, 133, 34, -223, -202, 83, -17, -3, -74, -260, -81, -71, 68, -193, 136, -153, -29, 169, 103, -235, -228, 95, -151, 6, 108, -211, -108, -15, 21, -30, 221, -36, 24, 316, -56, -136, -387, 54, 358, 199, -26, 114, -103, 152, -104, 183, -283, 32, 139, -38, 395, -65, 84, -74, -30, -48, 30, 72, -32, 69, 72, -66, -126, 259, -67, 17, -121, -20, -68, 151, -22, 24, 46, -102, 121, -269, 59, 158, -88, 198, -259, 294, 163, -1, -54, -88, 264, -103, -159, -65, -71, 105, 80, -164, -225, 178, -10, 87, 8, -275, -125, 54, 132, 95, -126, -91, 39, -26, 125, -262, 45, 183, 169, 36, -408, -142, 187, -42, 191, -139, 177, -1, 133, -60, 75, -52]
2995e2r7mL23p2n5J43j46j31qJ20j18k9j10M34J04k60k02J16L97k65J98l68m0
3018a22J55q3K18j18k55L21l8k55L06R0j61Q9k77J13j08J3P1j03J78j15K45p0
3040I4r8j38J66J50k91K01p8m4j1K43l21J44k10K50J45j26j92O0k0K13J2N7m48
3063b42j00PM44R9k35J24m6Nj66J24n2K05k71K09j26k9N5K29j97n8k54j62L00
3086a37L51j39Kr4r1J67m6J35L5k78L06l53k5R1p8J23L34n20K00o2J25J28M4m34
3110b16K19J05n3k71OL30k24J73m1j17J51l64L29J88l69J7m9R2L37n3m58K57J97
3133A86l06K72j52N2k99M09j06l7p0j04R5J07J70j15k06K34M6k66L59m41K19j46
3155i9P5J02j42o9K22p5K4N5j07K94j27L9q1p9k9J08k34K77k33J40k31L29L18
$$ y = [-52, -149, -153, 170, 98, 43, 186, 40, -91, -99, 21, -97, -126, -236, 198, 302, 42, -160, -44, 353, 88, 286, -82, -122, 33, -50, 168, 50, -205, 116, 78, -177, 129, 219, 58, 147, -130, -17, -125, -112, -41, -144, 34, -81, 164, 94, -4, -142, 24, 174, -117, 84, 6, -38, -49, 194, -127, 17, -193, 57, 202, 76, -116, -56, -76, 137, 149, 206, -242, -342, -335, 109, 208, -27, 97, 51, 56, -110, 14, -38, 167, -104, 105, -21, -50, 5, 234, 37, -21, -275, -437, -137, 214, 75, 77, -17, -108, 59, 13, 148, 183, -95, 211, -142, -167, -76, -154, -31, 303, -217, -17, -79, 46, 174, 218, -216, 3, 108, 55, -216, -210, 120, -104, 69, 28, -89, 62, -302, 27, 215, -154, -137, -186, -94, 243, 190, -268, -11, 186, -120, 152, 0, 52, -247, 162, 56, 19, -51, -155, -60, 47, 217, 102, -104, 130, 176, -90, 269, -172, 47, -99, -24, 78, -64, -133, 89, 14, 38, 93, -14, 280, 153, 192, 111, 32, 3, 111, -123, 154, -79, 61, -170, 159, 477]
3178D77p72K55j35Q8lL03m07K49k87L17j01K09j64pK9k11K29R6j30L60k06m9j91
3201e1K10l79L20k14J71l17K11J09r1qp2L63k77Qq7n7N5J07l3J4QJN8n2k2k1m4
3228i0K62K8k2j1Om75M68k31J4J31j96K43k36j65J27K45J12k45k4J2L49j37j72
3251gpk8O2R5j73J49j99L4J01kJ86l91K91K0k3j26J35j84M7J17J94n71J35l50
3275d95M21J15L4j9r4J52j52J59m2Pl29Q4L04j29j35j24J13jj60R1J20L66l81
3298i5J8j23L42j58P5j75M3J04j06J32J30m71O3Q9J02j8J48j1j18J14jj4j57M3
3322d4M6M7R6m9k77K65K23m38K54k02L2J16k32K29l6l9J3R9j28j52K76j05p9j90
3346b75N4J67j33L05j83l5J17r6R2p6k0j9rK26rj77J11J79j74P4n0n3J7lj48J33
$$ y = [477, -295, -40, -175, -87, -90, 213, -194, 55, -232, 85, -16, 193, 29, 22, 51, -160, 69, 165, 35, 395, 189, 140, -51, 159, -220, 100, -114, 57, -260, -49, 60, -31, -39, -111, 252, -25, -17, -104, -161, -106, 1, -32, -18, -10, -9, 49, -3, -25, -46, -90, 172, 200, 178, 167, 173, -302, 166, -65, -51, 80, -116, 127, -109, -274, -147, 98, 210, -35, -59, -47, 302, 165, -7, -14, -42, 20, 115, -58, 91, -108, -74, 27, 25, 211, -180, 111, 131, 108, -18, 117, -67, -20, 97, 291, -280, -145, -495, -74, 41, 75, 56, -38, 114, -38, 121, 79, 86, -243, -159, 145, 16, -119, -243, -130, -131, -291, -200, -80, 286, -95, -77, -200, 142, -16, 59, -116, -73, 31, -75, 57, 187, -284, -221, -132, -30, -48, 100, 89, -29, 85, 84, 70, -87, -44, 2, 49, 145, 96, -181, 84, 307, -131, 123, -79, -47, 69, -163, 66, 30, -9, 4, 103, -25, -177, 99, -6, -85, -275, -221, -54, -187, 118, -65, -100, 17, -79, 13, -63, -83, -102, -111, 115, 106, -71, 40, 219, 45, 119, 69, 16, 33, 30, -118, 15]
3372A5L1r5p9K07Q1J19j43j90J10k7qO6k10J21K7n1j4L5j3m3r7K90k61K52k63
3397a40N07j17r7j94k47J48K32j13L7j04j51J12M2Q8q9J61o1J24k12J92l02J2
3419a72K69K4J17l85J10J44m03Q8K67k75M09K4q4N5l96J50J32j8k26L8K12q2L98
3442C96k93k80L49n1j59K23l40J67J4j54J92J3l25K41J43j60j65K0J32q3J83J2
3464G5l06L84j43j91J60j11K64kK5k45k2n7L77j27j12J48j08j79K81q2R6j60J27
3487I2M03l63q8l3o5M3orj19J9J49J14oj56j20j27M22k34J3J19j37M37l44k2j48
3512a66K77K8j69J01k21J13K04L7k77L5q2J21j70O13m32l03J71Q4J37Jj67P7m0
3535b8j26K32k31J65Q3k56J65K1N9L7l28J58J16j52o7n1J95R9k46k0L06J52j58
$$ y = [15, 46, -49, -128, 79, 160, 279, 136, -54, 56, 29, 21, 87, -123, -2, 25, -26, -40, -5, -18, -61, -158, 132, -129, 123, -140, 367, 250, 153, -41, -288, -140, 92, -21, 16, -88, -239, -127, -85, 3, -86, 75, 14, 138, -74, 118, -184, -172, 97, 121, 238, -147, -37, 107, -296, -208, 59, -216, 193, 217, 133, 188, -208, -58, 74, 56, -170, -132, 80, -2, 396, 103, -177, 172, 121, -38, 185, -155, 12, 26, -128, 64, 77, -248, -7, 136, -24, -189, -169, -37, -120, 63, 75, -231, 153, 10, -181, -21, -132, 132, 130, 155, -90, -112, -169, 208, 81, -31, 117, 9, -170, 111, 29, 125, -35, 92, 495, 132, 44, 11, -54, -11, -17, -26, -145, -126, 23, 137, 131, -25, -145, -272, 150, -84, -71, 48, -89, 348, 4, -18, -166, 111, 139, -30, 71, -150, -37, 167, 204, -73, -38, -120, 1, -169, 444, 12, -291, -120, -36, 101, 102, -65, 12, -28, -154, 78, -153, 12, 95, -161, 4, 25, 84, 121, -207, -49, 67, -85, -152, -203, -8, 91, -155, -175, 131, 283, 125]
3558A25l30lN1K74j10J37m83M55j9o0r2K51j2k51J20K7j14r7K39j12j6n0J80k36
3582a26Q5J69k4l15K21k70M01j91j24N6P3l6N3N4k40l2K81j03J28k74L17O2n6
3605A09j2l03L59k47K36k46P1J4M6M7R0k13p5q9K39l7R5j32J28j28J71k68J29
3628a6Q4j83K72l51J03J94k03J52k9k2J44j2j07j18n0p1J66J6M9M4Nj50Q8n5j51
3653b01L90l60J52J59j32K8o8j21K96L4k34O6m3l2J30k46K64J6kJ30j27j44k27
3676b72K78r0p2P4J19m3P5Rl9k32RJ70k52K73k6J05K13k33j29j59L72j01J24j3
3700A60j67n14N47J5J48j84j05K69l3o5J98k42J10j84R3J85l28J70k59J17J29
3721F0q6J18J48M9m38J32qj56J30J8J29k14K49j15j16J16J41m46J79m8J22n4Q9
$$ y = [125, -205, -208, -157, 117, 7, 144, -339, 116, 97, 37, -55, 196, 184, -67, 53, 80, -34, -131, 108, -4, -20, -70, 110, -126, -41, 128, 104, -211, 10, -260, 141, -50, -174, -118, -45, -81, -28, 26, -214, -246, 35, -68, 60, -214, 103, 165, 109, 97, -206, 153, -94, 142, -104, -33, -19, 27, 74, 164, -49, -124, -213, 26, -11, 84, -48, 80, -48, 123, -145, -16, 68, -115, 157, -194, -91, 103, -100, 52, 23, 1, 145, 133, 26, -92, -142, -213, -47, -31, 18, 62, 67, -83, 5, -50, -201, 189, -171, -19, 140, 8, 36, -32, -153, 143, 177, -57, 9, -34, -66, 64, -182, 82, 98, 96, 226, 99, -45, -272, 6, -84, -156, -82, 37, -6, 69, 78, 39, -193, -184, -14, -266, 7, -19, 86, 299, 66, -63, -222, 150, 49, 173, 160, -7, -521, 26, 41, 189, 5, -100, 169, 136, 71, 269, 27, 137, -47, 46, 231, -97, 73, -186, -69, 60, -26, 92, 240, 289, -149, -17, -25, -181, -51, -33, 96, -118, 131, 16, -100, 16, 157, -289, -110, -158, -36, -90, -1]
3744aJ61j79l35N55n11L30J83p5k8j66P7n0R8k76k6J79M0J48Q6j18J78k24q6j5
3768e5M1k9J74p0J66l66J86O9q4l13K98j5q1j47R8K13j03L3J7j43J83l17J18M72
3792C45m30Q3R7j85J51nK69l10j44Q7P3rK10l20M3j53j30J80J30N0k23K31k27
3815a87K70k24J81j01J0p5K79j59p3j4M02j05l05Q6J97j25J0k45L25j38j17L63
3837B55j23k02M5J31q8j55K1o4K59J12q3j41j1R2Q1m03K91j54J19j27P8oP0j24
3861a27l8K28N0j80N7j9M9J12j89Pj1J14n4k25M59l88J92%J72k47J64K66l50J34
3885A76k12Q6mL2K11l00K04k11K1j37J91l16K39J14j69J4N7j87K81j16P5o6J29
3908A12k74K1J49Q5q7m2J74L2m49m1M01R2J72l87P0j30P7K22j25Kk20M0K7J83
$$ y = [-1, 160, -19, -354, 201, -310, 20, 203, 128, 100, -66, 11, -39, 59, -217, -243, -64, -24, 124, 210, 92, 270, 46, -40, -55, -14, -43, 131, 61, 227, -139, 47, 116, 32, -281, 17, 2, -79, -226, -128, 85, -18, 15, 32, -111, 72, -245, -127, 345, -85, -2, 95, -90, 61, 56, 325, 15, -129, -42, 31, 22, 232, -88, -45, -198, -328, -148, -18, 32, -191, 40, -187, 83, -141, 40, -61, -51, -126, 153, -6, -79, -93, 309, 204, -101, -15, 182, 57, 67, -178, 147, 9, -108, 255, 132, -70, -25, 106, 18, -137, -116, -180, 79, 191, 108, -33, -44, 48, 129, -274, 17, -137, -18, -145, -67, -73, -3, -127, -165, 63, 113, -67, -10, -29, 20, 132, -57, -50, -61, 53, -1, -226, 233, -155, 37, 37, 209, -38, 126, 392, 42, 176, -36, 50, 46, 78, 289, -11, 193, -18, 3, -134, 57, -259, -20, 94, -75, -61, -4, -191, 90, -26, 49, -17, 112, -162, -141, 8, 93, 6, -36, 138, 170, -279, -320, 81, 173, 345, -42, 28, -102, -25, 197, 72, 74, -146, -106, -79, 104]
3932A04j91J51N3j29j37J53l7J66l53K54n5m4J25j76j56M23k80j07L57m45N85
3953B61j15q7j08J56q3J00j57J0L6j11J47k86L34n9Q8j20mm0J89l64J10J20j36
3976a19L34k96P6J0o4L0LN1n9Q2N5k23N4R8o1p7P6L29m39L45j09j00j31J54j59
4001a40K43p3Qn4j03j89M13k45J49J31j97k4Q9J62k13j60K10J00r9J41j51n1j14
4024a67J9M3L23n06J98MK15J9l37L04J28k80j4j04l2L42m34K39J94j26j80j9M92
4047C21m67o1K53k4P0m8OP1p3j10J59r7r7K8n1J41O1L0j23k20K99j37N7L4N2N7
4073A31K1j47p9J62K3J05l60nL84j83Qq6N5k12K12l73M74j46O5j03K14k20l41
4096d01N31k46m6J34N3R0N7p2l07n2R1K73j61j7K2L72l67l5R7l3J39k63l1L58
$$ y = [104, -87, 64, 117, -12, -149, 4, -33, 133, -220, 34, -21, -65, 60, -116, -272, 151, -129, -236, 121, -324, 261, 146, 59, -49, 107, 24, 124, -33, -23, 13, -98, 49, -237, 97, 38, 126, 6, 2, -38, 151, -213, -103, 17, -119, 215, -81, -5, 5, -59, -29, -26, 25, -34, 48, 103, -120, -66, 32, -29, -106, -30, 299, -140, 205, 96, -4, -135, 19, -140, 103, 30, 38, -16, -119, -308, 105, -140, 9, 140, -57, -81, 8, 170, -43, -203, 7, 107, 8, 149, -2, -53, -167, -148, -105, 218, -288, -90, -86, 129, 148, -189, 115, 243, -37, -51, -155, -187, 155, -279, -40, 154, 28, -152, -171, 321, -146, -207, 46, 22, 92, 44, 50, 121, 48, -62, 97, 0, -97, -69, -120, 21, 82, 112, -11, -231, 68, -69, -12, 22, 74, 131, 152, 5, -74, 88, 111, 216, -144, -149, 235, 52, 60, -26, 29, -183, 29, -344, 130, -16, 49, -54, 160, -60, -401, 130, -116, -162, -28, 25, 115, 172, 100, -207, -259, -168, 105, -56, -73, -51, 321, -46, -81, 16, -17, 122, -141, -172, 186]
4120A86k53K92l25O2m7j61M02j11m2q2K9K7K40N3M4k31k0l32K53j6j72n1K08k54
4144c01K02k5OK22m8k5O2j05J13j8k27J2J06J75k30K84Qk84k26N86k35j47M7K43
4168A95K5k48j22J65m9L00j38K42m18j02K35k89L43l34J79P8n1j34j00K10J50
4189A37q0l4o6k00K38K81m72N24l97J04P0j78N1N3rJ32j22l14N72m00J15Q5j30
4212d0o0M3J48J6l82J85K01o8J02N8l62K41k72Q0J94l17K72k76N1J51K05j14k12
4235a56K42k17K13j43OJ27O4k7P7k50r9p9L08p2q9K22p3j14J35M4j15o7K0k0n1
4260a14j0J47R7o9o4k26N8N10N0l59N1k39J17K03K5j85r0P6k10Q6J51P0l45L1
4284b39K48o4J5M9J96j70%P0m05K99Q0l4L3l49K60nJ70k33M8r3M9M49k63k05J31
$$ y = [186, -67, 225, -100, -38, -85, -246, 156, 45, 3, -79, -50, -23, 217, 270, 314, 83, 63, -269, -16, -32, -204, -255, -47, -301, -99, -124, -118, 104, 56, 31, 93, -12, 101, 83, -144, -132, -26, 149, -81, 203, 211, -73, -299, 287, 52, -95, -48, 195, 220, -28, -150, 15, -34, 266, 128, 370, -48, -150, 85, -204, 139, -195, -16, 62, 11, -123, -223, -13, 137, 57, 23, -43, -243, -5, 276, -196, 328, -69, 35, 105, -73, -22, 31, 22, 154, 32, -282, 290, -110, 5, 90, -40, -100, -57, 91, 107, -275, -90, 111, 43, 145, 203, -159, 82, -190, -110, 84, -233, 39, -237, -186, -35, 170, 56, -156, 86, -131, 82, -61, -55, 72, 136, 109, 186, -64, -163, -242, 66, -6, -95, 127, 54, -60, 75, 119, 4, -63, -43, -63, -114, -124, 23, 120, 51, -13, -239, -181, 329, 379, 20, 71, -168, -51, 152, 177, -8, -98, -22, -232, -146, 5, 75, -270, -239, 9, -55, -40, 9, 205, 35, 35, 105, -300, -1, 79, 45, 78, -271, -11, -16, 154, -79, -31, -124, -75, 374, 111, -94, 37]
4309C7K47L8l10l3j5q0L58k41j09J67q5o6O9k32K85k98K76N0J79j71M8mj49p1
4333a10J3L91k15J38l72J36j10L67k88j56Q1J42Q9k71N03m81k4L28j95l9K21l28
4355a80L4J96j41P7K62k72K28j03l08J74J38j26j96J90P9L0r5p2j9K99l65J39
4377c1m0K7J51j33O6n5J09k37K52k37Q7Q4j1J63j51j92J96J25j95q7O4N9k9J85
4401A70q5k51M3Q4J39j29o2L8j42L1K68o5J46l06J47R5r8o3k62N46l9j58K0j01
4425c4l22L41j33K21k25j19K72K1J5Oj76J31J46l17J77J60l78J77L84l69l8P6
4447A6q5R2K10l11O7J07l27K11K2j12K88l04K93k15rJ04jj85L56l18O6J31N9m2
4471A13j85qp4L08l65J40J78k4p9R5j19jj15L00k04o5K99k57j1J96l43O0J5J11
$$ y = [37, 284, 322, 12, -21, -36, -116, 242, 1, -108, 59, -26, -92, -23, -255, 30, -268, 8, 58, 237, 66, 114, 110, -39, -110, -97, 294, 79, 217, -155, -19, -129, 238, -50, -206, -125, 17, 106, -165, 338, -143, -167, 161, -34, -73, 148, -180, -146, 50, -91, -14, 248, -24, 204, 101, -207, -33, 105, -21, -217, -27, 52, 82, -13, -85, -104, 195, -170, -31, -71, -44, 107, -26, 40, -15, 94, -143, 109, -128, -41, 43, 32, 195, 44, -148, 48, 173, -22, -109, -45, 14, -15, 170, 85, -166, -123, -39, 100, -29, -91, -53, -195, -164, 104, 39, 185, -121, 26, 121, 23, -40, -302, 244, 205, 47, 67, -34, -356, -15, -148, 73, -152, -271, 1, 22, 37, 43, -133, -2, 144, -173, 4, 164, -214, -37, 347, -22, -60, 16, -69, 23, 233, -78, -11, 96, -231, -20, 2, -110, 178, -126, 167, -48, -57, 47, 46, -139, 217, -101, -35, 96, 155, 113, -72, -80, -154, 154, -211, -71, 107, 83, 4, 99, -20, -21, -136, 164, -40, -105, 194, -63, -74, 122, -221, -161, -146, -35]
4495c5j02J3N52k55j19j91K47j57J00q6k00K14k64K53k28L80l58K38p1j70K69
4516C0R4j58P9p4k4Jj03K74j10oJ01P3k64J31q4R8J48j07N9j55j39L1J36po7l70
4542d13M70k66K43J38j19k13Q3K0J29n0J31p4k1qm1P1jo0K8q2p1J45J39k52o5
4567a39K0J21P2j3P4j6k16J30J01l4l3r5j41J72J70l2j45j35J61o3N7r1K3K51
4591A99n7L1l51P6R5R3J62m80K84j22k8J32j44K45Mj4k14n0O9J54o1j81K37j45
4615f6R2j02J49j13J45j06K4k70J23J22R3k12J43O6J9K6j41J35Mk03J5j45M0n8
4639b20O17j66k15p5J48k8J16j75j7j78Q7j30L57n8J43pk42pK23j37L43r4k09
4662G6j50o0K47j98J02KJ42l65K68k09J47L0k03J93k08r9P7L45m7j57J70j94R8
$$ y = [-35, -137, -124, 428, 173, 54, -137, 110, -47, 53, -33, -233, -19, -283, -30, -258, 122, -236, 2, -69, -239, 30, 124, -34, 45, -29, -53, -52, -155, 119, 9, 3, 104, 177, -87, 44, -40, 58, 206, 99, 158, 3, -136, -105, 31, 24, -43, -413, 57, -209, 34, 172, 53, -160, -77, -57, 72, 22, 153, 79, 58, 50, 9, 80, 79, 19, 47, -35, -106, 39, 178, -74, -139, -119, 2, 74, 61, 135, 119, -97, 33, 134, 100, 67, -28, -169, 3, 173, 141, -4, -139, 22, -41, 16, -75, -52, 199, 142, 173, -178, -102, -7, 86, 248, -232, 52, -70, -98, 34, -110, 135, 139, 125, -89, -139, -70, 84, 23, -158, 79, -66, 26, -76, 73, -40, 105, -1, 23, -247, -124, -2, 91, -121, 22, 88, 107, 133, -8, 127, 131, -72, -57, -202, -162, -220, 397, 231, 16, -59, 89, 61, 177, 2, -15, -193, -106, -236, 121, 63, 206, 199, -43, -50, 173, 36, 379, 285, 76, -74, -134, 113, -85, 17, 19, 161, -204, 64, -145, 2, 32, -171, 22, -186, -285, -208, 137, 90, -67, 103, -91, 7]
4685Gk2J9M3r3L6l6k49L65n0J0j60K93m17M2m8K42j69J26J21q8N2j0j4K82m79
4710a97j9K61m1l3P5K7k88K97k65K46j84K28o8J81k24J05o1l38k9J52K22J24m79
4733c08L82k00O3L08l79K20q3K7j58M9L03m78L74m8j26P8Q2j97K37j18p5r7K82
4756A38k53J43q4K56j23l21L06l07N42o14L19k58M31l0P4j50N3m20J92K60l3k03
4778h2J17j77p7K47k38M30j65p3L9J75N5l49K02o2q1j71j7K15p4O1K40k08j45
4801a38J43j55N0J35o8J16q7j88K51k94J62J86k74J28JJ19J53m80M2J70o5l6J36
4824Gj58K41p6r9L3j14J43J77m9R8q3q5K05k90j7Q2M3J43j14k28J47k46M2o3J11
4849a50J34M8P9j32q7l2m3j3K99m7j0P3k87l5K64l75L83j8j89P8r3J74j13M5J18
$$ y = [7, -15, 4, 47, -46, -10, -46, -295, 70, 20, 30, -130, 163, -254, -212, -260, -18, -187, -61, 60, -28, 24, 14, 0, 282, -197, -216, 45, 4, -29, 46, 73, -215, 82, -183, 63, -121, 107, 39, 220, -4, 101, 40, -298, -327, -175, 47, 171, -308, 74, -126, -63, 245, -134, 86, 3, 30, -128, -79, 224, -254, 120, 72, -54, 24, 106, -91, 146, 28, -47, -144, 138, -115, 28, -56, 200, 77, -244, 62, -245, 297, -317, 2, -256, 175, 145, 219, 69, 122, -298, -106, 154, 121, -82, 35, -142, -219, 28, -210, 220, 55, -18, 21, 196, 251, -98, 104, 42, -39, -210, -227, -12, -86, -25, 215, 7, -138, 5, -150, -100, 35, -33, 83, -4, -192, 59, -235, -73, 113, -161, -33, -32, 87, 240, -240, -198, -28, -93, -129, 7, -151, 90, 14, -85, -52, -166, -23, 154, 105, 203, 120, 35, 240, -50, -67, 15, 58, 201, 87, -141, 6, -240, -198, -261, -150, -16, 32, 111, -21, -108, -140, -183, -196, 103, 56, 46, 119, -168, -203, 61, -314, 69, 51, -138, -60, -153, 21, -92, -47, 71]
4874G1k34M66j73j52j01K89j73Q3N5j23K1L8p0l0K8M5j03NJ43j58K46N3l60J57
4898B3K02k56J05RK2j79R1j63L38k13Q8Qj68j2j75L36J3o6j0j06J50Mj50O7o8
4923a10o0J93N6j66K05k30K8q3Q9l42P87l22r8L59l38J98j06j25L96j46j9j38
4945B8nK0k18J00q9N9P5p9J30N7j6j45J45j54J29K37l64K0J40j08j8K2N7l5r5
4970a07K66j73o0J23N9k36J76J17k69R4O4k9N7j2p6K8P5j25K12j39q6p6K20M7
4994A50p2k56L36P2k55j01L66j41l38J45J41p5O8j85K18J10j75j3l3Q2n5N6j98
5017a53J24R9k26R6K06q8j77K10J96j54m1J03R6m11K41nK10o9k16j52j11J54J13
5040D5J51j80p9J98j44J59k2o6j1j6m2p7J8J06j38m8L87k06q6j15J73o0j90P8
$$ y = [71, -163, 303, 130, -22, -123, 166, -7, 76, 131, 8, 29, 67, -3, -33, -5, 40, -63, -58, 85, -73, 173, 226, -134, 23, 225, -31, 74, 83, 105, -74, 17, -146, 192, -21, 67, 75, -93, -105, -280, 56, 69, 3, -7, -113, 37, 41, -109, -42, -110, -170, 23, 79, -87, 118, -112, -84, -167, -78, -420, 367, 45, -53, 306, -32, 166, 60, -65, 331, 185, 166, 28, 23, 43, -175, -75, -164, -105, -30, -109, 21, 78, 62, -83, 62, -92, 37, 274, -90, -70, 70, -38, -56, -34, 23, -12, -107, 159, -14, -74, 49, 108, -128, 48, 165, -104, -10, 54, 25, 82, 70, -6, 22, 97, -28, 184, 45, -41, -117, 103, 150, 78, -178, 158, 230, -25, -126, 240, 99, -239, -94, 47, -28, 40, -145, 73, 183, 8, -5, -38, 44, -11, 45, -153, -29, 70, -156, -60, 146, 58, -119, 91, 287, 133, 92, 195, 291, -120, 121, 116, 326, 257, 41, -111, -222, -68, 45, 196, 16, -63, 135, -9, 150, 128, 62, 51, 35, -7, -84, -66, 40, -98, -146, 241, 35, -51, -166, 7, -53, -243, -165]
5064a65K63J24k86rm0Q1j4R0j73j2J53L84k23k32K85o1P3k03kj68N0j4R9J15m69
5089c54L67J37k99l4K56j00KO9J34o9j11k2J33l03J93k5p2L03m75J71K23j3j06
5112Eo0j63L26p6j79o2L56k4k10j00K18j89K76j62J03q6k1p8n8K17j40O1J76k19
5136h9L37k65J12N4L6j3j12p2K75k75Q7j52q5N0P1K15m72L78o6K9K66l74J33J2
5160H0k21L63j82Pj73M4J56j40k3N4K13k08o5k30J82N5J65j50m7J64j08j50K51
5183C7p9j54P0J84j80k4J86j09l3J30l7o8k5J18J55Q6j03l00k78M23kJ9j45L30
5207B01j39j82O3J68n4j29R4J97k48Q3N8JJ14j08j48J6j93K84k30J57j80J84N24
5230E33l81k49L32j84l38M12J29l52L16l07j29N7J10q7J27m9n9r9J45p3O6J68
$$ y = [-165, 98, 222, -64, -73, -113, -32, -46, 44, -129, -141, 12, 396, 173, -59, 226, 165, 238, 35, 33, -135, -85, -99, 0, 115, -354, 13, 150, -149, -183, 73, -27, -25, 44, 178, 109, -2, -24, 109, -194, -1, -26, -98, 205, -270, -99, 124, 111, 5, -55, -218, 108, 32, -147, -209, 147, 123, -87, -187, 31, -158, 118, -44, 59, -27, -48, -126, -184, 33, -107, -46, 130, -89, 248, -17, 95, 149, 185, 172, 60, -12, 263, -12, 75, -77, -162, -112, -41, 174, -298, 80, 14, 43, 309, -65, 68, 80, -141, 222, 40, 47, -126, -82, 74, -66, -89, -35, 178, -30, -95, -325, -143, -88, 77, -73, -120, 44, -64, -214, 37, -42, -196, -126, 58, -122, -146, 40, -69, -102, 28, -9, -77, -102, 16, 171, 257, 154, -146, -424, -1, -3, 16, -129, 201, 62, -120, -57, 111, 57, -72, 22, 219, -29, 54, 112, 113, 227, 119, -29, -13, -206, 78, -152, 5, -175, 9, 533, 152, -97, 235, 51, -287, 125, 254, -98, 218, -89, -218, -161, -51, -138, -11, -60, -119, -218, -73, -146, -80, 88]
5252H8k09j26L45m18J18K09l3J75j24o1k5O0k52L59j76K97j77j43J68O0m8j07
5274b0k57L16L2K3J16l16j0K01P4k00J84j3l3k1j06O8J95j65k55J99j69R8J11
5297E2j67P6O44n70l54L31O2j07r2J74q2O6n5j58L05k27J22nK43j23J14m05P9
5320g7K57m78M73k14L58o25K30rj34K20J77k54O2K35k89J20j23J80l41K95k4j15
5342g6K1k9n0M3J05J03k84N3J05l2P4r6m04L36j0k7N6q0J88Q5N4k54oJ60J6K14
5368B65n09L44k21q7L51k16J38j50n3K11J00j89Q2k66J60j15K67P6k32N7K4p7
5390d0Q8pP9j07J43q8k35K93J56j13k18l2K83r0m7J74l62K29q6Om27K52Q1n4O8
5415e4Q2L0j32J50j70J37l95K91Q0Q8j85K00j51P3r5J37j36J66k27O7J41j66P9
$$ y = [88, -121, -247, 98, -320, -202, 7, -26, 149, 25, -36, -61, -1, -253, 106, -70, 227, 50, -93, 75, 135, 87, -20, -277, 39, 71, 94, 210, -106, -116, 85, 159, -41, 143, 130, 97, 76, -30, 38, 233, 68, -187, 12, -157, -59, 52, -115, -39, 605, 35, -319, 12, 74, -33, -125, 49, -33, 33, -22, -180, 125, -102, 20, 15, 258, 135, 249, -156, -77, 180, -298, 175, -39, 319, -306, -76, -85, -219, 1, 178, -76, -14, 221, -68, 52, -71, 109, -232, 63, 39, -76, -55, -84, -134, -91, 14, 117, -167, -114, -9, -41, 33, -63, -467, -131, -141, -168, -112, -192, -4, 81, 135, -119, -125, 35, 51, 265, -244, 100, -121, -208, 143, -73, 65, -85, -138, 73, 173, -16, 66, -200, -40, -155, 112, 188, -44, 13, 37, -40, 48, 41, 120, 13, 156, 68, -167, 126, 282, 169, -49, -81, 202, 112, 65, 239, -123, 106, 20, 26, -401, -149, -68, -122, -54, 28, 58, -74, 76, -94, 43, -352, -61, 19, 107, -78, 122, -29, 44, -51, 86, -50, 116, -111, -44, 97, -69, 10]
5438A0j30lJ70l43K05P1J4K49j59k01K28l2N6L6k18K32k67J30j27M0K32J0k62
5461e9L47l31N3k03J41J46Q9r8j00k64L02J94l99J1R5K47n03J64P1j12K21L8k00
5484a50K43L5j7j08p6M9J45n3L0j91J54N9M5l3k73J88j3l16M40j87j72J13K9O
5508e3L51k23L1l64J49J85n59M31J05J0m2p7k2j42K73k31M34m30K46j0o0J79j58
5531B3o9j8M2L36m73J73j70J30P6j03k60Q7K4M31n67K64K09m24J81j58L33R6k07
5554d4J9K35r8l31J3K72j34J68k34K23M3j37K00r7k68J98J14o1pj68K10QNr1M9
5579H7m8l56L37k68J46J93k63R6n5J35p4J94k44M2O4K95k43l04K31O4n8j69k13
5602d11K44L03j57J45j18n2K0j74K11K33m29K46r2m8J7l3j17K36j4j52K4M27p6
$$ y = [10, -120, -123, 47, -296, -91, -20, -6, 243, 84, -117, 111, 79, 135, 171, -47, 185, -82, 48, -79, -39, 193, 203, -59, 288, -43, 10, -193, -52, 94, 183, 85, -15, -279, 23, 217, -182, -171, -76, 171, -332, -168, -97, -209, 12, 50, -150, 93, 128, 111, 3, -73, -24, 121, 68, 98, -93, 61, 120, 165, 132, -141, 47, 34, -282, 158, -29, -201, -88, -59, -53, 298, 75, 106, -258, -109, 76, -483, -52, 53, 63, 21, -56, -78, -220, 53, -178, 256, -174, 72, 62, 2, 181, 23, -46, -64, -22, 314, -159, 14, -156, -26, 50, -53, -313, -226, -202, 229, -338, -74, 135, -289, -108, -266, 67, 163, -44, -25, 210, 112, -219, -206, 66, -68, 100, -134, 89, 132, -5, 195, 98, -170, 28, 142, 81, 74, -94, 116, 124, 129, 38, 87, 39, -317, 20, -248, -102, 91, -172, -76, -131, 4, -70, 124, -120, -78, -14, 281, 38, -266, -35, 29, -29, -198, -411, -167, 136, -21, 124, 6, -46, -26, -200, 11, 244, -185, 61, -31, -79, -62, -95, -212, 24, 10, -142, -118, 309, 233]
5625B33k84J07m1n9j4J14Q7l84L49j37P6p5l6N6L26m27J09o0j09o0L82k4r9K3
$$ y = [233, -51, 56, 15, -44, -58, 56, 143, -241, 108, -29, 47, -28, -64, -8, 318, -109, 0, -60, -169, -229, 153, 129, 30, 53]
$$ [...]
8191d2
##END NTUPLES=NMR FID
##END=
