##TITLE=1H_DE-56K
 CDCl3
 8 sc, 
 26.6.2024
##JCAMPDX= 6.0         $$ Bruker NMR JCAMP-DX V2.0
##DATA TYPE= NMR FID
##DATA CLASS= NTUPLES
##ORIGIN= UXNMR, Bruker Analytische Messtechnik GmbH
##OWNER= root
$$ XWIN-NMR		Version 3.5
$$ Wed Jun 26 14:40:49 2024 Russian Standard Time (UT+4h)  she@DPX200
##.OBSERVE FREQUENCY= 200.1313
##.OBSERVE NUCLEUS= ^1H
##.DELAY= (6, 6)
##.ACQUISITION MODE= SIMULTANEOUS
##.ACQUISITION SCHEME= undefined
##.AVERAGES= 8
##.DIGITISER RES= 18
##SPECTROMETER/DATA SYSTEM= spect
##.PULSE SEQUENCE= zg30
##.SOLVENT NAME= CDCl3
##.SHIFT REFERENCE= (INTERNAL, CDCl3, 0, 15.7039)
##AUDIT TRAIL= $$ (NUMBER, WHEN, WHO, WHERE, WHAT)
$$ ##TITLE= Audit trail, XWIN-NMR		Version 3.5
$$ ##JCAMPDX= 5.01
$$ ##ORIGIN= Bruker BioSpin GmbH
$$ ##OWNER= she
$$ F:/spectra/data/she/nmr/H-F/1/audita.txt
$$ ##AUDIT TRAIL=  $$ (NUMBER, WHEN, WHO, WHERE, WHAT)
(   1,<2024-06-26 14:39:54.34 +0400>,<she>,<DPX200>,
      <created by zg, POWCHK disabled, PULCHK disabled
       configuration hash MD5:
       00 E9 B6 7A A2 85 ED C7 34 08 36 98 17 FE 4E 26
       data hash MD5: 16K
       EF A5 60 DC 29 87 74 EE 57 95 04 FE 54 C6 99 EA>)
$$ ##END=
$$ 
$$ hash MD5
$$ 52 85 8B 9E DD A2 87 61 FF 2A 57 A4 19 7D 2E 45
##$RELAX= 
##$RELAX= 
##$RELAX= 
##$RELAX= 
##$RELAX= 
##$RELAX= 
$$ Bruker specific parameters
$$ --------------------------
##$DU= <F:/spectra>
##$EXPNO= 1
##$NAME= <H-F>
##$PROCNO= 1
##$TYPE= <nmr>
##$USER= <she>
##$AMP= (0..31)
100 100 100 100 100 100 100 100 100 100 100 100 100 100 100 100 100 100 
100 100 100 100 100 100 100 100 100 100 100 100 100 100 
##$AQSEQ= 0
##$AQ_mod= 1
##$AUNM= <au_zg>
##$AUTOPOS= <>
##$BF1= 200.13
##$BF2= 200.13
##$BF3= 200.13
##$BF4= 200.13
##$BF5= 200.13
##$BF6= 200.13
##$BF7= 200.13
##$BF8= 200.13
##$BYTORDA= 1
##$CFDGTYP= 0
##$CFRGTYP= 5
##$CHEMSTR= <none>
##$CNST= (0..31)
1 1 145 1 1 1 1 1 1 1 1 1 1 1 1 1 1 1 1 1 1 1 1 1 1 1 1 1 1 1 1 1 
##$CPDPRG= <>
##$CPDPRG1= <>
##$CPDPRG2= <>
##$CPDPRG3= <>
##$CPDPRG4= <mlev>
##$CPDPRG5= <mlev>
##$CPDPRG6= <mlev>
##$CPDPRG7= <mlev>
##$CPDPRG8= <mlev>
##$CPDPRGB= <>
##$CPDPRGT= <>
##$D= (0..31)
0 1.2 0 0 0 0 0 0 0 0.06 0 0.03 0 0 0 0 0.0002 0 0 0 0 0 0 0 0 0 0 0 0 
0 0 0 
##$DATE= 1719398393
##$DBL= (0..7)
120 120 120 120 120 120 120 120 
##$DBP= (0..7)
150 150 150 150 150 150 150 150 
##$DBP07= 0
##$DBPNAM0= <>
##$DBPNAM1= <>
##$DBPNAM2= <>
##$DBPNAM3= <>
##$DBPNAM4= <>
##$DBPNAM5= <>
##$DBPNAM6= <>
##$DBPNAM7= <>
##$DBPOAL= (0..7)
0.5 0.5 0.5 0.5 0.5 0.5 0.5 0.5 
##$DBPOFFS= (0..7)
0 0 0 0 0 0 0 0 
##$DE= 6
##$DECBNUC= <off>
##$DECIM= 32
##$DECNUC= <off>
##$DECSTAT= 4
##$DIGMOD= 1
##$DIGTYP= 9
##$DL= (0..7)
0 120 120 120 120 120 120 120 
##$DP= (0..7)
150 150 150 150 150 150 150 150 
##$DP07= 0
##$DPNAME0= <>
##$DPNAME1= <>
##$DPNAME2= <>
##$DPNAME3= <>
##$DPNAME4= <>
##$DPNAME5= <>
##$DPNAME6= <>
##$DPNAME7= <>
##$DPOAL= (0..7)
0.5 0.5 0.5 0.5 0.5 0.5 0.5 0.5 
##$DPOFFS= (0..7)
0 0 0 0 0 0 0 0 
##$DQDMODE= 0
##$DR= 18
##$DS= 0
##$DSLIST= <SSSSSSSSSSSSSSS>
$$ [...]
##$SUBNAM2= <"">
##$SUBNAM3= <"">
##$SUBNAM4= <"">
##$SUBNAM5= <"">
##$SUBNAM6= <"">
##$SUBNAM7= <"">
##$SUBNAM8= <"">
##$SUBNAM9= <"">
##$SW= 18.0517328524113
##$SWIBOX= (0..15)
0 0 2 0 0 0 0 0 0 0 0 0 0 0 0 0 
##$SW_h= 3612.71676300578
##$TD= 16384
##$TD0= 1
##$TE= 0
##$TE2= 300
##$TE3= 300
##$TEG= 300
##$TL= (0..7)
0 120 120 120 120 120 120 120 
##$TP= (0..7)
150 150 150 150 150 150 150 150 
##$TP07= 0
##$TPNAME0= <>
##$TPNAME1= <>
##$TPNAME2= <>
##$TPNAME3= <>
##$TPNAME4= <>
##$TPNAME5= <>
##$TPNAME6= <>
##$TPNAME7= <>
##$TPOAL= (0..7)
0.5 0.5 0.5 0.5 0.5 0.5 0.5 0.5 
##$TPOFFS= (0..7)
0 0 0 0 0 0 0 0 
##$TUNHIN= 0
##$TUNHOUT= 0
##$TUNXOUT= 0
##$USERA1= <user>
##$USERA2= <user>
##$USERA3= <user>
##$USERA4= <user>
##$USERA5= <user>
##$V9= 5
##$VALIST= <valist>
##$VCLIST= <CCCCCCCCCCCCCCC>
##$VD= 0
##$VDLIST= <DDDDDDDDDDDDDDD>
##$VPLIST= <PPPPPPPPPPPPPPP>
##$VTLIST= <TTTTTTTTTTTTTTT>
##$WBST= 1024
##$WBSW= 4
##$XGAIN= (0..3)
0 0 0 0 
##$XL= 0
##$YL= 0
##$YMAX_a= 118379
##$YMIN_a= -150167
##$ZGOPTNS= <>
##$ZL1= 120
##$ZL2= 120
##$ZL3= 120
##$ZL4= 120
##$ABSF1= 10
##$ABSF2= 0
##$ABSG= 5
##$ABSL= 3
##$ALPHA= 0
##$AQORDER= 0
##$ASSFAC= 0
##$ASSFACI= 0
##$ASSFACX= 0
##$ASSWID= 0
##$AUNMP= <proc_1d>
##$AZFE= 0.1
##$AZFW= 0.1
##$BCFW= 1
##$BC_mod= 2
##$BYTORDP= 1
##$COROFFS= 0
##$CY= 11.3945322036743
##$DATMOD= 1
##$DC= 2
##$DFILT= <>
##$DTYPP= 0
##$F1P= 15.6554695791079
##$F2P= 12.8336369535428
##$FCOR= 0.5
##$FTSIZE= 0
##$FT_mod= 4
##$GAMMA= 1
##$GB= 0.15
##$INTBC= 1
##$INTSCL= 1
##$ISEN= 128
##$LB= 0.24
##$LEV0= 0
##$LPBIN= 0
##$MAXI= 10000
##$MC2= 0
##$MEAN= 0
##$ME_mod= 0
##$MI= 1.114404
##$NCOEF= 0
##$NC_proc= 0
##$NLEV= 6
##$NOISF1= 3.799351
##$NOISF2= 2.8
##$NSP= 1
##$NTH_PI= 0
##$NZP= 0
##$OFFSET= 15.70392
##$PC= 1
##$PHC0= -25315.1
##$PHC1= 9.787479
##$PH_mod= 1
##$PKNL= yes
##$PPARMOD= 0
##$PSCAL= 0
##$PSIGN= 0
##$REVERSE= no
##$SF= 200.130013532006
##$SI= 16384
##$SIGF1= 3
##$SIGF2= 2
##$SINO= 400
##$SIOLD= 16384
##$SREGLST= <1H.CDCl3>
##$SSB= 0
##$STSI= 0
##$STSR= 0
##$SW_p= 3612.71676300578
##$SYMM= 0
##$S_DEV= 0
##$TDeff= 0
##$TDoff= 0
##$TI= <>
##$TILT= no
##$TM1= 0
##$TM2= 0
##$TOPLEV= 0
##$USERP1= <user>
##$USERP2= <user>
##$USERP3= <user>
##$USERP4= <user>
##$USERP5= <user>
##$WDW= 1
##$XDIM= 8192
##$YMAX_p= 0
##$YMIN_p= 0
$$ End of Bruker specific parameters
$$ ---------------------------------
##NTUPLES= NMR FID
##VAR_NAME=  TIME,          FID/REAL,        FID/IMAG
##SYMBOL=    X,             R,               I
##VAR_TYPE=  INDEPENDENT,   DEPENDENT,       DEPENDENT
##VAR_FORM=  AFFN,          ASDF,            ASDF
##VAR_DIM=   8192,          8192,            8192
##UNITS=     SECONDS,       ARBITRARY UNITS, ARBITRARY UNITS
##FACTOR=    0.0002768,     1,               1
##FIRST=     0,             0,               0
##LAST=      2.2672688,     0,               0
##MIN=       0,             -150167,         0
##MAX=       2.2672688,     118379,          0
$$ Real data points
##PAGE= N=1
##DATA TABLE= (X++(R..R)), XYDATA
$$ [...]
1920f25R30J2l64L1M29O23l02q11L26P2j24m85o05K90K65j0q98P47O95L88o38
$$ -625 305 317 -47 -16 413 1036 734 -77 249 321 197 -288 -893 -603 -338 -348 -1246 -499 196 584 -54
1941e4K49M62L92m27o49j9M05l53n20j54O64J69n82q0J65O66o0q00K98J78O04
$$ -54 195 657 1049 622 -27 -46 359 6 -514 -668 -4 165 -417 -497 -332 334 274 -526 -228 -50 554
1962E54k71m21K87O42l7m72l95K95K61o95n57K30K15j33k98l6M84P14m74O9O42
$$ 554 283 -138 149 791 754 282 -113 182 443 -252 -809 -579 -364 -497 -795 -831 -347 367 -107 -38 604
1983F04Q00l89p27j43L30k22p12n31K81O21l38l57L26O30L36l04m48M96K88k9
$$ 604 1404 1015 288 145 475 253 -459 -990 -709 -88 -426 -783 -457 173 509 205 -243 253 541 512
2003E12p68J26L46K31q22Q7L89J26N3p10j18L33N4l72k34M95K99K09l11J26P09
$$ 512 -256 -130 216 447 -375 -288 101 227 280 -430 -548 -215 -161 -533 -767 -272 27 236 -75 51 760
2024G60P4P8n59N6K64o04o91k34P14j48n83k51P98N98l08q0L7Q26j47m54o3L36
$$ 760 834 912 353 409 673 69 -622 -856 -142 -290 -873 -1124 -326 272 -36 -116 -79 747 600 146 83 419
2046D19j10p0q73O0O43j14j62n10O99M41k46m85O2M62K20l54j46M03R7l29m33
$$ 419 309 239 -634 -574 69 -45 -207 -717 -18 423 177 -308 -246 216 436 82 -64 339 436 107 -326
2067c26K4N80m5n30l26N54r9k21j73J33M90L37j89j77N95q7O3l94k41J08J11n35
$$ -326 -302 278 233 -297 -623 -69 -168 -389 -562 -429 61 398 209 32 627 540 603 209 -32 76 187 -348
2089c48k19L09N0k59k94P13J24J67k58J95J66N12n96k05k02N68j09q92Q8M22K09
$$ -348 -567 -258 -208 -467 -761 -48 76 243 -15 180 346 858 262 57 -145 423 314 -578 -490 -68 141
2110A41o37j85K78L68k13j92j8L54O85l19j77K30L67oj96n00J46K92r22o9j38
$$ 141 -496 -681 -403 -35 -248 -440 -458 -104 581 262 85 315 682 676 480 -20 126 418 -504 -573 -711
2131g11K62J01k07j62M79Q43n87L3L94L81j49k19m52P0j01q9l89Q9L94k03j82
$$ -711 -449 -348 -555 -717 -238 605 18 51 445 826 677 458 6 76 -25 -114 -503 -414 -20 -223 -405
2152d05k45M51L52l11j11L73K53o3n01R2M11L20n5m25K50R0l98m42j42L35k20
$$ -405 -650 -199 153 -158 -269 104 357 294 -207 -115 296 616 561 136 386 476 78 -364 -506 -171 -391
2173c91j23j59L60P01m01p6M06K78J87m06l15L6K45k16o96k09N41m2m14P4N65
$$ -391 -514 -673 -313 388 -13 -89 317 595 782 376 61 97 342 126 -570 -779 -238 -280 -694 -620 -55
2194e5J51j3p8j14N70J96l92j20J95K59j33q11r6P92k32k66j61J45J73J34n17
$$ -55 96 83 5 -109 461 657 265 145 340 599 466 -345 -441 351 119 -147 -308 -163 10 144 -373
2215c73q2N52L5L8k76L92J38m3l95j11M85n3p34j6J62OR3m73K15P90p4k14l39
$$ -373 -455 97 132 170 -106 286 424 381 -14 -125 360 307 -427 -443 -281 -275 -182 -655 -440 350 276 62 -277
2238b77Q62J01l48l11n7J58nk73l15L63L05l14j00k3L74j68r1j40P95l99Q6k51
$$ -277 585 686 338 27 -30 128 123 -150 -465 -102 203 -111 -211 -234 140 -28 -119 -259 536 137 223 -28
2260b8M6N05k46n7k72M87m77q7p65L40M33q3m39K91L56O93o14P5K43L77j46k63
$$ -28 18 523 277 220 -52 435 -42 -129 -894 -554 -121 -204 -643 -352 4 697 83 158 401 778 632 369
2282C69n57L10K0p7n02J31L47l97P2m72Q44p5J78j21K23K09J66n81k59M21qk0
$$ 369 -188 122 142 65 -437 -306 41 -356 -284 -756 88 13 191 70 293 502 668 87 -172 249 241 221
2304B21n92P34k09k09j43l47K73j04L60n27L65M18p9n03L65N17l5nn99L03J91
$$ 221 -371 363 154 -55 -198 -545 -272 -376 -16 -543 -178 240 161 -342 23 540 505 500 -99 204 395
2325C95j77q37J74J66J25n60K49L9N75l5n2J44M4N37l83m29L04m6j32k87R0L55
$$ 395 218 -619 -445 -279 -154 -714 -465 -426 149 114 62 206 250 787 404 -25 279 233 101 -186 -96 259
2347B59j22j22l22K73K7J09m36L00K95M3o24K14K28K90r4j32k39L75k12j88k88
$$ 259 137 15 -307 -34 -7 102 -334 -34 261 304 -320 -106 122 412 318 186 -53 322 110 -78 -366
2368c66J33J42K4k80N06r9o1Q5k50M56L67l96q4j54J24l1l24k17pK48j71j19L86
$$ -366 -233 -91 -67 -347 159 60 -1 84 -166 290 657 261 177 23 147 116 -208 -425 -432 -184 -355 -474 -88
2391h8k62M67p7p9M5K64R5m29K2M55O1m97l89J99K50l47o2K4L86j54J0m5L77J95
$$ -88 -350 117 40 -39 6 270 365 -64 -42 413 474 -23 -412 -213 37 -310 -372 -348 38 -116 -106 -151 226 421
2415D21l24m0L55J04q8k49m4j68K32l71m31J60L87j70k17J31K60J05J34k13L77
$$ 421 97 57 412 516 428 179 135 -33 199 -172 -603 -443 -56 -226 -443 -312 -52 53 187 -26 351
2436C51L29m56l33K83k15L8j84o4J38P4q7J84j6l06L91j39j33K85Q1J72l72Q9
$$ 351 680 224 -109 174 -41 -3 -187 -251 -113 -39 -126 58 42 -264 127 -12 -145 140 221 393 21 110
2458A10J72J37l48k34L70j38q4k79k74K91L4j26J24K42J71J20j24m0N63r2j55
$$ 110 282 419 71 -163 207 69 -15 -294 -568 -277 -243 -369 -245 -3 168 288 164 124 687 595 440
2479D40k60O6Q6l53l27J54J99k44j61r7O21J1K14n33J79K82K60m06J18j47m4K77
$$ 440 180 246 332 -21 -348 -194 5 -239 -400 -497 124 135 349 -184 -5 277 537 131 249 102 58 335
2501C35o00M3NN08l22k36R8M47m97j01NK54K08k01J75j4L6k02J73k5J31k10k61
$$ 335 -265 -222 -217 291 -31 -267 -169 278 -219 -320 -315 -61 147 -54 121 107 143 -59 114 89 220 10 -251
2524b51J33j97M18k06m92O00m5K87j9l99M78K10m02k07K96J41k01l05J2J85J17
$$ -251 -118 -315 103 -103 -595 5 -40 247 228 -171 307 517 115 -92 204 345 144 -161 -149 36 153
2545A53q0m57L12K25K4j59m7K55J30l78m8K24r0L00m18J27j40M03l70n22N62l3
$$ 153 73 -384 -72 153 177 18 -29 226 356 -22 -70 154 64 364 -54 73 -67 336 -34 -556 6 -27
2567b7nm7K0J88N6k92j4O92j4j73l62J08M05j013K93j16P3n3J18n2P6oL30r6q2
$$ -27 -32 -79 -59 129 185 -107 -121 571 557 384 22 130 535 -478 -185 -301 -228 -281 -163 -215 -139 -145 185 89 7
2592GJ63J15j69lp1L71j96j33k78k6M17m9l91p8O4J45j50K50O1K03L6j80J05O0
$$ 7 170 285 116 113 42 413 217 84 -194 -220 197 148 -243 -321 -257 -112 -262 -12 49 252 288 108 213 273
2616B73J53m88J09Q1K57k95k47k59K89j0r2J32j49J15M90k91M1M20k98j03j12
$$ 273 426 -62 47 128 385 90 -157 -416 -127 -137 -229 -97 -246 -131 359 68 109 529 231 128 16
2637A6K3k2j80M7k46K76r7j0j8l3N09j35j87n6K02L27k73j33o0N38m06j26j63
$$ 16 39 17 -163 -116 -362 -86 -183 -193 -211 -244 265 130 -57 -113 89 416 143 10 -50 488 82 -44 -207
2660b07K42K9n7k57%O39p11R0L93j01m1q8l5M44o0r5K11j90l0j73k28k36M82J27
$$ -207 35 64 7 -250 -250 389 -322 -232 161 60 19 -69 -104 340 280 185 396 206 176 3 -225 -461 21 148
2684A48n15mM02p4P0r9J05J89R1j18k03j18M35k56k99K95J16m0j86k4r5kJ67q6
$$ 148 -367 -371 31 -43 27 -72 33 222 313 195 -8 -126 309 53 -246 49 165 125 -61 -85 -180 -182 -15 -101
2708a01j88K73J9J05j28J90K02O0m15l38L24j15j21J24L8L07m98J73J85j13M72
$$ -101 -289 -16 3 108 -20 170 372 432 17 -321 3 -112 -233 -109 -71 236 -262 -89 96 -17 455
2729D55j29k51J22M47j29l07l83O0K63k27l9J52l03J11j71L35j00K65J9m09K93
$$ 455 326 75 197 644 515 208 -175 -115 148 -79 -118 34 -269 -158 -329 6 -94 171 190 -219 74
2750G4J20M8k27m3J07L3j77k9k02P73m43j63l41N57l40K68q6J38J3J35p7k71J24
$$ 74 194 242 15 -28 79 112 -65 -94 -296 477 34 -129 -470 87 -253 15 -71 67 80 215 138 -133 -9
2773iJ71M3k56r2N9j94jJ88k60K15k5n9K40j04Q9k1j09K8L71o2n9L7j76K3j41
$$ -9 162 205 -51 -143 -84 -278 -279 -91 -351 -136 -161 -220 20 -84 5 -16 -125 -97 274 212 153 190 14 37 -104
2798a04J6j42K95m65P1L49O5M6J8k84K42O6j09j61J24R8M7j49j05J59Qn0j64O1
$$ -104 -88 -230 65 -400 -329 20 85 131 149 -135 107 173 64 -97 27 125 172 23 -82 77 85 35 -129 -68
2822f8J30j3k54J68L17l01M2L44k47Q3j18k50N01m67p7O2k28N68k12P4m04L64
$$ -68 62 49 -205 -37 280 -21 21 365 118 201 83 -167 334 -133 -210 -148 -376 192 -20 54 -350 14
2844A4K23k23N2j95J22J33K24n85K41j28K05J39m91K64l43N40k97L19m12K20k50
$$ 14 237 14 66 -129 -7 126 350 -235 6 -122 83 222 -269 -5 -348 192 -105 214 -198 22 -228
2865b28NK3L08m4j4O1J56l33K31k28J29J17k26l55r4N52k84L59j92K57o3M65n70
$$ -228 -223 -200 108 64 50 111 267 -66 165 -63 66 183 -43 -398 -492 60 -224 135 -57 200 137 602 32
2888C2K1l5o9Km0K52j47m0j03n5O45j72k36o0M5N0m5Jo0M4K37m05J1L50J39l53
$$ 32 53 18 -51 -49 -89 163 16 -24 -127 -182 463 291 55 -5 40 90 45 46 -14 30 267 -138 -127 223 362 9
2914Ik7j93L6L78m36J81j42M64q2k19R3ML0n4k5J67k0M0k74K48k66J62l57l8N5
$$ 9 -18 -211 -175 203 -233 -52 -194 270 188 -31 62 66 96 42 17 184 164 204 -70 178 -88 74 -283 -321 -266
2939b66J31K09m49L80K40L4n09K37R6K27j61l8K50m90J36k72M4K64k1j93J38P7
$$ -266 -135 74 -375 5 245 279 -230 7 103 330 169 131 381 -109 27 -245 -201 63 42 -151 -13 64
2961F4r7L86n06Q6L42k68J78k9p0K04O4l41l04N12r4k23L1K6j32J02j51M1L04
$$ 64 -33 353 -153 -67 275 7 185 156 86 290 354 13 -291 221 127 -96 -65 -39 -171 -69 -220 -179 125
2984A25N3k68K97j63N5J30l10l23M16P6k56m8R8l5M48m00j13M66q1q2k51J16M08
$$ 125 178 -90 207 44 99 229 -81 -404 12 88 -168 -216 -118 -153 295 -105 -218 248 167 85 -166 -50 358
3007C58n50K87o4J31J14k58J26j96J36j93j52Q7q7K86J24l12L60J21k32K0p5L50
$$ 358 -192 95 31 162 276 18 144 -52 84 -109 -261 -174 -261 25 149 -163 197 318 86 106 31 381
3029C81j02j69p7j88L22l00K42j44l0J30k00K1J42k6K16j78n0J33l1j32J28k71
$$ 381 279 110 33 -155 167 -133 109 -35 -65 65 -135 -114 28 2 218 40 -10 123 92 -40 88 -183
3051a83K84P8k71J74J6j50K3L39m20J30Q3j29n5L83n7k86m9K58j15j16K33j54
$$ -183 101 179 -92 82 98 -52 -29 310 -110 20 103 -26 -81 302 245 -41 -90 168 53 -63 170 16
3073A6J76l74K91k75k19L67q2M3j87L94j1n4Q7j7K0j87l24L25pm5j99j7L07K4
$$ 16 192 -182 109 -166 -385 -18 -100 -57 -244 150 139 85 172 155 175 -12 -336 -11 -18 -63 -262 -279 28 52
3097E2m24K16N1R7K42l79K88L55k33m68J86j72K09K40m52K42q1K11k96j15m0K78
$$ 52 -372 -156 -105 -8 234 -145 143 498 265 -203 -17 -189 20 260 -192 50 -31 180 -116 -231 -271 7
3119GJ15m97M99k79K70j65k33N52k44j20K1N0K01j08j83q2R8P9j43p5P9j3J12
$$ 7 122 -375 124 -155 115 -50 -283 269 25 -95 -74 -24 177 69 -114 -196 -98 -19 -162 -237 -158 -171 -59
3142e9L63j78k29O6L26j40o3j03K82j8j51j43J77o9k24K50p3k05K77l8%O6j2j07
$$ -59 304 126 -103 -37 289 149 86 -17 265 247 96 -47 130 61 -163 87 14 -191 86 48 48 114 102 -5
3166ek74L01J43l11L2J26K44j57j37N8k06n9K05j99N1K92m8j50L86k03o0J94l59
$$ -5 -279 22 165 -146 -114 12 256 99 -38 20 -186 -245 -40 -239 -188 104 56 -94 292 89 29 223 -136
3189a36RK88j33j66K5J49J2L7k09J46k48N01l23M9q1K59l5j05J18Q0j82r6J94
$$ -136 -127 161 28 -138 -113 36 48 85 -124 22 -226 275 -48 1 -80 179 144 39 157 237 55 -41 153
3212A53r6J45n51K59J69r0Qj31K20p4j14N9r4K57j05J60j24l78J94o1R9r3m8J05
$$ 153 57 202 -349 -90 79 -11 -3 -134 86 12 -102 -43 -137 120 15 175 51 -327 -133 -194 -95 -188 -236 -131
3236a31Q4L17j38o4ko3M8J05J52n29J34j22J84K23l06oL0J31j49J55k9R1k12K41
$$ -131 -47 270 132 68 66 3 51 156 308 -221 -87 -209 -25 198 -108 -114 -84 47 -102 53 24 115 -97 144
3260A44j65n9L49n54L88q7p8J53n3n7j53L38r2R3J18l40K7k89M35j40J46K20k91
$$ 144 -21 -80 269 -285 103 16 -62 91 38 -19 -172 166 74 167 285 -55 -28 -317 118 -22 124 344 53
3283E3J50j85J17j78k12M12j52K5K7k71K62k06m1L04q5J48k79M7n7K00j53N2M39
$$ 53 203 18 135 -43 -255 157 5 30 57 -214 48 -158 -199 105 20 168 -111 -64 -121 79 -74 -22 417
3306D17l26J6j41nJ49j40q3M42n25M10k09L3l45R9L48p8j57J55J50m2j60k41L63
$$ 417 91 107 -34 -39 110 -30 -113 329 -196 214 5 38 -307 -208 140 62 -95 60 210 168 8 -233 130
3329A30l16J24j21J18n4Q9N0j16k17M38n7j39L21j44j91J78q7p3K9J38j40k42
$$ 130 -186 -62 -183 -65 -119 -30 20 -96 -313 125 68 -71 250 106 -85 93 6 -67 -38 100 -40 -282
3351b82K29k27K88O0r7N1K94l47j23M35j75N3j54j12Q2j02L17j08L9j81J7m8R3
$$ -282 -53 -280 8 68 -29 22 316 -31 -154 281 106 159 5 -107 -25 -127 190 82 121 -60 -43 -91 2
3374BR1j1kl51J58M62l87K69l03mJ78J03oq1nj25n3m5K7n6j80M08r9r7K77l25
$$ 2 93 82 80 -271 -113 349 -38 231 -72 -76 102 205 199 118 113 -12 -65 -110 -83 -139 -319 89 -10 -107 170 -155
3400a55J93J20k73J1J31m6K13J89m12j91O9M16l32O7P7l12L37rq0K27j86J33k26
$$ -155 38 158 -115 -104 27 -19 194 383 -29 -220 -151 265 -67 0 77 -235 102 93 13 240 54 187 -39
3423c9Q0o6k2j33j02k0K83J07k44Q3K91r1m7j17J26k35R7R2K00j30j66r5M1K15
$$ -39 41 -25 -47 -180 -282 -302 -19 88 -156 -73 218 127 80 -37 89 -146 -49 43 243 113 -53 -148 -107 108
3447A08k44R0K00J1l3j27j9j28J95j0m6MQ3J54k21j71J20r7L43Qk86J04j71M02
$$ 108 -136 -46 154 165 132 5 -14 -142 53 43 -3 1 84 238 17 -154 -34 -131 212 220 -66 38 -133 269
3471B69m21j46L61L1k45o3M73j73k91J84L8o2j57L54j64Qj99J14K35j88J7k12
$$ 269 -152 -298 63 94 -151 -214 259 86 -205 -21 17 -45 -202 152 -12 -4 -203 -89 146 -42 -25 -237
3493b37J55K83m5k55J58K2k14oK27k36j65K02J50m5k66L13j18J47j89J50R8m51
$$ -237 -82 201 156 -99 59 81 -133 -139 88 -148 -313 -111 39 -6 -272 41 -77 70 -119 31 129 -322
3515c22K99P0N3n5M4k66K69j23j3r2J67L7j27L0l2J09j64Q7J98j68j37J96r2J41
$$ -322 -23 47 100 45 89 -177 92 -31 -44 -136 31 68 -59 -29 -61 48 -116 -29 169 1 -136 60 -32 109
3539A09p9L1k72L80m08L43J11j59J61l56K70M1q0k69K30O2j68J98k55K67l17J68
$$ 109 30 61 -211 169 -239 104 215 56 217 -139 131 172 92 -177 53 115 -53 145 -110 157 -160 8
3561Hl48J88L97l60J38j67J42M9k88p2M15J20l65R0J0J27o1p0M7J1L31m06J26
$$ 8 -340 -152 245 -115 23 -144 -2 47 -241 -313 102 222 -143 -53 -43 84 23 -47 0 11 342 -64 62
3584F2p1p8J11m2l32J57N66l69l90L73J65J1k17J1K2M2K9R4j85j55J44L7l62L62
$$ 62 -9 -87 24 -18 -350 -193 373 4 -386 -13 152 163 -54 -43 -21 21 50 144 -41 -196 -52 -15 -377 -15
3608a5RN1Mj32J03j95J29J96k74K16J32k49p1K06m03K24N6j40J86j86J67k14M12
$$ -15 -6 45 49 -83 20 -175 -46 150 -124 92 224 -25 -96 110 -293 -69 -13 -153 33 -153 14 -200 212
3631B12M8m80L16K28k11r6j46L7L3j16J44o3K9J38k1j76K73l41K24L0J44r7P2
$$ 212 260 -220 96 324 113 17 -129 -92 -59 -175 -31 -94 -65 73 52 -124 149 -192 32 62 206 109 181
3654A81O3j22l00K07m9j93K02J24m03K79J3J52r6k67L23L8j72J76j25k71O4K78
$$ 181 244 122 -178 29 -20 -213 -11 113 -290 -11 2 154 58 -209 114 152 -20 156 31 -240 -176 102
3676A02K7k79K21l3j67L68m70N24j91k70O8K1R3M33l89l06L90p9j3Jm4l06M1K33
$$ 102 129 -150 71 38 -129 239 -231 293 102 -168 -100 -79 14 447 58 -248 142 63 50 51 7 -299 -258 -25
3700b5J29k59p8L84j61k47K41K59l15p0p6L36M9J14j25Pj65j60J16j02J52K6L2
$$ -25 104 -155 -233 151 -10 -257 -16 243 -72 -142 -218 118 167 281 156 163 -2 -162 -46 -148 4 30 62
3723F2k69Q3L41k61P1K4J9m81K63L60l80l59L21m4L92k06j8j40K15m13M44J5r
$$ 62 -207 -124 217 -44 27 51 70 -411 -148 212 -168 -527 -206 -250 142 -64 -82 -222 -7 -420 24 39 30
3746C0k8Qm30M66o7P8r9P6L9l87L04J20n2j83J60j14J76o0j79L89k09l7mj0K4
$$ 30 2 10 -420 46 -21 57 -42 34 73 -314 -10 110 58 -125 35 -79 97 37 -142 247 38 1 -3 -13 11
3771A1q0K35k56J02j91J39k46N92m26RJ68j15K22m9j88P9K92l32J59n4O0o7k93
$$ 11 -69 166 -90 12 -179 -40 -286 306 -120 -111 57 -58 164 115 -73 6 298 -34 125 71 131 64 -229
3794b29J37J63R4j92K01Jj18O9l81J17q1J61J60l24K44j48J71m8k1R9M3l01M5
$$ -229 -92 71 165 -27 174 175 57 126 -255 -138 -219 -58 102 -222 22 -126 45 -3 -24 75 118 -183 -138
3817a38K12k63L88k13k67J95j12n9K67n4J40j38K0l1J10n82M64p4K49K11o51L05
$$ -138 74 -189 199 -14 -281 -86 -198 -257 10 -44 96 -42 -22 -53 57 -525 -61 -135 114 325 -326 -21
3839b1o7J4Q0J35Ok92K21J05l91L73k37N1j91J00o4K43j85M5J83j9R3k83K07J15
$$ -21 -88 -74 6 141 147 -145 76 181 -210 163 -74 -23 -214 -114 -178 65 -120 -75 108 89 182 -101 106 221
3863B21oJ4J3j85K56n06J30r9K05K2k43J46n3L29j91Q1j09m22L09J47O3j09j36
$$ 221 215 229 242 57 313 -193 -63 -162 43 65 -178 -32 -85 244 53 134 25 -397 -88 59 122 13 -123
3886a23M03j43j38o9J72n6j65k1R5J50k93K81l4K9Mk68K25l01J60M34l82J30R0
$$ -123 280 137 -1 -70 102 46 -119 -140 -45 105 -188 93 59 88 92 -176 49 -252 -92 342 -40 90 180
3909A80R6n17K06j97R5K93j3j31p4J48k41J63l6j27k7L02m19n7L19k04M83p7l17
$$ 180 276 -241 -35 -232 -137 156 143 12 -62 86 -155 8 -28 -155 -182 120 -299 -356 -37 -241 242 165 -152
3932a52OJ20M8lk63K76K10%j65M2k42J67j27J81M3j59J4o8L27l01K19k95L39k72
$$ -152 -146 -26 22 19 -244 32 242 242 77 119 -123 44 -83 98 141 -18 -4 -72 255 -46 173 -122 217 -55
3956e5J80j98J63J3n32O50j49l5J59j79P3J02j32j00K90j76l3J19j65l6q0o6L18
$$ -55 125 -73 90 103 -429 221 72 37 196 17 90 192 60 -40 250 74 41 160 -5 -41 -121 -187 131
3979A31k2k15L18k86J76l33M72m38R2K27j55P5j44J06j47L00k91L6J43k27K72
$$ 131 109 -106 212 -74 102 -231 241 -197 -105 122 -33 42 -102 4 -143 157 -134 -98 45 -182 90
4000I0m0J27Rk16j24j06L18r7J31J3j09q2J51Rj25r6R1J32j76J51j30K20j73j53
$$ 90 50 177 186 -30 -154 -260 58 -39 92 105 -4 -86 65 74 -51 -147 -56 76 -100 51 -79 141 -32 -185
4024a85L08j08J3J46j65j78J27L8K21k10j11P2J25J42j73q6P6J25k79K94K46l07
$$ -185 123 15 28 174 9 -169 -42 -4 217 7 -104 -32 93 235 62 -24 52 177 -102 192 438 131
4046A31k0r9J67l27M01l39j7N2J09j41Q4J55m00N1L39j01L14m83j5K15M9k96J24
$$ 131 111 12 179 -148 253 -86 -103 -51 58 -83 1 156 -244 -193 146 45 359 -124 -139 76 125 -171 -47
4069d7J45q1j0J32j83k24K64R9k32K91j3j3kp8j24n9J54K1M9j25M7j86K23j9k06
$$ -47 98 17 7 139 -44 -268 -4 95 -137 154 141 128 126 48 -76 -135 19 40 89 -36 11 -175 48 29 -177
4094a77J55L9k58K42j90l2K01N4K01n9J5J17K7m69k5L3K0K20j37k61J27Q2M2q8
$$ -177 -22 17 -241 1 -189 -221 -20 34 235 176 191 308 335 -134 -159 -126 -106 114 -23 -284 -157 -75 -33 -121
4118a21R6p8j10L24j8k01J25j36K77P0k21p0M6J13k33J60o6K60k87J68p2k81N59
$$ -121 -25 -103 -213 111 93 -108 17 -119 158 228 7 -63 -17 96 -137 23 -43 217 -70 98 26 -255 304
4141C04j60N3k22m9K07Q6k57J73j32l4J64j08k01j44K07K33j21J66j38j86K79
$$ 304 144 197 -25 -74 133 219 -38 135 3 -31 133 25 -176 -320 -113 120 -1 165 27 -159 120
4162A20j5k43p0J58j3j26J10lK41l79K82k82P4Q7J0L59k86O5l6J8l50J74L24k38
$$ 120 105 -138 -208 -50 -63 -189 -79 -82 159 -220 62 -220 -146 -59 -49 310 24 89 53 71 -279 -105 219 -19
4186a9k77L54J5J62rj41j90j0K09L49m26l9K7o5J79m28K78J22m9M5J11k85j14
$$ -19 -296 58 73 235 226 85 -105 -115 94 443 17 -22 5 -60 119 -309 -31 91 42 87 198 -87 -201
4209b01K30p6q2J5K25Q0M4k60R0j63M27n03n0k7K01p4j36J09O3J68p3R2mq8k41
$$ -201 29 -47 -129 -114 111 191 235 -25 65 -98 329 -174 -224 -251 -50 -124 -260 -151 -88 80 7 99 95 7 -234
4234b34L25L6l87N48o79M52j23L54m54p0J55m0K61m25J41j05L67J09m51K90k16
$$ -234 91 127 -260 288 -391 61 -62 292 -162 -232 -77 -117 144 -281 -140 -245 122 231 -220 70 -146
4255a46R6J57p7J42l70K45rP7J22k15K44r2k27K69j71k7j03O6J54K9j70j10J97
$$ -146 -50 107 30 172 -198 47 38 115 237 22 266 174 -53 216 45 18 -85 -19 135 164 -6 -116 81
4278H1N0N0j64J3J41m47J8K71mk58K12k48L23mq4l55L84j45J66P9j6J21k54K58
$$ 81 131 181 17 30 171 -276 -258 13 9 -249 -37 -285 38 34 -50 -405 -21 -166 0 79 63 184 -70 188
4302A88Qm39L61j83N4R3k09L0m2L57k48J50j29J61K4l03j08R8J86o7Q4j42r0K21
$$ 188 196 -243 118 -65 -11 82 -127 -97 -139 218 -30 120 -9 152 176 -127 -235 -137 49 -18 66 -76 -166 55
4326E5k30J37k15L02J3J8J02j01Jj67K74k80K32o8Q5r5J00k31L8L9j56L35k18
$$ 55 -175 -38 -253 49 62 80 182 81 82 -85 189 -91 141 73 158 63 163 -68 -30 9 -147 188 -30
4349c0Q0P1J0j15P4J13j34j76J11j92M1J9J68K1j6M8m7m6J98k66M8o1K11o3J97
$$ -30 50 121 131 16 90 203 69 -107 4 -188 -147 -128 40 61 45 93 46 0 198 -68 -20 -81 130 67 264
4374B64k66M4j5L0k72J02L14l87J43O3r6j22L21j01r2l4J14J47o4J27n05J03L77
$$ 264 -2 42 27 57 -215 -113 201 -186 -43 20 -76 -198 123 22 -70 -104 10 157 93 220 -285 -182 195
4397A95k29m6R4J42j97N8m4Q6M6l42K81mj25N0J06qN1j60K40l11K94j54K8L0j49
$$ 195 -34 -80 14 156 -41 17 -27 59 105 -237 44 40 -85 -35 71 63 114 -46 194 -117 177 23 51 81 -68
4422f8j48M52J29j96m23L76l6l03K19M4o7J95j74j79J92J1k69L32Kk45j7K78K84
$$ -68 -216 236 365 169 -254 122 86 -217 2 46 -21 174 0 -179 13 24 -245 87 89 -156 -173 105 389
4445C89m47K66l11J04q1r8J85j65K47j68r9L55j47j15P9L85n26K70k66Q6N0N7
$$ 389 -58 208 -103 1 -80 -178 7 -158 89 -79 -178 177 30 -85 -6 379 -147 123 -143 -57 -7 50
4467E0j33P8Nn6L54n24R9L17k50N2J07m06L15J05l1o6L6J7l56L01j16m7L26k08
$$ 50 -83 -5 0 -56 298 -226 -127 190 -60 -8 99 -307 8 113 82 16 52 69 -287 14 -102 -149 177 -31
4491c1J46l9Q4k04J51k1L06n94J66j73l7K45J39l0j69J88r9j94J95L6N5m3L12
$$ -31 115 76 160 -44 107 86 392 -202 -36 -209 -246 -1 138 108 -61 127 28 -166 29 65 120 77 389
4514C89m61L7l4J32n5k30K51J88l37K77qK25k51q4J02k38Q1k20K18oM20m44K83
$$ 389 -72 -35 -69 63 8 -222 29 217 -120 157 149 374 123 39 141 -97 -16 -236 -18 -24 396 -48 235
4537B35l07K63j73K17m17K92k86K59j64J34J79j74J7k0J16O0j45j23J7p3J00j15
$$ 235 -72 191 18 235 -182 110 -176 83 -81 53 232 58 75 55 171 231 86 -37 -20 -93 7 -108
4559a08R7Q6j66L9K10k19J87k77K23k69rJ28R1k12J20K78j96K60m78Q9J31K96
$$ -108 -11 75 -91 -52 158 -61 126 -151 72 -197 -206 -78 13 -199 -79 199 3 263 -215 -126 5 301
4581C01l09j03K86l91R2J58M9k59J50pP4k39M82j84k03j21K25q9K31J6j86j93
$$ 301 -8 -111 175 -216 -124 34 83 -176 -26 -33 41 -198 284 100 -103 -224 1 -88 143 159 -27 -220
4603b20L88k66M46l78J03j44j45N8l7J82o5J9J33m2k23K07j09R2j93L13k31J10
$$ -220 168 -98 348 -30 73 -71 -216 -158 -195 -13 -78 -59 74 32 -191 16 -93 -1 -194 119 -112 -2
4625bj95j32K02L38k23O5j2q9J20J16j81j32J20j93K58j31J79k32K71J08%k36
$$ -2 -197 -329 -127 211 -12 53 41 -48 72 188 7 -125 -5 -198 60 -71 108 -124 147 255 255 19
4647A9k5Q2j28j58P5Q0RL0k05K65j69P5K59k00o3J48j95J74J79k79J50j6k11L84
$$ 19 -6 76 -52 -210 -135 -55 -46 -16 -221 44 -125 -50 209 9 -54 94 -101 73 252 -27 123 107 -104 280
4671B80k25J05M0n35L06p4j62J89J88j80L2J66j79J47k08K4J16K01r4j45J61j62
$$ 280 55 160 200 -335 -29 -103 -265 -76 112 -68 -36 130 -49 98 -110 -86 30 231 137 -8 153 -9
4693io7RK94k53J67P7k64N9Q8j3Q3l29L29l81m6K68j69K98K0j87n9J37q3j03j07
$$ -9 -76 -67 227 -26 141 218 -46 13 101 88 171 -158 171 -210 -256 12 -157 141 161 -26 -85 52 -31 -134 -241
4718b41L55k94J08j14J07Mj00J12K91n4k08J1J17k72J44n9j71N98l49K38l60L11
$$ -241 114 -180 -72 -186 -79 -75 -175 -63 228 174 -34 -23 94 -178 -34 -93 -264 334 -15 223 -137 174
4740A74M4l62J68J28N2j2k77J10J50k04k1Q0l3J29l0p5M8j51JL06j19k25K53J05
$$ 174 218 -144 24 152 204 192 -85 25 175 -29 -50 30 -3 126 96 21 69 -82 -81 225 106 -119 134 239
4764B39k48o9R3k14K12n0J34k16q5N04m66K87p6j98K29j16R8j36K28k45J77k87
$$ 239 -9 -78 15 -199 13 -37 97 -119 -204 300 -166 121 45 -153 76 -40 58 -78 150 -95 82 -205
4786b05K6J74L7R9j04J19m8j6j20O2J29j01q8J13r6J44M6j84J07j64K64j49J84
$$ -205 -179 -5 32 131 27 146 98 82 -38 24 153 52 -36 77 -19 125 171 -13 94 -70 194 45 229
4809B29j84q6P8K1po5k49L78j63K4l13N21j60J8J53l2j9j73J49r0p0J45k43J34
$$ 229 45 -41 37 58 51 -14 -263 115 -48 -24 -337 184 24 42 195 163 144 -29 120 30 -40 105 -138 -4
4833dOk03M05l44p9K14K2p9K4J13o4k42M65j14j87J4L73m87M37o0l94J37o1K82
$$ -4 2 -201 204 -140 -219 -5 17 -62 -38 75 11 -231 234 120 -67 -53 320 -167 270 210 -184 -47 -108 174
4857A74L4k10jj52N9JJ48N6k97M17j10j42J62q3p4K14j06Q2l4k31j1M2p5j1O9
$$ 174 208 -2 -3 -155 -96 -95 53 109 -188 229 119 -23 139 56 -18 196 90 172 138 -93 -104 -62 -137 -148 -79
4882g9j24J70J57k27K44N3L3l26J69j16K52k81L5L3M9j85L03K08l18J66j98PO7
$$ -79 -203 -33 124 -103 141 194 227 -99 70 -46 206 -75 -40 -7 42 -143 160 368 50 216 18 25 92
4905I2nRk92K70l05J66O6k74L40K52l22J4n1Q3j40J6J0J08k0L9k72o0L53k40L79
$$ 92 87 96 -196 74 -231 -65 1 -273 67 319 -3 11 -40 43 -97 -81 -71 37 17 56 -216 -276 77 -163 216
4930B16l13M68n07K21j23RL0L50k62j63K38l80K73j7J09k43l1K67J39L0k09j08
$$ 216 -97 371 -136 85 -38 -29 1 351 89 -74 164 -216 57 40 149 -94 -125 142 281 311 102 -6
4952fj8J77M0m04nJ49qL6p2K16j83k1J85j8k69K03k0j5j48Q8J22j3L1k52J64o6
$$ -6 -24 153 193 -211 -216 -67 -75 -39 -111 105 -78 -99 86 68 -201 2 -18 -33 -181 -93 29 16 47 -205 -41 -107
4978a07K0J55m5k49l8J33J32o3q5L6M8O1j4j64J65L3l9n0Q5r6J75l25L09MR3j42
$$ -107 -87 68 23 -226 -264 -131 1 -62 -147 -111 -63 -2 -16 -180 -15 18 -21 -71 14 -82 93 -232 77 81 174 32
5004C2P8k09qK76j01p9N0J01j66o3L65j37m8K1J20j48j7k26L17k59K03k83K81
$$ 32 110 -99 -107 169 68 -11 39 140 -26 -89 276 139 91 112 232 84 67 -159 158 -101 102 -181 100
5027A00P9j81J84k48N20n31J23j98L67J96m48J79k12l8j1K80j69Q8J1J37l28Q9
$$ 100 179 -2 182 -66 454 -77 46 -152 215 411 -37 142 -70 -108 -119 161 -8 80 91 228 -100 -11
5049a1K75n84M74k20j93L07J30j84Q5J83m21q6K69r4K2K33n6lM5l42J38K39p6
$$ -11 264 -320 154 -66 -259 48 178 -6 79 262 -159 -245 24 -70 -48 185 129 126 171 -171 -33 206 130
5072A30n2j4PO4j65J5j75R9K44k73k35M50L5j43ok4j71M71M3j35k13j79J12q0
$$ 130 78 64 71 135 -30 -15 -190 -91 153 -120 -355 95 130 -13 -19 -43 -214 257 300 165 -48 -227 -115 -195
5096a95K69J00K0l03L69n6l45K57l8J27j34J11l05J26J53k73K08j24J05n1m2R8
$$ -195 74 174 194 -109 260 204 -141 116 78 205 71 182 -123 3 156 -117 91 -33 72 21 -21 77
5118G7lJ1j84J61j23R8L1K40m41J11j13J10j40K97pJ75k27R6j08j48P1P1k3L0
$$ 77 74 85 -99 62 -61 37 68 308 -133 -22 -135 -25 -165 132 125 300 73 169 61 -87 -16 55 32 62
5142F2KP6k17J55M3j36K96l79K28k64L39j94k19O8L45N7k39k7J13k29m5K04J84
$$ 62 64 140 -77 78 121 -15 281 -98 130 -134 205 11 -208 -140 205 262 23 -4 109 -120 -165 39 223
5165B23l10M62m26J90j15qM1k68L09m80K88M17l09L8o4O3j26L44m45M1K07j68
$$ 223 -87 375 -51 139 24 16 57 -211 98 -382 -94 323 14 52 -12 51 -75 269 -176 -135 72 -96
5187i6L0K34j4J15j65j07Q8p0N3j31K34L2k11K83k56J4j83o9K14Qk75L64j03O4
$$ -96 -66 168 154 269 104 -3 85 15 68 -63 171 203 -8 275 19 33 -150 -219 -5 3 -272 92 -11 53
5211E3m2J70O8k38k40J62K49n46K24J59J18m22K93K43k77K83l82K52j63O7q8l
$$ 53 11 181 249 11 -229 -67 182 -364 -140 19 137 -285 8 251 -26 257 -125 127 -36 31 -57 -60
5233f0J55j95K16K91k42j47k00L4R2Q7rm9J66Q1k58J3K2K58n11K34K67j36m41
$$ -60 95 -100 116 407 165 18 -182 -148 -56 31 22 -27 139 220 -38 -25 -3 255 -256 -22 245 109 -332
5256c32N24j76k4J21j78R8l58K58K6m4J13r0n9K82k73K63k80P2K64j60J40k8j33
$$ -332 192 16 -8 113 -65 33 -325 -67 -41 -85 28 -62 -121 161 -112 151 -129 -57 207 47 187 159 26
5279B6k34L18l79M66j38k99K11J22j30k1j02nK44L4P9j84K03j68Q5l85J82L17
$$ 26 -208 110 -269 197 59 -240 -29 93 -37 -58 -160 -165 79 113 192 8 211 43 128 -257 -75 242
5301B42j77m9K2j96J97r0q2J63q3k4J59j30K2j90K25n3k39N15q7r5k9O0k03J95
$$ 242 65 16 38 -158 39 -51 -133 30 -53 -77 82 -48 -26 -216 9 -44 -283 232 145 50 21 81 -122 73
5325G3o8J13j83R8j67K77k17j69J49J11J98j20O0rj93J42n5N1k13J55J43m04L93
$$ 73 5 118 -65 33 -134 143 -74 -243 -94 17 215 95 155 146 -47 95 40 91 -122 33 176 -228 165
5348A65k41p5K39l26M46j38J65m13K34p0K09k77j65J85mL4j7J65Q1q2k51L75J
$$ 165 -76 -151 88 -238 208 70 235 -178 56 -14 195 -82 -247 -62 -66 -32 -49 116 197 115 -136 239 240
5371B40m0K6l40j58L91j17%j64J67R2P5J9j46kq7J55J25m74K24k96K10lJ67k09
$$ 240 200 226 -114 -272 119 2 2 -162 5 97 172 191 45 43 -44 111 236 -238 -14 -310 -100 -103 64 -145
5395a45m8Q0J40P6j86K73j01j40j48L0J28N2P3j01J55k74J92Oj95l2M2J41k16
$$ -145 -193 -113 27 103 -83 190 89 -51 -199 -169 -41 11 84 -17 138 -136 56 62 -133 -165 -123 18 -198
5418a98M00l30N20k82P5q1l07P4K53r8kj5r8Q4k08K33l2P5k2J45l26J80k60J95
$$ -198 202 -128 392 110 185 104 -203 -129 124 26 24 9 -89 -5 -213 20 -12 63 41 186 -140 40 -220 -25
5442b5N4J2K03j09O4j92K28n6m1n7J0N7M5k00Q2p7k53M02j86k21K90n20K96L01
$$ -25 29 41 244 135 199 7 235 179 138 81 91 148 193 -7 75 -2 -255 147 -39 -260 30 -490 -194 107
5466A07j67J92k9J96m41K31l16Q4L07m05N36P7n11L10jM5k04K68l65J12p4j77
$$ 107 -60 132 103 299 -142 89 -227 -143 164 -241 295 372 -139 171 170 215 11 279 -86 26 -48 -225
5488b25L27j44k16J40N3R6j11O3Q6m06K41J64J40m07J79k1k28L69r5J5j3N9K21
$$ -225 102 -42 -258 -118 -65 31 -80 -17 69 -337 -96 68 208 -199 -20 -41 -269 100 5 20 7 66 287
5511B87m37J33P0p6O1k0L1o7J62k98J06J62j96J84K25j04k68o5L6PJ31Mj77K33
$$ 287 -150 -17 53 -23 38 18 49 -18 144 -154 -48 114 -82 102 327 223 -45 -110 -74 -67 64 68 -109 124
5535A24k79K2R3K53j53j46M2K64j28j0K41l85m0L7K11k42k39N01j79J93o5p6J72
$$ 124 -155 -133 -40 213 60 -86 -44 220 92 82 323 -62 -102 -65 146 -96 -335 166 -13 180 115 39 211
5558B11q9j94J95m9J56j80o3o8J62P1j94j0J80m06L77J22m20J82N4j23J39J29
$$ 211 122 -72 123 74 230 50 -13 -81 81 152 -42 -52 128 -278 99 221 -199 -17 37 -86 53 182
5580A82l56K39O4k68J37J33k27J19n7r2J77L2m11K65J91p9Rj78J25m6K1j1r4P22
$$ 182 -174 65 129 -139 -2 131 -96 23 -34 -126 51 83 -328 -63 128 49 58 -120 5 -41 -20 -31 -125 597
5604E97p87K92J95m40J68M2m3%j17n5J12j44N85k92k42K47j68p0K81K4k50J81
$$ 597 -190 102 297 -143 25 67 24 24 -93 -148 -36 -180 405 113 -129 118 -50 -120 161 185 -65 116
5626A16P4j35k22J68p1M72m80L1p0L45k96J89j62j02P7j69J82P7k66K46j39j5
$$ 116 190 55 -167 1 -70 402 -78 -47 -117 228 -68 121 -41 -143 -66 -235 -53 24 -242 4 -135 -150
5648a50L8J42j43J78j15J16j84J73P7j85J51m7J00j97J26j02J78l67L25q8J42
$$ -150 -112 30 -113 65 -50 66 -118 55 132 -53 98 51 151 -46 80 -22 156 -211 114 26 168
5669A68l79N66k95r0L02l17k3k22P24m27R1r6m07J32K29K39j61k24K63m3l8l03
$$ 168 -211 355 60 -30 272 -45 -68 -290 434 7 98 2 -405 -273 -44 195 34 -190 73 30 -8 -311
5691c11J53J89R7j53j47J89J71j22J7l3M8k65K39R7j04K1K9j96K23k33J31j14
$$ -311 -158 31 128 -25 -172 17 188 66 83 50 98 -167 72 169 65 86 115 -81 142 -91 40 -74
5713g4J10K76l18K40k50J83L1mj23k1k05J56m31L19ql46L57k60L48J56k56J88
$$ -74 36 312 -6 234 -16 167 198 194 71 50 -155 1 -430 -111 -119 -465 -108 -368 -20 136 -120 68
5735F8R8N3j49J54l74K14J76j05k9m8j76KL56j59k52J45L54m89J46j80K74r3M2
$$ 68 166 219 70 224 -150 64 240 135 106 58 -118 -116 240 81 -171 -26 328 -161 -15 -195 79 -14 28
5758B8K37k31j24O9J43l59K6M7q7M35r5j89q5M43j84Mk01j9L79k67K02jn9l89
$$ 28 265 34 -90 -21 122 -237 -211 -164 -251 184 89 -100 -185 258 74 78 -123 -142 237 -30 172 171 112 -277
5782b77J55J2K24j87r9J73K49k09l05L39k25o5J51J72j75k34K49k2L47l21j66
$$ -277 -122 -110 114 -73 -172 1 250 41 -264 75 -150 -215 -64 108 -67 -301 -52 -74 273 -48 -214
5803b14K59l35M62Mk27K04l0j06Rk17L20k05j57N9k2M23l50n8l7M16l04Q2j64
$$ -214 45 -290 172 176 -51 153 123 17 26 -191 129 -76 -233 -174 -196 227 -123 -181 -218 198 -106 -24 -188
5826a88Q4J24J86j57J18j88m2l3L2K07l3l82K67r0P5K97l84J16J53l21qK07k90
$$ -188 -104 20 206 49 167 -21 -63 -96 -64 143 110 -272 -5 -95 -20 277 -107 9 162 -159 -167 40 -250
5849b50J78R3l77N55l13L82k06j93K36r5R1O6k01K5m7J02j95M08O1o64L36o5K8
$$ -250 -72 21 -356 199 -114 268 62 -131 105 10 101 167 -34 -9 -56 46 -149 259 320 -344 -8 -73 -45
5872d5J40j41J50k23K73l39K55J30l27M91k96r2J34m7r5J75j08qK33j58L8o3n7
$$ -45 95 -46 104 -119 154 -185 70 200 -127 364 68 -24 110 63 -32 143 35 27 260 102 140 77 20
5895B0o2L32l82J04n5J7j23NRJ8Q6J22J25j33l03J95K60o1j53l69O73n39L44J64
$$ 20 -42 290 -92 12 -43 -26 -149 -144 -135 -117 -31 91 216 83 -220 -25 235 174 21 -348 325 -214 130 294
5919B94j90m2m7k3L33M4j62j07l50L17l95O41j66o2O5j79k2J18p6R8k54K97q1
$$ 294 104 62 15 -8 325 369 207 100 -250 67 -328 313 147 85 150 -29 -51 67 -9 89 -165 132 51
5942E1J1K0j98L19r5j38O8k04J3K01j08J65k08M8L05k40j67O3J95J3j27j46K11
$$ 51 62 82 -116 203 108 -30 38 -166 -153 48 -60 105 -103 -55 250 10 -157 -94 101 114 -13 -159 52
5965E2j84j58J70K65m21J92K42l52J94q2O3m79O91k03OJ74Q6l43J43k02L32l54
$$ 52 -132 -290 -120 145 -276 -84 158 -194 0 -82 -19 -498 193 -10 -4 170 256 -87 56 -146 186 -168
5987a68M3j77M87K6m32L08k25J39J41j41j46R2J32K11j39J5l98M37k84n8L32l12
$$ -168 -125 -302 185 211 -221 87 -138 1 142 1 -145 -53 79 290 151 166 -232 205 -79 -137 195 -117
6009a17J07K3l0P6j20p5N1K23l68J50k05M07k43J63k1k73L18k02J17j04P3j40
$$ -117 -10 13 -17 59 -61 -136 -85 138 -230 -80 -285 122 -121 42 21 -252 66 -136 -19 -123 -50 -190
6031a90K08k00M69m34K40l24M40N1l17J19k0n5L3j36QL19l11l3L24m6m6k53K07
$$ -190 18 -182 287 -147 93 -231 209 260 -57 62 42 -13 20 -116 -108 211 -100 -133 191 145 99 -154 53
6054E3j90J48k17J99K10r3N0k42J45m9J62k91R0J79j73K2j71L68j67K9K0J07k39
$$ 53 -137 11 -206 -7 203 110 160 -82 63 14 176 -115 -25 154 -19 3 -168 200 33 62 82 189 -50
6077e0J48r2p3R3q1K8j20O7K04Q5l39K82o3J34j50l40M45k75K89j01p9k03K36
$$ -50 98 6 -67 26 -55 -27 -147 -80 124 209 -130 152 89 223 73 -267 178 -97 192 91 12 -191 45
6100D5k45K13L24m67j03l5L77p4j98L39k23k4K7J72j36J28l13l3J44J0k02K53
$$ 45 -200 13 337 -130 -233 -268 109 35 -163 176 -47 -71 -44 128 -8 120 -193 -226 -82 -72 -274 -21
6122b1N0L0K9j04J77l84K56J9J55J14n37K46j87k0J14J67K6o5k1j60k7qL22k12
$$ -21 29 59 88 -16 161 -223 33 52 207 321 -216 30 -157 -177 -63 104 130 65 44 -116 -143 -151 171 -41
6146d1j72L77k21J2O2l21K63j28J10k7q3Q5K30J21k04m1j47p7J96j35N3M5j4J39
$$ -41 -213 164 -57 -45 17 -304 -41 -169 -59 -86 -169 -84 146 267 63 22 -125 -202 -6 -141 -88 -43 -57 82
6170H2k34M11l28J24o6L1J97k20J86l09O6O4k46L0K5J76n9K50j87K5J8j73m6M9
$$ 82 -152 259 -69 55 -11 20 217 -3 183 -126 -60 4 -242 -212 -187 -11 -70 180 -7 18 36 -137 -183 -134
6194a34M2l0J03k55J40M5J65k4j65j7J12Q2O1N0l17J64J20j94J30NK9qk18L18
$$ -134 -92 -122 -19 -274 -134 -89 76 52 -113 -130 -18 64 125 175 -142 22 142 -52 78 83 112 104 -114 204
6218B04m28M26l30J38K69k6p4j18j11J33n7m4nL11l55K5j68M57l20J89n0qK6j82
$$ 204 -224 202 -128 10 279 253 179 61 -50 83 26 -18 -23 288 -67 -42 -210 247 -73 116 66 58 84 -98
6242i8O6q3Q6K0k8j8q0L13K7l2m62N3M14j97J76j04q2q6k22L77k68L46r8j06J76
$$ -98 -32 -115 -29 -9 -37 -55 -135 178 205 173 -289 -236 178 -19 157 53 -29 -115 -337 40 -228 118 20 -86 90
6267I0j06J47NQ9j94j63J02l2j32N36j88k37K89M0L7l25k7J83j39J22k19P6K08
$$ 90 -16 131 136 225 31 -132 -30 -62 -194 342 154 -83 206 246 283 -42 -69 114 -25 97 -122 -46 162
6290A62m12J08j26M27l86J3N65k40k21Q1nN8n2K33l00M8L71k10o4K53k91K16l86
$$ 162 -250 -142 -268 159 -227 -214 351 111 -110 -29 -34 24 -28 205 -95 -47 324 114 50 303 12 228 -158
6313a58J2J48j43L12J3j05m03L97j65K22j11n3j73M17k60l8J50n6q6P2r2J97j41
$$ -158 -146 2 -141 171 184 79 -324 73 -92 130 19 -34 -207 210 -50 -88 62 6 -80 -8 -100 97 -44
6336d4J6K93k07j7p9P6j10J6J58q3L54k09k60j19q6M43j35j40J16j75J34J8q0
$$ -44 -28 265 58 41 -38 38 -72 -56 102 19 373 164 -96 -215 -301 142 7 -133 -17 -192 -58 -40 -120
6359a20M23O5o19pJ84K76J83l90k3k97L22r7K00j07L38m74J89l2j62K43N0kM9
$$ -120 303 368 -251 -258 -74 202 385 -5 -28 -325 -3 -100 100 -7 331 -143 46 14 -148 95 145 143 192
6382A92j88K1k3k15M20j11j21M4kP2p0K60l55m6o3K48n04M86j80l2R0M18l87K06
$$ 192 4 25 2 -213 207 96 -25 19 17 89 19 279 -76 -122 -185 63 -441 45 -135 -167 -77 341 -46 160
6406A60p0n4l6j2L37n86K48j73L31J12k54K17m54L09k47K99q5J3K39l99j99L32
$$ 160 90 36 0 -12 325 -261 -13 -186 145 257 3 220 -234 75 -172 127 42 55 294 -105 -304 28
6428B8%K11n45L32OL1K6l30K58k52J89J22n0lk6j15J53m01K71Q7j43J67O3m2K9
$$ 28 28 239 -306 26 32 63 89 -241 17 -235 -46 76 26 23 -3 -118 35 -366 -95 -8 -151 16 79 37 66
6453F6o8K50n31M68O0l12J56M6n3J48k54R8N9P1n25L51k66K71j20j23M27l99K63
$$ 66 -2 248 -283 185 245 -67 89 135 82 230 -24 74 133 204 -321 30 -236 35 -85 -208 219 -180 83
6476H3r4r8O2l1J47j89N6K61l1j29k89M86l29J39m1J25j61M0k15J01L51k76m2
$$ 83 -11 -109 -47 -78 69 -120 -64 197 166 37 -252 234 -95 44 3 128 -33 7 -208 -107 244 -32 -74
6499g4n5K75n0j17K4J31j54l2j0J77k41J46k15Q9J8R6k9J92k69K58l44J10Q7j34
$$ -74 -129 146 96 -21 3 134 -20 -52 -62 115 -126 20 -195 -106 -88 8 -21 171 -98 160 -184 -74 13 -121
6523a21Q1k87N72k99L2J80R1j36j68L89j88p0K09k98k09J58K59l53K85L38m35
$$ -121 -40 -327 245 -54 -22 158 249 113 -55 334 146 76 285 -13 -222 -64 195 -158 127 465 30
6544C0K8L0R6j50j33J60J17j69j16Q5M0p6J18N5m6j93N6j20O2J96j45ok28M45
$$ 30 58 88 184 34 -99 61 178 9 -107 -22 18 -58 60 115 69 -124 -68 -188 -126 70 -75 -81 -309 136
6568A36j75J47J79j92m10J92J15j96M59r3k16q9n0K14m11K71K5M85l68m5K8j36
$$ 136 -39 108 287 95 -315 -123 -8 -204 255 162 -54 -143 -193 21 -390 -119 -94 391 23 -22 6 -130
6590a30K05k07M98n96J9J76P6p6O4r6q6K95j46j53L11l35J62M08m14n5Q9K56K0
$$ -130 75 -132 366 -230 -211 -35 41 -35 29 -67 -153 142 -4 -157 154 -181 -19 389 -25 -80 9 265 285
6613B85l09K23l76k36M53k85J18m0L8J90j2j93k61L72j91K45j03K1J10j96n5L56
$$ 285 -24 199 -177 -413 40 -245 -127 -167 -129 61 49 -144 -405 -33 -224 21 -82 -61 49 -147 -202 154
6635A54j66j14K38k51J55k03L59k96O2K77m13K35J77K1j61p5m5k67L41K0j70J3
$$ 154 -12 -126 112 -139 16 -187 172 -124 -62 215 -198 37 214 235 74 -1 -46 -313 28 48 -122 -109
6657a09K61m16J74J73R4k27m0p1p5K06j97L36j7k92K87k07jM5J69j93J89J6j92
$$ -109 152 -264 -90 83 177 -50 -90 -161 -236 -30 -227 109 92 -200 87 -120 -121 -76 93 -100 89 105 -87
6680h7n1nK27J60j98M84o74J09l69J89J95j4Nk01K35O1r0K71l63J40J69l87R0
$$ -87 -138 -143 84 244 46 530 -144 -35 -404 -215 -20 -34 -29 -230 5 66 -24 247 -116 24 193 -194 -104
6703a04K40j05K84j49m13K64J14n4j90K51j37j91L20j66K00m15K47LJ9l0K94k39
$$ -104 136 31 315 166 -247 17 131 77 -113 138 1 -190 130 -36 164 -251 -4 -1 18 -12 282 43
6725D3j62J70j66P2k02M02l28j4L55o1l26R2K02p9j29O5j25K55k82K72j31L39
$$ 43 -119 51 -115 -43 -245 157 -171 -185 170 109 -217 -125 77 -2 -131 -66 -191 64 -218 54 -77 262
6747B62r8o4r4j4J18j76j49P1j30L35kL3k15J85j35k9L48l58K65r6k9q8jn0OJ22
$$ 262 164 100 6 -8 110 -66 -215 -144 -274 61 59 92 -123 62 -73 -102 246 -112 153 57 28 -60 -61 -111 -105 17
6773A7n4q1J61j22K06q7j96J92n1M9k0k64o2K91J43l00K15m2j16R6j56L19k30
$$ 17 -37 -118 43 -79 127 40 -156 36 -15 34 14 -250 -312 -21 122 -178 37 -5 -121 -25 -181 138 -92
6796i2R0N6L7K91o18K69k04L44l97L51l55K58M0j46L08j82r4j57K30N3R4l5j43
$$ -92 -2 54 91 382 -236 33 -171 173 -224 127 -228 30 70 -76 232 50 -44 -201 29 82 176 141 -2
6819bj0L0o4O7p9Jj05O0r8J46K67k38J37j05k34K50J91M6k76R8J58j64l98L33
$$ -2 -12 18 -46 21 -58 -57 -162 -102 -200 -54 213 -25 112 7 -227 23 214 260 -16 82 240 76 -322 11
6843A1m9K35k64K57k93J27j24J57J77j78q6K01P8j81j29K6o2RO1j3J05K27l37
$$ 11 -38 197 -67 190 -103 24 -100 57 234 56 -30 171 249 68 -61 -35 -97 -88 -27 -40 65 292 -45
6866d5j29K67l09L5K19m9J66j95j60M78l33k04N2O6J68J04J79k02r8l9NR2k0l23
$$ -45 -174 93 -216 -181 38 -11 155 -40 -200 278 -55 -259 -207 -141 27 131 310 108 10 -29 -24 68 48 -275
6890b75O88m89L10m60M80m7k93l0K13n7J46j41P0O4l33K17J26j90o2o4J06k5r0
$$ -275 413 -76 234 -226 254 207 -86 -116 97 40 186 45 115 179 -154 63 189 -1 -63 -127 -21 -46 -136
6913a36L28k89K02l33K15J21k38K3j58r6K82J71M5p7K39m60J80l39M78k55L45
$$ -136 192 -97 105 -228 -13 108 -130 -107 -265 -361 -79 92 137 60 299 -161 19 -320 158 -97 248
6934B48m75M7M26j40n6J97m60N4K06J37k17l1J70l69M57l31P8n5n7J75Mlj82O3
$$ 248 -227 -180 246 106 50 247 -213 -159 47 184 -33 -64 106 -263 194 -137 -59 -114 -171 4 8 5 -177 -114
6958a14k9LO0l3M32l1j41l53j30J63j49K12nJ32j64J59m6K4o1J69k45L49n6j94
$$ -114 -143 -140 -80 -113 319 288 147 -206 -336 -173 -322 -110 -115 17 -147 12 -34 -10 -71 98 -147 202 146 -48
6982d8J85l03L10j16K4j10m6J66J24p2Ql54K82k02n2P8K14j4P4j60o5J70L1m8
$$ -48 137 -166 144 28 52 -58 -104 62 186 114 122 -232 50 -152 -204 -126 88 74 148 -12 -77 93 124 76
7006G6k25M83k72l43M32j06QP9k12PK4j65L04J57l91j3O1K33j02J99n02N18k13
$$ 76 -149 334 62 -281 151 45 53 132 -80 -73 -49 -214 90 247 -144 -157 -96 137 35 234 -268 250 37
7029C7P2k43O5P3M5K4m28L05J2L62l11K06N9k47k17M6N05k82j39J45k07R1J14
$$ 37 109 -134 -69 4 49 73 -355 -50 -38 324 13 219 278 31 -186 -140 365 83 -56 89 -118 -27 87
7052H7j13J62k6j37j27K47J4j29J92p5k29N0O0J00J07j51m9o7J50nj78KJ4L92
$$ 87 -26 136 110 -27 -154 93 107 -22 170 95 -134 -84 -24 76 183 32 -17 -84 66 61 -117 -115 -101 291
7076B91n33N16k18l17K43J00j88R4k60M19p1L27l35r2j53k7L7K09m48K88L09m2
$$ 291 -242 274 56 -261 -18 82 -106 -12 -272 147 76 403 68 -24 -177 -204 -167 42 -406 -118 191 149
7098A49j08r1K73j7J5l11M27l55N8lK03l08j82Q1L09j69q9K62k07q6J93J40M0
$$ 149 41 -50 223 206 221 -90 337 -18 40 37 240 -68 -250 -169 140 -29 -118 144 -63 -149 44 184 224
7121B24j95k74K21j45L28k63J05l15K25M29m53L48j56kj58M3J21k85j56L22nj67
$$ 224 29 -245 -24 -169 159 -104 1 -314 -89 340 -113 235 79 77 -81 -38 83 -202 -358 -36 -41 -208
7143b08J23M17m10K13l81L8K08m1j70J28K50q0k74M14q3k12K5K44k22k02K27k33
$$ -208 -85 332 -78 135 -246 -208 0 -41 -211 -83 167 87 -187 227 144 -68 -43 201 -21 -223 4 -229
7165b29K46j38J68m29K33P8L84k46r1j1J30J4j59n4P1J80j29J20k48j13Q3J73
$$ -229 17 -121 47 -382 -149 -71 313 67 -24 -35 95 109 -50 -104 -33 147 18 138 -110 -223 -140 33
7187C3J1L9n3P7j41k27O0J51l7K67J23k23j67J36k55J74m3j88L69k0m27J58J17
$$ 33 44 83 30 107 -34 -261 -201 -50 -87 180 303 80 -87 49 -206 -32 -75 -263 106 86 -341 -183 -66
7210f6J96k62rN2K54k93J60l04J37J64j65j27K23L9p0O4q9K62j21O7n7j66K65
$$ -66 130 -132 -141 -89 165 -128 32 -272 -135 29 -136 -263 -40 -1 -71 -7 -96 166 45 112 55 -111 154
7233A54j04J51k09k29L45l31K65o4L6k8n0K0%N6p1J05J85j50l17J62K3K82j04
$$ 154 50 201 -8 -237 108 -223 42 -22 14 -14 -64 -44 -44 12 -59 46 231 81 -236 -74 -51 231 127
7256A27m73N36L7k30k5j86K77N5J99j86j04p8n9N9K53m00P0J23Q0P9l10L6K27
$$ 127 -346 190 227 -3 -28 -214 63 118 317 131 27 -51 -110 -51 202 -198 -128 -5 75 154 -156 -120 107
7279A07k91M7J31J34p2J22m07L30q5p3j32J34L05k84M7j14p7M34k56n4J80R4k62
$$ 107 -184 -137 -6 128 56 178 -229 101 16 -57 -189 -55 250 -34 13 -101 -178 256 0 -54 126 220 -42
7302d2J68n49M12r8j62O1K68J72k94J06n2j22M8J28j64J23j06K82l80J74J32j08
$$ -42 126 -423 -11 -109 -271 -210 58 230 -64 42 -10 -132 -84 44 -120 3 -103 179 -201 -27 105 -3
7324cL3J00q0j12R5j04J10l09J52N5p2J28l92K22K86j16J08R7j03lJ93m98J26
$$ -3 30 130 50 -62 33 -71 39 -270 -118 -63 -135 -7 -399 -177 109 -7 101 198 95 92 285 -213 -87
7347h7L5J24m0j6j35q6L03k32N03n89J15K36l58M30l60q7J77r6L11j38q4M95l61
$$ -87 -52 72 32 16 -119 -205 98 -134 369 -220 -105 131 -227 203 -157 -244 -67 -163 148 10 -74 421 60
7370F0L03m25K43r8k10L63l63L52j76j63j49J56Q7k57L38o8M2o1j88L06P7q6N2
$$ 60 363 -62 181 83 -127 236 -127 225 49 -114 -263 -107 -20 -277 61 -7 35 -26 -214 92 169 83 135
7393A35j91R3p6j56K79kr9m2J30K3J10l5m12o3L69R7m0j35O0M3P2m09L42JNj92
$$ 135 -56 37 -39 -195 84 82 -17 -59 71 94 204 169 -243 -306 63 160 120 -15 45 88 160 -249 93 94 99 -93
7419i3r5J31K6O5m12J91K98k08K48q1j08J97l71M78J3l25O1l3Q9l9N4O7j15k2
$$ -93 -188 -57 -31 34 -378 -187 111 -97 151 70 -38 159 -212 266 279 -46 15 -18 71 32 86 153 38 16
7443A6k99M34j26J70k35K4J21q4J13p2j24K77j31P0l49J23K74l58k1J53R3l08
$$ 16 -283 151 25 195 -40 -16 105 21 134 62 -62 215 84 154 -195 -72 202 -156 -177 -24 69 -239
7465b39R7j25O4J1J07O0n4J24l6m9L8j75n4P9L34Q0k76o6J33q4M4j18K38l11K19
$$ -239 -142 -267 -203 -192 -85 -25 -79 45 9 -40 -2 -177 -231 -152 182 262 -14 -80 53 -31 13 -105 133 -178 41
7490D1j91kr9K67k1J46J51k80j57L0N5KO6J44k51J63q0L3j50L08j18j13R4l50
$$ 41 -150 -152 -251 16 -5 141 292 12 -145 -115 -60 -58 8 152 -99 64 -16 17 -133 175 57 -56 38 -312
7514c12N11k71Q4j28R5%N9k15J04J20n32P64l87J58J51q4p4j74mj82J02m8L03
$$ -312 199 -72 12 -116 -21 -21 38 -177 -73 47 -485 279 -108 50 201 117 43 -131 -135 -317 -215 -263 40
7537D0o7J01P8l05J48r3j41J05o2M86l47Q3M3k22J26j51k4K33k04K39p6LJ25o07
$$ 40 -27 74 152 -153 -5 -98 -239 -134 -196 290 -57 26 69 -153 -27 -178 -202 31 -173 66 -10 -7 118 -489
7561d89L48N2N85o95L58j14J78j77k30K03K30j99j18J33M1m17M75l20L87j46j12
$$ -489 -141 -89 496 -199 159 45 223 46 -184 19 249 50 -68 65 106 -311 164 -156 231 85 -27
7582b7l5J72J21m48k78M33J95l01L53j8j35o4m8o6RL96jm7k17j64K48k65Q5j29
$$ -27 -62 110 231 -217 -495 -62 133 -168 185 167 32 -32 -80 -146 -137 259 258 211 -6 -170 78 -187 -102 -231
7606b31J11K04J1p9O2M3j21NL4K60m72L05q7J08j88l80K90k0ML35m80L35l64L18
$$ -231 -120 84 95 16 78 121 0 5 39 299 -173 132 45 153 -35 -415 -125 -145 -141 194 -286 49 -315 3
7630CJ54j44m0K7K92o20M25O5l65J70K09l6J01k06Qj5O2k28K37k22J18J79o6k19
$$ 3 157 13 -27 0 292 -328 97 162 -203 -33 176 140 241 35 43 28 90 -138 99 -123 -5 174 108 -111
7654a11J67M4k46J9L51m68NK80j51q6L45l4K5r9r5J56n8k76K71r5m9N4k45J84
$$ -111 56 100 -146 -127 224 -244 -239 41 -110 -196 149 115 140 41 -54 102 44 -232 39 -56 -105 -51 -296 -112
7678a12j19J96p3r2k8J56j03L06k62J72r5j23L25k46J17q8K45J6j99k07K40J96
$$ -112 -231 -35 -108 -200 -228 -72 -175 131 -131 41 -54 -177 148 -98 19 -69 176 192 -7 -214 26 222
7700B22l62L19j14J61j13k93L76k31k38K04J01k2m3J18k21L00j25j13J96N3l44
$$ 222 -140 179 65 226 113 -180 196 -35 -273 -69 32 10 -33 85 -136 164 39 -74 122 175 -169
7721a69L49k26J87r1l49J78L09j18j47j53L01j65J75J05l76L42k50q3J73O7j78
$$ -169 180 -46 141 50 -299 -121 188 70 -77 -230 71 -94 81 186 -190 152 -98 -181 -8 59 -119
7742a19J53R5l05l6J61j30OL65k65m36O59Op6M4j29o5j17J34r7OK56l70L80J29
$$ -119 34 129 -176 -212 -51 -181 -175 190 -75 -511 148 154 78 122 -7 -72 -189 -55 -152 -146 110 -260 120 249
7766B49n5k3j54P1m0O8k75K40j66J16k83J89K19l40J57R7m35M14j23M7l1J60j51
$$ 249 194 171 17 88 48 116 -159 81 -85 31 -252 -63 156 -184 -27 70 -365 49 -74 -27 -58 102 -49
7789d9P5q4K7r5L22q3n82L27o0O72k78k3l90L55k36K0J42Rn7J87l36j8L44m37
$$ -49 26 -58 -31 -126 196 113 -469 -142 -202 470 192 169 -221 134 -102 -82 60 69 12 199 -137 -155 189 -248
7813b48P8L1L45k00m4J44o5K1K96k99k59K99l14M09r1j34J75k22j7q2J14P3N4
$$ -248 -170 -139 206 6 -38 106 41 62 358 59 -200 99 -215 194 103 -31 144 -78 -95 -177 -63 10 64
7836F4l37M71l51L44j53k08L92k56M7J62j64n8M0j15K26l14M73j85q7J05k87L62
$$ 64 -273 198 -153 191 38 -170 222 -34 13 175 11 -47 -7 -122 104 -210 263 78 -9 96 -191 171
7858A71j44j65K03j76j05L75o1m3n3O6K19Rl49n6Q7K22m34K84R7Nk40J53l43J4
$$ 171 27 -138 65 -111 -216 159 98 55 2 68 287 296 -53 -109 -22 200 -234 50 147 152 -88 65 -278 -264
7882b64L23k66J60o9J53j21P3r1L80j20l66Q2m5K74J2m90L71K26l68K54j50l46
$$ -264 59 -207 -47 -116 37 -84 -11 -102 278 158 -208 -126 -171 103 115 -375 -4 222 -146 108 -42 -388
7904c88M86j29p8P6q8L79k21k57j1J42M3M8J97l51j26L37K84k26l5n3l4l61K29
$$ -388 98 -31 -109 -33 -121 258 37 -220 -231 -89 -46 2 199 -152 -278 59 343 117 82 29 -5 -366 -137
7927a37n8J92j13O2j0K96j72J22k29O4j41J36j06O8J54n4Q4J48l91j40K95J99
$$ -137 -195 -3 -116 -54 -64 232 60 182 -47 17 -124 12 -94 -26 128 74 158 306 -85 -225 70 269
7949B69k70j28J76j07k64J77r7J74M1p1q5k57M11J53J34k27Oj29j16K27j19j02
$$ 269 -1 -129 47 -60 -324 -147 -244 -70 -29 -100 -185 -442 -31 122 256 29 35 -94 -210 17 -102 -204
7971b04L02J00K1k12K76l33J99o3j75q6O5J28j01M0J40j27j09K28m7k7k25K62
$$ -204 98 198 219 7 283 -50 149 86 -89 -175 -110 18 -83 -43 97 -30 -139 89 42 15 -210 52
7993E2j70J81J25k15o5K34j88J63j84l1J18m4o3q1m0L60l6l97K13K81R2l04o2
$$ 52 -118 63 188 -27 -92 142 -46 117 -67 -98 20 -24 -87 -168 -208 152 116 -281 -68 213 305 1 -61
8016f1J62M7m45K38N5m6P5K53j49p2j2M2j86O5P8j14p8n1J21N5K66j09r6m8J44
$$ -61 101 148 -297 -59 -4 -50 25 278 129 57 45 87 -99 -34 44 -70 -148 -199 -78 -23 243 134 38 -10 134
8041A34k47j68J12J46N1J18l35N8M4K75l00K80l33J92J08p7k23J40J24jR1k21
$$ 134 -113 -281 -169 -23 28 146 -189 -131 -87 188 -112 168 -165 27 135 58 -165 -25 99 98 189 -32
8063c2J09k11m0J37P3N9l10K25k99J55J33j00K13j09J04q9K15m72L68j21j52J95
$$ -32 77 -134 -174 -37 36 95 -215 10 -289 -134 -1 -101 112 3 107 18 233 -239 129 8 -144 51
8085E1n4m9K28k77p2K98k65M23m86R4L58j76k36j18K63K0Kj43K50j26J39k15J79
$$ 51 -3 -52 176 -101 -173 125 -140 283 -203 -109 249 73 -163 -281 -18 2 4 -139 111 -15 124 -91 88
8108H8j62j68M83k21k73nL01k30Q8K06P8k54K07m26K08J11K1N6j41k7j04K85j82
$$ 88 -74 -242 241 20 -253 -258 43 -187 -99 107 185 -69 138 -288 -80 31 52 108 -33 -60 -164 121 -61
8131f1K43k4j44j69J99k29K93O5j66J92j83j96J34K15l14J10o2J75q7l2j12R3
$$ -61 182 158 14 -155 44 -185 108 173 7 199 16 -180 -46 169 -145 -35 -97 78 -9 -41 -153 -60
8153f0J96l04J69m4P5n6j6j59L09j02J6N3J61k38K20k18N8l2j17m7j6r2K82Q6
$$ -60 136 -168 1 -43 32 -24 -40 -199 110 8 24 77 238 0 220 2 60 28 -89 -136 -152 -244 38 124
8177A24j95J57j85K39N2m80N55j66k08R7j61J66J11j99
$$ 124 -71 86 -99 140 192 -288 267 101 -107 -10 -171 -5 106 -93
8191i3
$$ Imaginary data points
##PAGE= N=2
##DATA TABLE= (X++(I..I)), XYDATA
0@%%%%%%%%%%%%%qJ6j6J6j6K4l2L3m1N1n9P2q6R8j12J30j50J71j96K24k54K86
$$ 0 0 0 0 0 0 0 0 0 0 0 0 0 0 -8 8 -8 8 -8 16 -16 17 -24 27 -32 40 -46 52 -60 70 -80 91 -105 119 -135 151
35A51l22L62m05M53n05N64o28O95p70Q53r44J043j150J267j395J537j694J869
$$ 151 -171 191 -214 239 -266 298 -330 365 -405 448 -496 547 -603 664 -731 806 -888 981
53I81k060K273k517K790l102L465l890M395n008N775o763Q088r974J2893j8076
$$ 981 -1079 1194 -1323 1467 -1635 1830 -2060 2335 -2673 3102 -3661 4427 -5547 7346 -10730
68a0730L0116j16321n3232J04117j6172J1301L6924P9944K3231j8433j8339K9490
$$ -10730 19386 -96935 -150167 -46050 -62222 -50921 -13997 65947 89178 70745 52406 81896
80H1896N035l3817n1368l156K3008r844n2050j4736K2764J7670k1005k9643P948
$$ 81896 86931 53114 1746 -1410 21598 11754 -40296 -55032 -32268 -14598 -35603 -65246 -57298
93e7298M1685Q792k2720k709M1672M4713n51k2409K0628L7280r104m9262l4174
$$ -57298 -15613 -6821 -29541 -32250 9422 54135 53584 31175 51803 89083 79979 30717 -3457
106c457R76k219m4907m5516O564L3472J2087j0753J0798N5868M7240o185j4676
$$ -3457 -2481 -4700 -49607 -95123 -88559 -55087 -43000 -53753 -42955 12913 60153 53968 39292
119C9292J8323K1270j3914m5003k9949P398L133l0945l0969P647L1836P452k4713
$$ 39292 57615 78885 64971 19968 -9981 -2583 550 -30395 -61364 -53717 -21881 -14429 -39142
132c9142m52L7613K3984j1422j4074J6095L3287J977l0541j0455K1331Q781k6126
$$ -39142 -39594 -1981 22003 10581 -3493 12602 45889 47866 17325 6870 28201 36982 10856
145A0856l3167K066J9572j3802l3306n624K3765J8213r167r626K6080L9795Q175
$$ 10856 -22311 -20245 -673 -14475 -47781 -53405 -29640 -11427 -20594 -30220 -4140 35655 43830
158D3830j5730o05K1184P144l1359l4447m76Q774j6684l0411p864K3688J9641
$$ 43830 28100 27495 48679 55823 24464 -9983 -10459 -1685 -18369 -48780 -56644 -32956 -13315
171a3315r735o855K5711L4004N789j8072k170K2937O648k7531k3179M428J2556
$$ -13315 -23050 -29905 -4194 29810 35599 17527 15357 38294 44942 17411 -5768 -1340 11216
184A1216j1238k8574o257K1709R218j8120j2467J6040K5690j216j7186O722K8028
$$ 11216 -22 -28596 -34853 -13144 -3926 -22046 -34513 -18473 7217 6001 -11185 -4463 23565
197B3565J1289j3824j1781J1306J6475j1431k8364r256J0032k703k5763j9560
$$ 23565 34854 21030 9249 20555 37030 25599 -2765 -12021 -1989 -4692 -30455 -50015
209e0015J2551K0922j114q788J2686L1697J8988q357q476J3980J3273j6380l0635
$$ -50015 -37464 -16542 -17656 -26444 -13758 17939 36927 28570 20094 34074 47347 30967 332
222C32j0615Q894l821k5582j4464J4967J9043k387j0021J0697K7410J0831j4443
$$ 332 -10283 -1389 -5210 -30792 -45256 -30289 -11246 -13633 -23654 -12957 14453 25284 10841
235A0841p826J4039J3557j1249k0365P5J6244j13j9698j2047R517J0729j2139
$$ 10841 3015 17054 30611 19362 -1003 -928 15316 15203 -4495 -16542 -7025 3704 -8435
248h435k1063Q69J8008M965j2491k471K2612K2817j838j0771P955J7606j329k3684
$$ -8435 -29498 -28629 -10621 -5656 -18147 -20618 1994 24811 22973 12202 20157 37763 36434 12750
262A2750j7783K877K060j9486k1360K973J9443P651q749L504K4308J8905m713
$$ 12750 -5033 -2156 -96 -19582 -40942 -37969 -18526 -10875 -19624 -16120 8188 27093 22380
275B2380j1302M530J3048m158k2716j2523R168P292j2722j4971N120J7499Q45
$$ 22380 11078 15608 28656 24498 1782 -10741 -1573 5719 -7003 -21974 -16854 645 1490
288A490j5545m341J5412J1615r219j2501Q851J9228L419j2992k168J6177Q179
$$ 1490 -14055 -18396 -2984 8631 -588 -13089 -4238 14990 18409 5417 3249 19426 27605
301B7605j4719j8940k3Q255q813k0634o015J4359J2907n006l914J5944K2332M433
$$ 27605 12886 -6054 -6077 2178 -6635 -27269 -33284 -18925 -6018 -11024 -14938 1006 23338 27771
315B7771j2284l551J0964K162j8644j9266K27Q382m962j5774j110J8097J2534
$$ 27771 15487 11936 22900 25062 6418 -12848 -12621 -4239 -9201 -24975 -26085 -7988 4546
328D546o814p265J1420J6070k591j5364k373J2918N172j2507j1137P850J3174
$$ 4546 -2268 -9533 1887 17957 15366 2 -2371 10547 15719 3212 -7925 -75 13099
341A3099m552j6117l544J1156K675j4807j1555Q366J4284j106r172M896J9653
$$ 13099 8547 -7570 -11114 42 2717 -12090 -23645 -15279 -995 -2101 -11273 -6377 13276
354A3276J0972p710p591P539Q688j0434k0843q232O871m94j5139q566J1615J6322
$$ 13276 24248 16538 8947 16486 25174 14740 -6103 -14335 -7464 -7958 -23097 -31663 -20048 -3726
368c726J889n696P212J8709Q179j0733r327N898P014r703j8186l297R269J355
$$ -3726 -1837 -7533 -321 18388 26567 15834 6507 12405 19419 9716 -8470 -11767 -2498 -1143
382a143j2707o845J0342J2457l209j0614L344J4411M489j0496n364J1259J1671
$$ -1143 -13850 -20695 -10353 2104 -1105 -11719 -8375 6036 10525 29 -5335 5924 17595
395A7595n228j1428J996J0885O36j4953j0691N076N986r595j3760K573J4401N426
$$ 17595 12367 939 2935 13820 14456 -497 -11188 -6112 -126 -9721 -23481 -20908 -6507 -1081
409a081o931j92J5268J4230k924r744K165R635k987j7025j1993M840M194r606
$$ -1081 -8012 -8204 7064 21294 18370 8626 10791 20426 17439 414 -11579 -6739 -2545 -12151
423a2151j1501M314J4883M234o798J91J3377J1133n819j0051K703R727j911j3272
$$ -12151 -23652 -19338 -4455 -221 -7019 -6828 6549 17682 11863 1812 4515 14242 12331 -941
437i41o380P790O161q859j0447K839J0913M7j1827m025J0175R585n431p523P568
$$ -941 -7321 469 6630 -2229 -12676 -9837 1076 1123 -10704 -14729 -4554 5031 -400 -7923 -355
452c55J4623K142r541l102R152M166j1624j3933j015O132m097j2656k405J2365
$$ -355 14268 16410 6869 3767 12919 17085 5461 -8472 -9487 -3355 -7452 -20108 -22513 -10148
466a0148J0390k487l482R721J4699J375r883m445O052J788j2069j3544J006P863
$$ -10148 242 -2245 -5727 3994 18693 20068 10185 5740 11792 13580 1511 -12033 -11027 -3164
480c164j941j0157l27J2217Q189n618n743O380J0292j087j0203j720R824N365
$$ -3164 -5105 -15262 -15589 -3372 4817 -801 -6544 -164 10128 9041 -1162 -2882 6942 12307
494A2307p306p620N107Q863l807j2730l999O059J949j0277q485N928J1213J763
$$ 12307 5001 -2619 2488 11351 7544 -5186 -9185 -3126 -1177 -11454 -19939 -14011 -2798 -1035
508a035n128M169J5095Q455o211o621L232N340q360j5941o528M736J012r326n228
$$ -1035 -6163 -1994 13101 21556 15345 8724 11956 17296 8936 -7005 -13533 -8797 -7785 -17111 -22339
523b2339R053J3372J939n187M134J2356M932q314p353L518N453n793j2046j621
$$ -22339 -13286 86 2025 -3162 972 13328 18260 9946 2593 6111 11564 5771 -6275 -7896
537g896Q264K339q217o090O221P053l609q797M83R644M186n967k653R321J0029
$$ -7896 368 2707 -5510 -11600 -5379 1674 -1935 -10732 -10249 -605 3581 -2386 -5039 4282 14311
552A4311j115p489M70P375o89j2590r806K100L212o432r567K389J1486N858l387
$$ 14311 13196 5707 6177 13552 12863 273 -9533 -7433 -4221 -10653 -20220 -17831 -6345 -487 -3874
567c874L70J1233J0647k585q809l27O002k382j1931p453L480M473m812p947K447
$$ -3874 -3504 7729 18376 15791 6982 6655 12657 10275 -1656 -9109 -5629 -1156 -5968 -13915 -11468
582a1468R792L357o359k657Q029P382l361o592K561Q483J380p153m173N568M976
$$ -11468 -1676 1681 -4678 -7335 694 8076 4715 -1877 684 9167 10547 3394 -779 4789 9765
597I765o198j0275o61N485j312q970l347P960P752j027l536N575J1104K888o986
$$ 9765 3567 -6708 -7369 -1884 -3196 -12166 -15513 -7553 199 -828 -4364 1211 12315 15203 8217
612H217l778M652K653q853j0386q67M874j329p983j475Q930P521j722l897M864
$$ 8217 4439 9091 11744 2891 -7495 -8362 -3488 -4817 -12800 -14275 -5345 2176 454 -3443 1421
627A421R305L82p652l667N728K949o720p454K151O209n48p620k629O280M289n493
$$ 1421 10726 11108 3456 -211 5517 8466 1746 -5708 -3557 2652 2104 -5516 -8145 -1865 2424 -3069
643c069n891L066Q097J37n441M40Q281N360l702n066K621N499l281r760m990L337
$$ -3069 -8960 -5894 2203 2340 -3101 -2661 5620 10980 7278 2212 4833 10332 7051 -2709 -7699 -4362
659d362O79o173n320M907Q917J898l190K492R360N614m951n496J192M011m867
$$ -4362 -3683 -9856 -15176 -10269 -1352 546 -2644 -152 9208 14822 9871 4375 5567 9578 4711
674D711j0102l494M576J863n740l997N339Q163K19m702J040P518L182n404m848
$$ 4711 -5391 -8885 -4309 -2446 -8186 -12183 -6844 1319 1538 -3164 -2124 5394 8576 3172 -1676
689a676L573N622j977o623p78N745J944o760n460K693M182l354p041r6P149L570
$$ -1676 1897 7519 5542 -1081 -1859 3886 5830 -930 -6390 -3697 485 -2869 -9910 -10006 -2857 713
705G13l491o87O506P664o84m978J02M283m84q607o781R97K579l772n851J477P951
$$ 713 -2778 -3465 3041 10705 10021 5043 5145 9428 8944 337 -6444 -5447 -2868 -6640 -12491 -11014 -3063
722c063M107k661j181O563O471k034n974k75M571j09p129m520L789M002l240n874
$$ -3063 1044 -1617 -2798 3765 10236 8202 2228 1953 6524 6415 -714 -5234 -1445 2557 -683 -6557
738f557Q40N941J167n754k787M931M975k497m097K944P123K092m744k192L984
$$ -6557 -5717 224 1391 -4363 -7150 -2219 2756 259 -3838 -894 6229 8321 3577 1385 5369
753E369K804m957p388r80L464j113n903k281N500O170p62k340M203P076J322n470
$$ 5369 8173 3216 -4172 -5152 -1688 -2801 -8704 -10985 -5485 685 -77 -2417 1786 8862 10184 4714
769D714l013L162J572n858o884N89M127Q7m722q13N804N345l027l417K242N104
$$ 4714 1701 4863 6435 577 -6307 -5718 -1591 -1504 -6226 -7039 -1235 4110 1083 -2334 -92 5012
785E012l85n493k135M653L420l426m492K546N060n44o128k605L990J430m392m760
$$ 5012 4627 -866 -3001 1652 5072 1646 -2846 -300 4760 4216 -1912 -4517 -527 903 -3489 -8249
801h249K302O234O06l572J057O433M697k958m301J316L169l271p266l364K907
$$ -8249 -5947 287 893 -2679 -1622 4811 9508 6550 2249 3565 6734 3463 -3803 -7167 -4260
816d260J348l840l016M148O775J349k576J095N820K705m593m757R54L091k621
$$ -4260 -2912 -6752 -9768 -5620 1155 2504 -72 1023 6843 9548 4955 198 1152 4243 1622
831A622n978j221M103K103l457k992L767M809j081m816l26M853K094l558k484
$$ 1622 -4356 -5577 -1474 629 -2828 -5820 -2053 2756 1675 -3141 -3467 1386 3480 -78 -2562
846b562L626N130j221m261K21L523N80n493m687R97K922k574m594R85N685L321
$$ -2562 1064 6194 4973 712 933 4456 5036 -457 -5144 -4147 -1225 -3799 -8393 -7408 -1723 1598
862A598j765j026N219M656o60n062j067K739l00o047m455J905L154j956l795J088
$$ 1598 -167 -1193 4026 8682 8022 2960 1893 4632 4332 -1715 -6170 -4265 -1111 -3067 -6862 -5774
878e774N922K433l158j413L907L905k282m211K92M202O54m086k643K692L089k712
$$ -5774 148 2581 -577 -1990 1917 5822 3540 -671 -379 3823 4477 391 -2252 440 3529 817
894H17m875j63L762J67m561k186M280M520j191k140K483N478J226m164k177K247
$$ 817 -4058 -4221 -459 -292 -4853 -7039 -2759 1761 570 -1570 913 6391 7617 3453 1276 3523
910C523J398m210n525l97K917q9l657q84M587M766q04k652K269N007P9m519k400
$$ 3523 4921 711 -4814 -5211 -2294 -2383 -6040 -6924 -2337 2429 1625 -1027 1242 6249 6328 1809 -591
927e91K204K026l765m349R92L770L77l839j026L866K725k338l502J479M271J4
$$ -591 1613 3639 -126 -4475 -3483 287 664 -3175 -4201 -335 2390 52 -3450 -1971 2300 2314
943B314l311q77M134K845k089l439J480L398j579n204k317K399J453l585k778
$$ 2314 -997 -1874 2260 5105 3016 -423 1057 4455 2876 -2328 -4645 -2246 -793 -4378 -7156
958g156K641N112J503k212N82M781K673k683l733M43J752k274n367k348K900J567
$$ -7156 -4515 597 2100 -112 470 5251 7924 5241 1508 1951 3703 1429 -3938 -6286 -3386 -1819
974a819k243k111L636M467N35k327L55L608J787l293l330R56K825j360l905q24
$$ -1819 -4062 -6173 -2537 1930 2465 138 493 4101 5888 2595 -735 221 3046 1686 -2219 -3043
990c043L524J315l056k903J804K847j078l432l66M200K706k246j413L506L852
$$ -3043 481 1796 -1260 -4163 -2359 488 -590 -4022 -4388 -188 2518 272 -1141 2365 6217
1005F217m52m215m21K504l40m551l989Q82K412j653k906Q91M668L063j288o46
$$ 6217 5765 1550 1129 3633 3293 -1258 -5247 -4365 -1953 -3606 -6512 -5621 -953 2110 822 176
1021A76L682K983j241l849r47K204q8m222l168J446K825j505k841O59L828J072
$$ 176 3858 6841 5600 1751 804 3008 2920 -1302 -4470 -3024 -199 -1704 -4545 -3886 -58 1014
1037A014k356j349K703L047p63l212R46L968J069k915k185J725J693k846m052
$$ 1014 -1342 -2691 12 3059 2296 -916 30 3998 5067 2152 -33 1692 3385 539 -3513
1052c513n08J973L1k734j261L340L739L3j182J939L750J160l146k490J404R92
$$ -3513 -4021 -2048 -2017 -4751 -6012 -2672 1067 1100 -82 1857 5607 6767 3621 1131 2535 3527
1068C527l504m456J03J970O57k653j43L199L246o44k215J224L247J36l124j360
$$ 3527 23 -4433 -4330 -2360 -1703 -4356 -4499 -1300 1946 1302 -913 311 3558 3694 570 -790
1084g90K088J722j936k475M53K884o56k724j659J599J708k260k723J635L313J102
$$ -790 1298 3020 1084 -1391 -938 1946 1290 -1434 -3093 -1494 214 -2046 -4769 -3134 179 1281
1100A281j756J84L374K548j431k815N65J485j582m409k229J826J080k069j479
$$ 1281 -475 -291 3083 5631 4200 1385 1950 3435 1853 -2556 -4785 -2959 -1879 -3948 -5427
1115e427K226L916J171j564O28L029J640k273k823M83J653j626l722j196K155
$$ -5427 -3201 715 1886 322 950 3979 5619 3346 523 1006 2659 1033 -2689 -3885 -1730
1130a730J390j946j316J469L277j79k368J19K416J521j683j755J731K702l21k919
$$ -1730 -340 -2286 -3602 -2133 1144 965 -1403 -1284 1132 2653 970 -785 946 3648 3327 408
1146D08n61J859M91k813l025Q81J595n43k868N14L252K373r87o20K321K916m75
$$ 408 -153 1706 2197 -616 -3641 -2760 -1165 -1708 -4576 -4062 -810 1563 576 -44 2277 5193 4718
1163D718k799p71J321n3l119k875K99J970j331j612J35L578J826j445p27K205
$$ 4718 1919 1148 2469 2416 -703 -3578 -3279 -1309 -2640 -4252 -4117 -539 1287 -158 -885 1320
1179A320K623p30k106k67J650M42k870j740J517J492j543k655k97K061R9j709
$$ 1320 3943 3213 1107 840 2490 2932 62 -1678 -161 1331 -212 -2867 -3164 -1103 -1004 -2713
1195b713o49K030K374j39j397J283K848N95j700j634J039J130k444l314j87J083
$$ -2713 -3362 -1332 1042 903 -494 789 3637 4232 2532 898 1937 3067 623 -2691 -2878 -1795
1211a795j57j998l74K329K605k4p51J360K453K53j875j618J153R32j904k697l12
$$ -1795 -1952 -3950 -4324 -1995 610 586 -165 1195 3648 3901 2026 408 1561 2493 589 -2108 -2420
1228b420K306l78j794n92K288J365j149j684Q06K421R9j724l95K149J588j053
$$ -2420 -114 -492 -2286 -2878 -590 775 -374 -2058 -1252 1169 1268 -456 -851 1298 2886 1833
1244A833j476O75J425m19k816j869J424P06j989j833J331K632J182j352O29K825
$$ 1833 357 1032 2457 2038 -778 -2647 -1223 -517 -2506 -4339 -3008 -376 806 -546 83 2908
1260B908J625j414j823n4J070j060l197j086R26J080j260j105J148L331L98j282
$$ 2908 4533 3119 1296 1242 2312 1252 -1945 -3031 -2105 -1025 -2285 -3390 -2242 1089 1487 205
1276B05j87K230Q06j566j827M37J519p64j717q41K044O52j023j985Q78J283j92
$$ 205 18 2248 3054 1488 -339 98 1617 853 -864 -1705 339 991 -32 -2017 -1139 144 -48
1293d8k453L11J986J351j102o00J659J916q5j729o58J549J71k683k583N48J164
$$ -48 -2501 -2190 -204 1147 45 -555 1104 3020 2935 1206 548 2097 2268 -415 -2998 -2450 -1286
1310a286m10j691N06K769J255o18o36K008J794l57k316q49J249N7k116j737N50
$$ -1286 -1696 -3387 -2881 -112 1143 525 -111 1897 3691 3334 1018 169 1418 1475 -641 -2378 -1828
1327a828J817n45j882L26J912J050j319j182J758J539j48j518j02K273M31j511
$$ -1828 -11 -556 -2438 -2112 -200 850 -469 -1651 107 1646 1498 -20 -122 2151 2582 1071
1343A071j071N14J188j305k456m83J461L16j867o97J844K158K07j130J201K553
$$ 1071 0 514 1702 397 -2059 -2542 -1081 -765 -2632 -3329 -1485 673 880 -250 951 3504
1359C504J35j980r46M08N01j436k023n09J287P7r64n69J779J900n98j034L88J524
$$ 3504 3639 1659 713 1121 1622 186 -1837 -2346 -1059 -982 -1946 -2515 -736 1164 566 -468 -80 1444
1377A444P46j957p51J202J214j162j562K33J492L94k122p39R10Q53q63k041R91
$$ 1444 2190 233 -518 684 1898 736 -826 -593 899 1293 -829 -1568 -658 195 -668 -2709 -1718
1394a718J927M36q89k39J712J599p11j352K22R81q65k207r65O74Q18j077j345
$$ -1718 209 645 -244 -483 1229 2828 2117 765 987 1968 1103 -1104 -2069 -1395 -577 -1654 -2999
1411b999J116K359N90q87k01J938J190j294j621lR46p14j931n55J125J036r16
$$ -2999 -1883 476 1066 179 -22 1916 3106 1812 191 188 1134 420 -1511 -2066 -941 95 -821
1428h21j258J379J714j89j241l54J416J012j244j313J143J237l99j325n40J424
$$ -821 -2079 -700 1014 825 -416 -770 646 1658 414 -899 244 1481 1082 -243 -783 641
1444F41N78j054j791N25J135l79j629N8J362J431l98p28J334J595k47j767j90
$$ 641 1219 165 -1626 -1101 34 -345 -1974 -1916 -554 877 479 -249 1085 2680 2433 666 476
1461D76O68j27j589j843O10O88J23j236L05K026J155q55n75J170J350m74j478
$$ 476 1144 1017 -572 -2415 -1805 -1117 -994 -2230 -1925 101 1256 401 -174 996 2346 1872 394
1478C94q31J189K00j172r70J96J500m07j631P0J381M24j046q80Q86J704j38j043
$$ 394 -437 752 952 -220 -1190 -994 506 99 -1532 -1462 -81 343 -703 -1583 -697 1007 869 -174
1496a74M91J433O60r67j070K31N30j020j824o82J187L77r79q45J961J756j08p95
$$ -174 317 1750 2410 1443 373 604 1134 114 -1710 -2392 -1205 -828 -1807 -2652 -691 1065 957 162
1514A62P66J304L22j379j069K12L38p67j549j30J397L73j310k39J165J549o89
$$ 162 928 2232 2554 1175 106 318 656 -111 -1660 -1790 -393 -20 -1330 -1569 -404 1145 456
1531D56r93j2J215M66j266l80J071J311q56j020K99O68M1j925p09M46Q31o36j247
$$ 456 -537 -549 666 1132 -134 -514 557 1868 1012 -8 291 959 1000 -925 -1634 -1188 -357 -993 -2240
1550b240O29J780O66o22J9J194J016o99j215l12O81m05j672q38P92N74m57o18
$$ -2240 -1611 169 835 213 232 1426 2442 1743 528 216 897 492 -1180 -2018 -1226 -652 -1109 -1727
1568a727P30J819M97j221M9J112M23m13j682M10N56l69j160j34Q83P61q90p32
$$ -1727 -997 822 1319 98 147 1259 1682 1269 -413 -3 553 184 -976 -1110 -227 534 -356 -1088
1586a088N01J057j88r05o15J019R90m27r78J005R48J87j286n54R44J27j120j010
$$ -1088 -587 470 282 -623 -1238 -219 771 344 -634 371 1319 1506 220 -334 610 737 -383 -1393
1604a393j52J122k68q55N5J336J113k89k04P35R24n21j162o10K11K98j028j219
$$ -1393 -1545 -423 -691 -1546 -1491 -155 958 669 465 1200 2124 1603 441 -169 42 340 -688 -1907
1622a907O14R08k00r50N96R37R70p35o24P85R84m26p09p31J466M49j412n83M02
$$ -1907 -1293 -385 -585 -1535 -939 -2 968 233 -391 394 1378 952 243 -488 978 1427 15 -568 -166
1641a66N64m03j138m02P93K47n24j54O81J381l28k34J61J303L70j336p93K01L48
$$ -166 398 -5 -1143 -1545 -752 -505 -1029 -1183 -502 879 551 317 478 1781 2151 815 22 223 571
1660E71q80j329q5P57N13q00l30R06J408k06m60L57R71J42r39q74M00Q41r14p69
$$ 571 -309 -1638 -1723 -966 -453 -1253 -1583 -677 731 525 65 422 1393 1535 596 -278 122 963 49 -720
1680g20k50Q51L74r37l63L85J021m98j036N74Q60J42n89k93J304O62m32q88l8
$$ -720 -970 -119 255 -682 -1045 -660 361 -137 -1173 -599 261 403 -186 -479 825 1487 1055 167 129
1699A29P54l76j063r11L03N70n09p72O78J366O62k15j08N86J012o01j150k72Q00
$$ 129 883 507 -556 -1467 -1164 -594 -1103 -1875 -1197 169 831 616 508 1094 2106 1505 355 83 883
1718H83q65r58o59R81N12l52l29K12J017K44n71m53Q46K74n49o36L78J006m38
$$ 883 18 -940 -1599 -618 -106 -458 -787 -575 442 686 115 -338 508 782 233 -403 -25 981 543
1737E43o24l55R95L34q58r06K91Q28m40p16j66R59P80l70k54M89J223m45j027
$$ 543 -81 -436 559 893 35 -871 -580 248 -192 -908 -1074 -115 665 295 41 530 1753 1308 281
1756B81l44P78l62o08j167J79O76k95n9k30J395Q99o90l32L68J008m68r53k78
$$ 281 -63 715 353 -255 -1422 -1243 -567 -862 -921 -1151 244 1143 453 121 489 1497 1029 76 -202
1775b02J63L39o55p47N30Q12l53l66o18J036L55n98K8K70Q25j26o65k3R34J91
$$ -202 -39 300 -355 -1102 -572 240 -113 -479 -1097 -61 294 -304 -276 -6 819 693 28 5 939 1130
1795A130n95p29K20N73q76j144j07R32J74p63k33R89R91L39m39k9Q43L52p99r38
$$ 1130 535 -194 26 599 -277 -1421 -1528 -596 -422 -1185 -1418 -429 562 901 462 433 1276 1628 829 -109
1815a09P2M69l98j186k04R15M45n51k36M45J189m11r71O55M61L36m43p56L44J130
$$ -109 -37 432 34 -1152 -1356 -441 4 -547 -783 -338 851 440 -531 124 585 921 478 -278 66 1196
1835A196n56p15k02P20j0r67j81j38O46m58m10K46R16M26j96m07O77Q99n53q40
$$ 1196 640 -75 -277 443 433 -534 -715 -853 -207 -665 -1075 -829 87 513 317 -90 587 1486 933 93
1855I3r1N80n87o58o53L66M87k73k47L27J185n2m14O3N04J05l89p19K33O50m15
$$ 93 2 582 -5 -663 -1316 -950 -463 -736 -983 -656 529 477 63 126 630 735 346 -373 -140 510 95
1876I5n88k69O24J75l46m43N66M61j00p52q8P44N87l59n57J46O75M10r27j38M64
$$ 95 -493 -762 -138 37 -309 -752 -186 275 175 -577 -665 79 666 307 -250 -104 571 981 54 -84 380
1897C80K27m64j169K82O79k00j70n99Q61N74l33l25O84O90n6r66n43O16O3q39
$$ 380 607 143 -1026 -744 -65 -265 -435 -1034 -173 401 68 -257 427 1117 1061 95 -448 168 231 -608
1917f08j68J01L92L56q14l3N90Q12n32n1O9Q52n02p68NN74J01j43r00N19L87j87
$$ -608 -776 -675 -283 73 -741 -774 -184 628 96 45 114 966 464 -304 -299 275 376 233 -667 -148 239 52
1939E2m22m36N92J96k2o12M49M96j04j51L9Q07O9m40p11J95K38n85n14l27M91
$$ 52 -370 -806 -214 -18 -40 -652 -203 293 189 38 77 884 953 513 -198 -3 235 -350 -864 -1191 -700
1960g00M21k38j94O56O26k20k96J04P89n6m12r57M44K76l29l36j54M44K67k00
$$ -700 -279 -517 -711 -55 571 351 55 159 948 892 480 -477 -33 243 -86 -422 -576 -132 135 -65
1980f5m46N15L14O1n92k42O76L08m59j74P00Q4l1o68l9M14o4o50n62L12J17k33
$$ -65 -511 4 318 379 -213 -455 221 529 70 -104 596 680 649 -19 -58 356 292 -358 -920 -608 -491 -724
2002g24k39M14P23J18K43j60M01K04n23k84k62K87K5j002m48P33M02j63n24K60
$$ -724 -963 -549 174 292 535 375 776 980 457 173 -89 198 223 -779 -1227 -494 -92 -255 -779 -519
2022e19R79j43j42l78N98J81j52o34Q6N83j37m76j93J97N25k60m34o6K75M50r27
$$ -519 460 317 175 -203 395 576 424 -210 -124 459 322 -154 -347 -150 375 115 -319 -385 -110 340 -587
2043e87K34K01L60q0j09L48M99k25m23k10K40j91k75n70oM80J9k62k68J186J79
$$ -587 -353 -152 208 128 19 367 866 641 218 8 248 57 -218 -788 -794 -314 -295 -557 -825 361 540
2064E40k40l73M00N45j82n49p09P06K1m01m67K60L17K53o04J9O01J14j52m55L14
$$ 540 300 -73 327 872 690 141 -568 138 159 -242 -709 -449 -132 121 -483 -464 137 251 99 -356 -42
2085d2N66M9n75J41L21J56q75M9L41K12o42k03l48O66ql12p2O90N00J22m98m9
$$ -42 524 573 -2 139 460 616 -259 -210 131 343 -299 -502 -850 -184 -192 -504 -576 114 614 736 238 189
2107A89L70M23n80m12k09K12p2o64j72L54N56n18O3L96P40m6m93K30L77l98m05
$$ 189 559 982 402 -10 -219 -7 -79 -743 -915 -561 -5 -523 -460 -64 676 630 137 367 744 346 -59
2128e9m3m4N32j82l54r7L29R7n54l38M08L23j99l60o7Q17J51l39R5Q58n5n87l44
$$ -59 -102 -146 386 204 -150 -247 82 179 -375 -713 -305 18 -181 -541 -608 209 360 21 116 974 919 332 -12
2151a2L07p5k30n70k64L63K12J12l91L69M95J50m39L29j3K45j78o70J59K35K7
$$ -12 295 220 -10 -580 -844 -481 -269 -157 -548 -179 316 466 27 356 343 588 410 -260 -101 134 161
2172A61l49k40J34J72j34k47N2O35J46m83m2M19J43j37l22N1L46K49m19l82L88
$$ 161 -188 -428 -294 -122 -256 -503 -451 184 330 -153 -195 224 367 230 -92 -41 305 554 135 -247 141
2193A41r2l21l23J31K24R7j19k04K70N52k42j45M06O20j95o23j61N1jj19n98K58
$$ 141 49 -272 -595 -464 -240 -143 -262 -466 -196 356 114 -31 375 995 800 177 16 67 66 -53 -651 -393
2215c93L14j57j65J45M51J1p2k35L06M53m37k87m3K58J34m12j86q2P79m47l58
$$ -393 -79 -236 -401 -256 195 206 134 -101 205 658 221 -66 -109 149 283 -129 -315 -397 382 -65 -423
2236d23r4M83M04p42K17O5K09J79j26k10N49l5k12k17o8O8r7o57Q6M04K42m24
$$ -423 -517 -34 370 -372 -155 -90 119 298 172 -38 511 476 264 47 -21 47 -50 -707 -621 -217 25 -399
2258c99k84P86J87J34m54K23Q5o6jk72J10m1J16p30J87L79J36l35O1K6K58J29
$$ -399 -683 103 290 424 -30 193 278 212 211 -61 49 8 124 -606 -419 -40 96 -239 -178 -152 106 235
2280B35l32K58J43L00k94k25R4L80o8m71q2J09J70o66k39K32O2J66p9o4O48N4
$$ 235 -97 161 304 604 310 85 179 559 491 20 -62 47 217 -449 -688 -456 -394 -228 -307 -371 277 331
2302C31N8j59J37K05o1j84m40K67j44m92J19Q9Nr0j06J70M64L39n00K5L83j73
$$ 331 389 230 367 572 511 327 -113 154 10 -482 -363 -274 -269 -359 -465 -295 169 508 8 33 416 243
2324B43k88j53J4L74M2j54j02K25j89l9n43J55M49m9l39K7L46J79k25O9L35J78
$$ 243 -45 -198 -184 190 232 78 -24 201 12 -27 -570 -415 34 -15 -354 -327 19 198 -27 42 377 555
2346E55j04n43r2K32J02k70m70M17l3k0j23j75N42M46j94j93l3L89Rj93j84j31
$$ 555 451 -92 -184 48 150 -120 -590 -173 -206 -226 -349 -524 18 464 270 77 44 433 442 249 65 -66
2368f6K09n23J64J29oK18n15Q9N11o8j45M6p2K43k12Q4J5J0L00m40j02K29Lk05
$$ -66 143 -380 -216 -87 -93 125 -390 -301 210 142 -3 43 -29 214 2 86 101 111 411 -29 -131 98 101 -104
2392a04j67j58J9M51l23J57p6M50P6k14J09Q5J40j69o75M16k70J28l80J31K71
$$ -104 -271 -429 -410 41 -282 -125 -201 249 325 111 220 305 445 276 -399 17 -253 -125 -505 -374 -103
2413a03jj50J46j13L09K85l57p9J48K25j47q8K01k09n2k70kK24K2l40L77j85K24
$$ -103 -104 -254 -108 -221 88 373 16 -63 85 310 163 75 276 67 15 -255 -257 -33 -11 -351 26 -159 65
2436F5Q9k65p3K64K58j52M7J20K38l86k80l9J08K30o75r6M31l21J44kJ82J84Q1
$$ 65 154 -111 -184 80 338 186 233 353 591 205 -75 -114 -6 224 -451 -547 -116 -437 -293 -295 -113 71 152
2459A52J18K15k87N16q8n32L9k54J62m93q9O8N33j85k0j0K55q4j04N0J61m2K74
$$ 152 270 485 198 714 626 94 133 -121 41 -452 -541 -473 60 -125 -145 -155 100 16 -88 -38 123 81 355
2482C55j78k76M46l4l35J09j08J82l68l6m7M83k05j92P8k28N60j38j64J19N45
$$ 355 177 -99 347 313 -22 87 -21 161 -207 -243 -290 193 -12 -204 -126 -354 206 68 -96 23 568
2503E68j2lm94k6J26k63k48J24K0k50K04N1N4K00k9J05j57L14j10Ml13J3L35l43
$$ 568 556 553 59 33 159 -104 -352 -228 -208 -458 -254 -203 -149 51 22 127 -30 284 174 178 -135 -122 213 -130
2527a30K12j68j5K39k83k86M05j3q0K02k1J35K94m83m8R7K83k1l16j10M53l43
$$ -130 82 -86 -101 138 -145 -431 -26 -39 -119 83 62 197 491 8 -40 57 340 319 3 -107 346 3
2549Ck01l60M9M67n4j41M12K5j9l4r0K9K38k51l1k6m0j3j00L2j54J7m2n5K38K95
$$ 3 -198 -558 -509 -42 -96 -237 175 200 181 147 57 86 324 73 42 16 -24 -37 -137 -105 -259 -242 -284 -339 -101 194
2575A94J92n49J28R7K04J31o77K81K25k30J05j09p9M8k73j62K78J23j46J02j04
$$ 194 386 -163 -35 62 266 397 -280 1 226 -4 101 -8 -87 -39 -312 -474 -196 -73 -219 -117 -221
2596b21L87k46K86j7K96J03n32p5k1N7K08l39j9k88K80n7j19O2L24n9j78L62m7
$$ -221 166 -80 206 189 485 588 56 -19 -40 17 225 -114 -133 -421 -141 -198 -317 -255 69 10 -168 194 147
2619A47P1J15j32l10N00l05m26K69p7J68J51m43r5M79m63J84j88M28j31J25J27
$$ 147 218 333 201 -109 391 86 -340 -71 -148 20 171 -272 -367 112 -351 -167 -355 73 -58 67 194
2640A94l92K50J51k36o3K19L0n95J4J93L5J64j07k98K90K05L18l24J08J40J75
$$ 194 -198 52 203 -33 -96 123 153 -442 -428 -235 -200 -36 -143 -441 -151 54 372 48 156 296 471
2661D71n35K33J8m07M8j04l3K76J87m23K11Q6ok9m5r9N00k41k07K7M44q7r9j79
$$ 471 -64 169 187 -220 -172 -276 -309 -33 154 -269 -58 28 22 -7 -52 -151 349 108 -99 -72 372 285 186 7
2685GM0O3L5l52j8l29P38m12KJ37N04j19q9l90P41l91p8j31K01k6q9l11j6M22
$$ 7 47 110 145 -207 -225 -554 184 -228 -226 -89 415 296 207 -183 558 167 89 -42 159 133 44 -267 -283 139
2709A39m8k62K42j2K9j57l9K38p6M68l93j17k12K04r5P1j15K1K98j80q9j36K40
$$ 139 91 -171 71 59 88 -69 -108 130 54 522 129 12 -200 4 -91 -20 -135 -114 184 4 -85 -221 19
2732A9k21J22j20K21RP2J45n0j25J37l50j82L47j17l2k17L28K9k4q9J32J86l3
$$ 19 -202 -80 -200 21 30 102 247 197 72 209 -141 -323 24 -93 -125 -342 -14 15 -9 -98 34 220 187
2755A87Q2l2J46p5l37o9J51r5n2N0l32O2J84k18R5j9M16l2Q5j30j27L35j2k95
$$ 187 269 237 383 308 -29 -98 53 -42 -94 -44 -376 -314 -130 -348 -253 -272 144 112 197 67 -60 275 263 -32
2779c2J23L68l71q5p7j74M2J10k4j62M20k40o0J0Q3K47K6M7o4j9M7n33J33M4K34
$$ -32 91 459 88 3 -74 -248 -206 -96 -120 -282 138 -102 -162 -152 -69 178 204 251 187 168 215 -318 -185 -141 93
2804I3n2j26j0k1J48l86J61J58L78k71kK28J5k97K42j44j68K13m97L09k45n6K31
$$ 93 41 -85 -95 -116 32 -354 -193 -35 343 72 70 298 313 16 258 114 -54 159 -338 -29 -274 -330 -99
2827i9j16J09K9O5l5j39k2K34M19n60J04L78j28k72J2k13K93Mk49K94l49K11k03
$$ -99 -215 -106 -77 -12 -47 -186 -208 26 445 -115 -11 367 239 -33 -21 -234 59 63 -186 108 -241 -30 -233
2850b33N0K28L06k84j8j06j54L70j71J0k27J73J55j96j94L98j60K78n27M38p9
$$ -233 -183 45 351 67 49 -57 -211 159 -12 -2 -229 -56 99 -97 -291 107 -53 225 -302 136 57
2871E7KN4k4j8J7kJ45M9j68j26k26Q8Q5j8j45J08r5j2M93n50K08o1K57lj74K04
$$ 57 59 113 89 71 88 86 231 280 112 -14 -240 -152 -67 -85 -230 -122 -217 -229 264 -286 -78 -139 118 115 -59 145
2897A45J24j88j08K04k01K75m28K90k73N2K79k30L21m3j7N5j31R7l79O04n38k43
$$ 145 269 81 -27 177 -24 251 -177 113 -160 -108 171 -59 262 219 202 257 126 223 -156 448 -90 -333
2919c33M5K07k13J3J2Q8J50j28L17o8k1n0j44P8K10J8m75L93j62L70m01q9n2J82
$$ -333 -288 -81 -294 -281 -269 -181 -31 -159 158 90 69 19 -125 -47 163 181 -294 99 -63 307 -94 -183 -235 -53
2943e3J58m80L17k57J94J14j49J90O0r8m4k38O19l51K22l35j8J98J9k32P7j36
$$ -53 105 -375 -58 -315 -121 -7 -156 34 94 -4 -48 -286 333 -18 204 -131 -149 49 68 -164 -87 -223
2965b23J70j46M45l23J24J45l30R4K16r8n6M2J39j31R6k54N1L1o2K53l10j49K26
$$ -223 -53 -199 246 -77 47 192 -138 -44 172 74 18 60 199 68 164 -90 -39 -8 -70 183 -127 -276 -50
2988e0J34r3l0l7L9j18n7L99n8p9o1p5p8p3K18l6j11J17J23j24k0K16P4l16R2
$$ -50 84 -9 -39 -76 -37 -155 -212 187 129 50 -11 -86 -164 -237 -19 -55 -166 -49 74 -50 -70 146 220 -96 -4
3013dK39k62J6P1k31J23J68k46K74k05j0K63m98O56m30j80L73k05o3M1L06k35
$$ -4 235 -27 -11 60 -171 -48 120 -126 148 -57 -67 196 -302 354 -76 -256 117 -88 -151 -110 196 -39
3035c9j23J43j80j32K81J6j12J33J26k6m40P9L90q0K9J30nj48N4K44k48p5j08
$$ -39 -162 -19 -199 -331 -50 -34 -146 -13 113 87 -353 -274 116 36 65 195 190 42 96 340 92 17 -91
3058i1J86k79J46k15M8K12P6k87M9K29k1o0P3P2J50k9j17k62J0J30j11M6J0O8
$$ -91 95 -184 -38 -253 -205 7 83 -204 -155 74 53 -7 66 138 288 259 142 -120 -110 20 -91 -45 -35 33
3082C3j24J57j15K29K8j58mJ40j11l0L2l33L67L5l3J29l03P3J34l25L0j58L26
$$ 33 -91 66 -49 180 208 50 46 186 75 45 77 -256 111 146 113 242 -61 12 146 -179 -149 -307 19
3105A9o6P8j27L38r1R5K01k74k96K46k87K21j17J4j11p3J23k5L6P4J34n6k1j74
$$ 19 -47 31 -96 242 151 246 447 173 -123 123 -164 57 -60 -46 -157 -230 -107 -132 -96 -22 112 56 35 -139
3129a39L04J80j72L06m11k9J50l21n8K66j28l27J98j26J96j6J30J3r5OM41j58
$$ -139 165 345 173 479 68 39 189 -132 -190 76 -52 -379 -181 -307 -111 -127 3 16 -79 -73 368 210
3151B10m89rN7L02m07L75j15K4j79K38K16n09L75m15P4M87m3j02m5P2J04l42n2
$$ 210 -279 -288 -231 71 -336 39 -76 -52 -231 7 223 -286 89 -326 -252 235 192 90 45 117 221 -121 -173
3174a73K2K56R3m50J97j01p2l2k75O42j39r6k9K40k43M42j88R8j2k19j06M81l90
$$ -173 -151 105 198 -252 -55 -156 -228 -260 -535 107 -32 -128 -157 83 -160 282 94 192 180 -39 -145 336 -54
3197e4j77N30m30r9J82K03k35kJ40j75J63J84r8l3l19L39j22j71M9J00k2o3P2
$$ -54 -231 299 -131 -230 -48 155 -80 -82 58 -117 46 230 132 99 -220 119 -3 -174 -125 -25 -47 -110 -38
3220c8j11L08j92o4M58p9k64L38j83mM5J2l62L93m52K02J5k43K75j73K99j79J40
$$ -38 -149 159 -33 -97 361 282 18 356 173 169 214 226 -136 257 -195 7 22 -221 54 -119 180 1 141
3243A41k61J92k45J14j47J86J03j87L09n69L64Q1q2k2p4m6J68oj5JMo9P0J44M2
$$ 141 -120 72 -173 -59 -206 -20 83 -104 205 -364 0 81 -1 -23 -97 -143 25 19 4 5 9 -60 10 154 196
3268A96k99L40k8k97J63k83J46j48M28l22J98N9j44kk03J06J8J67m5R9L5q8P7
$$ 196 -103 237 209 -88 75 -208 -62 -210 218 -104 94 153 9 7 -196 -90 -72 95 50 149 184 96 173
3291A73j12J27j99L7J69J21j77l71p5J90J04q3l17N73k37L49Rk19p3J56k43K17
$$ 173 61 188 -11 26 195 316 139 -232 -307 -117 -13 -96 -413 160 -77 272 281 62 -11 145 -98 119
3313A19j32J14j96J57l5j54P6r9J09K55k11n7N3j6k63M93j46k82n1J88L08l51
$$ 119 -13 101 -95 62 27 -127 -51 -150 -41 214 3 -54 -1 -17 -280 213 67 -215 -266 -78 230 -121
3335a21K43m2n3k79l4K90jJ61L1j63j18j28O50k82L9K5k63j95k0k0N57j94l15
$$ -121 122 80 27 -252 -286 4 3 164 195 32 -86 -214 436 154 193 218 -45 -240 -260 -280 277 83 -232
3358b32j2K94j17j46P7J89n1r9M49o16M64j72J53j95L8j5o4j17J08J83k35J41
$$ -232 -244 50 -67 -213 -136 53 2 -97 352 -264 200 28 181 -14 24 9 -55 -172 -64 119 -116 25
3380B5J68j73L4K14j05jK5K3m83J40L63p9o4j21o2l8L38m72J46N1K80l49Lo9J42
$$ 25 193 20 54 268 163 162 187 210 -273 -133 230 151 87 -34 -96 -134 204 -268 -122 -71 209 -140 -137 -206 -64
3405f4K50j46q0J59o2j37m0j59J94j06M2n0J25m5J5L69j29l57J48l4O8K42j98
$$ -64 186 40 -40 119 57 -80 -120 -279 -85 -191 -149 -199 -74 -119 -104 265 136 -221 -73 -107 -39 203 5
3428Ej16K18J2k26M2K6k02L79j96k2LJ15J75k19p1J46k70M5m5K15J96N8n0k33
$$ 5 -111 107 119 -107 -65 -39 -241 138 -58 -80 -77 38 213 -6 -77 69 -201 -156 -201 14 210 268 218 -15
3452a5l6QR3j8k7k9K73k53p2L22l50K35r7P0J04k33K50j15n7j89R7Lk17Q6K0J18
$$ -15 -51 -43 50 32 5 -24 249 -4 -76 246 -104 131 34 104 208 -25 225 110 53 -136 -39 -36 -253 -167 -147 -29
3478b9L2j75M41j72j85M5J57k32L9n3K42l07L63k66j59J42j81L29J48k85J59j50
$$ -29 3 -172 269 97 -88 -43 114 -118 -79 -132 110 -197 166 -100 -259 -117 -298 31 179 -106 53 -97
3500i7n4L28l11kM10n76M87j86P0k9j23l05K30Q3J16ok51N34n66J24j4J78M6k2
$$ -97 -151 177 -134 -136 274 -302 185 -1 69 40 -83 -388 -158 -75 41 35 -216 318 -248 -124 -138 40 86 64
3524F4L8l1k60R7j39J70N02o55M33m89K98n6L0J43l0J2O0N6l37K90k57K3j23j11
$$ 64 102 71 -189 -92 -231 -61 441 -214 219 -270 28 -28 2 145 115 127 187 243 -94 196 -61 -38 -161 -272
3548b72M13k50R0j18K03k06K12Q1l33K27K94l89K5k00L2J55qJ27j48K73o7p4q3
$$ -272 141 -109 -19 -137 66 -140 72 153 -180 47 341 -48 -23 -223 -191 -36 -44 83 -65 208 141 67 -16
3571a6k69R3J86j23j73K11j10L03l21L24J28o0j04l4J43r5q8n3J24K42l01n4Q0
$$ -16 -285 -192 -6 -129 -302 -91 -201 102 -219 105 233 173 69 35 178 83 -5 -58 66 308 7 -47 33
3594C3l6J85%J19j52N1j67j60K18o6N6k35m7n6J23J04K77j76q4j17K44J32n25
$$ 33 -3 182 182 301 149 200 33 -127 91 25 81 -154 -201 -257 -134 -30 247 71 -13 -130 114 246 -279
3617b79L28n7N2p5K66m0j12k49K05j08j3Q4por0k65L15K81k92q1p7L37j96O9M
$$ -279 49 -8 44 -31 235 195 83 -166 39 -69 -82 2 -5 -11 -101 -366 -51 230 -62 -143 -220 117 -79 -10 -6
3642fN4J20k95K4J72j42j21J03J33j6j41L51k05R2p9m7K24o8k28l1J01k45L70
$$ -6 48 168 -127 -103 69 -73 -194 -91 42 26 -115 236 31 123 44 -3 221 153 -75 -106 -5 -250 120
3665A20k2N8l2k79L41l24P2j45K93r5j1mN5j92J31j10M79k37j10k1k60L36L01
$$ 120 98 156 124 -155 186 -138 -66 -211 82 -13 -24 -28 27 -165 -34 -144 335 98 -12 -33 -293 43 344
3688C44m71RJ47q9J62j61L18k97K76j68q8k82M02l31L08j78Q5j50M3J83K73n08
$$ 344 -127 -118 29 -60 102 -59 259 -38 238 70 -18 -300 102 -229 79 -99 -14 -164 -121 62 335 -173
3710a73K77j76J8Q5p6m2J99m30L86PQ9k54K34m66J63L61l67K75q5j57M58j24l12
$$ -173 104 -72 -54 31 -45 -87 112 -318 68 75 164 -90 144 -322 -159 202 -165 110 25 -132 326 202 -110
3733a10O0K63r0j42l4L45j38k04J5P2m8j9j55K27j27K03j79K60k07K62l84j75
$$ -110 -50 213 123 -19 -53 292 154 -50 -35 37 -11 -30 -185 42 -85 118 -61 199 -8 254 -130 -305
3755c05JL13p3o7K00L5j64J21P4j80L24n18J11K0N10n76J24M7N9j90rJ5L8P7j4
$$ -305 -304 9 -64 -131 69 104 -60 61 135 -45 279 -239 -128 -108 402 -174 -50 -3 56 -134 -143 -128 -90 -13 -27
3780b7P9J51m5K11n16J69k08J93P0J47l27J62J21j11J52j95J08j06j51L0J21J7
$$ -27 52 203 158 369 -147 22 -186 7 77 224 -103 59 180 69 221 26 134 28 -123 -93 28 45
3802D5l12M32m6r0M1r3l68L54L2J08l58K32j98j87L26P5L8k10O1j38K01J58J40
$$ 45 -267 165 119 29 70 -23 -391 -37 -5 103 -255 -23 -221 -408 -82 -7 31 -179 -118 -256 -55 103 243
3825B43j02m72J84K65r6k38M16k63J5p5K07j99o5K40k00o7K22J13k07J25Q2J16
$$ 243 141 -331 -147 118 22 -216 200 -63 -48 -123 84 -115 -180 60 -140 -207 15 128 -79 46 128 244
3847B44k59Rj48L15l17K57j99j43N11l2l52J10K76l05L39l10l9j6j9M0n7J90j80
$$ 244 -15 -6 -154 161 -156 101 -98 -241 270 238 -114 -4 272 -33 306 -4 -43 -59 -78 -38 -95 95 -85
3870h5l6Oj85M23Q4l25L83l94K36k65K08j83K7PR7J00Q1r6o1j69M03k59j22J89
$$ -85 -121 -115 -300 123 207 -118 265 -129 107 -158 50 -133 -106 -99 -2 98 179 83 22 -147 256 -3 -125 64
3894F4p8M9j21J72m59M98k70k2LP9L30j60j30rJ82Q4N9k75j6q2J68j36r6J1J78
$$ 64 -14 35 -86 86 -373 125 -145 -167 -164 -85 245 85 -45 -54 128 212 271 -4 -20 -102 66 -70 -166 -155 23
3919B3O8j4J85q8k16R7n3j36J10J07Qk26J09o6J49Q1k06M3q4M1J40J05m4l41p7
$$ 23 91 77 262 174 -42 55 2 -134 -24 83 91 -135 -26 -92 57 138 -68 -25 -109 -68 72 177 133 -208 -285
3944b85K27J30q1J62l60o4N20j38m8j41K29k24j5M1M06o32M06l07mL20j71j92
$$ -285 -58 72 -9 153 -207 -271 249 111 63 -78 151 -73 -88 -47 359 -273 133 -174 -178 142 -29 -221
3966b21L14j51K76l1k91J42K35j83j30p4M5J85j83J77r3j51Q3k40J80O3K13m42
$$ -221 93 -58 218 187 -104 38 273 90 -40 -114 -69 116 -67 110 17 -134 -51 -291 -111 -48 165 -277
3988b77K98k36Q7L85j15l25J28J06rol56K46kp9P3K6K17k98k9K50j09J52N0l01
$$ -277 21 -215 -128 257 142 -183 -55 51 42 36 -320 -74 -76 -155 -82 -56 161 -137 -166 84 -25 127 177 -124
4012a24K44N4k36P5o9L53k29k63J98K31l10K19l39L41J09j24lk39M06l54R1K53
$$ -124 120 174 -62 13 -56 297 68 -195 3 234 -76 143 -196 145 254 130 127 -112 294 -60 31 284
4034B84k88K51m36K22n7K25m06J01K43Qo1k05K25K2k1J30j93k59J71o6J24nl09
$$ 284 -4 247 -189 33 -24 201 -205 -104 139 147 86 -119 106 128 107 237 44 -215 -44 -110 14 9 -300
4057c00J05J01lK7o0J80J16j62K27p3k7j27Q3j29j89L84k29J54j09J2j16K9J90
$$ -300 -195 -94 -97 -70 -130 50 166 4 231 158 131 4 87 -42 -231 153 -76 78 -31 -19 -135 -106 84
4080H4N0k14j31N82k82N7L9R6o08K52m4L01k79J12qK14j80m4K0n3o0PJ70j6j41
$$ 84 134 -80 -211 371 89 146 185 281 -327 -75 -119 182 -97 15 7 221 41 -3 17 -36 -96 -89 81 65 -76
4105g6K0j70L47Mj94Q2Q9l9k4%k04P1q5L06k40K76L3k38P1m0K69l28R5J76j61
$$ -76 -56 -226 121 125 -69 13 102 63 39 39 -165 -94 -179 127 -113 163 196 -42 29 -11 258 -70 25 201 40
4130D0L1m6K8J9P8k67JJ11J88k6j05K02k8j37j35m2J17J80j03p0J09j11j19j90
$$ 40 71 25 53 72 150 -117 -116 -5 183 157 52 254 226 89 -46 -88 29 209 106 36 145 34 -85 -275
4154b75O5L07P4j34N5k1l6r3J71j53J23k45J66J58l8o0J18k58p5K89j53Q2k4j44
$$ -275 -210 97 171 37 92 71 35 -58 113 -40 83 -162 4 162 124 64 182 -76 -151 138 -15 67 43 -101
4178a01L47p9l00M5Q8L3j63K12k50M82l51J88Lj53J45r6R8j42j83n8K66J29l73
$$ -101 246 167 -133 -88 0 33 -130 82 -168 314 -37 151 154 1 146 50 148 6 -177 -235 31 160 -213
4201b13L4M3N8P2o0L15m56K61l6j2J26%j6L5j25J40l39J87J39k27K14k56M07k13
$$ -213 -179 -136 -78 -6 -66 249 -207 54 18 6 132 132 116 151 26 166 -173 14 153 -74 140 -116 291 78
4225G8l81OK90L20p5k08j94j94J26K03J76L2j73nk40J32K61J06j81R7j20N2l6
$$ 78 -303 -297 -7 313 238 30 -164 -358 -232 -29 147 179 6 1 -239 -107 154 260 79 176 56 108 72
4248G2Jq7L83l38l76K15K12Q5l41L5q3L17k80K94K0J16m08M65J7k65k80J34L6
$$ 72 73 -14 369 31 -345 -130 82 167 -174 -139 -222 95 -185 109 129 245 -163 302 319 54 -226 -92 -56
4271e6N2K0k83K92L9J09l07M4m2L61J87o03L17l77L41m1j30q5O1K75J41l99J52
$$ -56 -4 16 -267 25 64 173 -134 -90 -132 229 416 -187 130 -247 94 53 -77 -162 -101 174 315 -84 68
4294F8k46N31n33L56k83K80N3k56J36l05L20J85n6j08J39o63N13k84M69l20J71
$$ 68 -178 353 -180 176 -107 173 226 -30 106 -199 121 306 250 142 281 -382 131 -153 316 -4 167
4315A67n0j29J03Nj61j5K23p3k84J45P5n0O1n1O4j77K73Ql68J69R3J41k17o4K11
$$ 167 117 -12 91 96 -65 -80 143 70 -214 -69 6 -44 17 -34 30 -147 126 134 -234 -65 28 169 -48 -112 99
4340I9k82K70K42j73J68j29L5l16K48k01J17l04K83n8OP2k77L37k50J68k29J48
$$ 99 -183 87 329 156 324 195 230 -86 162 -39 78 -226 57 -1 5 77 -200 137 -113 55 -174 -26
4362b6L7Q4q0J28l13K70r3j36L7L50m32P2J34P2jJ1j40r3J09n0jN19l73j2K0L4
$$ -26 11 95 15 143 -170 100 7 -129 -92 258 -174 -102 32 104 103 114 -26 -119 -10 -60 -61 458 85 73 93 127
4388A27J60l68k0R1k84L50l9M8m4p6K03j34l15N04m37J50k0Q2l39n0N14j59J0
$$ 127 287 -81 -101 -10 -294 56 17 65 21 -55 148 14 -301 203 -234 -84 -104 -22 -361 -411 103 -56 -46
4411d6l5L38j6m55J53n6J10j51K58j80J57j57J44j27K24j87j07J27q2L7K1J98
$$ -46 -81 257 241 -214 -61 -117 -7 -158 100 -80 77 -80 64 -63 161 -26 -133 -6 -88 -51 -30 168
4433A68k42K09K21l88J65k85K26m2n3N5L04m06L15k21O9K5j41j6Q1J44Q4k18j07
$$ 168 -74 135 356 -32 133 -152 74 32 -21 34 338 -68 247 26 95 120 -21 -37 44 188 272 54 -53
4456e3M21j60k09L16k26j67J01J11k77J75j26PN6q3M25l50O3r1J32L4p2O0l79
$$ -53 368 208 -1 315 89 -78 23 134 -143 32 -94 -87 -31 -114 311 -39 24 -67 65 99 27 87 -292
4479b92K32OK03j64K19m96J33K18j53J68J46j05k01Q9L1l36L47K16k35j12K51
$$ -292 -60 -54 149 -15 204 -292 -159 59 -94 74 220 115 -86 3 34 -302 45 261 26 -86 165
4500A65j09l40L53k16J47k13m1J05J3K29k13N60o42K21K2L8K9j91J66j98J94p1
$$ 165 56 -284 69 -147 0 -213 -254 -149 -136 93 -120 440 -202 19 41 79 108 -83 83 -115 79 8
4522Hl33M12K05l27J04l69N36m2k96L52k09J92k99n8L8K32j99n3J81j42J41l69
$$ 8 -325 87 292 -35 69 -300 236 194 -102 250 41 233 -66 -124 -86 146 -53 -106 75 -67 74 -295
4544b95M03k66L2J15r4K9K89j99r5pJ97m6L5k9k9Pj82R5M2l03K91r2k59M35r9
$$ -295 108 -158 -126 -11 -105 -76 213 14 -81 -88 109 63 98 69 40 47 -135 -40 2 -301 -10 -102 -361 74 -25
4569b5L61l74l16L73j07j23r0J66k3K51L7o24L22K28k70R4O10l93k4o0n4m0K44
$$ -25 336 -38 -354 19 -88 -211 -301 -135 -158 93 130 -494 -172 56 -214 -120 490 97 73 13 -41 -81 163
4592A63o5J91j4lm12k8Q5L0J34l37M78j82J50j66J85m25K11K7o1k7P1q7L4m5K73
$$ 163 98 289 275 272 -140 -168 -83 -53 81 -256 222 40 190 24 209 -216 -5 22 -39 -66 5 -82 -48 -93 180
4617A80k53o3K39j82J41k78k3K1Q4K37O2j83o2J37j68J92j4j63n7K06o0j04j03
$$ 180 -73 -136 103 -79 62 -216 -239 -218 -134 103 165 -18 -80 57 -111 81 67 -96 -153 53 -7 -111 -214
4640b14J08K27l9L5N0r9m69L97o0rj07O8K0K25k07j37J50K9k0OJ89k51O2m5J03
$$ -214 -106 121 82 117 167 68 -401 -4 -64 -73 -180 -112 -92 133 -74 -211 -61 -32 -52 -46 143 -108 -46 -91 12
4665A2L0K43k46k98J46L4lK93l72J55J08k36J20J72k57J67o6o0J2R2n2j58J61
$$ 12 42 285 39 -259 -113 -79 -82 211 -161 -6 102 -134 -14 158 -99 68 2 -58 -46 46 -6 -164 -3
4688cj77N3K87k21J33J00l30J36j57L73M5k13J25J49n77N52k31j17K09q3j63K54
$$ -3 -180 -127 160 -61 72 172 -158 -22 -179 194 239 26 151 300 -277 275 44 -73 136 53 -110 144
4710A44ml50K23j98M86j83j97j29R9n4j2l6K63j64L06k57P7n5n6q3N4j61j31L98
$$ 144 140 -210 13 -185 301 118 -79 -208 -109 -163 -175 -211 52 -112 194 -63 14 -41 -97 -180 -126 -287 -418 -20
4734b0r7N31o22J05j9K85j62j11R8L65m36N1P5q8J18k11R0m1q5j53K25k0M54l84
$$ -20 -117 414 -208 -103 -122 163 1 -110 -12 353 -83 -32 43 -45 73 -138 -48 -89 -174 -327 -102 -122 332 -52
4758e2Q9K50l03L60m49j00M12j60k56N10l14Mk49K81J37j30k9Q0k0N9j63k5L48
$$ -52 37 287 -16 344 -105 -205 207 47 -209 301 -13 -9 -258 23 160 30 1 81 61 120 -43 -68 280
4781B80n88L02k4K86k36J47m10R6K9K21J8l57l4L11k24K51n1k36N0m6K61j00k54
$$ 280 -308 -6 -30 256 20 167 -243 -147 -118 103 121 -236 -270 41 -183 68 17 -219 -169 -215 46 -54 -308
4804c08N12j99R5l4q3j23J24j13j73R9L24j63m9L18m97K98M3l54L24j54J86L7
$$ -308 204 5 100 66 -17 -140 -16 -129 -302 -203 121 -42 -91 227 -270 28 71 -283 41 -113 73 110
4826A10K2l82K16J48l01L83j02J03l48K31l20L56P5l02K03j55J30k5j25K93m84
$$ 110 132 -250 -34 114 -187 196 94 197 -151 80 -240 116 191 -111 92 -63 67 42 -83 210 -274
4847b74L31o3p3J93J54m05j9L51j33Q2j85PM7Qj14L19k79j42J21J56o1k60L43
$$ -274 57 -6 -79 114 268 -137 -156 195 62 144 -41 -34 13 21 -93 226 -53 -195 -74 82 21 -239 104
4870A04O6j74k2Q3j96L23j91J58K5l8n1n8k78N76m28K07o8r1q1J38O3r5j77J72
$$ 104 170 -4 -26 57 -139 184 -7 151 176 138 87 29 -249 327 -101 106 38 -53 -134 4 67 -28 -205 -33
4894c3q8K87j31m7L12j51l47L38k18J05l36K19J82j18J33k84L52l01K83n01J14
$$ -33 -121 166 35 -12 300 149 -198 140 -78 27 -309 -90 92 -26 107 -177 175 -126 157 -344 -230
4915b30J96q8L29J6O3l51JL46j75l45j46L70j14K47j16J18K6R6l34K0o2o4L58
$$ -230 -34 -122 207 223 286 -65 -64 282 107 -238 -384 -14 -128 119 3 121 147 243 -91 -71 -133 -197 161
4938A61Jl29Q3P1R6n0o0J11j09j24q3K07k56K83m7P4j70P5M7j70J45k8j99J81
$$ 161 162 -167 -84 -13 83 33 -27 84 -25 -149 -232 -25 -281 2 -45 29 -141 -66 -19 -189 -44 -72 -271 -90
4962i0K3R5j6J2Q7k33J51k2J13l06J84j22L00r6j77o9L39m92R7K10J02m48J37
$$ -90 -67 28 12 24 111 -122 29 7 120 -186 -2 -124 176 80 -97 -166 173 -319 -222 -12 90 -358 -221
4985b21P4K11m09Q5N36n99N86k67M4J70k69K96n09N2L76l09P3K98j88M58p21L22
$$ -221 -147 64 -345 -260 276 -323 263 -4 40 210 -59 237 -272 -220 156 -153 -80 218 30 488 -233 89
5007H9j42J15j06K9J17K17l77j17L35j27k6j81m7J49J28M0j56j91L31k30J64P0
$$ 89 -53 62 -44 -15 102 319 -58 -175 160 33 7 -174 -221 -72 56 96 -60 -251 80 -150 14 84
5029H4j46j74M32k73J56j42N2J08p1m5OR8Q5l74J68n4j11L12k15L59k41p0l3J17
$$ 84 -62 -236 196 -77 79 -63 -11 97 26 -19 -13 85 170 -204 -36 -90 -201 111 -104 255 14 -56 -89 28
5053B8j6O5k66j6K02j92K76l44L51k05NK29k50J28L1K11n30J20N8J57J12J63o15
$$ 28 12 77 -189 -205 -3 -195 81 -263 88 -117 -112 117 -133 -5 26 237 -293 -173 -115 42 154 317 -298
5076b98M04n5m6l%j63M7J8j32N2L45m30L35p1l3m4JO3j33L00n60Q2M26jk39J5
$$ -298 106 51 5 2 2 -161 -114 -96 -228 -176 169 -261 74 3 -30 -74 -73 -10 -143 157 -403 -321 105 104 -135 -120
5102a20J71k74l1Q7L79k1l09j12J47j40K37k8J7L2j05K98k79J31r2J7J16o6k75
$$ -120 51 -223 -254 -167 212 191 -118 -230 -83 -223 14 -14 3 35 -70 228 -51 80 -12 5 121 55 -220
5125b20J17m1O8J15k96L41j6l73N11l53P4J45j42L8n1Q3q2K8J11J39j59K33n2
$$ -220 -103 -144 -76 39 -257 84 68 -305 206 -147 -73 72 -70 -32 -83 0 -82 -54 57 196 37 270 218
5148B18k83K45k59J44n1J71j39j54P0O9K14k47J3L55l04J1M4K38l41L45m76k9
$$ 218 -65 180 -79 65 14 185 46 -108 -38 31 245 -2 11 366 62 73 117 355 14 359 -117 -146
5170a46M7j11K09j33N11l06j93J00LJ42m4K36j32L4j86k94J15Q5n9O2J06Pj32
$$ -146 -99 -210 -1 -134 377 71 -122 -22 -19 123 79 315 183 217 31 -263 -148 -63 -122 -60 46 53 -79
5193g9K18n4k80K54j69J50J67l59K15J58m50N56k75m9P8j48q3K98n0J25j76J27
$$ -79 139 85 -195 59 -110 40 207 -152 63 221 -229 327 52 3 81 -67 -150 148 98 223 47 174
5215A74l72K77n8j38J63M6k75O6J97j82k19J46K02m5O1j91O0J36k78J36K39m7
$$ 174 -198 79 21 -117 46 92 -183 -117 80 -102 -321 -175 27 -18 43 -148 -88 48 -230 -94 145 98
5237I8j80K85n1j01j57Mj2K91j7k57N0J06Pl15K59r5L7k6K42kj00r1O7j14J48
$$ 98 -82 203 152 51 -106 -102 -114 177 160 -97 -47 59 66 -249 10 -85 -48 -74 168 166 66 -25 42 -72 76
5262G6J13k1k53L71j45J30j60Q6j39j09m8J48j61K2J48Kl0J29m9j15J83k62k30
$$ 76 189 168 -85 286 141 271 111 197 58 -51 -99 49 -112 -90 58 60 30 159 110 -5 178 -84 -314
5285c14N33l48J2J75r2%k3J47p5J21lj02l73J89J1P2k33P9M72j64q2O1p8Oj8o8
$$ -314 219 -129 -117 58 -34 -34 -57 90 15 136 133 31 -342 -153 -142 -70 -303 -224 248 84 2 63 -15 -9 -27 -95
5311i5K96k66K73j86n1J00J2l8M6n2k20Kp9L68j45q4R0J8N7j11k48K78J15n3j03
$$ -95 201 -65 208 22 -29 71 83 45 91 39 -181 -179 -258 110 -35 -119 -29 -11 46 -65 -313 -35 80 27 -76
5336g6Q3R4l65J70J00k47M29j73k8K7r1K15j11K71m67j3K32J8o6M5J16k30m0R8
$$ -76 7 101 -264 -94 6 -241 188 15 -13 14 -77 138 27 298 -169 -182 50 68 2 47 163 -67 -107 -9
5360ir3P7J22m38J66M5N4R2J80m48P5L25j18nJ64Pj00pk85K13J42l1J4j39M4k
$$ -9 -102 -25 97 -341 -175 -130 -76 16 196 -252 -177 148 30 25 189 196 96 89 -196 17 159 128 142 3 47 45
5386D5L8j57l80M33q6J17O0N2p4j16J44l0K76p1k76k8p4J11J26k0k72K29j45J17
$$ 45 83 -74 -454 -21 -107 10 70 122 48 -68 76 46 322 251 -25 -53 -127 -16 110 90 -182 47 -98 19
5410A9j00J61k0l42K61k09R9J60J29l47L81l78K61n4j53J12L41k2k06J58m40J33
$$ 19 -81 80 60 -282 -21 -230 -131 29 158 -189 192 -186 75 21 -132 -20 321 299 93 251 -189 -56
5432e6P3R2k70J62l17K27K16j02O3m5m1J37k02j11J40m8j78M29p3k33L2J86j10
$$ -56 17 109 -161 1 -316 -89 127 25 88 43 2 139 -63 -174 -34 -82 -260 169 96 -137 -105 81 -29
5455b9j8J57Pj26J8j47K01m3l1j07J04m9j69K09J13P1k9k2M2j71k5j6j30K35l3
$$ -29 -47 110 117 -9 9 -138 63 20 -11 -118 -14 -63 -232 -23 90 161 132 110 152 -19 -44 -60 -190 45 12
5480A2J15J9l23L39l49R6K18k27K9J5L30l72J46L1j40j1k04L12J23j48k93N17
$$ 12 127 146 -177 162 -187 -91 127 -100 -71 -56 274 -98 48 79 -61 -72 -276 36 159 11 -282 235
5502B35l7l83M41k88m3l77L78N2O8J12l16P1k52K78L17k03J59m51J87j10J27L4
$$ 235 198 -185 256 -32 -75 -452 -74 -22 46 158 -158 -87 -339 -61 256 53 212 -239 -52 -162 -35 -1
5524aJ05k49J1J85L98m96L76k59l15K23l22N12j39K84m14N9j25P0J35J63j45r2
$$ -1 104 -145 -134 51 449 -47 329 70 -245 -22 -344 168 29 313 -101 -42 -167 -97 38 201 56 -36
5546c6J00J36k28L68l20q8p6l6M45k08k78M20j00l39K55o1K56j6k99M75l28j75
$$ -36 64 200 -28 340 20 -68 -144 -180 265 57 -221 199 99 -240 15 -46 210 194 -105 370 42 -133
5568a33K22k4k03n4L72k14R4l99L92K18k80M6l96K04K49k93l2J34K11k76K26o2
$$ -133 89 65 -138 -192 180 -34 60 -339 53 271 -9 37 -359 -155 94 -199 -231 -97 114 -162 64 2
5590Bj80o2n0O28m01K30q0M6k43K3K38k87J24K7J45j63j75Q6L46k44k5Pj89L93
$$ 2 -178 -240 -290 338 -63 167 87 133 -110 -87 151 -136 -12 15 160 -3 -178 -92 254 10 -15 -8 -197 196
5614A96k99M19l35O4j85K72O3l64J40N6l6l8N0j89J70J10j09p7N9J49j31P4l1
$$ 196 -103 316 -19 45 -140 132 195 -169 -29 27 -9 -47 3 -186 -16 94 -15 -92 -33 116 -15 59 28
5637B8K4P0Jk98K09j57m6N02n07K25J07k3p6R5j54l3j64K62J29j37J24Nj15k9
$$ 28 52 122 123 -175 34 -123 -169 333 -174 51 158 135 59 154 0 -33 -197 65 194 57 181 186 71 42
5661D2j09K08j51J96J6m46M85l25O5K41l71J05q5K06J36j7q0j22j56L40k15R5
$$ 42 -67 141 -10 186 202 -244 241 -84 -19 222 -149 -44 -129 77 213 196 116 -6 -162 178 -37 58
5683E8m5K8K42n43K94p0j39K94j05NJ9J09n65J78K75j43j60M54k12r3J08Q6Rj30
$$ 58 13 41 283 -260 34 -36 -175 119 14 19 38 147 -418 -240 35 -108 -268 186 -26 -119 -11 75 84 -46
5707d6k5K1J75l89L59k96L04R3k68j2k8q6J96K0J22k19J72r4p2K4Q4J1k33J13
$$ -46 -71 -50 125 -264 95 -201 103 196 -72 -84 -112 -198 -2 18 140 -79 93 -1 -73 -49 35 46 -187 -74
5731g4j4K93m60K67o7j19J18j16M90l64J88n6L8l07K15k07qK53m5J8k14K89Ml77
$$ -74 -88 205 -255 12 -55 -174 -56 -172 318 -46 142 86 124 -183 32 -175 -183 70 25 43 -171 118 122 -255
5755b55J76J91k39K34j51L22q9k46N2j91K80r8j04j07J8K23j33K22n1r2Q8j53
$$ -255 -79 112 -127 107 -44 278 189 -57 -5 -196 84 -14 -118 -225 -207 16 -117 105 54 -38 50 -103
$$ [...]
8191B4
##END NTUPLES=NMR FID
##END=
