##TITLE=1H_DE-55_NaOH
 D2O
 64 sc, 
 28.6.2024
##JCAMPDX= 6.0         $$ Bruker NMR JCAMP-DX V2.0
##DATA TYPE= NMR FID
##DATA CLASS= NTUPLES
##ORIGIN= UXNMR, Bruker Analytische Messtechnik GmbH
##OWNER= root
$$ XWIN-NMR		Version 3.5
$$ Fri Jun 28 16:18:45 2024 Russian Standard Time (UT+4h)  she@DPX200
##.OBSERVE FREQUENCY= 200.1313
##.OBSERVE NUCLEUS= ^1H
##.DELAY= (6, 6)
##.ACQUISITION MODE= SIMULTANEOUS
##.ACQUISITION SCHEME= undefined
##.AVERAGES= 64
##.DIGITISER RES= 18
##SPECTROMETER/DATA SYSTEM= spect
##.PULSE SEQUENCE= zg30
##.SOLVENT NAME= D2O
##.SHIFT REFERENCE= (INTERNAL, D2O, 0, 15.7039)
##AUDIT TRAIL= $$ (NUMBER, WHEN, WHO, WHERE, WHAT)
$$ ##TITLE= Audit trail, XWIN-NMR		Version 3.5
$$ ##JCAMPDX= 5.01
$$ ##ORIGIN= Bruker BioSpin GmbH
$$ ##OWNER= she
$$ F:/spectra/data/she/nmr/H-F/1/audita.txt
$$ ##AUDIT TRAIL=  $$ (NUMBER, WHEN, WHO, WHERE, WHAT)
(   1,<2024-06-28 16:16:30.06 +0400>,<she>,<DPX200>,
      <continue with go, POWCHK disabled, PULCHK disabled
       configuration hash MD5:
       00 E9 B6 7A A2 85 ED C7 34 08 36 98 17 FE 4E 26
       data hash MD5: 16K
       19 BF 7C 27 16 20 D9 17 2A 7E 65 9D B7 C2 5A 8B>)
$$ ##END=
$$ 
$$ hash MD5
$$ 6A 8B 65 EF 6E 0F 58 41 9F 77 54 CC 68 F0 D7 F2
##$RELAX= 
##$RELAX= 
##$RELAX= 
##$RELAX= 
##$RELAX= 
##$RELAX= 
$$ Bruker specific parameters
$$ --------------------------
##$DU= <F:/spectra>
##$EXPNO= 1
##$NAME= <H-F>
##$PROCNO= 1
##$TYPE= <nmr>
##$USER= <she>
##$AMP= (0..31)
100 100 100 100 100 100 100 100 100 100 100 100 100 100 100 100 100 100 
100 100 100 100 100 100 100 100 100 100 100 100 100 100 
##$AQSEQ= 0
##$AQ_mod= 1
##$AUNM= <au_zg>
##$AUTOPOS= <>
##$BF1= 200.13
##$BF2= 200.13
##$BF3= 200.13
##$BF4= 200.13
##$BF5= 200.13
##$BF6= 200.13
##$BF7= 200.13
##$BF8= 200.13
##$BYTORDA= 1
##$CFDGTYP= 0
##$CFRGTYP= 5
##$CHEMSTR= <none>
##$CNST= (0..31)
1 1 145 1 1 1 1 1 1 1 1 1 1 1 1 1 1 1 1 1 1 1 1 1 1 1 1 1 1 1 1 1 
##$CPDPRG= <>
##$CPDPRG1= <>
##$CPDPRG2= <>
##$CPDPRG3= <>
##$CPDPRG4= <mlev>
##$CPDPRG5= <mlev>
##$CPDPRG6= <mlev>
##$CPDPRG7= <mlev>
##$CPDPRG8= <mlev>
##$CPDPRGB= <>
##$CPDPRGT= <>
##$D= (0..31)
0 1.2 0 0 0 0 0 0 0 0.06 0 0.03 0 0 0 0 0.0002 0 0 0 0 0 0 0 0 0 0 0 0 
0 0 0 
##$DATE= 1719576763
##$DBL= (0..7)
120 120 120 120 120 120 120 120 
##$DBP= (0..7)
150 150 150 150 150 150 150 150 
##$DBP07= 0
##$DBPNAM0= <>
##$DBPNAM1= <>
##$DBPNAM2= <>
##$DBPNAM3= <>
##$DBPNAM4= <>
##$DBPNAM5= <>
##$DBPNAM6= <>
##$DBPNAM7= <>
##$DBPOAL= (0..7)
0.5 0.5 0.5 0.5 0.5 0.5 0.5 0.5 
##$DBPOFFS= (0..7)
0 0 0 0 0 0 0 0 
##$DE= 6
##$DECBNUC= <off>
##$DECIM= 32
##$DECNUC= <off>
##$DECSTAT= 4
##$DIGMOD= 1
##$DIGTYP= 9
##$DL= (0..7)
0 120 120 120 120 120 120 120 
##$DP= (0..7)
150 150 150 150 150 150 150 150 
##$DP07= 0
##$DPNAME0= <>
##$DPNAME1= <>
##$DPNAME2= <>
##$DPNAME3= <>
##$DPNAME4= <>
##$DPNAME5= <>
##$DPNAME6= <>
##$DPNAME7= <>
##$DPOAL= (0..7)
0.5 0.5 0.5 0.5 0.5 0.5 0.5 0.5 
##$DPOFFS= (0..7)
0 0 0 0 0 0 0 0 
##$DQDMODE= 0
##$DR= 18
##$DS= 0
##$DSLIST= <SSSSSSSSSSSSSSS>
$$ [...]
##$SUBNAM2= <"">
##$SUBNAM3= <"">
##$SUBNAM4= <"">
##$SUBNAM5= <"">
##$SUBNAM6= <"">
##$SUBNAM7= <"">
##$SUBNAM8= <"">
##$SUBNAM9= <"">
##$SW= 18.0517328524113
##$SWIBOX= (0..15)
0 0 2 0 0 0 0 0 0 0 0 0 0 0 0 0 
##$SW_h= 3612.71676300578
##$TD= 16384
##$TD0= 1
##$TE= 0
##$TE2= 300
##$TE3= 300
##$TEG= 300
##$TL= (0..7)
0 120 120 120 120 120 120 120 
##$TP= (0..7)
150 150 150 150 150 150 150 150 
##$TP07= 0
##$TPNAME0= <>
##$TPNAME1= <>
##$TPNAME2= <>
##$TPNAME3= <>
##$TPNAME4= <>
##$TPNAME5= <>
##$TPNAME6= <>
##$TPNAME7= <>
##$TPOAL= (0..7)
0.5 0.5 0.5 0.5 0.5 0.5 0.5 0.5 
##$TPOFFS= (0..7)
0 0 0 0 0 0 0 0 
##$TUNHIN= 0
##$TUNHOUT= 0
##$TUNXOUT= 0
##$USERA1= <user>
##$USERA2= <user>
##$USERA3= <user>
##$USERA4= <user>
##$USERA5= <user>
##$V9= 5
##$VALIST= <valist>
##$VCLIST= <CCCCCCCCCCCCCCC>
##$VD= 0
##$VDLIST= <DDDDDDDDDDDDDDD>
##$VPLIST= <PPPPPPPPPPPPPPP>
##$VTLIST= <TTTTTTTTTTTTTTT>
##$WBST= 1024
##$WBSW= 4
##$XGAIN= (0..3)
0 0 0 0 
##$XL= 0
##$YL= 0
##$YMAX_a= 942168
##$YMIN_a= -988225
##$ZGOPTNS= <>
##$ZL1= 120
##$ZL2= 120
##$ZL3= 120
##$ZL4= 120
##$ABSF1= 10
##$ABSF2= 0
##$ABSG= 5
##$ABSL= 3
##$ALPHA= 0
##$AQORDER= 0
##$ASSFAC= 0
##$ASSFACI= 0
##$ASSFACX= 0
##$ASSWID= 0
##$AUNMP= <proc_1d>
##$AZFE= 0.1
##$AZFW= 0.1
##$BCFW= 1
##$BC_mod= 2
##$BYTORDP= 1
##$COROFFS= 0
##$CY= 11.3945322036743
##$DATMOD= 1
##$DC= 2
##$DFILT= <>
##$DTYPP= 0
##$F1P= 15.6554695791079
##$F2P= 12.8336369535428
##$FCOR= 0.5
##$FTSIZE= 0
##$FT_mod= 4
##$GAMMA= 1
##$GB= 0.15
##$INTBC= 1
##$INTSCL= 1
##$ISEN= 128
##$LB= 0.24
##$LEV0= 0
##$LPBIN= 0
##$MAXI= 10000
##$MC2= 0
##$MEAN= 0
##$ME_mod= 0
##$MI= 1.114404
##$NCOEF= 0
##$NC_proc= 0
##$NLEV= 6
##$NOISF1= 3.799351
##$NOISF2= 2.8
##$NSP= 1
##$NTH_PI= 0
##$NZP= 0
##$OFFSET= 15.70392
##$PC= 1
##$PHC0= -25326.23
##$PHC1= 20.58748
##$PH_mod= 1
##$PKNL= yes
##$PPARMOD= 0
##$PSCAL= 0
##$PSIGN= 0
##$REVERSE= no
##$SF= 200.130013532006
##$SI= 16384
##$SIGF1= 3
##$SIGF2= 2
##$SINO= 400
##$SIOLD= 16384
##$SREGLST= <1H.CDCl3>
##$SSB= 0
##$STSI= 0
##$STSR= 0
##$SW_p= 3612.71676300578
##$SYMM= 0
##$S_DEV= 0
##$TDeff= 0
##$TDoff= 0
##$TI= <>
##$TILT= no
##$TM1= 0
##$TM2= 0
##$TOPLEV= 0
##$USERP1= <user>
##$USERP2= <user>
##$USERP3= <user>
##$USERP4= <user>
##$USERP5= <user>
##$WDW= 1
##$XDIM= 8192
##$YMAX_p= 0
##$YMIN_p= 0
$$ End of Bruker specific parameters
$$ ---------------------------------
##NTUPLES= NMR FID
##VAR_NAME=  TIME,          FID/REAL,        FID/IMAG
##SYMBOL=    X,             R,               I
##VAR_TYPE=  INDEPENDENT,   DEPENDENT,       DEPENDENT
##VAR_FORM=  AFFN,          ASDF,            ASDF
##VAR_DIM=   8192,          8192,            8192
##UNITS=     SECONDS,       ARBITRARY UNITS, ARBITRARY UNITS
##FACTOR=    0.0002768,     1,               1
##FIRST=     0,             0,               0
##LAST=      2.2672688,     0,               0
##MIN=       0,             -988225,         0
##MAX=       2.2672688,     942168,          0
$$ Real data points
##PAGE= N=1
##DATA TABLE= (X++(R..R)), XYDATA
0@%%%%%%%%%%%%%%%%%%O3j27J28j28J28j28J31j94K55k56L05l69L97m56N19n83
34c15O67p50Q40r40J057j179J314j461J613j792J976k174K411k658K928l229L556
51A864l916M315m765N269n837O478p210Q072r083J0294j1783J3655j6105J9450
65A0698k4330L2107m6547Q2469l48969o93653P8268J45392M11783O62967N12624
76H22809R3264j00149m16852n95898m59186k12197M1304M35998N56018M11287
86E76398K46698k5255m09471n09869m16694k72941J9870L47121M65503M58632
96D79992K90159k5531k84709m14159m63132k90382K0718K38706L83378M52146
106C87186K88549J4971k05151l91765m40348k77717o5652J66508L89542M16713
$$ plain form
0 0 0 0 0 0 0 0 0 0 0 0 0 0 0 0 0 0 0 0 63 -64 64 -64 64 -64 67 -127 128 -128 177 -192 205 -251 268 -315
34 -315 352 -398 442 -498 559 -620 694 -767 846 -946 1030 -1144 1267 -1391 1537 -1692 1864
51 1864 -2052 2263 -2502 2767 -3070 3408 -3802 4270 -4813 5481 -6302 7353 -8752 10698
65 10698 -13632 18475 -28072 54397 -294572 -988225 -909957 -764565 -352782 310185 822809
76 822809 916073 815924 399072 -196826 -656012 -868209 -826905 -390907 165111 576398
86 576398 823096 797841 388370 -121499 -538193 -811134 -791264 -444143 21360 479992
96 479992 770151 744620 459911 45752 -417380 -707762 -687044 -448338 -64960 387186
106 387186 675735 690706 485555 93790 -346558 -624275 -689927 -523419 -133877 282836
116B82836K67018R8907j31111l68013l96839k69580j14470J19985L41374L77892
126B07999K92263J34184j11991l05562l57326l12852j53797R1723K72862L37918
136I5421L12938J59646o8160k45963l29645l11929j63496M2094K18536L28005
146C7447L14226J74336j3912j91892l12119l06720j85158p792J71370K91137K95497
157B66420J95430K4623j58106k76730k88653k06351m5927J37164K60851K83156
167A91877K13535O2819j11120k40147k76472k14321p2545R2914K23098K72024
177A41662K17529Q3003p7663k08426k62118k23797r9983N8300J91084K49985K22012
188B91588J14622m1737j76957k40831k18240j20542K6638J61831K34989K22355
$$ plain form
116 282836 549854 648761 517650 149637 -247202 -516782 -631252 -511267 -169893 207999
126 207999 500262 634446 522455 216893 -140433 -453285 -607082 -515359 -242497 95421
136 95421 408359 568005 499845 253882 -75763 -387692 -551188 -509094 -290558 37447
146 37447 351673 526009 512097 320205 8086 -298634 -483792 -491584 -320214 -29077 266420
157 266420 461850 486473 328367 51637 -237016 -443367 -489294 -352130 -91279 191877
167 191877 405412 468231 357111 116964 -159508 -373829 -446374 -353460 -130362 141662
177 141662 359191 442194 364531 156105 -106013 -329810 -429793 -371493 -180409 69576 291588
188 291588 406210 364473 187516 -53315 -271555 -392097 -365459 -203628 31361 253716
198B53716J27478j0580j42296k26014k24010j35769l138J24269K11910K20345
208A95911J41970J4790j13120k02791k14899j48380l0556J01750J94421K10857
218A49953J55615M6194q6293j81446k05841j57938n7213P0608J70308K00989J61476
229B66412O3775n9923j57458j96714j69677p1612M7626J42108J91907J71122Q2182
240C09748l3438j31148j83021j70768q8251K1228J21927J78779J68227R6324q353
251B81254j11010j74969j67504j03114m462R8299J64960J66740J07450J4324q8177
262A83791j54883j64856j13768k1668P9183J48236J62030J21165L1180o8385j38268
273F3757j60618j23919m0551N7535J30035J55027J24698M8399m6366j23113j53541
$$ plain form
198 253716 381194 370614 228318 2304 -221706 -357475 -360613 -236344 -24434 195911
208 195911 337881 352671 239551 36760 -178139 -326519 -357075 -255325 -60904 149953
218 149953 305568 351762 265469 84023 -121818 -279756 -336969 -266361 -96053 104936 266412
229 266412 330187 270264 112806 -83908 -253585 -325197 -277571 -135463 56444 227566 309748
240 309748 276310 145162 -37859 -208627 -296878 -275650 -153723 25056 193283 289607 281254
251 281254 170244 -4725 -172229 -275343 -279805 -181506 -16546 150194 257644 271968 183791
262 183791 28908 -135948 -249716 -271384 -192201 -43965 118065 239230 270410 202025 63757
273 63757 -96861 -220780 -261331 -203796 -73761 81266 205964 254363 207997 84884 -68657
284f8657j28351n3114L5478J13509J51055J28917O3008k4796j04731j43649j30804
295a62135o9684J6755R6589J37655J31251P5524q307q8651j34482j29509q3453
306b18447j550P9636J28595J30046Q6980R582o9211j22394j28802q9702j7072
317b12339O1493J16258J28270R3518K5090n4434j08977j26630r7645l1630M4279
328a62747J02389J23354R8600L9300l6029r7603j20510j00305m3345K6690R0325
339g9881J18732J03071N0518j9837q2599j13310j04490n6657J3350P3543J09620
350A2060J05521O0166n401o8670j07216j03516o5417k145O2164J02314J03453
361I3313O9306J0028n3360r7418j03503p2014j5489M7340R0665J02573P6667K0309
$$ plain form
284 -68657 -197008 -250122 -214644 -101135 49920 178837 241845 217049 112318 -31331 -162135
295 -162135 -231819 -215064 -118475 19180 150431 225955 217648 128997 -5485 -134994 -218447
306 -218447 -219997 -140361 -11766 118280 205260 214842 145631 23237 -105565 -195267 -212339
317 -212339 -150846 -34588 93682 187200 212290 157856 48879 -77751 -175396 -207026 -162747
328 -162747 -60358 62996 161596 200896 164867 67264 -53246 -153551 -196896 -170206 -79881
339 -79881 38851 141922 192440 172603 90004 -23306 -127796 -184453 -171103 -97560 12060
350 12060 117581 177747 172346 103676 -3540 -107056 -172473 -174618 -112454 -10140 93313
361 93313 162619 172647 119287 21869 -81634 -153648 -169137 -121797 -31132 71441 148108 168417
373A68417m1316q5930r9762q1400k6405L4992P9799R8162Q1532L2924k7292p5690
385E8031r5432q1649l7595J8852P2112R4371Q2760M2235j3466o5283r2233q4552
397a01849m5497P393N8084Q8709Q4934N0140k629n2829q5441q3940n4532k771
409a40228M8165Q0015Q5050N8516R275m3118p7538q3429o0565j3602L6313P3189
421b7957Q2886O1996J8500l0490o9225q3046o4323k2717K5222O4652Q1114O6303
433A02915K7918k0250n9380p8555o7866l2189J5398N6518P5846O8225L5180r220
445A14540n3163p2411o9469l9969N491M6682P0913P0188M2107k72m2213o8596
457C828o9480m4535m227L7501O6781O8624M7509Q965l3431o3594o7798n0598j1879
$$ plain form
373 168417 127101 41171 -58591 -139991 -166396 -131404 -51605 46557 128089 161013 133721 58031
385 58031 -37401 -119050 -156645 -137793 -65681 28690 111450 153685 140219 74936 -17297 -101849
397 -101849 -147346 -139953 -81869 6840 91774 141914 139285 86456 1015 -82925 -137457 -140228
409 -140228 -92063 -12048 73002 131518 140793 97675 20137 -63292 -123857 -137459 -101146 -27957
421 -27957 54929 116925 135425 104935 35710 -47336 -111659 -134376 -109154 -44502 36612 102915
433 102915 130833 110583 51203 -27352 -95218 -127407 -112009 -55491 20355 88580 123760 114540
445 114540 61377 -11034 -80503 -120472 -114981 -68299 2614 72802 114909 114637 72424 3828
457 3828 -65652 -110187 -114414 -76913 -10132 58492 106001 114966 81535 17941 -49857 -100455 -112334
470a12334K7931N9905O7163N1450J6633k4788n5164o8059n2352j9544J9001N3063
482c7095O5707N4562K3592j5686m8580o3746n5171k6693J0322M5961O1705N6233
494G1111K9872p505m1430o1012n6167l3469L599L7739N8775N6927L6015n36l3661
507F0258n4886n7459l8125l635L0996N2160N6979M0325O526k6137m9834n7331
519d0163m2131j0610K3424M7789N5841M2265J3368j8914m4697n5719m3550j6648
531h9745J6060M3272N4120M4108K0254j2980m0312n2086m5988k1906R002L6931
543c9270N0924M6550K5582o784l4179m9616m6156k7612L360L1002M7003M7987
555D8791K8410L00k7615m6600m7244k9454l423K5138M4716M5955L1561P048k2243
$$ plain form
470 -112334 -84403 -24498 42665 94115 110748 85960 30796 -37263 -89615 -109159 -90158 -37095
482 -37095 28612 83174 106766 91080 42500 -21246 -76417 -103110 -92788 -46827 14878 71111
494 71111 100983 93478 52048 -8964 -65131 -98600 -95001 -57262 1513 58440 94455 93919 60258
507 60258 5372 -52087 -90212 -93847 -62851 -10691 46288 86613 93139 67002 17168 -40163
519 -40163 -82294 -92904 -69480 -21691 34150 76415 89783 70869 26172 -29547 -73097 -89745
531 -89745 -73685 -30413 23707 67815 88069 75089 34777 -17309 -63297 -85203 -76201 -39270
543 -39270 11654 58204 83786 77002 42823 -6793 -52949 -80561 -77201 -46199 804 48791
555 48791 77201 77501 49886 3286 -43958 -73412 -76835 -51697 -6981 38974 70535 77583 55340
568E5340m2732m6373l3006j0230J9401M0221M5556L5754J1157j6260l7589m4665
580b3426l7278j4090J3777L6351M4015L7277J6624j1413l3104m3044l8397j8327
592g1035P903L1319M1626L8770K0243n183k8598m0277l9606k1565J839K5897L9306
605F39L9686K3905pk3100l8062l9652k4973l014K0922L7079L8651K6569N494j8827
619D5310l5487l8613k7912p267J6723L2638L8077L0024R844j4668l0775l8417
631b0523l1007r756J2119K8709L7204L1028J2103p842k8143l7432l0459j5196
643e9195O338K6456L5272L2574J6193m878k3916l4621l1830j8123K273K2129L2792
656A464L3238J9512j20k0258l2779l2046k1834j022J8334L0368L2750K2900K404
$$ plain form
568 55340 12608 -33765 -66771 -77001 -57600 -17379 28177 63931 75088 58828 21239 -23426
580 -23426 -60704 -74794 -61017 -24666 19349 56626 73250 61837 28733 -14311 -52708 -71035
592 -71035 -63132 -31813 9813 48583 68826 63643 35045 -5232 -44838 -66403 -64564 -38667 639
605 639 40325 64230 64223 41123 3061 -36591 -61564 -64578 -43656 -6577 32074 58643 64137 45310
619 45310 9823 -28790 -56702 -63969 -47246 -14608 23469 53493 63337 48669 17894 -20523
631 -20523 -51530 -61286 -49167 -20458 16746 47774 59877 52035 23892 -13540 -43999 -59195
643 -59195 -52857 -26401 8871 41445 57638 52760 28844 -5777 -37607 -55730 -53457 -31328 1464
656 1464 34702 54214 54094 33836 1057 -30989 -52823 -53845 -35511 -5143 27607 50507 52911
669E2911j4914k9803l3436k1937o208J4094K8200L1882K5131O598j2108k6039
681A4371l2119k4851q892Q886K5150L1586K5885J1423p966k4254l0278k6753j1408
694d9220N474K1395L0316K7175J3557m471k0139k9311k7425j4141K127J8559K8229
707B125K7168J5377K01j6666k7151k7696j7227o06J4735K4722K8792J8018K765
720D4557j3418k4949k7160j9198n860J3499K3339K7410J9465N994r444k2327k7449
733a5541k0801o887P612K1889K6383K1342Q281o822k0404k4881k1587j0209M637
746c6988J9606K4677K2545J1437m368j7446k3767k2855j2841K289J6075K4849
758C213K1015J3769P4j4506k2503k3905j4462o80J2972K1398K3207J5766K164
$$ plain form
669 52911 37997 8194 -25242 -47179 -53387 -39293 -11093 20789 45920 52518 40410 14371
681 14371 -17748 -42599 -51491 -42605 -17455 14131 40016 51439 43473 19219 -11059 -37812 -49220
694 -49220 -43746 -22351 7965 35140 48697 44226 24087 -5224 -32649 -46790 -44663 -26104 2125
707 2125 29293 44670 44871 28205 1054 -26642 -43869 -44475 -29740 -5018 23774 41792 44557
720 44557 31139 6190 -20970 -40168 -46028 -32529 -9190 18220 37685 43679 34235 11908 -15541
733 -15541 -36342 -43229 -35617 -13728 12655 33997 42278 35456 15052 -9829 -31416 -41625 -36988
746 -36988 -17382 7295 29840 41277 36909 19463 -4304 -27159 -40000 -37711 -21636 3213
758 3213 24228 37997 38071 23565 1062 -22843 -37305 -37985 -25013 -3615 19592 35358 37522
771C7522j0606k1840k2916j5770l591J0059K0611K1744J6811M199q040j8966k2462
784a3245j6794o220O766J7797K2713J7470P152o317j5982k2004j7728q223M098
797c0517J6081K0837J7791J0360l860j4477k0482j8093j0520K047J2857J9280
809A304J9241J1989j364j1632j9129j8745j2114r43J0749J9087J9127J1916J759
822C1245j0008j6782j9425j3351k658Q134J6675J8745J4167M019p390j5839j8407
835a0875j4460n935P903J3923J7830J5141O145m875j4211j8670j3419p474M246
848b4731J2469J7697J5556P247k077j2683j8282j4323q650K022J1584J5771J5568
861A7168R073j44j0562j6428j4716r579j090R524J5453J6196R059K220q471j5119
$$ plain form
771 37522 26916 5076 -17840 -33610 -37201 -27142 -6531 15213 32024 36223 28183 9217 -13245
784 -13245 -30039 -36259 -29493 -11696 11017 28487 35639 29322 13340 -8664 -26392 -34615 -30517
797 -30517 -14436 6401 24192 34552 30692 16215 -4267 -22360 -32880 -30833 -17976 1304
809 1304 20545 32534 31170 19538 409 -18336 -30450 -31393 -20644 -1557 17570 29486 31245
822 31245 21237 4455 -14970 -28321 -30979 -22845 -6170 12575 26742 30761 23371 7532 -10875
835 -10875 -25335 -31270 -23367 -9444 8386 23527 29672 24797 10586 -8084 -21503 -28977 -24731
848 -24731 -12262 5435 20991 28238 26161 13478 -4804 -19127 -27777 -25755 -14171 1600 17168
861 17168 26241 26097 15535 -893 -15609 -25188 -26278 -16754 -1301 14895 23954 26174 17703 2584
875B584j5853j0826j734P539J3106J6824J0190L056o540j2102j5494j1794m181
888b5225N584J2122J5008J2344M449l873j1818j5825j1215n469K380J1827J4694
901D983J2314O215k212j0554j4573j2229o606R03R951J3830J2694P678j109q609
915A2676j2185j4048p445j354Q200J2813J3395Q921P9o329j2827j2158r920j165
929b1347O200J1892J2380R380K550n940j0282j2659j0488k389M374J0528J3288
942G487R231M280n576q884j2582j0288l522K923R708J1337J0920M438k439q562
956H471j1873j0491n962K008Q294J0990J0768O883j271p819j0778j1758n710j21
970a8369P646Q951J1854O681R58n577j1309j0194o835j807N074J0013J0483Q611
$$ plain form
875 2584 -13269 -24095 -25829 -18290 -5184 11640 21830 24886 18346 6244 -9250 -21044 -25225
888 -25225 -19641 -7519 7489 19833 24282 20409 8591 -7234 -18449 -23918 -21538 -9711 4983
901 4983 17297 23512 21300 10746 -3827 -16056 -22662 -21759 -11808 2022 14716 22394 21285 12676
915 12676 491 -13557 -21002 -22356 -14156 -1343 12052 20973 21052 14723 1896 -10262 -20182 -21347
929 -21347 -15147 -3255 9125 18505 21055 15115 4833 -7826 -18314 -20703 -16329 -5801 7487
942 7487 16718 20998 15422 6538 -6044 -16332 -19854 -16931 -7223 4114 15034 19472 17033 8471
956 8471 -3402 -13893 -19855 -17847 -9553 1437 12205 19088 17817 9998 -780 -12538 -18248 -18369
970 -18369 -10723 -1772 10082 16763 17721 12144 835 -9359 -16194 -18001 -12927 -2914 7569 16180
984A6180K450n918r410j0206q041j694L337Q895J0241Q641K678l242r005r723
998d817q453m131L193P082J1165Q691L411j972o382j0060q733n409K162O323R731
1013A801Q935M787j034n723r355q593o032K23O414Q012R826M883O24n048q342
1028A378r570n854k53M096R101P512O061J771l762p610q879o566j175K788P797
1043c165Q175O562K207l018o828q419o745k184K270O293Q296O796K642j244n515
1058F123r057o194l661J135N512Q531P290L095j655m117q369p044m666J395M767
1073f915O866P601M000L83m033p238p798m494l47L710O835Q276M689L71l657o775
1089A474p075n300j417L306N938Q337M799J035k372o379o040n512k060J978N563
$$ plain form
984 16180 18630 12712 3302 -6904 -14945 -16639 -13302 -4407 5834 14475 17153 13911 4906 -4817
998 -4817 -13270 -17401 -14208 -7126 4039 12730 16141 14169 7787 -2273 -11006 -16415 -14253 -7930 1801
1013 1801 10736 15523 14489 8766 -589 -9182 -15214 -14991 -8577 -565 9261 14144 14768 9720 1378
1028 1378 -8192 -14046 -14299 -10203 -1102 6410 12471 14242 10480 2870 -6009 -12575 -13750 -10962 -3165
1043 -3165 5010 11572 13779 10761 3933 -4486 -11231 -13415 -11145 -4852 3444 10240 12882 11638 6123
1058 6123 -2934 -9128 -12789 -11654 -6142 2389 9679 12774 11119 7002 -1367 -8411 -13077 -11682 -6915
1073 -6915 -49 7552 11552 11935 7902 664 -7134 -11628 -11975 -8265 -1430 6846 11535 11906 8249 1474
1089 1474 -5601 -10901 -12318 -9012 -3074 5263 10062 11097 8725 2346 -3694 -9206 -11266 -9288 -3725
1104c725O885M937L401k019m530p588n709k546J130N301N615O522K429m12m510
1119E181o964n547k377m60M260O455N291M135j89m013n756n864l691M0L541N330
1135f28N834L714J419l653n022o124m077n52K569M766O223K779J631j655n520
1150A704n713l207j859K255L828N769L182K310j106m364n694l947k028J194M274
1165c402N263M268J400j72l327n210m817k679R54L405N703M375J577J95l068m045
1181D20n505k445J40J741N991M061K721J135l227l498n534k265r25J325N147M122
1197C404L906L44j698m601l773l943o22J865L259N213L556M31r76m009m706l861
1213f211j325J858K614M640L845O75l52k925m660k980k265J095K313N083L908
$$ plain form
1104 -3725 3160 8097 11498 9479 4949 -2639 -8348 -10894 -9764 -4463 1152 7674 10103 9691 5181
1119 5181 -1783 -7330 -9707 -10167 -5907 548 5839 9974 9785 5772 16 -5848 -9539 -9499 -5958 -628
1135 -628 5206 8920 10339 6686 1664 -4460 -8537 -9089 -6520 -1754 4469 7248 8879 7224 1704
1150 1704 -4009 -7216 -9075 -6820 -2992 2777 5959 8269 7163 2799 -2895 -6842 -8870 -7676 -3402
1165 -3402 1861 6129 7529 7357 4030 -1180 -5997 -8676 -7722 -4317 1386 5761 7338 7533 4465 420
1181 420 -5085 -7530 -7390 -5649 342 4403 7124 8259 5032 1534 -4000 -6265 -7190 -5865 -718 3404
1197 3404 7310 7654 5956 1355 -2418 -6361 -6983 -5118 -1859 3354 6910 7341 6365 2356 -2350 -6211
1213 -6211 -7536 -5678 -3064 1576 5421 6096 5744 2819 -1841 -4821 -7086 -5991 -3678 1405 5313
1228E313J807M58m545l793l385k943J088K584M289K394K965J31j349n133l905
1243d024j783j2J781K608M375K644N12j188m572l429k536m36J478L652L914K548
1259E532M88j866k644l769k850p28K91L735K950L600J221p33k802m741j950r72
1275e238R90J907L942K857J017O93l427l446l167j906K70L714L230J812J900K92
1291E440k741k697l680j050j167K531L270L410J854k06j021l113l254j684m18
1306d526J723K303L081K121J21o80k866l206k149j265J338L107L211J785Q43j110
1322C831j646m508j619m16J028J598K326L153J278j172k161j929l797n52L35K752
1338a499J952L101M83k0j309l302k304j295J91J068L078K691J382m27p38k464
$$ plain form
1228 5313 7120 7578 3033 -760 -4145 -7088 -6000 -3416 873 3267 6232 6363 5014 -119 -4024
1243 -4024 -5807 -5819 -4038 -1430 2945 5589 6101 4913 341 -3088 -5624 -6060 -4582 -930 2984 5532
1259 5532 6020 4154 1510 -2259 -5109 -5837 -5546 -1811 1139 4739 5960 5227 2425 -2316 -4266 -5238
1275 -5238 -4248 -2341 1601 4458 5475 6168 2741 -705 -3872 -5778 -5508 -1794 1436 3248 5148 5440
1291 5440 2699 2 -3678 -4728 -5895 -3364 -94 3316 5170 4964 3943 830 -2424 -4108 -4526
1306 -4526 -2803 -500 2581 4702 4823 4143 1277 -1929 -4078 -5343 -4005 -898 2313 4098 4941 3831
1322 3831 2185 -2323 -3942 -4358 -3330 -1732 594 3747 5025 3853 1692 -237 -4034 -4586 -4251 -1499
1338 -1499 453 3554 4037 4017 2708 -594 -2898 -4193 -4002 -2934 144 2835 4217 3790 3052 588
1354E88k908k079m07K301K082K969J656K68j807k468k609j038j690J815K020K457
1370A150K603J031j738j638l053k304J25k20K487K381K352R22q97j554k553j563
1386b469j909M09K751K229J771Q93l81j283k262k679p26Q0J822K215J978K137
1402D576q82j816j852k540m98q09K065K034J284J453K4o18k452j521j595J43J33
1419b871K446K840K66O87j031j117k406j419j229J584J298J680J851J327q02j964
1435A140j437k334l42J6J454J935K347L76m00j693j150k452o97q1J327K040K204
1452B253K69Q05j457k310k134K4n28J521J783J920N05P64k089j234j856j673j47
1469c584J212K085K257K55J359j510j997j727j366m93M78K564J414J493N43j011
$$ plain form
1354 588 -2320 -4399 -4806 -2505 -423 2546 4202 4470 2663 195 -2414 -3452 -5142 -3327 -1307 1150
1370 1150 3753 4784 3046 1408 -1645 -3949 -3824 -4044 -1557 824 3176 4098 3201 1647 -906 -2469
1386 -2469 -4378 -3969 -1218 1011 2782 3675 3294 2011 -251 -2930 -3656 -3576 -1754 461 2439 4576
1402 4576 3694 1878 26 -2514 -3012 -3821 -1756 278 1562 3015 3039 2421 -31 -1552 -3147 -3004 -2871
1419 -2871 -425 2415 2681 3368 2337 1220 -1186 -2605 -3834 -2250 -952 728 2579 3906 3104 1140
1435 1140 -297 -2631 -2973 -2957 -1503 432 2779 3155 2755 1062 -88 -2540 -3237 -3318 -1991 49 2253
1452 2253 2522 3327 1870 -440 -2574 -2550 -3078 -1557 226 2146 2651 3415 1326 92 -1764 -3437 -3584
1469 -3584 -2372 -287 1970 2225 3584 2074 77 -1650 -3016 -3509 -3031 -467 947 2440 2983 1972
1485A972j267j205k245m39P85J995O69J376J410j021p95k209j161j215M73J024
1501a853J801K141N43M64j884j204j641j003K15J279J215J937J117r90j344j112
1517c19j436o74j12J015J535K424m10K92p28j861j050k026J183O11J446J405M33
1534A728Q67q43j251j759j058K50j20K027P61P02Q29J61q76k239j682K32L07J133
1552h31J562J080J95l26m09k590n86p40K18K339mK033J491j064m46j775k054P0
1570a837L7K82J761J323J073q72o80j108k030K01j029N66K878M51K058j489J79
1587A764q59k658P4r04R57J565K26J706J292j494j441r28m91j002P92J90K112
1604I01J132O93j104q50j635r59q13J137P87Q71K252J54o67j057j398o63j316
$$ plain form
1485 1972 705 -500 -2745 -3184 -2399 -404 265 1641 3051 2030 1235 -974 -2135 -3350 -2877 -1853
1501 -1853 -52 2089 2632 3096 1212 8 -1633 -2636 -2421 -1142 73 2010 3127 2137 793 -319
1517 -319 -1755 -2429 -2541 -1526 9 2433 2023 2315 1587 -274 -1324 -3350 -2167 -1556 -110 1295 1728
1534 1728 2595 1752 501 -1258 -2316 -2066 -2186 -159 602 1304 2133 2294 1418 -821 -2503 -2271 -1964 -831
1552 -831 731 1811 2006 1680 1271 -1319 -1905 -2645 -2427 -88 -92 1941 3432 2368 1922 147 -1907 -1837
1570 -1837 -1800 -1518 243 1566 2639 1767 1087 -21 -2051 -1850 -2879 -2313 565 1016 3074 1585 1764
1587 1764 905 -1753 -1679 -2583 -1626 -61 165 1871 3163 1669 228 -700 -1191 -2193 -1401 -1211 901
1604 901 2033 2726 1622 772 -863 -1822 -2635 -1498 -711 160 2412 2566 1899 842 -556 -1219 -2535
1621b535R2J335J844O64J083q48j03k274l79j005N42N77J012J393J25P49p11j665
1639a04j543k27j73J297O27R12J084O71p93k054o51q99j71L30K12K983N31R63
1657B995k528L18j599k07o77J26P03J378J147J46Lq01j526m98k19p40J188J126
1675C35M45P85j08r51n92j168q74R72k79J573J709L26q86j87j064r56j534R50
1693a504O6Q39J633Q27l56r39Q60j713j521M07P52r6J790k5Q70o50q76l85j363
1712a384m18R43J415k44P74O87m05l79k582L3k73k4J475R54O67R48r25k13j252
1731b03n11l9q24J210M95R86J46K05j284l09m11p55j26J17Q78J355Q12J20j057
1750H05o51k034J17K62N84M10J513M02n21k62o68l89p21M1p59K051L28J111L42
$$ plain form
1621 -2535 -2443 -1108 736 1400 2483 1635 1532 -742 -1121 -2126 -1584 -1007 5 1398 1523 2272 1561 -104
1639 -104 -1647 -1874 -2047 -750 -123 789 1873 2544 1751 -303 -954 -1853 -2024 -1694 -1482 1501 2032 2995
1657 2995 467 785 -814 -1021 -1698 -1572 -869 509 1656 1802 1805 1004 -522 -1020 -1239 -1979 -791 335
1675 335 780 1565 1457 506 -86 -1254 -2128 -1156 -1435 138 1847 2173 1287 1100 36 -920 -2454 -1504
1693 -1504 -1438 -599 1034 1861 1505 566 1426 -287 -1808 -1401 -649 -745 1045 1020 1890 1240 364 -21 -1384
1712 -1384 -1802 -859 556 312 1086 1773 1368 989 -1593 -1560 -1833 -1857 -382 572 1239 2187 1262 1049 -203
1731 -203 -714 -753 -1577 -367 128 1114 1260 1465 181 -128 -539 -1294 -1420 -1303 -425 930 1742 1862 805
1750 805 154 -1880 -1763 -1501 -917 -507 1006 1408 887 625 -43 -432 -1153 -1112 -1871 180 508 1619 1961
1769A961j437p9o30n74j592N37J227J69R68O41j51l68j328n00N86q60J97J591
1787C58N83O31K05r24j057j381O56m40N30J155P77N1J68m01q35j848M83M3O55
1806e91L77P64P76l70k14J5q30j130J9j42L20K045l51k4P00q78q72o15j26J28
1826i99R7J159j87J787j038n08p20j22j246J806l95P99P25k22l3K77q32j179j56
1845i87m37J411Q2O00Q33l82j042L73j151m78N28l85J055J65N57K13K1j219j48
1864c91k63j32j50O46J707n73N9J33j314m96J54q54J87J249L89N37P51m50p49
1883D40l43q64l72j8J392M59k04P80p03l1l87j726Q81k19J144m2K83P47l56n55
1903C06o91l16l22J10N00N36j66J228o44r34N58r78k22R26l34P27O40p03Q96L77
$$ plain form
1769 1961 524 445 -185 -759 -2351 -1814 -587 -418 550 1191 1040 672 -656 -1156 -570 -1430 -1233 358
1787 358 941 1572 1777 853 -204 -1585 -929 -1369 -839 316 1093 1144 1312 911 76 -1772 -1289 -1246 -591
1806 -591 -214 550 1326 956 742 757 -73 -1203 -1184 -1326 -1006 1039 688 664 1364 486 -386 -1001 -1127 -999
1826 -999 -902 257 70 1857 819 311 -409 -531 -1777 29 -366 433 1158 936 903 1180 348 -831 -987
1845 -987 -1424 -13 69 669 1502 1120 78 451 -700 -1178 -650 -1035 20 185 742 955 976 -243 -391
1864 -391 -654 -786 -936 -290 1417 844 903 1036 -278 -774 -620 -1474 -1287 -38 351 888 1639 1189 440
1883 440 97 -767 -1139 -1157 235 694 490 1270 567 536 149 -1577 -696 -915 229 187 470 1217 861 306
1903 306 -385 -701 -1023 -913 -413 123 -43 1185 541 -393 165 -813 -1035 -109 -443 284 924 221 1117 1494
1923A494j304o38l96k22O1J263M51M70k40n26J9o51r43L82n04N42Q21J526r59
1942F46o5K5p35l96o71L50J68J472j37M5L88o32j11r43J33o66J097k3R13q92R46
1963I12n67m24p71m7p57J290L55K00Q81j31p7q36n8m92K01j00K62M91M91q85L10
1984B48r7p61j60M85r9Q38J33k24M75n41m1n83n85R08k7l82J568p4m63L41p40
2005B19p10J58n81Q6L72O46P20k24J71l25p95k80r60O69M7J034K10K90o33J50
2025B64r43m02l63Q03N25L43M17Q3L2O9m90j086l44mM66P70J016o58P47j224J2
2046C3k54Q8r31J003o59N13J413m38n70L79o34m18m23M85l28N72J018P2P5q80
2066A16p51j00L51L1j06J189k26K22J75k66j566P20n48l73O90L94M43L11r9l26
$$ plain form
1923 1494 190 -448 -844 -1066 -1005 258 709 1179 939 413 432 -219 -1162 -780 -1284 -742 79 1605 646
1942 646 581 606 -129 -525 -1196 -846 -678 794 657 702 1090 458 347 -596 -463 -1129 -32 -55 858 -34 912
1963 912 345 -79 -850 -897 -1654 -364 -9 191 1072 941 864 28 -30 -522 -321 -421 -159 332 823 -62 248
1984 248 151 -610 -770 -285 -384 454 587 363 838 297 256 -327 -912 -4 -31 -413 1155 1081 618 959 219
2005 219 -491 -333 -914 -828 -456 190 910 686 857 532 -263 -543 -1503 -834 -787 247 457 747 114 264
2025 264 -679 -1081 -1444 -641 -116 227 644 727 759 828 338 -748 -1092 -1096 -630 140 1156 498 1245 21 33
2046 33 -221 -133 -1064 -61 -720 -207 1206 768 198 577 -57 -475 -898 -413 -741 -169 849 921 996 116
2066 116 -635 -735 -384 -353 -459 730 504 726 901 635 -931 -211 -759 -1132 -442 -48 395 706 607 281
2086B81l62O51j388L35N02k30K33N35K66l86k70k36q5p47P54J77J45K79M56J21
2106A031j010P10j296j28l48L74J836k49N18r63j43m79k28j89j40O37Jj27J205
2125A012m05m39m51J28j96K88j056J588r4j47L84o80k22l64J62l56o38J202R18
2144F34k08J56n51M32q26R81j164P54j067N17J280p13J77j20o20Ro2K9N56K45
2164D39Q39k77J20j369P2m87J7j50P93O11J78o91P45j58q37Q57j741P60K31L32
2184B84n64Q49n4N9j153J98M66q06Q28m31K51R91k88k89l29P4m85o75J110k8l83
2205c75J333q7L68j887p3J33j15L01L67K47J70P39j106j1o18K37k51R41m51j76
2225c14L93N01k05M3p6j77m51q31J421o06M93N02n81r2m09K45K35m62p3J111m9
$$ plain form
2086 281 -81 570 -818 -483 19 -211 22 557 823 437 167 -69 -154 -901 -147 30 175 454 910 1031
2106 1031 21 731 -565 -693 -1041 -667 1169 920 1438 475 332 -147 -375 -564 -704 -67 -66 -193 1012
2125 1012 607 168 -283 -155 -351 -63 -1119 469 375 228 612 -68 -290 -654 -492 -848 -1486 -284 634
2144 634 426 582 31 463 -363 618 -546 208 -859 -342 938 225 402 282 -338 -329 -391 -362 194 439
2164 439 1278 1001 1121 -248 -176 -663 -646 -796 -3 608 786 95 840 682 -155 702 -1039 -279 -48 284
2184 284 -280 569 515 574 -579 -381 85 -721 107 -324 -73 918 630 341 12 86 -399 -1074 36 8 -375
2205 -375 958 871 1239 -648 -721 -588 -703 -402 -35 212 382 1121 15 4 -614 -377 -628 313 -138 -314
2225 -314 79 580 375 418 342 165 -286 -1117 304 -302 191 693 112 20 -389 -144 91 -371 -444 667 618
2246F18m01j16N8m13N86J93j404P32J53J76O29o38j56M64p19J17m27mP9P35N85
2267H47p25N77p41j72k90l79J44J412n5J27n39p4J37j82r44N85m47K39O65N8m04
2288a61O01k39R1M98j370K99k38J202o77K75q0N52r29m41P2M9j41R0J003l39L43
2309D60n97L71o53q25O39O04k17J13R69j041P51k06J85n62j063P39m06Q58K41
2328C60L36m05k2m1op47R54k83k39M65K44l17P9m39j096K78L49K0P09O55n32J19
2350D41n99k82M42j41O1l1J05o7K7L08L46l0m52o70O70J82o84J97J2O60o23j82
2372c10M02m61K00j65N17O4j28L35M8n37L35q26R31j330J76J151k89N20q43K03
2392gL26j126L02M3j64N98O19m39J53K2K06m8J80j443R10l64M06J38k06M8M93
$$ plain form
2246 618 217 101 159 -254 332 525 -879 -147 6 182 811 173 17 481 -238 -121 -548 -552 -473 262 847
2267 847 122 699 -42 -214 -504 -883 -739 673 618 745 206 132 269 87 -857 -272 -719 -480 185 243 -161
2288 -161 440 201 292 790 -580 -281 -519 683 6 281 201 753 -176 -617 -545 -496 -637 -547 456 117 460
2309 460 -137 234 -419 -1244 -605 -1 -218 -105 864 -177 574 368 553 -9 -1072 -333 -739 119 360
2328 360 696 291 269 228 222 -525 429 146 -93 372 616 299 378 -61 -1157 -879 -530 -510 199 854 322 441
2350 441 -158 -440 2 -139 -78 -109 -4 -71 -44 264 610 580 128 -542 128 310 -374 -177 -165 495 -128 -310
2372 -310 92 -369 -169 -334 183 247 119 454 502 -35 300 -526 405 -925 -749 402 113 633 -210 -7
2392 -7 319 -807 -505 -462 -626 -28 591 152 305 327 533 485 665 -778 132 -232 174 312 106 154 647
2413F47r47j7K79Q09j301Q22l81N04M60j421P24o55n18R02j56O21L4m11R44q64
2433G5L74p38n13L28O58n25j09L61J64Q98n57j175k3j01J192o85K37L49k95n18
2453f03N93k37k90J43k26P81k45L9jj8l47M88q9o06MK55O1O87o00M87k45n32k5
2476e26O69j185P43lN75n71m1J054m96n93R5j60P86q03M01j23J66Q69j034n42
2496g19R95m22K99n3K20n26N6K46K82q15j99L57N73J32L72l31m52J20m16P32p20
2517b69o0q3N69N44j81o14L07l11M61q3p79K56l43M21K39N60o08P12j91j68P44
2538A123j424K11l62M72K48n03k65R74q74J49m7O9L63J82k32k75p11J240K97o47
2558a2K41l58l94J095n02r0O14o09M09n39n2m02J235o55K98j81M02K91j449P66
$$ plain form
2413 647 -300 -317 -38 771 -530 292 -89 415 875 -546 178 -477 -995 -93 -249 372 406 -5 939 75
2433 75 449 -289 -802 -474 184 -341 -450 -89 75 973 416 -759 -782 -883 309 -376 -139 210 -85 -603
2453 -603 -10 -247 -537 -394 -620 161 -84 -45 -46 -64 -411 77 -12 -618 -614 -359 -298 389 -211 276 31 -501 -526
2476 -526 143 -1042 -299 -302 273 -298 -339 715 219 -374 -279 -439 347 -456 -55 -178 -12 857 -177 -719
2496 -719 276 -146 153 100 320 -206 -150 96 378 -437 -636 -279 294 426 798 467 15 135 -281 451 -269
2517 -269 -329 -412 157 701 520 -94 213 -98 363 280 -499 -243 -586 -165 74 634 26 738 547 379 1123
2538 1123 -301 -90 -452 20 268 -235 -500 474 -400 -251 -298 -229 134 316 84 -191 -902 338 635 -12
2558 -12 229 -129 -523 572 70 -20 594 -15 394 -145 -197 -599 636 -19 279 98 500 791 -658 108
2578A08K6N77q58MN0J094n03p07L06m52L70m48L78L67j9O84n54K94k21j149L61
2599b92L47j02k46L90R00q02q3l92n86Q08k0M63n52O92m67m00K86rPk6n43L43
2621b84N77K2j2j63k82j84K70N08l95p3M31q65R55p33J22l73O53k37J73K1n7r29
2643h55J197m1l33k46n55J378j101J037J2j70q76P60J4K16p6j53p77J277j044
2662c36n6N82l38Q14K35o49m58M13o1l89N04L23m10L43n15m39M35L4n21O11M43
2683E65p47k48K63J50L1k31n67N06K1L52k50M18l38K62m70K56l64k99O4P04j98
2704a20P69m60q0M53J80q30o54L13m10K3O68N93k25j00l19N3J33M0p34Q54j117
2725i70J722l70N4n60k38QM55l42KQ8J38K82J69j314J360n61L6r4o38L13l49N27
$$ plain form
2578 108 134 711 -147 -143 -93 1001 498 -209 97 -355 15 -433 -55 312 293 977 423 717 496 -653 -292
2599 -292 55 -47 -293 97 997 195 112 -280 -866 -58 -78 385 -167 525 58 -342 -56 -65 -58 -84 -627 -284
2621 -284 293 315 303 140 -142 -326 -56 452 57 -16 415 -450 505 -228 -106 -479 174 -63 110 131 74 -855
2643 -855 342 301 -32 -278 -833 545 -556 481 493 323 -553 207 221 437 361 208 -569 708 -336
2662 -336 -392 190 -148 666 901 252 -206 207 146 -243 261 584 174 517 2 -437 -2 32 -489 122 565
2683 565 -182 -430 -167 -17 14 -217 -784 -278 -257 95 -155 263 -75 187 -283 -27 -391 -690 -626 78 -120
2704 -120 649 189 109 562 742 -88 -742 -429 -839 -816 -148 445 220 120 -199 -146 -13 27 -707 147 -970
2725 -970 752 382 436 -124 -362 -354 101 -241 -239 -151 -13 269 438 -876 484 -77 -41 -135 -773 -460 -809 -282
2747b82L90m29o16L65M26O44J21n02J01M10q15m49m6J177m58l67N04j69j94j64
2767c53R14j021Q79o03J25K71j10k41K51L65m32l6J40q77N29l10N12j49q36J802
2787H20j409O70J42O3p70L13P8L81j65J67K41r21L94q5N49q98O67j97K05J51L15
2808G11j75j078N66L74n3p96J95O60r06R94k89m7j27p00L37Q12j76p63l31P24
2828f8P1K08m30M97m74o87J09J15Q29j30N7M95q1l11j65l32O57j046L65K91m48
2849d78O46l43q9l84l39K015j467P23l49K44O2p16P41K05o87L12O17j401O93P98
2869H03q97R46j333N4L24k09L89k60L00n81Q55j88l37m65L0M08O00q02N01J62
2889C00P84j507K84J95o8J94M68r28P3o39N10m80M92Q58q54N40p0k80m23L74N07
$$ plain form
2747 -282 108 -321 -937 -572 -146 498 619 117 218 628 -187 -636 -682 495 37 -330 174 5 -189 -353
2767 -353 561 -460 419 -184 -59 212 102 -139 112 477 45 9 149 -728 -199 -509 3 -146 -982 820
2787 820 -589 81 223 286 -484 -171 -93 288 123 290 531 -390 4 -81 468 -430 237 40 245 396 711
2808 711 536 -542 24 398 345 -451 -256 404 -502 492 203 156 29 -671 -334 478 302 -461 -792 -68
2828 -68 3 211 -219 278 -196 -883 -774 -659 170 40 97 592 511 200 35 -297 360 -686 -321 -30 -478
2849 -478 168 -175 -264 -648 -987 1028 -439 284 -65 179 241 -475 266 471 -216 96 713 -688 5 803
2869 803 -94 852 -481 -427 -103 -312 77 -183 117 -464 391 203 -134 -599 -569 -161 439 -363 138 300
2889 300 1084 -423 -139 56 -12 182 650 -278 -205 -844 -334 -814 -322 536 -318 222 152 -128 -551 -177 330
2910C30q92L8k65P0J120o87k16L94O16p36J362j564J98J30N49p0n66L67n53N36
2930A61k61m56Q09m41j6k90Q99o50J106p18J44j029J024l04m1L13L0r31O68J44
2950A61q48J117j358M01m47J032K25o19O3N19k4n80J81O28j035Q9J42P68j031
2969f16N77j77J47k52K26o02Q7J379r76o2m9J006n72M73kn63L45o30j07K43L63
2990B38L27k03l50n40M90m32K93M57k18m71N77L74J27o04L6K59j085N31m35J33
3010d96M26K49j047J169k89k58j76J35J003l42k25N4j71N37r24L25N30o02N76
3029D74j268K23P71l66j25J088j075K71r5n7O83o05N2j52l95N51k02L65L08k55
3049A91k55j65k04l8P33p7L4o12J214j064J60N87p10N90l62R28r23O06j046J95
$$ plain form
2910 330 -562 -524 -789 -719 401 -286 -502 -108 508 -228 1134 -430 -232 -102 447 377 -189 178 -375 161
2930 161 -100 -556 253 -188 -204 -494 405 -245 861 143 287 -742 282 -22 -63 250 280 -651 17 161
2950 161 -687 430 -928 -527 -974 58 283 -336 -273 246 222 -358 -177 451 -584 -495 -353 415 -616
2969 -616 -39 -216 -69 -321 -95 -697 -610 769 -207 -269 -318 688 116 589 587 24 369 -261 -368 -125 238
2990 238 565 362 12 -528 -38 -470 -177 280 62 -409 168 542 669 65 101 360 -725 -194 -629 -496
3010 -496 -70 179 -868 301 12 -246 -422 -287 716 374 149 203 32 569 -355 -30 500 -102 474
3029 474 -794 -571 200 -166 -291 797 -278 -7 -102 -159 524 -81 -29 -181 -576 -25 -227 138 446 191
3049 191 -64 -229 -433 -471 262 185 219 -393 821 -243 -83 504 -206 384 22 950 27 633 -413 -218
3069b18k67L62L65m22N5N90J3j67m38k94m2N28L67m25K59j95n96Q60j88m53J79
3090a27k91m40K40K15N62l82n22J490n45j01m64P23p61N27j88n26Q06K58j24r98
3110f48R24j9L12L60m03Pn76l06l56J33P6j70R07p0K86o58M70n57N13k04n13K75
3132b17Q40j303L77N00n34O75l47m2J046p99n11O87J69r68M48l80O41J40k81j69
3152b8P91j030j01P37k44L85J14r53k7M66p52J222j012O22l35K88l89M61o36J09
3172c12R0o57Q03K06K19l48L17J66L7j354J068K99m96O81j37n16O95m12k68k19
3192a38L41pN54o15p5L23m28M65ml60O18r95J112l73m02M6L45l01p1l53L45K68
3214B95M99r8n45l46j26k19O0P45l28k10L56j30O5K79J29M4l55k9l0k16k1N7P
$$ plain form
3069 -218 -485 -123 242 -180 -125 465 478 311 -127 -421 -463 65 432 7 266 71 -525 335 147 -306 -127
3090 -127 -418 -858 -618 -403 159 -223 -745 745 200 99 -365 358 -403 124 -64 -590 216 474 350 -648
3110 -648 276 257 569 929 526 533 -43 -349 -705 -572 -496 -666 241 171 457 -201 269 -288 225 21 -492 -217
3132 -217 623 -680 -303 197 -337 338 -9 -51 995 196 -315 372 541 -427 21 -359 282 422 141 -28
3152 -28 763 -267 -368 369 125 510 624 -329 -356 110 -642 580 -432 190 -145 143 -246 215 -421 -312
3172 -312 -222 -879 -76 130 349 1 318 484 521 -833 235 534 38 719 582 66 761 349 81 -138
3192 -138 203 196 750 135 60 383 -45 420 416 56 674 -321 791 418 16 62 407 106 35 -318 27 295
3214 295 794 696 151 -195 -321 -540 -480 265 -63 -273 83 -47 18 297 426 470 115 86 56 -160 -181 -124 -117
3237a17l56N7N57N38o02o38R3J35r3Q16r21nP09m09K61q09N33J03K07l72o28J078
3259A37l92K6K36m55K41N61k33n55K3P61j55j38J83n55P4k25M52K86n19J058m20
3280C91J70l93P5m96k02m36R28K67L76p41k51K49M24n88M23n25n2N89p0L68k49
3301B57l66J89o77J30M92k24P99l87L30j58p98Q48n73l75Q1K20k49R76n70N08
3321D53r68P03n2M4l82O03n90J05O48q51j93m7J72M83l89L26L24j76m00j99j23
3342e09J60n34R29N12q83J13J33N61k89m48L08j34K51R8n10P2M36m32J37q27J448
3363E92q41j12R04N66j665J135l18m48J34j11l41L36m09N48M55R9r70P1J001r92
3383c66K28n17J7M07k89L47M98k12M24m90O68j501J024pp07M06n06J094l57r69
$$ plain form
3237 -117 -473 -416 141 679 77 -561 -468 -333 -426 390 -531 -536 173 -236 25 -784 -251 -148 59 -313 -941 137
3259 137 -255 -229 7 -448 -207 354 121 -434 -411 350 195 57 240 -315 -241 -466 -14 272 -247 811 391
3280 391 561 168 243 -253 -455 -891 37 304 680 -61 -312 -63 361 -227 196 -329 -381 208 138 506 257
3301 257 -109 80 -597 -467 25 -199 600 213 543 385 -413 435 -138 -513 -432 -212 -461 515 -55 453
3321 453 -515 188 136 180 -202 401 -189 -84 564 -287 -480 -527 -355 128 -261 65 389 213 -187 -386 -509
3342 -509 -349 -883 46 558 -325 -212 -79 482 193 -255 53 -81 170 268 -242 -170 266 -166 -29 -856 592
3363 592 -249 -361 543 1109 -556 579 261 -187 -53 -164 -505 -169 -578 -30 425 524 -446 -375 626 -366
3383 -366 -138 -655 -638 -231 -520 -173 325 113 537 47 715 -786 238 231 -476 -70 -576 518 161 -808
3403h08O11J3J33J10l46m09J125J46j087j1Q6J60Q42j72r69R63q25O03n10M34
3423H9L24k34j44j44j83L97k09N92o05L32p19L64n00K46k35J098J77m06k15J50
3443A75m47L10l23k19M64l72L63R65j247jJ070j158P42l48j67L50k18j56M55r63
3463g25O25K79R1k09l41j22R08m73M19R5l29j38m35k15L50N51o47K04L79N3o32
3484c12M0L02l74J074r04L48p23O16K27k13n09K94M01r5n89n6P24j480J629k68
3504A32q02J370r69J83l49K16r5K16R6J58R2p99J430k75r84k03P94n50P31J25
3524E17m5p21K40M35o00j79q6O14j35j28L24n38J55K49n13L84J77k40J70K65o1
3545B84n54P76q11Jk38J331o33J45j54J14m42k78O02N37n69q13N67N77l69K62
$$ plain form
3403 -808 -197 -184 -51 59 -287 -696 429 575 -512 -523 -437 -277 565 393 -576 387 -438 165 -345 89
3423 89 413 179 35 -109 -292 105 -104 488 -117 215 -504 -140 -640 -394 -629 469 646 240 25 175
3443 175 -272 38 -285 -504 -40 -412 -49 916 -331 -332 738 -420 322 -26 -193 157 -61 -217 238 -725
3463 -725 -100 179 270 61 -280 -402 506 33 452 547 218 80 -355 -570 -220 331 -316 -112 267 320 -312
3484 -312 -272 30 -344 730 -174 174 -549 67 294 81 -428 -134 267 172 -417 -473 251 -1229 400 132
3504 132 -670 700 -269 -86 -435 -219 -314 -98 -2 156 248 -551 879 604 -380 -583 211 -339 392 517
3524 517 472 -249 -9 426 -174 -353 -439 175 40 -88 236 -302 -147 102 -411 -27 150 -90 80 345 284
3545 284 -270 506 -305 -304 -542 789 156 301 147 261 -181 -459 143 680 111 -702 -135 442 73 335
3565C35j70l7k13K96k67J48J07m39N12p21m5l44J060j44J34M41n36J055j545R11
3585E38k27k38J28J42k90L02j45q9j24L97j62o18n01N06Q41j02q72P3Q33M35j030
3606b03j59N17k33m95P30j3m96L46M51j35Q0k02m23O32j157J258k98K6K21j5j171
3627g39P68l20K96j21K2M20l67L3o7L81l0p99O13j82L09l58N46o70J8M61k5j485
3649a296J419n73K71Q36l80J270j808l35J176l25o23l81P31k7j07P67o97J15M68
3668E01l79J02m78R30m37k41Ol24N33O54j848J154N92j027O48j044O80j111O07
3687d82Q75j93M73r45K6n17O85O02n49K17k03j26O24n25N25j109Q09k16P49m44
3707B76o23N79o31P75j18j224M07J040n13M55m26P94k66q98L84Q9r04J300m61
$$ plain form
3565 335 165 128 -85 211 -56 92 199 -240 272 -449 -494 -838 222 78 212 653 117 1172 -373 538
3585 538 311 73 201 343 53 355 210 121 -3 394 232 -386 -887 -381 460 358 -514 -441 392 827 -203
3606 -203 -362 155 -78 -573 157 144 -352 -6 445 310 390 188 -235 397 -760 498 200 226 447 432 -739
3627 -739 29 -291 5 -116 -94 326 -41 -8 -75 306 276 -523 90 -92 217 -141 405 -265 -247 214 189 -1296
3649 -1296 123 -450 -179 657 277 1547 -261 -596 580 255 -368 -749 -18 -45 -152 615 -82 33 501
3668 501 122 224 -254 676 239 -2 4 -320 213 867 -981 173 765 -262 386 -658 22 -1089 -482
3687 -482 393 200 673 -272 -246 -763 -78 524 -25 192 -11 -137 487 -38 487 -622 187 -29 720 276
3707 276 -347 232 -399 376 258 -966 -559 481 -32 423 -3 791 525 -373 11 100 -804 496 35
3726C5K76K67k34k92j60p34L70o1N87N11r17J88M32Qn4o82J221o00j08M58l74
3747A37N1k65K14K32p52J44R29q42j98N82j51p89O89n73j35R28r08J035q57O93
3767A64l03o64P27l96M21j76J62k41N09J68K0j29K03J88qq13k62K47J83p37L95
3788c42m7j99K88K68k85K07M10l66J85j67j47R3n7l4Q44qr26j42N37L90m34M29
3810D97k52n92K30k66K79j24j79J27j01P42K16p20L09l45M45J41j148N78M97K4
3830C58o61K31R2q53J189m03R2q7l76K60k29J10j47j49O37n11O00k85j78J017
3850G07j071N29o72M57K73p91L77o98J256M65j209J336j096J10o55J312O4P0m15
3869C49J73r84K02R71j171J5M00L41n44J06J62P9n10P56J3n53l45N53N59l62o00
$$ plain form
3726 35 311 578 344 52 -108 -842 -472 -533 54 565 -352 -164 268 276 222 -460 761 161 53 511 137
3747 137 188 -77 137 369 -383 -239 690 -152 -350 232 81 -708 -19 -592 -727 201 -707 328 -529 164
3767 164 -139 -803 -76 -472 -51 -227 -65 -306 203 371 391 262 465 653 645 -168 -430 -183 0 -737 -342
3788 -342 -389 -588 -300 -32 -317 -110 300 -66 119 -48 -195 -102 -159 -193 651 643 -283 -425 112 502 68 497
3810 497 245 -347 -117 -383 -104 -228 -407 -280 -381 361 577 -143 166 -179 266 407 -741 -163 334 358
3830 358 -303 -72 20 -833 356 -47 45 -42 -418 -158 -387 -277 -424 -573 64 -447 153 -132 -310 707
3850 707 -364 165 -507 -50 223 -568 -191 -889 367 832 -377 959 -137 -27 -682 630 694 764 349
3869 349 522 -462 -260 711 -460 -445 -45 296 -248 -142 20 99 -411 345 358 -195 -540 13 572 210 -390
3890c90M81j56N72o15m39M02J82O35l15P4m83p93J531r69M75N3r9j6k25P48o60
3911gn01O44m61N29p8l46r5P13J35j185J705j360K36J15Q2q3k63M74l87P47j181
3932e67P3K49J83n20J95M43K27n25Q01j61q11J46K79k61N35o31J014n52j28J37
3952A26n87O48L15q91L4R1j01R2Ok15O26j24N12n51m82O45j99L3J7J71m94M22
3974I4n78M29l08J58N47n57J90j49p0L43J54k34k89L87j50k51n4M48p34O28k7
3995b3J86J26q51Q25L15o83K82k55k21J69n2L27J52l55K67n42R45l54m21mM61
4016B94q82j95N42M05l55L74l40K64P6m29l3P45p85O18Q0m42l11N69l54R03nq56
4038a17K80n10K38N28j047P35J2q90J262n89m42M06k11L17l73N71K00n50P66o42
$$ plain form
3890 -390 91 -65 507 -108 -547 -145 37 672 357 431 -52 -845 686 -283 192 245 146 130 -95 653 -7
3911 -7 -508 136 -325 204 126 -220 -315 398 533 -652 1053 -307 -71 44 126 43 -220 254 -133 614 -567
3932 -567 -494 -245 -62 -582 -387 56 283 -242 559 398 -413 -267 12 -249 286 -345 669 117 -11 126
3952 126 -461 187 502 -389 -355 -264 -365 -273 -267 -482 144 20 532 -19 -501 144 -55 -22 -5 166 -328 94
3974 94 -484 -55 -363 -205 342 -215 -25 -174 -244 99 253 19 -270 117 -33 -284 -338 110 -624 4 -23
3995 -23 163 289 -562 263 578 -105 177 -78 -299 -130 -182 145 297 -58 209 -333 612 258 -163 -167 294
4016 294 -588 -783 -241 164 -191 183 -157 107 183 -246 -279 466 -319 299 379 -63 -374 195 -159 744 739 -117
4038 -117 163 -347 -109 419 -628 107 119 -771 491 -98 -540 -134 -345 -28 -401 170 370 -180 586 -56
4058e6J09o32J033j168J96J449o83l1k32J76k45O45j058N6J20Q9K35l2N35l18
4078A88n78k8J073p62M65q13N21m97M15o4j42K28K41j67l19L88M7o63P29N2k99
4099A5k40M5k98K62Q19p48P79p25n06J292j326j90J050N48k91j94r20N57J048
4118I77j475Q50o10O22r26Q19l88Q9j5N29n78l93j85N67J155j209PM61p19Q8M24
4139I0k93R1P53q78K24r08J295m45k55P79l62N34k04q82J51o1Q96l56n27O11n5
4160A98k31M90m38n63K63k4N32n3l96J6N90R81j119n71Q50j247O72L82p25J36
4180b57p51J003M72j24k46n65L01N54n58n94P57n34M28M45r18L29L11m51P84j62
4200B24k81l41J33L36j14N94m93k59m22J169n85K89p74Q3O68n02M50N30j014K63
$$ plain form
4058 -56 53 -579 454 -714 -518 931 248 217 -15 161 -84 561 -497 -441 -321 -232 3 -29 506 188
4078 188 -390 -418 655 -107 358 -455 66 -431 -16 -80 -222 6 247 80 -239 149 196 -467 262 314 15
4099 15 -225 -180 -478 -216 603 -145 634 -91 -597 695 -631 -821 229 777 486 292 -628 -71 977
4118 977 -498 352 -258 364 -562 257 -131 -42 -57 472 -106 -499 -684 -117 1038 -171 -164 297 -422 -334 90
4139 90 -203 -112 641 -237 -13 -921 374 -71 -326 453 91 625 421 -461 -310 -371 525 169 -358 253 198
4160 198 -33 457 19 -544 -281 -305 227 174 -222 -206 384 1365 246 -325 525 -722 -50 332 -393 -257
4180 -257 -1008 -5 467 343 97 -468 -167 387 -171 -765 -8 -542 -114 331 -587 -258 53 -398 386 224
4200 224 -57 -398 -265 71 -43 551 58 -201 -623 546 -39 250 -524 -441 227 -275 175 705 -309 -46
4220d6m6n96J069n88K6J084j369R12l40n5L66m74N42j002O4K89K78o8l65P52p97
4241c64L75Mm48J020o73o4n48J535n35j71m28P5M69k21r0K72j63k83L2L61R8j010
4263g57R31q35J27K94N38K75p10N12m38O60l43O64j407L65lj38Q0o22P25J71O52
4284G41p66L20J70m01j44J86j39N07r52N70k63O9Q9K39M44j175P49L46k26K2j239
4305h53O62M10P89q69K9j32L80l14m57J30O7N74p09M29p22L77N02j69k27k58n55
4326i16R63J0m86L70J39QO7j34Nm06J7M89j60M16q5l86N41l73J55k31J62J50k22
4349I3L02r08Q57r03N13j53L96j331J610n73KQ40j085K7N9M89J8n28j64J451j405
4370c93J070j270K51J242j050L75p82R10L60j388N90K49j70O88O0q41M1L35r0
$$ plain form
4220 -46 -92 -688 381 -207 -181 903 -466 446 106 51 417 -57 485 -517 -453 -164 114 46 -319 433 -364
4241 -364 11 15 -433 587 -86 -150 -698 837 302 131 -297 -222 247 26 -64 208 45 -238 -206 155 253 -757
4263 -757 174 -661 -534 -240 298 573 -137 375 -63 597 254 918 -489 -124 -127 -265 -185 -807 -82 89 741
4284 741 -25 295 465 64 -80 106 -33 474 -478 92 -171 -102 -13 226 670 -505 244 590 364 386 -853
4305 -853 -191 219 1008 139 168 36 416 102 -355 -225 -158 416 -293 136 -586 -209 293 124 -103 -361 -916
4326 -916 47 57 -429 -59 80 88 155 21 26 -380 -363 126 -34 382 297 -89 452 79 234 3 165 315 93
4349 93 395 -513 344 -559 -46 -199 197 -1134 476 -97 -95 745 -340 -313 -254 235 253 -275 -439 1012 -393
4370 -393 677 -593 -342 900 -150 225 -557 353 713 -675 -85 164 -6 682 742 -99 -58 277 187
4389A87P4k75O96n37j30R70o48J76k21o14R01l31J51K94q21j29P01j088L44j72
4409d72P28m70M08j12K15m75k48N37M10j43j032J381j61n83j64k52K80J78l55
4428c30k54K48L60M93n03k36M76n34O01n3l60L51r7k50n21O18l49L52j24L21k17
4449hM9L42p96M16p08O86K95M57j047N93o50k94K99R65o17K74J59K75m74n11J05
4470a90Q06k35r18L94n07J3J08k56R24K98j97n66O99o41N28m11m01J071q78K36
4490a23j45K05l4p01J106k70r42J456J39q61P7O97o06k44J194m97m42l83P0o23
4510i27L87K25O9K74r93O80k16K81k70Q21k74r88J002o23Q19J19n34j63J117j122
4530c16J39M37J14o67P27q91N82m77m34J051m70J73n93O33Qk34K51k05M03n44
$$ plain form
4389 187 261 -14 682 145 15 985 337 513 292 -322 579 248 399 693 -128 -257 444 -644 -300 -472
4409 -472 256 -214 194 82 297 -178 -426 111 521 378 -654 727 566 -17 -181 -433 -153 25 -330
4428 -330 -584 -336 24 517 14 -222 254 -280 321 268 -92 259 162 -88 -609 9 -340 12 -112 209 -8
4449 -8 41 383 -413 3 -705 -19 276 733 -314 279 -371 -665 -366 599 -18 256 415 690 216 -295 -190
4470 -190 616 381 -537 -143 -650 -637 -529 -785 139 437 240 -326 373 -268 260 -151 -552 519 -359 -123
4490 -123 -268 -63 -97 -798 308 38 -904 552 691 -170 -93 604 -2 -246 948 451 9 -374 -304 -927
4510 -927 -540 -315 -246 28 -965 -285 -501 -220 -490 331 57 -931 71 -552 267 386 -148 -311 806 -316
4530 -316 -177 260 374 -293 434 -457 125 -352 -786 265 -205 -32 -625 8 16 -218 33 -172 231 -313
4550c13M65m19l14N45M3N34j082N58M58j42K46q26O79m94M31L5J43j42n32N94
4570D67q89M9P03o6O94r90K50J10p1j45m68k81J42L26J45K94m14j26l88J201k51
4591B92l6o60M82l3K51n69N21l25L89j259J422O71j601R10p38O31o06K0l57O84
4611H9l72P25l13Q71j192J84L93r44j68l0J87J233p76J01M58m55O03p99N19m26
4631a12M49j6j10p27J148j100L57O28k37k36J48l28m04L68M3M89J22r11J01P46
4651D18K66o96Q41o42q4j08J43l34K1l87R53q02l52Q59K14p51M03M8l05O93k78
4672A20L99K29m65J5n91K06j29P57j12o23M1N75l1k22j082J309K27p64j30R02
4692F31m07o11N33Q4m31k38j73P63m07j06Q58m01m38Q68m14m28K12o8k32n45L83
$$ plain form
4550 -313 152 -267 -581 -36 7 541 -541 17 475 333 579 -247 432 -62 369 404 547 405 -127 467
4570 467 -422 -373 330 264 958 -32 218 328 257 112 -356 -637 -495 -169 -24 270 -144 -270 -658 543 292
4591 292 256 -404 78 45 296 -273 248 -77 312 -947 475 1146 -455 455 -283 348 -258 -238 -595 89
4611 89 -283 442 129 1000 -192 -8 385 -559 -727 -757 -570 663 -113 -12 446 -9 594 -205 314 -112
4631 -112 337 321 211 -516 632 -468 -111 517 280 44 192 -136 -540 -172 -129 360 482 -429 -328 418
4651 418 684 -12 829 187 103 -5 138 -196 -175 -562 391 -411 -763 96 310 -441 -38 10 -295 398 120
4672 120 519 748 283 298 -293 -87 -216 541 429 -194 -153 422 391 169 -913 396 623 -141 -271 631
4692 631 224 -387 146 230 -201 -439 -612 151 -256 -362 496 95 -343 525 111 -317 -105 -173 -405 -950 -567
4713e67K73Q20o57j24N12L04o68m4R2M10k58L35q02K09Q53p82j80L1J83L19k95
4734c6k50j08N32L2j44o74J658j048k25J82k46J41j66J143n21m40k61J53RK30
4754c9J278p58L47n09j29n01J68K99n87P46M49k44q66R1R12r31p8K38p1N60q1
4775B94k74J10K9l21K18k45p5n14J275l90J56o59M23Q77q85Q0M55p86N15J14p19
4796c22M89J28n92O27j132Q61k90L88m77k84O64j3n46L49K52P26j282K44m55R0
4816e75M33L50k64m21J04M47m82O38L6L0k69N10n70L2M8K45Q3j011q5J386q00
4837a35L86J96q37J778j103k23l27N31n65Q39p55N74o96J33J91k0O69p58K63n50
4857d09O13m39O91m57M3K29n54M03o64J036q51P8J51K72j001J535j347M50N82
$$ plain form
4713 -567 -294 526 -131 -255 257 561 -107 -151 -59 351 93 428 -374 -165 688 -94 -274 -243 -60 259 -36
4734 -36 -286 -394 138 170 26 -648 1010 -38 -263 -81 -327 -186 -352 791 270 -170 -431 -278 -269 -39
4754 -39 1239 481 828 319 190 -311 -143 156 -431 315 764 520 -346 -255 657 -274 -352 -114 -185 375 294
4775 294 20 130 159 -162 56 -189 -264 -778 497 107 263 -396 27 904 19 99 554 -232 283 397 -322
4796 -322 167 295 -297 330 -802 59 -231 157 -320 -604 60 47 -499 -150 102 828 -454 -210 -665 -575
4816 -575 -142 208 -56 -477 -373 74 -408 230 266 296 27 537 -33 -1 47 292 375 -636 -721 665 -135
4837 -135 251 447 -390 1388 285 62 -265 266 -299 540 -215 359 -337 -204 -13 -33 636 -122 141 -409
4857 -409 204 -235 456 -1 42 271 -283 120 -544 492 -359 -281 -130 142 -859 676 -671 -221 361
4876C61m37K66l17n23J31J46k75P85m88P16k59R66q95P2k51n31L15R66k63q60
4896c75P24p84N76J5j120J191l3n08l4J32O8L20m12mj66R2N55p67K30K6J086q47
4918c5n51L65N27m12J39r2j22j10j23q4L44P06m63o10l24J700r56p19J514r98
4938c04K24r1OR86o37N61k39o01M91m0O2j99j79k11Q24m99m98m13J27J040k98
4959A12K79j162k72O58Q38q23M3l2j65R65r53K63j17O24m35O59j154J325p74N06
4979C85n56K99L98J7l35n82J330l33j118M86j22r7J119r99j61j34j9J59m99Q95
4999A33o3M32q13L65k73K69j76N34j35np19L97P36m43Q70m15q56j18M29p84J715
5020A080j405l44R43j27l8n41m88N82J47L65K15l38J43J68k46M16m22r67Q21K48
$$ plain form
4876 361 -76 190 -127 -650 -519 -373 -648 137 -351 365 106 1072 177 249 -2 -533 -218 748 485 -375
4896 -375 349 -435 141 156 -964 227 194 -314 -348 -216 -148 172 -240 -244 -410 -318 237 -530 -300 -274 812 -35
4918 -35 -586 -221 306 -106 33 -59 -181 -291 -414 -498 -154 552 89 -521 -845 855 -101 -820 694 -304
4938 -304 -80 -171 -165 821 184 745 506 -95 396 356 418 219 40 -171 653 154 -344 -757 -630 410 112
4959 112 391 -771 -1043 -385 453 -370 -327 -359 -524 441 -512 -249 -366 258 -177 482 -672 653 -121 385
4979 385 -171 128 526 543 208 -374 956 623 -495 -9 -131 -228 891 -108 -269 -403 -422 -263 -762 133
4999 133 70 502 -311 54 -219 50 -126 408 273 268 -451 -54 682 239 1109 694 -162 -280 149 -635 1080
5020 1080 -325 -669 274 147 109 -432 -920 -338 -191 174 389 51 194 362 116 532 110 -857 -36 212
5040B12N19k85o42O5m48J041l93P5j59k01k95K24K43M71o63K44L38o23J92j97
5060b82K32q8j102Q91l23J022k62J41J86q60R92j083O92o82N99o5m9j00Q2o9J98
5081G0l25O1L74j35m0l50M33o0J26N4N71m32o4o10N79j169P42P64n18J45j97o6
5103d7J22Q99j084M8N1P1L17L73o27l64M67j17k70k1N65j034J35M97K36p25N24
5124A6N52n21J77l07O39m87o04K08k6L90q1l42N23j01j17J34K79o16RJ54K05m60
5146c76N67L49o64k29M97P82j361P29l96K3K86k61K93K55n68K74j31L1J62o40
5166c78N2P67o91p52J349k53l98L69k24p79L60R02j99k50J48k57N75n82M51N46
5186G56j694J434j50r84M21P7l09P22L83n14l93L32N59J3r8m54j18K71j107K92
$$ plain form
5040 212 731 446 -196 -131 -579 462 69 144 -15 -216 -511 -287 -44 427 -236 8 346 -277 -85 -282
5060 -282 -50 -138 -1240 -349 -672 350 88 229 415 -445 547 -536 156 -526 73 8 -41 -141 -59 -128 70
5081 70 -255 -194 180 45 5 -345 88 28 154 208 779 347 283 -327 252 -917 -175 589 71 216 19 -47
5103 -47 75 974 -110 -62 -11 60 377 750 123 -241 226 109 -161 -182 383 -651 -516 -19 217 -508 16
5124 16 568 47 224 -83 556 69 -535 -327 -353 37 -44 -386 137 36 -81 53 332 -284 -275 -121 84 -376
5146 -376 191 540 -124 -353 144 926 -435 294 -102 -79 207 -54 239 494 -74 200 69 100 262 -378
5166 -378 -326 441 -250 -1002 347 94 -304 65 -159 -938 -578 324 125 -125 23 -234 341 -241 210 756
5186 756 -938 496 346 -638 -217 -140 -449 273 656 142 -251 81 640 653 555 101 -17 254 -853 -561
5206e61L62Q48j58o85l72N46j67p4J65K40Q9k92M57n82k44O19k30l94P7K6Q85
5227E55j153L64J052j212j75L63j02Q3n4O60p46M77j35M24m69L29J72j073R68
5246C28R6n56K45K52p55K56r66O05L31l35P02P0j04J31l71p18Q03P67j041L41
5266H1q71J314m77Rj65N8k62j75J94J2M47m46l28L82J202j134j60m90J124L89
5286G04j344J458r34J88K01j116P32q8%m09J350j118j19J237p44k83JM28J9L32
5306D95j24n60l20N6Q78M6j154R82r18J028k89pK00j69n86R68j140K66L16k18
5326b50K80n7M06m40O8N81L78j392L46L25r4L17l21n6L90m20J85K41r00K6J152
5347G65o08l60J45l13M55j29n53J08N26K1J62j34L62J05n29L09l62l16P35J57
$$ plain form
5206 -561 -199 649 491 -194 -566 -20 -187 -261 -96 144 233 -59 398 -184 -428 191 -39 -433 -356 -330 555
5227 555 -598 -234 818 -394 -569 -206 -308 -225 -279 381 -365 112 -23 401 -68 261 433 -640 328
5246 328 424 -132 113 365 -390 -134 -1100 -495 -164 -499 203 273 169 300 -71 -789 14 781 -260 81
5266 81 -790 524 47 56 -109 -51 -313 -488 -294 -282 165 -281 -609 -227 975 -159 -319 -809 315 704
5286 704 -640 818 -116 72 273 -843 -111 -199 -199 -608 742 -376 -495 742 -2 -285 -284 144 163 495
5306 495 371 -189 -509 -453 425 471 -683 299 -619 409 120 113 313 144 -442 526 -614 -348 -32 -250
5326 -250 30 -27 379 -61 7 588 966 -426 -80 245 151 468 147 91 481 61 246 487 -413 -387 765
5347 765 157 -203 -58 -371 84 -45 -598 -490 36 57 219 85 447 552 23 332 -30 -346 389 546
5367E46r88O17p97j09j71O15M53P15p02L47j107O75j52J39Q65j163P39o26j36
5386b40QN53n72P6Q6O58j036L72K9Q79o03Q87o71m83J36j50k92L03Q57q72j90
5407b65R46m64l0k71O9p2L25M57q92O09k67N35r48K06N37m68K81l93K97n00P0
5428b38J95K72j8K23q53Q32L58j425K48O74l00J170j137L27M1L2q20L52N43p44
5448b68o23L48O53K22m24k26J99O2K76m81L01N56o42o92J061L8m77L15m08M68
5468B58l04J7j52K53K67k66M34n35q76R40j88K13p00K86O20m05q50J637p61l72
5488d84P4L94l48j7R65o30L34k67m4l56L82k77j03K73J25l4j90M53j82R5N47r53
5510b43J093j405L07P38k44n27k42K51o82J095q17J53J225j291J98Q40K0m85k6
$$ plain form
5367 546 -442 175 -622 -731 -902 -287 166 881 179 526 -581 94 -58 81 946 -217 522 -104 -240
5386 -240 -232 321 -251 -175 -89 569 -467 -95 -66 813 210 1097 426 -57 79 -71 -363 -60 797 -75 -265
5407 -265 681 217 187 -84 -15 -87 238 695 -197 412 145 680 -268 -62 475 7 288 -105 192 -308 -238
5428 -238 -43 229 211 434 -419 413 771 -654 -406 268 -32 1138 1 328 369 401 -419 -67 476 -268
5448 -268 -891 -543 110 332 -92 -318 -119 -57 219 -262 39 595 -47 -739 322 360 -117 198 -210 258
5468 258 -46 -29 -181 72 339 73 507 -28 -904 36 -152 61 -639 -353 267 -138 -988 649 -112 -484
5488 -484 -410 -16 -364 -381 584 -46 288 21 -23 -379 3 -274 -377 -104 21 -13 -203 250 68 163 710 -243
5510 -243 850 -555 -248 490 246 -281 -523 -272 -954 141 -676 -523 702 -589 -391 449 469 -16 -42
5529d2q0j08J14o04N96n29M19M80q99J257p48J101j340P48n04N86o49M68k3o0
5549A83N36o9m28J20R5q1o18L12j66r3m6N32l34r0P0n1k53Q30n79m0L93q16N22
5572g1L2pl03R24n62n70K08l3O98l05n46N52m03P37k81k7o89N77n83K09n38J022
5594D1l70J55K58l65r01J269O14j153L66P50m08R0j14l14L59kn88O65p86O43k79
5615g0L59j284N43k6NO51n42l43O87n3P36m98n08N92J5n39L2R81j033L35o38J151
5637E53q52J84O78n42L24k56J83k88k86L40j27J21k51M25L02n34Q89n69j286O02
5657c90O4L65l06j34j2L22k62P01l56j50K84J48j67l8q0k32Q92p74k75P0k88J311
5679F93o20o62K47M58n15L87K04p52p1K02L04j09M88l83P40q91J205o61j76j35
$$ plain form
5529 -42 -122 -230 -116 -720 -124 -653 -234 246 -653 604 -144 957 -383 365 -139 447 -202 266 243 183
5549 183 719 650 222 342 437 356 -262 50 -116 -209 -255 277 -57 -147 -77 -128 -381 449 -130 -170 223 -593 -71
5572 -71 -39 -46 -349 575 13 -557 -349 -382 316 11 -535 17 -386 351 70 43 -646 -69 -652 -443 -981 41
5594 41 -329 -174 84 -281 -1182 87 701 -452 -86 664 256 346 232 -82 277 275 -313 352 -434 209 -70
5615 -70 289 -995 -452 -478 -473 178 -364 -707 -20 -73 663 165 -343 249 264 -275 -243 738 -295 40 -598 553
5637 553 -299 -115 563 21 345 89 272 -16 -302 38 -89 32 -219 206 508 -26 863 294 -992 -390
5657 -390 -326 39 -267 -401 -413 -91 -353 348 -8 -158 126 274 107 69 -11 -243 649 -125 -400 -330 -618 693
5679 693 73 -589 -342 116 -399 -12 192 -560 -631 -429 -125 -234 254 -129 611 -280 925 264 88 -47
5699d7M90m62Nq12P65L71m30R13q88J62n85Q73k84K19l98p3Q8M36q15j85L41L15
5721ao47K62M47Lj144J352K21o82J39m01P96r76Q39j199Q82l48O75k86l4M25p40
5742d17j89L94m11L79Q15o45m61Q0J036m22k25l01R81m45j203P47K11L92L87p62
5762e9M01J83j42K87n74n01j73J216m62p49N73O10j5q40L71m80O99l30K13J99
5782D27j13o21k55K44N94q4r21J156j061J086l77L12k83j59k80K66J9K09J84n6
5802B87p44N02O3j96P00j105Q86l08l13l41L77j17L36K63k99O26j084N64l53O76
5822D20Q4p65K59L92o02K58r4J88l17l53K17O00l03m68J023j38o75P02n06l64
5842d42Q09n48K47j10q8R3k9K02n51K45k2K96r66O70K25N96o85K07N56n02k58
$$ plain form
5699 -47 443 -19 -14 -826 -61 310 -120 793 -95 67 -518 355 71 290 -108 -181 -93 343 -472 -657 -316 -1
5721 -1 -648 -386 61 64 -1080 272 493 -189 -50 -451 345 -631 208 -991 -109 -457 218 -68 -102 323 -417
5742 -417 -606 -212 -623 -244 571 -74 -535 -455 581 159 -66 -367 614 169 -1034 -287 -76 316 703 -59
5762 -59 342 525 383 670 96 -405 -578 638 176 -573 0 610 595 -245 126 -354 345 15 228 427
5782 427 314 -307 -562 -318 276 192 -729 427 -634 452 75 387 104 -55 -335 -69 -50 159 343 287
5802 287 -457 45 108 -88 612 -493 393 85 -228 -569 -192 -309 27 290 -9 617 -467 97 -256 420
5822 420 504 -261 -2 390 -212 46 -48 140 -177 -530 -313 287 -16 -484 539 401 -274 428 -78 -442
5842 -442 367 -181 66 -44 -132 -39 -68 134 -417 -172 -194 102 -864 -194 31 627 -58 149 705 203 -55
5863e5NN87o94q70N31J004p36K64o04N71m65O13o44RP53n83M09k79L95k26j33
5884a48P6L70M5k90l50q0n48J237O40n87l02q1L98n55l20M34l61M32n7j2M26l43
5906B4k36l82N81L71r38L5P78p97p4O0Q78l43O95r04L96L89p74j13J173r06k16
5927c03J48J57n27L91l22O1J3Q19m94j11L3O59q67p1N10l16l25N54J39l19K13
5948D2l39K52J27kO36o49k8l3K80m99P02p75P74j238O21K80n98J003q10o3M79
5969A62K27n00L34n07L79M95j91m54p91R66po50M8O50p97J184l5j395J231l42
5989Gk39J268j239N36m38l28O08K51r99J054k0q59J347p64o8M1k15P35m97m00
6009b19L25k83L74k48p96R93o25M06N01j94K60j54m39M15j56m43P7m7J68k77R16
$$ plain form
5863 -55 -50 537 -157 -1027 -496 508 -228 36 -568 3 -462 151 -493 -484 269 -314 95 -184 211 -15 -148
5884 -148 -72 298 343 53 -297 -377 -925 312 952 365 63 -18 380 -175 -495 -61 -422 10 -47 -59 367 24
5906 24 -212 -594 -13 358 -580 -545 233 -564 -638 -578 300 -43 652 -252 144 533 -241 -354 819 -87 -303
5927 -303 -155 2 -525 -134 -456 -395 -382 437 -57 -168 -135 524 -343 -414 96 -220 -545 9 148 -171 42
5948 42 -297 -45 82 80 716 67 39 6 286 -213 489 -286 488 -750 -129 151 -447 556 -254 -317 162
5969 162 389 -111 223 -284 95 590 399 -55 -846 120 113 -537 -489 161 -636 548 513 -882 349 7
5989 7 -232 1036 -203 333 -105 -433 175 426 -573 481 461 -398 949 185 117 158 -57 678 181 -219
6009 -219 106 -177 197 -51 -847 146 -479 -73 428 234 494 340 -99 316 160 -283 -206 -253 -85 -362 554
6030E54r93J503j068n69J275j052N07n18M66K76j167J154m56K53M16j085P18p87
6048e73K7N58k71k15J049r28J79l17N90J41K35l51R7K04m08m29l67P25N02m57
6068in58Q48r2k35J93j88M27p7j46k32n27M08n13J168o96O8K12M42j015P28m27
6089b21M41k52o6N57q53K25%l42P9N91k58N62l84j32K59l49P37n12N90L86j885
6110h27N10P8J2O66p45j63J72L02K11L25k64q64N31J3O20k68J53k16n90M79m72
6131c37O72n92l9R07j025J18K6Q35q71O58q35N90n9l63N13j51k34O09J0p96L5
6152c29L8Q05O35j095K38r0j238Q87O6M05j011N95j93Q50o67L92o46J15O21r8
6172B80l53M50J50r76R07j33O7k24N64o15o2o22l20J351L35k3o26K92o34P69n26
$$ plain form
6030 554 -439 1064 -4 -573 702 -350 157 -361 105 381 -786 368 -88 165 581 -504 214 -573
6048 -573 -546 12 -259 -474 575 -353 -174 -491 99 240 475 124 221 425 17 -412 -779 -54 448 -9
6068 -9 -567 281 189 -46 147 -41 386 309 163 -69 -596 -188 -701 467 -229 -161 51 493 -522 206 -221
6089 -221 220 -32 -98 459 -394 -169 -169 -511 -432 159 -99 463 79 -53 206 -143 594 82 672 1058 -827
6110 -827 -317 -239 -227 439 -306 -469 -297 5 216 541 277 -587 -56 -43 577 309 462 246 -344 135 -337
6131 -337 335 -257 -296 611 -414 -296 -270 565 -306 352 -483 107 48 -315 198 47 -187 422 432 -364 -329
6152 -329 -291 514 1149 54 292 202 -1036 -149 -83 322 -689 -94 -287 563 -104 288 -358 -243 378 280
6172 280 -73 377 527 -449 458 325 392 168 732 117 55 -567 -887 464 799 776 150 442 -192 577 51
6193E1n31J038j366N55Q76p55J71m02P36M17j014K61K06l11p1j39J72JK26J80
6213C01j30K49L82j560K363k133J347q11j49O78o70k68K7J10m44Q59L59j21p70
6232c81P82j05j95k95k56M38q3M36j01K91k42Q5r54O01K61p17m5L24L9J99p9r10
6254i07J279l91n21K64N53l52Kn8K44j27p93J44J193n2n77l34J353q19m22O38
6274C17L47n7l74L86r07K65M71m68l57L6J87n42K63L50l61O84k55J97j499J546
6294B29L75q32M13j153P28L48p64M43J101m91l25k65m4o2J22J99k33j31J02J31
6314a09Q34q08K4m4k75p1R73n68N08n00L71j51O7j80M48n40p54M05L34j48j3r8
6336b95Q71j40m93N38n06K33n19O13o33J037j016Q7P13q96R21l26N0M25r48NQ64
$$ plain form
6193 51 -480 558 -808 -253 623 -132 39 -363 373 790 -224 37 243 -68 -139 -278 -106 -105 121 301
6213 301 171 420 802 -758 1605 -528 819 8 -141 537 -133 -401 -374 -264 -708 151 510 389 -381
6232 -381 401 296 101 -194 -450 -12 -95 341 240 531 289 374 -580 21 282 -435 -480 -156 -117 82 3 -907
6254 -907 372 -19 -540 -276 277 -75 -73 -131 113 -14 -807 -663 530 478 -99 -433 920 101 -321 317
6274 317 664 607 233 619 -288 -23 448 -20 -377 -341 -154 -696 -433 -83 -444 240 -15 182 -1317 229
6294 229 604 -228 185 -968 -240 108 -656 -213 888 397 72 -193 -237 -299 -177 22 -211 -342 -240 -109
6314 -109 725 -83 -59 -103 -378 -449 524 -44 464 -36 335 184 251 71 519 -21 -775 -370 -36 -184 -197 -295
6336 -295 576 436 -57 481 -25 208 -311 302 -331 706 -310 -223 490 -406 515 189 239 664 -284 -279 585
6357E85p14K98k29j14m11O85N75r71J165j707P65r8L55m08m30J112k30r98l21
6376a091M56Q60P46q87QO30p3n82l2N5l01K65j99J87M26p03M35k01M9K57m38j39
6398b72n8M71K38q50J30J169j032N70k06J18q14J74M96m98N11n52J1N7O75q82
6418e44j20J099p08L60M46o24j167N25P01m0k21P03j14q33O97o4K77m74O72n42
6438B9M41m70l36N92q44K12j1p4P36j22j79O1k14M29k03O4L45o56L70m84O91q
6460C69k95P73o32N13o48K7K94k22j1L26l92l72k21J386k87l55k95m75J98j66
6480d85K93L12K00j49j88N23k54q6Q3m3k60k99R21l83K49n33M56o51J171o03q70
6501e96J60K47Q66j015L57j253J871m37M76q74N67j54L32j19m2J52J54k32m48
$$ plain form
6357 585 -129 169 -60 -174 -585 100 675 -296 869 -838 -73 -171 184 -224 -654 458 228 -770 -1091
6376 -1091 -635 225 971 84 92 722 649 67 35 90 -211 54 -145 42 468 -235 200 -1 48 305 -133 -272
6398 -272 -330 141 379 -471 -341 828 -204 366 160 278 -536 -362 134 -364 147 -405 -394 -337 338 -544
6418 -544 -664 435 -273 87 533 -91 -1258 -733 -32 -72 -293 410 296 -537 160 96 373 -101 571 29
6438 29 470 0 -336 256 -588 -376 -387 -461 275 153 -26 35 -179 250 47 111 456 -200 170 -314 377 369
6460 369 74 847 215 728 80 107 401 179 168 494 102 -270 -491 895 608 253 -42 -517 -319 -485
6480 -485 -192 120 320 171 -17 506 252 166 249 206 -54 -353 568 185 434 -99 357 -294 877 274 -596
6501 -596 -436 -189 677 -338 19 -1234 637 200 676 -198 369 215 547 428 386 538 692 460 12
6520A2j85L37m44m2K86l29RL58J97O0J40j048J255l25m19J17l14J340j043j38
6540a76p57N52k0Q74q02j78p8J38J85P98k58K04q04j42O64j40K60M01r32k05L84
6561c2n68L61M54lk63R73j318m64Q47P53k87J9k03M55J59j378M99j18n74K47N26
6582H5k49p24N46N96K26k18o34R2P13J0j71o30j86L05N56J47n20P06j588Q83K92
6603B37r9m39K84J74l49M19QK22m02n2J14L82J00m28J47K35r66O77k13j20K30
6624A61O80p95J13l11l8O03o39M73m53L32p69M99Q51j274k67J117J62l90k07j78
6644c30K96L23J73k21n77l22L67l05L79l40R35j395J781r89K34q93R90l61L40
6663H5q65J043J45l61l55K31L63p21O51M71o86m1m22R68m66j52L68j42n93N47
$$ plain form
6520 12 -173 164 -280 -322 -36 -365 -356 2 199 259 399 -649 606 281 -138 -21 -335 1005 -38 -176
6540 -176 -933 -381 -401 473 -329 -507 -585 -447 -262 536 278 482 -322 -464 200 60 320 721 -211 -416 -32
6561 -32 -600 -239 215 212 -51 922 -396 -860 -13 740 453 472 269 724 883 -495 4 -114 -688 -441 85
6582 85 -164 -888 -342 254 480 262 -372 -280 433 443 272 -358 -544 -239 317 464 -56 650 -938 -55 237
6603 237 138 -301 -17 157 -192 227 235 457 55 3 117 499 599 171 318 553 -413 264 51 -69 161
6624 161 841 46 159 -152 -190 413 -226 247 -206 126 -643 -144 707 -567 -834 283 445 55 -152 -330
6644 -330 -34 289 462 241 -336 -658 -291 -596 -217 -557 378 -1017 764 -225 9 -884 106 -255 85
6663 85 -780 263 408 47 -308 -77 286 -435 216 687 1 -40 -462 506 40 -112 256 114 -479 68
6683F8J76r70J362o04m88k52N14M15m56j7L64o6m02P2O59l07n91Q42o57P6o6o84
6705a012J066J4q19J525j563R91m06J73J51q7l27l53M78M39n5o71J12P30o55J35
6725a34KK87P4JN49q13qp9L13o11J028k61m04m29O22j15n13K89j79L30L2K09j187
6748i97P66N2n6j04N7j13j18L83j65O92n30k69J113K71r83k22M65J8j87p23J49
6769e01R00j8o4k94M82j23m5M11m89KN05r18j41N08k11N06j054O25j89j60M73
6790B05m53N26K64j364M49N84j71l6R6p5p65O0P66l01J165o51n6o27M02k4j66
6811a72O17k26o55l59P11n86K58K13j81n4K60j88L73q08J557r26O5R3j8m92L82
6832a36M50o31K73M12p9p48N18L10o19P87p49R53n16k16K52n68J09k48N53k85
$$ plain form
6683 68 244 -726 636 32 -456 -708 -194 221 -235 -252 112 46 -356 -284 375 68 -523 319 -338 -262 -328 -1012
6705 -1012 54 68 -751 774 -789 202 -204 -31 120 33 -294 -647 -169 270 215 -456 -344 386 -269 -134
6725 -134 -132 155 229 230 779 -34 -42 -121 192 -419 609 348 -56 -485 137 22 -491 -202 -381 -51 -19 190 -997
6748 -997 -231 -179 -235 -339 -282 -395 -513 -130 -295 397 -133 -402 711 982 -1 -223 242 260 73 -650 -501
6769 -501 399 381 317 23 505 382 337 748 259 261 766 -152 -293 215 4 510 -544 81 -108 -268 205
6790 205 -248 278 542 -822 -373 211 40 4 100 25 -740 -680 86 -215 950 299 243 -384 18 -6 -172
6811 -172 445 219 -436 -795 -84 -670 -412 -199 -380 -434 -174 -362 11 -797 760 -166 -101 -8 -26 -518 -136
6832 -136 314 -317 -44 368 289 -459 59 369 -250 537 -212 741 225 9 261 -307 -198 -446 107 -178
6852a78J94n68N40P85o46j28L91k8k10n53M38j16o90Q19R6k2j018J287k64k5N37
6873F41m33m12K92k28j38M21q26M59lP59N5j045Q29m47m13J183l58l48M76j44
6893C20k75k0K87L75r91pJ5L33L70o56n14K48L78L8j20k12j76O99J15M5l96L86
6915B42j40P1k8K39j475J336K36l37k20l05N67J12K32o09k86M06J97m38j62O93
6935C31k64k15k84K80p9K27m46L79K99O0o12J358q13J53K43o3p94j45K28m65J50
6956d72P72k61j510J759n33K00M16k46O65j76j219o2J3J723l14p80J67j22L8K3
6976H1p93L42N73J42n78J61r5k4J7R58j052N23J61j008J089j50l66N71j216P21
6996E7l80J96N5M70j154K41O15j40L54j098O42k25L8J48l82O27M57m18m33j46
$$ plain form
6852 -178 16 -552 -12 773 127 -1 390 362 152 -401 37 -79 -769 50 146 124 -894 393 129 104 641
6873 641 208 -204 88 -140 -278 143 -683 -224 -227 532 587 -458 371 -76 -489 694 336 -12 464 320
6893 320 45 25 312 687 -304 -311 -296 37 407 -249 -763 -515 -137 -99 -219 -431 -607 92 207 252 -144 242
6915 242 102 173 145 384 -1091 245 481 144 -76 -381 186 298 530 -79 -365 41 238 -200 -362 331
6935 331 67 -148 -432 -152 -231 -4 -450 -71 228 288 -324 1034 221 374 617 554 -240 -385 -157 -622 -472
6956 -472 300 39 -1471 288 -245 -45 371 125 790 614 -605 -667 -654 1069 755 -25 142 20 58 81
6976 81 -712 -370 203 345 -233 -72 -167 -191 -174 784 -268 255 416 -592 497 347 -19 552 -664 57
6996 57 -323 -127 -72 398 -756 -515 100 -40 314 -784 -142 -367 -329 -181 -563 64 521 103 -330 -476
7016d76M52j05n8K15j79k82L06R29j041N79n81j41m68R31l62L48L5R81p97p23
7036d37N78M1l93J33K3j37J88j0J87n65M2p8J87M20j061J053k81L22j111K80Q85
7057B66o77R94k94k68P3L50j042J242r27N02M3j02M41q94K29N8L61r32R4J21O28
7078B66l23m69J071m71k20K99n13O46L30l19q3r2J67k13M30p23l48J053k58l00
7098g0P0J20o62l35J62L81L51K58q57J81k74k03J086N48j059J44M94l55q44M95
7118c69N89O6J24j96M36o39j14J79Jk68M00K18p09L52k01R9m62L75r10R99jJ55
7140A24K75k03K49j334R50O73n07J19m17j77L23n18j21n73P09n07J717n85K02
7159C99n22R47r11j91L5N93p5j64o05O17k48Q47q30j37Q0K17p94P13j93nQ12l22
$$ plain form
7016 -476 -24 -129 -187 28 -151 -433 -127 802 -239 340 -241 -382 -850 81 -281 67 102 1083 286 -437
7036 -437 141 182 -211 -78 -55 -192 -4 -14 173 -392 -350 -428 -241 179 -882 171 -110 212 -899 -619 266
7057 266 -411 583 289 21 94 444 -598 644 -283 219 262 160 601 -293 -64 -6 355 -577 -483 -362 266
7078 266 -57 -526 545 74 -146 153 -360 286 616 297 214 122 289 76 506 -217 -565 488 230 -70
7098 -70 0 120 -542 -877 -715 -334 17 275 -582 -401 -675 -878 208 756 -303 -159 335 -20 -864 -369
7118 -369 220 286 410 214 650 11 -103 76 77 -191 209 427 -282 70 -131 -32 -494 -119 -1029 -30 -31 124
7140 124 399 196 445 -889 61 734 227 346 -71 -248 75 -443 -564 -1137 -428 -935 782 197 399
7159 399 -123 824 -87 -278 -243 350 275 111 -494 123 -125 722 -108 -245 -165 52 -742 -29 -222 -227 585 263
7181B63j93m65N99N3N29j812K83P06o1L51L1j61j54k61R14j301M96Q17k7r31M80
7202A56K87q86p64M20O64P49l06n19O55m86j75o71J341M80r81l60j01O58k40l
7222h2j41J251k44o62j74J82p76J314n9n89L78n24M84k42oNk52j08M33k63k83
7243c58L28N7Q9k75L46K39N9q63O38P09k80o05n45J61J13J52L92l65J92L44r04
7264c76n23J539p30l48O29q89O50l08N64n38J94r5O71k7k5p73O35N2l3L46q33
7285b18j42N20K58n12j3N14j31m25R9K16Q56j013J84p24j94M16Q84J47m53k93
7305b4j21K41L49j403N29M34l30J30Q04n28J18n34o0K67j58N84O78r94j00M17
7325B99n39M64q39M97P33m22r0j72M21q95M84j32P54o9p25k96K7N79P08n82j47
$$ plain form
7181 263 70 -395 204 257 786 -1026 -743 -37 -98 253 284 123 -31 -292 622 -679 -183 634 607 -324 156
7202 156 443 -443 -1207 -787 -123 626 320 -199 456 -30 -205 -876 465 945 -36 -396 -497 161 -79 -82
7222 -82 -223 1028 784 122 -52 130 -646 668 609 20 398 -126 358 116 110 115 -137 -245 188 -75 -358
7243 -358 -30 27 116 -159 187 426 485 -378 260 969 689 84 -461 -300 -187 -35 357 -8 184 528 -376
7264 -376 -899 640 -90 -438 191 -698 -48 -356 208 -330 -136 -231 440 413 388 -385 250 302 269 615 -218
7285 -218 -360 160 418 -94 -107 407 276 -149 -50 166 1022 9 193 -531 -725 -309 575 722 269 -24
7305 -24 -145 96 445 -958 -429 5 -325 -195 609 81 199 -335 -395 -128 -286 298 976 -18 -118 299
7325 299 -240 224 -615 -118 615 193 103 -69 352 -543 -59 -191 563 494 -231 -527 -500 79 787 205 58
7346E8K4J85n14N77n44M88r70J83L92L68l19M03j068R75O74j068K47j54j18j03
7366b84m00M18p3N75m71L23R09q71l13L54J203j851J100j265Q59p5m80N94J23
7385C75n71K76K25k4K27o21J75k1l98O78n72K83N3k3N75l44r97J20M97m88J95
7406c80J014n92P85l15j18N71q03L30j143N54j39P56l0l12o47Q09r50J120l85
7425A25o16M05P66Pm14qp19N79J52K14o45J00L07k41k79O4J37N04j223J49R17
7446B81n40k15J30O61m50m61R74j91k41n69J04M86k73K6O60o43R5k5N1J68p55
7467g27J136K41j118O53K85j21j37p06O35k73M88l72j74M8k5P99M2n61M67p37
7487a57L13j42M78R4m16n63Q02n10Q66J13n30l78J44K32k53P3j35J12K16m87N23
$$ plain form
7346 58 82 267 -247 330 -214 274 -696 -513 -121 247 -72 331 -737 238 912 -156 91 -63 -181 -284
7366 -284 -684 -266 -339 236 -235 88 997 126 -187 167 1370 -481 619 -646 213 138 -342 252 375
7385 375 -196 80 305 281 508 -113 62 41 -357 321 -251 32 85 62 637 293 -704 -584 -87 -575 -380
7406 -380 634 42 827 512 394 965 162 492 -651 -97 -236 520 490 178 -469 340 -610 510 125
7425 125 -491 -86 680 687 273 265 -454 125 277 491 -154 -54 253 12 -267 -203 -66 438 -785 -636 281
7446 281 -259 -474 -344 317 -133 -594 380 189 -52 -621 -517 -31 -304 -278 382 -261 -166 -191 -140 28 -727
7467 -727 409 650 -468 185 470 349 212 -494 141 -132 356 -16 -190 -142 -167 632 674 113 580 -157
7487 -157 156 14 492 586 170 -393 409 -101 765 878 348 -30 114 346 93 166 31 143 359 -128 395
7508C95q69Q59j309J322p85l35N84J09J91O83J61j483M87n68Q26J52n28k57K47
7527a18L03O46j004r7j3K7J64p4P94k71q27Q23k2j037M85N42j030L76K93P04p33
7548f9r3L70l43M28l02M36j88o01j7J2J505m46j685K94M64J07O59n35o6l07R11
7569E34j075R0J06J024l79j21o19P54l76L65n17J55L63k28J28K2o43O98q7K07
7589D01K35r53O78q88O10j51j07K75K79j88Q0k17k12J51N55o38M82k52j00L87
7609D27r04j44L98Q75p29l40l26P49k51k10N08o9P7J78j121P45L32n88P4k04O03
7630H0M26m81m35P79K40j243J452n20j35L65j91m2j387J627k95r45Q72k07J92
7649A52o93J253j068o5N15k22K56l3o28j53J092r6l45j10M67N5q54R28j853J648
$$ plain form
7508 395 -474 385 -924 398 -387 -722 -138 -29 162 845 1006 -477 10 -558 268 420 -108 -365 -118
7527 -118 185 831 -173 -270 -283 -256 -92 -166 628 357 -470 353 331 -706 -221 321 -709 -333 -40 664 -69
7548 -69 -162 208 -135 293 -9 427 239 -362 -379 -367 1138 692 -993 -699 -235 -128 531 -4 -70 -377 534
7569 534 -541 -451 -345 679 300 179 -440 314 -62 303 -214 -59 304 76 204 226 -417 281 194 401
7589 401 636 -317 361 -527 83 -68 -175 100 379 191 271 54 -158 -7 548 -90 392 140 40 427
7609 427 -477 -621 -223 652 -77 -417 -743 6 -245 -455 53 -16 61 239 -882 -137 195 -393 -319 -523 80
7630 80 506 25 -410 369 609 -634 818 298 163 528 337 295 -1092 535 240 -705 167 -40 152
7649 152 -541 712 -356 -421 94 -128 128 95 -533 -686 406 310 -35 -145 322 377 -477 451 -1402 246
7669B46o35l41P62L20K55j31l20m83K07m53J224p84K34J07l22jJ22q7J33o40k3
7690f10N88L84k95J7j55K83l11j7M77k47m4J28j1q8Rj52K52k33l12P75j91m10
7712a63k76P68K35n34l78O09r24J169q95Q94m54l9O76p89qj59k20J058m06l53
7732a89K34M97l08k12L0K15J40j055P25K93j69O9l84M03j83O26m54J91r64N93
7752I8L65o03N06o27j86O52o69P66q1j37q16P64m56j82J50M23O35l46n39J043
7772G60j085Q73l46k44l06N41k99l24N67q80M31L37k24j27J027j080N46q30P42
7791G9l31l47k9J100r44M16o03L60j09N50k13M3J87J17m63m57J281p94N65n00
7811i2q6M4L62j51k78O18n73k36O96j81n18K14L44M68l27p86K03J076j452P21
$$ plain form
7669 246 -389 -730 32 352 607 476 156 -327 -120 -573 651 -133 101 208 -114 -115 7 -80 53 -587 -610
7690 -610 -22 362 67 84 -71 212 -99 -116 361 114 70 198 187 99 108 -44 208 -25 -337 438 247 -163
7712 -163 -439 329 564 30 -348 261 -663 506 -389 505 51 12 688 -101 -109 -268 -488 570 164 -189
7732 -189 45 542 234 22 52 267 407 -648 77 370 201 270 -114 289 106 732 278 469 -495 98
7752 98 463 -140 366 -261 -447 205 -464 302 221 84 -732 32 -424 -606 -456 -33 602 256 -283 760
7772 760 -325 548 202 -42 -348 193 -106 -430 137 -743 -312 25 -199 -326 701 -379 167 -663 79
7791 79 -252 -599 -628 472 -472 -56 -659 -299 -408 142 -71 -28 159 276 -187 -644 637 -157 408 -92
7811 -92 -178 -134 228 77 -201 417 -156 -392 304 123 -395 -181 163 631 304 -482 -279 797 -655 66
7831F6j318J178K56l5n8m65J88M71k56p39M97Q02l6m12N88j279J754j165j80J72
7851B9J04o43O97O77j039L86M32j181K43K50q0R73q86L72k20O52m70j002Q63K81
7871D38n59K67N4q9M5K79o94K92n18N00k92J20M17q87J150j9o79m55M63K56R43
7892A032j237N93o16J34PM94q99P00k04o2Q0r2p03P80J59K30q39r4R29K54k87
7913C59q45K19j35l50P79K57K34k55m94P96q56L85m22J69L29j30m72K23P03j32
7933C62n47O60j346J016j3p32N79mM42mq67N34k0p20O93N99o51o66R24K31k23
7954B47k25j09O79j415N93J57P83l46p84N01L05l50j86n18L00O46m86j46P73m70
7974e1m2j71j01O04j39p27R05K31l87o3n15O30k92O03j5O5j183J211k25j58k62
$$ plain form
7831 66 -1252 -74 182 147 89 -376 -188 283 27 -712 -215 587 551 139 727 -552 1202 37 -143 29
7851 29 133 -510 187 864 -175 211 643 -538 -295 -45 -125 848 -38 334 114 766 296 -706 157 438
7871 438 -121 146 200 111 156 435 -259 33 -485 15 -277 -157 260 -627 523 504 -175 -630 -167 89 1032
7892 1032 -205 388 -228 -94 -87 407 -492 208 4 -58 22 -70 -773 7 166 396 -443 -537 392 646 359
7913 359 -486 -267 -402 -752 27 284 518 263 -231 565 -291 94 -328 -159 170 40 -432 -209 494 362
7933 362 -185 475 -871 145 132 -600 -21 -25 417 413 -454 80 60 -660 33 632 -19 -685 239 470 247
7954 247 22 -87 592 -823 -230 -73 710 364 -420 81 386 36 -150 -668 -368 278 -208 -354 419 -51
7974 -51 -93 -264 -365 239 100 -627 278 509 122 59 -456 174 -118 485 470 535 -648 563 338 180 -82
7995h2j29O41p80n17J520j46n21Q03j128J169q57l74K55J272j742J055n91J027
8013H75p16j57k05M6j29O85K31m23l75M41k53n19J24K11o03O79o83Q40j18o28
8033f77O96Rm74J08O19l10K61k39N89r00O40N8L25p85j32Q9l6Q40J5j90n44J39
8055A01R77j194J29P62l87L5q13P7J173l18j408J77O61j57L08k70M36o00J96K38
8075A23l58p4J29N0L83o78L46j23j23J48j156J393m43L87N43j198P60%m63K29
8095a25N02L11r16j49L64m18l72J014l26K80k12L30j262N43Q06n05j12k15J077
8114F15m05K11m29j05M1L31j168J709p83n1J8K51j15n2k8q15J052o22Q86j038
8134d97M04N45l95L23J56j189Q88l41l73N43K15o34L94l67L11M62p09j5m0Q53
$$ plain form
7995 -82 -211 430 -350 -867 653 507 -14 789 -339 830 -27 -401 -146 1126 -616 439 -152 875
8013 875 159 2 -203 -157 -286 399 630 207 -168 273 20 -499 -375 -164 -767 -88 -771 69 -49 -677
8033 -677 19 28 -446 -338 281 -29 232 -7 582 -318 322 380 705 -80 -212 -123 -159 681 696 506 -38 101
8055 101 1078 -116 13 775 388 423 -390 -313 860 542 -866 -689 -28 -185 123 -147 289 -311 -115 123
8075 123 -235 -309 -180 -130 253 -425 -79 -202 -325 -177 -1333 60 -383 4 547 -651 109 109 -354 -125
8095 -125 377 688 -228 -377 -13 -431 -803 211 -115 165 -47 283 -979 -436 370 -135 -247 -462 615
8114 615 210 421 -8 -113 -72 259 -909 800 17 -34 -16 235 120 68 40 -775 277 -345 541 -497
8134 -497 -93 452 57 380 536 -653 235 -106 -479 64 279 -355 39 -328 -17 445 -264 -279 -319 534
8154E34n17P50m50l78k91O23K61n47J27L59j17n26N39j75j03J9n7K45r5o10K54
8175a55M0j04q15O47LJ51L97j32O45j06n98L14o85o30J318k66
$$ plain form
8154 534 17 767 317 -61 -352 271 532 -15 112 471 354 -172 367 192 89 108 51 296 201 -409 -155
8175 -155 -115 -219 -1034 -387 -384 -233 164 32 677 571 -27 287 -398 -1028 290 24
8191B4
$$ Imaginary data points
##PAGE= N=2
##DATA TABLE= (X++(I..I)), XYDATA
0@%%%%%%%%%%%%%%O4j28J28j28J28j50K14k56K69l33L99m63N76o46P11q34R62
31E13j098J268j452J639j839K066k322K597k905L235l599M000m429M899n415N985
47C143o608P282q019Q832r731J0725j1835J3068j4452J6027j7822J9890k2319
60a1819K5207k8720L3096l8720M6263n6954P3465j02619J69688o45818j28935
71f65866P99853L12482M90143N556l79686n58944m46518m30978r281K96400M79219
82a07620N35947M39309J728k46653m27108n43649m19965m2572J84019M01012N11956
93B86404L85020J04060j48550m13358m84391l52816j46271J16742M04409M59658
103B10907L44717J82930q4537l60036m25602l62745j99274Q4464L12753L89690
$$ plain form
0 0 0 0 0 0 0 0 0 0 0 0 0 0 0 0 64 -64 64 -64 64 -86 128 -128 141 -192 207 -256 320 -326 385 -449 513
31 513 -585 683 -769 870 -969 1097 -1225 1372 -1533 1702 -1897 2103 -2326 2573 -2842 3143
47 3143 -3465 3817 -4202 4630 -5101 5624 -6211 6857 -7595 8432 -9390 10500 -11819
60 -11819 13388 -15332 17764 -20956 25307 -31647 41818 -60801 108887 -536931 -665866
71 -665866 133987 446469 936612 942168 562482 3538 -442980 -873958 -883239 -586839 -107620
82 -107620 428327 867636 869364 622711 195603 -348046 -768011 -810583 -626564 -225552 286404
93 286404 671424 775484 626934 213576 -270815 -623631 -769902 -653160 -248751 210907
103 210907 555624 738554 654017 293981 -131621 -494366 -693640 -609176 -296423 93267
113I3267L82591K06171q7866k77982l67216l92114k22786O0623K45542L54136
123e634L87397K26126k2408k08891l48400l71128k15887j0772J82401L44845L61292
134C18941K22472L5991j63062l28053l51246k38017o3003J41294K99864L31475
144B06656K50537Q3669j25299k78378l17110k56281r5896J08329K58408L12535
154A47170K62515J09932p9617k33413l05900k64898j21359N5875K08948K91675
164G0928K62504J28339l9338j92288k79810k60781j44053K0241J77996K68213
174A1951K58552J58895k69j58080k53243k52369j62424j6115J38877K40991K49006
185B15772J68664K6145j21500k28719k50907j76246m0804J03094K13298K44182
$$ plain form
113 93267 475858 682029 594163 316181 -51035 -443149 -665935 -605312 -359770 -5634
123 -5634 381763 607889 585481 376590 28190 -342938 -558825 -569597 -387196 -42351 318941
134 318941 541413 577404 414342 86289 -264957 -502974 -565977 -424683 -124819 206656
144 206656 457193 540862 415563 137185 -179925 -436206 -532102 -423773 -165365 147170
154 147170 409685 519617 440000 206587 -99313 -364211 -485570 -429695 -220747 70928
164 70928 333432 461771 422433 230145 -49665 -310446 -454499 -434258 -256262 11951
174 11951 270503 429398 429129 271049 17806 -234563 -396987 -413102 -274225 -33234 215772
185 215772 384436 410581 289081 60362 -190545 -366791 -407595 -304501 -91203 152979
195A52979J81713N6641q8868j98917k31545j85690o9153P6583J90001K26821J86577
206B97142Q2717n9912j76965k22511j91434r2218M3064J59875K14087J93271R6652
217C43768l1091j42725k07297j94770j05226J9330J31202K00219J96315J15829
227C25554m065j19445j90555j92687j21227j1660J06158J83615J85358J26881
237B87927K2558r4783j76628j84290j32704l2767Q0987J66031J84310J38040M2918
248C01599o9516j52148j77579j43324m9739O0069J40231J74544J45114N8817m8464
259B39604j33355j70465j47795o7914L4331J23030J65752J46953P5302k1881j12523
270A31039j61528j46661p9982J3285J03068J55808J48339Q8085m361r3198j49181
$$ plain form
195 152979 334692 391333 302465 103548 -127997 -313687 -382840 -306257 -116256 110565 297142
206 297142 379859 319947 142982 -79529 -270963 -363181 -320117 -160242 53845 247116 343768
217 343768 312677 169952 -37345 -232115 -337341 -318011 -186809 13410 209725 325554
227 325554 321489 202044 11489 -181198 -302425 -314085 -207927 -24312 161046 287927
237 287927 310485 215702 39074 -145216 -277920 -310687 -229700 -63669 120641 258681 301599
248 301599 232083 79935 -97644 -240968 -290707 -230638 -90407 84137 229251 288068 239604
259 239604 106249 -64216 -212011 -279925 -245594 -122564 43188 190141 265443 243562 131039
270 131039 -30489 -177150 -257132 -243847 -140779 15029 163368 251453 247092 153894 4713
281D713j47276r5354o379Q4199J39975J44850R9256J6248p5299j34589j43630
292a13286j03562k2751O4208J28523J42982J08408L0384n3200j18766j41900j09532
303a88492l8533M3771J11502J37306J12695M4534l6025j04089j35208j14785n3072
314b20396K7637R8200J28961J16592N9914j9326q7390j26509j16565o3265R943
325a92204Q1901J21679J15410P0906l934p3512j16775j16570p6201m491O5551
336a28240J10931J16744P7132J3370n7544j05663j14791q0854k0344N0266J02186
347c6807J13396Q4358K6912m2674r5030j11037q9207l1802L3663Q8610J08719
358D9101R0823L7411k8867q1675j06109r2200m3342K1343P6574J03997R2951M8401
$$ plain form
281 4713 -142563 -237917 -244296 -160097 -20122 124728 223984 240232 164933 30344 -113286
292 -113286 -216848 -239599 -175391 -46868 96114 204522 234906 181706 62940 -78960 -188492
303 -188492 -227025 -183254 -71752 65554 178249 222783 186758 82669 -52539 -167324 -220396
314 -220396 -192759 -94559 34402 150994 210908 191582 104192 -22317 -138882 -202147 -192204
325 -192204 -110303 11376 126786 197692 193758 120246 3471 -113099 -189300 -193791 -128240
336 -128240 -17309 99435 176567 189937 132393 26730 -88061 -168915 -189259 -138993 -36807
347 -36807 76589 160947 187859 145185 50155 -60882 -150089 -181891 -148228 -59618 49101
358 49101 139924 177335 148468 66793 -39316 -131516 -174858 -153515 -76941 27056 120007 168408
370A68408j1670p0703j01515r1301n3963N571O3979R6749R3494N6185j54n6677
382I8403r3161r4656o0413o330N1063Q8411R4549O4366J1745m5466q3363r1261
394f6113o8539j7661M0225P9546R0083P1041K2764l2965p5625r0525p1549k7259
406a46577K5367P0183Q8449P3213L1794j9534o5204q6592p4931l5727J4993N9939
418f4627Q3769P5838M1154r760n4090q0912p6725m5214L276N0705P7302P5897
430G6613M9226J313m6238p3968p6481n1893o260M0379P1649P6326N2676J2634
442A25976l4798o8116p5499n5141j5348K9085O4310P4750N7157J9850k4874o1077
454C6275p2744n9171k4511J9665N6439P1498O1161K7358j4396n2918o9592o0774
$$ plain form
370 168408 156738 86035 -15480 -106781 -160744 -155173 -91194 5555 99049 155234 155080 98403
382 98403 5242 -89414 -149827 -156157 -105094 -16683 77866 142232 153977 108511 25148 -66113
394 -66113 -134652 -152313 -112088 -32542 57541 128582 151346 118381 42756 -47769 -119318 -146577
406 -146577 -121210 -51027 37422 110635 142429 122895 57691 -28901 -103832 -139559 -124566 -64627
418 -64627 19142 94980 136134 126374 72284 -8628 -85353 -130567 -127291 -76586 716 76613
430 76613 125839 127152 80914 6946 -69535 -121428 -127688 -87309 -15660 60666 113342 125976
442 125976 91178 23062 -52437 -107578 -122926 -93841 -29531 45219 102376 122226 97352 36275
454 36275 -36469 -95640 -120151 -100486 -44047 27451 88612 115970 101574 48656 -20936 -81710
466h1710l0950J0539M8689O7131O2263L4522o460m4370o5529o3140l7659K508
478a04166M0034O3524O2416L9686K268l6074o0403o3452m1049o514L1942N8085
490a3703O2856M3912R781k7466n4503o2264m6491j2506K3870N0686O0747M7981
502H2900J7417k0726m8478n9706m8852k0740J5930M5537N9609M8786K3740j1834
514H3583m3427n6579m9160k6889P387L9885N5190N1367K8715m288l6744n3356
526d316n1594l1753J855L2978N0119N2278L3979K118k9623m9698n1450l4737n178
539h5022K5600M7476N1830L5822P860k1439m4858n2064l7146j1383J8872M3114
551b1338N0667L8302J4928j7180m0215m8609m0749j6594J3426L8337M7061M0897
$$ plain form
466 -81710 -112660 -102121 -53432 13699 75962 110484 104024 59654 -5875 -69015 -106674 -104166
478 -104166 -64132 -608 61808 101494 103762 67688 7285 -56167 -97216 -103730 -71788 -13703
490 -13703 49153 93065 102846 75380 20877 -41387 -87878 -100384 -76514 -25828 34919 82900
502 82900 100317 79591 31113 -28593 -77445 -98185 -82255 -36718 22891 71677 95417 83583
514 83583 40156 -16423 -65583 -92472 -85085 -45200 9990 61357 90072 85784 49040 -4316
526 -4316 -55910 -87663 -85808 -52830 -2711 49567 83546 85664 56041 6343 -45107 -79844 -85022
539 -85022 -59422 -11946 39884 75706 83566 62127 17269 -34795 -71941 -83324 -64452 -21338
551 -21338 29329 67631 82559 65379 25164 -23445 -64194 -80788 -67362 -29025 18036 58933
563E8933K0952j0574l5306m7221m1627k1221O863L1883M5500M3283K2922m327
575G0060k9434m5334m2352k4561J305K5560M3918M3514K5620K930k4733m0684
587E809m3378k8871l837K1377M0431M2201K8832P433j9167l6615m2536l1470r802
600f9593J6838L4682M1455L3133J1235j3291l3703m0446l3566j3660J0872L2095
612b3949L9098L5796J4996p708k9538m0114l4558j7920N872K6710L9183L5113
624D2981J9328m139k5137l7163l4420k0614J318K1673L6487L5026K2107K008k1113
637C8342l4722l5548k3713l501J8238L4158L4481K5089N065j5933l1348l5265
649b4657k5610p618J2724L1032L4751K6741R766j1226k8729l4300k7716j1043
$$ plain form
563 58933 79885 69311 34005 -13216 -54843 -76064 -69201 -37318 8182 51465 74387 70060
575 70060 40626 -4708 -47060 -71621 -70316 -44756 -838 42676 68296 71226 46493 5809
587 5809 -37569 -66440 -70277 -48900 -8469 33732 62564 69997 50830 14215 -28321 -59791 -69593
600 -69593 -52755 -18073 23382 56515 67750 54459 20756 -19690 -53256 -66916 -56044 -23949
612 -23949 15149 50945 65941 58233 28695 -11419 -45977 -63897 -58025 -31315 7868 42981
624 42981 62309 58170 33033 -4130 -38550 -59164 -57846 -36173 314 35340 57447 59455 38342
637 38342 3620 -31928 -55641 -59142 -40904 -6746 27735 52824 57889 41956 10608 -24657
649 -24657 -50267 -57885 -45161 -14129 20622 47363 57129 45903 17174 -17126 -44842 -55885
661e5885R668K5900L4343K7985J3146p309k5193l3112k8277j4323M323K3787L2042
674G095K8118J6884l261k1398l2069k8321j7579J087J9130K9730L1187J7979O84
687D9266j7026k9404k9874j9468k049J4712K8576K9451K0870L941j3840k6663
699H492k9637k1339o165J2475K4580K9204K2069Q384j0474k3859k8775k2677r090
712d6812Q473K2230K9123K3287R272n245k1352k7548k4328j2555N510J8633K7259
725E947K5028J3169l673j8225k6389k3288j5278J330J6659K5624K4795J5077L80
738D1156j5177k4169k5135j5707k043J3328K3342K5086J7644K567j1383k2980
750F529k4876j7768m122R333K1248K4497J9349O172r095j9519k4809j9321p439
$$ plain form
661 -55885 -46217 -20317 14026 42011 55157 47848 22655 -10457 -38734 -53057 -48734 -24947 7095
674 7095 35213 52097 48836 27438 -4631 -32952 -50531 -49444 -30314 -584 30603 48582 49266
687 49266 32240 2836 -27038 -46506 -48555 -33843 -5267 24184 45054 48995 35155 8492
699 8492 -21145 -42484 -48649 -36174 -11594 17610 39679 48063 37589 13730 -15045 -37722 -46812
712 -46812 -38339 -16109 13014 36301 45573 40328 18976 -8572 -32900 -45455 -39945 -21312 5947
725 5947 30975 44144 40471 22246 -4143 -27431 -42709 -41379 -24720 904 25699 40776 41156
738 41156 25979 1810 -23325 -39032 -41075 -27747 -4405 20681 38325 40892 29509 6529
750 6529 -18347 -36115 -40237 -30904 -9656 14841 34190 40362 31267 11748 -13061 -32382 -39821
763c9821P596J9155K3621J9131R197n425j7954k3801j9307r874M754J5554K2608
776E434K0389J0733k972j5080k2688j9659j1875J849J3628K1139K1300J2030j38
789C4090j2301k0266k0433j4548p98J0973K0026K0987J3526K627j0426j8316k0252
802a5111j4846l647Q423J7739K0194J5703M600o838j6709k0126j6388n693N586
815b7113J6696J9948J5119P565n128j4978j8236j7445q391L918J3702J9488J6688
828B1833R352k523j3071j8245j7423r185P54J2347J6530J7671J0615M92j1516
841A7631j6407j7590j0125j647R144J6331J7673J1212K354q629j5899j5817j2621
854b4390l253O462J5582J6625J2873L654o341j3969j7005j2427m332M785J3301
$$ plain form
763 -39821 -32225 -13070 10551 29682 38879 33454 15500 -8301 -27608 -37482 -32728 -17174 5434
776 5434 25823 36556 33584 18504 -4184 -23843 -35718 -33869 -20241 898 22198 34228 34090
789 34090 21789 1523 -18910 -33458 -34256 -23283 -3257 17730 31256 33883 23457 5141 -15111
802 -15111 -29957 -33604 -25181 -7442 12752 28455 33055 26217 9508 -10618 -27006 -32699 -27113
815 -27113 -10417 9531 24650 32215 27087 12109 -6127 -23572 -31963 -28045 -14343 5145 21833
828 21833 31185 28662 15591 -2654 -20077 -29262 -28508 -16161 369 18040 28655 29147 17631
841 17631 1224 -16366 -26491 -28138 -18994 -2663 15010 26222 28576 19947 4048 -11769 -24390
854 -24390 -27643 -21181 -5599 11026 23899 27553 21212 7243 -9762 -22189 -26521 -21736 -8435
867h435J5381J4042N932m623j2543j5898j3092o876K991J1891J5641J3897Q059
880B6367l350j0611j4398j5960o497J108R107J5945J2591R800P8q810j5701j3223
894a3554r685p0P901J2991J5537Q715J568p172j2822j5028q960k054N282J2943
908d408J3495J0535L917o125j1775j3256j0663m473M587J1185J3276J1094N185
921B2574m188j0514j2648j1685n733K734J0444J2636J2084N666k197q406j3282
934b515j1552o715J332P908J2593J2204P018p04o896j2936j1519o938j208O334
948a3594J2594J2071P849J278o816j0794j2050q983j243N685J0265J2387Q486
961A7135J505m446r464j2000q579l157L625R739J1717R358K348k317q534j1431
$$ plain form
867 -8435 6946 20988 26920 22297 9754 -6144 -19236 -26112 -23121 -11230 4411 18308 26367
880 26367 23017 12406 -1992 -17952 -24449 -23341 -14234 1711 14302 24102 24180 15370 -331 -13554
894 -13554 -23239 -23309 -15408 -2417 13120 21835 23403 16231 3409 -11619 -20579 -22633 -17351 -4408
908 -4408 9087 19622 23539 17414 5639 -7617 -18280 -22753 -18166 -6981 6295 17389 22574
921 22574 18386 7872 -4776 -16461 -22194 -19460 -9016 3620 15704 21370 19173 10767 -2515
934 -2515 -14067 -20782 -19450 -11542 1051 13255 20273 19569 12673 -263 -11782 -18720 -19928 -13594
948 -13594 -1000 11071 18920 20198 13382 2588 -9462 -18445 -19688 -14003 -3738 8649 17135
961 17135 18640 14194 4730 -7270 -15849 -19006 -15381 -5642 6075 15433 17781 15464 6930 -4501
975d501r538m479K249Q848J0582R465M768j273p781r811r857n250M76O226J0922
990A046R921N006K98o619r918r890o281O39N165J0252R995N798M75n416q534r524
1006g587p383j238M970Q297J0826O838N81l255q502r160p636k828L775Q347Q286
1021D331P775L484l869o140q878q878k880K583O189R671P520L297r86p273r095
1036c149p203l917Q81O271Q152Q432M380p85m992q700p729m944L5M652Q252Q351
1052G987N387l35m475p414q056n484m82L766O580R073N491P35l304p679p205n362
1068a0777k379L731O124P387O384K658l638n790p531o004k768J494O849P131O703
1083I574J668m98o069o637o786k944J194M447P527O730L117n30m722o920o086
$$ plain form
975 -4501 -14039 -18518 -16269 -7421 3161 12626 17394 16121 8340 -1471 -11328 -16578 -16102 -9876 1046
990 1046 10967 15973 16271 9652 -266 -10156 -16437 -15798 -10633 -381 9614 15412 15887 10471 1937 -7587
1006 -7587 -14970 -16208 -11238 -2941 7885 14723 15304 12049 3547 -5613 -13249 -16077 -12302 -3955 4331
1021 4331 12106 15590 11721 5581 -3297 -12175 -15055 -12472 -6283 3388 10908 14205 13219 5946 -3149
1036 -3149 -10352 -14269 -13388 -7117 1035 9467 13847 13062 8070 -630 -8359 -13303 -13268 -8616 -364 7987
1052 7987 13374 13039 8564 1150 -6906 -12390 -12872 -9106 -2526 6547 12038 12773 9469 1790 -5415 -10777
1068 -10777 -13156 -9425 -3301 4086 10470 13128 9490 3700 -3831 -9835 -12603 -11109 -4260 2871 9574
1083 9574 11242 10744 4675 -1962 -8748 -11692 -10498 -6051 1476 8206 11323 10793 6071 -849 -6935
1098f935m554J089M164N989P083L153J96l630n759o506m444p27L694N621P010
1113E444L748Q41j656o676o051m695j248J737O296P033M867N59k514n203n284
1128b802n395j830K163L907P155M692J927j415m482m940o214k050O93M202O537
1143B148M140L564p95m782n182n647k309J81L651N642M987K308N31l847m945m456
1159d811l619j29L030M428N833L680L80l535m037n395l136j121K569M280N349
1174C766M243L9j299m841n247l579j567J098N472M940M054J62j149k652n601m510
1190f671j466J407M041L937M522J864j029k559n184m526j621L92L054M343M427
1205D931K594m83k559n175l359k343l6K464L262N019L097k89k824l550m525k726
$$ plain form
1098 -6935 -11489 -10400 -6236 -247 6836 9989 10185 6555 796 -5710 -10154 -10881 -7187 -1566 5444
1113 5444 9192 10033 8377 1701 -4350 -9045 -10293 -8556 -2260 4773 9640 10199 7685 2482 -2802
1128 -2802 -8197 -10027 -7864 -3957 3198 7890 9817 8402 3920 -1020 -7234 -9284 -8591 -4389 2148
1143 2148 6288 9852 9057 4275 -907 -6554 -8863 -8682 -5031 611 5598 7906 8437 4590 -355 -4811
1159 -4811 -8430 -8559 -5529 -1101 4732 8412 8792 5257 1220 -4175 -7311 -8432 -5863 -1583 3766
1174 3766 8009 8048 6749 1908 -3339 -6918 -8485 -7387 -1915 3025 7079 7241 6092 3440 -2161 -6671
1190 -6671 -8137 -6730 -2689 1248 5770 7634 6605 4046 -1138 -5664 -7285 -6893 -3839 504 4931
1205 4931 7525 7042 4483 -692 -4051 -6394 -6430 -3966 -704 4315 7412 7123 4299 749 -3776 -6502
1221f502p84K700L446L808L149J145k334l298m315k772j971K829L055L944L293
1236E393J621j785k953l537m294r24J170L000L833L550J546q41l126m226l233
1251d806j119P62K088L921L016K900j530k199l811l490j673K67K135L685L219
1266C365K602M96k707l560l341j989l41J855L178M065J773k74j920k263l886j399
1282d346j309K056K330L122K629R03j783k247l017k949k66K7K560L296L968M43
1298E417j282k472l027k505j177J77K825K903L569P62m27k227l510k187j988r1
1314e240K447L393K593K037j587r44l508j794j799K7J672K872K297J079J218j601
1330C162l045l002j304l75Q94L415K089K342P02j508k630k690k834J11J120K484
$$ plain form
1221 -6502 -7286 -4586 -1140 2668 5817 6962 4628 1330 -2985 -5757 -7728 -4899 -1844 2100 5393
1236 5393 7014 5229 2276 -1261 -5555 -6479 -5309 -2309 1524 5074 6620 5779 2653 -1573 -4806
1251 -4806 -5925 -5163 -3075 846 3862 6762 5232 3033 -778 -4268 -5941 -5674 -3539 146 3365
1266 3365 5967 6463 3756 196 -3145 -5134 -5475 -3620 -442 3623 5396 5122 3202 939 -2947 -4346
1282 -4346 -5655 -3599 -1269 1853 4482 5385 3602 1355 -1662 -4611 -4877 -4850 -2290 1006 4974 5417
1298 5417 4135 1663 -1364 -3869 -5046 -4869 -2044 859 4428 5190 4763 2536 -974 -3161 -5149 -5240
1314 -5240 -2793 600 3193 5230 3643 2699 -809 -2603 -4402 -4375 -2703 169 2466 3545 4763 3162
1330 3162 117 -2885 -4189 -4564 -3670 -255 1834 4176 4878 3370 740 -1950 -4784 -4673 -3553 -1069
1346a069L105J008J651j282k078k197j701j079N74J968J651K111J946J92l212
1361A588k290l028j26K80K110K311J963J164P28k164k387k777q68m24J505K692
1377B77K218J829j146n10l638r58j186k65J707K083J444J426l86L34k279l416
1393b466j673M46L07K697K803J729N67j492j423k680k145l82Q60J450K967J572
1409C137J043p09l166j125k119l58O43J361K114J515J593r97r53l025r14m96q66
1426c322J381J982J710J817n37j305k428j666o18n22J762J884J724J266k49J33
1442C012l051j247k238p6M72K082K439K002k82p83j299l182r26l51M11J280K973
1459A236Q19N71m5q31l077j606j72P17J109J846J339J460r55n75k532j972J28
$$ plain form
1346 -1069 2036 3044 4695 3413 1335 -862 -2563 -3642 -3068 -1100 551 2662 4608 4800 1588
1361 1588 -702 -3730 -3856 -3576 -1466 845 2808 3972 4700 2536 149 -2628 -3496 -3920 -2415 277
1377 277 2495 4324 3178 2668 -970 -1928 -3114 -3379 -1672 411 1855 3281 2895 3229 950 -2466
1393 -2466 -4139 -3693 -3386 -689 2114 3843 4410 2918 1495 -1185 -3330 -3712 -2852 -1402 1565 3137
1409 3137 4180 3471 305 -820 -2939 -3297 -2654 -1293 821 2336 3929 2932 1979 -1046 -1960 -2456 -3322
1426 -3322 -1941 41 1751 3568 3031 1726 -702 -2368 -2986 -3508 -1746 138 1862 3128 2879 3012
1442 3012 -39 -1286 -3524 -3600 -3128 -1046 1393 3395 3113 2330 1031 -2151 -3077 -3428 -3017 -1737 1236
1459 1236 2055 2626 2581 1750 -1327 -2933 -3105 -2388 -1279 567 1906 3366 2411 1836 -696 -2668 -2540
1476b540o6J798J511J349J983j159l74k523k088r14j79K247P43J929Q59M64j308
1493A732p98k815p46J61M39J676J826R94P79j512j014k036j615m83J727R01K055
1510A271J144N85m40j263k396r79j035Q27J289J849J342J94l84j118r61j820r21
1527b816P14J241K350K98Q49J75k179l73k390k87n1J673J700N25J066j1j896n8
1545E30l075l32O79L91K325R26R49O40k157r41r94j757k7J247J438P85J604L55
1563B586r05q60q19j510j305J620N7K363L01J100l66r98j753k233l54O11K137
1580c28J349J074K49m3p92k255j012j058K27J884J338K102r50m81m81n44o20j308
1598a649n09Q73J988O79J138l83j032m97k919J93L67n6K190P19N9J385o91j707
$$ plain form
1476 -2540 -2606 -808 703 2052 4035 2876 2502 -21 -2109 -3023 -3202 -955 -212 1717 2576 3040 1732
1493 1732 934 -1881 -2627 -2466 -2027 -351 1475 2469 3248 1736 722 -1314 -2929 -3412 -1685 -784 1271
1510 1271 2415 3000 2560 1297 -1099 -2078 -3113 -2286 -997 852 2194 2388 2004 886 -75 -1895 -2816
1527 -2816 -2102 -861 1489 1787 2636 2811 632 259 -2131 -2418 -2469 -796 904 1429 2495 2484 588 530
1545 530 -2545 -2877 -2198 -1807 518 1444 2393 3033 876 -65 -1059 -2816 -2843 -1596 -158 627 2231 2586
1563 2586 1681 821 2 -1508 -2813 -1193 -1136 1227 1528 2628 2262 1264 -489 -2722 -3076 -2465 -328
1580 -328 1021 2095 2344 2301 1509 -746 -1758 -2816 -2589 -705 633 2735 1785 1304 823 279 -341 -1649
1598 -1649 -2158 -1285 703 1382 2520 2137 1105 608 -2311 -2118 -1751 -1807 383 1102 1161 2546 1855 148
1616A48j192j014K7J375l43J526J247P98l28j366j934j556k7Q66J177P69K559
1633B732R8q95j330r75j528p4k01J946M76J532K98r1j397j174o31n20j8L94J585
1652B27P01Q69J3L0j912j238o74q5R21Q53J500O09n27k56r61j124m60o20P38Q49
1672e47J555O69k87L43j763o41l58j159K6K147k05J321J616j059r92j164r37k31
1690a666J22Q81R79J537j06q22l33r16j097j5q42J591J012R77L4P8j81j411j238
1709a416q1M75m05J793Q63M56m72k50n80j488o92k7K73J359J615m58Q37r66o88
1728A48n76r98q69J533Q69N92M43K13M4j398m3j609N2L29J81J372R44rR2n84j008
1749b82n40j132M06J199N02J375q75p2Q64j167j200j181K19K160m74J058J233
$$ plain form
1616 148 -1044 -2058 -2031 -656 -999 527 1774 2572 2244 878 -1056 -2612 -2639 -1773 -596 173 2732
1633 2732 2830 1935 605 -370 -1898 -1972 -2173 -227 249 1781 2079 1988 591 -583 -1214 -1734 -1752 -1358 227
1652 227 928 1797 1810 1840 -72 -1310 -1984 -2069 -1148 -295 1205 1814 1287 1031 70 -1054 -1514 -2134 -1396 -547
1672 -547 1008 1677 1390 1733 -30 -671 -1029 -2188 -2162 -15 -220 1101 2717 1658 666 -498 -1435 -1666
1690 -1666 -1544 -663 316 1853 1747 925 592 -324 -1421 -1436 -2278 -687 325 1302 1336 1414 1233 -178 -1416
1709 -1416 -1497 -1022 -1427 366 1229 1685 1213 963 383 -1105 -1797 -1824 -1551 -192 1423 965 1802 836 148
1728 148 -428 -1426 -2295 -762 107 699 1142 1355 1399 1 -42 -1651 -1599 -1270 -1089 283 1227 1218 1310 726 -282
1749 -282 -822 -1954 -1548 -349 153 1528 653 581 1445 278 -922 -2103 -1884 276 -198 860 2093
1766B093j088n18j12q63j077M27L84M18Q24J006p73Q26j622M21k199N23Q60O09
1784A39R34j22L12K41j480n37o74o72O35O09J336K29K56r2m09p23j244l82K91
$$ plain form
1766 2093 1005 487 375 -488 -1565 -1138 -754 -336 488 1494 721 1547 -75 346 -1853 -1330 -470 139
1784 139 1073 951 1263 1504 24 -513 -1187 -1859 -1224 -615 721 950 1206 1114 705 -18 -1262 -1644 -1353
$$ [...]
8191H20
##END NTUPLES=NMR FID
##END=
