##TITLE=1H_DE-55DCM_K_d6
 DMSO-d6
 8 sc, 
 8.5.2024
##JCAMPDX= 6.0         $$ Bruker NMR JCAMP-DX V2.0
##DATA TYPE= NMR FID
##DATA CLASS= NTUPLES
##ORIGIN= UXNMR, Bruker Analytische Messtechnik GmbH
##OWNER= root
$$ XWIN-NMR		Version 3.5
$$ Wed May  8 14:33:27 2024 Russian Standard Time (UT+4h)  she@DPX200
##.OBSERVE FREQUENCY= 200.1309
##.OBSERVE NUCLEUS= ^1H
##.DELAY= (6, 6)
##.ACQUISITION MODE= SIMULTANEOUS
##.ACQUISITION SCHEME= undefined
##.AVERAGES= 8
##.DIGITISER RES= 18
##SPECTROMETER/DATA SYSTEM= spect
##.PULSE SEQUENCE= zg30
##.SOLVENT NAME= CDCl3
##.SHIFT REFERENCE= (INTERNAL, CDCl3, 0, 15.7039)
##AUDIT TRAIL= $$ (NUMBER, WHEN, WHO, WHERE, WHAT)
$$ ##TITLE= Audit trail, XWIN-NMR		Version 3.5
$$ ##JCAMPDX= 5.01
$$ ##ORIGIN= Bruker BioSpin GmbH
$$ ##OWNER= she
$$ F:/spectra/data/she/nmr/H-F/1/audita.txt
$$ ##AUDIT TRAIL=  $$ (NUMBER, WHEN, WHO, WHERE, WHAT)
(   1,<2024-05-08 14:32:24.95 +0400>,<she>,<DPX200>,
      <created by zg, POWCHK disabled, PULCHK disabled
       configuration hash MD5:
       00 E9 B6 7A A2 85 ED C7 34 08 36 98 17 FE 4E 26
       data hash MD5: 16K
       FC C1 78 85 2A E2 38 54 7A DF 09 C4 76 27 85 D8>)
$$ ##END=
$$ 
$$ hash MD5
$$ 47 6D 08 43 B0 2A 32 E4 7E 5D 66 DA 85 46 FF 10
##$RELAX= 
##$RELAX= 
##$RELAX= 
##$RELAX= 
##$RELAX= 
##$RELAX= 
$$ Bruker specific parameters
$$ --------------------------
##$DU= <F:/spectra>
##$EXPNO= 1
##$NAME= <H-F>
##$PROCNO= 1
##$TYPE= <nmr>
##$USER= <she>
##$AMP= (0..31)
100 100 100 100 100 100 100 100 100 100 100 100 100 100 100 100 100 100 
100 100 100 100 100 100 100 100 100 100 100 100 100 100 
##$AQSEQ= 0
##$AQ_mod= 1
##$AUNM= <au_zg>
##$AUTOPOS= <>
##$BF1= 200.13
##$BF2= 200.13
##$BF3= 200.13
##$BF4= 200.13
##$BF5= 200.13
##$BF6= 200.13
##$BF7= 200.13
##$BF8= 200.13
##$BYTORDA= 1
##$CFDGTYP= 0
##$CFRGTYP= 5
##$CHEMSTR= <none>
##$CNST= (0..31)
1 1 145 1 1 1 1 1 1 1 1 1 1 1 1 1 1 1 1 1 1 1 1 1 1 1 1 1 1 1 1 1 
##$CPDPRG= <>
##$CPDPRG1= <>
##$CPDPRG2= <>
##$CPDPRG3= <>
##$CPDPRG4= <mlev>
##$CPDPRG5= <mlev>
##$CPDPRG6= <mlev>
##$CPDPRG7= <mlev>
##$CPDPRG8= <mlev>
##$CPDPRGB= <>
##$CPDPRGT= <>
##$D= (0..31)
0 1.2 0 0 0 0 0 0 0 0.06 0 0.03 0 0 0 0 0.0002 0 0 0 0 0 0 0 0 0 0 0 0 
0 0 0 
##$DATE= 1715164344
##$DBL= (0..7)
120 120 120 120 120 120 120 120 
##$DBP= (0..7)
150 150 150 150 150 150 150 150 
##$DBP07= 0
##$DBPNAM0= <>
##$DBPNAM1= <>
##$DBPNAM2= <>
##$DBPNAM3= <>
##$DBPNAM4= <>
##$DBPNAM5= <>
##$DBPNAM6= <>
##$DBPNAM7= <>
##$DBPOAL= (0..7)
0.5 0.5 0.5 0.5 0.5 0.5 0.5 0.5 
##$DBPOFFS= (0..7)
0 0 0 0 0 0 0 0 
##$DE= 6
##$DECBNUC= <off>
##$DECIM= 32
##$DECNUC= <off>
##$DECSTAT= 4
##$DIGMOD= 1
##$DIGTYP= 9
##$DL= (0..7)
0 120 120 120 120 120 120 120 
##$DP= (0..7)
150 150 150 150 150 150 150 150 
##$DP07= 0
##$DPNAME0= <>
##$DPNAME1= <>
##$DPNAME2= <>
##$DPNAME3= <>
##$DPNAME4= <>
##$DPNAME5= <>
##$DPNAME6= <>
##$DPNAME7= <>
##$DPOAL= (0..7)
0.5 0.5 0.5 0.5 0.5 0.5 0.5 0.5 
##$DPOFFS= (0..7)
0 0 0 0 0 0 0 0 
##$DQDMODE= 0
##$DR= 18
##$DS= 0
##$DSLIST= <SSSSSSSSSSSSSSS>
$$ [...]
##$SUBNAM2= <"">
##$SUBNAM3= <"">
##$SUBNAM4= <"">
##$SUBNAM5= <"">
##$SUBNAM6= <"">
##$SUBNAM7= <"">
##$SUBNAM8= <"">
##$SUBNAM9= <"">
##$SW= 18.0517689322627
##$SWIBOX= (0..15)
0 0 2 0 0 0 0 0 0 0 0 0 0 0 0 0 
##$SW_h= 3612.71676300578
##$TD= 16384
##$TD0= 1
##$TE= 0
##$TE2= 300
##$TE3= 300
##$TEG= 300
##$TL= (0..7)
0 120 120 120 120 120 120 120 
##$TP= (0..7)
150 150 150 150 150 150 150 150 
##$TP07= 0
##$TPNAME0= <>
##$TPNAME1= <>
##$TPNAME2= <>
##$TPNAME3= <>
##$TPNAME4= <>
##$TPNAME5= <>
##$TPNAME6= <>
##$TPNAME7= <>
##$TPOAL= (0..7)
0.5 0.5 0.5 0.5 0.5 0.5 0.5 0.5 
##$TPOFFS= (0..7)
0 0 0 0 0 0 0 0 
##$TUNHIN= 0
##$TUNHOUT= 0
##$TUNXOUT= 0
##$USERA1= <user>
##$USERA2= <user>
##$USERA3= <user>
##$USERA4= <user>
##$USERA5= <user>
##$V9= 5
##$VALIST= <valist>
##$VCLIST= <CCCCCCCCCCCCCCC>
##$VD= 0
##$VDLIST= <DDDDDDDDDDDDDDD>
##$VPLIST= <PPPPPPPPPPPPPPP>
##$VTLIST= <TTTTTTTTTTTTTTT>
##$WBST= 1024
##$WBSW= 4
##$XGAIN= (0..3)
0 0 0 0 
##$XL= 0
##$YL= 0
##$YMAX_a= 96695
##$YMIN_a= -134133
##$ZGOPTNS= <>
##$ZL1= 120
##$ZL2= 120
##$ZL3= 120
##$ZL4= 120
##$ABSF1= 10
##$ABSF2= 0
##$ABSG= 5
##$ABSL= 3
##$ALPHA= 0
##$AQORDER= 0
##$ASSFAC= 0
##$ASSFACI= 0
##$ASSFACX= 0
##$ASSWID= 0
##$AUNMP= <proc_1d>
##$AZFE= 0.1
##$AZFW= 0.1
##$BCFW= 1
##$BC_mod= 2
##$BYTORDP= 1
##$COROFFS= 0
##$CY= 11.3945322036743
##$DATMOD= 1
##$DC= 2
##$DFILT= <>
##$DTYPP= 0
##$F1P= 15.6554695791079
##$F2P= 12.8336369535428
##$FCOR= 0.5
##$FTSIZE= 0
##$FT_mod= 4
##$GAMMA= 1
##$GB= 0.15
##$INTBC= 1
##$INTSCL= 1
##$ISEN= 128
##$LB= 0.24
##$LEV0= 0
##$LPBIN= 0
##$MAXI= 10000
##$MC2= 0
##$MEAN= 0
##$ME_mod= 0
##$MI= 1.114404
##$NCOEF= 0
##$NC_proc= 0
##$NLEV= 6
##$NOISF1= 3.799351
##$NOISF2= 2.8
##$NSP= 1
##$NTH_PI= 0
##$NZP= 0
##$OFFSET= 15.70392
##$PC= 1
##$PHC0= -25293.73
##$PHC1= 1.587482
##$PH_mod= 1
##$PKNL= yes
##$PPARMOD= 0
##$PSCAL= 0
##$PSIGN= 0
##$REVERSE= no
##$SF= 200.130013532006
##$SI= 16384
##$SIGF1= 3
##$SIGF2= 2
##$SINO= 400
##$SIOLD= 16384
##$SREGLST= <1H.CDCl3>
##$SSB= 0
##$STSI= 0
##$STSR= 0
##$SW_p= 3612.71676300578
##$SYMM= 0
##$S_DEV= 0
##$TDeff= 0
##$TDoff= 0
##$TI= <>
##$TILT= no
##$TM1= 0
##$TM2= 0
##$TOPLEV= 0
##$USERP1= <user>
##$USERP2= <user>
##$USERP3= <user>
##$USERP4= <user>
##$USERP5= <user>
##$WDW= 1
##$XDIM= 8192
##$YMAX_p= 0
##$YMIN_p= 0
$$ End of Bruker specific parameters
$$ ---------------------------------
##NTUPLES= NMR FID
##VAR_NAME=  TIME,          FID/REAL,        FID/IMAG
##SYMBOL=    X,             R,               I
##VAR_TYPE=  INDEPENDENT,   DEPENDENT,       DEPENDENT
##VAR_FORM=  AFFN,          ASDF,            ASDF
##VAR_DIM=   8192,          8192,            8192
##UNITS=     SECONDS,       ARBITRARY UNITS, ARBITRARY UNITS
##FACTOR=    0.0002768,     1,               1
##FIRST=     0,             0,               0
##LAST=      2.2672688,     0,               0
##MIN=       0,             -134133,         0
##MAX=       2.2672688,     96695,           0
$$ Real data points
##PAGE= N=1
##DATA TABLE= (X++(R..R)), XYDATA
0 0 0 0 0 0 0 0 0 0 0 0 0 0 0 0 0 0 0 0 0 0 0 0 0 -1 2 -4 4 -5 6 -7 7 -7 7 -7 8 -9 10 -10 12 -13 13 -17 18 -18 20 -22
46 -22 24 -25 29 -31 34 -39 42 -48 54 -60 69 -83 94 -113 139 -172 222 -296 413 -617 1006 -1899 4679
69 4679 -25909 -134133 34576 68639 -50930 23035 59219 -7375 12982 4329 -18684 40940
81 40940 11323 -40828 22431 26809 -14122 22254 10747 -17972 24911 4126 -38485 12977
93 12977 23302 -30797 -24819 7159 8510 -8173 -23655 -981 7869 -32869 -22282 20113 2224
106 2224 -11494 -332 -11336 1730 13474 -18388 -7489 25827 1497 -9529 12740 11412
118 11412 10700 2038 -15103 15727 25743 -19556 -5113 35850 4134 -18963 8339 12200 -1508
131 -1508 -7189 -8985 4429 7293 -11047 -6686 4796 -3624 -7685 -8656 -8658 4214 -1564 -17342 -660
146 -660 12482 -4892 -11698 -665 7167 1988 -11983 -1707 19611 3021 -13158 9023 13202
159 13202 -5441 -2376 4619 4095 8170 -559 -4160 12207 8348 -9179 -2159 6882 1208 -3296
173 -3296 -6379 57 8311 -5280 -13415 4293 5301 -12214 -9001 4355 2909 -5379 -6524 1899
187 1899 5702 -4449 -7672 2195 3653 -1556 -2194 178 5925 4575 -5368 -1375 8936 2580 -4834
202 -4834 1504 7735 4706 -2836 -2747 7316 5342 -8220 -3333 7883 514 -6463 -461 2999 512
217 512 -3877 -5903 1051 3371 -5301 -4828 2753 1540 -2543 -4016 -1379 3077 159 -7231 768 7422
233 7422 -1398 -4700 3398 5045 -407 -2207 496 5074 2283 -3876 1150 6773 259 -3078 878
248 878 2196 1067 -1182 -2818 2391 3812 -3644 -4093 3199 1288 -5078 -3238 1681 939 -2729 -3545
264 -3545 1049 2281 -3066 -4107 1547 1739 -2175 -1990 1477 2377 -206 -2003 238 2799 495 -2657
280 -2657 649 4134 1456 -2054 397 3814 936 -2665 76 2850 552 -2075 -455 1904 958
295 958 -2122 -2123 1255 1122 -2683 -2161 1400 1353 -2188 -2568 740 946 -2305 -2702 1061 2107 -1296 -1868
313 -1868 1485 1788 -895 -1404 957 2020 205 -1190 922 2437 760 -1405 -163 2034 449 -1723
329 -1723 -225 2212 726 -1565 -346 1871 462 -1960 -1012 908 279 -1444 -956 902 228 -1332
345 -1332 -1318 157 504 -643 -1152 256 1662 -177 -1536 407 1583 -835 -1661 938 1769 -80 -1071
362 -1071 1039 1735 -118 -1018 758 1111 -89 -596 422 1142 248 -573 -107 437 235 -821 -959 768
380 768 586 -906 -1195 675 803 -1528 -1411 1053 521 -1078 -401 604 343 -379 -721 440 725 -604
398 -604 -278 332 681 218 -553 -4 899 480 -620 -242 1266 427 -718 221 1009 -26 -928 111 619
417 619 -142 -940 231 595 -152 -736 -580 -80 -427 -284 -292 216 73 -413 -350 188 153 -470 -775 -109 577
438 577 -28 -612 327 1013 -202 -254 333 708 -18 -192 78 619 -222 -356 432 -146 -310 -75 -136 18 179
459 179 -517 -253 380 169 -485 -639 177 128 -560 -720 201 313 -536 -215 331 214 -433 -176 552 254 -88
480 -88 142 66 118 152 125 -27 147 197 -110 45 517 489 -92 126 472 78 -688 -603 467 -74 -501 -107 600
503 600 -302 -616 -135 2 -121 -291 -171 211 -243 -21 -43 36 69 -221 -141 81 -56 -141 -238 130 192 67 107
526 107 55 511 182 -258 250 296 -55 20 196 209 -71 378 -50 -66 -40 21 -193 -35 86 -142 -150 60 142 -79
550 -79 -220 37 56 -388 -50 89 -178 -72 123 -52 -154 -386 113 -113 111 125 229 -38 -122 193 -48 -42
572 -42 187 277 -250 214 338 -207 -4 -196 -54 -78 -20 -22 361 -87 -125 132 35 -362 -159 115 62 -96 -71 -234
596 -234 -207 361 -4 -39 -36 -191 320 35 -11 105 -95 54 350 26 92 59 -85 71 -93 -94 347 213 -230
619 -230 -149 -32 -44 14 146 245 -168 356 -205 -257 127 -48 24 38 263 -44 283 -54 -98 112 200 -109 100
642 100 122 95 -44 202 431 -11 70 11 -164 -252 123 99 225 -101 89 -142 -78 -175 114 -147 56 80 7 -31
666 -31 -158 130 102 -97 -130 88 -191 -150 310 -147 -86 370 -280 -146 117 228 -39 248 -145 191 -10 159
688 159 14 107 43 -166 267 -40 -160 19 50 -19 -352 98 -66 -72 -169 324 -72 52 128 86 -179 -39 -115 -58
712 -58 18 162 -264 0 105 -180 9 -136 115 84 169 17 133 37 181 155 5 -217 -99 -111 92 -134 221
735 221 -105 97 37 -135 -154 -92 63 62 -13 -93 277 -64 -110 -194 -51 322 84 -3 38 44 186 -87 -160 -4 -104
760 -104 311 16 1 240 -36 104 -126 -131 -145 22 -256 172 -224 -60 173 185 127 -23 -42 -13 230 -99 15
783 15 -223 252 85 170 107 -77 87 -95 3 -76 87 -298 -225 -101 -195 -117 -140 -162 -73 158 23 -139 -45 -46 141
808 141 -89 98 -285 82 -243 171 38 106 146 -297 255 -372 163 -217 -69 -66 49 2 -21 33 120 -160 107
831 107 72 242 -48 -72 209 -28 -165 -251 -447 130 98 -114 1 97 45 -137 4 340 32 224 -106 -118 325
854 325 -115 -35 190 280 -141 140 255 153 -233 -186 -166 -182 -230 20 60 -73 125 96 242 -57 -52 -20 96 110
878 110 51 -52 -39 -47 -51 144 2 -110 -137 -305 107 -80 -192 216 186 -52 -116 88 215 152 -261 -46 -87 140
902 140 -88 200 -9 -358 234 -108 -90 -134 207 -90 -52 71 87 -217 -53 -132 -7 -40 -103 158 -15 -157 50
925 50 -244 -6 181 -12 -105 -94 -156 198 141 44 -43 35 -57 -63 -23 -205 119 -156 44 85 -29 -287 -243 28 -189
950 -189 -81 -64 -101 224 -237 -166 -160 237 235 -272 130 66 -140 32 2 71 171 -171 17 57 64 342 4 98 187
975 187 -145 -26 81 -154 -182 158 254 27 13 -141 155 187 -100 60 -125 -97 -243 94 69 23 -158 236 -137
998 -137 90 -30 -106 71 -25 -99 -8 32 203 -86 -38 180 -339 -372 -241 145 -175 -54 -31 128 100 -53 113
1021 113 -6 83 48 20 172 47 -193 51 -227 27 165 -67 29 -76 -59 -171 53 43 -50 117 -147 99
1043 99 -52 -109 100 -88 137 59 -30 208 201 -44 -171 42 -2 105 -30 -37 236 142 -36 -59 -195 68 -131 -102
1067 -102 -279 -32 112 -1 207 69 275 -74 139 2 -63 119 3 -25 2 -198 42 48 -106 104 -1 -19
1089 -19 117 -111 54 -95 -255 110 125 92 67 -113 86 110 165 -7 -113 -213 -68 -122 276 -9 311 -79
1111 -79 11 57 90 68 -214 73 2 247 37 140 81 -27 210 -21 -132 -14 176 -56 -83 -293 4 172 -113
1134 -113 -60 -2 84 -73 17 0 -105 90 -235 142 -175 -382 86 -7 41 -5 -14 84 -92 83 -314 240 87 -80
1158 -80 136 -94 114 -183 -223 -74 -259 -66 67 -34 97 6 -120 141 -9 -112 137 38 -80 46 0 156
1180 156 -127 39 -69 128 -185 65 55 185 -303 -99 188 -163 -10 -32 159 205 143 -283 24 -61 99 -79
1202 -79 -176 59 -137 148 -364 -150 -12 -68 -303 -50 12 -46 -244 -82 147 52 95 -109 68 20 162 25 -73
1225 -73 267 65 112 -80 -188 44 -39 109 1 153 186 -208 -58 -383 -309 64 124 -274 -115 -50 142 143 27
1248 27 127 -171 95 88 79 19 -216 297 80 -103 -199 75 113 12 -34 15 233 156 -166 89 113 108 -18 150 42
1273 42 -65 158 163 -257 -166 42 17 18 -127 -66 145 -146 15 -40 92 -93 -48 -61 115 -56 -17 209 -94 118
1297 118 -28 -187 33 -31 164 1 -139 86 -1 -235 -135 261 130 -15 -105 -131 -24 285 -117 -33 128 20
1319 20 -32 46 314 54 -59 151 157 -19 230 -99 60 -117 243 219 109 355 174 72 79 295 135 -218 -27
1342 -27 156 -114 98 122 -32 -257 142 -99 -92 -246 94 16 -79 -159 93 157 264 132 -38 104 172 -39 223
1365 223 34 -56 -106 75 96 75 -84 -219 54 -146 157 124 -145 5 -47 -40 207 -70 -201 -32 122 -146 -15
1388 -15 -40 192 168 46 -135 -49 -60 30 10 -7 21 -257 -28 132 -243 389 -49 -181 -149 -123 194 -41 141 -215
1412 -215 -153 27 -64 -206 44 56 -1 41 213 109 194 -183 -85 6 -33 45 -145 -28 -172 267 158 -316 497
1435 497 -46 16 225 -12 47 71 -331 -8 -41 -100 -59 -122 -159 -185 -83 66 -53 171 397 38 -149 2 123
1458 123 -8 -236 -44 -131 -71 62 -137 240 190 55 101 29 83 -162 212 -11 -60 116 -92 160 35 146
1480 146 -52 217 187 83 -88 55 99 -22 20 66 -291 -139 298 17 101 12 -10 152 30 -26 -15 13 109 -70
1504 -70 248 -176 224 315 141 -41 216 -37 73 -209 -127 1 251 -242 50 -145 -102 119 -127 8 -188
1525 -188 -120 -23 -42 46 149 294 -107 -10 134 -123 48 -121 80 -27 -27 99 151 -203 -165 165 44 174 47
1548 47 -88 -2 45 0 35 44 -301 25 -383 90 56 -98 -102 245 -183 123 -71 79 -228 -215 4 -240 78 -28
1572 -28 -29 -80 102 219 -2 20 -85 -132 5 -335 -85 253 2 216 140 95 15 -8 -12 176 -42 -148 154 130
1596 130 -25 211 -216 -16 5 -128 -26 25 -30 203 22 2 83 -34 -90 -83 115 51 79 -24 -395 254 -221
1619 -221 3 -64 -84 35 16 -34 89 -191 -244 2 -145 201 310 199 -81 -26 -93 144 88 -36 120 83 -51
1642 -51 -84 -70 103 16 -119 -40 340 361 -110 -136 28 -34 90 160 -263 133 30 309 12 217 253 117 -19
1665 -19 -5 13 -91 -360 -22 -14 128 -120 -128 168 -20 32 -123 -102 -18 229 -168 -152 -38 -61 60 55 11 -134 44
1690 44 77 167 143 89 -212 -259 -75 -78 34 136 39 -135 -148 -2 -145 -58 -84 -89 198 287 -163 97 -44 54 109 6
1716 6 -58 -40 43 -140 190 -30 -248 -54 -279 -31 17 78 151 8 25 -145 -36 162 265 121 46 51 361 64
1740 64 32 -13 -134 -5 194 99 17 34 -185 -135 -261 24 19 58 -20 113 15 -532 -5 -107 -142 -88 -97 -182 16 2
1766 2 153 -50 91 -158 -187 21 355 -151 8 -208 -33 2 -241 101 228 -84 192 43 110 -120 -69 -117
1788 -117 -133 191 280 -75 104 -28 -24 209 -168 -76 -5 -170 -184 214 167 48 -42 25 177 130 53 278 -101 18
1812 18 118 177 -163 106 -51 134 -151 -178 80 -89 -211 99 158 -19 18 -116 124 -83 -62 215 48 -256
1834 -256 131 -163 51 161 12 -201 169 -17 17 -100 163 -39 65 55 -185 172 -352 108 21 -59 -120 62
1856 62 172 163 -217 -191 -38 302 77 -126 111 16 30 81 -91 201 19 -25 -273 82 -33 -27 -83 25 -51 -20
1880 -20 69 151 -42 121 90 24 -154 -156 -46 -159 -20 -53 -45 186 -20 -199 295 -28 97 53 64 124 -219 201
1904 201 -160 -149 -130 -20 104 -106 16 -103 285 -8 -188 84 -94 -151 -69 78 -114 -62 -10 -128 -65 -123 63
1927 63 378 82 88 -24 14 -3 -160 159 -192 23 -34 165 -287 -147 68 62 38 -18 -97 -85 145 -122 167 140
1951 140 4 -91 -216 -199 75 -126 -92 43 58 -19 150 -267 151 116 75 -120 -110 194 155 17 -209 223 -22
1974 -22 43 -22 19 -122 124 38 19 154 24 -36 49 -51 227 251 51 32 -125 51 -10 191 72 252 23 -268
1998 -268 -105 90 37 -135 -61 -255 -30 136 65 17 -30 168 0 64 -55 -162 247 2 -141 42 -140 176
2020 176 56 119 363 -20 229 -69 178 17 236 68 90 77 112 -105 -10 -121 56 -107 -91 -107 -95 139 102
2043 102 41 266 153 94 253 -68 77 -119 -146 -86 55 50 123 140 69 79 171 -114 -153 205 -52 22 165 82 138
2068 138 103 -252 -158 133 174 -110 -142 95 -19 -31 -253 223 41 74 -117 190 1 141 197 97 -232 59
2090 59 -57 390 -270 -23 105 -37 148 44 -25 124 61 -206 297 158 78 -188 42 -131 -3 6 -40 -89 250
2113 250 114 72 -98 -133 -177 -21 143 56 52 246 171 50 -171 -172 145 -153 -128 128 -27 176 34 -170 8
2136 8 -27 0 69 194 137 -89 -50 -122 -26 -51 55 6 -185 135 36 52 9 156 141 99 93 94 132 36 41 192 -63 208
2164 208 -16 61 -116 43 92 -118 46 247 34 -39 116 50 37 5 4 85 -167 91 304 -101 -39 -69 -375 -14
2188 -14 -43 -74 81 132 -395 -303 69 -109 -189 84 136 140 -266 206 -87 44 -120 2 120 -116 169 -112 126
2211 126 -216 -137 61 22 -153 -230 -173 -85 -57 -83 78 -14 181 2 -48 -152 -39 -36 16 10 -104 24 -57 82 -71
2236 -71 -32 205 -18 -144 257 90 -159 19 -14 -141 5 -481 -288 -86 -141 -31 61 84 -124 407 248 59
2258 59 152 140 -165 4 237 -28 -102 -186 -171 -188 64 -85 72 -151 -111 293 -130 -412 218 81 -55 80 -5
2281 -5 -44 201 208 163 137 -6 119 -35 -14 115 -2 -20 134 10 -61 149 34 -72 -119 -12 -170 -117 -74 -55 82
2306 82 -19 -41 -49 -26 101 126 -210 -70 -79 -32 3 161 177 166 126 105 60 127 133 -119 12 -222 -147 -107 14 -11 -112
2333 -112 10 -22 -107 -229 228 -146 -127 -183 14 82 200 31 79 163 -101 232 67 13 28 -17 -42 -127 47 -106
2357 -106 -30 15 -3 260 -144 180 -86 -237 -155 161 -97 -99 48 64 -11 207 98 329 107 -30 182 227 -129
2380 -129 -187 -55 -257 -157 66 41 98 -80 -106 46 -17 179 100 104 -8 -98 37 192 -51 173 -115 27 1
2403 1 18 33 60 -69 108 132 131 -115 179 -185 -144 59 -74 -43 23 -28 -169 -124 -169 44 133 -143 -51 -252 -56
2428 -56 33 103 71 121 -34 -72 36 89 -42 -184 -11 -240 60 12 289 212 -22 32 -129 109 156 36 -22 -117
2452 -117 -113 -214 -87 81 -125 -110 26 -76 -123 -30 -151 -27 34 279 -45 -69 -70 152 86 -79 210 15 -25 -107
2476 -107 -262 -53 218 -179 -151 -194 -41 -148 -100 164 131 16 -22 -149 70 78 -297 184 15 -89 20 31 -251
2499 -251 9 -252 128 65 152 169 89 16 98 -23 -52 -106 -143 -19 6 231 -39 -209 10 -312 -55 -425 54
2522 54 271 -188 121 123 158 -42 -128 36 10 -152 263 -68 0 141 85 100 45 79 -7 -31 54 22 -94 26 -73
2547 -73 114 -40 31 -182 86 -202 49 282 70 -97 199 24 268 -60 15 27 88 -154 -100 -67 257 6
2569 6 -19 -30 -62 -18 113 81 -112 20 59 163 -274 105 25 -24 -94 17 33 -303 -30 -130 170 2 100 -156
2593 -156 -130 221 106 -238 407 -108 -207 94 88 111 -149 -41 60 -17 119 175 -152 -67 -9 20 258 30 6 -123
2617 -123 -96 -280 -7 -160 31 -131 17 -75 -73 67 55 33 -27 138 46 -242 24 -47 8 -153 -107 280 -30 -78
2641 -78 -84 258 -76 188 -197 -239 -73 23 -166 75 -139 -141 113 140 -15 105 15 218 -21 107 30 104 -141 -75
2665 -75 -137 94 185 -160 -68 -56 75 57 -171 221 114 236 77 127 121 12 -43 -71 241 -166 -99 5 -84 -87 -16
2690 -16 -39 1 145 -9 26 -213 -45 -140 -19 -33 345 64 122 60 94 109 -165 194 163 -55 149 73 82 62 50
2715 50 210 23 -215 -125 201 4 138 -101 -300 -59 -71 -288 222 31 -93 151 -49 46 -157 -212 40 14
2737 14 -73 353 -140 -157 26 173 -216 7 -49 -136 45 -135 -192 249 222 -281 60 140 51 185 14 -101 26
2760 26 74 -25 178 72 28 -407 -220 54 -116 -125 -116 -173 -73 -281 -42 132 -77 -109 145 -54 -283 -265 -161 15
2784 15 135 -37 -288 -92 -27 -131 -1 -199 62 103 -63 183 -60 46 -3 -8 -110 -27 -283 6 -106 -308
2806 -308 26 -178 -13 92 -10 -84 121 -88 218 76 -136 -92 -232 -11 -99 -23 151 52 -18 -176 -25 -91
2828 -91 205 39 -114 -110 -17 119 -87 -277 9 -138 -162 -59 -177 -46 -21 -164 102 171 -163 111 32 132 21
2851 21 -51 69 164 198 39 229 132 286 121 -92 -96 145 -52 19 110 -106 57 210 -87 -234 15 3 -42 -142
2875 -142 -164 -158 182 -56 -84 111 202 -24 156 -140 -304 12 7 -41 -136 149 -62 113 -180 154 19 -246 130
2898 130 -10 52 -41 95 -104 -145 208 134 105 7 89 132 148 66 144 94 6 -72 91 -165 65 65 66 -85 105 175
2924 175 -51 37 -86 19 -147 217 -76 -133 -37 -67 -184 -120 41 29 107 -132 -58 79 -102 -30 -161 170 117
2947 117 254 43 36 -75 132 -71 146 20 58 -47 -246 134 41 28 4 265 -11 63 283 59 122 160 -279
2970 -279 20 -11 106 0 -3 -95 -100 -67 -10 50 190 -52 -279 -121 -35 390 -114 164 83 246 194 -128 -169 113
2994 113 120 98 89 -147 175 -174 -183 20 12 82 326 129 -180 -92 -61 144 -79 -87 -71 -147 -130 23 86 156 -86 -191
3020 -191 -69 -9 142 -112 -141 -16 151 141 80 35 76 57 46 8 206 -37 33 -174 -36 111 -83 100 123 -77
3044 -77 -35 195 -209 -141 -4 300 -10 145 5 -6 107 234 48 -292 -62 -199 -62 -321 77 6 -222 -131
3066 -131 -4 -240 -22 -79 251 -7 -46 -69 75 -10 122 -16 176 -37 29 158 55 -2 119 36 217 -37
3088 -37 17 53 4 47 -197 28 -291 141 -35 142 -76 11 -34 -98 211 -156 -28 49 214 -162 -205 18 51 -117
3112 -117 0 0 206 143 -70 -25 265 198 81 60 -87 -40 -36 -146 -144 316 -37 109 -46 -21 12 -136 113 222
3136 222 -73 10 -54 166 83 -233 -2 51 168 -76 -15 -108 16 43 225 -153 137 33 97 303 262 -144 -6
3159 -6 92 186 0 11 47 -135 -54 0 106 186 11 54 331 37 -13 -448 -154 55 75 -45 190 -25 -29 195 -110
3184 -110 -106 -118 -44 -33 83 -192 74 49 165 -110 -180 269 -294 -105 -10 -219 117 81 57 142 -172 -61 -119 -55
3208 -55 33 -64 36 296 -90 -41 -18 121 -12 -165 196 136 91 -45 106 -127 -63 145 -166 -156 80 179 -120
3231 -120 31 -97 108 -174 -29 198 179 -138 -70 54 81 99 -218 -51 -124 69 -196 38 -70 107 -28 -247
3253 -247 -189 -305 -190 -437 -87 -2 -176 119 3 133 64 -125 70 -127 -150 44 23 -70 -54 -134 292 -3 241
3276 241 20 64 67 51 -67 77 -61 92 19 -29 -180 57 -217 -213 30 151 -115 -105 -267 -270 -25 -95 -84 24
3300 24 -64 39 226 -8 121 179 146 -111 278 -61 -69 20 128 -33 389 -275 133 -22 63 124 -195 36 35 44
3324 44 146 -6 117 164 -31 52 -67 17 63 78 157 57 142 -2 197 -288 65 119 -96 190 -121 -51 -36 -77
3348 -77 -227 180 119 -46 135 208 -92 -76 196 -79 2 249 257 102 -278 -72 192 45 65 -38 -120 -14 -40
3371 -40 -107 37 -73 90 90 312 63 -111 203 7 -95 16 -126 -126 -105 102 151 -21 -35 61 -291 -279 11 72
3395 72 14 -11 72 69 -99 -138 57 -34 -76 -98 -208 -12 147 68 -97 -11 -215 -225 -221 47 224 -35 -186 -143 79
3420 79 -40 -72 60 -32 9 108 200 171 -11 -18 122 146 -7 4 -13 97 -18 -221 -68 118 40 125 -127 415 -172
3445 -172 -12 119 -73 -76 -72 -104 10 -75 142 -44 31 -107 50 -58 -26 -32 -18 -232 78 -261 -22 13 145 -47
3469 -47 -102 -54 -55 -135 -56 199 -24 52 94 142 85 -312 88 72 31 119 236 132 -81 -251 -187 86 -292 70 -77
3494 -77 177 3 48 137 -68 110 232 -156 50 146 86 -7 41 -98 -17 -89 -236 181 5 -39 -103 51 -81 179
3518 179 211 -125 236 149 -98 -52 -40 -155 -26 147 163 256 -15 57 -267 18 -95 -20 29 321 15 -154 -222
3541 -222 -14 -67 -41 74 63 -8 -247 -168 48 -112 -36 -26 -167 154 -62 -259 35 200 27 -137 10 169
3563 169 -255 -43 -291 -297 -125 -28 31 -231 -21 -81 249 -175 -54 -38 -221 -32 -20 -208 -223 -5 -63 -8 -104 -84
3587 -84 -12 76 -146 -251 -59 -120 -127 -138 -141 -30 140 27 77 -67 67 -52 81 331 158 39 50 -130 -86 -75
3611 -75 -58 22 -78 -26 319 119 -183 -116 119 -37 53 115 -155 -202 -153 -15 -83 -209 -50 -207 108 196 -178 61
3635 61 -76 -31 -18 -84 -44 286 -61 -24 -89 -300 -157 15 78 156 -119 -243 60 -16 76 -117 237 -23 -134 89
3659 89 74 -15 -55 -124 316 -72 339 -192 179 -225 23 202 -204 -115 141 70 -23 60 -8 32 233 -50 -69 430
3683 430 -84 -255 106 -252 182 170 -75 -200 182 -59 -367 -109 33 112 -170 -189 44 209 24 -88 -268
3704 -268 -5 -170 90 -230 -72 63 217 -109 -169 -33 -186 193 -26 260 378 -116 -74 -293 -307 -46 27
3725 27 99 -197 -92 -155 180 -59 165 -38 59 94 68 87 187 -39 -10 -76 186 -21 106 125 -43 -131 -49 -62
3749 -62 -123 -119 -37 132 -21 9 301 -38 -151 -30 -117 123 101 36 -51 -19 -1 -13 -243 -20 -154 -122 -7 -102 43
3774 43 135 35 152 -224 -173 50 -7 7 68 -177 -29 -49 68 12 120 33 149 -99 143 173 57 86 -90 -22
3798 -22 272 -54 -264 -33 175 182 -59 -12 -78 175 22 94 53 154 152 -230 25 -340 -216 -263 -8 -33 -21 157
3822 157 123 -94 195 105 -1 95 22 281 -132 -90 -179 70 -153 45 -28 -70 -87 -6 110 -163 41 -97 128
3845 128 -34 89 52 -17 -166 1 101 -462 14 259 -75 291 -55 -211 98 -4 242 61 69 174 -91
3866 -91 -185 27 125 -262 149 -362 35 -86 55 -255 -86 -18 122 -14 55 -41 -270 42 -29 355 -186 154
3888 154 38 100 123 94 84 26 27 110 -77 -15 116 -53 5 -149 40 83 -224 15 -70 83 -120 -24 174 -101
3912 -101 -15 40 -9 -93 297 201 -92 -70 243 316 -35 -46 -58 51 200 -15 -154 103 15 -57 159 125 59 -35 -350
3937 -350 119 -22 69 74 -41 87 -142 -114 -78 -133 -51 -73 -157 -147 42 143 305 -120 52 -23 -295 328 -26 -71
3961 -71 60 312 11 -50 17 51 -253 -123 104 -104 -43 173 -43 -38 -305 -38 -21 -87 76 53 -33 133 -57 -224
3985 -224 -40 -184 -126 -55 114 -89 131 -13 113 -132 -28 42 176 163 253 314 132 -107 -194 89 -175 36
4007 36 5 -210 -111 -44 15 -49 -3 -20 -48 231 14 51 47 120 -118 166 122 -221 200 182 -52 8 236 25 86 -11
4033 -11 -109 30 187 -7 -160 -4 -54 -154 139 352 130 -164 -11 -74 -84 191 35 -79 -230 -172 -88 290
4055 290 -170 145 92 32 -77 23 91 139 -31 -133 94 42 -40 -72 -167 -59 -70 160 -24 64 -54 219 116
4078 116 41 316 114 112 -49 -509 15 -127 -144 351 -38 -49 22 -25 -38 -35 -19 -191 -29 -9 19 -126 52 71 -197
4103 -197 63 -69 24 12 105 70 -108 -212 41 -135 52 -138 63 108 -26 -33 -203 -260 -99 -190 69 -111 46
4126 46 -118 -286 -20 145 -90 -75 -195 199 164 2 80 64 29 -144 74 -62 186 -41 102 -126 -224 -47
4148 -47 112 -6 52 215 201 124 276 396 -55 144 25 222 -97 -186 -158 -65 -222 -190 -87 -118 -49 295 -204
4171 -204 -124 83 146 13 12 -112 -128 -138 -111 139 68 77 -46 240 -12 -112 -111 49 39 44 23 80 77 266 -256 -291 237
4198 237 -30 164 245 -34 312 -19 -150 -252 297 206 143 86 250 250 0 116 -125 -53 -302 138 155 -53 -94
4221 -94 118 -82 47 -74 217 -119 144 73 -89 -229 114 -25 280 124 57 -87 -241 139 -147 321 64
4242 64 -117 -293 41 2 -147 177 110 -35 10 -225 -173 22 -188 65 -138 38 27 216 32 -183 -159 77
4264 77 -173 -130 -13 411 49 113 -155 -93 446 260 70 -240 0 14 111 30 187 -46 84 -48 -80 76 -146
4287 -146 96 -12 187 147 -24 174 -47 -18 207 -111 -109 -137 65 112 180 15 -88 191 24 112 36 88 -19
4310 -19 -82 30 -309 5 141 118 -110 72 150 -30 -89 52 99 -49 -34 -51 24 -4 -83 -139 -8 139 99 218
4334 218 140 313 148 71 116 -302 -177 -120 -72 -217 190 -46 -105 -138 -114 -93 -203 90 29 54 45 63 -59 27 -53
4359 -53 143 -82 78 161 119 -50 50 15 31 4 101 -159 -282 228 -92 -57 116 139 -94 52 4 -39 56 -108
4383 -108 -168 -86 44 -230 1 269 -67 -70 106 80 -124 102 139 126 -14 39 -106 55 -53 -63 191 130 118 -20
4407 -20 -27 36 211 -70 265 103 -174 -87 97 -65 -199 151 -45 -99 -103 -71 -80 -88 -54 156 137 10 138 18 106
4432 106 328 225 157 -174 45 -8 -2 97 -136 -78 -91 38 71 -184 -204 -107 -47 -108 -81 123 147 -306 93 -194 -202
4457 -202 102 184 166 -210 36 177 -9 -179 69 -63 104 -171 54 72 200 106 112 88 233 81 -1 228 389
4480 389 59 -58 9 81 35 47 37 -128 -140 149 -145 -106 -252 179 -41 75 168 -35 207 6 -83 119 -117
4503 -117 59 -15 126 116 -13 57 191 -26 -38 98 134 124 78 325 86 312 98 -158 -10 -190 -332 -68
4525 -68 -90 107 49 -125 12 61 -96 -26 -82 2 -79 105 -130 53 18 35 -170 -52 126 -210 -40 61 96 348
4549 348 -19 -37 -87 -174 120 32 -158 181 395 -388 -102 69 -215 -52 -27 -82 -78 -43 -165 22 -19 -25 149 -67
4573 -67 11 114 131 7 -254 -162 136 -157 -105 46 -140 -44 120 14 -136 -101 -131 -73 56 243 -225 43 90
4596 90 20 -3 120 55 -419 -116 408 -101 -225 13 190 124 146 -40 -123 83 -5 -41 -179 215 -173 -152 -112 -69
4620 -69 -177 -37 -43 163 -115 5 103 -332 -17 60 -18 -67 58 50 -28 -64 -201 22 21 130 78 -321 -28 -38 -110
4645 -110 73 168 42 169 73 65 -160 35 112 -237 -104 27 -56 -106 -13 -18 65 5 -72 -33 213 -21 48 -130 13
4670 13 -67 -71 98 10 186 71 -13 -264 62 27 44 79 67 204 -39 86 215 178 -144 163 70 56 -197 9
4694 9 -115 -75 -21 -104 -171 145 45 250 77 227 23 11 162 233 196 -148 -70 -273 25 43 449 -50 59 9
4718 9 -145 87 8 125 101 -17 65 269 45 -138 166 -407 -307 132 120 -75 55 131 201 -56 -164 55 -123
4741 -123 102 -192 73 185 163 -174 113 33 -120 -26 -161 229 -289 21 155 -112 143 23 105 20 -103 -49
4763 -49 -82 -124 -32 -96 -49 252 -9 -49 28 61 -102 -31 -157 164 173 183 133 18 306 -21 -163 97 78 173 -157
4788 -157 -132 45 -15 64 223 21 325 -79 289 -139 -4 64 134 138 -39 -41 136 -121 -79 -211 -249 -63 121 137
4812 137 -67 -28 22 209 110 -206 -150 159 111 176 -75 43 -127 -282 134 -18 106 105 -175 25 5 -8 -20 116
4836 116 8 -86 19 -156 42 281 -76 -26 -141 64 255 -70 -136 -9 46 -50 118 -138 56 -43 134 78
4858 78 -188 -47 7 130 -56 -107 -4 -121 -127 -29 -120 -51 238 -33 -77 90 10 -101 -46 -13 -81 -100 -202 -26 56
4883 56 -79 20 329 -55 374 163 235 -60 200 62 259 109 35 415 -165 -113 -95 -10 83 73 -119 -85 113
4906 113 -39 -61 -183 150 7 -27 -8 218 76 -57 -190 148 -264 -35 -149 215 -132 41 -16 -180 -63
4927 -63 308 -263 -342 -135 -30 13 -18 -60 -140 -136 125 61 -105 -43 19 -2 162 51 123 165 372 -39 -30 286 158
4952 158 -123 -80 170 -294 61 -21 135 68 111 -88 128 83 -114 -100 34 138 180 -193 37 -103 -127 -28 -108
4975 -108 -231 201 -132 -62 3 77 -28 -82 -65 -6 -58 -23 -75 68 -8 -89 82 -207 -222 -64 62 147 88 -151 -220
5000 -220 -39 115 121 48 -176 72 81 287 -57 92 -19 -29 129 -26 225 79 -80 47 149 -74 125 -88
5022 -88 -129 67 45 -122 -172 -236 59 8 -65 -39 -62 -252 7 238 -103 55 183 -158 -65 115 207 -120 115 22
5046 22 55 94 45 132 67 -165 -320 -42 -10 15 358 -54 -162 123 -12 27 -89 -204 314 -60 71 -101 -132
5069 -132 379 -161 -80 -35 -82 -15 -54 246 284 -93 106 72 78 209 195 -12 63 -26 -285 185 -40 -108 -15 -35 230
5094 230 80 -47 36 -38 -42 70 -46 -132 -177 -45 -83 -172 -4 24 -119 -98 -242 170 -115 -69 -65 -137 -115 54 117
5119 117 -56 222 64 168 284 26 -69 -170 255 -133 42 80 -56 -78 -267 160 -20 -309 119 -130 -119
5140 -119 198 9 -10 -40 -11 -191 249 211 -112 99 14 177 -104 14 -26 -357 346 66 129 -37 -187 8
5162 8 -285 -67 6 -122 210 123 85 111 24 12 -3 -50 -54 -46 77 91 -180 -11 228 -201 255 -38 61 67 -96 25
5188 25 87 -147 148 137 13 278 252 176 -22 255 -79 -135 41 8 254 133 -158 -23 -148 291 235 -19 189
5211 189 -10 15 62 -196 12 -66 -4 124 -87 75 8 94 -61 182 101 140 -187 -115 -117 161 -110 -31 125 233
5235 233 -123 -6 -7 70 129 -127 -104 -56 -143 -241 105 -149 -55 -13 50 -193 127 233 159 63 -90 138 20 -104
5259 -104 -46 -200 119 -160 -83 46 189 189 16 -56 56 -207 -8 -328 -24 29 -100 -232 -69 -81 -36 106 -155
5282 -155 -321 -135 -18 8 -89 -94 -159 164 -128 76 73 72 63 -199 31 54 -171 270 17 -120 -18 101 226 36
5306 36 -27 -131 -24 -199 195 56 -102 135 138 -34 -91 6 2 159 -256 -169 -200 7 121 -58 85 273 -9
5329 -9 61 111 177 165 -10 -238 103 68 7 -41 195 -78 -139 168 0 -89 -331 195 78 -106 32 -132 201 11
5353 11 31 114 75 138 -82 281 -261 73 140 -72 -238 -143 83 -124 42 185 230 158 -19 -155 169 111 11
5376 11 58 -141 -240 46 124 184 -134 8 133 150 52 172 -156 117 67 -64 158 123 1 -42 85 78 -49 94
5400 94 -161 -110 -93 -71 -232 -87 31 33 -19 -57 -39 76 -34 23 186 62 58 125 -34 -190 -64 20 -13 -46 26 -37
5426 -37 -51 207 100 -37 -92 131 236 116 72 -10 -72 239 116 -122 -236 48 -49 -114 -121 222 -167 30 -76
5449 -76 133 31 69 -17 169 -311 223 84 -83 -73 -222 83 -219 -46 17 -299 -17 59 72 -263 -267 6 -109
5472 -109 -9 152 -63 37 -1 -65 -22 184 57 -46 -55 -209 239 -238 40 41 1 -143 -1 -277 135 133 96 -41
5496 -41 104 -25 15 -29 143 31 -49 22 -2 139 67 99 239 -195 -63 31 -22 -28 230 -120 -99 -19 -70 62 181
5521 181 -161 77 -2 -27 -146 -275 -162 47 -139 -224 162 30 37 -319 106 67 -37 91 -18 101 314 -7
5543 -7 17 96 13 266 -107 -224 20 71 5 46 78 -29 29 28 40 -138 159 -56 -17 56 -47 -132 178 -59 -31 -202
5569 -202 -90 -35 117 -47 69 -60 -164 -10 -6 -96 39 168 -90 -289 63 65 84 -172 23 105 84 320 39
5592 39 302 -50 16 -203 -96 203 -30 123 -86 -275 84 -68 -4 -154 42 11 -218 -20 -24 -57 -106 -32 -68
5615 -68 -52 38 91 -135 48 -137 118 165 -84 261 -101 -82 -355 32 116 -63 -80 188 17 76 -28 -246 178
5638 178 9 48 -62 136 47 -208 293 132 -2 -2 40 -65 -200 -54 145 -109 -296 33 63 196 -56 -106
5660 -106 -90 -38 141 139 89 65 -234 222 -135 -97 -81 262 -19 30 -94 -151 -193 39 175 67 167 211 -342 65
5684 65 197 57 355 -174 -228 0 -37 188 136 -27 20 -303 165 -64 113 -15 -40 168 -237 173 78 -176
5706 -176 -50 -202 -135 -199 1 18 -90 -168 -224 -96 -55 115 -128 128 105 -150 -134 80 86 -76 153 -20 36 85
5730 85 150 16 24 5 85 -82 254 -278 -69 -44 151 252 143 -352 -105 -72 6 -24 -212 -147 -51 -60 12 -40 182
5755 182 281 29 158 -113 -94 -64 -254 -272 -113 196 -23 354 314 -37 130 -110 -127 -160 193 176 -312 -329 -33
5778 -33 127 -4 91 -93 -380 -43 43 -108 316 -45 20 168 -18 -101 259 -132 -28 126 -58 -97 142 -28
5800 -28 -140 97 37 -120 -149 -80 261 -70 198 113 -75 -42 4 -189 107 -201 111 -151 -331 20 110 75 -150
5823 -150 11 -198 -195 180 -53 44 39 -35 66 -78 29 100 196 -134 66 -50 64 137 -30 -127 123 -112 310
5846 310 8 -31 238 -126 54 -141 17 67 -95 45 -86 257 141 289 192 -50 -61 148 -140 167 81 89
5868 89 172 24 112 31 27 -163 90 -178 0 -180 -178 4 -114 184 145 -40 11 10 39 -138 -119 -3 -6 253 -206
5893 -206 -142 -81 114 -175 -138 -153 -131 80 -10 22 20 8 10 -161 4 -113 -210 21 -140 -88 -101 -177 59 167 88 71
5919 71 -14 65 -177 222 -168 86 127 31 105 106 -40 318 -146 134 -127 -43 158 -24 40 12 126 37 159 -12
5943 -12 -9 26 49 -62 -36 56 -52 -8 -34 108 17 95 133 29 -78 174 350 -172 -109 155 9 95 62 -15 60 -6
5969 -6 -74 454 272 -125 79 9 -20 -361 -118 -222 164 -186 45 -95 123 188 9 -9 -109 -21 -73 -22 -95 20
5993 20 -16 220 131 -135 255 -17 -40 -68 -114 -37 -4 39 163 -91 -232 86 -45 -285 -74 -137 -6 -50 97 64
6017 64 -133 -75 -113 -158 -85 92 22 -293 -139 -124 75 -315 -14 24 -28 -32 -61 -112 -213 -320 252 114 146 -168 44
6042 44 136 -20 -145 -17 188 63 154 14 -20 -51 -117 -51 -54 41 -30 127 -59 -201 -180 172 159 2 -92 -370 18
6067 18 -219 -52 271 -78 65 53 -59 -43 85 -19 9 57 -210 12 -51 15 -119 -115 29 -540 54 -80 -76 -28
6091 -28 36 58 -105 146 296 157 148 -39 275 163 248 -148 77 242 226 -138 -66 -28 -112 40 -95 -70 -57 -283
6115 -283 -81 106 -170 35 36 183 -188 229 205 125 -58 47 -325 -21 -142 103 -96 192 -59 37 16 41
6137 41 25 13 -64 278 130 -136 112 137 -29 42 138 -200 -143 -71 -165 -38 -119 -256 176 -10 88 232 160 79 52
6162 52 -2 -73 -272 -55 144 54 -72 -89 -234 216 -173 107 2 -137 79 313 -168 144 87 138 -30 309
6184 309 -173 2 150 8 -182 -14 -247 72 288 173 130 73 159 -216 43 146 47 35 240 -188 46 113
6206 113 28 228 -38 -50 59 172 254 -32 -124 78 253 -6 152 282 -144 243 225 -162 -143 -50 -83 274 133
6229 133 -126 -339 -114 -75 83 -55 119 -56 -76 145 -64 316 303 94 214 87 -20 106 61 150 46 -36
6251 -36 131 -335 -44 155 -54 -245 102 30 -236 -29 166 176 247 -69 88 -56 -83 -53 70 76 76 32 -191 138
6275 138 79 320 195 -62 4 44 172 -93 6 65 82 281 -181 99 28 -29 182 88 71 -166 -170 42 -130 88
6299 88 116 -11 101 31 -87 121 -133 63 66 -22 -234 34 -27 -186 119 134 -53 36 205 197 55 -65 43 135
6323 135 1 -295 130 236 -181 -36 -172 -128 -129 -64 18 -76 -351 -13 -13 -122 233 313 -80 -120 80 -79 -154 -28
6347 -28 115 111 186 145 -54 120 -65 -203 -227 -219 17 -18 -87 -23 -41 -153 -214 128 84 236 30 86 -127 35 -83
6372 -83 116 170 128 79 -8 106 -91 -39 -228 28 147 -82 4 -52 252 -157 -281 -58 -114 126 -72 92 -109
6395 -109 165 69 -190 69 140 118 -269 -62 -25 -131 31 -115 30 -94 -137 197 82 37 -234 -118 -79 -157 41
6418 41 -12 88 102 -52 136 -41 228 -20 120 8 -117 117 33 -138 96 -163 135 -63 -56 10 72 -122 110
6441 110 -83 -198 295 190 244 44 203 156 106 -48 65 169 65 -78 200 28 55 86 162 103 -83 40
6463 40 86 63 -156 108 -249 123 1 -176 -61 11 -54 55 192 -52 -155 24 -56 10 -37 114 -177 268 33
6486 33 -221 -83 -57 69 64 267 73 -78 -31 98 144 -157 -142 -2 -5 126 -48 143 -22 145 199 -186 63
6509 63 64 -174 329 -150 82 131 -49 -103 102 93 142 27 171 -78 -76 -170 125 168 141 54 112 30 60 -68 42 25
6535 25 175 29 33 90 92 218 11 38 14 -259 139 -144 -29 105 -155 291 -47 -127 -295 -84 116 -111 -103 268
6559 268 237 21 60 104 -45 -252 -210 -85 59 0 -96 -135 -122 248 32 -19 -24 262 -246 68 -94 -26 171 -120
6583 -120 -21 235 -254 16 45 -23 135 20 193 -263 -63 134 -2 -37 -84 175 -25 70 114 -121 -16 32 285
6606 285 -127 -40 104 -121 124 30 40 218 95 -38 80 -40 -281 17 -117 -124 2 239 -90 -56 -135 213
6628 213 116 -266 158 27 16 -70 17 122 61 -107 71 294 -203 -196 80 131 -156 -18 -190 155 -236 -8 132
6651 132 224 96 -64 70 -134 -18 -96 76 -111 140 -5 60 -141 -262 -57 22 5 32 -155 -76 -276 73
6673 73 36 -152 47 18 27 14 5 -51 -95 173 -4 -121 -112 138 239 105 103 19 125 83 -207 72 -120 43 -44 -78
6699 -78 20 59 110 111 66 -20 104 -60 -93 -163 -73 356 99 -35 -201 -119 97 93 66 53 110 -55 -55 235 -83 -25 -202
6726 -202 6 118 -84 120 100 -12 -333 17 1 -241 90 -69 26 -185 -20 52 48 8 -32 153 221 -229 42
6749 42 64 -82 24 118 100 33 1 126 68 204 252 142 262 191 217 -270 15 523 -149 52 -186 52 149 15
6773 15 40 -33 -71 111 92 158 15 -210 -222 18 32 -52 -47 -113 -68 80 84 -7 -20 -252 136 -75 -191 24 -88 -228
6799 -228 -57 38 -85 147 315 2 115 75 75 -10 -31 24 -102 25 79 379 1 144 -77 -62 247 -118 10
6822 10 -152 -132 288 -25 120 -200 -90 7 -317 170 -107 143 -30 4 -21 13 -20 -385 -47 109 -126 -131 196
6845 196 91 -100 183 -17 -9 -166 -87 -61 27 -166 91 51 49 101 -73 -26 -73 -50 -31 -56 32 109 -64 -2 -125 -96
6871 -96 102 205 13 108 -111 -10 -30 -99 20 -29 113 -207 -115 -133 -78 72 79 21 -339 35 77 150 78 -174 88
6896 88 -217 -133 -35 226 62 -50 46 -90 231 -15 -230 -80 -207 -17 -249 -119 -92 38 -71 -49 20 71 -189
6919 -189 178 143 31 -120 50 -86 76 -42 109 -8 32 -197 -55 -124 -11 218 -34 391 185 -74 -123
6940 -123 49 77 -20 11 -59 -53 36 -54 137 -35 126 -16 37 35 -17 -9 227 41 -58 -139 -75 28 -9 134 -110 62
6966 62 98 114 -96 -60 -71 30 -80 -45 267 -128 -126 -90 267 30 -214 -149 -6 -45 -107 40 63 -153 216 -137
6990 -137 43 110 25 212 -124 81 61 -125 -348 -103 -45 -216 -304 178 -29 87 -140 -230 -139 142 -168 -74 55
7013 55 -233 -121 -184 -47 -19 -18 98 -44 -216 45 -218 33 -43 162 -9 -9 -192 -217 -62 -201 355 271 50
7036 50 -106 -90 -177 70 187 -141 -169 -247 -153 74 -60 38 -119 220 -99 -105 64 321 209 78 -161 21 193
7059 193 13 161 379 -12 39 -80 2 -24 63 -151 -51 25 -211 49 -43 223 -125 -173 140 29 -103 -247
7081 -247 175 -9 -230 -118 -161 38 -40 -49 85 179 -182 85 10 -26 276 -164 -104 -127 255 -187 -32 -87 242
7104 242 -97 -129 376 -10 133 -23 20 54 198 233 16 61 115 -56 20 -45 80 -320 55 55 64 -29 -225 -21
7128 -21 -27 -86 76 38 180 58 195 -97 -79 -143 -68 90 -24 -29 -30 -54 49 -46 -25 47 -46 -174 -23 -49 -209 -282
7154 -282 58 84 -98 -28 8 -117 164 147 150 113 107 -34 4 54 -46 162 -64 161 -116 130 -107 -13 36 132 17
7179 17 157 14 -27 -97 -49 -69 294 99 -274 -45 -36 54 -50 212 175 -245 -82 -144 -49 -151 -69 -83 -41 -34 -70 -49
7205 -49 -116 -163 -175 -41 -35 -42 -196 62 -61 -95 -40 123 -57 216 287 -5 12 3 -136 250 213 58 -104 20 -121
7230 -121 -237 64 -14 -2 -334 -100 -254 -64 -205 382 78 -64 45 -51 -62 -161 69 191 198 65 128 -66 -33
7253 -33 33 -83 21 89 -274 -40 166 -85 44 420 -46 -111 15 -239 -2 159 276 -118 134 7 -151
7274 -151 -239 -104 110 83 149 -160 102 24 -85 -236 39 33 67 -220 93 -70 11 4 -46 -21 319 79 -133 28
7298 28 -12 114 301 -17 -179 -160 -92 -52 -18 198 -10 -21 20 44 -247 -78 -174 71 80 -34 299 318 121 214 14
7323 14 241 -80 151 -91 -3 78 89 -17 57 20 -33 -113 109 1 39 -151 13 21 52 152 -103 131 98 2 112
7348 112 140 93 201 73 46 -24 -69 -79 139 15 218 -6 121 -14 -403 -63 -91 82 -163 -39 -163 237
7370 237 -42 176 28 40 -129 -11 62 -3 230 -39 -143 5 326 12 -49 29 -98 -62 -169 60 202 162
7392 162 51 -17 -10 -212 3 -135 -131 138 -40 -65 -41 -284 189 -49 201 -232 -180 155 215 -252 236 134 84
7415 84 87 70 208 25 -63 165 -73 -84 156 -294 -131 62 -119 -135 2 -23 -67 -187 -256 55 209 109 -118
7438 -118 -14 174 -48 186 -129 73 -57 6 -69 -93 -111 100 49 97 48 125 -50 -165 -30 -35 -66 62 -54 289
7462 289 319 -20 86 -319 -25 -117 -170 -26 169 187 41 -136 2 203 193 175 -118 57 123 162 -212 17 -108
7485 -108 53 -3 24 129 -62 -322 -51 -32 -34 -88 15 26 125 18 -48 -60 -63 104 27 -212 -65 -194 -160 249 -25
7510 -25 -81 112 14 -156 102 -81 205 -146 17 101 -99 -20 -4 53 -242 141 -242 153 -1 -83 -198 108 40
7533 40 126 -63 -155 -219 -146 -90 394 154 126 61 124 -125 186 115 224 -244 -155 125 54 -41 31 130 8 101 -66
7558 -66 18 -41 97 -1 -291 32 78 78 143 -54 -38 25 -145 63 28 -148 -101 118 -198 -53 186 149 -144 145
7582 145 -53 61 87 -3 194 149 152 15 26 162 -165 8 126 4 -165 -22 -95 -200 -92 -19 -260 -53 42
7605 42 144 20 -98 44 82 -219 60 85 -76 34 217 -47 -67 131 -43 36 -26 169 59 -210 21 -95
7627 -95 150 35 -118 172 -91 -289 39 64 58 -4 85 129 -168 152 -12 -27 -62 -85 -124 -170 -101 78 -60 -144 162
7652 162 88 85 106 43 125 -57 -35 -90 113 -137 -207 110 5 19 -171 -92 -156 -118 -289 -5 -114 -187 70 -52 147
7677 147 -53 -162 -23 118 207 362 -266 73 61 -54 89 -124 30 235 48 -105 -1 -336 -33 -32 115
7698 115 211 336 70 -80 -90 -130 259 60 194 -273 -1 145 -109 -53 -1 138 10 -40 48 192 -52 -74 58
7721 58 189 151 -126 -12 257 90 106 146 -105 129 255 -91 58 -54 -30 201 170 119 -110 -288 -4 -305
7743 -305 124 198 76 18 -21 117 -131 234 -207 25 121 -308 217 112 247 -152 56 -138 201 383 -42
7764 -42 177 -98 232 140 296 94 152 -213 -52 68 -135 -89 128 172 -257 -105 86 117 43 222 64 -58
7786 -58 -60 308 297 -177 317 -80 -101 -92 132 -170 -109 -143 26 122 69 -192 -12 -224 89 -71 -342 -124 -200 -222
7810 -222 25 14 342 118 72 128 2 195 449 -7 -120 11 -105 25 6 -76 -290 79 -172 308 -128 -136
7832 -136 78 282 62 -97 72 -61 154 326 -97 -109 120 63 -44 -56 -65 41 8 9 -30 -238 14 263 -62
7855 -62 -24 -176 11 39 -12 -188 313 34 -3 134 192 -68 186 109 9 104 -70 -178 -3 132 -126 62 -159
7878 -159 -19 52 -64 17 -60 76 -125 -49 100 24 -26 -40 -79 -44 -141 -18 216 222 332 -168 -61 84 34 -98
7902 -98 91 -92 -58 44 -4 -100 147 9 8 -112 -176 -162 96 -5 15 11 -30 -113 143 7 394 84 214 218 -155
7927 -155 227 89 51 -83 49 -90 139 141 163 76 122 -80 17 24 -99 94 -212 154 238 -23 16 204 -187 120
7951 120 108 136 210 -169 208 -116 32 235 104 50 95 -2 98 242 108 -50 -156 -256 -83 -100 111 -61
7973 -61 96 26 85 -39 51 13 122 -40 95 -4 201 98 -36 -155 1 61 81 72 -93 50 -92 -34 -114 172
7997 172 70 77 -62 -138 -31 80 102 -81 -132 94 119 -176 125 -341 51 -200 -146 -116 174 43 -42 -49 40 141
8021 141 216 174 171 -3 -187 -38 -146 -93 332 -206 -289 -205 -163 117 -97 23 103 -14 -124 -98 -196 23 -106 -168
8045 -168 -243 -181 32 -214 -357 -82 -197 -1 116 161 -200 15 -88 -22 -133 124 222 -18 88 48 113 -219
8067 -219 86 -75 114 165 128 -293 -117 -243 179 153 -123 6 30 69 25 -349 -15 311 76 -101 35 -87
8089 -87 22 76 -20 23 206 -118 -82 -217 44 -63 110 315 177 282 -185 9 -292 -35 -45 225 9 94
8111 94 -323 31 90 -8 -111 -15 -142 -96 28 116 40 -214 -274 -312 -174 -112 -110 160 -209 -54 159 -133 -308 100
8135 100 144 68 191 112 -77 -178 12 -50 148 153 -39 69 143 -224 -52 -31 -210 -221 -221 -20 18 122 -8 75
8159 75 -78 -91 371 88 157 10 5 128 49 72 -114 -82 92 26 45 91 218 21 -106 219 3 -105 -6 -55
8183 -55 -76 5 106 136 -103 -105 -112 108
8191A08
$$ Imaginary data points
##PAGE= N=2
##DATA TABLE= (X++(I..I)), XYDATA
0 0 0 0 0 0 0 0 0 0 0 0 0 0 7 -7 7 -7 14 -14 14 -21 26 -28 35 -42 49 -56 64 -77 88 -99 115 -131 147 -168
34 -168 189 -214 240 -269 299 -334 374 -414 459 -509 563 -623 687 -756 833 -919 1011 -1116
52 -1116 1228 -1357 1498 -1659 1841 -2050 2292 -2580 2924 -3344 3874 -4561 5501 -6858 9000
67 9000 -12914 22367 -97227 -43824 96695 -72382 -18897 50459 -18689 -25337 16102 -19430
79 -19430 25823 18799 -42156 4619 39036 -20678 5471 20622 -15076 15089 23969 -23048 19683
92 19683 45200 -12497 -15109 27715 20113 -2895 -15315 742 14133 -18216 -19023 25897 9098
105 9098 -21722 -6270 -8359 -9619 5733 -17912 -18874 17162 -1800 -24328 2672 5578 -6274
118 -6274 -6671 -15588 4992 22911 -15673 -13315 33269 8718 -24029 8354 20608 128 -2590
131 -2590 1679 10761 14877 -2604 -2669 12437 3184 -5197 -879 -232 6335 3669 -12848 -1838 12215
146 12215 -7263 -17579 -2952 3894 -3215 -13744 -6426 13174 264 -19344 693 11358 -9809
159 -9809 -9035 4365 2525 2596 -1227 -5616 8078 8454 -8964 -1759 12297 5156 -668 1165 5436
174 5436 10902 539 -9675 5942 10107 -8905 -7147 8319 5183 -5769 -5976 1432 4386 -4759
188 -4759 -8799 1214 3508 -4207 -5143 -1339 1617 -177 -7942 -5441 5626 1168 -7558 -28 6897
203 6897 2296 -3397 -2631 6266 6353 -5879 -2594 10340 4056 -5284 1715 6114 2049 -1868 -2417 3026
219 3026 5285 -2796 -3616 4615 2959 -3463 -3556 -1017 1675 -749 -7178 -1388 5933 -2432 -7644 1131
235 1131 3426 -3346 -4274 -337 3352 1061 -4350 -551 5725 -86 -4444 1122 3515 918 -230
250 -230 53 3238 4778 -1880 -2871 4331 3374 -3793 -1634 3899 2371 -2047 -2672 1792 2672 -2709 -3829
267 -3829 1736 2138 -2762 -3014 1091 1079 -2140 -3607 -851 1954 -466 -3320 -206 3207 310 -2981
283 -2981 -255 3207 527 -2789 114 3332 1288 -1323 279 2721 1626 -1402 -778 2541 2004 -1190
299 -1190 -935 2217 2023 -1691 -2019 1202 1555 -1983 -2389 1184 1781 -1702 -2583 836 986 -1787 -2571
316 -2571 539 1207 -856 -1609 265 1455 -152 -2103 -413 1802 532 -1608 -132 2456 1058 -1518
332 -1518 101 2240 540 -1393 -187 1714 1295 -741 -331 1516 548 -1264 -824 643 669 -560 -1193
349 -1193 270 927 -676 -2152 -472 1167 -750 -2018 354 1742 -569 -1694 757 1030 -917 -1484
365 -1484 398 1123 -224 -540 727 1306 365 -600 -29 1144 742 -373 107 988 938 -661 -728 738
383 738 943 -909 -1017 1120 902 -1421 -750 812 57 -976 -645 -100 192 -765 -913 244 278 -534 -1016
402 -1016 -234 575 193 -935 -94 1325 738 -868 -146 1218 501 -820 180 1059 256 -467 248 1087
420 1087 -102 -247 -25 488 281 -173 -348 320 142 -192 -247 197 292 -310 -688 173 457 -473 -854 321
440 321 635 -604 -841 -132 466 -187 -529 347 750 -225 -300 170 388 84 -89 59 416 84 36 50 240
461 240 406 -352 -154 563 339 -8 103 69 464 -243 -399 495 268 -685 -144 311 171 -446 -297 152 93
482 93 -155 -363 -81 80 194 -2 -2 403 106 -200 -153 360 60 -284 -114 757 284 -395 324 771 57 -350
504 -350 81 121 -157 -33 79 224 -111 -279 -57 -131 -36 64 -211 -49 69 -104 -205 -215 138 -237 -195 -161
526 -161 85 113 -156 117 339 79 -256 236 -13 -241 113 322 -218 98 248 -168 271 236 -196 -220 217
547 217 23 -200 -154 337 152 -61 -565 284 5 -462 -55 47 -56 -433 64 50 -77 60 15 316 -208
568 -208 14 111 -32 -7 207 -262 -102 458 3 -108 95 92 124 -81 -10 -2 165 -167 97 104 -198 -78 123 40
592 40 -202 76 -90 -250 -191 -112 -193 -230 -259 -99 137 -102 -165 18 -391 -43 -180 97 154 31 -255 -171 349
615 349 -16 45 -53 -238 119 255 38 -137 139 14 93 15 -135 38 -148 31 -35 53 -187 -100 -62 -175 -11
638 -11 -148 -296 107 -57 -229 -38 161 -259 -339 81 96 -135 -261 98 -29 164 -47 -213 110 11 101 159
660 159 198 173 -215 208 48 125 -164 168 -236 -30 296 92 -176 316 -86 -144 183 100 -87 -181 -89 -124 -162
683 -162 25 -158 -93 -110 62 -158 -249 49 82 137 -205 -70 -107 166 170 62 45 62 -21 83 105 28 77 -8 -481
708 -481 141 126 -12 73 72 21 -25 119 -113 -409 -275 66 -133 177 -47 13 -79 -153 40 -140 38 -299 -98
731 -98 -94 -242 69 116 414 -192 29 -8 278 140 -17 -61 -190 214 -211 -266 -33 -56 -19 234 171 59 111 -346
755 -346 55 162 -376 -68 257 -104 173 -19 -96 191 -60 -266 -73 44 140 -103 -33 -15 -61 -20 -287 -269 -239
778 -239 -163 136 130 -88 30 112 38 -9 -164 -166 -272 105 30 78 71 -90 87 71 13 -83 -55 -89 30 -27 14 -12 56
805 56 135 -28 67 -42 -102 61 -23 195 -136 -52 -3 -116 -1 127 109 123 -133 -167 51 -105 101 22 173 -2
829 -2 -96 -126 -178 -123 -24 -85 -237 -100 90 329 -341 -67 -68 -22 -72 -31 53 -270 -226 -9 22 -146 -55 291 78 42
855 42 -91 -6 -100 154 64 -146 -218 114 -21 -108 -60 193 65 -199 26 279 63 3 -129 -139 -128 -390 88 -218
879 -218 51 -26 51 -161 -169 -54 -99 -63 -61 -27 148 -1 34 139 73 194 179 244 50 -10 155 -222 -225 85 -99 -55
905 -55 21 13 12 -240 -40 -285 -30 -159 182 114 -44 62 -299 0 159 -4 -72 21 -89 -105 51 -82 -25 -136
929 -136 -78 -87 -47 8 153 -190 -7 30 157 -27 -18 10 -101 145 -2 -69 83 -105 -74 -60 114 -73 -93 -189 70
954 70 -20 -275 64 -81 99 -275 99 -15 2 -85 132 190 26 197 39 -24 308 -37 -114 -71 219 55 35
977 35 46 259 -85 190 193 -61 -126 69 59 102 41 -217 160 -86 -18 -272 26 -104 243 -130 241 11 36 84
1001 84 125 272 25 -137 83 -88 -292 -14 24 54 -172 99 -81 189 -20 -99 -113 -316 35 -34 -66 -135 -19
1024 -19 77 -155 138 -76 -20 165 -180 74 66 139 -40 162 69 -35 51 -13 229 155 227 -149 239 65 44 124
1048 124 -56 281 -49 18 -83 90 -47 141 -56 -194 224 22 15 221 -13 72 -39 22 217 50 20 -45
1070 -45 46 -28 -62 -134 -37 -197 109 -147 -219 169 96 100 253 -132 153 44 -15 -24 -111 216 156 -47 -50 -132 64 52
1096 52 -25 -10 -105 123 173 264 -86 -159 -18 -7 -4 37 26 -155 154 136 214 -45 -133 200 11 100 -6 -202 136
1121 136 -180 -175 36 108 -331 159 44 26 -146 12 -169 107 25 -73 -120 91 -114 167 195 185 81 167 -79
1144 -79 449 71 -117 -102 277 -66 -240 -108 44 49 -105 -111 206 125 -41 66 -216 -50 -145 -340 -273 -57 -131
1167 -131 -234 84 123 -237 -185 -219 -25 167 50 -157 69 -113 185 -173 162 135 -115 -125 -224 64 -110 -444
1189 -444 258 61 -66 -13 159 -1 -45 157 387 -82 -18 208 -232 159 -183 -70 -8 0 85 132 193 -68 117
1212 117 86 -99 -145 120 20 232 -41 10 203 -288 -88 -58 -6 212 122 -124 89 -77 31 193 101 25 -19
1235 -19 -23 -8 76 -236 -83 20 14 124 134 -208 131 125 -113 -17 -196 -39 0 20 -57 128 140 81 -129 -8 -101 88
1261 88 -42 -117 169 6 136 -43 -147 62 -27 115 74 71 -112 160 -213 -27 76 -267 -26 59 77 45 8
1284 8 -101 -142 -16 227 -175 89 -71 8 118 23 175 25 -165 -33 -56 180 164 36 -33 -52 -273 -36 9
1307 9 75 -37 -261 138 72 -60 -112 -443 -45 54 114 35 201 -22 -150 98 -121 101 146 56 -134 280 187 -37
1331 -37 217 64 292 154 59 -7 60 -62 39 -165 -54 -111 -246 230 -33 204 -110 -209 93 -12 -84 91
1353 91 -81 196 -177 34 -77 15 -77 -252 -186 70 -29 -21 285 -53 80 -1 17 -77 -126 -164 -166 -33 -326 68 109
1378 109 3 12 32 -71 -3 9 -43 -4 114 38 -141 -204 -195 -95 -101 -53 -199 -91 154 38 -39 -97 -134 49 33 142
1404 142 -201 213 336 -322 -95 192 -91 -61 50 -178 -25 197 -5 -183 -204 -10 79 121 14 56 45 155
1426 155 97 -92 77 25 167 30 -247 103 165 -44 112 -3 -44 -110 167 70 114 -124 15 31 151 47 -296
1449 -296 149 -181 299 -49 -104 153 -48 -106 -64 245 -125 -39 7 133 -82 -274 108 37 -259 102 76 -92
1471 -92 -89 191 44 32 -32 -205 220 -28 137 141 71 48 -56 12 -122 73 39 -11 45 -144 47 -146 -74 67 -214
1496 -214 51 58 -325 -26 -97 13 80 226 -12 -111 -45 47 -194 99 -10 11 -91 56 185 -201 -76 4 -1 -21
1520 -21 -40 -142 76 418 124 39 185 -141 23 41 -191 -126 -47 124 -34 -90 -34 -154 16 -120 -364 -175 -36
1543 -36 16 72 -165 124 36 84 -94 82 57 -50 38 110 -23 -72 150 85 -120 29 34 173 -64 -26 205 92
1567 92 124 76 -70 -147 96 -15 -131 274 80 -168 163 -187 69 -107 21 102 -257 -5 13 236 66 -118
1589 -118 65 218 -90 124 10 -258 113 -87 -167 59 -181 90 141 208 156 -18 216 63 236 68 63 -152
1611 -152 70 -63 -26 -22 49 -3 57 -128 -106 257 211 62 -15 49 16 98 167 -91 10 233 177 -14 -34 93 -324
1636 -324 43 -196 21 140 51 -134 -10 -17 25 -277 -262 -229 -33 -6 -187 -11 111 8 63 -65 51 57 12 -97
1660 -97 -91 -297 -86 -58 -125 227 167 57 -332 -97 82 -205 -43 90 45 71 2 48 15 -19 -237 62 101 -130
1684 -130 83 -34 -107 -9 -99 136 -2 -112 189 93 -77 20 -70 -171 205 11 -51 8 61 -102 67 -20 100
1707 100 -227 -252 -50 -127 83 49 -65 114 -167 -64 -130 -37 59 150 -35 122 -56 225 138 61 24 126 -59
1730 -59 -50 -18 -77 -119 -121 -36 -190 14 -304 -127 -74 -180 35 0 -124 -117 190 -3 98 43 61 -53 -135 51 68 -232
1756 -232 -21 -30 -82 93 288 52 79 71 -182 378 -35 -76 -131 -83 -49 75 -10 -125 123 4 189 103 -141 -82
1780 -82 -50 272 41 60 78 129 115 272 25 114 17 280 97 -133 129 250 -319 -50 -172 99 264 -39 -173
1803 -173 -23 125 11 -127 -88 -303 -152 -260 -20 -36 -34 -49 -42 260 120 12 112 -66 -291 77 124 -136 -44
1826 -44 -49 5 -47 138 -146 230 -98 -348 31 43 131 43 112 150 49 -42 -121 52 -44 32 -21 -112 -71 -114 31 -191
1852 -191 -106 -146 -3 -111 -164 -101 104 152 -12 -36 -254 90 182 -350 -112 110 146 -100 75 3 170 9 261
1875 261 90 -134 -150 -98 -173 -18 28 -195 3 -31 112 148 -119 -59 -141 -159 -140 83 -40 -66 132 -127 57 84
1899 84 -64 -61 -58 170 -73 -57 -121 111 -208 -95 -1 -46 -171 -126 -261 148 -24 -21 -266 72 104 39 -5 -221 -177
1924 -177 -177 -85 80 -101 93 50 -46 177 15 -120 -126 -137 148 -1 -45 190 4 -333 -308 77 35 -232 -129 5
1948 5 -126 -24 -78 -135 -55 99 162 -24 -79 13 50 -132 -41 39 -136 -245 -75 133 38 -183 -140 322 88 103 -164
1973 -164 -54 -35 -14 246 -172 87 -155 -83 -72 -43 209 -182 109 201 46 24 -33 7 70 -180 -93 65 -140 -47
1997 -47 -344 145 41 13 3 -171 -103 -40 66 50 123 -92 72 252 -61 -6 -27 35 53 -24 -169 5 -140 -2
2021 -2 -75 -97 126 116 -11 201 -117 9 274 -73 56 45 -117 50 -180 260 -27 -337 55 154 -34 18 24
2044 24 -237 -162 -108 -29 76 148 112 -55 -390 18 84 50 14 20 -209 133 245 -34 87 -91 30 -70 97 108
2068 108 32 66 107 122 86 -246 78 1 239 -106 -121 121 121 30 68 -90 -168 -216 150 11 -211 -48 224 -91
2092 -91 -76 24 258 -26 292 251 -109 -186 -42 118 277 -120 -108 -35 7 -97 -174 -120 -104 -75 -7 213 -14 50
2116 50 -33 189 -36 -121 -99 12 4 -2 0 46 21 -118 65 46 107 -112 -26 45 34 -106 -231 -105 123 -237 205 160
2142 160 -1 123 -126 62 -39 -196 10 206 -239 -31 56 -136 42 -77 -278 193 -25 -52 228 -75 129
2163 129 -44 -316 277 -241 382 79 146 -62 111 -323 98 -183 -21 81 28 -185 -77 12 -114 123 -153
2184 -153 41 62 230 172 3 -9 94 -26 287 192 -133 119 51 93 -48 76 11 -39 98 30 -43 46 -147 115
2208 115 -66 -21 -8 -287 96 109 -10 69 -201 -214 119 -77 32 0 -57 149 -189 26 58 87 -79 66 22
2231 22 -73 -68 183 4 136 -73 31 -26 -33 134 33 286 9 101 38 -159 -240 -45 371 -102 -383 -128 -103 -11
2255 -11 -53 -192 -64 -128 34 332 -90 -170 125 -127 79 41 127 108 12 -129 -201 55 -85 356 -17 -250 -166
2278 -166 -101 -129 -55 69 225 111 -96 -90 127 147 70 -29 -182 -193 179 -111 -18 -29 -170 -20 -141 124 -146 219
2302 219 -103 -209 145 -34 133 -176 -125 13 89 -124 -22 -3 -19 121 -8 42 -156 -116 60 -176 19 79
2324 79 125 -75 107 52 8 -37 178 -134 267 146 -154 44 -43 -258 -60 249 162 63 -99 -97 -66 96 93 260
2348 260 -103 294 -66 98 -254 49 -169 194 59 -10 -100 33 -71 1 70 133 48 -101 -171 -131 199 18 68
2371 68 42 10 135 -53 104 -211 -153 145 -51 51 -385 10 -283 74 9 -199 -142 293 -74 18 -129 -52 13
2394 13 269 131 145 72 134 92 85 -52 214 -37 171 -33 39 200 132 -150 -50 29 -54 -55 58 7 -179 118 125
2419 125 182 1 -28 5 36 -188 -141 -410 -119 223 48 171 -31 -98 -116 -38 87 62 165 172 -151 30 -169 152
2443 152 -36 25 52 64 170 62 125 -11 43 115 275 -38 -228 158 -47 -212 -96 -243 238 142 2 57 157
2466 157 39 3 -155 -69 128 -156 -123 236 -6 25 7 78 -130 37 -129 9 88 127 67 28 -217 -164 45 36
2490 36 -96 41 214 -227 106 -199 23 111 -7 -15 179 -126 -120 -195 7 91 -250 -37 40 125 174 132 56 -76
2514 -76 56 -177 -136 6 110 16 -27 -177 67 151 193 132 -35 -70 27 236 -32 -137 -107 76 -119 -46 317 -253
2538 -253 192 306 -82 70 -88 -56 -129 15 184 -110 147 1 36 -60 14 259 56 96 25 -30 -97 141 -97
2561 -97 44 175 -175 69 80 -26 33 -72 314 -183 264 -98 69 147 -68 -2 17 -69 69 2 72 147 -121
2584 -121 -30 61 -10 101 137 -229 64 -91 289 -205 46 -54 121 189 -32 132 140 356 -42 5 -29 -92 43
2607 43 -51 -26 -26 -53 108 -162 145 -144 -79 -63 118 254 58 8 -221 -122 124 -81 -140 65 141 148 180 49 -45
2632 -45 -9 -275 187 3 70 90 82 13 160 94 -71 214 142 224 -66 169 66 272 -32 142 1 81 -163 -58
2656 -58 -120 121 73 -17 59 -199 -178 -60 58 132 266 -44 -133 116 -144 -178 -123 57 -94 -175 -113 64 -6 8 174
2681 174 127 -268 -109 132 -54 -40 62 167 123 64 -163 237 -171 152 125 41 48 -76 -57 -92 -36 -270 -85 71
2705 71 -3 -45 95 34 -187 -46 -192 18 -143 116 -68 -146 -98 314 75 79 -200 -26 117 -314 -7 -148 2
2728 2 -109 -254 56 -63 38 55 -232 -206 163 -72 -120 -79 173 79 173 -58 -90 -61 130 -111 327 52 152
2751 152 135 18 -162 -56 115 154 -173 -326 185 -19 -96 -38 -50 224 6 -268 -250 -243 -18 -74 -315 -250 -235 -2
2775 -2 -36 129 234 14 -125 -131 51 136 -22 92 -124 10 121 -119 -34 243 169 210 -41 8 -180 -71 -10 175
2799 175 106 60 -89 -35 94 -118 136 55 8 -161 -116 -66 -52 42 413 107 93 122 102 -68 72 -106 147 148 34
2824 34 165 86 -134 218 -24 -7 39 7 18 -165 -173 39 -23 -180 0 -71 154 35 -8 -74 -71 30 -191 48 102
2849 102 -202 -115 116 -12 5 -124 61 30 -25 57 138 -271 12 -55 116 30 -80 48 -112 155 297 307 143
2872 143 -127 -46 66 29 -228 -77 45 73 -9 -58 -152 -300 -12 -37 -72 124 147 78 -183 36 124 141 302 -70
2896 -70 355 -258 -106 -274 -20 240 9 20 24 3 57 320 114 -98 138 -169 -51 -142 -196 129 -62 -74 -25
2919 -25 211 -5 66 94 -198 -83 5 -8 -60 159 156 -109 323 128 153 107 41 156 38 7 -102 -51 -106 185 94
2944 94 37 71 109 210 123 58 -91 60 88 -60 9 -109 -61 145 -192 -41 -35 -98 -1 233 215 -67 40 -125 -4
2969 -4 -8 0 148 179 -14 -11 -76 142 -42 64 109 -70 -61 131 -94 301 99 -66 -107 -126 80 -84 -261 95 -253
2994 -253 128 -83 -43 -249 1 14 208 -289 -136 -144 -4 131 208 -222 6 -86 -24 -17 -112 100 -117 -105 -271 93
3018 93 393 -76 -199 218 -126 -69 138 -95 -42 -3 -105 -86 163 -149 -53 -47 48 1 -7 -24 -177 -38 48 184 110
3043 110 42 105 -116 183 124 -159 326 -105 -35 76 315 -93 -32 107 -54 50 -97 4 -33 240 -3 -172
3065 -172 -143 -22 38 46 328 199 -99 -31 36 20 213 14 117 -81 -66 14 -6 93 117 -179 83 21 324 -146
3089 -146 11 15 -130 -87 105 -5 136 -38 -61 91 -99 -244 -44 -115 -62 142 132 -111 -44 -77 162 188 90 206
3113 206 44 -41 -319 5 -67 32 -15 135 28 2 83 -76 55 202 -143 77 -99 -206 -241 21 120 68 -316
3136 -316 -179 -52 -21 68 0 62 186 57 98 78 129 -123 105 220 -50 -45 -69 16 271 -49 -22 378 -96 47
3160 47 -195 -81 -99 30 -10 139 78 117 -61 27 7 12 35 126 -103 27 -408 -152 117 -100 -193 -57 -176 -228
3184 -228 -29 -11 204 57 17 69 155 -123 89 -11 312 -28 -112 -53 30 -46 129 -220 -85 -20 83 -137 46
3207 46 18 172 -50 213 209 51 31 71 62 -28 -157 81 167 192 107 -33 133 42 210 155 59 -84 116 -19 -142
3232 -142 -101 -158 -141 -104 -167 -44 -143 -96 -160 79 257 -80 -42 22 123 -173 -176 -29 28 154 196 -161 -158 -142 4 59
3258 59 80 -162 55 -138 -230 -221 -74 54 -7 -133 -323 -321 -8 288 46 -19 105 5 121 42 8 -276 181 -32
3282 -32 216 94 11 219 -114 24 20 1 64 108 20 132 -37 28 -193 -22 -106 -35 44 335 72 58 -178 47
3306 47 42 -79 162 13 46 145 -41 84 -128 108 115 -55 113 -161 -89 -35 -161 -17 -201 44 -10 326 69
3329 69 -255 146 282 73 -99 24 43 -353 78 -103 -40 163 -46 280 136 -297 -280 196 -121 307 54
3350 54 85 -27 245 -4 319 -109 200 -5 22 -207 76 -347 -22 71 69 72 12 122 3 -27 17 -170 127 180
3374 180 -223 172 -144 104 -62 65 -10 119 -293 114 145 -70 76 -126 146 23 -225 123 -45 -254 95
3395 95 191 -19 -1 113 -245 -153 126 14 208 109 42 -1 -115 50 -175 15 -108 52 -65 -144 237 462 -104
3418 -104 19 192 239 91 63 77 156 -112 -107 -175 -273 -101 -80 54 68 -97 -85 141 74 -132 217 -51 166 118
3442 118 -145 -26 121 8 -254 151 380 -3 -178 -41 -182 -92 158 -140 -156 -49 183 74 5 -177 31
3463 31 -39 -139 153 207 215 145 -63 54 -200 -94 127 -17 153 -80 -64 160 -92 289 217 -106 -214 84 31
3486 31 141 -24 346 120 -131 197 195 6 -6 -306 -27 67 -174 -79 -116 -143 102 103 48 138 -251 -23 -32 61 0
3511 0 204 16 -130 -144 69 264 181 -17 236 -264 39 168 -270 55 -4 -37 -55 162 98 -16 -16 19 -156 249
3535 249 -93 -95 -26 -332 -3 -109 31 127 -38 -1 110 -156 51 39 -37 -193 107 125 22 -97 -154 -136 125
3558 125 -119 211 179 236 159 -174 -91 189 169 -105 164 112 -46 -59 189 72 75 105 311 43 132 -171 -4 -112
3582 -112 -166 19 -19 1 36 -152 -107 2 -226 -209 -125 32 196 285 319 -237 88 185 109 -139 14 -287 -6 232
3606 232 169 -38 116 14 -60 45 -121 97 12 167 -6 68 185 127 -115 -37 47 -3 -130 -97 -239 249 253 -430
3630 -430 175 -46 28 138 -73 226 189 -150 -166 -156 -58 -126 -64 18 -104 -124 227 -95 44 10 -72 6 -213 12
3654 12 84 212 390 239 -69 21 13 -100 -62 -59 -215 -293 -251 -188 137 22 -198 -132 270 -243 -58 -114 55 54 36
3679 36 136 -103 71 23 -79 -176 -39 -127 148 -163 -253 -247 51 38 78 91 -70 -4 -240 144 5 -82 48 137
3703 137 87 54 -15 -5 149 -114 54 -130 159 76 61 199 -326 -12 -104 177 -214 -78 88 -83 -212 165
3725 165 59 -60 76 -161 206 123 87 -55 -81 293 98 289 -48 70 -347 30 -71 -202 320 -17 -39
3746 -39 -3 -94 184 20 143 -48 -36 -161 -175 169 72 -280 -202 226 146 120 -153 -64 -78 -114 75 45 102 -250 -215
3771 -215 55 18 203 46 -20 69 67 -150 55 63 117 -35 43 13 -82 195 141 -14 -217 66 -150 107 -16 265
3795 265 172 -106 -57 263 141 -161 -7 133 80 40 28 206 117 18 51 -3 -213 104 113 -169 206 10 -87 -93 26
3820 26 185 65 23 -104 64 81 -71 59 24 58 -113 -51 -144 119 -50 -179 146 70 98 -262 -54 0 235
3843 235 76 82 -350 76 -31 -51 93 -43 -161 196 -100 -138 152 -144 -161 -49 95 -23 114 -53 -237 154
3865 154 -253 240 -152 157 -55 209 95 -170 87 -205 -201 -149 154 -184 -160 11 7 -143 59 -16 -24 -103 167
3888 167 -47 27 28 -88 -263 -72 2 -130 -41 90 121 68 -82 -248 11 64 268 -131 40 -31 -13 -94 -373 -19
3912 -19 96 -66 -12 -112 6 69 -57 -13 19 -4 -200 -12 66 -74 141 70 86 -40 17 131 115 249 93 37
3936 37 -26 -320 55 -60 -6 182 -156 85 108 -89 -52 -253 -53 222 186 215 17 41 216 125 269 43 96
3959 96 154 -25 -152 -4 55 -96 -20 167 -180 -34 77 176 130 247 97 124 -147 271 99 -64 30 4 206
3982 206 -183 -181 -217 108 -94 276 -52 -62 -135 51 -120 189 -27 61 211 -32 -46 -12 -20 -170 -105 -48 131 124 -329
4007 -329 -130 83 -147 -40 59 -70 119 -246 -96 -84 188 76 -26 -288 -110 -5 -119 -129 -366 88 79 267
4029 267 -43 -152 -55 29 26 -145 -94 189 87 70 68 6 92 55 105 -143 177 -101 0 188 -114 -142 54 -252
4053 -252 -182 237 -141 112 50 12 -1 99 -43 38 237 -40 99 5 173 20 -113 238 -66 81 -233 158
4075 158 118 114 240 -65 55 -133 303 -33 88 2 57 -96 -18 -85 -325 -152 -229 40 43 -15 75 -101 6 31
4099 31 49 53 58 196 -94 96 8 -24 -146 -148 -26 29 144 152 14 127 -117 -103 -116 359 -15 -260 134 132 -7 108
4125 108 52 370 -119 148 -168 16 28 -46 -61 21 -120 69 -83 205 -16 157 -107 45 -53 276 -337 -171
4147 -171 103 -149 198 141 40 -38 11 10 68 -96 101 -218 -211 83 -58 58 37 117 55 380 -106 7 338 -278
4171 -278 -16 157 68 -99 -166 -112 -80 -5 166 -133 92 -75 -52 -114 -138 -26 -314 138 -29 -148 13 111 29
4194 29 94 185 90 83 -49 332 5 -67 239 -20 146 10 172 108 -69 141 65 -8 41 -155 86 -102 312 177
4218 177 13 -82 -156 -375 16 -139 -26 409 -381 123 -241 -259 -154 162 106 -132 -10 95 -6 -225 -27
4239 -27 -46 -142 63 119 79 -31 -65 373 93 -213 9 -22 -104 153 98 -55 241 -64 135 99 -323 -221 -208 212
4263 212 -301 -172 -252 -51 276 46 -200 179 -114 -230 -7 202 -54 -54 -237 -79 44 -95 198 5 -12
4284 -12 49 -75 -29 -116 54 -131 181 94 -30 55 81 -87 -19 47 -115 -150 -20 -76 -40 -45 -13 -37 -99 67 232 5
4310 5 -18 -12 -263 -46 -7 -344 -57 8 -67 75 -44 -55 24 8 -31 -67 -14 -10 43 -26 188 79 196 -182 47 145
4336 145 -139 -1 220 -88 -49 129 53 -155 -18 -237 -220 -9 -28 -28 -250 -47 18 -32 -94 111 -122 147 -56
4359 -56 18 326 134 86 -131 -328 15 -264 48 64 -15 65 -68 86 -247 -172 223 55 -308 105 31 -213 287
4382 287 -15 117 195 192 -60 204 -138 192 294 -123 -16 7 -17 -142 168 -38 -223 58 -53 -243 -76 33
4404 33 -99 -207 -130 -149 -214 -335 -14 -179 -102 -136 100 33 -50 176 72 -88 -119 77 -89 -24 91 148 -99 106
4428 106 -9 -271 -85 103 -76 -63 9 -333 -176 14 -185 -39 90 -20 -20 -80 27 330 -133 238 122 -81
4450 -81 28 -67 -113 89 -99 -161 48 -223 -103 -10 -86 135 -48 159 -62 118 -147 336 61 -70 -37 -255
4472 -255 -107 -97 164 -205 247 159 30 171 97 -101 -32 141 45 -164 20 137 -132 163 -7 185 1 -38
4494 -38 -102 141 84 28 202 -154 -124 -130 -255 163 32 -136 38 -122 181 -111 -19 -163 41 -252 23 56 -47
4517 -47 -75 -242 72 -148 102 -12 -70 21 -199 144 28 -179 350 110 -243 -167 -12 -54 -186 -270 93 -286
4539 -286 26 -173 127 -50 114 251 225 39 25 171 183 79 -28 -51 -44 194 48 50 -30 16 -49 57 -153 -49
4563 -49 -78 -183 -200 393 13 -150 53 -56 57 -297 -55 198 -99 -92 -159 -347 9 -6 99 190 14 -76 165
4586 165 -44 -79 -201 22 102 349 31 -114 106 -272 296 -91 37 -122 175 -104 -104 64 -97 -89 11 83
4608 83 -60 231 110 28 201 -81 82 206 71 475 -55 -69 -19 -82 39 -136 129 180 155 -81 67 -38
4630 -38 -196 -82 107 73 135 37 -138 189 -53 -274 -124 38 -77 14 77 -7 -71 222 -23 27 120 -318 -66
4653 -66 350 -32 182 -215 -98 -160 -106 73 181 -21 -65 -17 -198 290 26 38 -21 -62 19 108 -281 -5 12 215
4677 215 28 -137 80 117 -157 89 -189 -358 17 53 -22 -33 329 -253 63 371 -24 -83 -77 -226 -101 177
4699 177 128 24 142 64 82 63 -187 235 24 106 136 -174 77 -34 71 -209 141 -235 86 -139 16 -15
4721 -15 -86 -77 -9 179 109 -145 -41 88 154 216 22 60 -410 345 -35 -60 -124 -37 -22 -121 319 -27 137 -39 79
4746 79 40 67 88 -45 27 -18 182 98 -82 -115 84 63 -156 -249 105 132 -162 -1 101 248 -73 -111 -12 97
4770 97 -112 92 263 142 -91 -70 109 -37 68 -50 -112 -404 110 -50 -188 -20 31 108 -201 192 -112 23
4792 23 -146 44 -24 -42 -29 -116 -191 125 -47 -21 -125 146 -121 88 18 49 22 501 85 48 -122 -1 23 25 15
4817 15 -62 306 -136 -70 -6 -5 -33 21 60 58 65 24 -49 135 -22 -139 24 -189 129 278 54 -164 336 231 -20
4842 -20 206 -117 191 -60 -13 -124 -211 107 30 54 -178 30 -147 31 118 230 325 151 -22 -202 -81 37
4864 37 218 -138 58 8 -60 119 -74 -104 0 85 -94 -23 -151 -85 23 108 63 211 94 127 -104 207 -252
4887 -252 -134 -132 -58 -159 0 -75 17 -97 -40 82 185 -88 104 -152 31 -90 124 -93 -60 215 133 12 149
4910 149 249 -82 143 55 -110 20 -12 -151 -55 -37 113 -21 80 26 -121 -177 -39 -121 12 -53 61 88 -68
4933 -68 104 -134 -116 25 -346 -84 -14 -347 75 -129 -348 -47 62 -47 227 25 44 -13 -60 -221 254 -8
4955 -8 131 129 104 96 128 38 105 -16 175 243 -131 36 -123 -62 9 76 188 180 21 39 -5 43 80 107 -94 89 49
4982 49 15 178 -1 -124 -100 -80 -29 -66 268 -73 -32 103 -239 -52 -149 18 -113 4 102 213 215 -236 146 69
5006 69 161 -109 346 -107 -71 112 -158 -73 116 42 107 60 -145 106 -55 -298 -103 -39 -11 -197 -343 67 -130
5029 -130 66 -169 -279 164 58 337 -90 -22 -31 35 229 -118 -239 -9 178 -201 -393 107 137 28 -20 -190
5051 -190 -16 -148 104 24 98 187 -79 -172 281 102 274 -140 -128 86 0 -75 -169 56 -58 1 -194 2 -1 8
5075 8 30 90 194 20 -197 -137 205 45 46 49 187 -94 -172 -192 -159 201 106 76 131 70 -51 -69 -146 77 11 292
5101 292 -12 2 100 122 68 -187 88 229 70 31 154 -57 452 10 -257 216 -14 41 -37 -19 -182 298 109
5124 109 226 -27 -256 -51 -49 72 140 242 50 181 34 47 -31 -105 57 61 -204 -55 150 -150 -56 264 14
5147 14 27 15 135 -80 36 64 -64 -12 28 189 -111 -43 268 -147 -34 -114 -6 -135 189 -32 -3 -163 -62
5170 -62 -120 230 -22 -118 72 300 -119 -229 9 32 -59 -177 149 -3 -11 -180 -175 -334 288 -86 -113 248 61
5193 61 -13 27 -235 43 -231 75 -101 -27 51 99 -224 90 82 143 61 18 244 16 110 28 -237 -43 -124 -60 140
5218 140 -165 -6 -72 -141 82 82 37 147 -71 4 2 -18 -85 -117 167 -78 168 -85 -27 -56 -176 -5 -60 111 330
5243 330 -22 -26 -18 5 -50 -213 22 -64 -247 -11 44 0 -209 -168 -22 63 245 64 166 13 152 140 -121 -69
5267 -69 18 2 -52 -154 189 170 -137 -288 398 61 -294 69 -9 21 -4 -247 139 87 30 70 -265 -69 -148 -14
5291 -14 -103 102 -91 37 -129 99 -56 140 66 -45 -192 -110 10 27 89 77 211 -70 185 -104 99 -198
5313 -198 32 18 -14 -72 -18 -212 239 -46 -84 169 201 -64 -50 56 -105 175 30 90 -45 -3 51 4 157 143
5337 143 -80 117 232 -481 28 257 -37 45 -31 -11 -156 10 175 -140 165 -22 -235 -390 103 56 -116
5358 -116 -206 -115 158 31 -106 -148 -30 -174 -103 -132 173 125 -36 -82 2 110 37 15 -16 -65 143 -179 86 26
5382 26 -43 95 -144 334 -156 164 75 232 85 24 205 -76 -249 256 99 169 139 -166 -207 43 -73 -97 97
5405 97 -69 105 -50 -57 -34 64 131 -175 184 -57 -6 114 58 99 -118 72 118 -25 176 175 88 -61 -105 -76 98
5430 98 -74 -61 -203 -84 160 -74 137 56 110 -83 4 160 155 314 212 27 -78 -194 80 110 36 345 155
5453 155 -256 55 -66 -15 190 20 -6 -48 -63 32 7 271 -29 -70 -19 -155 -14 161 -337 50 200 -326 417
5476 417 9 80 108 -119 147 -172 -46 -118 -53 45 62 -104 217 -30 18 209 26 227 15 -121 148 3
5498 3 89 -303 117 -184 152 292 -15 0 -98 -92 -180 135 -10 -288 42 125 120 -76 40 -115 179 63 -35 -34 -91
5523 -91 13 -5 -178 -3 -32 -62 -227 82 46 -165 70 -24 -96 -88 18 -65 -139 53 -15 79 100 115 153 -72 -294
5548 -294 -29 -275 -237 -135 -196 70 -29 -95 -70 -255 -176 177 136 -87 -13 15 -92 52 160 120 53 -57 94 33
5572 33 263 67 -72 262 120 -250 157 -51 -10 -33 224 121 -55 -48 69 -40 -195 -73 -217 65 -162 -54
5594 -54 157 -11 78 42 -198 -20 80 -133 -195 -72 -106 -72 -71 -238 9 -52 -139 182 111 36 -10 66 -102 70 39
5619 39 -97 -24 -260 -141 34 -31 -55 -33 -305 47 -32 -219 -8 -322 50 -228 7 59 -293 49 -9 134 -2
5642 -2 48 69 -107 138 63 -146 -47 77 -50 -128 39 -5 197 189 123 313 -31 -179 -64 71 162 130 1 192
5666 192 -109 -70 -76 -102 159 113 -174 -77 41 107 0 -125 -179 25 -90 93 -99 93 61 -29 -85 50 -50 -21
5690 -21 146 -59 61 17 -32 -248 -125 106 -102 334 132 54 -96 186 -149 119 16 -101 105 -109 -89 119
5712 119 13 230 -50 -118 38 8 98 166 -226 62 -82 -16 -168 161 344 -41 -29 40 84 -84 99 26 73
5735 73 6 70 16 -230 94 71 -117 -95 115 -155 -225 201 -109 26 11 301 3 -76 36 74 -207 -139 63 301
5759 301 176 93 -33 -105 70 -173 -47 -223 -86 80 -10 -177 -23 124 138 66 -95 -107 -2 -138 83 128
5781 128 158 -133 110 81 -15 187 -194 -59 6 99 109 -121 -43 -91 -4 -356 63 51 236 -69 82 -130 -89 -206
5805 -206 -47 95 -50 82 -299 198 -81 39 -89 -128 46 -76 166 -64 -141 -111 187 20 228 201 105 11
5827 11 -43 -77 144 229 -319 216 192 -294 -59 -77 202 191 41 104 -2 137 291 -263 -43 -246 -65 247 115
5850 115 -65 -64 -100 -133 240 88 -36 12 -95 33 124 -312 -23 174 1 -176 -274 236 -109 54 90 120 168
5873 168 -194 132 67 -183 53 -99 78 289 -42 -14 225 116 196 46 -214 221 155 -12 158 -46 23 -54
5895 -54 -23 148 -154 57 -92 -5 -164 -26 -77 219 111 231 62 -261 34 -95 -108 137 -51 134 63 -79
5917 -79 344 32 -72 25 17 178 -13 -291 109 145 -126 124 61 -132 -108 85 -232 -164 22 -104 -53 -27 -87 196
5941 196 -51 -18 112 8 135 113 34 43 -63 34 1 -18 208 -28 51 -110 -61 446 -18 5 73 145 -91 4 131
5966 131 -57 -29 -239 151 -123 -91 49 252 125 -38 125 -311 -11 274 -90 98 -26 159 88 -220 169
5987 169 5 13 -105 21 -18 187 -103 -132 91 -7 -191 -118 167 -82 82 -33 -224 48 32 212 -56 -327
6009 -327 222 -124 86 -53 101 -204 -12 4 -6 111 136 30 142 7 -102 -161 -34 -27 -49 -56 81 -21 -60
6032 -60 -160 -127 5 -29 53 8 -327 161 171 12 15 45 149 -143 14 -127 420 202 118 28 -68 -65 125 -127 -60
6057 -60 -129 -124 229 -193 -54 -110 -188 39 -42 -67 131 -7 130 -82 -192 157 -147 -56 148 -66 -29 161 0
6080 0 -81 -233 162 55 -118 16 -173 8 67 102 -42 -140 164 128 -24 230 106 -230 -68 -40 118 -74 22
6103 22 30 18 137 -48 187 47 123 -141 37 8 0 -16 -32 -29 -5 -191 -169 -88 -98 312 -54 62 206 -242 142
6128 142 52 -42 -128 -99 -40 156 -123 62 14 -132 -173 -154 87 9 71 -11 -8 -493 -102 312 72 20 -273 214 -70
6153 -70 20 -282 -225 72 37 55 299 -108 -208 33 -10 219 284 -349 -172 243 127 246 -161 89 92 186 -108
6176 -108 -5 11 189 -89 79 -70 110 -312 -194 -81 -200 177 33 -17 91 64 35 274 -11 141 -86
6197 -86 -154 -6 147 75 -68 119 -60 -104 150 8 45 -34 124 -64 242 -188 46 72 317 -13 184 -42
6219 -42 58 -46 -25 159 -164 145 -108 -49 -228 -64 309 162 117 97 -170 168 -61 -15 -138 64 276 -97
6241 -97 -142 108 -20 203 67 -14 -5 -131 -256 104 16 -61 18 92 -117 164 141 30 -57 -157 235 -222 -6 8
6265 8 -52 -293 1 -22 -102 247 4 -135 25 40 -27 -121 -62 -19 202 267 127 219 -84 74 108 313 -145 68
6289 68 331 79 -37 -197 13 71 -131 -87 -166 -77 318 218 89 194 -131 -38 -66 44 51 -130 -163 140 -53
6312 -53 12 -21 -79 3 29 105 -41 98 -46 15 -78 164 -11 -28 -96 -85 -148 -122 104 92 48 -207 -92 348 -14
6337 -14 210 -197 53 27 -243 -123 -67 107 71 -125 7 -217 93 92 56 -286 123 -70 -31 -80 -40 -36 -115 169
6361 169 -44 -181 111 -177 185 37 26 -170 3 255 -93 145 5 -63 86 98 154 27 123 -271 -28 185
6383 185 5 44 59 170 40 -242 -139 86 53 -104 -19 49 -11 -56 33 28 -38 -133 90 171 -30 201 -76 86
6407 86 211 142 210 84 104 79 -126 -162 -106 -110 -267 83 -129 6 -276 43 -207 86 23 120 0 107 -42 -24
6431 -24 59 84 129 -77 -116 51 -207 -116 -291 39 -60 219 -161 -111 147 32 46 11 140 54 -129 -1 77 76 -103
6456 -103 83 -227 64 -174 241 5 -47 -28 -137 -106 -222 -75 -194 -55 32 150 -173 -263 -281 105 318 -13
6478 -13 -55 43 -197 70 64 244 -125 3 -237 -23 113 -19 -146 -91 -94 -68 -14 252 -85 -128 139 -141 2 67
6502 67 -104 -302 162 -2 46 12 100 -193 56 36 76 -46 -20 105 78 -33 111 143 -176 -82 82 -52 32 53
6526 53 -264 -4 -141 -26 25 -34 112 -2 82 -116 204 171 -204 151 -53 74 106 4 -129 76 -322 -136
6548 -136 172 14 -137 212 60 54 60 54 53 65 -12 -222 166 207 170 124 -316 -59 -37 -91 108 75 25 -42 -13 -102 179
6575 179 70 14 61 -29 -152 -40 -2 266 305 -136 -67 163 103 -89 -71 69 -109 -124 -68 82 -97 -40 -32 19 289
6600 289 31 50 76 -230 -99 -261 208 -252 87 240 86 51 256 -81 102 101 -114 -131 98 189 -198 77
6622 77 35 -49 112 -83 -148 5 -163 99 -260 -29 219 -18 -235 155 -10 -23 126 8 109 14 -46 96
6644 96 -45 21 -5 -85 100 -64 -80 55 83 175 154 -57 91 -19 -21 104 91 29 133 -16 -68 136 47 -56 -152
6669 -152 -246 194 -20 497 -260 -2 33 -105 -92 -184 59 -147 97 -105 -198 -115 -18 52 48 59 -148 303 132 142
6693 142 -59 116 12 22 104 -66 -276 -209 -284 -254 68 23 -140 -7 -65 -5 -132 -156 -37 -153 -140 -21 -155
6716 -155 -120 -36 -20 -177 125 199 -252 -69 187 -84 -98 146 76 114 -216 -66 46 31 -161 186 121 185 180 123
6740 123 -50 -31 -11 202 -76 -156 -57 140 -120 -43 264 221 87 189 241 7 -100 52 -187 256 10 4 -151
6763 -151 -13 127 -26 -87 171 -2 -36 248 -301 -114 -18 132 -119 -121 -83 88 198 57 25 20 208 -65 112
6786 112 214 240 -87 0 142 -168 -49 25 21 -114 134 -20 0 -165 50 -129 222 145 149 133 21 22 -221 191
6810 191 -13 -72 54 45 -49 -230 -288 155 -191 -103 104 -108 -60 -227 37 -150 -4 234 18 -17 -10 115 -213
6833 -213 82 62 -75 -113 122 131 -99 -9 157 -57 -59 -130 246 204 -4 78 -47 -116 -26 -51 167 -107 22 -55 47
6858 47 195 -211 212 -171 89 -235 -205 49 -84 -149 -19 -164 -68 69 0 322 253 176 -30 -163 -12 97
6880 97 231 -79 -124 265 90 173 126 -17 83 159 -121 -149 10 -60 97 16 -108 -140 62 10 165 -154 163
6903 163 23 -45 165 78 76 -186 -204 60 28 -298 -112 -47 -12 340 95 -257 -155 30 -75 10 23 115 -83 41
6927 41 -113 -78 101 98 -266 -73 -40 153 152 138 203 138 101 -227 -128 130 3 -208 9 14 -83 144 18 -75 84
6952 84 -62 38 -127 -255 20 -114 141 90 29 -97 66 -96 42 141 -20 -233 -93 156 -36 -2 -94 -22
6974 -22 8 -41 -122 -42 28 -230 31 -125 71 -228 -37 6 -74 123 -119 132 3 -22 -312 -217 -115 -145 -38 163
6998 163 -20 107 289 -161 24 174 -254 -81 16 169 39 -94 298 303 -353 -1 -176 10 112 -326 217
7019 217 279 34 -47 -54 -14 62 -12 96 -120 247 -106 -70 33 -203 -64 115 78 167 -16 -305 -179 10 -5 105
7043 105 18 -39 25 73 -145 118 -143 -423 182 -69 67 -180 -73 -49 -87 -128 49 149 -40 -250 -141 72
7065 72 -129 140 19 -8 209 97 -168 -163 153 35 61 -65 -73 21 205 -58 158 -61 -198 93 -26 90 -70
7088 -70 -51 -200 -69 219 129 276 175 -199 -170 177 -280 -51 -90 -218 101 -24 82 -18 -223 -128 -148 136
7110 136 -8 -134 -114 46 -121 12 85 29 209 -137 119 -115 -199 73 143 404 382 -184 -37 -148 -128 108
7132 108 -56 115 -69 130 31 -120 -33 -95 -183 127 -166 -139 81 -77 55 20 -121 -148 -24 -71 -81 36 146
7155 146 116 -152 -113 -100 -19 -20 -77 93 187 32 -17 -280 -91 -86 -42 151 -35 10 31 33 117 65 -166 192 -311 -65
7181 -65 -226 -74 18 -85 -115 -98 -80 -24 48 193 -30 -11 117 -235 -109 -34 -57 41 186 4 -114 105 14 -142
7205 -142 -136 186 44 -111 -14 28 -90 -67 105 -301 -82 158 126 6 -37 -237 51 166 30 -6 36 38 65 -40
7229 -40 -155 117 -126 75 -8 -58 304 -179 145 -42 -125 84 -292 -233 -105 136 93 153 -3 150 74 70 45 -77
7253 -77 -88 -253 107 -27 222 -37 -79 -8 -127 74 112 286 -4 284 -70 -139 -15 -91 5 -45 185 -238 147
7276 147 -103 -10 -58 -68 45 223 -221 -16 221 -4 102 -328 222 -242 88 107 274 -49 -42 39 141 71 45
7299 45 -36 160 -125 -27 185 61 -65 -60 -35 10 -223 16 156 -91 197 -23 -33 -19 -149 -3 160 -59 35
7322 35 184 -95 -170 -5 -103 -21 169 87 -70 399 -51 112 138 33 -72 -111 -250 -81 -121 -217 91 -93 130
7345 130 -241 4 9 43 3 -225 -35 -138 -250 331 -40 11 -209 -28 -213 305 138 -105 -75 81 121 -115
7367 -115 -44 307 78 -63 -64 -8 108 133 114 103 123 -135 184 119 106 -7 86 74 -55 19 116 191 -48 -85 78
7392 78 -165 330 298 347 79 264 45 -29 -13 -177 249 15 156 195 -92 186 -59 -213 68 -48 107 234
7414 234 21 -221 -23 -195 -87 105 -75 66 -73 -99 318 -392 216 135 112 -230 42 -34 -46 147 -24 75
7436 75 -3 -108 -138 144 -30 -274 -76 -39 56 -40 52 -104 21 2 -47 15 47 -101 52 -35 36 -26 -79 213 13
7461 13 281 -14 103 34 135 20 -155 -96 -28 74 -286 -88 -158 -5 -59 -467 122 179 -165 -115 6 228 96
7484 96 -129 49 -222 -91 -214 -233 22 -51 -31 9 -83 -93 29 -2 -61 226 -179 -242 -56 140 -83 255 -200
7507 -200 -1 -179 -150 -84 65 95 -134 172 -44 -243 -116 103 104 -112 39 210 -21 -81 143 152 -163 -112 -17
7530 -17 29 -80 -239 69 124 -161 28 -67 -18 95 20 27 96 156 103 -56 127 -84 278 93 34 228 -131 85
7554 85 -63 216 99 -199 47 27 -8 21 5 -72 -262 -217 -301 -168 -27 164 206 63 28 147 -41 -119 -142 -19
7578 -19 21 -18 37 -117 -79 -10 359 -49 203 -305 20 -44 -168 -80 -42 185 -125 -78 -97 35 36 164 -48 222
7602 222 135 -5 239 212 -300 -75 64 67 115 286 40 40 -51 243 43 111 -32 -20 0 92 -57 117 133 166 83
7627 83 -168 29 116 37 -142 183 -95 27 -69 -76 -147 -148 -33 137 170 -276 45 117 -227 176 -11 -40 -81 10 124
7652 124 -24 175 -141 -33 -72 -128 -38 -63 159 -218 -154 -171 -124 -140 -76 5 -94 -66 -180 172 35 36 18 -119 7
7677 7 260 2 -175 89 19 86 109 33 -77 -231 -164 -201 135 -211 -275 -203 -307 -199 259 -32 -86 64 -94 76
7701 76 -8 55 -168 -108 -83 8 -175 -108 -4 -120 -139 -110 39 -57 151 115 -54 98 -137 71 -48 -104 2 -55
7725 -55 -29 -64 -7 162 70 64 -88 179 -103 -248 190 47 22 76 63 90 -86 -8 21 -256 -22 124 11 50 -97
7750 -97 -10 -57 -25 128 -187 -138 73 -25 65 47 -38 -82 170 -92 83 2 62 139 13 -1 -93 117 34 -280 -75
7775 -75 -96 108 -120 -169 24 -56 -349 45 -90 -183 84 -38 152 -117 -262 -63 122 203 214 -238 -29 90
7797 90 -34 -313 265 326 -49 -310 -122 71 204 103 -17 -37 142 -105 -134 164 151 267 -100 48 -128 183
7819 183 199 -156 66 -23 -133 -24 37 41 106 -158 -130 -34 -103 -26 33 -205 103 5 108 -136 -171 161 -192 -15
7843 -15 -22 133 130 -19 15 264 -2 -51 189 66 -92 26 -2 -91 177 17 170 199 -3 -127 -145 98 73 -1
7867 -1 51 -213 -33 91 -24 -42 -218 -83 -57 -53 -19 -95 -51 106 -142 29 -272 21 162 98 85 -21 -95 -170 -96
7892 -96 100 64 -242 -56 125 171 -74 121 -28 -44 -79 101 -21 33 271 -247 -123 -56 154 -120 -200 187 211
7915 211 94 57 -101 -96 58 42 254 103 -58 -56 64 -220 -182 -279 55 179 116 96 132 -6 -224 37 108 55
7939 55 127 -135 -22 -115 -152 -377 -219 -41 -70 149 -53 -232 176 138 166 158 -14 -230 -15 -98 -25 29 284 -132
7963 -132 105 153 -183 -345 -69 112 -7 -129 -63 -162 48 6 78 97 47 331 -273 -78 -100 -44 -80 -10 178 -108
7987 -108 110 -17 -145 -286 134 18 -75 -166 141 -220 -76 -39 -6 35 -29 -141 86 -179 26 125 141 10 -201
8010 -201 -46 149 -131 145 -210 94 222 47 -36 -281 88 -170 179 -43 80 62 187 119 194 -198 144
8031 144 -67 -37 -240 -54 130 -109 62 -22 -98 -37 103 114 -66 63 -144 -97 37 -29 -9 160 98 -41 73
8054 73 -31 71 -169 457 99 62 29 -2 75 197 -155 174 -172 -185 33 -102 -30 49 -125 48 -11 206 104
8077 104 -105 189 -312 68 -30 -96 56 -65 20 80 434 -264 62 107 166 -22 135 78 -201 -184 -89 95 -131
8100 -131 -215 -57 -73 -96 52 -12 73 25 -188 -197 24 9 12 -33 77 -86 2 7 -120 -95 -163 46 55 26 139 -124 85
8127 85 -276 41 -182 79 80 190 174 -181 15 48 75 130 -94 199 96 34 194 -40 259 -164 49 -95 -188
8150 -188 -162 -142 122 226 180 196 197 -41 -156 -9 -64 58 38 27 244 -124 28 172 -82 83 -78 87 104
8173 104 -128 70 113 -49 80 96 -262 75 84 -215 -11 -63 166 -212 -197 -80 -272 190
8191A90
##END NTUPLES=NMR FID
##END=
