##TITLE=1H_DE-55DCM_K_b
 CDCl3
 64 sc, 
 27.6.2024
##JCAMPDX= 6.0         $$ Bruker NMR JCAMP-DX V2.0
##DATA TYPE= NMR FID
##DATA CLASS= NTUPLES
##ORIGIN= UXNMR, Bruker Analytische Messtechnik GmbH
##OWNER= root
$$ XWIN-NMR		Version 3.5
$$ Thu Jun 27 16:05:33 2024 Russian Standard Time (UT+4h)  she@DPX200
##.OBSERVE FREQUENCY= 200.1313
##.OBSERVE NUCLEUS= ^1H
##.DELAY= (6, 6)
##.ACQUISITION MODE= SIMULTANEOUS
##.ACQUISITION SCHEME= undefined
##.AVERAGES= 64
##.DIGITISER RES= 18
##SPECTROMETER/DATA SYSTEM= spect
##.PULSE SEQUENCE= zg30
##.SOLVENT NAME= CDCl3
##.SHIFT REFERENCE= (INTERNAL, CDCl3, 0, 15.7039)
##AUDIT TRAIL= $$ (NUMBER, WHEN, WHO, WHERE, WHAT)
$$ ##TITLE= Audit trail, XWIN-NMR		Version 3.5
$$ ##JCAMPDX= 5.01
$$ ##ORIGIN= Bruker BioSpin GmbH
$$ ##OWNER= she
$$ F:/spectra/data/she/nmr/H-F/1/audita.txt
$$ ##AUDIT TRAIL=  $$ (NUMBER, WHEN, WHO, WHERE, WHAT)
(   1,<2024-06-27 16:04:35.43 +0400>,<she>,<DPX200>,
      <continue with go, POWCHK disabled, PULCHK disabled
       configuration hash MD5:
       00 E9 B6 7A A2 85 ED C7 34 08 36 98 17 FE 4E 26
       data hash MD5: 16K
       89 40 CC FA 9C CF 00 1F 15 E6 AF 1E F6 2B CA D2>)
$$ ##END=
$$ 
$$ hash MD5
$$ C7 C8 7F CB B1 3D 97 6D CC 53 6A A0 49 95 92 CB
##$RELAX= 
##$RELAX= 
##$RELAX= 
##$RELAX= 
##$RELAX= 
##$RELAX= 
$$ Bruker specific parameters
$$ --------------------------
##$DU= <F:/spectra>
##$EXPNO= 1
##$NAME= <H-F>
##$PROCNO= 1
##$TYPE= <nmr>
##$USER= <she>
##$AMP= (0..31)
100 100 100 100 100 100 100 100 100 100 100 100 100 100 100 100 100 100 
100 100 100 100 100 100 100 100 100 100 100 100 100 100 
##$AQSEQ= 0
##$AQ_mod= 1
##$AUNM= <au_zg>
##$AUTOPOS= <>
##$BF1= 200.13
##$BF2= 200.13
##$BF3= 200.13
##$BF4= 200.13
##$BF5= 200.13
##$BF6= 200.13
##$BF7= 200.13
##$BF8= 200.13
##$BYTORDA= 1
##$CFDGTYP= 0
##$CFRGTYP= 5
##$CHEMSTR= <none>
##$CNST= (0..31)
1 1 145 1 1 1 1 1 1 1 1 1 1 1 1 1 1 1 1 1 1 1 1 1 1 1 1 1 1 1 1 1 
##$CPDPRG= <>
##$CPDPRG1= <>
##$CPDPRG2= <>
##$CPDPRG3= <>
##$CPDPRG4= <mlev>
##$CPDPRG5= <mlev>
##$CPDPRG6= <mlev>
##$CPDPRG7= <mlev>
##$CPDPRG8= <mlev>
##$CPDPRGB= <>
##$CPDPRGT= <>
##$D= (0..31)
0 1.2 0 0 0 0 0 0 0 0.06 0 0.03 0 0 0 0 0.0002 0 0 0 0 0 0 0 0 0 0 0 0 
0 0 0 
##$DATE= 1719489637
##$DBL= (0..7)
120 120 120 120 120 120 120 120 
##$DBP= (0..7)
150 150 150 150 150 150 150 150 
##$DBP07= 0
##$DBPNAM0= <>
##$DBPNAM1= <>
##$DBPNAM2= <>
##$DBPNAM3= <>
##$DBPNAM4= <>
##$DBPNAM5= <>
##$DBPNAM6= <>
##$DBPNAM7= <>
##$DBPOAL= (0..7)
0.5 0.5 0.5 0.5 0.5 0.5 0.5 0.5 
##$DBPOFFS= (0..7)
0 0 0 0 0 0 0 0 
##$DE= 6
##$DECBNUC= <off>
##$DECIM= 32
##$DECNUC= <off>
##$DECSTAT= 4
##$DIGMOD= 1
##$DIGTYP= 9
##$DL= (0..7)
0 120 120 120 120 120 120 120 
##$DP= (0..7)
150 150 150 150 150 150 150 150 
##$DP07= 0
##$DPNAME0= <>
##$DPNAME1= <>
##$DPNAME2= <>
##$DPNAME3= <>
##$DPNAME4= <>
##$DPNAME5= <>
##$DPNAME6= <>
##$DPNAME7= <>
##$DPOAL= (0..7)
0.5 0.5 0.5 0.5 0.5 0.5 0.5 0.5 
##$DPOFFS= (0..7)
0 0 0 0 0 0 0 0 
##$DQDMODE= 0
##$DR= 18
##$DS= 0
##$DSLIST= <SSSSSSSSSSSSSSS>
$$ [...]
##$SUBNAM2= <"">
##$SUBNAM3= <"">
##$SUBNAM4= <"">
##$SUBNAM5= <"">
##$SUBNAM6= <"">
##$SUBNAM7= <"">
##$SUBNAM8= <"">
##$SUBNAM9= <"">
##$SW= 18.0517328524113
##$SWIBOX= (0..15)
0 0 2 0 0 0 0 0 0 0 0 0 0 0 0 0 
##$SW_h= 3612.71676300578
##$TD= 16384
##$TD0= 1
##$TE= 0
##$TE2= 300
##$TE3= 300
##$TEG= 300
##$TL= (0..7)
0 120 120 120 120 120 120 120 
##$TP= (0..7)
150 150 150 150 150 150 150 150 
##$TP07= 0
##$TPNAME0= <>
##$TPNAME1= <>
##$TPNAME2= <>
##$TPNAME3= <>
##$TPNAME4= <>
##$TPNAME5= <>
##$TPNAME6= <>
##$TPNAME7= <>
##$TPOAL= (0..7)
0.5 0.5 0.5 0.5 0.5 0.5 0.5 0.5 
##$TPOFFS= (0..7)
0 0 0 0 0 0 0 0 
##$TUNHIN= 0
##$TUNHOUT= 0
##$TUNXOUT= 0
##$USERA1= <user>
##$USERA2= <user>
##$USERA3= <user>
##$USERA4= <user>
##$USERA5= <user>
##$V9= 5
##$VALIST= <valist>
##$VCLIST= <CCCCCCCCCCCCCCC>
##$VD= 0
##$VDLIST= <DDDDDDDDDDDDDDD>
##$VPLIST= <PPPPPPPPPPPPPPP>
##$VTLIST= <TTTTTTTTTTTTTTT>
##$WBST= 1024
##$WBSW= 4
##$XGAIN= (0..3)
0 0 0 0 
##$XL= 0
##$YL= 0
##$YMAX_a= 364541
##$YMIN_a= -394176
##$ZGOPTNS= <>
##$ZL1= 120
##$ZL2= 120
##$ZL3= 120
##$ZL4= 120
##$ABSF1= 10
##$ABSF2= 0
##$ABSG= 5
##$ABSL= 3
##$ALPHA= 0
##$AQORDER= 0
##$ASSFAC= 0
##$ASSFACI= 0
##$ASSFACX= 0
##$ASSWID= 0
##$AUNMP= <proc_1d>
##$AZFE= 0.1
##$AZFW= 0.1
##$BCFW= 1
##$BC_mod= 2
##$BYTORDP= 1
##$COROFFS= 0
##$CY= 11.3945322036743
##$DATMOD= 1
##$DC= 2
##$DFILT= <>
##$DTYPP= 0
##$F1P= 15.6554695791079
##$F2P= 12.8336369535428
##$FCOR= 0.5
##$FTSIZE= 0
##$FT_mod= 4
##$GAMMA= 1
##$GB= 0.15
##$INTBC= 1
##$INTSCL= 1
##$ISEN= 128
##$LB= 0.24
##$LEV0= 0
##$LPBIN= 0
##$MAXI= 10000
##$MC2= 0
##$MEAN= 0
##$ME_mod= 0
##$MI= 1.114404
##$NCOEF= 0
##$NC_proc= 0
##$NLEV= 6
##$NOISF1= 3.799351
##$NOISF2= 2.8
##$NSP= 1
##$NTH_PI= 0
##$NZP= 0
##$OFFSET= 15.70392
##$PC= 1
##$PHC0= -25317.14
##$PHC1= 12.58748
##$PH_mod= 1
##$PKNL= yes
##$PPARMOD= 0
##$PSCAL= 0
##$PSIGN= 0
##$REVERSE= no
##$SF= 200.130013532006
##$SI= 16384
##$SIGF1= 3
##$SIGF2= 2
##$SINO= 400
##$SIOLD= 16384
##$SREGLST= <1H.CDCl3>
##$SSB= 0
##$STSI= 0
##$STSR= 0
##$SW_p= 3612.71676300578
##$SYMM= 0
##$S_DEV= 0
##$TDeff= 0
##$TDoff= 0
##$TI= <>
##$TILT= no
##$TM1= 0
##$TM2= 0
##$TOPLEV= 0
##$USERP1= <user>
##$USERP2= <user>
##$USERP3= <user>
##$USERP4= <user>
##$USERP5= <user>
##$WDW= 1
##$XDIM= 8192
##$YMAX_p= 0
##$YMIN_p= 0
$$ End of Bruker specific parameters
$$ ---------------------------------
##NTUPLES= NMR FID
##VAR_NAME=  TIME,          FID/REAL,        FID/IMAG
##SYMBOL=    X,             R,               I
##VAR_TYPE=  INDEPENDENT,   DEPENDENT,       DEPENDENT
##VAR_FORM=  AFFN,          ASDF,            ASDF
##VAR_DIM=   8192,          8192,            8192
##UNITS=     SECONDS,       ARBITRARY UNITS, ARBITRARY UNITS
##FACTOR=    0.0002768,     1,               1
##FIRST=     0,             0,               0
##LAST=      2.2672688,     0,               0
##MIN=       0,             -394176,         0
##MAX=       2.2672688,     364541,          0
$$ Real data points
##PAGE= N=1
##DATA TABLE= (X++(R..R)), XYDATA
$$ plain form
0 0 0 0 0 0 0 0 0 0 0 0 0 0 0 0 0 0 0 0 0 0 1 -29 63 -64 64 -64 64 -65 92 -125 127 -131 159 -190 199 -233
36 -233 259 -288 322 -360 403 -444 494 -545 604 -667 738 -812 897 -985 1091 -1200 1319
53 1319 -1455 1612 -1784 1979 -2208 2472 -2790 3167 -3633 4225 -4994 6069 -7634 10149 -14896
68 -14896 26782 -117483 -57430 364541 129288 -319606 -179153 230141 258725 150263 -710
79 -710 -194645 -102226 215549 177303 -109358 -194311 -127970 -65450 66133 71615 -109338 -153598
91 -153598 6965 108927 118452 57958 -54189 -48566 95004 128549 36983 -24332 -61455 -59763
103 -59763 30253 59608 -40295 -94821 -52282 -18247 21081 45351 -36430 -84077 19048 80401
115 80401 23472 8410 19191 -14803 8525 68887 30948 -32654 -18797 -1020 -10226 6106
$$ packed form
0@%%%%%%%%%%%%%%%%%%%%Jl0R2j27J28j28J28j29J57k17K52k58K90l49L89m32
36b33M92n47O10o82P63q47R38j039J149j271J405j550J709j882K076k291K519
53A319k774L067l396L763m187M680n262N957o800P858r219J1063j3703J7783k5045
68a4896M1678j44265O0053M21971k35253m48894J40453M09294K8584j08462j50973
79g10j93935R2419L17775l8246k86661q4953O6341O2520J31583N482j80953m4260
91a53598J60563J01962R525o0494j12147N623J43570L3545r1566o1315l7123J692
103e9763R0016K9355r9903n4526M2539L4035L9328K4270q1781m7647J03125O1353
115H0401n6929j5062J0781l3994K3328O0362l7939o3602J3857J7777r206J6332
$$ plain form
127 6106 754 -50864 -49010 7183 19008 -7586 -12658 -7347 2104 24007 28156 8673 -1940
140 -1940 951 10465 16988 8405 -9007 -12781 -9650 1051 8122 -8473 -24800 -11311 6800 1202
154 1202 -2045 3072 -2483 -2415 14831 15083 -1048 -344 5101 -4376 -33 6901 -9306 -18252 -523
169 -523 5439 -3522 442 5428 1269 5156 11912 5174 -2228 -845 -2245 -6479 -4266 -4703 -12074 -9407
185 -9407 -1063 1237 1509 1614 4423 8008 9841 6364 6176 4753 -55 -1017 1152 -3676 -7093 -4760
201 -4760 -5629 -7846 -4054 -1803 -7518 -4436 4412 -3 -2655 5744 6367 1189 7264 11843 5647 3371
217 3371 8246 2814 -2910 753 -2325 -11680 -9216 -4522 -9839 -12285 -4431 -2001 -4369 2303 6436
232 6436 6101 7391 11459 10609 6962 8324 7795 692 -623 191 -5282 -9789 -9005 -8750 -9548 -8958 -6238
$$ packed form
127F106n352n1618J854N6193J1825k6594n072N311R451K1903M149j9483j0613
140a940K891R514O523q583j7412l774L131J0701P071j6595j6327J3489J8111n598
154A202l247N117n555O8J7246K52j6131P04N445r477M343O934j6207q946J7729
169e23N962q961L964M986m159L887O756o738p402J383j400m234K213m37p371K667
185i407Q344K300K72J05K809L585J833l477j88j423m808r62K169m828l417K333
201d760q69k217L792K251n715L082Q848m415k652Q399O23n178O075M579o196k276
217C371M875n432n724L663l078r355K464M694n317k446P854K430k368O672M133
232F436l35J290M068q50l647J362n29p103j315Q14n473m507P84K55p98N90K720
$$ plain form
249 -6238 -2747 -2332 2167 5655 7154 7841 10103 9816 6282 6566 5528 306 -2246 -969 -4113 -8416
265 -8416 -6696 -4837 -7554 -6646 -2172 -1920 -2470 1369 3040 1033 3048 5759 4995 3580 7189 5741
281 5741 2336 2471 3625 956 -3129 -1994 -3828 -7107 -6839 -5392 -6425 -5523 -1068 29 311 4229
297 4229 6597 5770 5588 8165 6229 1773 1440 1466 -2052 -4234 -3356 -4773 -6185 -4245 -2821 -2598 -1097
314 -1097 1619 1079 -543 2533 2929 -167 722 3059 2008 925 1619 1982 1219 1138 1529 -187 -1724
331 -1724 148 -1292 -4074 -2353 -2261 -3911 -3583 -815 146 -344 1078 3349 3290 2202 3669 3005 1489
348 1489 1641 1801 -1082 -1464 -995 -1648 -2647 -2249 -835 -2555 -2256 238 -692 -1106 69 786 -273 0
366 0 1461 628 -17 2243 1662 -242 941 1565 661 -1264 593 656 -2072 -2057 -1513 -2149 -3002 -1817 -1369
$$ packed form
249f238L491M15M499L488J499O87K262k87l534K84j038n222k552J277l144m303
265h416J720J859k717R08M474K52n50L839J671k007K015K711p64j415L609j448
281E741l405J35J154k669m085J135j834l279K68J447j033R02M455J097K82L918
297D229K368q27j82K577j936m456l33K6l518k182Q78j417j412J940J424K23J501
314a097K716n40j622L076L96l096Q89K337j051j083O94L63p63q1L91j716j537
331a724J872j440k782J721R2j650L28K768R61m90J422K271n9j088J467o64j516
348A489J52J60k883l82M69o53r99L98J414j720K99K494r30m14J175P17j059K73
366@J461q33o45K260n81j904J183O24r04j925J857O3k728J5N44o36q53J185M48
$$ plain form
385 -1369 -877 -104 960 210 1332 2372 2195 1556 2332 2654 1794 658 846 15 -1260 -2510 -2502 -3060 -2724
404 -2724 -1542 -1738 -1338 223 902 637 577 3466 1850 920 2279 1385 781 697 813 24 -529 -198 -919
423 -919 -1886 -1567 -1482 -2513 -1882 -636 -1224 -1735 -392 705 952 564 2033 3157 2153 3036 2912 1015
441 1015 1296 911 -24 -2335 -2021 -2677 -2785 -3599 -2179 -1312 -1176 -725 824 1346 1464 2614 1766 2046 2200
460 2200 2016 733 221 114 -231 -1543 -489 -676 -1845 -1852 -247 -1308 -1813 297 -49 -554 17 498
478 498 1466 1018 2364 2168 1200 1989 1524 440 -34 730 453 -1024 -1356 -2029 -1564 -2038 -489 -1555 -901
497 -901 -57 167 294 969 2226 2394 1417 2100 1151 696 -48 825 -601 -1526 -1300 -1425 -1244 -1423 -949 -649
517 -649 -32 89 79 849 684 1145 488 452 377 1118 -405 813 1130 254 863 44 -507 -441 -463 -613 -1145
$$ packed form
385a369M92P73J064p50J122J040j77o39P76L22q60j136J88q31j275j250Qn58L36
404b724J182j96M00J561O79k65o0K889j616r30J359q94o04q4J16p89n53L31p21
423i19r67L19Q5j031O31J246n88n11J343J097K47l88J469J124j004Q83j24j897
441A015K81l85r35k311L14o56j08q14J420Q67J36M51J549N22J18J150q48K80J54
460B200j84j283n12j07l45j312J054j87j169pJ605j061n05K110l46n05N71M81
478D98R68m48J346j96r68P89m65j084m74P64k77j477l32o73M65m74J549j066O54
497i01Q44K24J27O75J257J68r77O83r49m55p44Q73j426r25K26j25J81j79M74L00
517f49O17J21j0P70j65M61o57l6p5P41j523J218L17q76O09q19n51O6k2j50n32
$$ plain form
538 -1145 -1250 -1373 -1637 -1448 -434 -16 441 623 872 1833 1449 1601 1668 1302 194 -583 207 -1347 -1945
557 -1945 -1599 -1189 -908 -129 -416 -1015 -219 -254 -598 610 1728 410 170 1038 723 801 825 1426 562 179
577 179 1065 -334 -308 -1209 -699 -979 -1114 -673 -1086 -1165 -206 69 107 450 105 780 1324 550 1411 978 816
598 816 662 -233 -374 -765 -102 -1736 -904 -955 -604 -41 -199 677 146 317 748 847 374 1304 657 -205 1168
619 1168 571 67 -445 149 -1268 -243 -942 258 -216 -835 -568 -289 -44 69 -591 -35 1022 -59
637 -59 1377 176 1314 1348 1033 703 460 1072 -702 -428 -598 -742 -1594 -815 -507 -892 -624 -344 159 34
657 34 705 1301 1124 226 1784 103 0 90 728 -387 278 -724 -839 -175 -1267 -404 -1204 -200 -328
676 -328 -408 -200 597 5 106 924 244 592 605 1353 359 -365 -332 698 232 528 -1427 -732 -371 -412 -1289
$$ packed form
538a145j05j23k64J89J014M18M57J82K49R61l84J52O7l66j108p77P90j554n98
557a945L46M10K81P79k87n99P96l5l44J208J118j318k40Q68l15P8K4O01q64l83
577A79Q86j399K6r01N10k80j35M41m13p9R59K75L8L43l45O75N44p74Q61m33j62
598H16j54q95j41l91O63j634Q32n1L51N63j58Q76n31J71M31R9m73R30o47q62J373
619A168n97n04n12N94j417J025o99J200m74o19K67K79K45J13o60N56J057j081
637e9J436j201J138L4l15l30k43O12j774K74j70j44q52P79L08l85K68K80N03j25
657C4O71N96j77q98J558j681j03R0O38j115O65j002j15O64j092Q63q00J004j28
676c28q0K08P97n92J01Q18o80L48J3P48r94p24L3J030m66K96j955O95L61m1q77
$$ plain form
697 -1289 -679 14 531 -869 105 513 573 999 1626 737 988 491 968 186 -408 -106 -1339 -737 -535 -89
717 -89 -269 -139 97 502 -352 522 -163 247 -250 107 537 709 220 904 314 259 207 -74 60 -357 -15
738 -15 -919 -388 325 -1059 -489 -332 -321 211 196 528 1080 -146 997 1170 23 853 -580 636 -174
757 -174 -64 -198 -543 -1101 -156 -1499 92 -1065 -97 823 246 129 425 -546 450 -4 -65 -25 1133 319
777 319 167 760 -293 -19 -500 368 -177 -457 -698 -256 -933 -797 -577 -738 157 204 908 250 323 -397 318
798 318 457 679 -128 263 597 -1128 -81 -535 -215 165 -403 127 -578 229 -432 -434 677 -65 -299 386
818 386 415 -44 471 -242 -187 -86 -611 -1087 -301 -765 -202 -686 297 -257 -359 114 -248 585 -225 467 -39
839 -39 202 240 563 521 -84 -398 281 713 362 -624 446 -646 -122 -919 -469 -515 -224 -60 -538 -109 -426
$$ packed form
697a289O10O93N17j400R74M08O0M26O27q89K51m97M77p82n94L02j233O02K02M46
717h9j80J30K36M05q54Q74o85M10m97L57M30J72m89O84n90n5n2k81J34m17L42
738a5r04N31P13j384N70J57J1N32j5L32N52j226J143J73j147Q30j433J216q10
757a74J10j34l45n58R45j343J591j157R68R20n77j17K96r71R96m54o1M0J158q14
777C19j52N93j053K74m81Q68n45k80k41M42o77J36K20j61Q95M7P04o58P3p20P15
798C18J39K22q07L91L34j725J047m54L20L80n68N30p05Q07o61kJ111p42k34O85
818C86K9m59N15p13N5J01n25m76P86m64N63m84R83n54j02M73l62Q33q10O92n06
839c9K41L8L23m2o05l14O79M32l51r86J070j092N24p97M50m6K91J64m78M29l17
$$ plain form
860 -426 -91 437 384 1092 -153 -50 180 72 59 513 -651 -476 -47 -321 -195 -469 -790 595 311 -305
880 -305 -158 -966 269 645 272 422 547 86 538 -569 375 -182 -160 415 624 88 -648 -28 47 -336
900 -336 -363 109 -196 548 -766 196 -202 453 -233 840 787 7 531 -238 85 -188 -51 -633 -623 185 26
921 26 297 217 -346 -235 -400 375 635 -620 414 439 763 -320 -303 144 181 201 -248 -84 323 619 -311
942 -311 -667 611 -394 193 81 -99 183 -998 782 524 663 439 -287 25 412 26 199 7 -532
961 -532 -163 -881 -36 -507 86 -498 -727 -6 -164 -383 416 -136 85 420 264 792 391 -668 163 661
981 661 -89 306 -191 26 -29 -586 175 -441 45 236 410 -216 -65 -155 691 -63 216 365 1424 563 516
1002 516 850 1019 -170 -75 -12 -143 -186 -637 -378 -367 -747 -390 241 -669 145 -478 812 -177 259 298 265
$$ packed form
860d26L35N28n3P08j245J03K30j08j3M54j164J75M29k74J26k74l21J385k84o16
880c05J47q08J235L76l73J50J25m61M52j107R44n57K2N75K09n36p36O20P5l83
900c36k7M72l05P44j314R62l98O55o86J073n3p80N24p69L23k73J37n82J0Q08j59
921B6K71q0n63J11j65P75K60j255J034K5L24j083J7M47L7K0m49J64M07K96r30
942c11l56J278j005N87j12j80K82j181J780k58J39k24p26L12L87l86J73j92n39
961e32L69p18Q45m71N93n84k29P21j58k19P99n52K21L35j56N28m01j059Q31M98
981F61p50L95m97K17n5n57P61o16M86J91J74o26J51r0Q46p54K79J49J059q61m7
1002E16L34J69j189R5O3j31m3m51K59J1l80L57O31r10Q14o23J290r89M36L9l3
$$ plain form
1023 265 180 332 179 -983 129 25 708 -253 -670 -229 -562 -511 -33 -210 -381 183 186 31 -271 -897 130
1044 130 308 192 758 -351 666 282 -584 -396 -276 -414 685 519 375 -577 -244 113 241 588 737
1063 737 -325 -144 132 -11 129 294 -104 -743 -364 -485 -308 158 -240 108 31 121 -467 -341 -360 -718 298
1084 298 514 -67 746 -103 263 -165 304 212 -124 -202 1174 -550 -153 145 -658 -904 -651 -413 -558 -41
1104 -41 -398 547 146 324 237 189 564 286 151 -92 580 196 111 1115 -13 -218 159 188 196 -242 -173 35
1126 35 -348 -613 -345 478 -192 433 482 108 45 676 -769 150 -131 -446 -46 220 -115 -193 763 -240 -65
1147 -65 -927 -149 493 -128 313 -183 396 -439 58 -657 -22 433 -110 30 -395 -317 51 -209 -75 63 -242
1168 -242 -253 -71 -428 -86 6 812 176 223 -607 -4 45 655 219 -63 -528 -770 -357 -972 -460 1071 789
$$ packed form
1023B65q5J52j53j162J112j04O83r61m17M41l33N1M78j77j71N64Lj55l02o26J027
1044A30J78j16N66j109J017l84q66J88J20j38J099j66j44r52L33L57J28L47J49
1063G37j062J81K76j43J40J65l98o39L79j21J77M66l98L48p7R0n88J26j9l58J016
1084B98K16n81Q13q49L66m28M69r2l36p8J376j724L97K98q03k46K53K38j45N17
1104d1l57R45m01J78q7m8L75k78j35k43O72l84q5J004j128k05L77K9Qm38O9K08
1126C5l83k65K68Q23o70O25M9l74o3O31j445R19k81l15M00K66l35p8R56j003J75
1147f5q62P78O42o21M41m96N79q35M97p15O35M55n43J40m25P8L68k60J34J38l05
1168b42j1J82l57L42R2Q06o36M7q30O03M9O10m36k82m65k42M13o15N12J531k82
$$ plain form
1189 789 127 -672 597 237 86 5 -549 17 -33 387 57 375 119 561 -271 304 -282 388 387 331 109
1210 109 -298 -504 338 -521 217 88 460 -604 123 622 257 -516 -430 -637 354 454 -99 -664 267 -628
1230 -628 658 252 594 -443 494 -191 -106 -499 -430 886 -560 377 573 -166 -213 -325 -78 111 57 -608
1250 -608 689 364 639 303 -168 274 -379 762 55 413 -183 -242 -861 -204 572 422 -48 -41 809 -528
1270 -528 792 622 -324 -181 -88 -2 -379 -557 305 -387 -44 -311 9 -710 -371 -49 -143 -102 -228 299 -394
1291 -394 -98 322 -192 -105 -114 892 454 413 281 283 -577 119 -117 -581 -348 188 -318 45 -768 216 800 -248
1313 -248 45 -74 100 -182 194 215 156 91 523 643 -194 312 59 -59 -499 190 -495 28 423 166 170 471
1335 471 -397 308 -52 -208 198 17 385 -61 164 -667 819 54 584 73 -26 -82 -34 -314 91 894 658
$$ packed form
1189G89o62p99J269l60j51q1n54N66n0M20l30L18k56M42q32N75n86O70jn6k22
1210A09m07k06Q42q59P38j29L72j064P27M99l65p73Q6k07R91J00n53n65R31q95
1230f28J286m06L42j037R37o85Q5l93O9J316j446R37J96p39m7j12K47J89n4o65
1250f08J297l25K75l36m71M42o53J141p07L58n96n9o19O57P76j50m70PQ50j337
1270e28J320j70r46J43R3Q6l77j78Q62o92L43k67L20p19L39L22r4M1j26N27o93
1291c94K96M20n14Q7rJ006m38m1j32Kq60O96k36m64K33N36n06L63q13R84N84j048
1313b48K93j19J74k82L76K1n9o5M32J20q37N06k53j18m40O89o85N23L95k57ML01
1335D71q68P05l60j56M06j81L68m46K25q31J486p65N30n11r9n6M8k80M05Q03k36
$$ plain form
1356 658 130 593 204 63 -92 -630 -293 475 821 392 47 791 326 399 56 2 168 388 732 -155 421
1377 421 10 260 -199 -515 -120 -470 -362 205 83 247 224 -233 115 316 188 -564 161 -213 -54 590
1397 590 -62 561 -51 128 -37 -817 -524 526 -670 -555 -315 121 -245 -414 487 -422 124 12 249
1416 249 496 342 -78 -160 -21 148 -777 315 156 223 1226 560 -261 -177 113 -86 100 55 -327 106 227
1437 227 224 -476 228 209 431 666 159 -361 -325 -241 170 63 -79 196 -378 311 540 -19 -87 -100 406 28
1459 28 257 161 -585 -336 -214 97 288 911 311 508 571 697 -250 -123 -193 -336 -194 167 1 -264 340
1480 340 520 -495 168 -7 -269 -727 468 -653 130 -60 -17 122 -1108 417 568 646 276 -237 194
1499 194 81 -928 337 -575 -260 -386 -304 166 -310 589 -1010 -462 198 -276 -254 87 -248 197 -439 665
$$ packed form
1356F58n28M63l89j41j55n38L37P68L46m29l45P44m65P3l43n4J66K20L44q87N76
1377D21m11K50m59l16L95l50J08N67j22J64k3m57L48K01j28p52P25l74J59O44
1397E90o52O23o12J79j65p80K93J050j196J15K40M36l66j69R01r09N46j12K37
1416B49K47j54m20q2J39J69r25J092j59O7J003o66q21Q4K90j99J86m5l82M33J21
1437B27lp00P04j9K22K35n07n20L6Q4M11j07j42K75n74O89K29n59o8j3N06l78
1459B8K29r6p46K49J22L11J91O23o00J97O3J26r47J27p0j43J42L61j66k65O04
1480C40J80j015O63j75k62m58J195j121P83j90M3J39j230J525J51P8l70n13M31
1499A94j13j009J265r12L15j26Q2M70m76Q99j599N48O60m74K2L41l35M45o36J104
$$ plain form
1519 665 -406 37 -72 -271 -112 688 213 -623 124 -222 264 -545 -1021 -621 976 101 222 -50 -231
1538 -231 9 -14 -271 -420 -143 -42 -674 -415 -180 1056 -260 -575 -58 80 -670 -326 -221 -83 -239 -630
1558 -630 512 225 -148 -450 -175 174 -183 376 -345 615 -108 -597 280 -185 -172 -264 -265 44 709 -510 31
1579 31 -236 495 152 319 -67 206 77 195 126 -207 -443 55 -256 -208 567 -61 -950 27 -268 878 691
1600 691 -82 653 -279 -328 -104 169 -59 422 -8 130 299 269 -50 112 433 531 -336 -256 -30 96 176 -716
1622 -716 184 134 62 -224 -124 -317 587 107 202 -522 40 -322 496 776 -328 229 -311 16 142 -513 445
1643 445 165 139 84 -699 460 227 -532 340 -259 -124 119 49 313 -566 419 -150 271 -57 -57 155 -110
1664 -110 425 297 -236 -314 -454 -141 248 -358 166 -376 -771 -300 -187 245 -61 -987 -834 -125 617 788
$$ packed form
1519F65j071M43j09j99J59Q00m75q36P47l46M86q09m76M00J597q75J21k72j81
1538b31K40k3k57j49K77J01o32K59K35J236j316l15N17J38p50L44J05J38j56l91
1558f30J142k87l73l02K75L49l57N59p21R60p23m89Q77m65J3r2jL09O65j219N41
1579C1k67P31l43J67l86K73j29J18o9l33k36M98l11M8P75o28q89R77k95J146j87
1600F91p73P35r32m9K24K73k28M81m30J38J69l0l19J62L21R8q67Q0K26J26Q0q92
1622g16R00n0p2k86J00j93R04m80R5p24N62l62Q18K80j104N57n40L27J26o55R58
1643D45k80k6n5p83J159k33p59Q72n99J35K43p0K64q79R85n69M21l28%K12k65
1664a10N35j28n33p8j40L13L89o06N24n42l95M71J13M32l06r26J53P09P42J71
$$ plain form
1684 788 -278 -126 -302 -835 447 -364 -120 241 -111 745 525 512 113 -256 -109 -239 108 481 151 -156
1704 -156 111 -882 621 82 159 -102 -152 -295 -271 -300 117 144 -190 765 -373 -262 -95 -449 290 -315 -498
1725 -498 38 116 571 -226 -208 -131 -223 -212 -197 493 386 -188 -792 597 556 31 160 153 5 -197 16 638 151
1748 151 -191 373 -229 520 146 -128 97 -83 68 1119 -888 -150 266 207 410 154 301 185 -477 -305
1768 -305 363 -1865 309 -66 -182 -450 108 -328 65 -130 -217 334 -172 304 -324 102 62 -609 -350 220
1788 220 -803 -845 579 -519 286 -360 -102 442 -603 -91 540 613 1284 128 -789 182 654 -189 -96
1807 -96 86 -23 65 110 124 -77 -114 -457 -503 -311 963 -559 449 229 -540 871 -244 546 -182 234
1827 234 466 134 -710 -29 849 771 565 -198 -133 -242 -42 164 1028 472 -71 -413 75 -226 -348 -434 -211
$$ packed form
1684G88j066J52j76n33J282q11K44L61l52Q56k20j3l99l69J47j30L47L73l30l07
1704a56K67r93J503n39P7k61n0j43K4k9M17K7l34R55j138J11J67l54P39o05j83
1725d98N36P8M55p97J8P7r2J1J5O90j07n74o04J389m1n25J29pj48k02K13O22m87
1748A51l42N64o02P49l74k74K25j80J51J051k007P38M16n9K03k56J47j16o62J72
1768c05O68k228K174l75j16k68N58m36L93j95q7N51n06M76o28M26m0o71K59N70
1788B20j023m2J424j098Q05o46K58N44j045N12O31P3O71j156r17R71M72q43R3
1807i6J82j09Q8M5J4k01l7l43m6J92J274j522J008k20p69J411j115P90p28M16
1827B34K32l32q44O81Q78p8k06p63O5j09K00K06Q64n56n43l42M88l01j22q6K23
$$ plain form
1848 -211 750 122 -523 -210 94 -78 140 593 -1035 283 613 -1282 -639 821 476 -79 -461 840
1866 840 -229 556 -390 -197 -179 -704 29 -904 286 96 353 -113 277 -78 582 -880 348 411 101
1885 101 -200 -395 283 421 783 262 -1 -247 -553 -361 -588 137 -897 285 113 -573 -406 -377 -522 35
1905 35 416 -286 346 760 571 -112 311 -5 148 628 230 437 107 330 576 319 -636 -368 359 268 -406
1926 -406 -701 351 -1036 -393 -52 281 -359 -155 84 -16 274 322 365 -149 55 27 257 137 533 -588
1946 -588 102 -286 470 -25 -66 -219 297 48 -345 -135 -20 -291 -388 7 166 363 1314 -341 -102 -72 -181
1967 -181 773 419 262 627 421 316 399 -176 45 -71 416 113 -539 -1 -160 -189 234 790 202 88 76
1988 76 321 -440 113 -217 -58 708 163 280 -96 -650 -235 -995 -164 265 -835 42 526 380 217 94
$$ packed form
1848b11R61o28o45L13L04j72K18M53j628J318L30j895O43J460l45n55l82J301
1866H40j069P85r46J93J8n25P33r33J190j90K57m66L90l55O60j462J228O3l10
1885A01l01j95O78J38L62n21k63k46l06J92k27P25j034J182j72o86J67K9j45N57
1905C5L81p02O32M14j89o83M23l16J53M80l98K07l30K23K46k57r55K68P27r1o74
1926d06k95J052j387O43L41L33o40K04K39j00K90M8M3n14K04k8K30j20L96j121
1946e88O90l88P56m95m1j53N16k49l93K10J15k71r7L95J59J97R51j655K39L0j09
1967a81R54l54j57L65k06j05Q3n75K21j16M87l03o52N38j59k9M23N56n88j14j2
1988G6K45p61N53l30J59P66n45J17l76n54M15p60Q31M29j100Q77M84j46j63j23
$$ plain form
2008 94 541 -723 -715 603 616 -192 308 -271 -103 8 304 -54 -332 -565 -108 -268 326 125 364 -127 288
2029 288 -619 -18 -465 489 91 -622 570 694 959 211 296 -278 -348 -62 27 43 55 -405 -298 151 444
2050 444 19 798 -101 265 472 399 -575 74 -71 555 -20 307 -553 -604 0 -334 -73 -408 -577 607
2070 607 17 175 360 -173 -176 -764 -507 308 -781 -30 251 -16 189 -181 511 863 74 258 347 -254 362
2091 362 -348 204 -473 -760 -27 79 544 -204 -524 319 201 482 163 -33 161 -592 444 178 -167 218
2111 218 616 1177 69 799 277 225 -109 139 13 373 -41 366 633 -113 -530 -560 -31 263 141 -552
2131 -552 -439 -331 -285 327 101 467 62 -352 -217 -223 177 -361 -5 213 388 304 -302 -375 -486 350 -591 198
2153 198 -411 197 184 -448 -877 -233 354 -524 481 -77 -265 -209 -305 -64 -185 315 244 -627 299 702 303
$$ packed form
2008I4M47j264QJ318J3q08N00n79J68J11K96l58k78k33M57j60N94k01K39m91M15
2029B88r07O01m47R54l98p13J192J24K65p48Q5n74p0K86Q9J6J2m60J07M49K93
2050D44m25P79q99L66K07p3r74O49j45O26n75L27q60n1O04l34K61l35j69J184
2070F07n90J58J85n33ln88K57Q15j089P51K81k67K05l70O92L52p89J84Q9o01O16
2091C62p10N52o77k87P33J06M65p48l20Q43j18K81l19j96J94p53J036k66l45L85
2111B18L98N61j108P30n22n2l34K48j26L60m14M07K67p46m17l0N29K94j22o93
2131e52J13J08M6O12k26L66m05m14J35oM00n38L56K18J75q4o06p3j11Q36r41P89
2153A98o09O08j3o32m29O44N87q78J005n58j88N6r6K41j21N00p1q71R26M03l99
$$ plain form
2174 303 167 395 705 -12 52 -52 -29 411 194 366 -31 -534 -173 -124 -547 231 424 -782 147 -480 133
2195 133 -388 -137 493 72 64 -900 289 -426 -398 292 -200 -32 936 -315 -163 273 -255 333 -580 -876
2215 -876 88 -50 -58 -301 -486 61 337 1064 250 -767 108 95 -173 660 416 388 8 -306 403 -147 -169
2236 -169 -153 248 244 617 -410 982 -991 22 192 725 -511 -256 566 -102 -426 159 305 91 146 198
2256 198 633 425 172 -603 47 521 -74 -750 -149 552 -748 -333 -217 194 -59 269 277 -473 -147 -548
2276 -548 -39 -308 -282 -384 325 -321 -76 217 320 -571 -642 305 15 171 14 204 289 214 362 -222 548
2297 548 91 478 -69 -447 -235 99 190 -169 -420 549 -399 153 -444 466 172 166 54 389 796 -472 -585
2318 -585 -424 414 -390 -73 532 872 193 260 718 604 -40 693 -139 -337 -91 104 -881 -72 -266 789
$$ packed form
2174C03j36K28L10p17O4j04K3M40k17J72l97n03L61M9m23P78J93j206R29o27O13
2195A33n21K51O30m21qr64J189p15K8O90m92J68R68j251J52M36n28N88r13k96
2215h76R64j38qk43j85N47K76P27q14j017Q75j3k68Q33k44k8l80l14P09n50k2
2236a69J6M01mL73j027J392j973J013J70N33j236K55Q22o68l24N85J46k14N5N2
2256A98M35k08k53p75O50M74n95o76O01P01j300M15J16M11k53L28Qp50L26m01
2276e48N09k69K6j02P09o46K45K93J03q91p1R47k90J56j57J90Q5p5J48n84P70
2297E48m57L87n47l78K12L34R1l59k51R69r48N52n97R10k94oj12L35M07j268j13
2318e85J61Q38q04L17O05L40o79O7M58j14o44P33q32j98K46J95r85Q09j94J055
$$ plain form
2338 789 254 179 230 152 -304 -24 228 -267 -143 56 -35 -107 -207 -582 1050 151 -512 -242 -88 -128 -92 93
2360 93 184 -72 -596 115 267 394 -358 -115 101 -361 -883 433 495 -437 233 592 -391 -316 272 392 -137
2381 -137 -398 4 -166 258 269 191 -334 440 -192 -295 693 -147 259 36 431 -90 431 763 138 475 -332
2402 -332 5 -326 -154 -169 -851 41 224 383 726 123 -231 248 -213 194 -888 194 -330 386 244 30
2422 30 147 106 -900 114 -822 702 -222 -561 -37 470 579 -252 686 35 -48 -278 -122 387 -239 -246 -618
2443 -618 -428 170 944 -577 -117 596 -226 -467 525 51 247 -597 161 -400 -212 -116 -1024 -400 -235 -355
2463 -355 338 -276 536 508 146 1202 38 425 -188 456 783 317 -663 691 309 277 286 66 826 -397
2483 -397 -78 606 314 -336 71 -180 -311 137 349 206 -895 -316 -703 208 -1051 -389 -783 226 -122
$$ packed form
2338G89n35p5N1p8m56K80K52m95J24J99r1p2j00l75J632q99o63K70J54m0L6J85
2360I3R1k56n24P11J52J27p52K43K16m62n22J316O2r32O70L59r83P5N88J20n29
2381a37k61M02j70M24J1p8n25P74o32j03R88q40M06k23L95n21N21L32o25L37q07
2402c32L37l31J72j5o82Q92J83J59L43o03l54M79m61M07j082J082n24P16j42k14
2422C0J17m1j006J014r36J524r24l39N24N07J09q31R38o51q3k30J56N09o26pl72
2443f18J90N98P74j521M60P13q22k41R92m74J96q44P58n61J88R6r08O24J65j20
2463c55O93o14Q12k8l62J056j164L87o13O44L27m66r80J354l82l2Rk20P60j223
2483c97L19O84k92o50M07k51j31M48K12j43j101N79l87R11j259O62l94J009l48
$$ plain form
2502 -122 -20 569 -491 502 -305 -5 337 -481 -178 300 82 171 137 -363 157 -441 264 59 -448 301
2522 301 -232 204 1291 -57 -363 607 403 157 1004 173 -265 181 460 579 104 -728 -360 -265 -578 724
2542 724 -445 218 1310 509 409 -258 467 18 92 410 515 -930 -113 559 -581 188 -1026 138
2560 138 -777 118 -412 618 871 -60 179 -461 -350 519 554 162 187 705 257 -363 -319 -77 -244 -366 -15
2581 -15 114 -227 346 -526 547 294 -487 -425 -145 209 399 -74 -42 350 -7 -21 95 -84 -204 -209 696 728
2603 728 -18 48 146 -22 175 280 -454 217 -46 -510 202 891 103 -298 624 174 651 198 -277 -571 -177
2624 -177 155 -26 -683 29 -79 196 -590 357 340 -626 300 -381 -20 180 -222 258 64 -996 12 -574
2644 -574 28 -453 677 543 -697 747 -271 -239 -470 -346 77 221 135 369 143 717 316 -190 541
$$ packed form
2502a22J02N89j060R93q07L00L42q18L03M78k18Q9l4n00N20n98P05k05n07P49
2522C01n33M36J087j348l06R70k04k46Q47q31m38M46K79J19m75q32L68R5l13J302
2542G24j169O63J092q01j00o67P25m49P4L18J05j445Q17O72j140P69j214J164
2560A38r15Q95n30J030K53r31K39o40J11Q69L5l92K5N18m48o20M4K42j67j22L51
2581a5J29l41N73q72J073k53p81O2K80L54J90m73L2L92l57j4J16j79j20nR05L2
2603G28p46O6R8j68J97J05p34O71k63m64P12O89p88m01R22m50M77m53m75k94L94
2624a77L32j81o57P12j08K75p86R47j7r66R26o81L61K00m02M80j94j060J008n86
2644e74O02m81J130j34j240J444j018L2k31J24M23J44q6K34k26N74m01n06P31
$$ plain form
2663 541 -265 188 -298 -4 14 -303 -125 321 160 865 324 69 108 -463 -459 -276 -254 -163 -535 554 28 148
2685 148 -15 -662 343 -308 -45 -296 -151 350 -559 -346 -59 -39 187 -263 -902 91 -197 -139 63 35 -196
2706 -196 249 -515 -57 -297 -662 470 -50 -562 -75 52 140 288 -77 356 -148 142 -238 657 -7 211
2726 211 649 -47 248 145 410 -107 245 186 160 -310 -332 -210 365 -756 -136 229 -576 -305 49 79 333
2747 333 -431 -25 -344 -807 489 -624 -309 569 -110 -503 253 -1307 139 -721 -572 91 161 -127 -460
2766 -460 39 650 -50 -735 -433 53 -846 -42 429 -73 699 264 658 -629 179 -311 687 177 18 7
2786 7 -325 -453 -884 202 -187 773 93 49 179 477 -699 310 160 58 147 -479 -522 171 -381 564 -9
2807 -9 679 135 648 68 248 442 -550 96 -22 669 249 782 -609 -68 105 159 -442 -273 -231 -53 -386
$$ packed form
2663E41q06M53m86K94J8l17J78M46j61P05n41k55L9n71MJ83K2R1l72J089n26J20
2685A48j63o47J005o51K63k51J45N01r09K13K87K0K26m50o39R93k88N8K02k8k31
2706a96M45p64M58k40l65J132n20n12M87J27Q8J48l65M33n04K90l80Q95o64K18
2726B11M38o96K95j03K65n17L52n9k6m70k2J22N75j121O20L65q05K71L54L0K54
2747C33p64M06l19m63J296j113L15Q78o79l93P56j560J446q60J49O63P0k88l33
2766d60M99O11p00o85L02M86q99Q04M71n02P72m35L94j287Q08m90R98n10j59j1
2786Gl32j28m31J086l89R60o80m4J30K98j176J009j50j02Q9o26m3O93n52R45n73
2807iO88n44N13n80J80J94r92O46j18O91m20N33j391N41J73N4o01J69M2J78l33
$$ plain form
2828 -386 -24 -61 -421 17 80 -546 -437 147 577 362 412 105 78 209 308 261 -145 -192 -195 -338 52 657 787
2851 787 -185 -245 -649 -533 -202 -127 28 620 -147 123 15 -167 777 247 -605 -41 193 -214 269 -506 392
2872 392 207 318 1071 387 92 -52 96 500 104 -529 396 -378 -284 -78 -257 -380 -38 -421 358 -598
2892 -598 -183 574 -189 200 -419 149 -326 -322 442 212 489 508 238 -457 329 -12 -155 264 393 -4 -1148
2913 -1148 44 340 260 118 192 60 -571 32 -67 5 -40 308 -453 201 330 1137 690 281 928 -350 652
2934 652 310 -398 403 -268 -299 18 -202 -211 -637 -468 389 -378 37 325 -180 426 147 -225 -751 274 -493
2955 -493 -410 751 743 -61 -423 141 -585 237 482 415 -132 -101 95 -181 489 -303 746 -895 -181 -565 -1261
2976 -1261 440 -208 473 20 -442 -214 -155 237 -307 -77 1226 -950 462 208 -429 288 -359 501 -326
$$ packed form
2828c86L62l7l60M38O3o26J09N84M30k15N0l07k7J31R9m7m06m7lj43L90O05J30
2851G87r72o0m04J16L31P5J55N92p67K70j08j82R44n30q52N64K34m07M83p75Q98
2872C92j85J11P53o84k95j44J48M04l96o33R25p74R4K06j79j23L42l83P79r56
2892e98M15P57p63L89o19N68m75MP64k30K77J9k70o95P86l41j43M19J29l97j144
2913a148J192K96q0j42P4j32o31O03r9P2m5L48p61O54J29Q07m47m09O47j278J002
2934F52l42p08Q01o71l1L17k20rm26J69Q57p67M15K88n05O06k79l72n26J025p67
2955d93Q3J161qq04l62N64p26Q22K45o7n47L1J96k76O70p92J049j641P14l84o96
2976a261J701o48O81m53m62K28N9L92n44K30J303k176J412k54o37P17o47Q60q27
$$ plain form
2995 -326 -141 -464 -371 -69 584 415 -102 -134 383 -342 -57 268 -75 143 910 738 -44 -513 -49 101 234
3016 234 -341 -301 -13 35 569 -200 -305 74 -117 31 20 690 589 -76 -77 813 -331 -580 -28 -356 215
3037 215 110 1 -199 379 -834 -34 -100 273 -387 448 -495 -159 556 265 250 -157 -192 -191 170 37 415
3058 415 -197 814 -351 707 1340 -559 257 575 -225 224 362 -453 234 -9 334 -399 -39 -412 -237
3077 -237 546 398 -416 232 32 85 -367 433 -86 -25 -78 65 630 -422 -911 492 151 -400 303 832
3097 832 -598 415 -747 661 -570 -330 -467 -483 -15 453 -1042 -317 -62 -340 -19 794 43 -58
3115 -58 121 -394 -213 496 295 122 232 -583 132 211 30 65 -32 -256 -792 228 -365 113 197 -109 414
3136 414 -231 112 -648 -308 137 457 -1000 -699 -234 -134 23 57 476 -15 42 -506 -169 -565 107 31 298
$$ packed form
2995c26J85l23R3L02O53j69n17l2N17p25K85L25l43K18P67j72p82m69M64J50J33
3016B34n75M0K88M8N34p69j05L79j91J48j1O70j01o65jQ90j144k49N52l28N71
3037B15j05j09k00N78j213Q00o6L73o60Q35r43L36P15k91j5m07l5JL61j33L78
3058D15o12J011j165J058O33j899Q16L18q00M49J38q15O87k43L43p33L60l73J75
3077b37P83j48q14O48k00N3m52Q00n19O1n3J43N65j052m89J403l41n51P03N29
3097H32j430J013j162J408j231K40j37j6M68M68j495P25K55k78L21Q13p51j01
3115e8J79n15J81P09k01j73J10q15P15P9j81L5r7k24n36J020n93M78Q4l06N23
3136D14o45L43p60L40M45L20j457L01M65J00J57L4M19m91N7n48L37l96O72p6K67
$$ plain form
3157 298 131 363 62 -482 -651 882 -196 -499 873 121 225 508 -718 34 -7 -107 -3 584 -4
3176 -4 450 365 -80 209 -4 378 -484 327 -365 -250 -585 169 299 -385 -336 -956 515 540 -70 162 -240
3197 -240 265 635 -244 251 181 122 -665 -116 -164 103 -343 679 -2 -628 42 -84 -301 284 -175 163 530
3218 530 332 -427 643 -540 -863 413 -332 -469 643 -336 -295 -289 -487 664 -990 -32 93 226 -337
3237 -337 -514 -648 -54 -802 -619 133 59 173 361 -106 480 763 -77 -139 -250 -108 175 -203 219 -588 -116
3258 -116 -258 31 431 -501 352 284 -199 767 157 3 117 -82 666 51 439 291 -1096 -374 576 -559
3278 -559 346 44 38 -42 -335 526 206 311 600 399 16 691 171 -513 657 -206 268 -179 14 745 16
3299 16 465 214 70 65 365 -2 -609 374 484 -208 135 182 347 -414 217 -395 -243 406 284 -776 663
$$ packed form
3157B98j67K32l01n44j69J533j078l03J372p52J04K83j226P52m1j00J04N87n88
3176dM54q5m45K89k13L82q62Q11o92J15l35P54J30o84M9o20J471K5o10K32m02
3197b40N05L70q79M95p0n9p87N49m8K67m46J022o81o26O70j26k17N85m59L38L67
3218E30j98p59J070j183l23J276p45j37J112r79M1Oj98J151j654R58J25J33n63
3237c37j77j34N94p48J83P52p4J14J88m67N86K83q40o2j11J42K83l78M22q07M72
3258a16j42K89M00r32Q53o8m83R66o10j54J14j99P48o15L88j48j387P22R50j135
3278e59R05l02oq0k93Q61l20J05K89k01l83O75n20o84J170q63M74m47J93P31p29
3299A6M49k51j44nL00l67o07R83J10o92L43M7J65p61O31o12J52O49j22j060J439
$$ plain form
3320 663 -195 976 -9 -722 -488 -398 -339 -276 30 319 -138 -208 -153 116 396 -95 188 -384 162 -147 109
3341 109 166 -39 248 47 284 287 272 -998 -1032 -379 757 57 737 387 -706 231 -285 160 -491 -621 -137
3362 -137 -20 153 -89 472 595 321 157 843 406 -204 55 -114 -523 169 121 -157 -59 -165 -45 4 -121
3383 -121 680 289 -177 -28 718 -212 791 -581 -474 431 -663 383 207 -688 -290 -117 -9 466 43
3402 43 286 360 -501 437 537 -813 -185 147 -16 -243 651 -91 -688 399 -108 615 415 -584 -432 -78
3422 -78 -227 317 67 -397 304 430 206 -326 1085 893 -891 -30 338 927 222 452 383 453 399 -546 191
3443 191 -158 273 478 770 239 -321 -563 964 61 49 112 -392 -312 232 164 -197 -110 -182 -221 -586 233 -631
3465 -631 195 -447 -365 671 -702 -47 -678 -141 409 -297 589 -417 569 -184 -614 873 166 -58 116
$$ packed form
3320F63q58J171r85p13K34R0N9O3L06K89m57p0N5K69K80m91K83n72N46l09K56
3341A09N7k05K87k01K37Lj5j270l4O53J136p00O80l50j093R37n16M45o51j30M84
3362a37J17J73k42N61J23k74j64O86m37o10K59j69m09O92m8k78R8j06J20M9j25
3383a21Q01l91m66J49P46r30J003j372J07R05j094J046j76q95L98J73J08M75m23
3402D3K43P4q61R38J00j350O28L32j63k27Q94p42n97J087n07P23k00r99J52L54
3422g8j49N44k50m64P01J26k24n32J411j92j784Q61L68N89p05K30o9P0n4r45P37
3443A91l49M31K05K92n31n60k42J527r03j2O3n04Q0N44o8l61Q7p2l9l65Q19q64
3465f31Q26o42Q2J036j373O55o31N37N50p06Q86j006R86p53m30J487p07k24J74
$$ plain form
3484 116 154 376 225 261 -1180 296 -218 269 26 59 150 25 624 525 -216 -68 543 -203 439 -600 -821
3505 -821 255 115 458 -172 -313 98 489 325 511 277 -568 -170 191 239 556 28 -564 280 449 -32
3525 -32 -170 -449 473 647 -249 -362 -234 57 -221 -79 141 -628 -275 -346 -13 569 -381 -287 389 58 -792
3546 -792 -390 155 -319 376 81 513 -273 188 -101 -676 -445 -138 585 369 -773 891 58 -66 453
3565 453 270 147 -126 -304 -338 101 -195 894 138 80 -482 96 -233 291 805 -5 -176 55 -611 838
3585 838 305 469 41 128 -600 -497 973 -178 -676 658 -230 431 -171 -1207 176 95 120 -285 -7
3604 -7 405 205 -213 166 -169 773 226 -287 169 -553 -92 -671 65 758 35 -5 123 140 -503 -318 548
3625 548 -161 -339 -100 39 -45 -333 -607 -349 -370 905 629 -519 562 -588 -244 -27 -582 46 -443
$$ packed form
3484A16L8K22j51L6j441J476n14M87k43L3R1j25N99r9p41J48O11p46O42j039k21
3505h21J076j40L43o30j41M11L91j64J86k34q45L98L61M8L17n28n92Q44J69m81
3525c2j38k79R22J74q96j13J28K91k78J42K20p69L53p1L33N82r50R4O76l31q50
3546g92M02N45m74O95k95M32p86M61k89n75K31L07P23k16j142J664q33j24N19
3565D53j83j23k73j78l4M39k96J089p56n8n62N78l29N24N14q10j71K31o66J449
3585H38n33J64m28Q7p28J03J470j151m98J334q88O61o02j036J383q1K5m05K78
3604gM12k00m18L79l35R42n47n13M56p22M61n79P36O93p23m0J28J7o43J85Q66
3625E48p09j78K39J39q4k88k74K58k1J275k76j148J081j150L44K17n55O28m89
$$ plain form
3644 -443 -161 -121 63 239 683 -159 -787 -391 196 295 -451 242 516 -657 -127 -52 285 -612 -91 -325 -580
3665 -580 -216 217 79 -656 -206 809 472 -173 -5 -430 285 420 695 -90 -407 -464 947 -204 -366
3684 -366 -48 -274 263 -386 566 -382 -594 286 64 80 -132 563 800 -187 45 -272 -389 -460 80 264 -270
3705 -270 -271 -87 65 127 82 191 -91 -178 204 -242 44 592 92 -40 -623 -360 -104 -614 -522 566 -320 -131
3727 -131 658 -446 263 349 -118 706 -285 -33 -246 255 62 1094 411 31 388 166 504 -480 -438 186
3747 186 35 173 219 -53 -138 -73 342 -521 -52 -534 -495 -721 8 120 124 -64 -98 76 166 -310 -1 -642 -445
3770 -445 -112 -223 -636 -228 229 157 -435 -438 129 -276 -425 -392 904 -277 593 71 1058 171 1 449 27
3791 27 -148 110 354 61 -52 -472 106 -130 -86 -329 -281 665 -389 -17 189 -152 -369 -522 503 162
$$ packed form
3644d43K82M0J84J76M44q42o28L96N87R9p46O93K74j173N30P5L37q97N21k34k55
3665e80L64M33j38p35M50J015l37o45J68m25P15J35K75p85l17n7J411j151j62
3684c66L18k26N37o49R52r48k12Q80k22J6k12O95K37r87K32l17j17p1N40J84n34
3705b70jJ84J52O2m5J09k82q7L82m46K86N48n00j32n83K63K56n10R2J088q86J89
3727a31P89j104P09Q6m67Q24r91K52k13N01j93J032o83l80L57k22L38r84M2O24
3747A86j51J38M6k72q5O5M15q63M69m82L9k26P29J12Mj88l4J74R0m76L09o41J97
3770d45L33j11m13M08M57p2n92lN67m05j49L3J296j181Q70n22R87q87j70M48m22
3791B7j75K58K44k93j13m20N78k36M4k43M8R46j054L72K06l41k17j53J025l41
$$ plain form
3811 162 -846 85 490 -1047 -525 727 -656 -741 -158 -32 -779 100 7 -218 -108 -318 -631 392 763
3830 763 -948 144 -524 -258 25 287 -487 -99 10 37 -194 498 134 -534 283 -115 -534 -98 831 517
3850 517 -481 60 147 -209 151 -241 458 -80 670 -359 -583 -312 437 44 67 1010 551 44 114 -299 -158
3871 -158 -161 843 285 -737 -113 -266 -897 345 -189 451 -22 -532 256 171 -308 -311 695 551 -128 -159 -831
3892 -831 -31 40 -268 361 550 -284 -623 309 -556 252 -49 -319 143 71 298 475 183 163 -1011 -742 181
3913 181 -137 484 -254 140 355 135 589 -41 -504 200 -238 -566 116 430 -485 -288 -238 -1022 -357 -279 -64
3934 -64 190 -373 -406 711 857 272 -186 -832 -527 594 -351 -129 227 -325 558 348 -184 -651 -53 57
3954 57 25 -267 -1 -65 -593 411 69 377 -93 -587 664 296 313 151 -28 -288 92 367 -153 250 163
$$ packed form
3811A62j008R31M05j537N22J252j383q5N83J26p47Q79r3k25J10k10l13J023L71
3830G63j711J092o68K66K83K62p74L88J09K7k31O92l64o68Q17l98m19M36R29l14
3850E17r98N41Q7l56L60l92O99n38P50j029k24K71P49l93K3R43m59n07P0m13J41
3871a58lJ004n58j022O24j53o31J242n34O40m73n10P88q5m79lJ006j44o79l1o72
3892h31Q00P1l08O29J89q34l39R32q65Q08l01k70M62p2K27J77k92k0j174K69R23
3913A81l18O21p38L94K15k20M54o30m63P04m38l28O82L14r15J97N0p84O65P8K15
3934f4K54n63l3J117J46n85m58o46L05J121r45K22L56n52Q83k10n32m67N98J10
3954E7l2k92K66o4n28J004l42L08m70m94J251l68J7j62j79k60L80K75n20M03q7
$$ plain form
3975 163 120 279 279 -323 738 -240 171 374 -14 184 -167 -700 548 290 43 -458 379 -385 -614 75
3995 75 586 1070 -148 -128 -358 -1077 180 -323 -725 551 232 -318 563 354 -160 573 -383 362 -282 -105
4015 -105 -185 429 958 400 -316 -35 39 -618 -537 305 549 934 -413 206 411 -213 216 -682 -312 349 -658
4036 -658 57 -196 -581 -541 691 134 -50 235 5 1164 51 -106 -1015 129 641 13 -882 -533 -131
4055 -131 385 -332 -102 223 -308 546 132 -557 -60 502 236 -326 388 294 -313 544 454 -759 -211 336
4075 336 -345 -238 895 6 -371 116 116 641 251 35 267 -325 -262 -17 -144 193 119 436 -526 178 -646
4096 -646 193 -529 -165 -137 -433 53 316 -266 71 -245 392 -616 -292 135 911 -70 313 30 -109 -494
4116 -494 322 429 110 93 -527 -181 303 -79 540 235 -13 389 0 -495 -94 -291 -482 -585 605 -209
$$ packed form
3975A63m3J59%o02J061r78M11K03l88J98l51n33J248k58k47n01Q37p64k29O89
3995G5N11M84j218K0k30p19J257n03m02J276l19n50Q81k09n14P33r56P45o44J77
4015a05q0O14N29n58p16K81P4o57Q1Q42K44L85j347O19K05o24M29q98L70O61j007
4036f58P15k53l85M0J232n57j84K85k30J159j113j57r09J144N12o28q95L49M02
4055a31N16p17K30L25n31Q54m14o89M97N62k66n62P14r4o07Q57r0j213N48N47
4075C36o81J07J133q89l77M87%N25l90k16K32n92O3K45j27L37p4L17r62P04q24
4096f46Q39p22L64K8k96M86K63n82L37l16O37j008L24M27P76r81L83k83j39l85
4116d94Q16J07l19j7o20L46M84l82O19l05k48M02l89m95M01j97j91j03J190q14
$$ plain form
4136 -209 -163 520 368 -403 284 98 -74 -327 -430 -521 272 -1 373 534 -89 250 -498 -509 148 180 940
4157 940 317 -592 436 -26 530 341 -548 -434 -914 109 596 8 -994 -292 490 426 -120 127 -70
4176 -70 118 108 101 -451 801 -217 -570 26 530 -78 -481 277 -127 255 -492 -466 430 43 -64 -380 344
4197 344 -685 -130 346 1196 100 224 417 -2 -554 -310 514 -471 170 -332 -346 -397 683 47 -192 398
4217 398 -775 435 -114 -50 -11 -9 -66 259 1447 1011 -697 -10 189 -76 557 -437 -350 -238 73 382 -473
4238 -473 318 -188 49 16 24 264 149 -63 -750 -20 -182 512 101 375 -421 691 165 -4 -526 -22 -633
4259 -633 832 623 218 -575 -518 125 -326 411 -198 -213 -360 -160 45 451 -49 241 131 -278 -96 294
4279 294 -43 -154 296 319 227 -40 -430 -145 174 480 547 -499 -301 -270 346 -66 -133 189 551 765 177
$$ packed form
4136b09M6O83j52p71O87j86j72k53j03r1P93k73L74J61o23L39p48j1O57L2P60
4157I40o23r09J028m62N56j89q89J14m80J023M87n88j002P02P82o4n46K47j97
4176g0J88j0pn52J252j018l53N96N04o08m03P58m04L82p47K6Q96l87j07l16P24
4197C44j029N55M76Q50j096J24J93m19n52K44Q24r85O41n02j4n1J080o36k39N90
4217C98j173J210n49O4L9Kn7L25J188m36j708O87J99k65O33r94Q7J12L11L09q55
4238d73P91n06K37l3QK40j15k12o87P30j62O94m11K74p96J112n26j69n22N04o11
4259f33J465k09m05p93N7O43m51P37o09j5j47K00K05M06n00K90j10m09J82L90
4279B94l37j11M50K3r2k67l90K85L19L06O7j046J98L1O16m12o7L22L62K14n88
$$ plain form
4300 177 -234 -157 225 -399 -689 291 -8 529 -420 322 -100 702 -686 371 -313 -30 -476 491 1100 -234
4320 -234 51 418 -384 -637 121 75 794 176 -90 16 -148 65 -113 -51 -886 -457 -457 -393 9 -283 73 -653
4342 -653 -171 76 -285 147 241 -151 72 157 920 -498 -537 540 516 76 215 339 740 149 -31 408 -745
4363 -745 95 -754 -104 -82 -361 -19 1196 899 423 -682 472 600 -3 93 -129 -207 -181 443 -874 139
4383 139 -145 40 42 -238 -20 -174 -207 -638 -308 340 -37 303 211 -544 365 105 -863 731 -14 -169 30
4404 30 -323 -409 495 19 193 290 165 -239 -18 294 -236 -13 -320 279 -390 23 -364 -353 -623 216 -553
4425 -553 -182 264 500 -37 714 238 -45 -73 137 -147 73 -208 -218 -57 -296 -419 -70 221 -38 -499 -457
4446 -457 918 580 239 274 5 -112 784 371 -61 638 -533 -352 -302 180 524 -135 -110 178 -364 5
$$ packed form
4300A77m11P7L82o24k90R80k99N37r49P42m22Q02j388J057o84K83m46R67O09j334
4320b34K85L67q02k53P58m6P19o18k66J06j64K13j78O2q35M29%O4M02k92L56p26
4342f53M82K47l61M32R4l92K23Q5P63j418l9J077k4m40J39J24M01n91j80M39j153
4363g45Q40q49O50K2k79L42J215k97m76j105J154J28o03R6k22p8K6O24j317J013
4383A39k84J85Kk80K18j54l3m31L30O48l77L40r2p55R09k60r68J594p45j55J99
4404C0l53q6R04m76J74R7j25m04K21L12n30K23l07N99o69M13l87J1k70Q39p69
4425e53L71M46K36n37P51m76k83k8K10k84K20k81j0J61k39j23L49K91k59m61M2
4446d57J375l38l41L5k69j17Q96m13m32O99j171J81N0M82L44o59K5K88n42L69
$$ plain form
4466 5 -439 -403 194 -87 351 -195 349 -548 -574 441 -26 133 -305 -38 658 -552 -376 206 -102 291 304
4487 304 -243 -306 276 -456 -258 -376 502 -442 -182 -38 540 -1087 -666 -306 -353 445 318 317 -234 743 -664
4508 -664 222 218 -3 -115 126 -608 291 566 123 527 163 42 46 772 -760 834 -313 -865 118 -666
4528 -666 -495 -590 304 412 -311 39 252 -66 -227 137 233 -103 38 245 -503 -325 -92 -416 339 46 -81
4549 -81 -604 273 -529 100 -248 480 -153 467 474 58 -243 -203 -513 -179 -23 -587 -335 79 -111 -519 -756
4570 -756 -454 0 -206 -45 -135 319 -460 -74 469 198 156 -62 -769 -59 -226 309 287 266 646 57 -746
4591 -746 -157 344 -12 343 -230 399 -103 84 -178 -262 -372 175 75 634 296 430 53 334 341 -193 -98
4612 -98 -76 -363 229 389 435 169 130 -459 367 -68 127 -787 12 -207 132 -390 324 148 -98 183 -70
$$ packed form
4466Em44L6N97k81M38n46N44q97k6J015m67J59m38K67O96j210J76N82l08L93J3
4487C04n47o3N82p32J98j18Q78r44K60J44N78j627M21L60m7P98j27jn51R77j407
4508f64Q86mk21j12K41p34Q99K75m43M04l64j21MP26j532J594j147n52R83p84
4528f66J71r5Q94J08p23L50K13l18j61L64R6l36J41K07p48J78K33l24P55k93j27
4549h1n23Q77q02O29l48P28o33O20Pm16l01M0l10L34J56n64K52M14j90m08k37
4570g56L02M54k06J61r0M54p79L86N43k71m2k18p07P10j67N35k2k1L80n89q03
4591g46N89N01l56L55n73O29n02J87k62q4j10N47j00N59l38J34l77K81Pn34R5
4612i8K2k87N92J60M6k66l9n89Q26m35J95r14P99k19L39n22P14j76k46K81k53
$$ plain form
4633 -70 210 -1004 -119 -146 -167 -798 196 6 403 -281 -468 -645 -176 58 94 191 -391 -16 -47 271 -1176
4654 -1176 215 -186 -492 -9 364 386 -1221 -8 -90 699 161 332 132 -23 -42 -523 184 -643 -485 -284
4674 -284 115 -2 610 929 472 48 485 128 -281 -306 6 -826 -237 -626 597 -609 -663 87 10 921
4694 921 -576 203 -47 -175 298 203 557 452 414 226 -300 -260 257 -11 236 556 253 -310 -413 200 62
4715 62 236 -252 -47 351 157 -451 142 665 607 415 -398 -45 -155 543 162 723 109 -369 -600 -90 -531
4736 -531 370 692 -128 116 78 133 -169 -259 299 -90 699 -1 -916 254 73 -97 -560 13 661 253 -25
4757 -25 77 111 -46 569 619 32 318 362 164 -399 929 381 455 85 -50 85 24 149 400 287 -384 -138
4779 -138 580 605 -329 -458 -494 -106 -95 -275 -299 184 106 -222 -454 97 -734 -212 657 407 -653 -339 -226
$$ packed form
4633g0K80j214Q85k7k1o31R94j90L97o84j87j77M69K34L6R7n82L75l1L18j447
4654a176J391m01l06M83L73K2j607J213q2P89n38J71k00j55j9m81P07q27J58K01
4674b84L99j17O12L19m57m24M37l57m09k5L12q32N89l89J223j206n4P50p7R11
4694I21j497P79k50j28M73r5L54j05l8j88n26M0N17k68K47L20l03n63j03O13j38
4715F2J74m88K05L98j94o08N93N23n8j92q13L53j10O98l81N61o14m78k31N10m41
4736e31R01L22q20K44l8N5l02r0N58l89P89p00r15J170j81j70m63N73O48m08k78
4757b5J02L4j57O15N0n87K86M4j98n63J328n48P4l70j35J35o1J25K51j13o71K46
4779a38P18K5r34j29l6L88J1j80k4M83p8l28k32N51q31N22Q69k50j060L14J13
$$ plain form
4800 -226 -552 -764 -462 -228 214 -438 114 2 740 -448 -530 278 -461 1073 146 -426 231 14 -109 -25
4820 -25 9 153 -78 -174 -48 -356 -125 -399 676 -401 -708 -218 -284 324 -577 81 64 512 260 102 2
4841 2 423 209 -174 -436 -194 679 209 -157 113 512 160 297 91 -644 365 624 142 -201 56 423
4861 423 -410 -596 478 -271 -635 -243 -363 -981 609 110 -168 -120 -124 36 64 -163 -173 60 -82 -52 299
4882 299 340 69 -153 525 64 287 494 731 1087 -634 504 111 225 -919 -479 -774 -194 88 -1031
4901 -1031 18 125 772 721 195 910 -377 -63 -54 -518 624 743 414 -91 433 -312 116 206 955 -543
4921 -543 -521 560 -7 436 146 -56 -52 -675 -67 187 101 56 338 452 -80 309 4 151 128 -128 -209 -9
4943 -9 -743 105 195 -387 514 229 294 -553 -737 429 -176 -324 316 783 -53 247 174 373 128 -504 452
$$ packed form
4800b26l26k12L02K34M42o52N52j12P38j188q2Q08p39J534r27n72O57k17j23Q4
4820b5L4J44k31r6J26l08K31k74J075j077l07M90o6O08r01O58j7M48k52j58j00
4841BM21k14l83k62K42Q73m70l66K70L99l52J37k06p35J009K59m82l43K57L67
4861D23q33j86J074p49l64L92j20o18J590m99k78M8mJ60K8k27j0K33j42L0L51
4882B99M1k71k22O78m61K23K07K37L56j721J138l93J14j144M40k95N80K82j119
4901a031J049J07O47n1n26P15j287L14Rm64J142J19l29n05N24p45M28R0P49j498
4921e43K2J081n67M43k90k02Mo23O08K54q6m5K82J14n32L89l05J47k3k56q1K00
4943ip34Q48R0n82R01k85O5q47j84J166o05j48O40M67q36L00p3J99k45o32R56
$$ plain form
4964 452 474 -777 -326 817 80 -102 -1 -115 295 -165 -273 546 -735 285 592 749 493 1076 206
4983 206 187 -1110 -282 -101 -154 -577 -743 128 132 -720 463 -416 -671 -576 -582 972 -644 549 398 -750
5003 -750 -296 -328 139 347 505 -161 88 17 -362 292 -338 459 293 -258 -240 430 225 -384 78 192 -86
5024 -86 5 -939 568 -118 -681 698 -220 743 536 678 -226 11 232 297 -976 -188 162 -325 60 498
5044 498 -822 -119 -236 499 128 308 -83 291 391 -694 385 -393 610 -95 -308 462 -399 95 297
5063 297 -48 -176 -193 -339 329 232 -8 328 -562 -133 710 573 30 145 833 -206 -447 -535 -582 -279 205
5084 205 0 341 103 1006 -546 -171 271 300 318 216 358 31 -179 -253 711 -889 -28 -116 -6 -978 607
5105 607 180 431 748 216 -562 -32 313 -156 -506 481 -687 408 -580 -147 233 75 -402 -663 351
$$ packed form
4964D52K2j251M51J143p37j82J01j14M10m60j08Q19j281J020L07J57k56N83q70
4983B06j9j297Q28J81n3m23j66Q71Mq52J183q79k55R5oJ554j616J193j51j148
5003g50M54l2M67K08J58o66K49p1l79O54o30P97j66n51J8O70k05o09M62J14k78
5024h6R1r44J507o86n63J379r18R63k07J42r04K37K21O5j273P88L50m87L85M38
5044D98j320P03j17P35l71J80l91L74J00j085J079p78J003p05k13P70q61M94K02
5063B97l45j28j7j46O68r7k40L36q90M29Q43j37n43J15O88j039k41q8m7L03M84
5084B05k05L41k38R03j552L75M42K9J8j02J42l27k10p4R64j600Q61q8J10r72J585
5105F07m27K51L17n32p78N30L45m69l50R87j168J095r88M33L80j58m77k61J014
$$ plain form
5124 351 866 117 -147 608 -332 -33 48 -356 5 26 -454 -137 -895 411 -406 250 -564 -47 -217 -148 110
5145 110 259 18 188 220 17 -152 -50 961 221 -39 -44 213 113 374 -184 134 111 -363 -370 127 -430 68
5167 68 85 -93 71 464 -108 -153 85 -418 300 -559 -814 397 584 -47 521 -155 447 -606 -449 -324
5187 -324 359 278 -708 91 202 -374 -922 118 402 -333 -589 -530 523 -914 168 -348 -445 -47 -294 -247
5207 -247 18 -215 -367 534 -253 -277 206 -643 519 788 65 -427 202 -372 -360 -123 -115 -1063 329 381 700
5228 700 719 202 -37 -255 615 -92 271 -222 67 176 -598 255 -87 99 -467 -367 -293 25 -260 256 -587
5249 -587 -160 103 -399 285 697 277 794 145 -20 -670 122 -54 -331 157 9 -789 -397 253 302 653
5269 653 658 -682 253 35 -476 300 -414 -544 592 336 -104 159 565 53 442 408 558 -13 -636 -111
$$ packed form
5124C51N15p49k64P55r40K99Q1m04L61K1m80L17p58J306q17O56q14N17j70O9K58
5145A10J49k41J70L2k03j69J02J011p40k60nK57j00K61n58L18k3m74pM97n57M98
5167F8J7j78J64L93n72m5K38n03P18q59k55J211J87o31N68o76O02j053J57J25
5187c24O83q1r86P99J11n76n48J040K84p35k56N9J053j437J082n16r7L98k47M7
5207b47K65k33j52R01p87k4M83q49J162K69p23m92O29n74J2K37Qr48J392N2L19
5228G00J9n17k39k18Q70p07L63m93K89J09p74Q53l42J86n66J00P4L18k85N16q43
5249e87M27K63n02O84M12m20N17o49j65o50P92j76k77M88j48p98L92O50M9L51
5269F53Nj340R35k18n11P76p14j30J136k56m40K63M06n12L89l4J50n71o23N25
$$ plain form
5289 -111 192 1089 42 -13 567 479 -77 -63 -219 82 -470 -115 386 -323 503 349 -279 -109 -1288 112
5309 112 -222 58 -175 -9 425 355 -515 708 -735 -906 246 263 683 -480 -51 -95 -891 338 -10
5328 -10 -735 223 -254 690 134 -8 232 -235 -687 661 407 -568 -60 -590 159 264 -701 -175 511 406
5348 406 100 311 814 -645 457 263 -372 312 -215 -51 -57 38 -839 -405 162 -425 837 245 544 598
5368 598 682 60 3 150 -51 335 -404 499 50 227 -13 -97 -513 61 381 150 54 -88 534 -1306 432
5389 432 -164 -336 -792 203 -462 97 -404 -10 114 -949 -188 -211 -559 290 563 -610 367 350 -94 -27
5409 -27 932 -565 -357 209 317 -819 -71 363 117 -593 -61 97 -139 -92 768 -362 -628 -108 166 286
5429 286 -40 -147 714 -220 -924 -664 216 276 -989 -282 67 273 -90 146 395 40 478 280 121 -166
$$ packed form
5289a11L03Q97j047n5N80q8n56J4j56L01n52L55N01p09Q26j54o28J70j179J400
5309A12l34K80k33J66M34p0q70J223j443j71J152J7M20j163M29m4p96J229l48
5328a0p25R58m77R44n56j42K40m67m52J348k54r75N08n30P49J05r65N26O86j05
5348D06l06K11N03j459J102j94o35O84n27J64oR5q77M34N67n87J262n92K99N4
5368E98Q4o22n7J47k01L86p39R03m49J77k40q4m16N74L20k31r6j42O22j840J738
5389D32n96j72m56R95o65N59n01L94J24j063P61k3l48Q49K73j173R77j7m44O7
5409b7R59j497K08N66J08j136P48M34k46p10N32J58k36M7Q60j130k66N20K74J20
5429B86l26j07Q61r34p04K60Q80O0j265P07L49K06l63K36K49l55M38j98j59k87
$$ plain form
5449 -166 444 63 -413 -154 918 462 -36 -391 -339 -243 -146 339 -342 227 -396 -231 650 -220 597 644 291
5470 291 399 115 86 25 283 -265 -269 -175 -71 956 -193 -532 859 -906 159 539 -6 563 746 -861
5490 -861 20 -361 -156 228 369 783 -218 57 94 259 272 385 114 450 -206 159 -632 -242 -254 204 278
5511 278 385 -478 -232 -412 101 350 285 581 469 163 -421 483 -994 85 996 11 68 -717 -913 -425
5531 -425 1115 368 -428 21 1070 374 -102 769 -157 -146 265 384 479 53 275 -774 315 349 -132 159
5551 159 -87 117 174 153 238 257 -192 -535 -348 396 -363 643 769 -383 -564 -109 -606 -461 105 443 267
5572 267 11 538 -300 -294 154 177 73 -298 166 288 -618 -201 -375 560 247 -4 -323 709 416 -237 -136
5593 -136 -313 -489 -644 -365 152 91 639 180 -525 -1 -544 48 399 241 165 219 112 -213 543 158 741
$$ packed form
5449a66O10l81m76K59J072m56m98l55N2R6R7M85o81N69o23J65Q81q70Q17M7l53
5470B91J08k84k9o1K58n48mR4J04J027j149l39J391j765J065L80n45N69J83j607
5490h61Q81l81K05L84J41M14j001K75L7J65J3J13k71L36o56L65p91L90j2M58P4
5511B78J07q63K46j80N13K49o5K96j12l06n84R04j477J079R11r85N7p85j96M88
5531d25J540p47p96M49J049o96m76Q71r26J1M11J19R5m26K22j049J089L4m81K91
5551A59k46K04N7k1Q5J9m49l43J87P44p59J006J26j152j81M55m97J45N66L38j76
5572B67k56N27q38OM48K3j04l71M64J22r06M17j74R35l13k51l19J032k93o53J01
5593a36j77j76j55K79N17o1N48m59p05N24n43N92L51j58p6N4j07l25P56l85N83
$$ plain form
5614 741 508 -1146 -453 -247 -167 -444 101 241 -95 -262 487 -62 -815 -302 490 383 -144 421 -612 -333
5634 -333 -269 350 254 488 50 -132 644 662 -479 -410 644 -172 658 704 -89 296 371 -450 138 -329 -322 95
5656 95 1026 -274 -547 -118 559 685 499 457 -577 -349 -1013 -307 -38 -827 541 58 603 434 241 453
5676 453 -237 237 652 -295 558 -73 -117 -171 -823 167 169 144 -279 -575 -224 412 7 -235 7 -233 -217 568
5698 568 443 -252 154 -408 -187 154 -167 -946 560 -21 76 120 -437 43 -210 -20 -196 748 -672 624
5718 624 -688 28 -839 67 -564 487 -122 -303 212 200 464 -377 -507 -105 -113 -141 17 199 389 -54 -177
5739 -177 -162 190 -106 137 -577 83 -81 192 134 -149 -798 363 -768 -240 262 471 248 988 -410 -310
5759 -310 118 -52 158 581 -488 245 360 -526 248 -19 280 -410 -217 992 -141 318 646 215 -143
$$ packed form
5614G41k33j654O93K06Q0k77N45J40l36j67P49n49p53N13P92j07n27N65j033K79
5634c33O4O19r6K34m38j82P76J8j141O9J054q16Q30M6p93L85P5q21N88m67PM17
5656I5R31j300k73M29O77J26j86m2j034K28o64P06K69p89J368m83N45j69j93K12
5676D53o90M74M15r47Q53o31m4n4o52R90Kk5m23k96L51O36m05k42K42k40J6P85
5698E68j25o95M06n62K21L41l21p79J506n81R7M4n57M80k53J90j76R44j420J296
5718F24j312P16q67R06o31J051o09j81N15j2K64q41j30M02qk8J58J82J90m43j23
5739a77J5L52k96K43p14O60j64K73n8k83o49J161j131N28N02K09k23P40j398J00
5759c10M28j70K10M23j069P33J15q86P74k67K99o90J93J209j133M59L28m31l58
$$ plain form
5778 -143 104 29 289 1052 176 -333 -546 -167 -150 114 -276 663 -176 -512 364 -419 -946 58 -260 649
5798 649 368 39 -152 -5 -134 -53 -63 155 -35 156 389 370 26 75 -242 -118 -65 66 -383 298 19 454
5820 454 -351 -26 -826 -18 -274 -204 -691 -241 -201 332 54 -716 216 -127 23 -168 120 -516 -920 -100 430
5841 430 72 -57 -130 -137 -103 -306 -54 -962 898 -151 112 -125 16 731 -166 469 56 -38 -12 -381 27
5862 27 -338 296 426 597 236 95 -447 103 -250 -369 -511 392 276 -102 81 697 -246 144 -397 -384 149
5883 149 384 -696 163 126 -537 342 -198 551 -482 568 -89 -427 126 -276 -60 188 295 -450 551
5902 551 -47 109 -155 -514 -464 -601 -182 -838 713 292 140 480 76 -355 330 -165 534 509 243 -690
5922 -690 -111 -596 -57 327 -94 -26 -488 75 -350 49 270 -659 -330 465 238 -95 -345 -748 -497 -55
$$ packed form
5778a43K47p5K60P63q76n09k13L79J7K64l90R39q39l36Q76p83n27J004l18R09
5798F49k81l29j91J47j29Q1j0K18j90J91K33j9l44M9l17J24N3J31m49O81k79M35
5820D54q05L25q00Q08k56P0m87M50M0N33k78p70R32l43J50j91K88o36m04Q20N30
5841D30l58j29p3pL4k03K52r08J860j049K63k37J41P15q97O35m13r4K6l69M08
5862B7l65O34J30J71l61j41n42N50l53j19j42R03j16l78J83O16r43L90n41J3N33
5883A49K35j080Q59l7o63Q79n40P49j033J050o57l38N53m02K16K48J07p45J001
5902E51n98J56k64l59N0j37M19o56J551m21j52L40m04m31O85m95O99k5k66r33
5922f90N79m85N39L84m21O8m62N63m25L99K21r29L29P95k27l33k50m03K51M42
$$ plain form
5942 -55 -445 -185 516 -335 -191 713 327 284 -162 177 332 -4 -810 150 -551 -352 65 262 -503 -251 -442
5963 -442 249 -95 -226 541 -24 -705 342 -317 71 469 -151 -788 599 872 51 1001 590 -756 -364
5982 -364 -728 -144 -510 -568 895 19 745 -369 -246 -872 635 165 -396 -299 82 7 -182 501 -236 211
6002 211 -66 -268 59 415 329 963 318 -10 -197 881 1 -124 -576 -129 271 -55 144 40 -486 -8
6022 -8 -4 340 -566 -757 -742 103 -998 208 -215 -514 401 -353 -785 -105 -228 179 -244 -44 -747 -628 -475
6043 -475 36 -611 -588 -1157 -164 110 -80 -492 -471 -396 -318 -126 643 -202 -272 180 -6 -147 233 405 283 159
6065 159 -150 520 -359 -85 -316 350 -698 -399 -14 -72 216 -820 -198 243 -257 133 -320 -273 -8 -361
6085 -361 554 -82 -308 -252 660 372 927 478 -127 -492 24 11 -157 -394 4 -480 438 68 -153 -893 -440
$$ packed form
5942e5l90K60P01q51J44R04l86m3m46L39J55l36q06R60p01J99M17J97p65K52j91
5963d42O91l44j31P67n65o81J047o59L88L98o20o37J387K73q21R50m11j346L92
5982c64l64N84l66n8J463q76P26j114J23o26J507m70n61R7L81p5j89O83p37M47
6002B11k77k02L27L56q6O34o45l28j87J078q80j25m52M47M00l26J99j04n26M78
6022hML44r06j91J5Q45j101J206m23k99R15p54m32O80j23M07m23K00p03J19J53
6043d75N11o47K3n69R93K74j90m12K1P5P8J92P69q45p0M52j86j41L80J72j22j24
6065A59l09O70q79K74k31O66j048K99L85n8K88j036O22M41n00L90m53M7K65l53
6085c61R15o36k26N6R12k88N55m49o05l65N16j3j68k37L98m84R18l70k21p40M53
$$ plain form
6106 -440 137 -152 -281 329 -242 -282 -423 92 -205 -600 137 -108 204 219 100 1103 -187 169 663 -430
6126 -430 301 -129 223 818 -446 -341 -455 -432 1065 -102 564 -256 -72 1070 -634 279 279 -13 455
6145 455 80 146 537 344 28 905 -136 -96 901 335 -266 -360 -501 -465 325 128 169 -658 -690 -182 -901 -12
6167 -12 265 -771 -42 -506 -257 -482 -321 733 295 847 -281 -333 277 -12 -859 26 230 198 -257 -591
6187 -591 -296 152 -32 -83 -271 -547 -387 395 -322 78 329 -303 249 44 -184 211 357 459 -868 287
6207 287 399 581 -20 -462 50 -293 337 68 209 -512 -771 538 183 123 -547 65 -288 165 -277 -161
6227 -161 -245 -876 659 -411 649 -246 -95 316 -800 426 899 526 -406 -35 -59 -44 -193 42 494
6246 494 -258 309 -413 -506 -47 687 236 -206 346 312 372 218 -481 242 -335 520 395 -307 -371 -385 -1105 -554
$$ packed form
6106d40N77k89j29O10n71m0j41N15k97l95P37k45L12J5j19J003j290L56M94j093
6126d30P31m30L52N95j264J05j14K3J497j167O66q20J84J142j704R13%k92M68
6145D55l75O6L91j93l16Q77j041M0R97n66o01r4j41L6P90j97M1q27l2N08p19Q89
6167a2K77j036P29m64K49k25J61J054m38N52j128n2O10k89q47Q85K04l2m55l34
6187e91K95M48j84n1j88k76J60P82p17M00K51o32N52k05k28L95J46J02j327J155
6207B87J12J82o01m42N12l43O30k69J41p21k59J309l55o0o70O12l53M53m42J16
6227a61q4o31J535j070J060q95J51M11j116J226M73l73r32L71k4J5j49K35M52
6246D94p52N67p22r3M59P34m51m42N52l4O0j54o99P23n77Q55j25p02o4j4p20N51
$$ plain form
6268 -554 59 -201 -182 97 138 -337 75 314 -525 -641 -560 -947 19 -510 197 -762 384 13 142 640 -61
6289 -61 -7 275 100 -293 -21 -240 -10 -591 -648 -304 -408 -285 258 -649 -347 146 207 77 -876 -295 -360 -343
6311 -343 303 -16 250 -83 161 -312 -163 1 724 294 -405 36 491 373 -13 -278 -544 415 26 -49
6331 -49 -772 853 517 -244 140 -327 114 80 649 265 -883 -60 189 -642 166 -414 100 -27 10 -751
6351 -751 -185 -25 -361 159 243 -375 1 168 305 418 562 106 -353 -354 225 -331 -389 376 256 92 -483
6372 -483 591 683 87 -277 -211 -276 175 125 541 -61 1 -100 51 -329 797 -124 -23 40 -91 492 238
6393 238 -8 627 192 43 -581 -107 -826 96 522 -681 195 259 848 25 -21 -116 -316 -78 280 423 363
6414 363 160 585 544 -192 -554 148 71 -315 22 106 311 651 -552 -137 -44 -100 17 -358 -699 382 -438
$$ packed form
6268e54O13k60J9K79M1m75M12K39q39j16Q1l87R66n29P07r59J146l71J29M98p01
6289f1N4K82j75l93K72k19K30n81n7L44j04J23N43r07L02M93O1j30r53N81o5J7
6311c43O46l19K66l33K44m73J49J64P23m30o99M41M55j18l86k65k66R59l89p5
6331d9p23J625l36p61L84m67M41l4N69l84j148Q23K49q31Q08n80N14j27L7p61
6351g51N66J60l36N20Q4o18L76J67J37J13J44m56m59jN79n56n8P65j20j64n75
6372d83J074R2n96l64O6o5M51n0M16o02O2j01J51l80J126r21J01O3j31N83k54
6393B38k46O35m35j49o24M74p19R22M26j203Q76O4N89q23m6r5k00K38L58J43o0
6414C63k03M25m1p36l62P02p7l86L37Q4K05L40j203M15R3n6J17l75l41J081q20
$$ plain form
6435 -438 -237 -565 336 -166 -415 200 58 370 -420 447 117 56 -62 342 692 65 300 314 -146 708 376
6456 376 -34 0 481 -738 -392 715 535 95 269 82 446 346 112 -51 -241 -735 283 -222 16
6475 16 616 577 -83 -95 -61 199 -151 200 -306 477 297 -124 212 219 35 1098 377 240 24 -11 211 107
6497 107 334 -84 496 531 -107 677 332 116 58 -688 -235 -262 -53 243 84 160 -247 524 566 198 -425 -211
6519 -211 87 548 722 -458 -282 136 -304 978 -14 -963 -604 -253 -207 -490 -506 335 -384 243 -168 395
6539 395 -78 -132 527 -478 -253 84 -483 -291 -426 779 -373 138 -886 -62 648 217 596 84 -113
6558 -113 -309 -328 475 381 -386 0 -365 443 -138 187 -490 486 -637 403 296 -992 578 318 420
6577 420 199 -279 -34 -460 305 560 -756 -1 -552 355 -480 -59 230 15 -159 -258 -400 -334 49 866
$$ packed form
6435d38K01l28R01n02k49O15j42L12p90Q67l30o1j18M04L50o27K35J4m60Q54l32
6456C76m10L4M81j219L46J107j80m40J74j87L64j00k34j63j90m94J018n05K38
6475A6O00l9o60j2L4K60l50L51n06P83j80m21L36Pj84J063p21j37k16l5K22j04
6497A07K27m18N80L5o38P84l45k16n8p46M53k7K09K96j59P6m07P71M2l68o23K14
6519b11K98M61J74j180J76M18m40J282r92r49L59L51M6k83j6Q41p19O27m11N63
6539C95m73n4O59j005K25L37n67J92j35J205j152N11j024Q24P10m31L79n12j97
6558a13j96j9Q03r4p67L86l65Q08n81L25o77R76j123J040j07j288J570k60J02
6577D20k21m78K45m26P65K55j316P55n51R07q35M21K89k15j74r9j42O6L83Q17
$$ plain form
6597 866 -264 383 456 -525 -261 97 -277 175 109 103 -311 -178 -809 84 -42 162 776 206 -365 32 172
6618 172 88 255 -437 816 566 364 -220 -370 776 -331 493 368 -214 -345 617 677 -433 190 -295
6637 -295 370 -63 724 -395 787 -50 -577 -876 189 -270 -313 -135 -17 731 -761 -91 771 -308 -230
6656 -230 41 697 -127 559 828 -272 896 623 117 -410 -1064 -74 -241 -644 315 -333 -637 -160 671
6675 671 -18 366 -200 216 957 -303 -150 -142 -574 -341 -301 40 52 231 148 424 169 -650 204 -872 722
6696 722 -515 141 645 -201 84 496 -110 -122 1109 27 569 -137 -204 483 -356 400 654 244 190 -299
6716 -299 526 13 -663 198 -40 -813 -1006 -287 83 32 -341 -278 -781 325 -290 -123 433 256 -122 645
6736 645 234 -43 494 1119 135 -631 416 20 129 985 -546 -133 -670 -360 -214 -202 181 655 464 -147
$$ packed form
6597H66j130O47P3r81K64L58l74M52o6om14J33o31Q93j26K04O14n70n71L97J40
6618A72q4J67o92J253k50k02n84j50J146j107Q24j25n82j31R62O0j110O23m85
6637b95O65m33P87j119J182q37n27k99J065m59m3J78J18P48j492O70Q62j079P8
6656b30K71O56q24O86K69j100J168k73n06n27o54R90j67m03R59o48l04M77Q31
6675F71o89L84n66M16P41j260J53Qm32K33M0L41J2J79q3K76k55q19Q54j076J594
6696G22j237O56N04q46K85M12o06j2J231j082N42p06o7O87q39P56K54m10n4m89
6716b99Q25n13o76Q61k38p73j93P19L70n1l73O3n03J106o15J67N56j77l78P67
6736F45m11k77N37O25r84p66J047l96J09Q56j531M13n37L10J46J2L83M74j91o11
$$ plain form
6756 -147 233 32 332 23 443 -341 -75 2 465 297 -485 93 954 -8 808 -393 -1174 445 68 283
6776 283 -871 360 489 -2 329 1091 -141 -266 -501 -178 -764 35 180 -267 -673 147 85 -191 -344
6795 -344 535 -644 -349 160 -289 -725 554 406 306 116 127 333 -761 98 121 -765 720 -603 285
6814 285 174 647 546 -850 686 -43 -536 323 -39 -192 -451 -7 242 -171 105 180 190 508 252 -99
6834 -99 68 695 -210 -502 -431 -219 -166 -553 456 -807 162 -20 -94 379 -249 61 210 -74 157 -627 218
6855 218 322 -617 239 241 -369 343 -143 -189 -204 -33 113 -282 52 -243 -184 421 -445 63 -72 503 -372 696
6877 696 -9 -106 -68 65 -11 -104 -162 -42 340 533 182 -1030 111 256 604 29 -644 -453 445 139 395
6898 395 230 -46 -133 -531 -237 -781 316 697 -843 135 -68 -1155 9 -673 -323 61 3 194 194 487
$$ packed form
6756a47L80k01L00l09M20p84K66P7M63j68p82N78Q61r62Q16j201p81J619l77K15
6776B83j154J231J29m91L31P62j232j25k35L23n86P99J45m47m06Q20o2k76j53
6795c44Q79j179K95N09m49m36J279j48j00j90J1K06j094Q59K3q86J485j323Q88
6814B85j11M73j01j396J536p29m93Q59l62j53k59M44K49m13K76P5J0L18k56l51
6834i9J67O27r05k92P1K12N3l87J009j263R69j82p4M73o28L10J49k84K31p84Q45
6855B18J04r39Q56Ko10P12m86m6j5J71J46l95L34k95N9O05q66N08j35N75q75J068
6877F96p05r7L8J33p6r3n8J20L82J93l51j212J141J45L48n75o73J91Q98l06K56
6898C95j65k76q7l98K94n44J097L81j540R78k03j087J164o82L50L84n8J91%K93
$$ plain form
6918 487 -291 35 -186 -112 87 25 -239 -79 63 544 -118 547 82 240 310 581 259 322 -510 -322 468
6939 468 -185 575 -183 -27 537 193 -55 19 -461 -189 276 -503 658 926 -403 -794 61 -29 -1155 -34
6959 -34 -497 198 -336 -522 261 653 357 476 -203 172 401 69 1324 734 -209 228 688 -543 -186 -485
6979 -485 2 -88 -158 -311 -226 346 346 -460 -404 15 -395 412 106 401 -162 84 237 -847 87 407 -37 128
7001 128 -58 -464 -272 -386 434 -49 178 853 139 -164 -176 318 103 119 15 -254 336 -101 -383 330 448
7022 448 -143 243 321 -172 89 -637 -621 -1062 349 -357 137 52 -588 308 481 60 -253 -141 515 -151 -111
7043 -111 -118 252 -157 -422 -286 400 -226 -291 -305 336 -367 112 -371 872 -92 -177 -421 -594 -158 -142 477 263
7065 263 -501 270 -153 -850 258 56 170 -805 -419 -256 -171 16 56 40 489 -162 -189 275 199 229 594 -102
$$ packed form
6918D87p78L26k21P4J99o2k64J60J42M81o62O65m65J58P0K71l22O3q32J88P90
6939D68o53P60p58J56N64l44k48P4m80K72M65p79J161K68j329l91Q55r0j126J121
6959c4m63O95n34j86P83L92k96J19o79L75K29l32J255n90r43M37M60j231L57k99
6979d85M87r0p0j53Q5N72%q06N6M19m10Q07l06K95n63K46J53j084R34L20m44J65
7001A28j86m06J92j14Q20m83K27O75p14l03j2M94k15J6j04k69N90m37k82P13J18
7022D48n91L86P8m93K61p26J6m41J411p06M94q5o40Q96J73m21l13J12O56o66M0
7043a11pL70m09k65J36O86o26o5j4O41p03M79m83J243r64q5k44j73M36J6O19k14
7065B63p64P71m23o97J108k02J14r75L86J63Q5J87M0j6M49o51k7M64p6L0L65o96
$$ plain form
7087 -102 -686 710 -209 116 223 -485 328 -160 -214 216 129 -1245 -468 114 162 435 -391 -278 -122 161
7107 161 -538 -109 -51 -546 129 -621 -196 -304 -691 226 71 -13 28 291 -93 74 310 -489 351 -393 101
7128 101 373 -61 -69 -358 140 445 451 -71 105 -406 225 -45 370 -17 -159 1178 500 -805 -14 -103 -23
7149 -23 915 122 -248 -103 283 27 81 -418 440 202 138 -306 -26 -227 2 -130 -388 147 475 -231 -651
7170 -651 -52 -158 -828 261 402 551 -372 68 -542 -130 251 -548 -205 12 138 376 -415 306 400 347
7190 347 2 -222 157 76 377 457 -247 51 240 485 294 407 439 149 -970 597 -251 326 -231 173
7210 173 654 515 351 -206 216 130 -195 96 52 58 492 255 366 -376 52 70 -314 -346 -101 -312 346 213
7232 213 227 181 -346 -334 -276 -186 14 -20 453 548 -136 383 20 28 537 -311 591 76 -267 851 381 -54 -35
$$ packed form
7087a02n84J396r19L25J07p08Q13m88n4M30q7j374P77N82M8K73q26J13J56K83
7107A61o99M29N8m95O75p50M25j08l87R17j55q4M1K63l84J67K36p99Q40p44M94
7128A01K72m34qk89M98L05On22J76n11O31k70M15l87j42J337o78j305P91q9Q0
7149b3R38p93l70J45L86k56N4m99Q58k38o4m44K80k01K29j32k58N35L28p06m20
7170f51N99j06o70J089J41J49r23M40o10M12L81p99L43K17J26K38p91P21R4n3
7190C47l45k24L79q1L01Q0p04K98J89K45j91J13L2k90j119J567q48N77n57M04
7210A73M81j39j64n57M22q6l25K91m4OM34k37J11p42M28J8l84l2K45k11O58j33
7232B13J4m6n27J2N8R0K00l4M73R5o84N19l63QN09q48R02n15l43J118m70m35J9
$$ plain form
7255 -35 -420 1080 370 189 -52 78 -335 -209 201 178 69 -179 610 -443 243 -462 98 322 270 390
7275 390 292 557 839 450 118 164 -148 -16 106 457 -701 454 365 -197 -331 390 425 27 -422 194 91
7296 91 -176 -306 -462 -442 162 -336 -12 -517 -271 -347 -488 915 -745 -183 -53 146 -659 -266 784 -253
7316 -253 410 -340 -61 -132 -179 -148 572 318 -992 -89 -98 -681 -670 434 -19 361 367 743 -555 166 -626 -37
7338 -37 554 368 -100 -639 -226 1201 462 116 -341 -424 -412 214 -128 561 205 -427 797 371 161 -628
7358 -628 -286 532 132 -270 797 -326 603 286 -839 -259 179 89 -849 -547 -292 448 -309 -339 -127 89
7378 89 -748 445 213 117 -347 322 -66 -439 -51 -196 -504 458 -488 243 502 -150 226 237 -291 488 -346
7399 -346 365 -355 -469 -337 478 458 -764 -142 -301 -476 322 121 64 -190 173 46 359 206 4 5 444
$$ packed form
7255c5l85J500p10j81k41J30m13J26M10k3j09k48P89j053O86p05N60K24n2J20
7275C90r8K65K82l89l32M6l12J32J22L51j158J155q9n62j34P21L5l98m49O16j03
7296I1k67j30j56K0O04m98L24n05K46p6j41J403j660N62J30J99q05L93J050j037
7316b53O63p50K79p1m7L1P20k54j310R03rn83J1J104m53L80OL76j298P21p92N89
7338c7N91j86m68n39M13J427p39l46m57q3J2O26l42O89l56o32J224m26k10p89
7358f28L42Q18m00m02J067j123R29l17j125N80M38r0r38L02K55P40p57l0K12K16
7378H9q37J193k32r6m64O69l88l73L88j45l08R62r46P31K59o52L76J1n28P79q34
7399c46P11p20j14J32Q15k0j222O22j59j75P98k01n7k54L63j27L13j53k02JM39
$$ plain form
7420 444 475 391 531 405 945 -13 -91 -67 -425 -175 599 -105 -175 -240 -105 -490 876 626 111 129 -45 140
7442 140 -149 -516 -70 233 -343 -382 829 -247 193 -346 234 -249 -96 -160 364 683 817 556 -456 -281
7462 -281 -667 475 300 -121 431 362 -930 126 -568 -515 7 -642 695 -219 259 -173 -120 322 174 640
7482 640 -85 -668 178 -14 -1041 441 -452 190 101 -110 -93 -388 43 -817 -424 67 -143 -472 549 -362
7502 -362 -535 -331 327 -87 124 33 -542 578 1001 378 -93 -56 -222 -117 61 -92 296 648 630 -151 474
7523 474 311 -86 -122 1147 52 93 220 -223 -97 -570 -122 -161 -44 -226 549 -387 4 1323 881 -673
7543 -673 256 -237 -156 -83 -365 -951 319 532 221 673 -148 -378 -271 33 73 -135 15 118 597 -850
7563 -850 213 -723 160 102 456 906 662 -242 -467 -375 362 455 676 487 95 266 472 138 817 -83 -67
$$ packed form
7420D44L1q4J40j26N40r58p8K4l58K50P74p04p0o5J35l85J366k50n15J8j74J85
7442A40k89l67M46L03n76l9J211j076M40n39N80m83J53o4N24L19J34k61j012J75
7462b81l86J142j75m21N52o9j292J056o94N3N22o49J337r14M78m32N3M42j48M66
7482F40p25n83Q46j92j027J482q93O42q9k11J7k95M31q60L93M91k10l29J021r11
7502c62j73K04O58m14K11r1n75J120M23o23m71L7j66J05J78j53L88L52j8p81O25
7523D74j63l97l6J269j095M1J27m43J26m73M48l9J17j82P75r36L91J319m42j554
7543f73R29m93Q1P3k82n86J270K13l11M52q21k30J07L04M0k08J50J03M79j447
7563h50J063r36Q83n8L54M50k44r04k25R2P37R3K21j89l92J71K06l34O79r00J6
$$ plain form
7584 -67 -113 -91 307 -569 -706 418 -389 -252 102 -359 381 6 614 376 419 236 440 369 -160 74 50 307
7606 307 -283 -213 -124 -603 184 654 -641 -155 -4 -337 -795 270 -616 -421 -347 509 238 -797 792 -783
7626 -783 -260 -752 83 -268 -540 -389 -26 -156 -88 -177 -92 -397 241 -276 500 -132 -452 -179 120 47 19 -86
7648 -86 614 999 84 -161 -223 429 142 -479 -19 212 -125 -303 219 336 -280 -263 -88 717 -595 703
7668 703 288 -545 -296 -282 419 -362 -277 -164 -130 -628 -70 -158 470 98 78 168 597 1020 -8 -843 -341 218
7690 218 -6 -341 488 545 431 53 232 -115 165 171 182 -48 -91 -425 44 176 -213 95 208 -325 136 29
7712 29 -107 476 -272 84 258 417 -220 -590 -649 238 -401 -630 -167 10 676 95 -464 -215 -90 -270 -284
7733 -284 528 -513 435 231 787 447 -62 587 763 70 298 -109 70 292 -397 210 -153 579 132 -326
$$ packed form
7584f7m6K2L98q76j37J124q07J37L54m61P40l75O08k38M3j83K04p1n29K34k4K57
7606C07n90P0Q9m79P87M70j295M86J51l33m58J065q86J95P4Q56k71j035J589j575
7626g83N23m92Q35l51k72J51L63j30O8q9Q5l05O38n17P76o32l20K73K99p3k8j05
7648h6P00L85r15k45o2O52k87o21M60K31l37j78N22J17o16J7J75Q05j312J298
7668G03m15q33K49J4P01p81Q5J13L4m98N58q8O28l72k0R0M29M23j028q35N02N59
7690B18k24l35Q29N7j14l78J79l47K80OJ1k30m3l34M69J32l89L08J13n33M61j07
7712B9j36N83p48L56J74J59o37l70n9Q87o39k29M63J77O66n81n59K49J25j80j4
7733b84Q12j041R48k04N56l40n09O49J76o93K28m07J79K22o89O07l63P32m47m58
$$ plain form
7753 -326 1 -207 -325 -462 -57 308 -501 -307 172 177 -21 3 426 311 -42 722 -107 -58 -276 -148 182
7774 182 350 -477 -285 -725 953 -11 453 -345 -292 9 185 645 480 362 1338 -1 -190 491 -248 276
7794 276 149 136 626 -367 -332 187 -802 -547 -40 -280 -395 -536 -405 36 408 395 -558 -469 -277 658 -230
7815 -230 -572 412 649 733 508 -375 -222 505 -531 -808 -377 -57 -462 -73 -828 -33 517 301 -295 -656
7835 -656 -532 336 -202 95 -386 -508 165 1008 583 -354 -416 847 158 -280 -372 -18 172 508 253 -364
7855 -364 620 25 135 247 437 -554 -2 -506 481 109 181 -91 -417 691 348 -578 223 303 -9 311
7875 311 -275 317 116 93 129 1135 413 61 -280 83 23 -33 163 122 -352 -416 -423 186 95 -663 -391 -353 -452
7898 -452 -319 -698 459 -461 21 170 174 -714 12 589 597 -548 -197 314 -15 98 -822 161 480 -154 210
$$ packed form
7753c26L27k08j18j37M05L65q09J94M79Nj98K4M23j15l53P64q29M9k18J28L30
7774A82J68q27J92m40J678r64M64p98N3L01J76M60j65j18R76j339j89O81p39N24
7794B76j27j3M90r93L5N19r89K55N07k40j15j41J31M41L72j3r53Q9J92R35q88
7815b30l42R84K37Q4k25q83J53P27j036k77M31L20m05L89p55P95N50k16n96l61
7835f56J24Q68n38K97m81j22O73Q43m25r37o2J263o89m38r2L54J90L36k55o17
7855c64R84n95J10J12J90r91N52n04R87l72P2k72l26J108l43r26Q01Q0l12L20
7875C11n86N92k01k3L6J006p22l52l41L63o0n6J96m1m74o4pO09r1p58K72L8r9
7898d52J33l79J157r20M82J49Mq88P26N77Qj145L51N11l29J13r20R83L19o34L64
$$ plain form
7919 210 -556 -384 282 -58 -576 -893 475 602 -64 -406 742 551 -86 -835 -80 -516 -624 -520 -42
7938 -42 307 -72 45 -186 244 313 360 654 173 -65 173 589 45 18 5 427 -268 -67 195 -333 -43 -69
7960 -69 -136 415 -243 -60 -180 -309 -14 -690 378 -192 140 -601 170 1139 -233 -407 -298 -98 -224 -385
7980 -385 -228 237 447 441 354 224 281 14 74 -186 12 420 -242 -282 367 -122 -14 344 -363 374 409 -286
8002 -286 -318 -194 311 113 489 246 -272 5 71 9 -439 238 -166 743 250 -135 -274 -284 -347 -266 -379 -455
8024 -455 -19 -850 55 449 192 -161 -365 -183 -121 -199 411 -15 152 586 -314 -50 554 -388 -23 165 23
8045 23 161 111 -344 172 464 209 1086 -246 1315 -184 -328 -225 85 -450 -21 13 -17 -297 203 -384
8065 -384 315 911 448 74 -249 526 -174 381 198 312 91 -500 1111 67 -143 -230 186 553 -161 -37
$$ packed form
7919B10p66J72O66l40n18l17J368J27o66l42J148j91o37p49P55m36j08J04M78
7938d2L49l79J17k31M30O9M7K94m81k38K38M16n44k7j3M22o95K01K62n28K90k6
7960f9o7N51o58J83j20j29K95o76J068n70L32p41P71R69j372j74J09K00j26j61
7980c85J57M65K10oq7j30N7k67O0k60J98M08o62m0O49m89J08L58p07P37L5o95
8002b86l2J24N05j98L76k43n18K77O6o2m48O77m04R09m93l85j39j0o3Q1j13p6
8024d55M36q31R05L94k57l53k04J82O2p8O10m26J67M34r00K64O04r42L65J88j42
8045B3J38n0m55N16K92k55Q77j332J561j499j44J03L10n35M29L4l0k80N00n87
8065c84O99N96m63l74l23P75p00N55j83J14k21n91J611j044k10q7M16L67p14J24
$$ plain form
8085 -37 -151 313 89 518 -748 370 0 526 -152 433 869 177 871 365 -58 57 -5 135 -136 -118
8105 -118 -173 200 -211 -622 84 333 112 -340 247 176 177 -440 -545 -179 -229 376 59 22 39 309 276 -384 -223
8128 -223 669 556 -94 767 -205 -124 318 -192 -367 1041 -341 271 -206 72 389 504 -108 -962 130
8147 130 -127 9 1526 1 242 207 161 147 135 -542 390 -262 -365 94 437 56 289 857 -190 -445
8167 -445 21 238 274 -263 -8 29 -41 825 820 538 -12 -250 105 -316 -1027 -654 144 -55 -42 20 -58 611 -389
8190 -389 -459
$$ packed form
8085c7j14M64k24M29j266J118l70N26o78N85M36o92O94n06m23J15o2J40k71J8
8105a18n5L73m11m11P06K49k21m52N87p1Jo17j05L66n0O05l17l7J7K70l3o60J61
8128b23Q92j13o50Q61r72Q1M42n10j75J408j382O12m77K78L17J15o12q54J092
8147A30k57J36J517j525K41l5m6j4j2o77R32o52j03M59L43l81K33N68j047k55
8167d45M66K17L6n37K55L7p0Q66nk82n50k38L55m21p11L73P98j99J3O2p8O69j000
8190c89p0
8191d59
$$ Imaginary data points
##PAGE= N=2
##DATA TABLE= (X++(I..I)), XYDATA
$$ plain form
0 0 0 0 0 0 0 0 0 0 0 0 0 0 0 0 0 -2 64 -64 64 -64 64 -118 128 -128 166 -192 207 -256 305 -323 384 -448 510
33 510 -574 640 -714 798 -904 1011 -1121 1248 -1391 1549 -1707 1888 -2084 2312 -2541 2804
49 2804 -3088 3404 -3747 4132 -4559 5040 -5576 6194 -6898 7716 -8681 9842 -11264 13059
63 13059 -15394 18593 -23241 30696 -44511 79210 -394176 -355391 237125 94895 66854
74 66854 -60681 -219111 -94357 306577 241510 -26512 -99377 -37784 16507 189526 141116
85 141116 -130462 -197512 16085 102302 61189 -28584 -145812 -145341 26338 83336 1329 -61426
97 -61426 -75150 -32729 97167 122086 1339 -47377 21473 63885 77556 54608 -43059 -85932
109 -85932 -3860 25100 -27361 -32456 -41324 -83391 -20508 65783 14502 -47845 -2034 32728
$$ packed form
0@%%%%%%%%%%%%%%%kO6j28J28j28J28j82K46k56K94l58L99m63N61o28P07q32R58
33E10j084J214j354J512j702J915k132K369k639K940l256L595l972M396m853N345
49B804n892O492p151P879q691R599j0616J1770j3092J4614j6397J8523k1106K4323
63A3059k8453L3987m1834N3937p5207J23721m73386L8785N92516j42230k8041
74F6854j27535j58430J24754M00934o5067k68022p2865O1593N4291J73019m8410
85A41116k71578o7050K13597Q6217m1113q9773j17228M71J71679N6998q2007o2755
97f1426j3724M2421J29896K4919j20747m8716O8850M2412J3671k2948r7667m2873
109h5932Q2072K8960n2461n095q868m2067O2883Q6291n1281o2347M5811L4762
$$ plain form
121 32728 33407 54942 32218 -27398 -9539 42913 24225 -12611 -13689 -21797 -29516 6 10306
134 10306 -21310 -34395 -15417 2802 16079 11975 -4699 -4366 13941 24931 21034 3855 -7204
147 -7204 -327 5375 -987 -3174 -5785 -18496 -12812 10287 7964 -8779 -4875 4336 821 6868
161 6868 9165 -9734 -11657 6221 3628 -6557 1881 1992 -6829 1509 13543 3191 -4306 1555
175 1555 2509 132 3716 25 -7550 -2218 5497 871 -992 1176 -1646 -2377 221 -1421 -2818 -6190
191 -6190 -8619 -2963 1427 -849 -819 5326 7494 6989 10914 8756 2355 3761 4961 -4408 -8070 -4390
207 -4390 -9609 -15674 -7661 -3101 -10527 -5343 4642 3098 3541 11155 10128 5279 10357 11937 2613
222 2613 972 4863 -2339 -8856 -4244 -4478 -11416 -9807 -5244 -6897 -6437 -1584 19 214 4490 8044
$$ packed form
121C2728O79K1535k2724n9616J7859N2452j8688l6836j078q108p719K9522J0300
134A0306l1616j3085J8978J8219J3277m104j6674L33J8307J0990l897j7179j1059
147g204O877N702o362k187k611j2711N684K3099k323j6743L904R211l515O047
161F868K297j8899j923J7878k593j0185Q438J11q821Q338J2034j0352p497N861
175A555R54k377L584l691p575N332P715m626j863K168k822p31K598j642j397l372
191f190k429N656M390k276L0O145K168n05L925k158o401J406J200r369l662L680
207d390n219o065Q013M560p426N184R985j544M43P614j027m849N078J580r324
222B613j641L891p202o517M612k34o938J609M563j653M60M853J603J95M276L554
$$ plain form
238 8044 6469 6612 9407 8201 3496 4366 4257 -447 -3280 -2730 -4028 -7354 -8205 -6555 -7308 -7093 -4043
255 -4043 -1499 -2546 1363 4729 4948 5548 8361 9709 6064 6731 7166 2585 -1566 -1532 -4096 -8664 -7969
272 -7969 -7653 -9407 -8442 -4095 -2135 -2086 3003 6638 4644 7137 9042 6699 4041 5463 3810 -493
288 -493 -2020 -1203 -3727 -5754 -2976 -3630 -4371 -2401 -490 -2681 -1565 235 1169 -908 479 3998
304 3998 1789 2099 3702 4674 2973 3510 2870 -667 -721 -448 -3034 -5555 -4563 -3951 -5653 -4796 -1906 -391
322 -391 116 2852 3920 3379 3502 5540 3914 1096 1216 1166 -1095 -2132 -1523 -3075 -2756 -1079 -725 -1776
340 -1776 -1527 492 -541 -1679 -239 257 -994 57 1553 389 616 1741 2596 1435 1121 2784
356 2784 1038 -481 1336 148 -2897 -1673 -1583 -2871 -3530 -2045 -1015 -856 -75 955 632 999 2825
$$ packed form
238H044j575J43K795j206m705Q70j09m704k833N50j298l326q51J650p53K15L050
255d043K544j047L909L366K19O00K813J348l645O67M35m581m151L4k564m568O95
272g969L16j754R65M347J960M9N089L635j994K493J905k343k658J422j653m303
288d93j527Q17k524k027K778o54p41J970J911k191J116J800R34k077J387L519
304C998k209L10J603R72j701N37o40l537n4K73k586k521R92O12j702Q57K890J515
322c91N07K736J068n41J23K038j626k818J20n0k261j037O09j552L19J677L54j051
340a776K49K019j033j138J440M96j251J051J496j164K27J125Q55j161l14J663
356B784j746j519J817j188l045J224R0j288o59J485J030J59P81J030l23L67J826
$$ plain form
373 2825 2266 1711 3378 2798 372 198 1627 -138 -1394 -781 -1354 -2826 -2337 -1446 -2763 -2179 -875
390 -875 341 -456 444 664 149 825 1829 1824 1850 470 2911 929 920 932 -496 -1118 -997 -696 -3680 -2899
410 -2899 -1821 -1789 -2755 -665 -113 425 439 2603 2486 1780 3249 3310 1911 561 1184 -687 -1586 -1362 -2285
429 -2285 -2859 -2752 -1411 -1742 -1542 -431 383 1210 1344 2201 1791 1454 1399 2089 1346 406 1285 575 -1054
448 -1054 94 -594 -1227 -1364 -1001 -1870 -2568 -1917 -895 -2216 -443 368 62 321 1527 2061 1831 2569
466 2569 2807 993 578 1219 -785 -2979 -1778 -1894 -2819 -3004 -1714 -2102 -1517 -515 136 -100 589 2496
484 2496 1391 678 2237 1661 -72 211 1614 88 688 -807 -1209 -2056 -883 -789 -705 -1144 -175 -931
502 -931 -1660 -667 487 518 324 1544 1130 946 2035 2545 889 46 116 973 -134 -576 -626 -1535 -2009 -1061
$$ packed form
373B825n59n55J667n80k426j74J429j765j256O13n73j472M89Q91j317N84J304
390h75J216p97R00K20n15O76J004nK6j380K441j982rJ2j428o22J21L01k984P81
410b899J078L2r66K090N52N38J4K164j17p06J469O1j399j350O23j871q99K24r23
429b285n74J07J341l31K00J111Q14Q27J34Q57m10l37n5O90p43r40Q79p10j629
448a054J148o88o33j37L63q69o98O51J022j321J773Q11l06K59J206N34k30P38
466B569K38j814m15O41k004k194J201j16r25j85J290l88N85J002O51k36O89J907
484B496j105p13J559n76j733K83J403j526O00j495m02q47J173R4Q4m39R69p56
502i31p29R93J154L1j94J220m14j84J089N10j656q43P0Q57j107m42n0r09m74R48
$$ plain form
522 -1061 -1667 -1978 -476 425 -594 972 1769 1236 1045 1524 2098 1611 310 795 -421 -483 -362 -1498
540 -1498 -1245 -191 -961 -1170 -796 -214 252 -740 143 -394 416 -2 462 1329 131 1048 1043 988 636 624 74
561 74 -606 -188 -531 -1585 -960 -1249 -876 -1060 -1044 -455 10 364 830 643 1854 1088 1302 1478 -52 773
581 773 -326 -1260 -1214 -475 -678 -1347 -737 -564 -1355 -189 -129 -782 -428 598 445 325 1354 1030 198 954
601 954 729 747 -87 244 1090 111 -205 -135 -1321 -90 -497 -927 -1580 -467 -662 -305 304 222 776 966
621 966 1457 1160 1041 252 1607 419 -203 44 -1050 -1769 -319 -1863 -1064 -1341 484 157 -518 669
639 669 472 425 321 688 289 -199 12 357 262 -173 167 255 -186 -701 -70 -742 -556 -1187 -855 -142 -718
660 -718 -61 -232 56 460 446 621 580 1213 1768 140 417 -282 273 -385 -489 -826 -1009 -709 -737 -1244 -571
$$ packed form
522a061o06l11J502R01j019J566P97n33j91M79N74m87j301M85j216o2J21j136
540a498K53J054p70k09L74N82M66r92Q83n37Q10m18M64Q67j198R17nn5l52j2n50
561G4o80M18l43j054O25k89L73j84J6N89M65L54M66j87J211p66K14J76j530Q25
581G73j099r34M6P39k03o69O10J73p91J166O0o53L54J026j53j20J029l24q32P56
601I54k25J8q34L31Q46r79l16P0j186J231m07m30o53J113j95L57O09q2N54J90
621I66M91k97j19p89J355j188o22K47j094p19J450j544P99k77J825l27o75J187
639F69j97m7j04L67l99m88K11L45r5m35L40Q8m41n15O31o72J86o31L32P13n76
660g18O57j71K88M04j4J75m1O33N55j628K77o99N55o58j04l37j83L00k8n07O73
$$ plain form
681 -571 -308 -785 -123 609 711 712 1139 1176 273 -48 630 471 -46 387 -780 -124 -505 -532 -981 -888 -468 -376
703 -376 -699 635 357 -205 -562 148 623 392 116 667 -75 341 1301 147 578 38 330 -930 -1081
722 -1081 -108 -241 -1461 -683 65 -471 333 -66 212 496 1356 774 740 532 654 648 -546 680 -144 -362
742 -362 -1098 314 -474 -601 -383 227 -490 -846 761 -7 -512 55 -325 45 355 -56 -491 -613 607
761 607 133 61 -11 399 173 -669 -632 -422 -503 -341 -531 -35 -355 -262 758 -289 802 694 481 44 -296
782 -296 438 8 -85 -105 -525 -450 -472 -764 -583 -697 -557 -137 -61 32 615 141 598 939 531 33 326 -56
804 -56 -431 -45 245 265 605 -128 -84 77 -370 -232 -691 -400 43 -437 70 156 -210 356 130 251 -504 817
826 817 691 1139 141 -61 446 38 -283 281 -428 -718 -57 -347 -523 79 -364 -334 -3 413 998 183 325
$$ packed form
681e71K63m77O62P32J02JM27L7r03l21O78j59n17M33j167O56l81k7m49R3M20R2
703c76l23J334k78n62l57P10M75k31k76N51p42M16R60j154M31n40K92j260j51
722a081R73j33j220P78P48n36Q04l99K78K84Q60n82l4k08J22oj194J226q24k18
742c62p36J412p88j27K18O10p17l56J607p68n05N67l80L70L10m11m35j22J220
761F07m74p2p2M10k26q42L7K10q1J62j90M96l20R3J020j047J091j08k13m37l40
782b96P34m30r3k0m20P5k2k92J81j14J40M20P6R3N83m74M57L41m08m98K93l82
804e6l75L86K90K0L40p33M4J61m47J38m59K91M43m80N07Q6l66N66k26J21p55J321
826H17j26M48r98k02N07m08l21N64p09k90O61k90j76O02m43L0L31M16N85q15J42
$$ plain form
847 325 813 221 575 242 -315 -320 -452 380 -278 -441 -807 -917 -590 -606 -227 -568 430 -1034 197 529 -168
868 -168 172 324 1120 19 351 -109 110 -436 -890 -947 -27 -428 -495 -697 -207 -971 -233 -646 159 41 494
889 494 1359 512 958 568 -61 324 -44 -85 979 -451 -451 2 -305 90 102 245 160 -493 -330 -906 -265
910 -265 -422 491 172 38 646 -55 896 627 116 152 729 -106 -21 -369 -632 -433 -480 -815 -234 -256 -116 115
932 115 419 327 -470 1278 467 187 554 741 352 -863 -194 -198 -431 -775 48 87 56 -358 441 -247 700
953 700 890 84 462 229 -209 711 -222 158 -29 -160 -622 53 370 -199 -701 766 -22 -20 -644 189 -93
974 -93 -390 -234 290 608 -190 -496 411 -142 610 -470 287 106 9 -145 197 -313 -594 90 -225 294 -25
995 -25 813 -112 189 -262 450 -140 61 -130 568 -154 198 143 1115 116 -310 761 251 20 490 479 -402
$$ packed form
847C25M88n92L54l33n57nj32Q32o58j63l66j10L27j6L79l41R98j464J231L32o97
868a68L40J52P96j101L32m60K19n46m54n7R20m01o7k02M90p64P38m13Q05j18M53
889D94Q65q47M46l90o29L85l68m1J064j430%M53l07L95J2J43q5o53J63n76O41
910b65j57R13l19j34O08p01R51k69n11L6N77q35Q5l48k63J99m7l35N81k2J40K31
932A15L04r2p97J748q11k80L67J87l89j215O69mk33l44Q23L9l1m14P99o88R47
953G00J90q06L78k33m38R20r33L80j87j31m62O75L17n69n02J467p88Ko24Q33k82
974i3k97J56N24L18p98l06R07n53P52j080P57j81r7j54L42n10k81O84l15N19l19
995b5Q38r25L01m51P12n90K01j91O98p22L52n5R72r99m26J071n10k31M70j1q81
$$ plain form
1016 -402 -398 -565 -103 547 117 124 -286 -150 801 -121 388 -326 948 -130 -203 365 18 -37 -66 -42 -557 88
1038 88 -63 -471 -715 -176 -394 647 684 479 -226 68 76 82 989 625 -141 503 -100 105 -851 441 -45
1059 -45 14 -855 -147 -517 -436 -720 5 -42 -236 384 130 -432 236 156 -477 369 109 703 277 37 -136 -396
1081 -396 -278 -100 -141 1 -187 -135 -649 605 -698 75 185 72 -70 -199 613 78 159 -449 282 416
1101 416 -129 38 145 -77 63 387 -751 264 614 587 98 1079 143 -284 -687 -152 163 84 852 -294
1121 -294 -179 -39 92 -53 110 74 520 -111 -574 -601 -89 198 -31 537 -218 134 453 199 421 85 1076
1142 1076 242 -232 36 -761 352 -604 -24 -380 -5 -552 -89 181 717 222 -417 -145 422 -289 326
1161 326 -446 78 661 370 74 330 -72 -608 407 206 118 322 28 -476 333 -869 -8 365 101 279
$$ packed form
1016d02Mj67M62O50m30Pm10J36R51r22N09p14J274j078p3N68l47n5k9K4n15O45
1038H8j51m08k44N39k18J041L7k05p05K94QOR07l64p66O44o03K05r56J292m86
1059d5N9q69P08l70Q1k84P25m7j94O20k54n62O68q0o33Q46k60N94m26k40j73k60
1081c96J18J78m1J42j88N2n14J254j303P73J10j13j42j29Q12n35Q1o08P31J34
1101D16n45J67J07k22J40L24j138J015L50k7m89R81r36m27m03N35L15p9P68j146
1121b94J15J40J31j45J63l6M46o31m63k7N12K87k29N68p55L52L19k54K22l36R91
1142A076q34m74K68p97J113r56N80l56L75n47M63K70N36m95o39K72N67p11O15
1161C26p72N24N83k91k96K56m02n36J015k01q8K04k94n04Q09j202Q61L73k64J78
$$ plain form
1181 279 -356 -129 80 -45 6 559 1191 77 -139 124 489 105 227 -165 114 -296 62 133 263 -471
1201 -471 145 209 80 -28 177 -53 -29 -365 -56 -122 -533 36 19 -586 -74 -404 -497 -71 -223 -392 -140 469
1223 469 650 541 252 232 -188 -78 -218 774 128 13 28 -90 -198 11 -61 -463 -420 -310 -140 -25 218
1244 218 -179 -803 -275 414 -474 287 -159 -45 -346 439 -371 -82 -197 -178 472 434 -77 74 -20 159 122
1265 122 -747 -329 49 -1073 -801 352 347 -144 28 379 -401 -139 -478 313 -295 389 -148 334 163 466
1285 466 7 -718 -14 187 421 -395 55 -136 -36 -170 90 -347 -216 480 328 -25 230 -7 622 -409
1305 -409 -99 -655 -307 -660 117 145 426 88 -176 -114 375 238 321 -56 -682 -113 -109 255 -34 -1136 -330
1326 -330 327 -56 270 66 523 891 -552 -64 83 -467 -28 415 82 -6 208 -292 292 -75 -559 138
$$ packed form
1181B79o35K27K09j25N1N53O32j114k16K63L65l84J22l92K79m10L58P1J30p34
1201d71O16O4j29j08K05k30K4l36L09o6m11N69j7o05N12l30r3M26j52j69K52O09
1223D69J81j09k89k0m20J10j40R92o46j15J5j18j08K09p2m02M3J10J70J15K43
1244B18l97o24N28O89q88P61m46J14l01P85q10K89j15J9O50l8n11J51r4J79l7
1265A22q69M18L78j122K72J153nm91J72L51p80K62l39P91o08O84n37M82j71L03
1285D66m59p25P04K01K34q16M50j91J00j34K60m37J31O96j52l53K55k37O29j031
1305d09L10n56L48l53P77K8K81l38k64O2M89j37Q3l77o26N69ML64k89j102Q06
1326c30O57l83L26k04M57L68j443M88J47n50M39M43l33q8K14n00N84l67m84O97
$$ plain form
1346 138 -853 -182 1 -825 353 -304 148 -1111 525 -225 -228 57 59 134 -200 -1107 388 487 75 -2 157
1367 157 -418 -193 -105 193 -262 -685 -657 101 38 -1090 -680 -561 -49 324 985 -216 235 225 -406 380 350
1388 350 -38 -431 614 -92 296 634 43 873 -327 -70 -270 -464 348 -634 41 -93 -215 -153 -293 -159
1408 -159 391 268 -110 779 635 -712 -471 62 -178 -278 -250 481 723 179 -466 271 329 323 95 308 4
1429 4 104 -210 -669 72 -422 394 4 111 -625 378 290 25 -227 308 -90 124 376 -385 -5 73 680
1450 680 -984 489 -584 54 804 -295 -133 172 126 -256 -416 -49 -101 -817 647 481 75 76 654 -469
1470 -469 296 -410 0 31 136 -315 703 344 395 225 -455 269 65 -624 125 -107 -32 -362 -392 114 -347
1491 -347 -5 1212 219 -511 37 -658 -280 -405 588 -89 -319 -837 566 539 -242 134 324 14 -175 340
$$ packed form
1346A38r91O71J83q26J178o57M52j259J636p50lK85KP5l34r07J495R9m12p7J59
1367A57n75K25Q8K98m55m23K8P58o3j128M10J19N12L73O61j201M51j0o31P86l0
1388C50l88l93J045p06L88L38n91Q30j200K57k00j94Q12r82O75j34j22O2j40J34
1408a59N50j23l78Q89j44j347K41N33k40j00K8P31K42n44o45P37N8ok28K13l04
1429DJ00l14m59P41m94Q16l90J07p36J003q8k65k52N35l98K14K52p61L80P8O07
1450F80j664J473j073O38P50j099J62L05m6l82j60L67n2p16J464j66m06JN78j123
1470d69P65p06M10L1J05m51J018l59N1j70o80P24k04o89P49k32P5l30l0N06m61
1491c47L42J217r93p30N48o95L78j25R93o77k30n18J403k7p81L76J90l10j89N15
$$ plain form
1511 340 -296 285 -392 -658 -71 -184 28 13 -19 -725 113 -420 -110 -102 230 -252 426 425 -230 86 -389 -235
1533 -235 -113 -163 -66 -77 47 -89 -127 -352 -236 -15 203 -573 -401 278 667 -398 7 -240 -1000 361 522
1554 522 -245 347 -725 -218 286 100 -588 273 1359 110 -343 320 92 -65 162 155 -218 -679 -343 -247
1574 -247 -287 -30 -191 -274 -60 32 417 194 -593 74 -74 838 -152 -263 -461 -149 445 45 -529 214 -159
1595 -159 -338 615 422 -193 -485 205 536 -68 363 -672 440 365 -63 297 555 785 301 551 -413 53
1615 53 -596 19 -219 -244 -135 250 185 455 -840 -136 -339 -264 209 -377 339 -106 -320 -195 -127 514 770
1636 770 1139 757 79 421 -235 -296 -272 -373 839 -721 550 2 320 -433 587 -161 -122 213 -224 142
1656 142 -385 286 -525 321 -532 217 601 39 -122 -104 130 209 -571 626 -330 50 228 -104 -494 432
$$ packed form
1511C40o36N81o77k66N87j13K12j5l2p06Q38n33L10QL32m82O78jo55L16m75J54
1533b35J22n0R7j1J24j36l8k25J16K21K18p76J72O79L89j065M05k47p60J361J61
1554E22p67N92j072N07N04j86o88Q61J086j249m53O63k28j57K27pl73m61L36R6
1574b47m0K57j61q3K14R2L85k23p87O67j48R12r90j11j98L12N94m00n74P43l73
1595a59j79R53j93o15k92O90L31o04M31j035J112p5m28L60K58K30m84K50r64M66
1615E3o49O15k38k5J09L85o5K70j295P04k03P5M73n86P16m45k14J25O8O41K56
1636G70L69l82o78L42o56o1K4j01J212j560J271n48L18p53J020p48L9L35m37L66
1656A42n27O71q11Q46q53P49L84n62j61J8K34P9p80J197r56L80J78l32l90R26
$$ plain form
1676 432 104 -174 -62 -119 -387 -314 -145 -709 306 -211 -132 -425 18 -598 445 -156 -364 -290 246 479 134
1697 134 -305 -48 -8 230 13 161 -283 -315 93 233 576 -285 172 -691 331 -152 -134 470 282 89 524
1718 524 352 363 815 468 -373 82 54 -136 -429 -10 35 439 -263 -146 107 -425 93 104 472 -288 182
1739 182 -90 -209 -64 -712 -307 -323 -198 377 -281 67 416 -211 -116 -883 -453 198 -260 -483 264 -486 -351
1760 -351 -105 721 -164 -7 -298 647 109 932 -86 -350 -482 846 -78 -257 -19 243 -403 165 -595
1779 -595 -122 22 -307 17 -439 -669 -10 2 -21 233 -716 -236 313 -381 -120 -122 -262 -540 -117 279 -60
1800 -60 -3 32 -438 -1200 36 158 -76 -582 72 -689 286 -316 199 -115 -49 269 -130 350 819 -359 817
1821 817 -493 171 -760 -721 209 -195 -286 -498 9 209 400 -848 445 343 88 -130 556 -411 466 118
$$ packed form
1676D32l28k78J12n7k68P3J69n64J015n17P9k93M43o16J043o01k08P4N36K33l45
1697A34m39K57M0K38k17J48m44l2M08J40L43q61M57q63J022m83J8O04j88j93M35
1718E24j72J1M52l47q41M55k8j90k93M19M5M04p02J17K53n32N18J1L68p60M70
1739A82k72j19J45o48M05j6J25N75o58L48L49o27R5p67M30O51m58k23P47p50J35
1760c51K46Q26q85J57k91R45n38Q23j018k64j32J328r24j79K38K62o46N68p60
1779e95M73J44l29L24m56k30O59J2k3K54r49M80N49o94K61kj40k78M23L96l39
1800f0N7L5m70p62J236J22k34n06O54p61R75o02N15l14O6L18l99M80M69j178J176
1821H17j310O64r31L9R30m04r1k12N07K00J91j248J293j02k55k18O86r67Q77l48
$$ plain form
1841 118 -79 261 -228 -304 -429 -626 1268 1086 744 -25 -107 273 -249 -285 84 504 113 550 -336 337 -51
1862 -51 935 673 17 469 -164 568 366 -435 604 -16 -175 -101 178 -22 -173 -286 565 -498 -377 -212
1882 -212 -152 4 404 436 -462 244 -355 209 -442 553 177 -44 -529 -761 -381 -366 -549 -97 -1046 -393 477
1903 477 247 -125 -135 57 134 552 20 112 425 446 132 -349 -609 202 -209 719 -419 -655 -153 -366 125
1924 125 618 -777 -266 611 0 110 641 725 382 -195 -104 609 -396 258 -271 -501 434 -239 -31 330
1944 330 -364 -275 -153 265 -152 406 64 -508 305 323 746 -263 130 -439 490 -262 -967 -87 -315 133
1964 133 -42 246 -198 792 -237 255 -503 276 -627 -331 -428 594 474 341 147 -110 -281 -60 -161 -154
1984 -154 235 573 -444 208 -181 5 460 -230 -721 -7 178 -284 488 -320 308 -193 868 -335 -142
$$ packed form
1841A18j97L40m89p6j25j97J894j82l42p69q2L80n22l6L69M20l91M37q86O73l88
1862e1R86k62o56M52o33P32k02q01J039o20j59P4K79k00j51j13Q51j063J21J65
1882b12O0J56M00L2q98P06n99N64o51R95l76k21m85k32L80J5j83M52r49O53Q70
1903D77k30l72j0J92P7M18n32R2L13K1l14m81k60Q11m11R28j138k36N02k13M91
1924A25M93j395N11Q77o11J10N31Q4l43n77R1P13j005O54n29k30R35o73K08L61
1944C30o94Q9J22M18m17N58l42n72Q13J8M23j009L93n69R29p52p05Q80k28M48
1964A33j75K88m44R90j029M92p58P79r03K96r7J022j20j33j94k57j71K21j01P
1984a54L89L38j017O52l89J86M55o90m91P14J85m62P72q08O28n01J061j203J93
$$ plain form
2003 -142 481 -757 -732 208 381 -244 -390 -281 -46 -669 -619 -134 -460 40 468 -431 45 115 121 596 -52
2024 -52 82 -182 -31 216 564 57 443 811 -160 -217 -210 -174 184 56 271 721 128 49 -55 317 904 400
2046 400 240 -746 -352 -245 106 -735 782 413 101 258 -76 -109 744 -171 334 406 186 -434 17 893
2066 893 -472 52 -291 -127 58 115 451 -9 94 633 -296 786 -455 731 476 167 114 -279 301
2085 301 -23 -74 -162 886 -65 -87 180 -191 172 246 428 -257 251 -226 805 288 -204 723 -152 263 -204
2106 -204 417 -555 -496 -341 -159 -292 551 -274 -194 -719 0 427 -240 -395 -166 150 -728 -629 -424 171 869
2127 869 -140 -300 -140 -12 -918 -613 -560 467 -791 118 -357 -31 -28 -197 566 16 488 294 364 -261
2147 -261 -128 -605 -692 -20 -54 -257 294 -281 242 -266 204 310 71 -407 -547 -181 -132 -93 188 -213 661
$$ packed form
2003a42O23j238K5R40J73o25j46J09K35o23N0M85l26N00M28q99M76P0OM75o48
2024e2J34k64J51K47L48n07L86L68r71n7PL6L58j28K15M50n93p9j04L72N87n04
2046D00j60r86L94J07L51q41J517l69l12J57l34l3Q53r15N05P2k20o20M51Q76
2066H93j365N24l43J64J85N7L36m60J03N39r29J082j241J186k55l09n3l93N80
2085C01l24n1q8J048r51k2K67l71L63P4J82o85N08m77J031n17m92R27q75M15m67
2106b04O21r72N9J55J82j33Q43q25Q0n25P19M27o67j55K29L16q78R9K05N95O98
2127H69j009j60J60J28r06L05N3J027j258R09m75L26Lj69P63n50M72j94P0o25
2147b61J33m77q7O72l4k03N51n75N23n08M70J06k39m78j40L66M9L9K81m01Q74
$$ plain form
2168 661 -93 -123 -126 -3 831 226 -207 -843 -221 -620 77 -232 -284 123 302 91 -797 647 173 -598 -60
2189 -60 -73 64 -251 264 501 -74 -129 -55 690 338 2 484 89 -174 -378 200 -103 -312 176 -704 -33
2210 -33 -290 -198 -55 -614 -394 452 193 54 536 -37 208 795 855 -34 -629 -412 134 -373 -466 668 288
2231 288 -506 271 133 -431 -227 66 102 -220 237 -591 476 -105 191 -577 221 -40 141 -6 -131 18
2251 18 381 2 -276 176 2 -741 -88 -3 76 -564 -11 -90 -572 -433 371 700 -569 534 -448 -132 -138
2272 -138 376 -194 -149 -271 -280 -141 -387 -676 -267 -175 -122 338 -482 -361 -120 -23 537 -143 -195 114 558 -143
2294 -143 65 -21 301 56 -594 -165 72 -485 -302 -1187 -257 -568 -386 246 -135 309 506 -194 -206 -71 61
2315 61 -95 -290 235 -105 -271 -411 -172 246 -326 281 -249 -175 -128 -107 196 686 -566 -245 99 219 230
$$ packed form
2168F61p54l0lJ23Q34o05m33o36O22l99O97l09n2M07J79k11q88J444m74p71N38
2189f0j3J37l15N15K37n75n5P4P45l52l36M82l95k63k04N78l03k09M88q80O71
2210c3k57R2J43n59K20Q46k59j39M82n73K45N87O0q89n95K17N46n07r3J134l80
2231B88p94P77j38n64K04K93L6l22M57q28J067n81K96p68P98k61J81j47j25J49
2251A8L63l79k78M52j74p43O53Q5P9o40N53p9m82J39Q04L29j269J103r82L16o
2272a38N14n70M5j22rJ39k46k89M09R2N3M60q20J21K41R7N60o80n2L09M44p01
2294a43K08q6L22k45o50M29K37n57J83q85R30l11J82O32l81M44J97p00j2J35J32
2315F1j56j95N25l40j66j40K39M18n72O07n30P4M7K1L03M90j252L21L44J20J1
$$ plain form
2336 230 861 376 126 811 160 -690 520 -464 -146 -671 632 -376 3 -599 -61 208 433 280 365
2355 365 -148 -233 206 -582 -848 -232 -192 -886 -774 -330 -45 459 -148 -879 309 65 330 -12 -324 52
2375 52 26 -426 417 -18 -97 -34 -1445 226 233 -122 275 -123 190 -517 -433 -178 -261 186 -369 -649 -429 270
2397 270 -156 -380 -404 645 462 -583 -328 141 514 275 141 -231 -79 1181 543 155 367 129 -68
2416 -68 24 521 580 204 -558 675 -745 -436 160 -130 -98 33 335 423 -569 -616 -212 -436 -253 -444 -39
2437 -39 -414 -21 513 260 -917 -105 -176 860 -382 257 224 -439 -50 107 141 -289 2 289 -207 -607
2457 -607 247 -107 -133 87 548 301 -19 -161 558 33 162 236 56 -647 -106 -64 766 29 -488 51 -381
2478 -381 -214 -258 -127 -444 -912 250 -733 -588 -74 261 -60 -599 -268 -55 -97 172 -156 611 358 397 -559
$$ packed form
2336B30O31m85k50O85o51q50J210r84L18n25J303j008L79o02N38K69K25j53Q5
2355C65n13q5M39p88k66O16M0o94J12M44K85N04o07p31J188k44K65l42l12L76
2375E2k6m52Q43m35p9O3j411J671Pl55L97l98L13p07Q4K55q3M47n55k80K20O99
2397B70m26k24k4J049j83j045K55M69L73k39j34l72J52J260o38l88K12k38j97
2416f8R2M97N9l76p62J233j420L09N96k90L2J31L02Q8r92m7M04k24J83j91M05
2437c9l75L93N34k53j177Q12p1J036j242O39l3o63L89J57L4m30K91K87m96m00
2457f07Q54l54k6K20M61k47l20j42P19n25J29P4j80p03N41M2Q30p37n17N39m32
2478c81J67m4J31l17m68J162r83J45N14L35l21n39L31K13m2K69l28P67k53L9r56
$$ plain form
2499 -559 -465 -214 -1 883 -453 -8 424 411 747 291 -352 539 248 -312 -338 -1591 -716 -27 -4 78 544
2520 544 111 -256 168 -342 51 -659 -278 433 -211 725 -243 -236 178 -93 -196 758 286 238 -54 -154 484
2541 484 -430 375 207 73 -286 -191 222 -256 -76 -469 -105 610 133 146 -497 36 673 68 329 212 561
2562 561 118 -64 -1079 194 644 422 246 964 -84 7 217 -101 -151 295 -114 -135 -204 61 -215 -95
2582 -95 174 -167 400 137 399 56 39 -92 -311 -291 226 -449 -618 -191 -434 -193 209 163 -726 -600 -593 442
2604 442 -142 40 304 -436 -1 535 -331 152 870 41 92 561 -26 -554 -24 128 -36 -128 11 -62 48
2625 48 313 -508 557 568 66 -101 502 272 586 -29 526 116 -12 -452 752 -55 -139 772 -145 -89 -252
2646 -252 -348 -376 150 -53 -83 -222 -1 294 279 274 384 562 509 124 282 -187 -460 -395 24 -2 164 294 821
$$ packed form
2499e59R4K51K13Q84j336M45M32j3L36m56o43Q91k91n60k6j253Q75O89K3Q2M66
2520E44m33l67M24n10L93p10L81P11o44R36r68PM14k71j03R54m72m8k92j00O38
2541D84r14Q05j68j34l59R5M13m78J80l93L64P15m77J3o43N33O37o05K61j17L49
2562E61m43j82j015J273M50k22j76P18j048R1K10l18n0M46m09k1o9K65k76J20
2582i5K69l41N67k63K62l43j7j31k19K0N17o75j69M27k43K41M02m6q89J26PJ035
2604D42n84J82K64p40M35N36q66M83P18q29N1M69n87n28N30J52j64r2J39p3J10
2625D8K65q21J065J1n02j67O03k30L14o15N55m10j28m40J204q07q4R11r17N6j63
2646b52r6k8N26k03l0j39K21K95j5nJ10J78n3l85J58m69k73O5M19k6J66J30N27
$$ plain form
2669 821 451 -240 63 230 -191 -470 -11 254 -630 -557 645 51 -371 387 643 -319 -852 86 770 -98
2689 -98 640 262 -60 122 -77 -217 202 -21 12 -271 503 -478 -359 -193 401 111 -545 -264 -458 10 -189
2710 -189 270 98 249 776 665 -624 88 -616 334 -626 -291 681 18 501 106 -196 -281 -75 46 643
2730 643 288 138 81 -132 1008 -286 -24 -610 151 -114 178 176 -55 -339 -665 1349 60 -316 -98 -314
2750 -314 107 -31 118 274 402 -97 -788 -655 125 415 420 137 251 -555 1 -786 -19 -105 -117 -68 -535 278
2772 278 169 118 -394 138 343 647 -796 -364 365 286 -22 -220 245 -231 -259 -89 -292 257 430 2 539
2793 539 32 71 99 290 -586 -69 135 26 81 -880 69 -121 -662 -313 -500 -354 -143 -263 -18 -902 418
2814 418 129 563 1154 771 393 -474 4 90 -126 -1038 -217 119 -283 -867 -183 238 -1088 -270 286 35
$$ packed form
2669H21l70o91L03J67m21k79M59K65q84P3J202n94m22P58K56r62n33R38O84q68
2689i8P38l78l22J82j99j40M19k23L3k83P74r81J19J66N94k90o56K81j94M68j99
2710a89M59j72J51N27j11j289P12p04R50r60L35R72o63M83l95l02q5K06J21N97
2730F43l55j50n7k13J140j294K62n86P61k65K92kk31k84l26K014j289l76K18k16
2750c14M21j38J49J56J28m99o91J33P80K90Nk83J14q06N56p87P67q6j2M9m67Q13
2772B78j09n1n12N32K05L04j443M32P29p9l08j98M65m76k8J70k03N49J73m28N37
2793E39n07L9K8J91q76N17K04j09N5r61R49j90n41L49j87J46K11j20K45q84J320
2814D18k89M34N91l83l78q67M78Q6k16r12Q21L36m02n84O84M21j326Q18N56k51
$$ plain form
2834 35 -98 -84 316 1200 20 -138 -113 -172 903 482 -201 311 28 -22 104 -429 -3 92 396 -442 113
2855 113 925 2 -85 -218 408 -31 221 -331 -727 302 -132 325 -128 705 -26 268 -110 447 174 -487
2875 -487 -620 -567 -443 549 -48 -359 133 334 46 349 466 -36 -777 274 172 564 308 -92 -555 -126
2895 -126 -630 -182 92 -179 -86 36 -334 562 -26 -53 365 173 405 236 97 67 771 -599 -376 409 -6
2916 -6 648 -463 -235 -425 -182 -214 -445 116 79 198 -428 209 -508 45 -65 94 -150 132 -271 326 1129
2937 1129 402 -473 288 111 -502 -98 -230 -368 -312 78 25 -403 290 -285 -295 -89 -82 386 -320 495 332
2958 332 -311 354 -275 -186 696 -469 -475 -865 134 -1175 733 -498 -10 657 -199 329 242 1007 337 -315
2978 -315 -12 -580 30 163 -46 -115 -30 -854 -368 -310 184 398 -120 -370 115 114 -314 -428 -109 -19 -538 251
$$ packed form
2834C5j33J4M00Q84j180j58K5n9J075m21o83N12k83n0J26n33M26R5L04q38N55
2855A13Q12r23q7j33O26m39K52n52l96J029m34M57m53Q33p31K94l78N57k73o61
2875d87j33N3J24R92n97l11M92K01k88L03J17n02p41J051j02L92k56m00m63M29
2895a26n04M48K74k71R3J22l70Q96n88k7M18j92K32j69j39l0P04j370K23P85m15
2916fO54j111K28j90K43l2k31N61l7J19o26O37p17N53j10J59k44K82m03N97Q03
2937A129p27q75P61j77o13M04j32j38N6L90n3m28O93n75j0K06PM68p06Q15j63
2958C32o43O65o29Q9Q82j165ol90R99j309J908j231M88O67q56N28q7P65o70o52
2978c15L03n68O10J33k09o9Q5q24M86N8M94K14n18k50M85jm28j14L19R0n19P89
$$ plain form
3000 251 -256 550 -266 -260 -90 -437 46 595 167 -38 480 428 455 -62 627 690 -238 652 -118 -173 56 312
3022 312 631 -183 334 -16 -442 -231 299 -847 -110 -244 34 -185 653 120 45 -65 -212 210 24 -340
3042 -340 26 -8 -574 420 403 -606 -47 760 -488 -606 -437 -390 31 -326 50 107 201 694 -486 239 -229
3063 -229 577 -618 123 -512 -551 655 118 150 129 114 -693 261 -510 67 318 546 294 -105 -139 153 10
3084 10 118 400 -311 733 211 127 -437 203 -647 -464 -784 -384 505 -782 -67 89 -786 71 28 -254
3104 -254 397 -500 159 426 -120 218 278 -10 -494 -727 236 453 10 157 -786 406 -165 244 304 -463
3124 -463 -448 792 -538 -220 -518 487 -371 -59 -513 -173 613 20 445 833 388 -217 683 475 275
3143 275 526 -179 412 -166 -87 -125 -75 -250 231 -197 -354 -284 -158 -778 -298 -54 40 -291 -111 230 865 49
$$ packed form
3000B51n07Q06q16OJ70l47M83N49m28k05N18n2K7n17O89O3r28Q90p70n5K29K56
3022C12L19q14N17l50m26K11N30j146P37j34K78k19Q38n33p5j10j47M22j86l64
3042c40L66l4n66R94j7j009N59Q07j248j18J69M7M21l57L76N7R4M93j180P25m68
3063b29Q06j195P41o35l9J206n37L2k1j5q07R54p71N77K51K28k52l99l4K92j43
3084A0J08K82p11J044n22q4n64O40q50J83l20M00Q89j287P15J56q75Q57m3k82
3104b54O51q97O59K67n46L38O0k88m84k33R63K17m43J47r43J192n71M09O0p67
3124d63J5J240j330L18k98J005q58L12m54L40P86n93M25L88m45o05R00k08k00
3143B75K51p05N91n78P9l8N0j75M81m28j57P0J26o20M80K44R4l31J80L41O35q16
$$ plain form
3165 49 358 345 -70 -85 -402 -186 -563 450 -142 43 332 -839 -726 627 445 541 553 -476 -209 -271 -273
$$ packed form
3165D9L09j3m15j5l17K16l77J013n92J85K89j171J13J353j82R6J2j029K67o2k
$$ [...]
8191B42
##END NTUPLES=NMR FID
##END=
