##TITLE=1H_DE-54_d6_TFA
 DMSO-d6
 8 sc, 
 24.6.2024
##JCAMPDX= 6.0         $$ Bruker NMR JCAMP-DX V2.0
##DATA TYPE= NMR FID
##DATA CLASS= NTUPLES
##ORIGIN= UXNMR, Bruker Analytische Messtechnik GmbH
##OWNER= root
$$ XWIN-NMR		Version 3.5
$$ Mon Jun 24 16:15:04 2024 Russian Standard Time (UT+4h)  she@DPX200
##.OBSERVE FREQUENCY= 200.131
##.OBSERVE NUCLEUS= ^1H
##.DELAY= (6, 6)
##.ACQUISITION MODE= SIMULTANEOUS
##.ACQUISITION SCHEME= undefined
##.AVERAGES= 8
##.DIGITISER RES= 18
##SPECTROMETER/DATA SYSTEM= spect
##.PULSE SEQUENCE= zg30
##.SOLVENT NAME= DMSO
##.SHIFT REFERENCE= (INTERNAL, DMSO, 0, 15.7039)
##AUDIT TRAIL= $$ (NUMBER, WHEN, WHO, WHERE, WHAT)
$$ ##TITLE= Audit trail, XWIN-NMR		Version 3.5
$$ ##JCAMPDX= 5.01
$$ ##ORIGIN= Bruker BioSpin GmbH
$$ ##OWNER= she
$$ F:/spectra/data/she/nmr/H-F/1/audita.txt
$$ ##AUDIT TRAIL=  $$ (NUMBER, WHEN, WHO, WHERE, WHAT)
(   1,<2024-06-24 16:13:57.71 +0400>,<she>,<DPX200>,
      <created by zg, POWCHK disabled, PULCHK disabled
       configuration hash MD5:
       00 E9 B6 7A A2 85 ED C7 34 08 36 98 17 FE 4E 26
       data hash MD5: 16K
       A5 40 25 A4 F1 CD EE A5 6F 6C D9 02 7C CD A6 CD>)
$$ ##END=
$$ 
$$ hash MD5
$$ C1 74 59 FE 09 F1 27 57 51 D4 54 F4 D1 5B 01 A2
##$RELAX= 
##$RELAX= 
##$RELAX= 
##$RELAX= 
##$RELAX= 
##$RELAX= 
$$ Bruker specific parameters
$$ --------------------------
##$DU= <F:/spectra>
##$EXPNO= 1
##$NAME= <H-F>
##$PROCNO= 1
##$TYPE= <nmr>
##$USER= <she>
##$AMP= (0..31)
100 100 100 100 100 100 100 100 100 100 100 100 100 100 100 100 100 100 
100 100 100 100 100 100 100 100 100 100 100 100 100 100 
##$AQSEQ= 0
##$AQ_mod= 1
##$AUNM= <au_zg>
##$AUTOPOS= <>
##$BF1= 200.13
##$BF2= 200.13
##$BF3= 200.13
##$BF4= 200.13
##$BF5= 200.13
##$BF6= 200.13
##$BF7= 200.13
##$BF8= 200.13
##$BYTORDA= 1
##$CFDGTYP= 0
##$CFRGTYP= 5
##$CHEMSTR= <none>
##$CNST= (0..31)
1 1 145 1 1 1 1 1 1 1 1 1 1 1 1 1 1 1 1 1 1 1 1 1 1 1 1 1 1 1 1 1 
##$CPDPRG= <>
##$CPDPRG1= <>
##$CPDPRG2= <>
##$CPDPRG3= <>
##$CPDPRG4= <mlev>
##$CPDPRG5= <mlev>
##$CPDPRG6= <mlev>
##$CPDPRG7= <mlev>
##$CPDPRG8= <mlev>
##$CPDPRGB= <>
##$CPDPRGT= <>
##$D= (0..31)
0 1.2 0 0 0 0 0 0 0 0.06 0 0.03 0 0 0 0 0.0002 0 0 0 0 0 0 0 0 0 0 0 0 
0 0 0 
##$DATE= 1719231237
##$DBL= (0..7)
120 120 120 120 120 120 120 120 
##$DBP= (0..7)
150 150 150 150 150 150 150 150 
##$DBP07= 0
##$DBPNAM0= <>
##$DBPNAM1= <>
##$DBPNAM2= <>
##$DBPNAM3= <>
##$DBPNAM4= <>
##$DBPNAM5= <>
##$DBPNAM6= <>
##$DBPNAM7= <>
##$DBPOAL= (0..7)
0.5 0.5 0.5 0.5 0.5 0.5 0.5 0.5 
##$DBPOFFS= (0..7)
0 0 0 0 0 0 0 0 
##$DE= 6
##$DECBNUC= <off>
##$DECIM= 32
##$DECNUC= <off>
##$DECSTAT= 4
##$DIGMOD= 1
##$DIGTYP= 9
##$DL= (0..7)
0 120 120 120 120 120 120 120 
##$DP= (0..7)
150 150 150 150 150 150 150 150 
##$DP07= 0
##$DPNAME0= <>
##$DPNAME1= <>
##$DPNAME2= <>
##$DPNAME3= <>
##$DPNAME4= <>
##$DPNAME5= <>
##$DPNAME6= <>
##$DPNAME7= <>
##$DPOAL= (0..7)
0.5 0.5 0.5 0.5 0.5 0.5 0.5 0.5 
##$DPOFFS= (0..7)
0 0 0 0 0 0 0 0 
##$DQDMODE= 0
##$DR= 18
##$DS= 0
##$DSLIST= <SSSSSSSSSSSSSSS>
$$ [...]
##$SUBNAM2= <"">
##$SUBNAM3= <"">
##$SUBNAM4= <"">
##$SUBNAM5= <"">
##$SUBNAM6= <"">
##$SUBNAM7= <"">
##$SUBNAM8= <"">
##$SUBNAM9= <"">
##$SW= 18.0517599122864
##$SWIBOX= (0..15)
0 0 2 0 0 0 0 0 0 0 0 0 0 0 0 0 
##$SW_h= 3612.71676300578
##$TD= 16384
##$TD0= 1
##$TE= 0
##$TE2= 300
##$TE3= 300
##$TEG= 300
##$TL= (0..7)
0 120 120 120 120 120 120 120 
##$TP= (0..7)
150 150 150 150 150 150 150 150 
##$TP07= 0
##$TPNAME0= <>
##$TPNAME1= <>
##$TPNAME2= <>
##$TPNAME3= <>
##$TPNAME4= <>
##$TPNAME5= <>
##$TPNAME6= <>
##$TPNAME7= <>
##$TPOAL= (0..7)
0.5 0.5 0.5 0.5 0.5 0.5 0.5 0.5 
##$TPOFFS= (0..7)
0 0 0 0 0 0 0 0 
##$TUNHIN= 0
##$TUNHOUT= 0
##$TUNXOUT= 0
##$USERA1= <user>
##$USERA2= <user>
##$USERA3= <user>
##$USERA4= <user>
##$USERA5= <user>
##$V9= 5
##$VALIST= <valist>
##$VCLIST= <CCCCCCCCCCCCCCC>
##$VD= 0
##$VDLIST= <DDDDDDDDDDDDDDD>
##$VPLIST= <PPPPPPPPPPPPPPP>
##$VTLIST= <TTTTTTTTTTTTTTT>
##$WBST= 1024
##$WBSW= 4
##$XGAIN= (0..3)
0 0 0 0 
##$XL= 0
##$YL= 0
##$YMAX_a= 75693
##$YMIN_a= -76632
##$ZGOPTNS= <>
##$ZL1= 120
##$ZL2= 120
##$ZL3= 120
##$ZL4= 120
##$ABSF1= 10
##$ABSF2= 0
##$ABSG= 5
##$ABSL= 3
##$ALPHA= 0
##$AQORDER= 0
##$ASSFAC= 0
##$ASSFACI= 0
##$ASSFACX= 0
##$ASSWID= 0
##$AUNMP= <proc_1d>
##$AZFE= 0.1
##$AZFW= 0.1
##$BCFW= 1
##$BC_mod= 2
##$BYTORDP= 1
##$COROFFS= 0
##$CY= 11.3945322036743
##$DATMOD= 1
##$DC= 2
##$DFILT= <>
##$DTYPP= 0
##$F1P= 15.6554695791079
##$F2P= 12.8336369535428
##$FCOR= 0.5
##$FTSIZE= 0
##$FT_mod= 4
##$GAMMA= 1
##$GB= 0.15
##$INTBC= 1
##$INTSCL= 1
##$ISEN= 128
##$LB= 0.24
##$LEV0= 0
##$LPBIN= 0
##$MAXI= 10000
##$MC2= 0
##$MEAN= 0
##$ME_mod= 0
##$MI= 1.114404
##$NCOEF= 0
##$NC_proc= 0
##$NLEV= 6
##$NOISF1= 3.799351
##$NOISF2= 2.8
##$NSP= 1
##$NTH_PI= 0
##$NZP= 0
##$OFFSET= 15.70392
##$PC= 1
##$PHC0= -25321.44
##$PHC1= 15.58748
##$PH_mod= 1
##$PKNL= yes
##$PPARMOD= 0
##$PSCAL= 0
##$PSIGN= 0
##$REVERSE= no
##$SF= 200.130013532006
##$SI= 16384
##$SIGF1= 3
##$SIGF2= 2
##$SINO= 400
##$SIOLD= 16384
##$SREGLST= <1H.CDCl3>
##$SSB= 0
##$STSI= 0
##$STSR= 0
##$SW_p= 3612.71676300578
##$SYMM= 0
##$S_DEV= 0
##$TDeff= 0
##$TDoff= 0
##$TI= <>
##$TILT= no
##$TM1= 0
##$TM2= 0
##$TOPLEV= 0
##$USERP1= <user>
##$USERP2= <user>
##$USERP3= <user>
##$USERP4= <user>
##$USERP5= <user>
##$WDW= 1
##$XDIM= 8192
##$YMAX_p= 0
##$YMIN_p= 0
$$ End of Bruker specific parameters
$$ ---------------------------------
##NTUPLES= NMR FID
##VAR_NAME=  TIME,          FID/REAL,        FID/IMAG
##SYMBOL=    X,             R,               I
##VAR_TYPE=  INDEPENDENT,   DEPENDENT,       DEPENDENT
##VAR_FORM=  AFFN,          ASDF,            ASDF
##VAR_DIM=   8192,          8192,            8192
##UNITS=     SECONDS,       ARBITRARY UNITS, ARBITRARY UNITS
##FACTOR=    0.0002768,     1,               1
##FIRST=     0,             0,               0
##LAST=      2.2672688,     0,               0
##MIN=       0,             -76632,          0
##MAX=       2.2672688,     75693,           0
$$ Real data points
##PAGE= N=1
##DATA TABLE= (X++(R..R)), XYDATA
0@%%%%%%%%%%%%%%%%%%%qJ6j6J6j6J8k6L2l2L9m7N3o1O9q1R3j03J15j30J47j66
40h8J87k10K32k58K89l20L54l89M28m72N20n72O30o95P65q43R28j024J136j263
60f65J408j576J773k010K302k671L149l812M886j2905J9137q5648J06909K0491
74E0768r4613R2543p7026r35N1962p0624P8205Q230o1023M8482n7870R812M1180
87A9091m5684N4747J870m3859K0871m3775K2972M2109k9856K4374j1584k6591
99a5315J6555l0751K0110L6599j5146P482k5267j8866K2079r737J6415K0013j3306
112A0865N87k4755j2590K3249L529J3029M626j5134j509j7082o090K2642J0599
125A1966R551q179k1889o08k440M445J5463L694L638r722j8360J11M505J0264
$$ plain form
0 0 0 0 0 0 0 0 0 0 0 0 0 0 0 0 0 0 0 0 0 -8 8 -8 8 -8 10 -16 16 -16 23 -24 29 -32 37 -44 49 -54 61 -69 78 -88
40 -88 99 -111 121 -137 152 -168 186 -203 225 -247 273 -299 331 -364 401 -442 486 -538 598 -665
60 -665 743 -833 940 -1070 1232 -1439 1710 -2102 2784 -10121 9016 -76632 30277 50768
74 50768 -43845 48698 -28328 -29263 22699 -47925 30280 38510 -22513 25969 -31901 -22089 19091
87 19091 -26593 28154 30024 -13835 7036 -36739 -13767 28342 -1514 22860 11276 -15315
99 -15315 1240 -29511 -9401 27198 12052 19534 -5733 -24599 -2520 -12257 4158 24171 10865
112 10865 11452 -13303 -25893 -2644 885 13914 18540 3406 1897 -15185 -21275 1367 11966
125 11966 21517 13338 -8551 -9159 -11599 -7154 8309 12003 15641 5919 -12441 -12330 -7825 2439
139B439J0474k860k065q679j2372J710P936J2114P079q844q368o603k610P346
153c303P465O814L26j0451p460k199M160Q190L117R69k650p168m775M1M887Q620
169F583K187l540n830n859K21L796N569M711j670n986n189j512M189N128K597
184E395k35m063l806k144J027M370L493Q75k209m796k305R26K639L841J883j411
200C480m188l580L91K630L943J965k131l395k616l16K308L442J370k67k520l404
216b888q84J637L072K151k06j729k928k004N37L029L078J216k237l655k055N25
232c341K927K588J148r03l144k322n80J939L522J218p18k555k089j073J038K321
248b4K560R04k210l142j506O31K373K212J283r05k754k457m95K488K565J578j155
$$ plain form
139 2439 12913 10053 7988 -691 -13063 -11353 -3417 8697 15776 6932 -1436 -8039 -10649 -3303
153 -3303 4162 10976 11302 851 -6609 -8808 -4648 3542 6659 7628 4978 -2190 -6965 -6924 -2037 6583
169 6583 8770 5230 -600 -6459 -6238 -2442 3127 7838 6168 182 -5007 -6519 -2330 2798 5395
184 5395 5160 1097 -2709 -4853 -3826 544 4037 4912 2703 -2093 -4398 -3472 -833 3008 4891 3480
200 3480 -708 -4288 -3897 -1267 2676 4641 2510 -885 -3501 -3817 -1509 1933 3303 3036 516 -2888
216 -2888 -3772 -2135 937 3088 2882 1153 -1775 -3779 -3242 -213 2865 4081 1844 -1811 -3866 -3341
232 -3341 -414 2174 3322 2419 -725 -3047 -3627 -1688 1834 3052 2334 -221 -2310 -3383 -2345 -24
248 -24 2536 3440 1230 -1912 -3418 -2787 -414 1798 3081 2176 -578 -3035 -3530 -1042 1523 3101 1946
265A946k060j979j164J456K102K039Kj285k662j306O43J936J910Q91o24k194k193
282b542L1J546K389R57q55j654j625n48O74J728K094j76j387j635j318P46J386
299a89J133Q04n55j387j557j43J339J515Q10l73j259j066q55O82J202J325l80
316A046l97j503o43M63Q32R92M04m85j235l22k08P62J036K85l79o42p79k79L86
335f66J053O34l21m19p70l04Q0P88N09L98m75r47m43K71L58Q56M7k66o20n43L83
356c97M92K67K70k47l62o71L3P35J3N57p3n57m96k55M51N25M62j60m36k36m77
377e62K24M61O21k03l64o25j46K87L71M26J7k35k93m17j62N11K15N06j23k12p85
398d88n4K82L01O26k38o2o55k52K39M67K76Q7l91j50k66J55K10L5J44j17j16k09
$$ plain form
265 1946 -114 -2093 -3257 -1801 301 2340 2342 1057 -1605 -2911 -2268 -332 1578 2469 1845 -349 -2542
282 -2542 -2511 -965 1424 2381 1526 -128 -1753 -2301 -1627 101 2195 2019 632 -1003 -2321 -1575 -189
299 -189 944 1748 1193 -194 -1751 -1894 -555 960 1770 1397 138 -928 -1783 -1101 101 1426 1046
316 1046 649 -854 -1497 -1034 -202 790 1194 709 -526 -848 -1056 -294 742 1027 648 6 -773 -1052 -666
335 -666 387 1021 700 281 -489 -793 -713 75 584 982 507 -440 -883 -612 -254 602 649 383 -237 -780 -397
356 -397 95 362 632 385 23 -648 -615 120 133 690 617 60 -436 -691 -240 285 747 587 151 -85 -562
377 -562 -338 123 744 541 177 -448 -594 -307 64 490 507 272 -21 -438 -600 -89 126 632 509 297 -488
398 -488 -542 -260 41 667 429 367 -288 -540 -301 166 442 529 138 -12 -278 -123 87 122 266 149 33 -176
420a76k84M54J11M42l37j0n83k48L70M59J5L63l35l05k19l53O47J69Q3Nj76n11
442d19N5K40J64J99J08N4n52j99K41J81J3J40j89q0m7k49K61L02P4kk98J40l18
465a81l8J59J51J06k73J1L4%o5J98j42J33J12j64j33N1K24j97K18k09p8J24K3
488F4P1R0l89j8J4K54k77Q4L61k56J98j85K29k55m2L00lj33K17m77K37O7o1M3
512A33q0n9r4Q1n5m2J35K2q9j58N3J93RQ8l21P8K22j15j21N7K41m99N89q8j41
537C9J36j13l55K73K22j26l67J48K85j56r8J94Lj19j17J06O0j15J3J5L2j13J75
560B2J22o6j77J58p7M2j65M06l19r1J16Ok5O5L1j92K26p5j80jJ26K8j17k02O61
585C22j79P3nn60L54k15L21j25j71p5L22j67K01R1j54N3Mj13K81j89l9j13M7m0
$$ plain form
420 -176 -460 -6 105 547 210 200 -383 -631 -261 198 213 576 241 -64 -283 -636 11 180 263 268 92 -419
442 -419 -364 -124 40 239 347 401 -151 -350 -109 72 85 225 36 -44 -91 -340 -79 223 297 295 -3 137 -181
465 -181 -219 -60 91 197 -76 -65 -31 -31 -96 102 -40 93 205 41 -92 -41 183 -14 204 -5 -83 41 64
488 64 135 225 -164 -182 -168 86 -191 -107 254 -2 196 11 240 -15 -57 243 240 107 324 -153 84 151 90 133
512 133 53 -6 -100 -19 -74 -116 19 41 -48 -206 -153 40 49 137 -184 -106 116 1 -120 -63 178 -321 268 180 39
537 39 175 62 -293 -20 202 76 -291 -143 142 -14 -112 82 85 -34 -151 -45 15 -100 -87 -72 -40 -153 22
560 22 144 78 -99 59 -18 24 -141 265 -54 -145 -29 -23 -48 17 48 -144 82 7 -173 -174 -48 -20 -137 -339 322
585 322 143 216 211 -349 5 -210 111 -14 -185 -260 62 -105 96 187 33 86 90 -23 258 69 30 -83 -36 -76
609g6O3J62l75K66k21J73J86P9k27l28J37M16l41qMJ64j89K87M8m22K19j8J04
632A03j93qN1M6L25l77n7nJ49j04j38M59m65L63j71j74J12J39J23j52J90j79J14
655A51j44r5L00r5j51N2m5NN1J12J63k17l26l6K36p9J45r3O7J10j6OR5q4k67J47
681hO0L5m22N00j27K59k66j14K38k58L69l68J80M4J74o8k26k69P9L45j17M1k27
704a46M92m47O6Q3k66K27R7R4k24k2J81j80k7j55K53j63P1m2P0j36K11J65k44
727d2j62N46j0m39K79l35N1K86r1j11m5N8q0j09L18j84J21KM0k49N53m44NQ9J54
752B01j54P7L8j31J81k21l0J07j3N1r1k30K21J31k49L2J97o2l14K23P7n3J55k00
776e7K99j24j50j67K31o7p7J34k11L96j68J26k96K1K74l87K27N4j8J19m71M3L11
$$ plain form
609 -76 -13 149 -226 40 -181 -8 178 257 30 -298 -161 255 -86 -94 -90 74 -115 172 220 -202 17 -1 103
632 103 -90 -98 -47 -1 324 -53 -110 -115 34 -70 -208 251 -214 149 -22 -196 -84 55 178 26 216 37 151
655 151 7 -88 212 117 -34 18 -27 -22 29 141 304 87 -239 -275 -39 -118 27 -66 1 111 95 101 196 112 -155 -8
681 -8 52 87 -335 165 38 297 31 -83 155 -103 266 -102 78 122 296 228 2 -267 -188 157 40 81 -146
704 -146 346 -101 -35 48 -218 9 106 200 -24 -46 135 -45 -72 -227 26 -137 -66 -108 -38 -174 37 202 -42
727 -42 -204 342 332 -107 172 -163 -112 174 83 -28 -73 -15 -95 -204 114 -70 51 53 93 -156 397 -47 -42 47 201
752 201 47 124 162 31 212 -9 -39 68 55 106 15 -215 6 137 -112 -80 117 55 -259 -36 41 -12 143 -57
776 -57 242 118 -32 -199 32 -35 -112 22 -189 207 39 165 -131 -110 164 -223 4 58 40 159 -312 -269 42
799D2j94K26n6K17k77J2p1J48j4LO6l31K48n1K25J8k85P7j97K45J3j05K29l28
823a40K48j85M0K6J07l8%j37k0J29o5N5j65J47J37j20q9J44K04l79L48j13P3j30
847G7Q0l2K12j14n82L22mQ4p5J16J32j05m48J21J23J20L36l17R5j30P8Qk28L39
871B08j88K28l82J46k96J48O0L5j37J25K19j89O5N4O4J36k86O8mj66K51k80L28
894B07l06j31M71l77k2M57k15J16l70j8J15J34j05Q3K05j95j55R5QO9K2m00L39
917B7m7J7RP9M5Jm84N63k22O4O9j63j27R4K09j73P1j52K8j2j73L82l02J83k2L2
943do3j50J99P8m7J65j24q6L73j94k09o5O3J16J92k66q2N9r1K08l42K02j36M05
967B01l43K02M0j73K78j60n4K48k17j75L57l32J61j15j58J36K75j03Q0j3m00M41
$$ plain form
799 42 -152 74 18 235 -42 -30 -101 47 33 36 102 -229 19 -32 193 211 -74 3 -194 51 64 -41 188 -140
823 -140 108 -77 -37 -11 96 58 58 -79 -99 30 -35 20 -145 2 139 19 -70 74 278 -101 247 134 207 77
847 77 157 125 337 223 -359 -37 -41 43 -32 84 216 111 -337 -216 -93 27 363 46 141 11 89 97 -131 208
871 208 20 248 -134 12 -284 -136 -76 -41 -178 -53 166 -23 42 96 160 296 10 78 74 -92 159 -121 207
894 207 -99 -230 241 -136 -158 299 84 200 -170 -188 -73 61 -44 39 244 49 -106 -11 -3 66 88 -312 27
917 27 -20 -3 6 85 130 131 -353 210 -12 52 121 -42 -169 -75 134 -39 32 -120 -92 -104 -277 105 -197 -14 -36 -4
943 -4 -67 -217 -18 60 13 178 54 -32 341 147 -62 -127 -64 52 244 -22 -104 -45 -136 72 -270 -68 -204 201
967 201 -142 60 100 -73 205 45 -9 239 22 -153 204 -128 33 -82 -240 -104 171 68 148 135 -265 176
989A76k78J71k2j28J60j09p6Q7J69j58K9K48k62j39m9L73k01r0K7RR2J48m08J19
1013a12k3J35Q1r5M3n6K00o6k66K28M1k89J95r2L4j80L42k76O4J61l1k23K47N2
1037A14q3p4l5o7J67R6p3J09j59K0J30K9J18qj24l08o3M09j40j35J22j66J85r7
1061c3J26n6O8j63J45J8k79K85k81K17m4R1m5k27O7K06m1k90L66L3k33LL1l01
1085c37K25J6J52M6k51Q5j21K02r7R7J29j02j0j4O9j4k55L33p3k15J61n7RK4k64
1110b62M03n78L43J18j45o5K60K13l15k4L3m4l2J06J09j5M2l67L11J62j55J79
1132B77j98o6m3J2l25K36J80j87K57j8p0l7J03l05K43j74j4l3J66K6K8L9l6j32
1156g1pK42n6k87K69k50K49r5j5K33k58J01k9q4K1J54J28j84j36J66j01p8K0J40
$$ plain form
989 176 -102 69 47 -81 79 -30 -106 -19 150 -8 21 269 7 -132 -181 192 -9 -99 -72 -63 29 177 -231 -112
1013 -112 -135 0 81 -14 29 -27 173 107 -159 69 110 -179 16 -76 -42 -222 120 -156 -92 69 38 -185 62 114
1037 114 31 -43 -78 -145 22 118 45 154 -5 15 145 174 292 284 160 -148 -211 198 58 -77 45 -121 64 -33
1061 -33 93 37 105 -58 87 105 -174 111 -170 47 3 94 49 -178 -111 95 54 -236 130 163 -70 -67 -36 -337
1085 -337 -112 -96 56 102 -149 -64 -185 17 -80 17 146 44 34 20 89 75 -180 153 80 -135 26 -31 -22 2 -262
1110 -262 141 -437 -94 24 -121 -186 74 287 -28 -52 -19 -63 -95 11 120 105 147 -220 91 253 98 277
1132 277 79 13 -30 -18 -343 -107 73 -114 143 125 55 18 121 -184 59 -115 -129 -162 4 30 58 97 61 -71
1156 -71 -78 164 108 -179 90 -160 89 -6 -21 212 -46 55 26 -58 -37 117 245 61 -75 91 -10 -88 -68 72
1180G2j44j22m6J59J60k3q1j50O1M37m00j62R6Q2LJ72k98J63j61K72M8j87j90
1203b39J96K46k72L35l74J26K98l98l4K68p7l38K06J98j30L3j09J93j2j71j76
1224b31J50Q8P7k28M4R3j19K22k61P7k03L72K7K21l61J11n0j00M0K6J05J15k74
1247e9K11k02m7j01K32J12l79J49J86O4j44L7j90L8O7P7j02L28m71M09n95N51
1269A71l64K68m84N26O0j37nJ58j6j95l7J8j65K73j47L08q6l74K89j83K08j35
1291d9n8r0K88k32K77J62j38j68p4R4o1M7l1P5J84k05J59l07k4J18nPK13k74K52
1316A60n8q8q0L79k60j45O1L50m80n9J90J60Q5j11k0o4l0Rj54J20j55J46j7r5
1340a56K04j66Q5l7O1j04R1o8J18j06K29p4J27j38NL9L1n4j74J15j35J08K42l80
$$ plain form
1180 72 -72 -194 -240 -81 79 56 -25 -175 -114 323 -77 -239 -143 -61 -58 114 -184 -21 -182 90 138 -49 -239
1203 -239 -43 203 -69 266 -108 18 316 -82 -116 152 75 -263 -57 141 11 44 -65 128 116 -55 -231
1224 -231 -81 7 84 -144 -100 -7 -126 96 -165 -88 -291 81 108 329 -32 79 29 -71 -31 -5 100 215 -59
1247 -59 152 -50 -97 -198 34 146 -233 -84 102 166 22 59 -131 -93 -26 51 -51 277 -194 215 -380 171
1269 171 -193 75 -409 117 177 40 35 193 177 -18 -55 -37 -202 71 -76 232 146 -228 61 -122 86 -49
1291 -49 -107 -197 91 -141 136 298 160 -8 -82 12 -49 -2 -33 42 226 21 180 -127 -151 -33 -38 -31 182 -92 160
1316 160 102 14 -66 313 53 -92 -31 319 -161 -220 -30 130 215 104 84 20 -10 -1 -155 -35 -190 -44 -61 -156
1340 -156 48 -118 -33 -70 -9 -113 -22 -90 28 -78 151 77 204 66 71 110 141 87 -87 28 -107 1 243 -137
1364a37Q0J07q9K52k00j78K05l2j17L5k53M09L9k56O6L62l15O3n3J34J19l36K84
1387A89k63J02l50M69O5m84L52k86M59m5l03J26j61L01l34J5L2K18j8k44J00l05
1409c65K65J3K8R2l4K67j10k36J80l19L86j45j57P9J38j3J19l08L1p5N8J10JJ04
1433A09r7L13q2P6o07J9K68P8jl91L91k90N43k79J12k14K71m83J82O7j01J30j14
1456a00K9J40j28J54l3j79J06o8K55k45RJ2k17J27J5K46j74J15k82m6L0m1M44
1479A69j87k17N05l79L02l10J10K53k47o2J45k72N12J48m91j45J40K82m08J65
1499A3k11M44l74J29L00o70L89L8J56k15K58l34M5K46k38J85k78J97K9l48K04
1520c5J24k79M65l70J26R6k95NL84m49J78J00j54L8r6J87k95L65J09r6j21o0p9
$$ plain form
1364 -137 -57 50 -39 213 13 -165 40 8 -109 -74 -327 82 121 -135 -69 293 -22 41 -12 122 241 -95 189
1387 189 -74 28 -322 147 212 -272 80 -206 253 208 -95 31 -130 171 -163 -148 -116 102 84 -160 -60 -365
1409 -365 -100 -87 -59 33 -1 266 156 -80 100 -219 167 22 -135 -56 82 69 188 -120 -89 -164 -106 4 5 109
1433 109 12 325 243 319 -288 -269 -1 77 76 -315 76 -214 329 50 162 -52 219 -264 -82 -15 -116 14 -100
1456 -100 -71 69 -59 95 62 -117 -11 -79 176 -69 -60 -48 -265 -138 -123 123 -51 64 -218 -264 -234 -275 169
1479 169 -18 -235 270 -109 193 -117 -7 246 -1 -63 82 -190 322 470 -21 -166 -26 256 -152 13
1499 13 -198 246 -128 1 301 -369 20 58 214 -1 257 -77 -32 214 -24 161 -117 80 109 -239 -35
1520 -35 89 -190 275 -95 31 127 -168 -163 221 -228 -50 50 -104 -66 -162 25 -270 95 204 108 -13 -73 -152
1543a52R7j64k8P9r1L49j47L16k31lj00M5j16M7K84k28j10J52m5n1P9J50k04j30
1567b02L91k22K34l26J33j39K54k02K1q4M82n54J44P9j35J08Nk27L59m98K68J00
1589a1J11m09L76k2j7m4K30k70L0j23K5L33k65p1K96j55K6J11j82L1o7L32j65
1612A00O7O4l76K55l10J90k83M58l23j35M17p7K2o3P4m06M49j59n0j27K72j73
1634a14Q6k47j8K44J33j17r3Q2l76O09n85M48O3N9j64J68Nk36r1J86O1J3J1j88
1658f1K53m9mJ31l01P7O3k65K63j66j03M27O9k55m3J04k57K96k74L1q5J67J2k91
1682b61J27K74q4k26O2R9L0m3Rj58L86L3j97J78m31K30qJ77j98n4Q3J6j96KK91
1707A41m23J24j53M66k09K25k54N1J47j58o0m8J31J60p8J3k0J12m39N08l29L5
$$ plain form
1543 -152 -55 -219 -247 -168 -259 90 -57 259 28 25 -75 -30 -146 -99 185 -43 -153 -1 -46 -97 -18 132 -72 -202
1567 -202 189 -33 201 -125 8 -131 123 -79 -58 -142 340 -214 -70 9 -126 -18 -13 -240 119 -379 -111 -11
1589 -11 100 -309 67 45 28 -16 214 -56 -26 -149 -124 209 -56 -127 169 14 40 151 -31 0 -67 265 100
1612 100 167 231 -145 110 -200 -10 -293 165 -158 -293 124 47 69 6 80 -326 123 -36 -86 -213 59 -114
1634 -114 -28 -275 -293 -49 84 -33 -126 -44 -420 189 -396 52 115 174 10 178 183 -53 -144 42 103 116 127 -61
1658 -61 192 143 139 270 -31 46 109 -156 107 -59 -162 265 334 79 36 140 -117 179 -95 -64 -149 18 30 -261
1682 -261 -134 140 56 -170 -108 -9 21 -22 -13 -171 215 248 51 229 -202 28 20 197 -1 -55 28 44 -152 -150 141
1707 141 -282 -158 -311 155 -54 171 -83 -32 115 -43 -103 -151 -20 140 62 75 55 167 -272 236 -93 -58
1729e8J51j29j8j55J04J34OR5L9k76p0K93j53k24L42J26j25O2r3q6q7j79L68j98
1753a31K67j92R3j56K98k50J2J76j18l2l5J43k1Ll70M10m5k12J97J57l1k45m0
1776a22J79k96J30K45k74J74J41j86J19j13J0K03j64M3n3j41r7J55J65k32J77
1797F3k8L6j26J65j84L5M6K04q3j33m9M3K09L8n65L97q0j65L02j17J4q4O1j08
1821a09J98j73k60K41M77l56J27k74M01m81L76j91J70K3m5j04n6K80p70O97k86
1842a15K29M6r4k0L0J92m99K7J52J0J95J9OP9r5l20o4N5O7K56j39N6j07o5K89
1867A90m50K90j76K32j32J65N1J03k91k23R4R5j07J98J75k27k03M73l58R1J63
1888A53l37J77J56K6j97l15J39m4M84p1j9j59K15Mk6k78J19M2k31K83j97k1k1
$$ plain form
1729 -58 93 -36 -54 -209 -105 29 35 130 169 -107 -177 116 -37 -261 81 207 82 144 51 -35 -122 -301 67 -131
1753 -131 136 -56 37 -119 179 -71 -59 117 -1 -33 -68 75 54 57 -313 97 52 -160 37 194 163 -82 -122
1776 -122 57 -239 -109 136 -138 36 177 -9 110 -3 7 210 46 89 36 -105 -202 -47 118 -114 63
1797 63 35 71 -55 110 -74 -39 7 211 128 -5 -54 -11 198 236 -329 68 -12 -177 125 8 22 -62 -1 -109
1821 -109 89 -84 -344 -103 374 18 145 -129 272 -209 167 -24 146 169 124 20 -36 244 -526 171 -115
1842 -115 114 160 66 46 76 268 -231 -204 -52 -42 153 172 178 257 162 -158 -222 -167 -100 156 17 73 -34 -99 190
1867 190 -260 30 -146 86 -46 119 170 273 -18 -241 -147 -52 -159 39 214 -13 -216 257 -101 -10 153
1888 153 -184 -7 149 175 -22 -337 -198 -242 242 171 152 -7 208 212 186 -92 27 69 -162 121 -76 -97 -118
1911a18J43j15k4L6K09q0K87l96J21p9l1P7j35K3J10Q3or3R5J83m87J00j53J11
1935a39lJ96j91J96kj43K23q0j78J63q5m2L50J64m97q8p7L19k38J13k6Q7J11M0
1959A73m35Q5K72j84J01J86p6j53k34L00j75R2R1J28l12l0K26j47K98m38K97O7
1981A32o11M00o6J66j18J19o3j3l15M12k7j7M5M5r3o6J08O0k52J08R3o9L12k08
2005H2r0m1J86j89R1r0K42n07L01rk37K19l0j41L48l7q5r3N0J61L5j72N4K99n00
2030a53L29j58l1nj84K00J28k90j3K27j34J52k3k9n4j04Q9j85NK23k67L99m20
2053b98L97k7j37N0j35K04j26K60l16l4kJ49J45o2P6l71N09j23L7j10k92K65p9
2076b0J56k05L4K72k04j33J29j34J76p2J32j33j57K45k11J39J3k6j05K32j53j2
$$ plain form
1911 -118 25 -90 -114 -78 131 51 338 -58 63 -16 -47 30 -105 -82 28 111 105 12 107 290 -197 -97 -250 -139
1935 -139 -142 54 -137 59 57 -86 137 57 -121 42 -43 -85 265 429 -68 -156 -233 86 -152 -39 -65 22 133 173
1959 173 -262 -177 95 -89 12 198 122 -31 -265 35 -140 -48 43 171 -141 -171 55 -92 206 -232 65 132
1981 132 -479 -79 -145 21 -97 22 -41 -54 -369 43 16 -1 44 89 -4 -70 38 98 -154 -46 47 -22 290 82
2005 82 -8 -49 137 -52 39 -51 191 -316 -15 -24 -261 -42 -72 -213 135 98 13 -80 -30 131 166 -6 48 347 -153
2030 -153 176 18 -13 -18 -202 -2 126 -164 -177 50 -84 68 45 16 -38 -142 -53 -238 -233 -10 -277 122 -298
2053 -298 99 72 -65 -15 -150 54 -72 188 -128 -162 -164 -15 130 68 144 -227 282 159 196 86 -206 59 -20
2076 -20 136 -69 -35 237 33 -100 29 -105 71 -1 131 -2 -159 86 -125 14 27 1 -104 128 -25 -37
2098c7l7j82J47N7j82J46o4LM23l27n6J07j33L21R0l36K43K7j47LM6k30J21p3
2122g0o1K50k34J15R7j2j26j36O4J35q1qn4J10K75j67J04k84J77j01K64j57o6
2145C4j01J13k1k34j94Q31l81k26K08r6K1R5j35m1M7Q2K22o2m54K02M06k80J19
2168A55j85K26m87K76m8K02JKk15q9J7P0K9K01j06ok2l16O66m02j3j51L27j78
2192d6O6q7j18K80J79k35k33l8K07J20j82m3L18l13N48k73l84J28r8L68p2j87
2214i5j24R5qK98l01K7j5j87O11p8j06N2J93l77M5j08J3M1j00K47r8j22l24M75
2238E4p1j55K81l9m1k04K11K1K6M7l01K43P0j60m9Q0Q7l50L39j07k37N54n0l79
2262a30K34k62K4K7J87Ql36R5J74j2j96L52q0j46Q2K10o01K47N5k16K91O9J44
$$ plain form
2098 -37 -74 -256 -109 -52 -234 -88 -152 -149 274 -53 -109 -2 -135 186 276 -60 183 210 63 66 112 -118 3 -70
2122 -70 -131 119 -115 0 97 85 -41 -177 -113 22 -59 -67 -121 -11 264 97 201 -83 94 -7 257 100 34
2145 34 -67 46 25 -209 -403 428 47 -179 29 -67 -46 49 -86 -127 -80 2 224 162 -292 -90 316 36 155
2168 155 -30 196 -291 -15 -63 139 140 142 -73 -162 -145 -75 -46 155 49 43 21 -295 371 -31 -44 -195 132 -46
2192 -46 20 -67 -185 95 274 39 -194 -232 -25 95 -87 -130 188 -125 423 150 -234 -106 -204 164 92 -95
2214 -95 -219 -124 -132 166 -135 -108 -123 -310 301 223 117 169 362 -15 30 -78 -65 -24 -124 123 25 -97 -421 54
2238 54 -17 -172 109 70 29 -175 36 57 83 130 -171 72 142 -18 -67 13 100 -250 89 -18 -255 299 249 -130
2262 -130 104 -158 -134 -107 80 88 -248 -153 21 9 -187 165 85 -61 21 231 -370 -123 -68 -284 7 76 220
2285B20k27N0j99K95k29k81M78J4j09J11r7n5N9M7j48J3K36q3R3K05m44L3M2j28
2309a04j05J32pN2R8k02M60k62J98k32r6K6J26j14j03J81J66q2J5j32K61k93l8
2332e5L1rn4J20J31lQ4j90j73J86N1o7r4L9L7L53k26k24j16J49K7k46M68k82o3
2357a26L2O6K16j24L4K01m97L15j21j72J32p5K06L7j58O2m7k06K94k23J75M1j02
2380d0l1R7k60K55J98j78p3J48r0l09K47J77l50M40j42j8k56J42L61m28m1L20
2402A69j98Q4k58J84j90L60k5j86K40j10M1k56K08k32K74k52M00l54k0J68q2K76
2424B41j88O7j04j98J08k5J95K07n00j29K88k41L86k25L05j28O9k11L74l33M4
2445Bm4o3J71p2J26K6o1j13J57j68Q5j29K42j89K76k51J42k7k12J62j54N3j15
$$ plain form
2285 220 -7 43 -156 139 -90 -371 107 121 12 123 26 -29 30 77 -71 -58 178 95 188 393 -51 -18 24 -104
2309 -104 -209 -77 -84 -32 66 -136 324 62 260 28 -68 -42 84 -30 -133 48 214 132 147 15 276 -17 -55
2332 -55 -24 -33 -87 33 164 161 245 55 -118 68 119 52 -42 -3 34 387 161 -63 -179 -30 -3 -249 219 -63 -126
2357 -126 -94 -28 188 64 98 299 -198 117 -4 -176 -44 -119 87 124 -34 28 -19 -225 69 -154 21 62 -40
2380 -40 -71 26 -234 21 219 41 -32 116 26 -283 -36 141 -209 231 89 71 -185 -43 318 -110 -151 169
2402 169 -29 55 -203 -19 -209 151 126 -60 180 70 111 -145 63 -169 105 -147 253 -101 -121 47 -35 241
2424 241 53 120 16 -182 -74 -99 96 303 -197 -326 -38 -279 107 -118 187 59 128 -83 291 -42 2
2445 2 -42 -105 66 -6 120 146 85 -28 129 -39 46 -83 159 -30 246 -5 137 110 -102 60 -94 -41 -156
2468a56K17nL3k98J36J09J05rj29j4J38k33J25j75M0J58k2K56l73M3j48o2L69
2491A05n2k19K56J4j83K84k00j94J15K32J47k40m0K57m64K37l50L02R1o7J08M3
2513A82l52L9K92l16J40j6Q5k27K92j69k84O06j54k61L20n58M33K6j44J9O1O8
2535H2L1R7l24q9K97J82k45j27j59J21P7r9Q6l4j6J17OJ58k42K36j14N4k15J53
2559C3J01k53J87J45k25J76k37K69k88N2j10K06k10K48q2k38K80r8pJ34j33k2
2581g2J76k29J25j3J7n9j14J65L2J95k71k66K61L83m37J87j56J09K0Q8m3j0l90
2604c02M85Q4l55j73J65K25k71J91K94k68n7q6J0M0j37J41j07M50j82o5K21m70
2626a67P8j11J10N8R7j93r4L29n0O7k15J9J30P3k66N0J34j31j40J07J06M2J25
$$ plain form
2468 -156 61 56 89 -209 -73 36 141 132 3 -11 127 -106 19 -156 -116 42 20 276 -97 -54 -202 -264 105
2491 105 53 -166 90 104 -79 205 5 -189 -74 158 305 65 25 282 -182 55 -295 7 98 31 139 182
2513 182 -170 -131 161 -155 -15 -31 54 -173 119 -50 -334 272 118 -143 177 -381 52 78 -66 -47 14 82
2535 82 113 210 -114 -203 94 276 31 -96 -255 -134 -57 -156 -70 -104 -120 -3 3 161 -81 155 41 95 -120 33
2559 33 134 -119 68 213 -12 164 -73 196 -92 -40 -150 56 -154 94 12 -226 54 -44 -51 83 -50 -72
2581 -72 104 -125 0 -13 4 -55 -169 -4 28 223 -48 -314 -53 330 -107 80 -76 33 53 141 98 88 -302
2604 -302 183 267 -88 -261 -96 129 -142 49 343 75 18 -68 -58 -18 -155 -14 -121 329 147 82 303 -167
2626 -167 -89 -200 -90 -32 65 -128 -222 107 57 124 -91 -72 58 131 -135 -85 49 -82 -222 -115 -9 33 158
2649A58k54J76Q8k30J98j51M8J8j86L14l50K92j8J48k80L74k25P3J57m39l3L64
2671B42k61R3l3k71K84j10M19l60M4k74O0J10J94k21J85P3k43M8J87j32j0j76
2693a52J58l4KK5j42P4J10l07K58K22j34O8l18J73J42j49J12p5O7n3K73k19J43
2716B44j97J77j70j46j77j7M03p4J70k48l0L7N9J21J36k26P6l41L42j26J20m52
2738c19K15R5J29m2r7J49l67J62nrN5J64k41l8J1K50m33N16M8m08M34m72J27j35
2762b11J82j49J01K57m91K85J39J4j01O0j8L8j16Q4m6j09J23k23K61j79o9N2L31
2785B15j22j00M3j1K4j60J68J32Pm16Q3J40%K65j07k24J53P7k01K75j82J13O3
2808B35k54N2L6m6r8L32m43K48k11L40m6q8l6j45J15q7J64J76k92j82K55M7Pn3
$$ plain form
2649 158 -96 80 168 -62 136 -15 33 51 -135 179 -171 121 103 251 -29 345 120 193 350 -89 -122 242
2671 242 -19 74 41 -230 54 -56 363 3 47 -227 -167 -57 137 -84 101 174 -69 -21 166 34 24 -152
2693 -152 6 -28 -26 -1 -143 -69 41 -266 -8 214 80 148 -170 3 145 -4 108 33 100 47 320 101 244
2716 244 47 224 54 -92 -269 -286 117 43 213 -35 -65 -28 31 152 288 62 138 -203 139 13 133 -319
2738 -319 -104 -9 120 78 -19 130 -237 -75 -80 -89 -34 130 -111 -149 -138 112 -321 195 243 -165 269 -203 -76 -211
2762 -211 -29 -178 -77 180 -311 -26 113 127 26 86 68 106 -10 74 28 -81 42 -181 80 -99 -168 -116 215
2785 215 93 -7 36 25 49 -111 57 189 196 -220 -137 3 3 268 161 -63 90 167 -34 241 59 172 235
2808 235 -19 33 69 23 -75 257 -186 62 -149 191 145 57 21 -124 -9 -96 68 244 -48 -230 25 72 79 26
2832B6j50K87L2j59m2j59J80k3k49J36k24L78M6k71N76k52j01j12J05R9j40K59
2854B42j69j44K45j98q5R3k09K1Q0K8L3J01l05K60P6r2M60l03k07nk60K91o4J53
2878D2o6q4M7j01J29k70J81J29rJ57j88j03j2M41k12j97J00J04j12k11L17k91
2900b09L50P5p1l58J44J04n8j5j54M3N5j00K59N8k29M3j89L46NKJ33l15K54N6
2924B29j13q6j49J30j82j22J45K09j46J34j41K81r0k80J01J49M1k46J48j23Q5
2945b6J25j07M6k38J50q7J54J18q4J99k73l1k0J07L8n3j43p3J87j31L47j16j97
2968a08N1j02J78Mj25L5j90L27m1J69m11M7J98N5j92J2q8K52k31J92j26J43P1
2991A20j02J00l20L67j21J48n7p9L4r9N6k66N5L34j74K22j15l21J47p0N41n42
$$ plain form
2832 26 -124 163 195 36 -6 -165 15 -8 -257 -121 -345 33 79 -192 384 132 31 -81 24 123 -17 242
2854 242 73 -71 174 -24 -109 -16 -225 -204 -124 -96 -63 38 -267 -7 69 -23 437 134 -73 -78 -338 -47 -111 42
2878 42 -24 -108 -61 -162 -33 -303 -122 7 -2 155 -33 -136 -148 293 81 -116 -16 88 -24 -235 82 -209
2900 -209 141 216 145 -213 -69 35 -23 -38 -192 -149 -94 -194 65 123 -106 -63 -252 94 99 101 234 -81 173 229
2924 229 116 30 -119 11 -171 -293 -148 61 -85 49 -92 189 99 -181 -80 69 110 -136 12 -111 -26
2945 -26 99 -8 38 -200 -50 -137 17 135 51 250 -23 -54 -74 33 71 18 -125 -198 -11 -142 205 89 -108
2968 -108 -57 -159 19 23 -102 -67 -257 70 29 198 -213 -166 32 87 -105 -93 -181 71 -160 32 -94 49 120
2991 120 18 118 -202 165 44 192 135 56 90 -9 47 -219 -164 170 -4 218 103 -218 -71 -141 400 -142
3013a42J54j92K55J66l2j68J5k99l0M33M4l66L12O5j34J18j07O3j53KR7k13J16
3036Dj37J21K88j12j55k9K6j34K30l6k42j75M65o1j30L00l42P9r3L20j35k32K36
3059E6j96J30J38k04K19l93M13J57n37J00K05n9J97j40O6j07n2o2J45m1j02K06
3081A39l40L16J75k99l49O04q8K1q7K27k66J2n0Q0j38J81J21k29j51J2j20o0L90
3104A01j19Rj81J8J93j84P3K45k61k24K32q0K38J06m4Oj79J29K0J3k81M87m86
3127a69J93J04j7j55J2l3J22q3P8J15Q9j87p7j69k19L96R1j20k7J61m3L5q3l9
3151b5j4K6m9N4j25J36l9J2k08J81J94j30J08Nl8j73l8J29L7m4P6q2p8K76k24
3176c3Q1m35N15j17qj22K32n8M0j3l02K12J15j13q7P1N6J38k42J31m23K20m5N4
$$ plain form
3013 -142 12 -180 75 241 209 41 56 -243 -273 160 204 -162 150 215 81 199 92 155 2 4 101 -112 4
3036 4 -133 -12 276 164 9 -20 6 -128 102 66 -176 -351 114 53 -77 223 -119 -40 -133 187 52 -180 56
3059 56 -140 -10 128 -76 143 -250 163 320 -217 -117 88 29 226 86 152 45 -7 -69 76 35 -67 139
3081 139 -201 115 290 -9 -358 246 158 179 92 319 53 65 15 95 -43 138 259 30 -121 -109 -229 -289 101
3104 101 -18 -9 -190 -172 21 -163 -90 155 -106 -330 -98 -178 60 166 122 128 -51 78 98 111 -170 317 -169
3127 -169 24 128 111 -44 -32 -65 57 -26 52 167 256 69 -8 -177 -396 0 91 -29 -56 105 62 97 14 -25
3151 -25 -39 -13 -62 -8 -133 3 -36 -24 -232 -51 143 13 121 126 88 -85 -123 6 43 -1 75 -7 -85 191 -33
3176 -33 48 -387 128 11 3 -119 113 55 95 82 -220 -8 107 -6 -93 -22 34 172 -70 61 -362 -142 -187 -133
3200a33J99n7j06j60P7KK79k83K96j23J09k84K39Q1o1J44j64j24J20P2K5k29J82
3223A01k50J89J42l02L40j52j0ko6L0%j01L23rr9r2J77k87jK4p3O4j08J34n4K21
3249A39o3q7j16J88L8ml0m14L14J47k00L23j93j68R1L73k92J01K37n11M45j79
3271A39m7o5nm8Q7J85O9k90j5J12j35J2J60r5l2L37m91K02l9k65L27l13J94J48
3295A32m63M40P3K3j91K06j6l18N0J75j03J41J5j78k57J45L06m7j02J25k90k00
3317c34J84q8L4Q8Q6K34q2M4j92L15l69nK01q7j94Q9N6k73J12J45j54K92k04K78
3341A76l36q3K41o7o2L42lj01j21K23j24j71J90Lj13K19j4k01O0j83J47Jj7l9
3365c3J38j86J01k86M24j46J01k98K41J1M3k92L24j68Q9m3J9J1j41O8J75j32J28
$$ plain form
3200 -133 66 9 -97 -257 -180 -178 101 -182 114 -9 100 -184 55 136 75 219 55 -69 51 123 148 -81 101
3223 101 -149 40 182 -120 220 68 58 56 -10 20 20 -81 242 233 134 42 219 -68 -69 -45 -118 -54 -162 -28 -82 139
3249 139 76 -11 -127 61 99 95 65 -349 -35 112 -88 235 42 -126 -35 338 46 147 384 -127 318 139
3271 139 92 27 22 -26 61 246 315 25 10 122 -13 -1 159 64 32 369 -122 80 41 -224 103 -210 -16 132
3295 132 -331 109 182 205 14 220 204 -114 -64 111 8 149 164 -14 -271 -126 180 133 31 156 -134 -334
3317 -334 -150 -238 -204 -116 -30 204 122 166 -26 289 -80 -85 116 29 -165 -76 -20 -293 -181 -36 -190 102 -102 176
3341 176 -160 -243 -2 -69 -131 211 208 107 -14 209 85 -86 104 107 -6 213 199 -2 58 -125 22 23 6 -33
3365 -33 105 -81 20 -266 158 12 113 -185 56 67 110 -182 142 -26 63 20 39 50 -91 -23 152 20 148
3388A48n0j25J22j20K27K2k69J26M6p9K03o25K99N6n4J33k6L9j13k30J48L06m46
3411b62L55j1M7k18L28j28k6j82J50j92J38J0j6rJ86k12J39k89P9K15n7J82j45
3434H2J16O2j19r7Mo5J68J5r6j81R3J23J30l31J79n0K79k51K0m5L0rk13M6J06
3459dn9n7M82k51l25J64J52M1o01L84rj41L86l27J91r6N5J43J02m36L63p8q7J24
3483A16m34K82J8K79l08O4K32j89l07M24k86r8J82J69jj22r2l6L72k02Kr5m0J58
3507H8K57l79n4R9j90L75k59N7k29M07J15m34J50J59j20r5M3J62k54L3R3P5k96
3530a97Q6R8jo5j0Q6J75l71o7J04R0M90m95j96K29L18k62j73K19j18K1P7O8j21
3554a5Q1J37m9k75l1K45j51j85L10j0p4n6N9k8J58Oo8J08k25L5QJ34k35L12m15
$$ plain form
3388 148 98 -27 95 -25 202 224 -45 81 127 48 251 -374 -75 -19 -73 60 34 73 -40 -270 -122 184 -262
3411 -262 93 82 129 -89 239 111 85 -97 53 -139 -1 9 -7 -16 170 -42 97 -192 -113 102 45 227 82
3434 82 198 260 141 44 48 -17 151 166 70 -111 -18 105 235 -96 83 33 312 61 81 36 66 57 -156 -110 -4
3459 -4 -63 -120 362 111 -214 -50 102 143 -458 -74 -83 -224 162 -165 26 -70 -15 128 230 -206 157 79 -8 116
3483 116 -318 -36 -18 261 -47 17 249 60 -247 177 -109 -207 -25 144 143 21 -71 -107 265 63 65 -30 -70 88
3507 88 345 -34 -88 11 -179 196 -63 -6 -235 172 287 -147 3 162 42 -53 -10 152 -102 -69 24 99 -197
3530 -197 -111 -13 -14 -79 -89 -3 172 -199 -266 -162 -72 418 -77 -273 -44 274 12 -161 58 -60 -39 38 106 -15
3554 -15 66 203 154 -121 -152 93 -58 -243 67 57 -17 -73 -14 -42 116 122 54 162 -63 -28 -20 114 -121 191 -224
3579b24K31L38l80R1j68J31j07j39K58l58J19J73L7J06n1l07K82o2N7J56j25j02
3601d4K15k2k72K69k00L0o0J88j87l0L31k7k33K56l09J29N1k39j96J93J66QM3
3624F0R6j00k47J07J34K01j45oJ53k90J68k45R6n9J13P6j9J50k73L91m16p5n3
3647a83L20j60n3%kq1nJ50j82K05J3l00N14l28k8K72j95k95L39J7O6j57J23L9
3671H9j14j03N3M14k58j22j50N86l47j75M03k13j87r9K45N0j32K34j67R4l25L52
3693A28k83%J64L3k57L42l23K49N8j48K36J28l49q5Q8K31l72K46j03R3k00m7J
3716a70k2N8K80m2j05p8n7J44k93M15P1k34J87j07k30Q9J00o0q7J11N9L8k0lk24
3741a80M18l22j81R4K06j71J43J00j27MO4p0j53K35p3j83L37n1l05L41k7j0j26
$$ plain form
3579 -224 7 345 -35 56 -112 19 -88 -227 31 -327 -208 -35 2 108 57 -250 32 -30 27 183 58 -44
3601 -44 171 149 -123 146 -54 -24 -84 104 -83 -113 218 191 -42 214 -95 34 85 -154 -350 -157 9 17 60
3624 60 156 56 -191 -84 50 251 106 100 253 -37 131 -114 -18 -77 36 112 93 243 -30 361 -55 -130 -183
3647 -183 137 -23 -76 -76 -78 -159 -164 -14 -196 9 22 -278 236 -92 -120 152 -43 -338 1 18 84 -73 50 89
3671 89 -25 -128 -75 339 81 -41 -191 395 48 -127 276 63 -124 -223 22 72 -60 174 7 101 -224 128
3693 128 -155 -155 9 42 -215 127 -196 53 111 -37 199 327 -22 -107 -19 212 -160 86 -17 76 -124 -171 -170
3716 -170 -192 -134 146 104 -1 -79 -136 8 -285 130 201 -33 154 47 -183 -94 6 -54 -141 -30 29 67 47 44 -180
3741 -180 238 -84 -265 -171 35 -136 7 107 -20 -16 48 -22 -175 60 -13 -196 141 90 -215 126 99 89 -37
3764c7k5R4N6l57M73rj02O5k27O3k0r4J96k06J92K73l67k07K30m0J60%j96l39
3788d24N98k25J84m4Q0m00M71k19O9l0J14j26k40K47R8j09M0k7r0P5j8m7j11K02
3812F8r6j9QJ70j35K47m18K79j7O8k47m11O57k16J0K08k83J02j6q3J51o0J82r0
3836E9p2m6j23L75o2j60j59p3J66J94j48j28K05lJ21k07L23M7k64j58j6K58j02
3859B7j5K30l55j90K54K5n1J07J35m0m37L99J26k93J22R0n3%M6Q5k14M2J99j88
3883E1k37J9j45M6M60l67J80J73l88L82l67Q3Q4K19l05J09k22J23M0q0J76O8j65
3906f3l2J08m3N0J75j5L6j99J93l97Q3K60j08o9n6M8j61L76m04M05l06K44k40
3929a15l6p4J95NJ20j91o4K21p2r5n1J73r8L95k50n9l3j00Q6J86j86P4j96Q4L0
$$ plain form
3764 -37 -62 32 88 -269 204 195 93 158 -69 -6 -26 -120 76 -130 62 335 -32 -239 -9 -49 111 111 -85 -424
3788 -424 174 -51 133 89 169 -231 240 21 90 60 174 48 -192 55 153 44 84 57 -33 42 24 -23 -134 68
3812 68 -28 -47 -39 131 -4 243 -175 104 87 155 -92 -503 154 -62 -52 156 -127 -25 -41 -124 27 -33 149 59
3836 59 -13 -59 -182 193 131 -29 -188 -261 -95 99 -49 -177 28 25 146 -61 262 309 45 -113 -129 129 27
3859 27 12 242 -113 -303 -49 -24 -75 32 167 127 -310 89 215 -78 44 134 81 81 127 212 -2 40 239 51
3883 51 -186 -167 -312 -266 194 -173 7 180 -208 174 -193 -110 -26 193 -112 -3 -225 -102 -62 -142 34 102 -63
3906 -63 -95 13 -30 20 195 180 216 17 210 -187 -104 156 48 -21 -77 -29 -190 186 -218 187 -119 125 -115
3929 -115 -151 -225 -30 -25 95 -96 -160 61 -11 -106 -157 16 -82 313 63 4 -29 -129 -43 143 -43 31 -165 -81 -51
3954e1L09j85L0j33Q1k22O6J97l25L39m1j14j44K08p7j16J24L7n0j08L9k72L87
3977b1J77m48J39K72J19m40K57j46J74j16P0Q5j82K62j08j01K6k48K20n9J53l36
3999b51K53J84k3j60j59L65k08J9J49j59k2l8r8p5K81j00M4j37J31O0l74J30j08
4022b96L76k39J58K2J9n6J82j68j25oQ8K3K18r6R4n8o2j49n6K62N1l67m2R5M24
4047B92j28k46K78k93J81P6m25K83M3k02M8J02q5j63L27m3j11k27K88q3m1J87
4069E8k14J54K34j58J02m81M58o6mJ8l30M61pk03j79K14j3J19l21K09j66J39j98
4092a74p4K85P9m5k25j8J79P6M7j28l41J60Q8K88l01K58m0p3M5k93L69k46K18
4115A34k46J82P8l91K09J0Q5J86l05j64L84j46k12J74j19N33m53l21O07p3m53
$$ plain form
3954 -51 258 73 103 -30 51 -171 -105 92 -233 106 65 -49 -193 15 -62 -178 -54 -17 -67 -175 -136 -408 -21
3977 -21 156 -292 -153 119 238 -202 55 -91 83 -33 37 122 -60 202 94 -7 19 -229 -9 -68 85 -251
3999 -251 2 186 163 3 -156 209 1 20 169 10 -12 -50 -148 -223 58 -42 2 -135 -4 56 -318 -188 -296
4022 -296 80 -159 -1 21 40 -16 166 -2 -127 -133 -45 -22 196 100 194 136 74 -75 -131 131 182 -185 -227 -132 292
4047 292 164 -82 196 -97 84 160 -265 18 61 -141 -93 9 -76 -239 88 45 -66 -293 -5 -88 -129 58
4069 58 -156 -2 232 74 176 -305 153 87 83 101 -229 232 225 22 -157 57 44 163 -158 51 -115 24 -174
4092 -174 -248 37 116 71 -154 -172 7 83 130 2 -339 -179 -91 197 -104 154 114 41 86 -207 162 -84 134
4115 134 -112 70 148 -243 -34 -24 61 247 -58 -222 162 16 -196 -22 -141 392 -61 -382 225 152 -301
4136c01K22J89k38k0K07J37J46k73J62R0l21M5m3j24L39l76K85j47%R6J56m4j67
4159B0R2j18k41K09p8k4pJ54l6K4j29J13L01k61j54K29l19J82j29k3K1j08K1L63
4183A02l07L62j22n4J72l0j08j5j2Q8N1J03m50J04R8k3N1j69J91L8j24J64k57
4206a47K14M7m43L82j25m4K83k41j6R7M1j3k97K97j64J88l13K01J2k20L52o7P
4229C1J7j36P0q4K04j03L1K9q0k41K29j22NK36j29L14k76J98k5k45j3J75P2l47
4253a90J16K36k59J52l62K47l4M13k81k11L21j93k1j2K27j57R2np0L49m53q1J12
4276f4j6M43j27k20K55m45K96jK01l80J71J34l74J4j60J85j96L18j57K20RJ50
4298B56l57J07K8K0l5J61J31n96K60q8L1q2Q6K27k85Q9kLj95K33n0kJ86j25N9
$$ plain form
4136 -301 -79 110 -128 -148 59 196 342 69 231 321 0 45 2 -122 217 -159 126 -21 -21 75 231 187 20
4159 20 112 -6 -247 -38 -116 -140 -147 7 -29 -5 -134 -21 280 19 -135 94 -225 -43 -172 -195 -174 -282 -261 102
4183 102 -205 157 35 -19 153 123 15 0 -12 76 127 230 -220 -116 -18 -41 10 -159 32 70 -54 110 -147
4206 -147 67 114 -329 53 -72 -116 167 -74 -90 7 48 35 -262 35 -129 59 -254 -53 -41 -261 91 24 31
4229 31 48 -88 -18 -102 102 -1 30 59 -21 -262 -33 -155 -150 86 -43 271 -5 193 168 -77 -90 85 157 -190
4253 -190 -74 162 -97 55 -307 -60 -94 319 38 -173 148 -45 -66 -78 149 -8 84 79 9 358 -95 -176 -64
4276 -64 -80 363 236 16 271 -174 122 121 322 -58 113 247 -127 -113 -273 -88 -284 34 -123 97 106 256
4298 256 -101 6 34 54 19 180 311 -285 -25 -113 -82 -164 -78 149 -136 -47 -49 -46 -241 -8 -58 -60 126 1 60
4323F0L4R1l73J86j0J05k37M12k09oJ13j47j03K16Q2k88K44j66J20m4J07m09J57
4346f5J27k72K23j65K52k00K73j37J76j50K81j14j81L5j22j09L34k49o6O0K12
4367A43l09J37K57j69j08k7m4K50l45K59j54J68q7K5R2l2J49j55j19kL9j50J47
4390c5J95j46N1j65L7jR1J8J47j96o6j92j64L32O6p1J42n9r8M73m9j25N1j03n0
4415H3R3l18K36K44l67j10K75q0r1J68j49K03k89K26R2j32jj11lJ4K16j20l10
4438b31J48J1K67Nk45J30j06R0m3j81R8N3k6j12R1k33K75k60N53m01K80l4m8k37
4462a56K39J27n7k03M6J8oN7p4r0J11J26k52K13r6K57n21K86j72q6K74j44Rj09
4486b03O0mL48O0k57l7K28J21n46q9K32j11J1K70m3N8j19J09j03QM5K8l10J73
$$ plain form
4323 60 94 185 -188 -2 -12 93 -144 268 59 53 166 19 -84 132 214 -74 170 4 124 80 187 -222 -65
4346 -65 62 -210 13 -152 100 -100 173 36 212 62 343 229 48 83 -39 -148 186 -63 -129 -69 143
4367 143 -166 -29 228 59 -49 -76 -120 130 -215 44 -110 58 -29 -4 88 56 205 50 -69 -71 -32 -182 -35
4390 -35 160 14 65 -100 -63 -64 27 45 192 -4 -70 -262 -426 -94 -28 -99 43 -16 -114 359 310 185 236 133 83
4415 83 176 -142 94 338 -29 -139 136 56 -35 133 -16 187 -102 124 216 84 83 -28 -31 -17 199 79 -231
4438 -231 -83 -72 195 200 -45 85 -21 69 26 -155 -57 -4 -30 -142 -51 -284 -9 -269 284 -117 163 129 81 -156
4462 -156 83 210 153 -50 -4 14 8 65 -9 -99 12 138 -114 99 3 260 -261 25 -147 -233 41 -103 -94 -203
4486 -203 -143 -147 201 261 4 -33 195 316 -230 -319 -87 -198 -187 83 40 98 -21 88 -15 -7 38 66 -244 -71
4510g1J01j72M0l3L9j34M43Pj78k50L31l08J44r3K03p8k01K17J0j59R9J51J20
4533B28J0k19K00j6m35L14M7l14K78j96J55j41L78n43J2K56nK9n9J73j39j4P3
4556G2o2J04j62j80O7N23k02l21K53j69l4q1M10j60O5l14L9M75o28J20K58p8k8
4579c3m0j55M5J23L41m31N1J16n9Q7J44k60M71k64j77J75N7k7j69P7n4J51j5j58
4603dK6p6J49M3k49R6P0j8j8q0p3j0J04K52k38K77j17o5r7q4J98j71lM8K28m16
4629b28L41j09M7OJ99j50j78J63m3j5L7K50k80j56L4P7Q3m35L47J17k12K65N3
4652B13o8l43O6l2K35J83m45K18l64N16j42M1j74J73j6J42j64j03K52k14l19M65
4674A20k16j15K52P2r9o4m2J03Q1Ko5o3M36k40k95K86k80l22P67k91p6m4l1J57
$$ plain form
4510 -71 30 -142 -102 -135 -96 -230 213 220 42 -208 123 -185 -41 -134 69 -9 -210 7 17 -142 -43 108 228
4533 228 238 19 219 203 -232 82 129 -185 93 -103 52 -89 289 -254 -242 14 9 38 -21 152 13 -1 72
4556 72 10 114 -48 -228 -161 362 160 -161 92 -77 -111 -192 218 58 123 -191 -152 323 -305 -185 73 -5 -33
4579 -33 -73 -228 -183 -60 281 -150 -99 17 -42 45 189 -71 400 136 -41 134 191 164 -5 72 18 169 154 -4
4603 -4 22 -54 95 138 -111 -15 55 37 19 -61 -134 -144 -40 212 -26 251 134 69 -28 -112 86 -85 -88 -40 188 -228
4629 -228 113 4 51 57 256 106 -72 91 48 33 70 320 40 -116 -82 -5 78 -357 -10 107 -105 160 213
4652 213 145 -198 -132 -164 71 254 -191 27 -337 179 37 78 -96 77 61 203 39 -64 188 -26 -345 120
4674 120 -96 -211 41 113 14 -50 -92 11 92 94 29 -34 402 162 -133 153 -127 -449 318 27 -49 -93 -124 33
4698C3K49l75Q3J58l09K5J78j07P0j14J54m4L0J55j05J53O5j86k52L11q4J06o4
4721A30l84M93l11L17l17n4M33k45J5J47l4n7k00N1JK01j36j18J36r0M8k37J58
4744e3Q0Q6L7j28O7o3j12Q8k62M9K43mj38L22l22J32j70M4K68K8M3k74L07k46
4768B2n1O7N8R1l83K35j6N1q9k37K26M46l66K1N4j37J17p0J33j01K5n11N45j18
4792A2J32Lj73r5J11K7K49l35J69j58J17l3l10J55K68j78J24l5Q7k42K03n7j76
4815a35J74m1L28j05m46L77j74j63N18k45j58QJ17j6j44K38K05j75k19J88k04
4836g2K99Rk19j54R5j54Q8P4j34Q6J61o7L2j22R3pl5p2K16k42qM9R1J66J66k90
4862D9q8J15r2q7P5j55K01J57j86j45J31j00K73l06L66J2m42j06O85k02j83J43
$$ plain form
4698 33 282 -93 -10 148 -161 -136 42 -65 5 -109 45 1 31 186 81 234 299 113 -139 172 88 194 130
4721 130 -254 239 -72 245 -72 -126 307 62 77 224 190 133 -67 -16 -15 186 50 -68 68 -22 26 -211 -53
4744 -53 27 113 150 22 89 26 -86 2 -260 -211 32 28 -110 212 -110 22 -148 -104 164 192 235 -39 268 22
4768 22 -29 38 96 187 -196 39 23 74 -15 -252 -26 420 54 75 129 -8 109 39 172 71 96 -415 130 12
4792 12 144 147 -26 -121 -10 17 266 -69 100 -58 59 26 -284 -129 139 -39 85 50 137 -105 98 41 -135
4815 -135 39 -2 326 221 -225 152 -22 -185 333 88 -70 -62 55 39 -105 133 338 163 -56 132 -72
4836 -72 227 236 17 -137 -42 -196 -108 -34 -168 -82 79 12 44 -78 15 8 -27 -99 117 -125 -133 -84 7 173 339 49
4862 49 -39 76 -16 -103 -28 -183 18 175 -11 -156 -25 -125 148 -158 208 220 -222 -328 357 155 -28 115
4884A15j13l75L64o4J83l09M11j09K2j01j26L02j04n3n0L71k23j00R0k7qj08P9
4907F7J85p9l6j30P9N0n6m5m6m8p5K41L2j71JPJ99l30K50k34k7J63J88m61jK74
4933cJ58j48J41N3l12O6J76p4p7J08K2k27P3o1J25J14K01n79M09k46p1L1J92J0
4957H1m61O57N1l38J86j90l04L16M4R6O0p7k53J53N8o6j61K00M3Pl9o2r7p8K82
4982A08P4k48J94j99m0J63m0k07J99J16j36R9k83K98k37q2L04k59L08r7j69j23
5004b57M09l77K24K22l88L29j20N2q0J18k39J29k28K01j51K4L44o0k84N38n33
5025a27p9K81q6j86K80l55M89m29M0J34J48J50o4j32OJ50m00J84J30j03J01Q9
5047B21n1j46l0qj20J77J31k29M11n78J02l5K97k42L16j02P6L8l13M4j44J30J75
$$ plain form
4884 115 2 -373 -9 -73 110 -199 212 103 125 24 -102 200 96 43 -7 364 141 41 131 104 96 -12 67
4907 67 252 173 137 7 86 136 80 35 -11 -59 -134 107 139 -32 -31 -24 175 -155 95 -139 -166 -3 185 -276 -277 -3
4933 -3 155 7 148 201 -111 -45 131 57 -20 88 110 -117 -44 -105 20 134 335 -244 165 -81 -152 -121 71 81
4957 81 -380 277 328 -10 176 -14 -318 -2 42 138 198 121 -132 21 79 13 -148 52 95 102 63 1 -96 -174 108
4982 108 182 -66 128 -71 -111 52 12 -195 4 120 -16 83 -200 98 -139 -221 83 -176 132 35 -134 -257
5004 -257 152 -225 -1 221 -167 162 42 94 14 132 -107 22 -206 -5 -156 -132 212 152 -132 406 -127
5025 -127 -206 75 -11 -197 83 -272 217 -212 -172 -38 110 260 196 64 70 220 -180 4 134 31 132 221
5047 221 170 24 -6 -14 -134 43 174 -55 356 -222 -120 -155 142 -100 216 114 190 228 -85 -41 -185 -55 120
5070A20j23L2J41j36l9l20K10L62l48J50m37L63m20L01M7J63L5k79L03k57K70
5091A38j91j73J40J54O3k64K83j4J54j68p0q0K64l71L86l73M81j91k75K55k21
5112g3Q6J03k35L22k2k42R5j60L5L1K49k60K70l87L93m8m8L3K6k55J9J32J10k13
5136c9j88J23J06j83j49L85Mq4J42k60K19j58J04j13O3k10L61j61l5rN4J32m5
5159E9J64j02j2j14k77L66m0j92L03l58Q0K5K07n4m%J39m06L56p5j9p1J40p8j01
5184f4J07J57O0l47K2K14K13l66j21k28M95j77M7m3J48k0K20k56k2m5Ro0j28L67
5208A82k7n1j50L32j47k31M1q7j58K16M75l79k26M46k61N3o8J95l44L26Q0l25
5230a08j68M21K6j29l32L27O8l40K17J84l46N96k77N6p2p4q8J22l59K62j88Q2
$$ plain form
5070 120 -3 29 170 34 -5 -325 -115 247 -101 49 -388 -25 -445 -144 -97 66 101 -178 125 -132 138
5091 138 -53 -226 -86 68 131 -133 150 136 290 122 52 -28 236 -135 251 -122 359 168 -107 148 -73
5112 -73 13 116 -119 203 181 -61 34 -126 -91 -60 189 -71 199 -188 205 157 109 142 168 -87 -68 64 174 -39
5136 -39 -227 -104 2 -181 -330 55 59 -25 117 -143 76 -82 22 -91 -28 -238 123 -38 -73 -82 -28 104 59
5159 59 223 121 109 -5 -282 84 44 -148 155 -203 -123 -98 109 55 51 51 190 -216 140 65 46 -25 115 37 -64
5184 -64 43 200 260 -87 -65 149 362 -4 -125 -353 142 -35 12 -31 117 97 317 61 39 -6 3 -57 -185 182
5208 182 155 104 -46 286 139 -92 -51 -138 -296 -80 395 16 -210 236 -25 28 -40 155 -189 137 217 -108
5230 -108 -276 145 171 42 -290 37 105 -235 -18 166 -180 416 139 195 123 49 -39 83 -276 -14 -202 -120
5252a20M07l37O0k9L06j07m14L27Q2l9k98J01j04M1K28l64L85r6M8j40L29m79
5274b13K13P5o4K22m82L14p1K42l96J5N5J64n5L5k83M8J10J74J41j51j00NN6j0
5298D4J35k35J91k34L16l91L28k29J50o8M5r2O0l00N70k21m3q0J48p2kK17k16
5321B1o2n5N4J34k29l1Qk61M50L15k96K4M3k39J3j0K61l18L73j83K89k58j26j48
5345b31K52L31n50k5m0O88l06N0K8O5l22J80J9J2k58Q2l32K64j65M10p4k57L40
5368A61k54j49N26k44q2K10k69L7J66Oj19O5m8N1k20J61kJ20j20J73k03K7L1j31
5392a07k3J91m49M14j45K82j67l98K56l6J76k02KJ73J74JJ15j45j17J41k67j8
5414a49O00m09J29j38J84p9k36OK00j37L6N7r0J90m18K87J59O6n37L46l58L97
$$ plain form
5252 -120 287 -50 10 -19 287 180 -234 93 175 136 -162 -61 -165 -124 104 -260 125 29 77 -63 266 -213
5274 -213 0 75 11 233 -249 65 -6 236 -160 -145 -90 74 19 54 -229 -181 -71 103 244 93 -7 -2 54 44
5298 44 179 -56 135 -99 217 -174 154 -75 75 7 52 -40 20 -280 290 69 26 -54 94 22 20 237 21
5321 21 -41 -96 -42 92 -137 -168 -160 -421 29 344 48 72 115 -124 -111 -121 140 -178 195 12 301 43 -83 -231
5345 -231 21 352 -198 -223 -263 425 119 169 197 262 -60 120 139 151 -107 -25 -357 -93 -258 152 78 -179 161
5368 161 -93 -242 284 40 -42 168 -101 -64 102 108 -11 54 6 57 -163 -2 -4 116 -4 169 -34 -7 24 -107
5392 -107 -130 61 -388 26 -119 163 -4 -402 -146 -182 -6 -208 -206 -33 141 142 257 112 -5 136 -131 -149
5414 -149 451 42 171 33 217 138 -98 -92 108 -29 7 64 -26 164 -254 33 192 258 -279 67 -291 106
5436A06j67K91j80j54K04j58J03l4J63l9j48M8P9k96L7R3q0O5l8pK14j39J4k36
5460b59l7K31J1J03j8J13J94k11k37O8n5o4q8K50M8k35L20J35m12L10j53J81l27
5483a32J72RJ40l68K15K01j96o5J1N29n14J45k18L20l80R6j76L11l05L57o6k90
5505b04J90q1R7m4j36N0K57r5q9jq6R5m1L04k16J47l69L25j00J44q3J21o7r6j3
5530IJ9J72o7l6j60M14n28K17j13M33k51j60p4M7L15j75j32J69k6r6K91k04m1
5553B3%M17k69l5k98j8M42j76j95J34j06O8J83k97l9N0K66j22L10m69P5P9K85
5576C08l1l00J86j83J28O7k06j7K08j76J35m9k2k06J13O2n3K87l83M24l25k4%
5599e7m7J40j72L19k21K12k06J06j22M9J9K4j83J60l89M30R4j23k67J83J44m23
$$ plain form
5436 106 -61 230 50 -104 100 -58 45 11 174 135 -13 35 114 -182 -145 -52 -132 -67 -105 -112 102 -37 -23 -259
5460 -259 -296 -65 -54 49 31 144 338 127 -110 -42 -97 -161 -249 1 49 -186 134 269 -143 167 14 195 -132
5483 -132 40 49 189 -179 36 237 41 -24 -13 516 2 147 -71 249 -131 -35 -211 100 -205 152 86 -204
5505 -204 -14 -95 2 -42 -178 -128 129 34 -55 -56 -142 -47 -88 216 0 147 -222 103 3 147 64 185 118 22 9
5530 9 28 200 133 97 -63 351 -177 40 -73 360 109 -51 -125 -78 237 62 -70 99 73 -23 268 64 23
5553 23 23 440 171 136 -162 -180 262 86 -109 25 -81 -13 170 -127 -166 -116 150 28 338 -131 -56 23 308
5576 308 277 -23 163 -20 108 175 -31 -48 160 -16 119 70 48 -158 -45 17 -36 251 -132 292 -33 -57 -57
5599 -57 -104 36 -136 183 -38 174 -32 74 -48 1 20 44 -139 21 -368 62 156 33 -234 -51 93 -330
5621c30m2L06j30M26j15j2k77J98K25k74j36j15L61j61Q3l21J48J26P2k80K45
5642cj22K40r7L1K9J62k70Nn7R2j53J63q5J99l00K59m60P7M63k98J65P8k0j10
5666a2j26rL5k26L24j94L35j88LJ02l13K32J13M4Ql13L26k38Q9o4O8Pp1Lm8r6
5692b09K81k25r5K73q1r6r4L17q4J49j36l9j89K59j39J77J10pj02k47L11k49j85
5715c00J94J53J7k89Q2J21m6K3J46l7Qj69o5j05K14r3m9K44o0P3l79L70p9K6j
5740aJ10j24J51j67q8K21N4j96J36J30k87N3J08k04N7K28k58o4K26j6P2k09j02
5763a70J07J43J0p4J0l6J61m83J44M63k08p2j27K23M4m17L01jM9j71J54jJ45l37
5787a43k3J89R4L5k14R3K4K5j03R4r1K40l46k7J90J83j22j96p2pJ81J3j09K22
$$ plain form
5621 -330 -372 -66 -196 230 115 103 -174 24 249 -25 -161 -276 85 -76 7 -314 -166 -40 32 -248 -3
5642 -3 -125 115 18 49 78 240 -30 -25 -82 10 -143 20 -65 134 -166 93 -367 -290 173 -125 40 118 98 -12
5666 -12 -138 -147 -112 -338 -14 -208 127 -61 -58 44 -269 -37 76 120 128 -185 141 -97 -8 -72 -4 3 -68 -65 -113 -209
5692 -209 72 -153 -248 25 -56 -152 -246 71 -13 136 0 -39 -228 31 -108 69 179 172 70 -177 134 -115 -300
5715 -300 -106 47 64 -225 -143 -22 -68 -45 101 64 72 -97 -162 -267 -53 -146 -195 49 -11 62 -317 53 -26 0 -1
5740 -1 109 -15 136 -31 -119 102 156 -40 96 226 -61 -8 100 -104 -47 181 -77 -141 85 69 141 -68 -170
5763 -170 -63 80 90 16 26 -10 151 -332 -188 275 67 -5 -132 91 135 -282 19 18 67 -104 50 49 194 -143
5787 -143 -166 23 117 152 -62 31 55 80 -23 71 -20 220 -126 -153 37 220 98 -98 -170 -177 4 17 -92 130
5811A30J1j31J42n32L07L68l99Q1j16J71j72O8M61l89k76K94j03r5L89J67l27
5832D9j44L9J09j87J46j71J49ML2L2j14J7j88L06k00k4K18J2j28k5K17o1kk8j64
5857a06K03k99K84k71K76k72J32J21j98M80p9j55q0L6l50M69j13J28p6k48J30
5878A2j81qL37k59K72j18l90L05j5q3Q3kk32L08J3K5k33J95l6j87K45N1k36K98
5902A64j46j31R4n4N8M4j33K83j26M8Q9l61L31r3j09j20r7mK89j02J82K6k91L67
5926B08j17j18O1j81N3M52l10m3M4j23Q4j24KK00J3k09L54l87L5j53R9j7M97k19
5950A01J8r2n7M5K8n2k1Q7jj11j8J48l07N6%L21j87K51J8k77J02j21rj21O6N6
5976g7j38M52l5j63J01p2N7m5K55l24QLj32K54l54k6K08m6M96k90lj20k61J17
$$ plain form
5811 130 141 10 152 -380 -73 295 -104 -23 -139 32 -140 -72 389 0 -276 18 -85 -180 209 376 49
5832 49 -95 -56 53 -134 12 -159 -10 -6 26 58 -56 -39 -227 79 -121 -145 73 85 -43 -68 149 88 86 58 -106
5857 -106 97 -202 82 -189 87 -185 -53 68 -130 350 271 116 36 72 -278 191 78 206 130 -118 12
5878 12 -169 -177 160 -99 173 55 -335 -30 -45 -128 -45 -47 -279 29 42 67 -166 29 -7 -194 51 102 -134 164
5902 164 18 -113 -19 -73 -15 29 -104 179 53 101 190 -171 160 67 -42 -162 -259 -263 26 -76 106 132 -159 208
5926 208 91 -27 34 -147 -94 358 48 5 49 -74 10 -114 -112 88 101 -108 246 -141 -106 -259 -160 -177 320 101
5950 101 119 27 -30 15 43 -9 -30 57 56 -55 -73 75 -232 -176 -176 145 -42 209 227 -50 52 -69 -78 -199 -133 -77
5976 -77 -215 237 202 39 140 68 125 80 335 11 19 22 -110 144 -210 -236 -28 -74 422 132 129 9 -252 -135
6000a35M44l21j83K64j20K70l86J23j5J72k6j82j9J10j76Q2J17K58o54L79k3J70
6022A49k65K02J56k8k81l01L30l3J64l6j73K4J96l01K13j54N65o05K01K3l66M13
6044I3Lj49Q0J97l11J60j53J55M2j20k07L01j78k11L13K5k11K74K6l5J75m8m33
6067b12K29j79K9OJ01M7j24Q5q0L54k42k39J95J16m8m2M8k8k33K01O6k07K02P5
6091A20j24K77k85J73J3r3P6jk05n9L2k22J51L42l08K04K3k63K06Jj0j12q6J53
6115Cq7l9K41l27J63q7P6L37k07Nj53mj17j61O23l11M6n3K44l65J75m0J57k78
6139a59j29L08q9j13J67j52M8K85j01j51O0j5j32j7J76j11J97K43l89on2K88q8
6162F8J17l06k00L84k81n6P2q7K69k87M12Ll91J43J06K58j85l36k9J83K44k63
$$ plain form
6000 -135 309 -12 -195 69 -51 219 -167 -44 -59 113 87 -95 -114 -4 -180 -98 19 277 -377 2 -21 149
6022 149 -116 86 242 214 -67 -368 -38 -71 93 57 -116 -92 104 -197 16 -138 427 -178 23 46 -320 93
6044 93 96 -53 27 224 -87 73 -80 75 117 -3 -210 91 -87 -298 15 40 -171 103 129 94 269 221 -212
6067 -212 17 -162 -133 -127 -26 21 -103 -18 -98 256 14 -225 -30 86 38 -4 44 16 -217 -16 50 -157 45 120
6091 120 -4 273 -12 161 174 81 157 156 -49 -108 -76 -298 -147 195 -113 91 114 -149 57 58 48 -64 -150 3
6115 3 -84 -123 118 -209 -46 -133 -57 280 73 78 -75 -79 -196 -357 266 -45 1 -52 192 -173 2 -38 119 -159
6139 -159 -288 20 -69 -182 -15 -167 -119 166 65 -86 -26 -41 -173 -190 -14 -125 72 315 -74 -80 -132 156 68
6162 68 185 -121 -321 63 -218 -274 -202 -289 -20 -307 105 108 -283 -140 -34 224 39 -297 -326 -143 101 -162
6184a62p1M35l2K34l08J40j93k7R9k17M72l60K00j66N2j08Q4J4J85j63k12K17
6206A13R5l17j93K77J49k12l6L38k56L16j91l62R7K96J2J14Q1m64J89k34K48p1
6228a1j07j39J07L74l07q6J05J51P9j82j73L43j88J90q0r3j38O6KM21m08O6K17
6251B09l58K14r8O3p8M7j17K52O2K7j61j31j3j04M3N6J30k79J38J8lJ09J5k62
6275b21J28J19Q0k3q6o7L54l45J44lm9j09j05L43k74J62k36L36Q0j80j43J66j70
6298i9R8j6J52k42M71k15k10r8J24J40m3j24j80K73n9L4j24j51R4K70N8l12J37
6321b2J96l21N30n63O6J97L3j20j42L51k60L25n00PK52mj13J18R7j71L95l25m1
6344a5J27j2Q6j69l9j47L79k06N7J14k54l82N49r5K40l02jl25K91L03o4Lk21J38
$$ plain form
6184 -162 -233 202 170 404 96 236 43 16 115 -102 370 10 210 44 96 -12 72 86 271 108 -104 113
6206 113 208 -109 -302 -25 124 -88 -124 214 -42 274 83 -279 -182 114 126 240 321 -143 46 -188 60 -11
6228 -11 -118 -257 -150 224 -83 -169 -64 87 166 -16 -189 154 -34 156 76 -17 -155 -89 -87 334 -74 -8 209
6251 209 -149 65 -33 30 -48 -1 -118 134 196 223 62 -69 -82 -186 -143 -87 43 -236 -98 -80 -83 26 41 -221
6275 -221 -93 26 106 83 -3 -70 284 -61 83 80 31 -78 -183 160 -114 48 -188 148 228 48 -95 71 -99
6298 -99 -1 -17 135 -107 364 149 -61 -159 -35 105 62 -62 -242 31 -28 6 -118 -269 -175 95 153 -159 -22
6321 -22 174 -147 383 -180 -114 83 116 -4 -146 205 -55 270 -230 -223 29 25 -88 30 127 -44 351 26 -15
6344 -15 112 100 186 17 -22 -169 210 4 61 175 -79 -461 88 -7 233 -69 -70 -395 -104 199 135 138 -83 55
6368E5j67M5J50j03L7J55q3j5N4M9n2k29L36N2l11j98J27Q7j28K88M9j73j42p9
6392a96J65j24L61l72M73l10J22k01J37k23P5J57j81J08K3m5j31J83j05K76k71
6413g9K08l51O8j01O05l56k2k51L33Nj60J2J0j29K02L12j92o2l98L51l14L10J52
6436A53j7l96N22m50L42o8k59K26j45J08j65K24j15p1J64m38O01j26p7L03k48
6457F8O1l87M18j93J82l91K72j1k34L16l17J05K1J7J16J04j24o8O8J75q1j36P9
6480F0Q3p2J06l84J05NK44m1k16J43j7N7n1J96k76Q8J85j25n4j37O0j87P2K36
6504H0L8N7m82K30j40J17j7l4O9J84j31j34n2K06j91J30J7Q2J26nj11r4Q5k70
6528b40K25P2k13L15k79K39mm12J45M18j85qn1j43P3J58k40nJ93j91K35Mj52J29
$$ plain form
6368 55 -112 -67 83 -20 17 172 89 74 128 177 125 -104 232 284 -27 -225 -98 -11 -139 149 198 25 -117 -196
6392 -196 -31 -155 206 -166 307 -3 119 -82 55 -168 -93 64 -117 -9 14 -31 -162 21 -84 192 -79
6413 -79 129 -222 -154 -255 350 -6 -28 -279 54 59 -101 -89 -79 -208 -6 306 114 52 -346 5 -309 1 153
6436 153 136 -260 262 -188 154 86 -173 53 -92 16 -149 75 -40 -111 53 -385 216 90 13 316 68
6457 68 129 -258 160 -33 149 -242 30 19 -215 101 -216 -111 -90 -73 43 147 23 -45 23 198 117 -19 60
6480 60 143 71 177 -207 -102 -97 147 106 -110 33 16 73 22 218 -58 30 215 90 36 -101 -41 -228 -156 80
6504 80 118 175 -307 -77 -217 -100 -117 -151 -82 102 -29 -163 -215 -9 -200 -70 -53 29 155 150 39 -55 30 -240
6528 -240 -15 57 -156 159 -120 119 115 -297 -152 266 81 73 22 -121 -48 110 -130 -135 58 -133 102 106 -46 83
6552H3R7o3j51qP4K01J49l45J02l12M34k16M2j69R4q5K66J3j60J6k75kL12J13
6576B10m43L1J84r2l9K95k29J16J27q0J3k00K03ol0k36K69O3m7l32o9K59K42k63
6600e4M21l50J23J60k97j06J80qp6N0j2J4k87K38j96L05j54L95k18m16N35m5K8
6623B30k57j8Kj5K3O0M7Q2k82K17k50J29k48L51j35p9R6O3nN4P3n08M33j49J19
6648C3K41j08l03j86L39j12M5J41K8R5l63K4N8L9r4p9J83K40j28O0j19J08k29
6671h7P3l7j5J61M0j21p5M38k27j84o5K26j00J19j30J07l12L47k30pO9p0K74k60
6695f6J06j28j6Q1J30l47K09m2j21J81L1K2m8k40K11M4J3nN1pQ9L4k7j46m8J50
6721A11n06M57L2m16K67J39j2j40Q5J70k58R8j86O2N3O9j52J05J09j14J81j68
$$ plain form
6552 83 180 117 -34 -42 32 233 382 37 139 -173 261 45 87 -82 12 -73 193 206 46 62 -213 -215 97 210
6576 210 -233 -202 -18 -110 -149 146 -83 33 160 80 93 -107 96 90 60 -176 93 156 109 -223 -292 -33 209 -54
6600 -54 367 17 140 300 3 -103 77 69 -7 43 31 45 -242 -4 -200 105 -49 346 128 -288 247 202 230
6623 230 -27 -45 -43 -58 -35 25 72 154 -128 89 -161 -32 -280 71 -64 -143 -47 16 11 65 138 -370 63 -86 33
6648 33 274 166 -137 -323 16 -96 -51 90 118 213 -150 -126 -68 -29 -123 -202 -19 221 93 153 34 142 -87
6671 -87 -14 -51 -66 95 135 14 -61 377 150 -34 -99 127 27 146 16 123 -189 158 -72 -79 -10 -80 194 -66
6695 -66 40 -88 -104 -23 107 -240 -31 -73 -194 -13 18 40 -8 -248 -37 7 20 15 66 59 148 182 155 9 -39 111
6721 111 -395 62 94 -322 -55 84 72 -68 17 187 -71 27 -159 -97 -44 25 -127 -22 87 -27 154 -14
6743a4J68k51q8J27J77p2l4j92J24j7N2n8P2K21k83K18m53K92k9N8r3k10J27J86
6767B8k28J15J78%j50K18j22K4j97J11%K2q3K6K69k35k15J97L4j15J5o5K72J09
6791B08l90L23j27r6j63J46j5Q8j72J27K04j09l6O1j20j64L43j86n6J95Oj3L7
6814I1J11j62r0J83k69K99j42J00P6m47N45l35J66j51R3k49J79r3J67q1L7J17
6836A45j33j15K5K09k99lK23pJ36l30N4J5nK89j26k22J44L70m14j77L69j30j08
6859i0M3j65J81K7l4Q3l7j78K89q7J50l02Q5m0K7J20J12k51R1l39L36l2L58k73
6883G4j76K2PK76q3p9j84K80p2k02K62M6k93o7J40J59k5J55p0l72R2n4L19N4l28
6908a19L13l45K31K37m06K12n6j77o5L60m0j42j03J46k4NL81l38n6J36n6o3R7
$$ plain form
6743 -14 154 -97 -185 -58 119 47 13 -179 -55 -72 -20 -78 -6 215 -68 150 -303 -11 -40 18 -75 -285 -158 28
6767 28 -200 -85 93 93 -57 161 39 63 -134 -23 -23 -1 -84 -58 211 -24 -239 -42 -8 -123 -108 -173 99 208
6791 208 -182 141 14 -82 -245 -99 -114 -26 -198 -71 133 24 -12 49 -71 -235 108 -78 -134 61 67 54 91
6814 91 202 40 -50 133 -136 163 21 121 197 -250 295 -40 126 -25 68 -181 -2 -95 72 -9 28 145
6836 145 12 -103 -78 131 -168 -171 52 45 181 -149 -95 -80 -85 204 78 -144 0 370 -44 -221 148 18 -90
6859 -90 -47 -212 -31 -4 -38 45 8 -170 119 32 182 -120 -35 -75 -48 72 184 -67 24 -315 21 -11 347 74
6883 74 -102 -80 -73 203 120 41 -143 137 65 -137 125 171 -122 -189 -49 110 85 240 170 -202 -110 -164 155 209 -119
6908 -119 194 -151 80 317 -89 123 67 -110 -175 185 145 3 -100 46 22 27 408 70 14 150 94 31 128
6931A28m7j81J58pj6j38n5L35k76jK26k40J23J98k93m9L38k06n7J25k35R2O2r5
6955a11J90j1k37N4jK45j00K4r5L1l2R6R6k97K24j4q8J54o78N01J31NJ09k76J49
6980F9p8j95K61pj49Q9J91k29o7NJ16Qq3J7L15k95l02Q2J23N5K02k50r9J99j67
7005a89m0p7J49K55k34M00k34r2k30L77q2J33k07N8j30o0L03j07j16K5P1M3J47
7028A63N3k52PO1k73M35l01l2N1Q0k0j64M87j61p3l75L21N7k71q0K76J54j21K04
7052B26p0J10k18k01j60K67o3J97n8j00o3K00K2j14L36j45l7k09J87O3qk36k94
7075c68M99m4p8oM04o30M04q9P6j39m06K21R9j02J97M5k79L4j5L88k08J3K27q5
7099A58r3p7J65k79K32K1o0j8j39Nl4K05k41L40j69j6L1j36P1J20L6J25j60k70
$$ plain form
6931 128 81 -100 58 51 35 -103 -158 177 -99 -100 126 -114 9 207 -86 -135 203 -3 -60 65 -170 -78 -16 -111
6955 -111 79 68 -169 -115 -116 129 29 53 -42 -11 -43 53 149 -148 76 62 -26 128 -550 -49 82 87 196 -80 69
6980 69 -9 -204 57 50 -99 -10 181 -48 -115 -110 6 14 -69 -52 263 -32 -334 -252 -129 -74 128 -122 -221 -22 -189
7005 -189 -229 -306 -157 98 -136 264 30 -62 -292 85 3 136 -71 -13 -143 -203 100 -7 -123 -98 -27 16 163
7028 163 216 -36 -29 32 -241 194 -107 -139 -88 -8 -28 -192 295 134 61 -314 7 64 -207 -287 -11 143 22 226
7052 226 156 266 48 -153 -313 -46 -109 88 30 -70 -133 67 89 -25 311 166 129 -80 107 170 162 -74 -368
7075 -368 131 87 9 3 407 -223 181 92 168 29 -377 -156 -57 -159 38 83 -196 -162 -177 211 3 16 243 158
7099 158 65 -12 153 -126 106 127 67 49 -90 -85 -119 86 -155 185 16 0 31 -105 -34 86 122 247 87 -183
7123a83M50k03k30P4j05K23q3q0K75k49N2K3J00k6K23k03j09N1K41n9m13K81O
7146E6p5N7o4J91k03Rj21J79n2N9J03k28R2k05KJ00K51Mn0k09j97L11L7k1j35
7171a09j20J38J7L03j94r8K93l34J63j49K00m75O8K96N4k23O4M3LK95l29n1K83
7194A38O9l34L02l05K8Q5qn4q5N2L05k94O6P4k79j71M55J9l48L88L5Q8m33J87
7218b0L9rn5J75o6m09N07l62J55O6j04L57k36j32R3K6j4j66P5j06K33j36K2nn5
7243a27L4L5qN0j71J67n8P2j09O7J41j03j26m8M04k43P1o9Jn2K45q9J30n4j62
7268bM8K35m41L64k43R6p1R0j11j22n2J17j14J43L7O1Kn9M5j10L23j21JM3l69
7293b10J37N9j7k4J08j84J25J50k45N9J96j23j98Q4k71L17o8K65r8j18m2J19l63
$$ plain form
7123 -183 267 64 -166 -92 -197 26 -57 -137 138 -111 -59 -36 64 38 261 58 -51 0 241 182 -231 50 56
7146 56 -19 38 -26 165 -38 -29 -150 29 -23 36 139 -89 3 -202 -200 -100 151 155 105 -104 -301 10 47 26 -109
7171 -109 -229 -91 -74 229 35 -63 230 -104 59 -90 110 -365 -297 -1 53 -170 -106 -63 -60 235 -94 -145 138
7194 138 207 -127 175 -130 -102 -17 -25 -79 -164 -112 193 -101 -35 39 -240 -411 44 63 -285 103 138 226 -207 -20
7218 -20 19 10 -45 130 64 -345 162 -200 -45 21 -83 274 38 -94 -1 25 11 -155 -80 -186 47 -89 -67 -72 -127
7243 -127 -93 -58 -66 -16 -187 -20 -78 -6 -115 -48 93 -10 -136 -184 220 -23 48 -21 -20 -72 173 84 214 160 -2
7268 -2 46 281 -160 204 -39 57 -14 76 -35 -157 -209 -92 -206 -63 -26 35 37 -22 23 -87 236 115 116 159 -210
7293 -210 -73 -14 -31 -55 53 -131 -6 144 -101 -42 154 31 -167 -83 -354 -37 -105 160 62 -56 -98 21 -342
7316c42L20m6J63k01J21o6J89K7l60K1K54J19j90K57m07j66K72K4j20K04Mj36
7338e9k4O0j93K48L6j9l74K59k5K34l17J59N9J59jm00J54N6j93L81k31K0J20j35
7362b6R7k48O0l4K04m9K46k81J12n5J37m43L56K52n54N0J19K03q9k61K66o8k50
7385b56M07k63OL47k27R1m3K2k15J19J42j26j31K38j40j15R4J7M5K97p74L56K10
7408A01n1k3j56l07K35L25Qj33l6L8j44J35k28L15kJ44n20M54o5J55l05K18J24
7431B82j36qj07J29j11k2J5J0j52M16k79j95J8L20j38j21l6Q0J00K1rj21J68j96
7455g2L3J03Qq1j54Q4L56q5Jk89J4J93k04p2K19K6j17k5K42l75R4J4K19l4j93
7480i5J81m0K51l71R5k78N38l19J19j29k1J80j51j48L62k26L22n06K25k8J85k97
$$ plain form
7316 -342 -22 -68 95 -106 15 -51 138 165 -195 -174 80 199 9 266 -141 -307 -35 -11 -131 73 77 -59
7338 -59 -83 -23 -216 32 68 49 -325 -66 -91 143 -174 -15 44 203 202 -198 -44 12 -181 200 -31 -11 109 -26
7362 -26 71 -177 -117 -151 53 4 250 -31 81 26 163 -280 76 328 -226 -176 -57 146 57 -204 62 -6 -256
7385 -256 151 -112 -106 241 14 105 62 84 -131 -12 130 4 -127 111 -29 -144 -50 -33 12 309 -465 -109 101
7408 101 50 27 -129 -436 -201 124 132 -1 -37 1 -143 -8 -236 79 77 221 -299 155 90 245 -60 158 282
7431 282 146 138 31 160 49 27 42 52 -100 316 37 -158 -140 180 42 -79 -115 -35 65 86 77 -44 124 -72
7455 -72 -39 64 72 -9 -163 -79 277 192 193 -96 -82 111 -93 -165 54 80 -37 -62 180 -195 -101 -87 132 98 -95
7480 -95 86 46 297 -74 21 -257 281 -38 81 -48 -69 111 -40 -188 174 -52 270 -236 -11 -39 146 -151
7502a51K07j14J03J27r0r9q0J66o6o4J07k11J36L46k86J31k26M16l20M8k44L26
7524A62k15K8j04J81r5q6K63j04n2j42j67K09M19m22K0J58O6j1L2L7l54l2J92
7547a7N5j56J1j13K92K67k62M1j7j19j12J06p2Q7j25q0J78q2J14J72l67K00nj64
7571a68J59j66K38q5K2Q8k3l3N7Q8l6j92J08n6k8K09m18K47j67K5K09j11m12L98
7595d7P5l84K69K40k40O9J94l56L25k26J62J1J55Jqj22Jk1o1J17p4l10J63L08
7619B41k38R0k9P6k16k6L34k20K88n10L63j64j40oL24j43k73K50O7j89L85l32
7641f8R4K70l81L0L0j3J61m38L21K72l31P3J9J12j02Q4oJ06j49k42J40j10K74
7664A46Jk05M05o13J40K49j29L4p9J16j06J06j73p2J61j07K30l32K33K43j47k02
$$ plain form
7502 -151 56 -58 45 172 82 -17 -97 69 3 -61 46 -165 -29 317 31 162 -64 352 32 80 -164 162
7524 162 -53 -25 -129 52 -43 -129 134 30 -22 -164 -331 -122 297 -125 -105 53 119 108 140 177 -177 -209 -17
7547 -17 38 -118 -107 -220 72 339 77 118 101 -18 -130 -24 -96 -9 -134 -214 -36 -118 -4 168 -199 1 -4 -168
7571 -168 -9 -175 63 -22 0 88 65 32 89 177 141 -51 57 1 -27 182 -236 11 -156 -131 78 -33 -445 -47
7595 -47 28 -356 -87 153 -87 -18 176 -180 145 -81 81 92 247 248 240 118 119 98 37 154 80 -230 -67 241
7619 241 3 93 64 140 -76 -102 232 12 300 -210 153 -11 -151 -157 167 24 -249 1 68 -121 264 -68
7641 -68 26 296 -85 -55 -25 -38 123 -315 6 278 -53 20 39 151 49 133 127 233 84 -158 -18 -128 146
7664 146 147 -58 347 -266 -126 123 -6 28 -51 65 -41 65 -108 -180 -19 -126 104 -228 5 248 101 -101
7686a01J92k14J31j34O4K00O8m54L21j4l4n6J24j72k2J91j81K4K5L04J72r3n59
7709b18J40J36J18j88r8K1k6P9J39k07P6O9L5K2l18J29j57K66J58j91O8M1J3M4
7733A51l27K63o2P6j85k39J2L01J59j01P6k58JJ64K3j16j22K81j22L1pn7o8n0
7757a76J40K66k04J10m2j46K57k55L3K77l52P6K46k89j8k4R4j33J02L6m5j36K7
7780a56K07j23J05nj88J50k05J02J66l8J21l13k6K42J81j78j95k4L50j16p8Q8
7802F7k63J77R5m7K0J14l97J95K5O1J19k72J5K39n7k0r4N2K0q5L9k53K53J10m6
7827F7Q7l0j02j12q8J72P4P8k72J84J31j04k23K60J2j33J89p1k88J4jJ92j60j67
7851b91K68j2L09l66J15r8J13r2K2j90J33k8M9K3J81k10J06j42J5J63k95nK18
$$ plain form
7686 -101 91 -123 8 -126 -62 138 206 -248 73 59 25 -31 93 -79 -101 90 -91 -67 -42 262 434 341 -218
7709 -218 -78 58 176 -12 -110 -89 -115 -36 103 -104 -28 41 76 98 -220 -91 -248 18 176 -15 53 94 107 151
7733 151 -176 87 25 101 -84 -323 -311 -10 149 48 124 -134 -133 31 54 -62 -184 97 -25 6 -1 -58 -126 -176
7757 -176 -36 230 26 136 94 -52 205 -50 -17 260 -92 -16 230 -59 -77 -101 -7 -140 -38 -2 -47 -183 -156
7780 -156 51 -72 33 28 -160 -10 -215 -113 53 15 136 -177 -203 39 220 42 -153 -177 173 57 -21 67
7802 67 -196 -19 76 29 49 163 -234 -39 -14 47 166 -106 -91 148 91 71 -23 29 49 -36 3 -250 3 113 67
7827 67 154 124 22 -90 -178 -6 68 146 -126 58 189 85 -138 122 134 1 190 119 -169 -155 -156 36 -124 -291
7851 -291 -23 -35 274 -92 23 -75 38 -54 -32 -222 -89 -117 -68 -45 136 -74 32 -110 -95 68 -227 -232 -14
7874a4o5L4j28M22Rn13L55J71j28k09n2j07K80l07Q4M87m09K9j61k6L01j21K02
7897A34K7l57J36N6j25N3L25j46l0J25K92m53l00p6M27k45N9P5J01r6K5P5K28
7920C10o85K76J2P2j04J29j75J11Pj49K07j10K44j25j22q8L15j58J79k33N38l51
7942A00j33K80l14l8L84k08j50L5j27K43m72L72j12K33m8nK37n88O39m03Q1M3
7964D9J74j51Q9k91L30j32l18K58J41j77k08K46J27k49J21l0j21J93J80r8m2n6
7986C5Nk36K45j16j61L72j88M2o9j30Q3K11j20j17p8K52m4pN4K24m61M01m76J29
8010a50L4OK37J5k07o3K62j07R2n8L5m64K38K69j72n3J17K08k78K14j34j60L02
8033A83r0k27K08nJ29n42N21j31l4PJ96k66j0o4J83Pj68J75o6n8n1K60m00N36
$$ plain form
7874 -14 -79 -45 -173 249 258 -255 100 271 143 -66 -118 -225 55 -252 -168 319 -90 -61 -222 -248 53 -68 134
7897 134 161 -196 -60 -4 -129 -76 249 103 73 198 490 37 -263 -339 88 -157 -98 -23 78 -18 7 82 310
7920 310 -375 -99 -87 -15 -119 10 -165 -54 -47 -196 11 -99 145 20 -102 -190 125 -33 146 -87 451 100
7942 100 -33 247 -67 -105 279 71 -79 -44 -171 72 -400 -28 -140 93 45 40 277 -311 328 -75 6 49
7964 49 223 72 161 -130 200 68 -250 8 149 -28 -236 10 137 -112 9 -21 -142 51 231 133 91 35
7986 35 40 -196 49 -67 -228 144 -44 -2 -71 -201 -118 93 -27 -144 -222 30 -14 -21 33 257 -204 197 -279 -150
8010 -150 -116 -110 127 142 -65 -128 134 27 119 61 96 -368 -130 139 -33 -86 31 239 -39 175 41 -119 183
8033 183 93 -134 74 69 198 -344 177 46 12 19 215 -51 -61 -125 58 65 -103 72 6 -52 -103 157 -243 293
8057B93j33m00M01J10n56L35q3q2k1K33o1m3O2L4l5j15J4J62J37l94K06p6J69
8080A57n1j58J12k6m9j9r6K88k92K11m0P2j00k63L98k34J35j00K7K1J32p8L3k57
8104a77J7O9K57k01j36J98j22K02j63j1r5J20J62j50P6j48Mk24J97lK52k60L60
8127B24j11k71N4J15M5J18l73K46q1J3J03j40j35J46j3R7j03N0K83j41J40l41
8149g5L1j82j11M89l65L05Qj35R4K4q7j80K90k8p6K1K4J31l08J47q7r2K50r1K10
8174B07k79k3O7k1K53l67J4P2k37L52j64K04k60J48QjJ53
$$ plain form
8057 293 160 -240 161 271 -285 50 -33 -115 -136 97 36 -7 55 89 54 -61 -47 115 252 -142 64 -12 157
8080 157 106 -52 60 34 -15 -34 -130 158 -134 77 37 109 9 -254 144 -90 45 -55 -28 -7 125 47 80 -177
8104 -177 -160 -91 166 -35 -171 27 -95 107 -56 -67 -162 -42 120 -30 46 -102 -98 -322 -125 -128 124 -136 224
8127 224 113 -158 -104 11 56 174 -199 47 -34 -21 82 -58 -193 -47 -60 37 -66 -16 267 126 266 -75
8149 -75 -44 -226 -337 152 -213 92 100 -35 59 83 -4 -184 106 78 2 23 47 178 -130 17 -70 -162 88 -3 207
8174 207 -72 -95 -28 -49 204 -163 -149 -77 -314 38 -126 78 -182 -34 -26 -27 126
8191A26
$$ Imaginary data points
##PAGE= N=2
##DATA TABLE= (X++(I..I)), XYDATA
0@%%%%%%%%%%%%%qJ6j6J6k1K9l2M0m8N6o4P2q8J04j20J37j60J83k08K39k70L06
35A63l46L89m36M87n43O05o74P49q30R17j013J119j235J362j499J649j816K000
53A048k206K436k694K987l322L709m161M697n345O151p186Q562j0487J3402j8374
68a0783K9083r4463N7406Q0623q9609J03436j06870k339N5283q4214P5104K4776
80C7433n1720N9364p7622K135M4757n1596N2668J0149k9678L4031o4334J947M2470
93A0004j8777L5299j3160k8777K4785l7229O611L1035p063K3054k2887k7253K1550
106b808j0849J1983J3242j1777J5110j6385j9533J4365j163J5380O418j5363O176
119D796j1210r323J2247L504J4397m13k1546j408j181N392J1394l870M133k262
$$ plain form
0 0 0 0 0 0 0 0 0 0 0 0 0 0 0 -8 8 -8 8 -13 16 -16 24 -24 32 -32 40 -48 56 -64 73 -87 96 -112 127 -143 163
35 163 -183 206 -230 257 -286 319 -355 394 -436 481 -532 587 -648 714 -785 864 -952 1048
53 1048 -1158 1278 -1416 1571 -1751 1958 -2203 2494 -2851 3300 -3886 4676 -5811 7591 -10783
68 -10783 18300 -76163 -18757 61866 -27743 75693 -31177 -33516 21767 -62447 12657 37433
80 37433 -14287 45077 -32545 -30410 14347 -37249 15419 25568 -4110 29921 -34413 -32466 10004
93 10004 -8773 26526 13366 -15411 9374 -27855 -21244 9791 2728 25782 2895 -24358 -2808
106 -2808 -13657 -1674 11568 -209 14901 -1484 -21017 -6652 -7815 7565 13983 -1380 4796
119 4796 -6414 -15737 -3490 14 14411 13998 -7548 -8956 -10137 -4745 6649 2779 6912 4650
133D650j2732Q4P14P739R428n486k058l942o890K013K919Q072P770o984q226n813
149h742o64R710M723L255l18q945o513j690N147R879L014k929n011n962j365J405
165e006M502P799J662m219p286o313K100O013O268L948l269p009o079k071N874
180c086Q011L806j850o475n668j624K582O023M839P63l652o209l438R7M971N560
196D650K535k025n707n369m56L774N644M295j399m998n208j775K875N184L319
211E339L83l329m361l171P38L818M257J431j369l990l279j203K319M600L137n12
227D808l918l779j683J991L706K691K95k464l367k081R15K760K998P72j626k670
243f52j945j01J325K474K021Mk670k376j392J574K740J678m9j805k233j356P64
$$ plain form
133 4650 -8082 -7998 -7284 455 9883 4397 2339 -1603 -8493 -6480 -3561 4511 12281 5297 -2929 -8742
149 -8742 -9406 304 5027 8282 7964 -981 -7494 -9184 -4037 5842 8856 5927 916 -5046 -6411 -5006
165 -5006 -504 7295 8957 4738 -2548 -8861 -6761 -748 5520 9468 6199 -810 -6889 -8960 -3086
180 -3086 4925 8731 6881 406 -5262 -6886 -4304 1719 6558 7321 3669 -2540 -5978 -5881 -910 4650
196 4650 7185 5160 -547 -5916 -6372 -2598 3046 7341 5942 944 -4264 -6039 -3164 2020 5339
211 5339 5722 2393 -1968 -5139 -4401 -583 3674 5105 3736 -254 -3533 -4736 -2417 2183 5320 4808
227 4808 890 -2889 -4572 -2581 1125 3816 4111 1647 -1720 -3801 -2886 -126 2872 3644 2018 -652
243 -652 -2597 -2698 -1373 1101 3122 3126 456 -1920 -3312 -1738 1002 2680 2631 826 -1407 -2763 -1999
260a999K350J656K10j558j765p60K96J524J167Q97m73j832j196l48J166J315J311
277A961o65j477j458m89J022J798J140n41j912p57l15Q89J079P22N59j051j316
294h11o30L46J075J015Q1l24j075j223j66J164J533Q06p91j375p47k63Q10Q76
312C01J065k51r90j225m22P71Q52J131j98o69q48q96N00O73J115J75l21j191m13
331h41m17P76N68J280m23q61j183j99M60J170O09K55j148p56n19J77R69R76K36
350A129p55q52p65K51P15R46L34Q1r67q87j67K36R48P75m20k32q34j46M3N41N98
371E72L88o04o18l77k33N15N89M65j80m11o07j67L84L45N27j19l95m07k26n1P92
392A82L87n0q6k35p76j48O70K31M62j75m79m31o3L61K36K05J86l36l68k30K73
$$ plain form
260 -1999 351 2007 2217 659 -1106 -1866 -1570 -46 1121 2018 1545 -287 -1483 -1831 -665 650 1961
277 1961 1296 -181 -1639 -2128 -1106 692 1832 1291 -621 -1378 -1693 -804 275 997 1556 505 -811
294 -811 -1441 -1095 -20 995 1076 752 -323 -1546 -1712 -548 985 1791 1000 -375 -1122 -1385 -575 301
312 301 1366 1115 125 -1100 -1522 -751 101 1232 1034 365 -483 -1379 -879 -206 909 1084 763 -428 -841
331 -841 -1258 -482 86 1366 943 82 -1101 -1300 -840 330 939 1194 46 -710 -1229 -1052 -83 893 1129
350 1129 374 -478 -1243 -992 -277 669 1003 1084 117 -770 -937 -701 247 1022 602 370 -464 -610 -567 -26 572
371 572 960 356 -262 -639 -872 -357 232 697 517 106 -501 -668 -284 61 588 469 74 -333 -559 -610 182
392 182 569 519 433 198 -578 -726 -56 175 637 462 -17 -448 -511 -150 86 291 477 141 -227 -457 -184
413a84J81K15L2j36k55k33J00K27J83P5n9k25l63K92K10J14J71j38k82m53K74
434b54K9K33K31l9j48k45J26j00K66J20L9j82j08m51K06M34K63k00j86q8N5l05
456c04K07J99J50n4o27K9L80J86j37N7n1M4j92R0j97N63o2K70j83m37l7K16j96
479h6K73J05l04J45k34l09O03o4P7q5m94L53j85L02J37K00j92j80k96Q0M2p5j2
502a99K65L75o07J34j5j89K43l0K65k93jo0J37K73q6j14m5k05K54n3j53J93K60
525C49m2M8k32j09R3j6J36j3L0j51o8k02J47j01J33o9j0n8J71r4k77L99J14n2
549A26j7o3k6j60J1R2k57J10M09p7N2k48j5J47l24K69J95m10L52n2k67j4K54j83
573i6q3L93l91L69j84j07n0K39o9J15m29M46n5J09p2k41K01j38K98m26J08J68
$$ plain form
413 -184 -3 212 244 108 -147 -380 -280 -53 130 205 146 -79 -442 -150 60 174 345 207 -75 -528 -254
434 -254 -225 8 239 200 52 -193 -67 -167 99 219 258 76 -32 -483 -277 157 420 220 34 -54 1 -304
456 -304 -97 102 252 198 -429 -400 -20 166 29 86 35 79 -113 -23 -220 343 281 551 368 -69 -106 110 -86
479 -86 187 292 -12 133 -101 -410 193 129 206 121 -373 -20 -205 97 234 434 242 62 -234 -154 -112 -187 -199
502 -199 66 441 -166 -32 -47 -236 7 -23 242 -51 -52 -112 25 298 212 98 53 -152 102 49 -104 89 349
525 349 307 355 123 14 107 91 227 214 244 93 25 -177 -30 -131 2 -67 -77 -135 36 -58 -335 64 178 126
549 126 109 46 20 -140 -129 -37 -294 -184 225 148 200 -48 -63 84 -240 29 224 -186 166 114 -153 -167 87 -96
573 -96 -179 214 -177 192 8 -99 -149 90 21 136 -293 153 98 207 135 -106 95 -43 255 -171 -63 105
595A05k02j08K74l7r6K95p6Q0l13RJ39jqo4J75j70K31jm14J13m8K82j38k55M95
620B67l73j7oJ86R5j42M7j55L88m09N9R3k14J69l4J21j18K93l66l89P32j00j39
643a2M8j94K65J76m5o6q1p9n0q8K06o8K04j15j00R0k93J0J38L8k4K90k90l1l0
668a01J50j2kK10j69l68kK91O1L12n40K07j05j32L69l49L11k34J31N4k41J90J00
691A31n3l46J31R8o3R3j95J60qJ81l34M37l66j31M99m76J88q4O5K78j15j4k66
714a90K03J10k85L03j35r2k11L66n2k90N16m34q2J64K7K57l47K94m52L25j23J06
736b2L7K39k7k78l9J90m5J73k51L7J15l0K59m68K86j51N7M5J34l68l4K53l42J68
760f2J91j84j5K84j23r0R7k8l28M92o6j54p3M8K23m35K87l9l6j12K38p6l05K6
$$ plain form
595 105 -97 -205 69 32 -64 231 155 235 -78 -69 70 69 61 -3 172 2 233 232 -182 -69 -117 165 27 -228 267
620 267 -106 -123 -129 57 152 10 57 -98 290 -119 -60 33 -181 -12 -46 75 -43 250 -116 -505 227 127 -12
643 -12 36 -158 107 283 238 172 91 12 -38 -126 80 12 216 101 1 91 -202 -192 -54 -16 -40 250 -40 -71 -101
668 -101 49 37 35 245 76 -292 -294 -3 58 370 -170 37 -68 -200 169 -180 131 -103 28 82 -159 31 131
691 131 78 -268 -137 -39 -102 -9 -204 -44 -52 129 -205 232 -134 -265 234 -242 -54 -138 -73 205 90 76 -190
714 -190 13 123 -162 141 6 -86 -297 69 17 -273 243 -191 -273 -109 -82 175 -172 122 -330 -5 -128 -22
736 -22 15 254 227 -51 -90 100 55 228 -23 14 129 99 358 -110 176 25 82 127 261 -107 -141 112 -230 -62
760 -62 129 -55 -70 214 91 1 98 70 -258 234 168 14 -59 -11 212 -223 64 25 -11 -123 115 39 -266 -240
784b40M77n7q4l67J94j52K38M0nj86K81j61K9m6J66k69J16K04k49j03J71M8j77
807a32J31J02k18j5J20Ok63M14l73M74l04J47m24N15j83N9K28k19j79J61J44k44
829e3K32q8j44J26J40k53j25L75j70m20L65K0L7L36m07m9P4j24K35j42N0K4l08
852b69L09p9L2P3j65K12l64L38j30J19%k75M28j58j78K03k63J67J38m62J62K3
874a39q1K26j29J50K35k65K2r5L42k87J02k93K55n5K56q6L0k90J70m04K55j51
896b32m0N81n21M2M4L4o1J76O0J18j13k72K29k00J94p5K08j10k13L20Ml04K86
919A55j15N4k76K32L8j69q2J12J7k04P1J28J49J83l06L10l44J31o5j1k40L45K1
942A34j10k41M22j49j32K01l6l03j3R8L32j82j92N17l81O3q3kp4K91k65L56m03
$$ plain form
784 -240 237 180 96 -271 -77 -229 9 49 44 -142 139 -22 7 -39 127 -142 -26 178 -71 -174 -3 45 -132
807 -132 -1 101 -117 -132 -12 -6 -269 145 -228 246 -58 89 -335 180 -3 56 284 65 -114 47 191 -53
829 -53 179 91 -53 73 213 -40 -165 210 40 -380 -15 5 42 378 -29 -78 -4 -128 107 -35 15 39 -269
852 -269 40 -39 -7 66 -99 113 -251 87 -43 76 76 -199 229 71 -107 96 -167 0 138 -324 -162 -139
874 -139 -220 6 -123 27 262 -3 19 -76 266 -21 81 -212 43 -12 244 158 188 -102 68 -336 -81 -232
896 -232 -272 309 -212 -170 -126 -92 -153 23 83 201 88 -184 45 -155 39 -36 172 62 -151 169 173 -131 155
919 155 40 94 -182 50 88 -81 -163 -51 -34 -238 -167 -39 110 293 -13 297 -47 84 19 8 -232 113 134
942 134 24 -217 205 56 -76 125 89 -214 -227 -129 203 21 -171 346 -35 28 -55 -57 -131 160 -105 251 -152
965a52R3N8p3K29k42LL96l24O4j91K24P0p2J3k73M2J52K05K4m79N07l26J9L15
989B82k58R8n7j96l7m3J25j77K99k28K03q3K36j83j3K0JJ61j85k9j05K81k09P8
1013a9J99j82J31j81J16l2j60K90k72l6K14k0k77J14K9M35k62j93O9j75J83k15
1035b44L18j4j50J70L55m94J87M6j14j62J91m09K7J56j9K27q9O4k22N2K1J6j2
1058i9J85j60M1L4J30o2k95L24j73J79J44j28l4k28P4p3NO9J48l3k4K27k56j25
1082a30J91j31J22R1l44K53j52QO1J13q4O5k02K09j09P2L2l04K68l70J71J28r2
1105a34K21j15J75l24L6J74M5j16K18m51L18l75K41j32K63K9q4L57l41J97j57
1126D5J56l62J09n4L69m37J31M1k11L9J29J01K30o6j69m00P83l51M3r0P4j97m2
$$ plain form
965 -152 -59 -1 -74 155 -87 -84 312 -12 52 -139 85 155 83 96 -177 -135 17 222 246 -233 274 -52 -33 282
989 282 24 122 65 -131 -168 -211 -86 -263 36 -192 11 -72 164 -19 -32 -12 -11 150 -35 -64 -169 112 -97 -19
1013 -19 180 -2 129 -52 64 32 -128 162 -110 -146 68 48 -229 -115 -86 349 87 -106 -37 -212 -29 -244
1035 -244 74 60 -90 80 435 -59 128 174 60 -102 89 -320 -293 -137 -156 71 -18 46 -176 -124 -103 -87 -99
1058 -99 86 -74 -33 1 131 69 -226 98 -75 104 248 120 86 -142 -68 -141 -136 -67 81 48 24 251 -5 -130
1082 -130 61 -70 52 143 -201 52 -100 -92 -31 82 -2 63 -139 70 -39 33 65 -239 29 -341 -170 -42 -134
1105 -134 87 -28 147 -177 -141 33 78 -38 180 -271 47 -328 -87 -219 44 73 -11 346 5 202 45
1126 45 201 -161 -52 -106 263 -174 -43 -2 -213 -174 -45 56 286 220 51 -349 434 83 126 36 110 -87 -129
1149a29L43l93L35j57J30k97K99k14N1P3J85l54k8K86M1l04J21Lj17J36M0m1O9
1172G8j11L23l31j58M37N0j18k46n8K13k38K91J09j79J33r4j35j88K30K04k12
1193@k30j28J64K54k76M86k03j53K59j93m3o7J42J80l53j52M94k05Q3j77K3PJ64
1216G6m3q7K1J03k69J56Q4K35j89K09o34N63j12m8j41Q3J18k9n09L84j72j6J20
1239i7j39L29j96K10k41J35q9k9J07p0J55j28R8K2k85M23k15N9L7Q5k01J14j27
1262d3J17j06O4K02l10K48n4k62J40J03l9j41M2K0J67k39J41L5j52K82j64k19
1284a68m6K07l7p0J29r0J95O5j55O9k08L79k43k53K72K6j67j4M96l31j96J44k19
1307b15K71o6K13l61M73k86j67J40K51l98J71J63n5j98k75K45J04J30j66j34L33
$$ plain form
1149 -129 214 -179 156 -1 129 -168 131 -83 -32 41 226 -128 -156 130 171 -133 -12 -9 -126 10 50 9 78
1172 78 -33 290 -41 -199 238 288 170 -76 -134 79 -159 132 241 62 195 101 -34 -222 8 212 0
1193 0 -230 -358 -194 60 -216 270 67 -86 173 -20 -63 -130 12 192 -161 -313 181 -24 59 -118 -95 -88 76
1216 76 33 -54 -33 70 -199 -43 41 276 87 296 -338 225 113 65 -76 7 125 96 -413 -29 -201 -217 -97
1239 -97 -236 93 -103 107 -134 1 -88 -117 -10 -80 75 -53 45 67 -218 205 -10 49 86 171 -30 84 -43
1262 -43 74 -32 32 234 -76 172 118 -144 -4 99 60 -81 -39 -19 148 -91 50 85 -67 215 51 -168
1284 -168 -214 -7 -44 -114 15 -75 120 185 30 99 -109 270 27 -226 46 72 -95 -109 387 56 -140 4 -215
1307 -215 56 -10 203 -158 315 29 -138 2 253 -145 26 189 134 -64 -339 -94 10 140 -26 -160 173
1328A73j64L66k26j79J01J8N9j10J0J3m8j07K6J64k64J77l27M36q4k6Q5m83M25
1351C5J55m31K39p1O5J12j0O1j43m5K3o0K6l7K06r7R8j49J61j11R1j79J47J46
1375B32l83J94r4N7o1J5J00j95p8J42NO7JJ38k23k1O0K61l58L17k38k6J92j82
1399g8K22j05q2%j07J00J8R0R2j81L5j05K38q1J74j72k56N2M5L9k5k1M6M2R1j03
1425c2R8k80L24L5j21R2l1k14K81l1k9p3l7rj07K51n4l07M33j04k24L10j36M2
1449G7l70M86K4j54j55J46j14q7K60K55l55R2m40L57k0K84j66j42j21K67j42P3
1471E5J61k89J82j53m1K8k45K98N6j19j45J99j14L42r4r3Q5J17j27j4j79p5J80
1494A5J32M2l46N8J12K08m93K17l10L46K16j85l19J58K89j62j11k0J08N4Pp2J19
$$ plain form
1328 173 9 375 149 -30 71 89 148 38 48 61 13 -94 -68 96 -168 9 -318 118 34 8 93 -390 35
1351 35 190 -241 -2 -73 -8 104 94 155 12 -33 -10 -70 -44 -81 125 28 126 -23 138 27 118 -61 86 232
1375 232 -151 43 -51 6 -55 -40 60 -135 -213 -71 -66 1 2 140 -83 -104 -44 217 -141 176 -62 -88 104 -78
1399 -78 144 39 -43 -43 -150 -50 -32 58 150 -31 4 -101 137 56 230 58 -198 -146 -101 -62 -87 -108 -62 -20 71 -32
1425 -32 66 -214 110 145 24 116 85 -129 152 121 92 19 -18 -27 -134 117 63 -244 189 85 -139 171 35 77
1449 77 -293 193 217 63 -92 54 -60 -147 113 368 13 105 -335 22 2 286 120 -22 -143 124 -18 55
1471 55 216 -73 109 -44 -85 -57 -302 -4 52 -67 -212 -13 -127 215 121 28 113 230 103 89 -90 -165 15
1494 15 147 189 -157 -99 13 221 -272 -55 -365 -19 197 12 -307 -149 140 -22 -133 -153 -45 9 16 -56 63
1517F3j70J04Lp4L45l22l3L19j18k55K86p3l52R7L84J14k43j1q9j23J36O5o9j8
1541c4K96l73J30k9p4M4P0N4J7J48l29jJ50j94P4O8k60O14j25k79r3J36J4k23
1565a99R1M8K66q2K6n2r1p3p1P6J7J82K04j23n0m23N32k33j43m0K80l16O6K71
1589A63L4k72K3J41J0K0n2j09J69j02p6k49L74j35k49O08j98j01n4J4M7K6k40
1612b08K86P4k52P4r2O6%P0k25L67P6k07K30l85P9J39j57K19J48k99Q5r0J65l50
1636a87l9R9J9M74m80J88j7j51J86M3o3j16L72m33L32m58J84J89j52o2K15j88
1658d5l4P3K27j66p5k4L33n26K17p5J90k77J05j8J84kP7q9k71K28k1l3qn4j40
1683b24Q2L66k38Q1L4n1j10N7L41m08J78j69J58J7j89J5J36j5r7j08p0M09l5J47
$$ plain form
1517 63 -107 -3 0 -74 271 -51 -84 235 117 -138 148 75 -277 -180 204 318 75 64 -25 -148 -12 53 -16 -34
1541 -34 262 -111 19 -10 -84 -40 30 84 101 249 -80 -81 69 -125 -51 17 -243 371 246 -33 -126 10 24 -199
1565 -199 -108 -60 206 124 150 98 7 -66 -137 -61 -44 138 342 219 169 -254 278 45 -98 -138 142 -174 -108 163
1589 163 197 -75 -52 89 99 119 67 -42 127 25 -51 -300 74 -61 -310 298 100 -1 -55 -41 6 32 -208
1612 -208 78 152 -100 -26 -118 -52 -52 18 -207 160 236 29 259 -126 -47 92 -65 154 302 3 88 -2 163 -187
1636 -187 -226 -127 -108 366 -114 74 57 -94 92 135 72 -44 328 -105 227 -231 -47 142 -10 -72 143 -45
1658 -45 -79 -6 221 55 -20 -44 289 -237 -20 -95 95 -182 -77 -95 89 87 164 75 -196 32 11 -22 -30 -84 -224
1683 -224 -142 224 -14 67 101 50 -60 -3 338 -70 108 -61 97 114 -75 -60 76 61 -36 -144 -214 195 160 307
1707C07l45pK8L50j99j92O0j20J32j01n1J72L7j79J3K25k35J91N9l5J91o8m32
1730a99J66K66n1J6k35q5J08k45L33N8k68L99k68J07r4j8P4P1Oor1j35K05j6j51
1755e3Q5J31q2l3l10M01J28l3m55K14o4o3J64O7j73j15K01m1n6M04m31O5K01j07
1779D5J46j93J1k53O42p55L61M27l56K02l03L15q0j04Rq0n8m5J71k47O2K08r7
1802B8J18k23K79j67j54p9L18J85r5j72Q9k61L54l82L5L19j75J1l66K83M1j42
1824a56K48k30R9O5o9R4q6J58l00m7L39q6J69J08l03k09K1J39K01j23p6K87l84
1847a41L35j63j6m0L23l61J10k8r5K02j03j7j48p7J65J2J2k9k04J97M0J7N1j08
1871f6Q3k28J33L58l20p4K78m7k49J56j82J63o6K4k79K95j61j88K63K7j00L07
$$ plain form
1707 307 -38 -45 -17 333 134 -58 2 -118 14 -87 -138 34 71 -108 -95 130 -105 86 145 110 301 233 -199
1730 -199 -33 233 182 198 -37 -122 -14 -259 74 132 -136 263 -5 102 8 -10 64 135 141 135 44 -91 114 98 -53
1755 -53 32 163 81 48 -262 139 267 234 -221 -7 -71 -134 30 97 -76 -191 10 -31 -87 317 -114 -49 152 45
1779 45 191 -2 9 -244 398 -357 4 431 75 277 -26 289 209 105 114 34 -24 -69 102 -145 -83 125 28
1802 28 146 -77 202 35 -119 -198 120 305 210 38 127 -134 220 -162 -127 192 17 28 -338 -55 -14 -156
1824 -156 92 -138 -39 26 -43 51 -35 123 -177 -224 115 29 198 306 3 -206 -185 -46 155 32 -44 243 -141
1847 -141 194 31 15 -25 298 -63 47 19 -76 126 23 6 -142 -219 -54 -42 -30 -59 -263 -66 -26 -9 42 -66
1871 -66 17 -211 -78 280 -40 -114 164 117 -132 24 -158 5 -61 -37 -316 -21 -182 -370 -107 -80 -180 127
1893A27k88P1O5P4R6l19J33pp0K15k13K56l44M6J19o1j01O3J50N7j51k25L48O9
1917A10j23oJ22j21L8J73J77m44j22K09J3k50J53j57o8L49k92J46j4J99l00j4
1939b22l8N74k50m3j5L0J38O9k42L6q7q4K60j63J9j12L52m72n2K78k20M86o7j10
1963F5lK4K9k34J89K4k99K06j3j06K6l1j89K23J57J30j98J28j00j21K01p8p3j70
1987b13M27j23j42J59n9j7n8o1P0m4J44j53k4J3N1rj76O5J51J70k92J11J99l62
2011a73P2j60N56m62R8J86j49k2K6l74J09K68J73p6O7J54k69K5p0J4l57O13m5
2034B04k81k62M83l59M31j38j98J52n9K28l00J84m43L58K7l9j28lN5J22j15m4
2056a25K20n8q7J19n1m7n0j8m7L60j15l19K75j57M3N1J27r5J64j22q4L4K22m48
$$ plain form
1893 127 -161 -90 -25 49 145 -174 -41 -48 -118 97 -116 140 -204 -158 -39 -100 -201 -138 12 69 -82 -307 41 110
1917 110 -13 -19 103 -18 20 193 370 -74 -196 13 26 -224 -71 -228 -296 53 -239 -93 -107 92 -208 -222
1939 -222 -260 314 64 21 6 36 174 243 1 37 -50 -134 126 -37 -18 -130 222 -250 -302 -24 -244 242 175 65
1963 65 62 86 115 -119 70 94 -205 1 -12 -118 -92 -123 -312 -89 68 198 0 128 28 -93 108 30 -43 -213
1987 -213 214 91 -51 108 49 32 -26 -87 -17 -61 83 -70 -94 -81 -30 -39 -215 -150 1 171 -121 -10 189 -173
2011 -173 -101 -261 295 -167 -69 117 -32 -54 -28 -402 -293 -25 148 72 139 293 24 49 -21 -7 -364 249 204
2034 204 -77 -339 144 -215 216 78 -120 32 -27 201 -99 85 -358 0 27 -12 -140 -143 -88 34 -81 -125
2056 -125 95 37 -50 69 18 -29 -79 -97 -144 216 101 -218 57 -100 -57 -6 121 26 190 68 -16 18 240 -208
2080b08o4L11j77K16K88m77J81M6J09q3k22K21k45K93k39l4J10K75l98L5j21j3
2102a96q2K88j24M1L44o6k30J07k86K13R4O3j67j8k5j36K62L8j97J45j46J31M7
2125A00lR4j74j52J49NJ8j53k72J44N2K41R3J8m14L86j70M2K4L9m3K5m5K35k69
2150c0M6j37L35j53k12O1K9L34l98K02q7J01k75J22j48K25j52L99m6kj82j29J77
2173H0J63n13M82o2j58K51l12k86L80j08L31k74J31j7k64m6J32P9K3N3k72L70
2195A63m72K64J36K0j63j23p2M13l6k77K51j63J6L28m54K40n4k97L28L9p5k2P6
2218F6l7j39J57k31L45p8K68n99J20J18J33l27J7K62k62K1L45l5k88J47k2K34
2240B15l8j3k70K83j86j59K31l3k2NL9j44K41l8k52J29J90p9J66r8j66R5l03N5
$$ plain form
2080 -208 -272 39 -138 78 366 -111 70 116 225 142 -80 141 -104 189 -50 -84 26 301 -97 -62 -183 -196
2102 -196 -278 10 -114 -73 271 205 -25 82 -204 9 103 166 -1 -19 -44 -180 82 120 -77 68 -78 53 100
2125 100 97 191 17 -135 14 19 37 -116 -388 -244 -192 49 142 160 -254 132 -38 4 28 67 24 49 4 239 -30
2150 -30 16 -121 214 61 -151 -90 -61 273 -125 77 -10 91 -184 -62 -210 15 -137 262 216 214 32 -97 80
2173 80 243 -270 212 150 -8 243 -69 -355 25 -83 248 -26 105 88 -176 -222 -90 -11 12 65 -207 163
2195 163 -309 -45 91 111 -52 -175 -247 166 130 -147 104 -59 -43 285 -169 71 17 -280 48 87 12 -10 66
2218 66 29 -110 47 -184 161 83 351 -248 -128 -10 123 -204 -187 75 -187 -166 179 144 -144 3 -19 215
2240 215 177 164 -106 177 -9 -168 63 30 8 13 52 -92 149 111 -141 -12 178 99 265 167 1 96 -207 -152
2264a52K79l68J37o1J4J5J79rk53J00j28L47j2L2k22K40o2j13J89j21l56M21k2
2287G4r6K65k02k78O81k96j19j48P8k3K26j02j11J16NJ43j40lJ20k00k65J73K66
2310A64m48j6J21J44L51l92J33M1M5j36J07j32J4J00O7n5J6j77k7k6M24m70m7
2333a99Q7k53M12j57L48k66j18K23q3R1J06j69M2k48J49K04j02Jj02L46o10N42
2355B44k11K24k40m7M14l19l00L20K30n78J66O1O6L7J9j75J41j76J38J79j0J9
2377B02l95K51J8Qr3j31K54q7J50jj61l5J77l76K84M4r0M9pj84J18j00J80j35
2401f0K33l71j0L30j95J08j53J23m6N2j0J88m18K10o2j26R0J06j1P8j16m8L0Q6
2425HM2k37K45Q5l25M19q3K6j98k7P6j84K93r3j57j71M75j15oj14K1m1j81J43
$$ plain form
2264 -152 127 -241 -104 -165 -151 -136 43 34 -219 -119 -247 100 88 120 -102 138 76 -37 152 31 -325 96 74
2287 74 -22 243 41 -237 444 148 29 -119 -41 -64 162 60 -51 65 70 213 73 70 190 -10 -275 -102 164
2310 164 -284 -300 -179 -35 316 -76 57 98 143 7 114 -18 -4 96 163 108 124 -53 -80 -106 318 -152 -199
2333 -199 -112 -365 47 -110 238 -28 -146 77 -6 85 191 22 64 -184 -35 169 67 68 -34 312 -298 244
2355 244 33 257 17 -30 384 65 -235 85 315 -263 -97 -36 30 67 86 -89 52 -124 14 193 183 202
2377 202 -193 58 76 84 -9 -140 114 27 177 176 15 -20 157 -219 65 109 19 68 61 -123 -5 -105 75 -60
2401 -60 173 -198 -208 122 -73 35 -118 5 -41 11 1 189 -229 -19 -81 -207 -117 -11 -22 56 -60 -108 -78 8
2425 8 50 -187 58 143 -182 237 154 180 -18 -45 31 -153 140 47 -110 -281 194 79 73 -41 -20 -61 -242 -99
2449i9K81n9m60L26l61M18J33k55o5L35j78j07K05k5k40M9O8k38K60J54l07J26
2471c9L17m96N52n31M05k50J31j37k81N32m42O4K28j60l5J41K4l98L39R9j64J69
2493F8p7r9r1J66k04P0J11k00K02p5J87q6r8J00M7l9k81K75J19q6R6M8j99L4O6
2518E4p9K1qk2Rj12J99N3q8r1K0m0j44N21k55L54q6l28JN1k80L39p6K19l04j31
2544b03J2j3M16j24L5L7k97J04M18n24J02n6J09L4k21J94Q8k83L04n2k12J22j41
2567a51J08J13%J68n02K30j58L95k38RJ38k59K57l8n4J7K40k88K16k01O5J16p6
2590A07j50J02k47J01M43l05J71j67j96J99R9J9m29J72j46N60l63J47m7ql10L65
2612A17j81O3L64k54j68m3J39l05L91j57k00j9N09q7l3j65o8K14O1m5j29J32o4
$$ plain form
2449 -99 182 123 -337 -11 -372 46 179 -76 -141 194 16 -91 114 89 -151 -102 -34 -272 -12 142 -165 -39
2471 -39 278 -218 334 -197 208 -42 89 -48 -329 203 -239 -175 53 -107 -142 -1 23 -375 -36 63 -101 68
2493 68 -9 -108 -199 -33 -237 -167 -56 -256 -54 -129 58 -28 -126 -26 21 -18 -299 -24 95 9 105 153 -46 -12 54
2518 54 -25 -4 -12 -34 -25 -137 62 115 27 -64 -44 -84 -228 293 38 392 306 -22 -21 30 -250 89 13 232 -72 -203
2544 -203 -191 -204 212 88 123 160 -137 -33 385 -139 -37 -93 16 50 -171 23 111 -172 132 80 -132 -10 -151
2567 -151 -43 70 70 238 -264 -34 -192 203 -35 -26 112 -147 110 72 18 35 275 -13 203 2 67 183 107
2590 107 -43 59 -188 -87 356 51 222 55 -141 58 157 176 -253 -81 -227 333 -30 117 70 62 -248 117
2612 117 -64 -1 363 109 -59 -102 37 -268 123 -34 -234 -253 256 169 136 -29 -97 117 178 133 4 136 72
2635G2K5RN6n07J09K67k3l4Q6P8j59j03P3j02M12k88j74L65j28p2j74J30J1K02
2659A31J9j59p7M21j22m06J6M01p7k19k5j27QJ60j2J50j24K0L9K69k54K61k21
2682G2k8p8J31j65j10k61K40K9K11k22l1L42j37J83j16K2P1q6k69K00P5N4l28
2705b01M12k21k32J13k36O62j97k55n0P1K11J92j75K1l88J23Q9K9J44K55l86l5
2727e4M7j4K6N8j4j67K17r0P9M2J02N1k8m10N7l04M26r7J69j29O0K44j72Kj76
2752g5j2qN8J34K8k52J37jJ22k53J5J39kJ05J31l87K32j73j18j2mL3M0R3J54m6
2778G8K36l76j30O6o3L35o6k19l1J23L5N9J03m01pM03L0P1m1j79l7M9Mk96L94
2803A40j44Njoj10j70M40J36k20P0j26l0R1R2k47J2j87K51K53j71l47J10J97J57
$$ plain form
2635 72 97 106 162 -345 -236 31 8 -26 60 138 -21 -124 -51 -153 259 -29 -203 162 34 -38 -212 -82 -71 131
2659 131 150 -9 -86 335 213 -193 -177 224 147 -72 -97 -224 -216 -56 -68 82 -42 -22 17 286 32 293 72
2682 72 44 -34 97 -68 -178 -439 -199 -170 41 -181 -212 130 -7 176 60 82 153 67 -202 -2 73 127 -201
2705 -201 211 -10 -242 -129 -365 297 100 -155 -205 -134 77 269 94 115 -273 -150 -61 -32 112 367 -19 -54
2727 -54 -7 -21 5 63 49 -118 99 9 88 130 232 283 255 -155 -98 -402 24 -73 96 -33 27 271 99 101 -75
2752 -75 -87 -95 -37 97 125 -127 10 9 131 -122 -107 32 30 135 266 -121 111 -62 -180 -192 -196 -163 -123 -30 124 78
2778 78 314 -62 -192 -126 -189 146 80 -139 -170 -47 -12 47 150 -251 -258 145 175 246 205 26 -11 38 42 -254 140
2803 140 -4 1 0 -6 -116 -286 154 290 70 140 14 -16 75 167 -80 -68 -255 -4 249 78 -269 -159 38 195
2827A95j65N6j75RQ1L8Q2O1L7k30j70J32N6L4R8k96K39O2q2m7k45K31k4j48J64
2852gK00k89J8L99n56J88N4pj08K87n86L71J13m22K74J4J33M0l66J92J09l39K21
2875f7j46L67k40J66j34N8N7Lk91L27N8q2p0J81n19M68R1j75P7M0k15O2J72k22
2899c4K94l73j0L7o0R4J54j63K70j21k86PK09r7k05M13l19K40L28m05j04K40M0
2922A49K6k52M9m2qK6J41j81J12k53K42j04K69P7k03j81jJ88r6J64q8j26N1K54
2946B13j32J39l64K83k70P4l1K40k17J42J14j33K0J37m00n3K79k30R5N6j47M59
2968B74m63K25K2j81K15k16K54p6K0j5l4j11K12l20J11O1N0j89K32j89K00j72
2990i0K22q6m60J81k8N06k00N0l65J61j8K53j01lJ66n7Rj46j92J77J38j14M21
$$ plain form
2827 195 30 86 -89 -80 1 39 121 182 219 -11 -181 -49 7 41 139 -157 82 144 62 15 -230 1 -23 -171 -7
2852 -7 193 -96 -78 321 -235 -47 7 0 -108 179 -407 -36 77 -345 -71 -57 76 116 -250 -58 51 -288 -67
2875 -67 -213 154 -86 80 -54 4 61 64 -227 100 158 76 6 187 -332 136 227 52 129 169 -46 16 188 -34
2899 -34 260 -113 -123 -86 -146 -52 102 -61 209 88 -198 -191 18 -79 -284 129 -190 50 378 -27 -131 109 149
2922 149 175 -77 -28 -70 -78 -52 89 -92 20 -233 9 -95 174 251 48 -133 -134 54 -42 122 34 -92 -41 213
2946 213 81 220 -144 139 -131 -57 -88 152 -65 77 191 58 78 215 -185 -238 41 -189 -94 -38 -185 274
2968 274 -189 36 58 -123 92 -124 130 54 74 59 25 -86 126 -194 -83 -22 28 -161 71 -118 82 -90
2990 -90 132 46 -414 -233 -261 245 45 95 -270 -109 -127 126 25 22 188 131 140 -6 -198 -21 117 3 424
3013D24n54N6L16k95%N3J77r3j28j20K2QR9n2J04J04p7j59Q3k18J26P2J8J74k44
3038a04J73o4J7n9n3R0j89P0J28L0K24l65j67J09J78j85K39k6L43l88r3M97l48
3061E7m2P0k53L05k76J0J70J99l49J77j25M6J13j66M6k0J22j74M8j3K95m33K80
3084H7q3J52l39q4K08J92k63J54j42P2L06p2l44j94L32J13k89N0q6J66J98J41
3106B75j74M8L0l0j17M7pL4p2J12l11j2K80J9o7J52j56L7k57R9m2J87j55P2J03
3131I5j13J1n6LP8ln1J90j72K01k52j48K05k25K46k90M70k02L81k84j46K67l5
3154A70j8j16J58l19o1N4J09mK19k38J93j87j7K4k56L83j24M3k49L08J16K78o04
3177a38qJ81j06K9N8L0J58j72k43L38l09O8K13J56l11n8N3J74l07J63qJ66k97
$$ plain form
3013 424 -130 -74 242 -53 -53 0 177 84 -44 -164 -142 -134 -35 -87 17 121 44 -115 -32 -250 -124 -52 -34 140 -104
3038 -104 69 5 22 -37 -90 0 -189 -119 9 39 263 -102 -269 -160 18 -167 72 46 389 1 -92 405 57
3061 57 15 85 -168 137 -139 -129 41 240 -109 68 -57 -11 102 -64 -18 -38 84 -90 -42 -55 240 -193 87
3084 87 4 156 -183 -267 -59 133 -130 24 -118 -46 260 188 -156 -350 -18 95 -194 -144 -230 -64 134 275
3106 275 101 149 179 149 32 79 72 106 34 146 -165 -177 103 122 55 207 51 88 -169 -70 -112 75 -80 -8 95
3131 95 -18 -7 -63 -60 18 15 -36 154 -18 183 -69 -217 -12 -237 9 -281 189 -13 368 84 -62 205 170
3154 170 152 36 194 -125 -186 -132 -23 -27 192 -46 147 -40 -57 -33 -289 94 -30 13 -236 72 188 466 -138
3177 -138 -146 35 -71 -42 16 46 204 32 -211 127 -182 -114 99 255 -56 -114 -61 113 -194 -31 -39 127 -170
3200a70J98j94K86j49o2K58j81o9J9L04k05K0P4kj30J75j45j2k37M10j87j57J38
3223a8O0N9j21l01J61O9R7k01J13J59j54L2j55J84r3L67j14J10j19j9J88j52r6
3246E6j11j46L43L1p0j15R0l4j63R9j74J41nJ48k53R8q9J26RJ73n6k2J05l28P9
3271f8q6N80l87k6J56k24J82j47K4k3K78k30N0K38k54p8J7J07m05L60j19o3j11
3294b29L22j48J15k17K08j37Q0K3j06J92k64K03k4j44KK41J43k58L3k65J55N5
3316b0j87L31K1r0o9K42m31J41l9k12n6N00n8j91R1mJ39j52K9J24q8L0K54k14
3340I1j00R8R4r7j1J65k83N3K5J44m46J09J92J25j96n1K28k55M73m86M43k24j33
3363d2j18N8L85m11J50j87p7J2J45J3j70J71O3k33K02j58L57J24m21J92p0J92
$$ plain form
3200 -170 28 -166 120 -29 -91 167 -14 -83 -64 240 35 55 129 127 -3 172 27 15 -222 188 1 -156 -18
3223 -18 42 101 -20 -321 -160 -91 6 -195 -82 77 -77 -45 -200 -16 -109 258 144 254 135 116 304 152 56
3246 56 -55 -201 142 173 103 -12 78 44 -119 -20 -194 -53 -58 90 -163 -65 -154 -28 -19 154 98 76 181 -147 -68
3271 -68 -154 426 39 13 169 -55 127 -20 4 -19 259 29 79 317 63 -15 2 109 -296 64 -55 -118 -229
3294 -229 93 -55 60 -157 51 -86 -6 17 -89 103 -161 42 18 -126 -124 117 260 2 35 -230 -75 -20
3316 -20 -207 124 145 55 -14 228 -203 -62 -101 -313 -369 131 73 -118 -27 -31 108 -44 -15 109 21 51 305 91
3340 91 -9 89 183 86 75 240 -43 10 35 179 -267 -158 34 159 -37 -88 140 -115 358 -128 315 91 -42
3363 -42 -160 -102 283 -128 22 -165 -242 -230 -85 -72 -242 -71 -8 -241 -39 -197 160 284 -137 55 -15 177
3385A77j93K08l00M3M01l68O5l42K03K93l9j92Lq3L89k69R9j60k66K38l0J91k69
3408b01K81o1j07P0%k9J57o9k54K05J92l82j7M59m06k0N9Q7j70J21J19j36K22
3431A20M1k34Q0M0l1q0J42o7j84K23P6j34J26j58q9R6O6j69J01J77p9j27K13j64
3455a5j10k8L9K33k50j20K37j55M48j41j73R9j82K05j25K67M3m88L59km63K50
3477g2J3k69J85K1k5J6N8K54j8j31m6P6j25R2J52k65K7q6J60j65K40k41L00j79
3501b8q9L4r7J45j4P5o5J92o7J54n92M13j79J02K75n06K87K7J50j83n5m2K22J81
3525C40o33K02l0R7r7o1J93M9m4J38k19q2N2J21K73l62k50K93P2k01J66q9K38
3548A66j25j26L5m2K15q3q5l60L54k07K34j11o3K18J16j38p1j14M00k97Q1j79
$$ plain form
3385 177 -16 192 -108 -65 336 -32 33 -309 -106 187 148 -44 -41 -124 265 -4 95 -65 -331 -93 -123 68 -201
3408 -201 80 19 -88 -18 -18 -47 110 41 -213 -8 184 -198 -215 244 -162 -182 -123 -36 -206 -85 34 -102 120
3431 120 161 -73 7 47 16 -64 78 11 -173 50 126 -8 118 -40 -129 -33 33 -136 -35 142 63 -64 149 -15
3455 -15 -125 -153 -114 119 -131 -251 -14 -169 279 138 -35 64 -118 87 -38 229 272 -216 143 141 -322 -72
3477 -72 -59 -328 -143 -122 -147 -131 -73 181 163 32 -14 62 -63 29 181 -84 -57 -143 17 -148 92 -149 151 -28
3501 -28 -117 -83 -180 -35 -49 26 -39 153 86 240 -352 61 -118 -16 259 -247 40 67 217 34 -21 -63 159 340
3525 340 -293 -91 -121 -24 -121 -182 11 60 16 154 -65 -147 -95 26 299 -63 -313 -20 52 -149 17 -72 166
3548 166 41 -85 -50 -92 123 40 -45 -405 -51 -258 -24 -135 -198 20 136 -2 -73 -187 213 -84 -3 -182
3570a82Q8J89N5o2k83l7N05j55j92K29j93m2QK36n3R2j04L6l69L06j53L2n1K29
3594A29j42j03M9o2Q4k92L70K6r3j18J88Q3L5k69J38m8j3Q3r4jL3J65l77L41j3
3619I9j54q5o5J64K22k51K63j95%J68P7j29k12R8J61l63M1mN2j21J72L5L7P1M5
3644A26j95M2J9r0j9K77K11l40J21J5j57k0J31j84L16k67j99k8J58R9J0q3J99
3667A42Mp7K45l58r4J8J71j5q9K32l03K37k27k4K13N7J81j24j43k15J83j85J99
3690B8j90K92j91p6K81N4l46J52o5J4P1l16K80j13N9J15o2M2j39J45j22J28j65
3713a24J44j52K1J15L0p2J06j58p3N9K57j74O4J28O0j13L7j95k18qL03k40J62
3736d1j79j23K66L9l2k05M40nk98K47j44J57j54J05k04L15j66j01R8j96K26k02
$$ plain form
3570 -182 -94 95 150 88 -195 -232 273 118 -74 155 -38 -80 -72 164 111 203 99 135 -234 72 -81 -49 -100 129
3594 129 -13 -116 -67 -129 -45 -337 33 59 -34 -152 36 119 154 -115 23 -25 -38 45 -49 -50 -17 148 -229 112 99
3619 99 -55 -140 -205 -41 181 -70 193 -2 -2 166 243 114 -98 0 161 -202 -161 -165 -113 -234 -62 -27 10 81 126
3644 126 -69 -27 -8 -98 -117 160 371 31 152 167 10 -10 121 -63 253 -14 -213 -241 -83 16 26 -57 142
3667 142 146 69 314 -44 -138 -120 51 36 -53 179 -124 113 -114 -138 75 132 313 189 46 -169 14 -171 28
3690 28 -162 130 -61 -137 144 198 -148 4 -61 -47 24 -292 -12 -125 -66 49 -13 29 -110 35 -87 41 -124
3713 -124 20 -132 -111 4 34 -38 68 -90 -163 -104 153 -21 43 171 231 118 155 -40 -258 -266 37 -203 -41
3736 -41 -220 -343 -77 -38 -70 -275 165 160 -138 109 -35 122 -32 73 -131 184 18 -83 15 -181 45 -157
3758a57K01J17j38k8k2J2r8l1J55j37K64n3r1L52k59O5k50L13q1q3J32O3r4o1
3782I1j3k07K72j35r7L34j70k75K27J19K9k43p0J77M1K0j28P6j75K14j50J49m0
3805D6J59o0j6j87M7JR7N1l02M0q5K86k23O0j15R8J37j27N26n55O3l2N0J83n0
3830I2k37L83l05k4Ok52L75o9n9J74p8J64j58j5j32L8J7J62k8l89K04M50k42j12
3854c5J03k15l00M47K5n3K0K05j00k66K85m0j07j81K66J30k87j17M22m18K42n9
3876c3J10J70k71n8K60j54nm5k6P1J36K50n17N16l11k8k00K05jp1j28M25l18L9
3900A6L23k61j19p1J84n7J25m24J57R6K32l54M38p9k91K38%j24j70r3l1K52J71
3923A58J1k25M6J35Ol71K93q9K03j52k30M04k1P0k39J48j43J76k70o2J38jJ16
$$ plain form
3758 -157 44 161 23 -5 -27 -15 -113 -144 11 -126 138 85 -6 346 87 152 -98 215 134 51 183 246 152 91
3782 91 78 -129 143 8 -89 245 75 -200 27 146 175 -68 -138 39 80 100 -28 48 -127 87 -63 86 46
3805 46 205 145 129 -58 -11 -10 87 138 -164 -124 -209 77 -146 -86 -201 -103 34 -93 433 -122 -59 -91 -41 142 92
3830 92 -145 238 -67 -91 -85 -337 38 -31 -90 84 6 170 12 -3 -135 -97 -80 82 54 -335 -131 319 77 -35
3854 -35 68 -147 -447 0 25 -28 -8 197 97 -169 116 76 -31 -212 54 184 -103 -220 202 -216 26 -33
3876 -33 77 247 -24 -82 178 24 19 -26 -52 19 155 405 -112 404 93 65 -135 70 69 -2 -130 295 -23 16
3900 16 339 78 -41 -112 72 15 140 -284 -127 -31 201 -153 285 206 -85 153 153 29 -141 -234 -265 -13 158
3923 158 169 -56 -10 125 131 -240 53 -36 167 15 -215 189 168 238 -1 147 4 180 -90 -152 -14 -15 101
3946A01l48L63k41J05K68r6O3k93k12J84L8L00l87k07L39o4K45K1k66J82p7k52
3968b34J97Q0k56M38j51k04o5M40k00j16K0k30L17k2r3q1L94k64j88L98L0k59
3990d9Q3R5m9qj20J30R3r2j78J93qJ09n0k58J4j85L16k32l4L14p6J26k64J9J74
4015F3j77p8K52j61R2k32Q8K52O9k9j19j16K1j07J08J77K4k31oL6q6K05O4k35
4039a26K46j62k5l4K55q2Q5k32J33M9j15M4J02k88K67Jl34K61k6O7q0j80M84l65
4063e5N7K77p9n6o9J07k91J51k73J07m2J97J91j07j68k3M21k22k36n7K1K83J7
4086A51J1J37j59j81J3k16K66j43K09M9p3P1J38k91L1J20j83J02k06K32k47J18
4108e1J44J22k79J81k18L12l26j46K59J56L1k16J25Nk31j20K68r5K22k72J17P
$$ plain form
3946 101 -247 116 -125 -20 248 152 215 -78 -290 -106 -68 232 -155 -362 -23 -87 158 179 -87 95 18 -234
3968 -234 -37 43 -213 225 74 -130 -195 245 45 -71 -51 -281 36 14 -79 -160 234 -30 -218 180 210 -49
3990 -49 34 129 80 72 -48 82 175 83 -95 98 90 199 149 -109 -95 -280 36 -196 -230 84 8 134 -130 -111 63
4015 63 -114 -192 60 -101 -9 -241 -153 99 168 139 20 -96 -75 -182 -74 103 127 -104 -110 -74 -160 45 109 -126
4039 -126 120 -42 -67 -101 154 72 157 -75 58 107 -8 36 138 -150 117 118 -216 45 19 86 6 -174 310 -55
4063 -55 2 279 200 144 75 182 -109 42 -231 -124 -166 31 222 115 -53 -76 345 123 -113 -170 -149 134 151
4086 151 162 299 140 -41 -28 -244 22 -121 88 137 64 135 273 -18 13 133 -50 52 -154 78 -169 -51
4108 -51 93 215 -64 117 -101 211 -115 -261 -2 154 185 -31 94 99 -132 -252 16 -79 143 -129 -12 -5
4130eJ06mm9Mm8OJ3J46k14%M7R6N2j73R8k3l7k44L62K2k40J76q2j2j59Q0Ok36
4158c12L24k60L66K6%l01K26m43M60r3J00N1q1r1J22j79o0O2J93mk69K29n4l3
4182b1Q9m7Nj0Q3j56N25m73J98O7k81l4K17j05N1j53j20N5J46o8n6O4K9P5j97
4207a17O6j79J84j4M9l2q4K75j45q5K3K61j03K8l8j13j78J90K4m2L0J61k61k00
4231c00K64j38K77K1J17j01J72k3k55j86j30K10j53K93o7q7j6j48L46k73J28p8
4253a27N8J06j51j9KK67l8j78j69M06k2r1J25L5j34J07j14J28Q0k72k4J50j64
4276c9NJ17j4k47O5L6j1K0J86m5M9nj15p8J59L7k22M1J32l13L78m01K5L41j8k67
4302a84L2M38j94Q0m05K57j30O9j74J3J3L77l83L26p4j00J56j46QL22m64L44k96
$$ plain form
4130 -5 101 97 48 52 4 10 23 169 -45 -45 2 98 150 -23 75 52 15 -229 133 155 -85 91 9 -3 -162 -82 -76 -312
4158 -312 12 -248 118 144 144 -157 69 -374 86 -7 93 144 63 -28 94 -85 -145 -83 110 106 -163 66 12 -21
4182 -21 68 21 26 16 99 -57 468 -5 193 260 -21 -55 162 57 108 -45 -165 -110 36 -32 -88 -24 5 80 -117
4207 -117 -51 -230 -46 -60 -11 -43 -127 148 3 -82 -59 202 99 127 89 -24 -202 -12 12 -30 0 161 -100 -300
4231 -300 -36 -174 103 124 241 140 312 289 34 -152 -282 -72 -225 68 1 -86 -102 -250 96 -177 -49 -127
4253 -127 -69 37 -114 -133 -131 136 98 -80 -249 157 135 44 169 204 70 177 63 191 271 -1 -25 125 -39
4276 -39 -34 83 69 -178 -113 -77 -88 -68 118 73 122 117 2 -76 83 120 -102 -61 71 -242 136 -265 -240 101 83 -184
4302 -184 -152 286 92 172 -233 24 -106 -37 -211 -198 -185 192 -191 135 61 -39 117 -29 -21 301 -163 181 -115
4325a15K7p5K76j41m3R6j37n4J2J79j84n9J96Q3j84L03j92p1L76m40J73j55J83
4348E4P7N7j68j72K08J92k99K9J47n39M37M2j63N0k7PJ7J04M6j01L12l90L14l00
4372f6K05O5k96Q2nJ49o6L62l53j97J80j95J00Jk4J69j57k70M28n5j34KM4J68
4396A37l23J75J58k94J3K82n7Q4r8p1k4J54l51L87n54O27k50k03L81j77L53m09
4418f0k07L08P1j8m3K04p9j82M5Jk6L7j3m4o8Q4k38L26P2M8j28l1j36j3J67k09
4444a32J04j45LK78o7j07J27j28m2j86N08l89M9K98j10J31o0j13n0J80k16k9J56
4467F0O7R6j08k68M02j22j02J10Ro4j8J67m20K4n1J24L06j00k78K05j24R6O4j41
4491f6j7N9J68R2j78J66l05K06j36o8P2L06j98r1l15J72Q1J75j38m05N96n39M95
$$ plain form
4325 -115 -88 -163 113 -28 -71 25 -112 -166 -154 25 -159 -218 -22 61 -123 180 -12 -83 293 -147 26 -129 54
4348 54 131 188 20 -152 56 248 -51 -22 125 -414 23 65 -98 -48 -75 -68 -51 53 99 -2 310 -80 234 -66
4372 -66 139 204 -92 -10 -15 134 68 430 77 -120 60 -135 -35 -34 -58 111 -46 -316 112 57 -77 -75 -31 137
4396 137 -186 -11 147 -147 -134 148 91 175 77 6 -18 136 -215 172 -382 245 -5 -208 173 -4 349 -60
4418 -60 -267 41 112 94 51 255 176 -6 39 40 14 51 38 -6 -74 10 -228 98 170 218 90 59 -77 -90 77 -132
4444 -132 -28 -173 -170 108 41 -66 61 -67 -109 -295 213 -176 -127 171 61 192 132 19 -31 149 -67 -96 60
4467 60 127 223 115 -153 249 127 25 135 144 80 62 229 -191 -167 -218 -94 212 112 -166 39 -85 11 75 -66
4491 -66 -83 -24 144 236 58 224 -81 125 -11 -79 -7 299 101 10 -305 -133 -52 123 -15 -420 176 -363 132
4514A32k99K28l22K70R8o3KPL1p4Q2j27K11k47M70j77j84j88J13J83j58P6j20
$$ plain form
4514 132 -167 61 -261 9 107 44 46 53 84 10 92 -35 176 -71 399 222 38 -150 -37 146 -12 64 -56
$$ [...]
8191a32
##END NTUPLES=NMR FID
##END=
