##TITLE=1H_DE-54_NaOH
 d2O
 8 sc, 
 25.6.2024
##JCAMPDX= 6.0         $$ Bruker NMR JCAMP-DX V2.0
##DATA TYPE= NMR FID
##DATA CLASS= NTUPLES
##ORIGIN= UXNMR, Bruker Analytische Messtechnik GmbH
##OWNER= root
$$ XWIN-NMR		Version 3.5
$$ Tue Jun 25 16:25:36 2024 Russian Standard Time (UT+4h)  she@DPX200
##.OBSERVE FREQUENCY= 200.1312
##.OBSERVE NUCLEUS= ^1H
##.DELAY= (6, 6)
##.ACQUISITION MODE= SIMULTANEOUS
##.ACQUISITION SCHEME= undefined
##.AVERAGES= 8
##.DIGITISER RES= 18
##SPECTROMETER/DATA SYSTEM= spect
##.PULSE SEQUENCE= zg30
##.SOLVENT NAME= CDCl3
##.SHIFT REFERENCE= (INTERNAL, CDCl3, 0, 15.7039)
##AUDIT TRAIL= $$ (NUMBER, WHEN, WHO, WHERE, WHAT)
$$ ##TITLE= Audit trail, XWIN-NMR		Version 3.5
$$ ##JCAMPDX= 5.01
$$ ##ORIGIN= Bruker BioSpin GmbH
$$ ##OWNER= she
$$ F:/spectra/data/she/nmr/H-F/1/audita.txt
$$ ##AUDIT TRAIL=  $$ (NUMBER, WHEN, WHO, WHERE, WHAT)
(   1,<2024-06-25 16:24:33.75 +0400>,<she>,<DPX200>,
      <created by zg, POWCHK disabled, PULCHK disabled
       configuration hash MD5:
       00 E9 B6 7A A2 85 ED C7 34 08 36 98 17 FE 4E 26
       data hash MD5: 16K
       BD CE 51 5F 2F 5A 68 63 55 E6 D2 84 B1 CE BB C1>)
$$ ##END=
$$ 
$$ hash MD5
$$ B3 59 C5 5B C0 70 17 B1 A0 EB 40 2C 92 DD DF 65
##$RELAX= 
##$RELAX= 
##$RELAX= 
##$RELAX= 
##$RELAX= 
##$RELAX= 
$$ Bruker specific parameters
$$ --------------------------
##$DU= <F:/spectra>
##$EXPNO= 1
##$NAME= <H-F>
##$PROCNO= 1
##$TYPE= <nmr>
##$USER= <she>
##$AMP= (0..31)
100 100 100 100 100 100 100 100 100 100 100 100 100 100 100 100 100 100 
100 100 100 100 100 100 100 100 100 100 100 100 100 100 
##$AQSEQ= 0
##$AQ_mod= 1
##$AUNM= <au_zg>
##$AUTOPOS= <>
##$BF1= 200.13
##$BF2= 200.13
##$BF3= 200.13
##$BF4= 200.13
##$BF5= 200.13
##$BF6= 200.13
##$BF7= 200.13
##$BF8= 200.13
##$BYTORDA= 1
##$CFDGTYP= 0
##$CFRGTYP= 5
##$CHEMSTR= <none>
##$CNST= (0..31)
1 1 145 1 1 1 1 1 1 1 1 1 1 1 1 1 1 1 1 1 1 1 1 1 1 1 1 1 1 1 1 1 
##$CPDPRG= <>
##$CPDPRG1= <>
##$CPDPRG2= <>
##$CPDPRG3= <>
##$CPDPRG4= <mlev>
##$CPDPRG5= <mlev>
##$CPDPRG6= <mlev>
##$CPDPRG7= <mlev>
##$CPDPRG8= <mlev>
##$CPDPRGB= <>
##$CPDPRGT= <>
##$D= (0..31)
0 1.2 0 0 0 0 0 0 0 0.06 0 0.03 0 0 0 0 0.0002 0 0 0 0 0 0 0 0 0 0 0 0 
0 0 0 
##$DATE= 1719318273
##$DBL= (0..7)
120 120 120 120 120 120 120 120 
##$DBP= (0..7)
150 150 150 150 150 150 150 150 
##$DBP07= 0
##$DBPNAM0= <>
##$DBPNAM1= <>
##$DBPNAM2= <>
##$DBPNAM3= <>
##$DBPNAM4= <>
##$DBPNAM5= <>
##$DBPNAM6= <>
##$DBPNAM7= <>
##$DBPOAL= (0..7)
0.5 0.5 0.5 0.5 0.5 0.5 0.5 0.5 
##$DBPOFFS= (0..7)
0 0 0 0 0 0 0 0 
##$DE= 6
##$DECBNUC= <off>
##$DECIM= 32
##$DECNUC= <off>
##$DECSTAT= 4
##$DIGMOD= 1
##$DIGTYP= 9
##$DL= (0..7)
0 120 120 120 120 120 120 120 
##$DP= (0..7)
150 150 150 150 150 150 150 150 
##$DP07= 0
##$DPNAME0= <>
##$DPNAME1= <>
##$DPNAME2= <>
##$DPNAME3= <>
##$DPNAME4= <>
##$DPNAME5= <>
##$DPNAME6= <>
##$DPNAME7= <>
##$DPOAL= (0..7)
0.5 0.5 0.5 0.5 0.5 0.5 0.5 0.5 
##$DPOFFS= (0..7)
0 0 0 0 0 0 0 0 
##$DQDMODE= 0
##$DR= 18
##$DS= 0
##$DSLIST= <SSSSSSSSSSSSSSS>
$$ [...]
##$SUBNAM2= <"">
##$SUBNAM3= <"">
##$SUBNAM4= <"">
##$SUBNAM5= <"">
##$SUBNAM6= <"">
##$SUBNAM7= <"">
##$SUBNAM8= <"">
##$SUBNAM9= <"">
##$SW= 18.0517418723606
##$SWIBOX= (0..15)
0 0 2 0 0 0 0 0 0 0 0 0 0 0 0 0 
##$SW_h= 3612.71676300578
##$TD= 16384
##$TD0= 1
##$TE= 0
##$TE2= 300
##$TE3= 300
##$TEG= 300
##$TL= (0..7)
0 120 120 120 120 120 120 120 
##$TP= (0..7)
150 150 150 150 150 150 150 150 
##$TP07= 0
##$TPNAME0= <>
##$TPNAME1= <>
##$TPNAME2= <>
##$TPNAME3= <>
##$TPNAME4= <>
##$TPNAME5= <>
##$TPNAME6= <>
##$TPNAME7= <>
##$TPOAL= (0..7)
0.5 0.5 0.5 0.5 0.5 0.5 0.5 0.5 
##$TPOFFS= (0..7)
0 0 0 0 0 0 0 0 
##$TUNHIN= 0
##$TUNHOUT= 0
##$TUNXOUT= 0
##$USERA1= <user>
##$USERA2= <user>
##$USERA3= <user>
##$USERA4= <user>
##$USERA5= <user>
##$V9= 5
##$VALIST= <valist>
##$VCLIST= <CCCCCCCCCCCCCCC>
##$VD= 0
##$VDLIST= <DDDDDDDDDDDDDDD>
##$VPLIST= <PPPPPPPPPPPPPPP>
##$VTLIST= <TTTTTTTTTTTTTTT>
##$WBST= 1024
##$WBSW= 4
##$XGAIN= (0..3)
0 0 0 0 
##$XL= 0
##$YL= 0
##$YMAX_a= 167177
##$YMIN_a= -176783
##$ZGOPTNS= <>
##$ZL1= 120
##$ZL2= 120
##$ZL3= 120
##$ZL4= 120
##$ABSF1= 10
##$ABSF2= 0
##$ABSG= 5
##$ABSL= 3
##$ALPHA= 0
##$AQORDER= 0
##$ASSFAC= 0
##$ASSFACI= 0
##$ASSFACX= 0
##$ASSWID= 0
##$AUNMP= <proc_1d>
##$AZFE= 0.1
##$AZFW= 0.1
##$BCFW= 1
##$BC_mod= 2
##$BYTORDP= 1
##$COROFFS= 0
##$CY= 11.3945322036743
##$DATMOD= 1
##$DC= 2
##$DFILT= <>
##$DTYPP= 0
##$F1P= 15.6554695791079
##$F2P= 12.8336369535428
##$FCOR= 0.5
##$FTSIZE= 0
##$FT_mod= 4
##$GAMMA= 1
##$GB= 0.15
##$INTBC= 1
##$INTSCL= 1
##$ISEN= 128
##$LB= 0.24
##$LEV0= 0
##$LPBIN= 0
##$MAXI= 10000
##$MC2= 0
##$MEAN= 0
##$ME_mod= 0
##$MI= 1.114404
##$NCOEF= 0
##$NC_proc= 0
##$NLEV= 6
##$NOISF1= 3.799351
##$NOISF2= 2.8
##$NSP= 1
##$NTH_PI= 0
##$NZP= 0
##$OFFSET= 15.70392
##$PC= 1
##$PHC0= -25320.14
##$PHC1= 9.587481
##$PH_mod= 1
##$PKNL= yes
##$PPARMOD= 0
##$PSCAL= 0
##$PSIGN= 0
##$REVERSE= no
##$SF= 200.130013532006
##$SI= 16384
##$SIGF1= 3
##$SIGF2= 2
##$SINO= 400
##$SIOLD= 16384
##$SREGLST= <1H.CDCl3>
##$SSB= 0
##$STSI= 0
##$STSR= 0
##$SW_p= 3612.71676300578
##$SYMM= 0
##$S_DEV= 0
##$TDeff= 0
##$TDoff= 0
##$TI= <>
##$TILT= no
##$TM1= 0
##$TM2= 0
##$TOPLEV= 0
##$USERP1= <user>
##$USERP2= <user>
##$USERP3= <user>
##$USERP4= <user>
##$USERP5= <user>
##$WDW= 1
##$XDIM= 8192
##$YMAX_p= 0
##$YMIN_p= 0
$$ End of Bruker specific parameters
$$ ---------------------------------
##NTUPLES= NMR FID
##VAR_NAME=  TIME,          FID/REAL,        FID/IMAG
##SYMBOL=    X,             R,               I
##VAR_TYPE=  INDEPENDENT,   DEPENDENT,       DEPENDENT
##VAR_FORM=  AFFN,          ASDF,            ASDF
##VAR_DIM=   8192,          8192,            8192
##UNITS=     SECONDS,       ARBITRARY UNITS, ARBITRARY UNITS
##FACTOR=    0.0002768,     1,               1
##FIRST=     0,             0,               0
##LAST=      2.2672688,     0,               0
##MIN=       0,             -176783,         0
##MAX=       2.2672688,     167177,          0
$$ Real data points
##PAGE= N=1
##DATA TABLE= (X++(R..R)), XYDATA
$$ [...]
1387G7j21jJ50k05L0n5P9j15K04o3N1J16j87M2J1j4k60K75k43J09L1j09J92J10
$$ 77 -44 -45 105 -100 -70 -125 -46 -161 43 -20 31 147 -40 2 13 -1 -261 14 -229 -120 -89 -198 -6 104
1411A04j11R2M9m3ro0j2j16j7M1j4J28l11N35k96qJ06K5N1k18Q9K6rO8j65o2L44
$$ 104 -7 85 134 91 82 22 10 -106 -123 -82 -96 32 -279 256 -40 -48 58 83 134 -84 5 31 22 90 -75 -137 207
1438B07j99J18j57n4j05J76j52K67j19k7J10k24Q5j2j9K23m0j02J09j26J72l7
$$ 207 8 126 -31 -85 -190 -14 -166 101 -18 -45 65 -159 -74 -86 -105 118 78 -24 85 -41 131 94
1460I4j96K71l71J01J5J59P2j60O5r9J51j25l5j0Q5o5l8M8Kk9J28j3pp2J17m3
$$ 94 -102 169 -202 -101 -86 73 145 -15 50 -49 102 -23 -58 -68 17 -48 -86 -38 -36 -65 63 50 43 -29 88 45
1486D5o0J26q1J2m3r4k0K44j01j03q8rK45K4n5o9L3N7q2Pk4q5J13J23j11M7j17
$$ 45 -15 111 30 42 -1 -95 -115 129 28 -75 -163 -172 73 97 42 -27 6 63 -19 -12 -36 -121 -8 115 4 51 -66
1513f6J80j48R3p4J14j53J05k5k31J94k9j10R8K35q4j59kr6J13J33j08N2n8nj80
$$ -66 114 -34 59 -15 99 -54 51 26 -205 -11 -40 -150 -52 183 99 -60 -62 -158 -45 88 -20 32 -26 -31 -211
1538b11K35m6R7l9J43l5k67J15K1j25Qq1R3J1n1J42o3J50j43J49r3j17Q4M5K6
$$ -211 24 -22 75 36 179 144 -123 -8 13 -112 -104 -185 -92 -81 -132 10 -53 97 -46 103 10 -107 -23 22 48
1563D8j02O7p8q5R1j5J78j83J8J20k31O5R7L3j15P4J17K5j71KK1JqO8L1j58RJ38
$$ 48 -54 13 -65 -150 -59 -74 104 -79 -61 59 -172 -107 -10 23 -92 -18 99 124 -47 -45 -24 -23 -31 37 68 -90 -81 57
1591E7pr5K70j35j49M1L8L7Q3k55J96L5nk85J37J02j42P0j96K44l6J7n0k2NJ93
$$ 57 50 -45 225 90 -59 -18 20 57 140 -115 81 116 111 -174 -37 65 -77 -7 -203 41 5 22 -28 -50 -45 148
1617A48j67m9o4N9J16k54L13j95R5j17J90p4L0j04K50k11o5L0L4o1Q6P0r8J21
$$ 148 -19 -68 -132 -73 43 -211 102 -93 2 -115 75 1 31 -73 177 -34 -99 -69 -35 -96 -10 60 -38 83
1641H3r7k7J0K03k95K62k28J39j22Q3k5O9n9k6J0P3k38J86N8p1J10p8j35K16j23
$$ 83 -14 -41 -31 172 -123 139 -89 50 -72 11 -14 55 -4 -30 -20 53 -185 1 59 -12 98 20 -115 101 -22
1666b2l9K7j02J98m4L5J16k15l4PJ75k20o8J29N2n6P9L2N1P9k09R0j80M6q5J55
$$ -22 -61 -34 -136 62 18 53 169 -46 -80 -73 102 -118 -186 -57 -5 -61 18 50 101 180 -29 61 -119 -73 -158 -3
1692cN8M1r2j32Q1J07Qj11J06n7P2j75q6J58J7p4Q3Q8k27j7Q0O8M9j50J42n0L
$$ -3 55 96 4 -128 -47 60 68 -43 63 6 78 -97 -183 -25 -8 -82 1 89 -138 -155 -75 -7 42 -108 34 -16 -13
1719a3M6j13Q0N7r1J39j16J43o6j03Q4KL7L6j51M8Q9k2Q3j50n1J1j3l9l3N8l9
$$ -13 33 -80 0 57 -34 105 -11 132 66 -37 47 49 86 122 -29 19 108 86 169 19 -32 -21 -34 -73 -106 -48 -87
1746h7L43l18J15j64M9K23k63J82rQLJ38j95o4m0P5Po2J17l6jk6q3R9m8NJ32k43
$$ -87 256 -62 53 -111 -62 161 -102 80 71 79 82 220 25 -39 -79 -4 3 -59 58 22 21 -5 -88 11 -37 -32 100 -143
1774a43J87L8m0J17k63r4J75j29K40j16p1J99l04K13j27J0J63l8J1n1JJ1J40J04
$$ -143 44 82 42 159 -104 -198 -23 -152 88 -28 -99 100 -204 9 -118 -108 55 17 28 -23 -22 -11 129 233
1798B33k74R2MJ9j79J26q8J89jj9O7j35J37r8r3M1o6R2MqJ86l12n3Q9K0J61p2
$$ 233 -41 51 55 74 -105 21 -67 122 121 102 169 34 171 73 -20 21 -45 47 51 43 229 -83 -136 -47 -27 134 62
1825F2j55J40p7J18k2q1M6j65P1K3j52R5m9J3L58j69m9Q0j74R0L2j05RR2M5Q3
$$ 62 -93 47 -30 88 66 -15 31 -134 -63 -40 -192 -97 -146 -133 225 56 7 87 -87 3 35 -70 -61 31 76 159
1851A59j49N9n8J57k77O6P7j33J16j07k3jJ83k53K07K0J64k20J9nkLp7N3J1R7
$$ 159 10 69 11 168 -109 -43 34 -99 17 -90 -113 -114 69 -184 23 43 207 -13 6 1 -1 2 -75 -22 -11 86
1877H6l32K56k1J2J81k08n4J2J65k22LL9oj52K24j33k3K81j7m4k06J14K07k58
$$ 86 -246 10 -11 1 182 -26 -80 -68 97 -125 -122 -83 -89 -241 -17 -150 -173 108 91 47 -159 -45 162 -96
1901i6J80J0r8j47J15o7J47J53k77PJ00J20l23J17K31r4j34qP0kR5j47K15k28
$$ -96 84 94 -4 -151 -36 -103 44 197 -80 -73 27 147 -176 -59 172 78 -56 -64 6 4 99 -48 167 -61
1925f1K35k24K4J55j06O1j98P0r4J71j07K56j84J52m2k71J91K6q4NLQ1j4N7j30
$$ -61 174 -50 -26 129 23 84 -114 -44 -138 33 -74 182 -2 150 108 -163 28 54 -30 -25 -22 59 45 102 -28
1950b8L01k85P7mQ8l7p2j18O3N4j64P7K8l3l4J93K9O0l46L52j7j37j44K12m4j04
$$ -28 273 -12 65 61 149 112 40 -78 -15 39 -125 -48 -20 -53 -87 106 135 195 -151 201 184 47 -97 115 71 -33
1976c3j16m2J74k6R8M5k26K6R7L3q0R9P7j36L0k1kk9k1l5J3J30k51J48J01j42
$$ -33 -149 -191 -17 -43 55 100 -126 -100 -3 30 -50 49 126 -10 20 -1 -3 -32 -53 -88 -75 55 -196 -48 53 -89
2002h9K1K8J92q8oP0q0r9k3N1J58l1j87L8p2Mq4J67R4K18l52K1J42l4O3l7j43
$$ -89 -68 -40 152 64 58 128 48 -51 -74 -23 135 104 -83 -45 -117 -113 -197 -30 64 282 -70 -49 93 59 122 85 -58
2029e8k6N9J33n1j51J15j73P4m1N0J2J12j88K12l6j8J3QN2K4k1j91J00P7j44N7
$$ -58 -84 -25 108 57 -94 21 -152 -78 -119 -69 -57 55 -133 79 43 25 38 46 98 122 101 -90 10 87 -57 0
2055@j15J6M2J58J5j55J15j41Q0O8j08J08K1j78J90K3km2r1kj1j82J57k1m3R0
$$ 0 -115 -99 -57 101 116 -39 76 -65 15 83 -25 83 104 -74 116 139 137 95 4 2 -9 -191 -34 -55 -98 -8
2081hq2J34po4J42k13J1R2K8r6o2k9J52r3J36N4j62Rk7p4K93k78J07k3P3n6n4
$$ -8 -90 44 37 -27 115 -98 -87 5 33 -63 -125 -154 -2 -95 41 95 -67 -58 -85 -159 134 -144 -37 -60 13 -43 -97
2108i7K62%k15K30p6j70Q2M0J3j84j24L34p9n4L23p3j87R2j9l6J18j82POl5l8
$$ -97 165 165 -50 180 104 -66 16 56 69 -115 -239 95 16 -38 285 212 25 117 98 62 180 -2 5 11 -24 -62
2134f2J0K13q1J5P8j56j8j45J52j41J57n3K01k52L9p5rL03j72q7l8N0j10K12J55
$$ -62 -52 161 80 95 173 17 -1 -146 6 -135 22 -31 170 -82 -43 -118 -127 176 4 -83 -121 -71 -181 31 186
2159A86j14l0j50mJ19M3p3j9P9p3k7O3M0M3j64N7J9n5J27q1m3J21k7Q2j49K15
$$ 186 72 42 -108 -112 7 50 -23 -42 37 -36 -63 0 40 83 -81 -24 -5 -60 67 -14 -57 64 37 119 -30 185
2185A85j3k21j2L5P6k8rJ07j9j90N4Om0K7q1M5K01o7j09J89j05q7J24r1o0J45
$$ 185 172 -49 -61 -26 50 22 13 120 101 -89 -35 -29 -69 -42 -123 -78 123 56 -53 136 31 -56 68 -23 -83 62
2211F2j9N8o5j54j5J78Q1j86qR2R6j6n7k22L08q0j16l1K34mj29j05K41k17J31
$$ 62 43 101 36 -118 -133 45 126 -60 -68 24 120 104 47 -175 133 53 -63 -94 140 136 7 -98 143 -74 57
2236E7r1J09r3j90L54k09J70l5l8J09jq2k60J17n1L26j69o7J36Qo3m4o3Pj4k3
$$ 57 -34 75 -18 -208 146 -63 107 72 34 143 142 60 -200 -83 -134 192 23 -44 92 100 37 -7 -70 -63 -77 -100
2262a00M1j28J61j2M9q8L15l54Q3L6P1j82J13L3n9j08Q8O1j94J89M2L4j31K9J69
$$ -100 -59 -187 -26 -38 11 -77 238 -116 -33 3 74 -108 5 38 -21 -129 -41 20 -174 15 57 91 -40 -11 158
2287A58k09J15j29J4Q5n8J38q0L2q2l9KJ54p2oO9O9k60J07P7J24l58Q0J64L3k21
$$ 158 -51 64 -65 -51 34 -24 114 34 66 -16 -55 -53 101 29 23 92 161 -99 8 85 209 -149 -69 95 128 -93
2313i3K0O4L4j85M9O2j37J19J47k45K38K3m9J50k21O6R2j62j4R8j03N4R0m2m4
$$ -93 -73 -9 25 -160 -111 -49 -186 -67 80 -165 73 96 47 197 -24 42 134 -28 -42 56 -47 7 97 55 11
2338A1M8j64J46j07P9r4O7j03K06N3j86J30j36MP6n8Mj04K22M2j35Q7q4j08J0
$$ 11 59 -105 41 -66 13 -81 -14 -117 89 142 -44 86 -50 -46 30 -28 -24 -128 94 136 1 88 4 -104 -94
2363i4J43p1M2j08N0m7P5j52K25l9j51L69k38n7J43j41q7J81O9j43K28k96P8K35
$$ -94 49 -22 20 -88 -38 -85 -10 -162 63 24 -127 242 4 -53 90 -51 -138 43 112 -31 197 -99 -21 214
2387B14k96P0Q9j97J86J2k3l1Pk9n1k6j23J94j12m8J55N5j30M1k8J22j32M2k0
$$ 214 -82 -12 77 -120 66 78 55 24 31 2 -49 -75 -198 -4 -116 -164 -9 46 -84 -43 -71 51 -81 -39 -59
2412e9J14j24J44q4L2L3j36J91k08K20k78j5J49J15K3l55K63j49K22r4j48Q9j44
$$ -59 55 -69 75 -9 23 56 -80 111 -97 123 -155 -170 -21 94 117 -238 25 -124 98 4 -144 -55 -199
2435a99N1N0J61r8j7Q4K0j07o8J77m2O7o8j24RJ75j35Q4j50L24j53n3O7kLk00
$$ -199 -148 -98 63 -35 -52 32 52 -55 -123 54 12 79 11 -113 -104 71 -64 20 -130 194 41 -12 55 53 56 -144
2461a44K56j20O2K4k1j9J40j32J02j04k3j31K23q9m8J07ok34J75m1j76J70P6j28
$$ -144 112 -8 54 78 57 38 178 46 148 44 21 -110 113 24 -24 83 77 -157 18 -23 -199 -29 47 -81
2485h1J12j73L6KJ14j26Q2J25k08K8p7K51r9M4R3j82K7N3j25J04q4K70k22J5L6
$$ -81 31 -142 -106 -104 10 -116 -34 91 -117 -89 -166 85 -14 30 123 -59 -32 21 -104 0 -84 186 -36 -21 15
2510A5j8q4J50l8J08M5j81j74J20jQ8m2j32K92j08Q2o9j79J07K2j6k4L1L2l2N4
$$ 15 -3 -87 63 25 133 178 -3 -177 -57 -58 30 -12 -144 148 40 122 53 -126 -19 3 -13 -37 -6 26 -6 48
2536D8o6q7K29k22J81L2KJ2j72N6p6K30j50j26J75j01R8j45L8R6j12Q4J22K7r0
$$ 48 -18 -105 124 -98 83 115 117 129 -43 13 -63 167 17 -109 66 -35 63 -82 -44 52 -60 24 146 173 83
2561H3o9l2j23J51L3Lo4j23M10l16K28j81q9J38k1k41J63O8j8K0R1%j26L5P9K1
$$ 83 14 -18 -141 10 43 46 -18 -141 269 -47 181 0 -89 49 28 -213 -50 18 0 20 111 111 -15 20 99 120
2587A20j34L6N4R3k63J69l1r1L9P5N2l17N0J17j1m0J4N4k02J43Q7j09J9r4K17
$$ 120 -14 22 76 169 -94 75 44 -47 -8 67 119 -198 -148 -31 -42 -82 -68 -14 -216 -73 14 -95 -76 -170 47
2612D7NPl0q0M3N7Q3Nl49J54J20j32j1J02j10J78k45J89J0j69J61q0Q0M5L2r9
$$ 47 52 59 29 -51 -8 49 132 137 -212 -58 62 -70 -81 21 -89 89 -156 33 43 -126 35 -45 35 80 112 13
2638A3nk8P7j83Q3R4n8Q3k97L3J94j17L9M9n8M4l8R7Lj4j40L29k68j01K73j91
$$ 13 8 -20 57 -126 -43 51 -7 76 -221 -188 6 -111 -72 -23 -81 -37 -75 22 25 11 -129 200 -68 -169 104 -87
2664h7K10k54P0Pk9R9N2q6L8j7J12j60P9l6p4J15j56J67J58k49okN1j53Q4j40
$$ -87 123 -131 -61 -54 -83 16 68 -18 20 3 115 -45 34 -2 -76 39 -117 50 208 -41 -47 -49 2 -151 -67 -207
2690b07J69Q1p8RK7KJ1P6j81J77l0n3R7j9oj7J4j48J01K5O8j30J13l1pj45K68
$$ -207 -38 43 -35 -26 1 3 14 90 -91 86 56 3 100 81 75 58 72 -76 25 50 118 -12 101 70 63 -82 186
2717A86k63jO0J50k15J7j0P1k8k0J42N0j01r2J71j94j37R2j35K19o6p4J25K1R9
$$ 186 -77 -78 -18 132 -83 -66 -76 -5 -33 -53 89 139 38 -54 117 -77 -214 -122 -257 -38 -104 -178 -53 -32 67
2742F7O9k82K05l4R1K3j09j05J25o2j04K8J59n9J85Po5j42l5K1j03J75j00N4p6
$$ 67 136 -146 59 25 116 139 30 -75 50 -12 -116 -88 71 12 197 204 139 -3 -38 -17 -120 55 -45 9 -67
2767f7P6p4M0J50J0j00P3k44J87l4J5k57J5J89J55j24j00M3qK14j85l4n3J99j75
$$ -67 9 -65 -25 125 135 35 108 -136 51 17 32 -225 -210 -21 134 10 -90 -47 -55 159 -26 -60 -113 86 -89
2792h9J3N2Q7Qj94J15J07r6K8j27J93k17J22m7k0J13J0j27P7L6o7r2J04K7R5k9
$$ -89 -76 -24 63 71 -123 -8 99 3 31 -96 97 -120 2 -45 -65 48 58 -69 8 44 -23 -115 -11 16 111 82
2818H2j81J65j27jK35j53M1oo1L8J6q9p3QJ02rnJ49j55j19K04j26J73j11L6l6
$$ 82 -99 66 -61 -62 173 20 61 55 -6 32 48 -41 -114 -106 -4 -13 -18 131 -24 -143 61 -65 108 -3 33 -3
2844cp2P0Q3j44K34r0o1j4j3K5J35j55O0j41Q3J18p5j68J94J8r1j06Q8J4J40l9
$$ -3 -75 -5 78 -66 168 78 17 3 -10 15 150 -5 55 -86 -3 115 40 -128 66 84 -7 -113 -25 -11 129 90
2870I0k11K27k33m7l1J62J59k38%L2J50p2Nj14J20j30j8o0N8L41k69j39J20K04
$$ 90 -121 106 -127 -174 -205 -43 116 -122 -122 -90 60 -12 -7 -121 -1 -131 -149 -209 -151 190 -79 -218 -98 106
2894A06k48Q9n6N0P0m5K21j42l4j14J42j33J97j5j66J09M9P5k39Q6K5j72K51j05
$$ 106 -142 -53 -109 -59 11 -34 187 45 11 -103 39 -94 103 88 -78 31 80 155 -84 2 27 -145 106 1
2918AR1o6n2pJ55o0q1P5K4Pk3j33J02Q6j88K5pJ30Q6j34k21K38j04N3K33j80m6
$$ 1 92 26 -26 -33 122 62 -19 56 80 87 64 -69 33 119 -69 -44 -51 79 165 31 -190 48 -56 -3 230 50 4
2945Dj00K72j57n3jj0K7M1j80Q9J52j39J29R7m4k18P3j16J78j49K9M6J12J5l2
$$ 4 -96 176 19 -34 -35 -45 -18 23 -157 -68 84 -55 74 171 127 -91 -18 -134 44 -105 -76 -30 82 97 65
2970F5L6j70J8RK32n43M92j40oj4K53l63J26J22j46J94k51K15j17j94K71o0q8
$$ 65 101 -69 -51 -42 190 -353 139 -1 -7 -21 232 -131 -5 117 -29 165 -86 129 12 -182 89 29 -59
2993e9O2j08K73j04k16K42k8j79q1K80J21j89m8l2J78q0lJJ36M1m7k36J21o8j20
$$ -59 3 -105 168 64 -152 90 62 -117 -198 82 203 14 -34 -66 112 32 29 30 166 207 160 -76 45 -23 -143
3018a43L23n2j09M6j26oJ60p4j12J02o7L7K41j37j65M9j71K1J77kK2l7J4JN2P3
$$ -143 180 128 19 65 -61 -67 93 19 -93 9 -58 -21 220 83 -82 -33 -204 -183 -6 -8 14 -23 -9 -8 44 117
3044A17k16Q0J03j02j0j8R6Q8k24K7J49j88K13n2m1M1l5k1j0J0N9k02J63P2Q2
$$ 117 -99 -19 84 -18 -28 -46 50 138 -86 -59 90 -98 115 63 22 63 28 7 -3 7 66 -136 27 99 181
3069A81j80J14o7j78K24j09n6oJ06k4N1Q3j06o1r3J30n2L5m7N0J4J10j8J07k39
$$ 181 1 115 48 -130 94 -15 -71 -77 29 5 56 139 33 -28 -121 9 -43 -8 -55 -5 9 119 101 208 -31
3094c1M0J28r5j10K70j52K17l39J37j66K11k16j2J20j30K57n5j10J93j66m9N1
$$ -31 9 137 42 -68 202 50 267 -72 65 -101 110 -106 -118 2 -128 129 74 -36 157 -9 -58 -7
3116gL2j3%K2J0m2k08J6J99K9Pj30K03j89M0P5m2P5o9O2j12J26r4n1j56K61J9
$$ -7 25 12 12 34 44 2 -206 -190 9 38 45 -85 118 -71 -31 44 2 77 8 70 -42 84 -10 -61 -217 44 63
3143F3j68O0k0M0O6j38M6J99j06o9j28P7L9J82j63K7J72j05j12J19k06M2K05j97
$$ 63 -105 -45 -65 -25 41 -97 -51 148 42 -27 -155 -78 -39 143 -20 7 179 74 -38 81 -125 -83 122 -75
3167g5N1k3Q4k52K55L4L5k2n8j22K3J26J21r8j27Q5k06M1J7J86m7m9J38j22QJ14
$$ -75 -24 -47 37 -215 40 74 109 87 29 -93 -70 56 177 79 -48 37 -169 -128 -111 75 28 -21 117 -5 3 117
3193A17q4J04j18j08Q9K8P4o9j66J22lJ44j88o8J2O7j38Q0J80j22J13m5O6j47
$$ 117 33 137 19 -89 0 28 102 33 -133 -11 -14 130 -58 -126 -114 -47 -185 -105 75 -47 66 21 87 -60
3217f0k2l8L7o4J06M2k6j8j27K39M6k3K8k35Q0l7O6j5m6L6o4jL4R6J1j51J46j51
$$ -60 -82 -120 -83 -147 -41 1 -25 -43 -170 69 115 92 120 -115 -35 -72 -6 -21 -67 -31 -95 -96 -62 34 45 -106 40 -111
3245a11k4L33k43k3J74j67L0m5R2j31j52L30l3k25J39o4K18k22Q5J32k9j73J73
$$ -111 -135 198 -45 -68 106 -61 -31 -76 16 -115 -267 63 30 -195 -56 -120 98 -124 -39 93 64 -109 64
3268F4%j25p7j2K21j09j05J79p6m8N6j0j86K94n6J2J9Mm3n9J70o9o8M5Pj67J68
$$ 64 64 -61 -138 -150 71 -38 -143 36 -40 -88 -32 -42 -228 66 10 22 41 45 2 -57 113 44 -24 21 28 -139 29
3295B9r8R8J8j44m7J66k55J20R5O0j06O0M7l5J8O9k48J96J4o9K1m7j14J17J94
$$ 29 -69 29 47 -97 -144 22 -233 -113 -18 42 -64 -4 43 8 26 95 -153 43 57 -12 9 -38 -152 -35 159
3320A59Lk71N3O6k10K06L9M0j5K4j94MJ18Q5k21J67M6r6K2j08n2R3j01L84k63
$$ 159 162 -109 -56 10 -200 6 45 85 70 94 -100 -96 22 107 -114 53 99 3 25 -83 -135 -42 -143 241 -22
3345b2L7k2o8J71j61oO4L0J62j07r5j16j7J50k9J45kon3qj46K01j26P0K2j17J5
$$ -22 15 -7 -75 96 -65 -71 -7 23 185 78 -17 -133 -150 0 -29 116 114 108 55 47 -99 102 -24 46 68 -49 -34
3372c4J51p9J67k36K33j84p6J56K1j15J30k19J14j20mJ07J25k72J34J7r6J69l2
$$ -34 117 38 205 -31 202 18 -58 98 119 4 134 -85 29 -91 -95 12 137 -135 -1 16 -80 89 57
3395E7m7K2jq8J93j91l9J30q5J62j67R7O1j93J11r4n7R1Q6j47J98K55l74m7R7
$$ 57 10 32 31 -57 136 -55 -94 36 -49 113 -54 43 104 -89 22 -72 -129 -38 48 -99 99 354 -20 -67 30
3420C0J24j58Q5r5J84k27k0mJ12L4j77J08R2j69p7J98q8J4J4P9m9j3J47k48J59
$$ 30 154 -4 81 -14 170 -57 -77 -81 31 65 -112 -4 88 -81 -158 40 -48 -34 -20 59 10 -3 144 -104 55
3445E5m5r5P4n9Q1l8j2r6J60r2Kj3R4J8j0n1m6K2P1j07J46j18j6Lj24K49j04J01
$$ 55 10 -85 -11 -70 11 -27 -39 -135 25 -67 -65 -78 16 34 24 -27 -73 -51 20 -87 59 -59 -75 -72 -196 53 -51 50
3473E0j08OJ20p2N2J8n6k4j6m8q3J55K5n4M2K8r8M7j31J86j21J51L7j27j43J06
$$ 50 -58 -52 68 -4 48 66 10 -14 -30 -78 -161 -6 19 -35 7 35 -63 -16 -147 39 -82 69 106 -21 -164 -58
3499e8J00l5j34J22J20k30K05j7l21K49N5p8j24K65L5j02o9P2k2j7J3P2k25L17
$$ -58 42 7 -127 -5 115 -115 90 73 -248 1 56 -22 -146 119 154 52 -17 55 33 16 29 101 -124 193
3523A93q4k12j5K33r1N9r5j7OL1K03l21J25m4J11j67M8o3J34J07j48r0J52o6j13
$$ 193 109 -103 -118 115 24 83 -12 -29 -23 8 211 -110 15 -29 82 -85 -37 -100 34 141 -7 -97 55 -11 -124
3548a24k4J77j08M2rQ7r0J19j44O4m1l3R6q0K69j92J23k76O6N9lJ9M5j60K13m6
$$ -124 -148 29 -79 -37 -46 41 -49 70 -74 -10 -51 -84 12 -68 201 9 132 -144 -78 -19 -22 -3 42 -118 95 49
3574D9O8o8M6o4n9J19r3K9q7K6r5J92l9K09n3j55m0J3M8j20j2O4J22n7j42J92
$$ 49 117 49 95 31 -28 91 -2 27 -60 -34 -129 63 24 233 180 25 -15 -2 46 -74 -86 -22 100 43 -99 93
3600I3J1kk30J67m6p3J29j02q0P1j3m7J31l7R5P1j95J70r5L2j76K03r1P5m0j67
$$ 93 104 102 -128 39 -7 -80 49 -53 -133 -62 -75 -122 9 -28 67 138 -57 113 18 50 -126 77 -14 61 21 -146
3626a46J56O1q3j2k1O5o8L8Jl5M9rJ00p4j9N8l8q5qJ1J28k9j66J14p4k0Q8L1k7
$$ -146 10 71 -12 -24 -45 20 -48 -10 -9 -44 5 -4 96 22 3 61 23 -62 -70 -59 69 40 -126 -12 -86 -106 -18 13 -14
3655a4P6j3L2q8qJ9q7m5K52L1n4j46N9LM7P8j56P0l9j54l1J65q0Q2k4M0k58J85
$$ -14 62 49 81 -7 -15 4 -83 -128 124 155 101 -45 14 17 64 142 -14 56 17 -137 -168 -3 -83 -1 -25 15 -243 -58
3683e8J14k32J70J21n3m0k1J96j96l8J67j70J2MR0m2R8j19J06o3j93J46Q8o3J08
$$ -58 56 -176 -6 115 62 22 1 197 1 -37 130 -40 -28 -24 66 24 122 3 109 46 -147 -1 87 24 132
3708A32j20j5M8J09j02j97JJ04j3J36J1J7k24R3P4O0j49K4l5k4k6J33M8j88O4
$$ 132 12 -3 45 154 52 -145 -144 -40 -53 83 94 111 -113 -20 54 114 -35 -11 -46 -70 -96 37 85 -103 -39
3733c9L5lM9Q2j79J92j4r8k4J17j14L9Q2J6j44M0l3J52r8o5L5k8Qn1N9j6j20K16
$$ -39 -4 -7 42 124 -55 137 123 25 1 118 4 43 125 141 -3 37 4 156 58 -7 28 0 8 -43 16 0 -120 96
3761I6j15p7J98l64L53j57O6j55K50Oq6k6L0N3K8p4j04J35O3j01k01K36Nk1P1
$$ 96 -19 -96 102 -262 91 -66 0 -155 95 101 15 -11 19 72 100 26 -78 57 120 19 -182 54 59 38 109
3786A09j80J73N8j24P1j24J93j75L0n9RJ25j52J99j08J6R9k35J23Qp3m3k0N8K4
$$ 109 -71 102 160 36 107 -17 176 1 31 -28 -19 106 -46 153 45 61 160 -75 48 56 -17 -60 -80 -22 2
3811Bk55L37j0j43J27k6Q8L7j56q3K59k42Q0rN8j98K17l2p1q2L6K87k64M9q9J06
$$ 2 -253 84 74 -69 58 32 120 157 1 -82 177 -65 15 6 64 -134 83 51 -20 -102 -66 221 -43 6 -83 23
3837B3R1O4k6j91o1N6L0J41j38l6k1J9L21j61k98%J20n4k6N6J47l6M6k53L2p4
$$ 23 114 178 152 -39 -100 -44 -14 127 -11 -47 -68 -49 272 111 -187 -187 -67 -121 -147 -91 56 20 66 -187 -155 -229
3863b29L57j99JP2k2J43j62M4n5K1J00r2o2J89k8j16J00N1k26J70r1J6J88k49
$$ -229 128 -71 -70 2 -20 123 -39 5 -50 -29 71 -21 -83 106 78 -38 62 113 -113 57 -34 -18 170 -79
3887g9k7J58j46j6M5qJ38J9j80m2J21j22N0rK4J50j70J60o4lp4m1L05j94L1o8
$$ -79 -106 52 -94 -110 -65 -73 65 84 -96 -138 -17 -139 -89 -98 -74 76 -94 66 2 -1 -75 -116 189 -5 26 -42
3913d2Q5L5L1j37o0K63k28J61j44k37L53Pj46J64P8l24J61j22n8M7K8M8jl4J76
$$ -42 43 78 109 -28 -88 175 -53 108 -36 -273 80 87 -59 105 183 -141 20 -102 -160 -113 -85 -37 -38 -72 104
3938A04j40J03p7n0L7p9J6J01j34J17rJj4J29L5j41Op1Q8RP8j67J80k01R7JOM
$$ 104 -36 67 -10 -60 -23 -102 -86 15 -119 -2 -11 -10 -24 105 140 -1 5 -66 22 31 109 -58 122 -79 18 19 25 29
3966B9k0P2q9o8J29j37J38j18n4LJ90N4j38nN3M4r1n3J32j12P7o9Jq4J29j39J35
$$ 29 9 81 -8 -76 53 -84 54 -64 -118 -115 75 129 -9 -14 39 83 -8 -61 71 -41 36 -33 -32 -116 13 -126 9
3993IK9K6j33J3O1J9L9n7o9K05r9j01J19k00J66j84J02P0k12K1K21j46k7J12r1
$$ 9 38 64 -69 -56 5 24 63 6 -63 142 43 -58 61 -139 27 -157 -55 15 -197 -176 45 -101 -128 -16 -107
4018a07LK17j99K67o8j34o3J13rPn0L3R1l13K97O6j13q5j1l7j7J9K6J20j28P1
$$ -107 -104 113 -86 181 113 -21 -84 29 20 27 -23 10 101 -212 85 151 38 -47 -58 -95 -112 -93 -67 53 -75 -4
4044dJ98k18J02m1qm3O1j13m1R8k4Rj33Q6j13L19m0o0j13J12j0rL2q9JL8J02M3
$$ -4 194 -24 78 37 29 -14 47 -66 -107 -9 -33 -24 -157 -71 -184 135 95 35 -78 34 24 15 47 -42 -41 -3 99 142
4072A42j78J8J03j09j70J81J41j93N0J88l21j4J85l7l9k6%oN7N4j30O8K09r0K6
$$ 142 -36 -18 85 -24 -194 -13 128 -65 -15 173 -148 -162 23 -14 -53 -79 -79 -85 -28 26 -104 -36 173 83 109
4097A09o2j36K73k01N3j99N4J58j33j8O1P3Jj29K58q3k30O9J0J96k87J48j04l
$$ 109 47 -89 184 -17 36 -163 -109 49 -84 -102 -41 32 33 -96 162 79 -151 -82 -72 124 -163 -15 -119 -122
4121a22R0J53j57j17Q7RJ33J4j48J09L9j50J16o4O4k8OJ25j68m4L9j6M4Q4j64
$$ -122 -32 121 -36 -153 -66 -57 76 90 -58 51 90 -60 56 -8 56 28 34 159 -9 -53 -14 -30 14 98 -66
4146f6qJ75k9k7k05J08L0j2m4K12k31P2J20j02K1rj1q4K72j65p9J04N0M6j57j7
$$ -66 -74 101 72 45 -160 -52 -22 -34 -78 134 -97 -25 95 -7 14 5 -6 -90 182 17 -62 42 92 138 -19 -36
4172c6J51p8j17K58r6r2R2J4k08J91j25O6j23L02j13k13P0J44j45l6lj00J55K1
$$ -36 115 37 -80 178 82 -10 82 96 -112 79 -46 20 -103 199 86 -127 -57 87 -58 -94 -97 -197 -42 -21
4196b1j39Q2P2M2o0N0n4K3q8J2oQ7j10OJ06n1J26L8j11M4r0J64J9p6k02K11j8
$$ -21 -160 -78 -6 36 -24 26 -28 -5 -93 -81 -87 0 -110 -104 2 -49 77 115 4 48 -42 122 141 65 -137 74 56
4223E6kj08J25Q3n0j45j26K65j05j9L0Q0j06j08N0J05k65M3K86j01O8r7J63q8
$$ 56 54 -54 71 154 104 -41 -167 98 -7 -26 4 84 -22 -130 -80 25 -240 -197 89 -12 56 -41 122 34
4247C4r6K75j22K3l29J93qq2J69R4k37P2n7mj12P6J07j38K07J6l8%j45J5J29m5
$$ 34 -62 213 91 114 -215 -22 -30 -112 57 151 -86 -14 -71 -75 -187 -111 -4 -142 65 81 43 43 -102 -87 42 -3
4273cP9N3k29J42K6Mk73J92J2R6k55K45j98P4o9m9R1P1kj10J64j89J15k8qj0P1
$$ -3 76 129 -100 42 68 72 -201 -9 3 99 -156 89 -109 -35 -104 -153 -62 9 7 -103 61 -128 -13 -41 -49 -59 12
4300A2j11J7R4Q8l55K69j79O5P5K16j98K0q7J96j79o3K29l13K04m6J71p4p5J39
$$ 12 -99 -82 12 100 -255 14 -165 -100 -25 191 -7 13 -74 122 -57 -120 109 -204 0 -46 125 51 -24 115
4324A15k5j71Q3q0J5L0J15j39J29j83j4rJ81o0Mmj7j81K21j72L02k08qmO5L4R2
$$ 115 90 -81 2 -78 -63 -33 82 -57 72 -111 -125 -134 47 -13 -9 -13 -30 -211 10 -162 140 -68 -76 -80 -15 19 111
4351A11j52l5Q3j0j18k7K27j09K7n5M7K07j96R7r5j33L20m24J70Q5k15N8R3P4
$$ 111 -41 -76 7 -3 -121 -148 79 -30 -3 -58 -11 196 0 97 2 -131 189 -235 -65 20 -195 -137 -44 30
4375C0L8m1M5m2J1k29J34J02j04J10J29j89j2M7j79J78j29J24J46k42J04lj53
$$ 30 68 27 72 30 41 -188 -54 48 -56 54 183 -6 -18 29 -150 28 -101 23 169 -73 31 28 -125
4398a25J44l4j69J31Q0L0j55O2o4J04l3K36j95l6P6J35r0j76j3J71j31J09K6r7
$$ -125 19 -15 -184 -53 27 57 -98 -36 -100 4 -29 207 12 -24 52 187 97 -79 -92 79 -52 57 83 -14
4422a4M8o2P4j57l9J5K16r1J4j40J4K18J02k41J4J98j86LM9j47N3j7J01Jp2L9
$$ -14 34 -28 46 -111 -150 -135 81 -10 4 -136 -122 96 198 -43 -29 169 -17 -14 35 -112 -59 -76 25 26 -46 -7
4448gK7J3j1k0J01j22J38k73K15l7JR2M0j11j02O2K11j10m9N5j11K15j68j99K89
$$ -7 20 33 22 2 103 -19 119 -154 61 24 25 117 157 46 -56 6 217 107 58 113 2 217 49 -150 139
4473A39j19q9L0p2J46J48l29J05M0p0K5J67n6j0j08M1p0L0OJ9j0J24k04J45j05
$$ 139 20 -69 -39 -111 35 183 -146 -41 -1 -71 -46 121 65 55 -53 -12 -82 -52 -46 -27 -37 87 -117 28 -77
4498g7Ok3o0J51r7J09q1O3K19k51l4K84j26N1m9j14L2O3o2P0j24JK52q8k45O2
$$ -77 -71 -94 -154 -3 -100 9 -72 -9 210 -41 -75 209 83 134 85 -29 3 66 4 74 -50 -49 203 115 -130 -68
4524f8%J10o5q2L3L9K10l46M8j23K33q9O6R8krJ09j34l7o2J11j02q7K03n2m4K
$$ -68 -68 42 -23 -105 -72 -33 177 -169 -121 -244 -11 -100 -34 64 62 53 162 28 -9 -71 40 -62 -149 54 2 -42 -40
4551d0M5j0j4J26k5m0k9o8M6L4j2L3P8j44L8RkRo5j23J54Qm4J13k55K21p9J9J8
$$ -40 5 -5 -19 107 82 42 13 -55 -9 25 13 46 124 -20 18 27 25 34 -31 -154 0 8 -36 77 -178 43 -36 -17 1
4580Am9J59j8j59r2J65j3J14k23J01L7j79OJ59N1j35P6o6j8n2J38m4Q7j16K96
$$ 1 -48 111 93 -66 -158 7 -6 108 -115 -14 23 -156 -150 9 60 -75 1 -65 -83 -135 3 -41 46 -70 226
4605B26Lk76k0J12j99J39jp4K04k50Q9k17L03k0j80J90j27l6L61j62k29L13j91
$$ 226 229 -47 -67 45 -154 -15 -16 -90 114 -136 -47 -264 39 19 -161 29 -98 -134 227 65 -164 149 -42
4628d2K4j8J24j21o5K49j12J03k10r0J78q0mQ3k18Q8M0R5q9J37L9j71o9K47lj80
$$ -42 -18 -36 88 -33 -98 151 39 142 -68 -158 20 -60 -64 19 -199 -111 -71 24 -65 72 111 -60 -129 118 115 -65
4654f5J30m8N1J2K8r5K4o5j23K46oj2J26j36qk62L13j63K3r5Q1j12K00j57J66
$$ -65 65 17 68 80 108 13 37 -28 -151 95 89 77 203 67 59 -203 110 -53 -30 -125 -44 -156 44 -113 53
4679E3j34J23k1P4QKj69R5M0o0p3mK7r1QO7J72k64L06j83m0J05j3n5N8k2j4M3
$$ 53 -81 42 21 95 103 105 -64 31 71 11 -62 -66 -39 -130 -122 -55 117 -147 159 -24 -64 41 28 -27 31 9 -5 38
4707C8j15J34Q2m33L71k24J41k3R5j19J50r6J3k34J98K08k61N9Q0j0r9Q6M3m8
$$ 38 -77 57 139 -294 77 -147 -6 -29 66 -53 97 1 14 -220 -22 186 -75 -16 64 54 -45 41 84 36
4731C6J28k73K9J40k1l5JN5K6k8R1k70J87j81J4J05j26K92k83L4K14j88L2m7M9
$$ 36 164 -109 -80 60 39 4 5 60 86 58 149 -121 66 -115 -101 4 -122 170 -113 -79 135 -53 -21 -68 -19
4756a9O7k2j49J36m8J87o4j98R6L4j5p0J69K3j48m0R4Q1r0p7Ro7J30m7K7q2P3
$$ -19 48 26 -123 13 -35 152 88 -110 -14 20 5 -65 104 127 -21 -61 33 114 24 -53 -44 -111 19 -28 -1 -83 -10
4783a0j05mJ92j9R6j88l0K47k24Q2p2o6l8J76N3k23k0j0O5KJ20O2j06j32J46J49
$$ -10 -115 -119 73 54 150 -38 -68 179 -45 37 -35 -101 -139 37 90 -133 -153 -163 -98 -96 24 86 -20 -152 -6 143
4809A43q3K1j0n5nJ15k18J22K04k86k0m1K33k9k09J16j33J81k20J20Q0Qk5j76
$$ 143 60 81 71 16 11 126 -92 30 234 -52 -72 -113 120 91 -118 -2 -135 46 -174 -54 26 34 9 -167
4833a67K41j67O0J8j28K32j99M8J01q3M6J32j42m1M2Q4k4j19J03m5j7O4l8p0K66
$$ -167 74 -93 -33 -15 -143 89 -110 -62 39 -44 2 134 -8 -49 -7 77 53 -66 37 -8 -25 39 1 -69 197
4858A97j38M4l5j08L6L7j26K5J26j82QJ06R5r0J8n9n7J55o9%j58J98l2j03O2q
$$ 197 59 103 68 -40 -4 33 -93 -68 58 -124 -116 -10 85 -5 13 -46 -103 52 -17 -17 -175 23 -9 -112 -50 -58
4884e8K6R6j4l8j38R1J58K1k79K4J16l5J66K0j00j6r5Q7j56K63J0j16o1R0l5O4
$$ -58 -32 64 50 12 -126 -35 123 144 -135 -111 5 -30 136 156 56 40 -55 32 -124 139 149 33 -28 62 27 91
4910I1j06J67r0k28K72k11J5J91o2j41J58l67L96j13J12n7r9R4j41N6J65L1Kj46
$$ 91 -15 152 62 -166 106 -105 -90 101 39 -102 56 -311 85 -28 84 27 -72 22 -119 -63 102 133 135 -11
4934a1J19nJm09L22P9j11J01r0J49j25m8j10K63r1j13J19p3K02k73K10N0j62p
$$ -11 108 103 104 -305 17 96 -15 86 -4 145 20 -28 -138 125 34 -79 40 -33 169 -104 106 156 -6 -13
4958a3N7o5J41k90J26J17p1J9j16J82j42NJ78K2n6r5r6J12k08K82r8J4O0J05j10
$$ -13 44 -21 120 -170 -44 73 2 21 -95 87 -55 -50 128 150 94 -1 -97 15 -193 89 -9 5 65 170 60
4983F0j54k5N3n1Q7J9J43j98j01K38N9m1k8L3Pj29Q8K5r7p1J81j65Q8j47J27L9
$$ 60 -94 -119 -66 -117 -30 -11 132 -66 -167 71 130 89 61 94 101 -28 60 85 -12 -83 98 -67 21 -126 1 40
5009D0m9J06j56L3m6J42k65K48pj0n7J67k63R7J68k37J3R3j9o0O8j7K2oJ65j27
$$ 40 -9 97 -59 -26 -72 70 -195 53 46 36 -21 146 -117 -20 148 -89 -76 17 -2 -62 6 -11 11 5 170 43
5035D3K0r0K09l74J64K5l9k1K66j7k03J19m8l0j37Q2o7K29p5j22K5P4o2J7j94
$$ 43 63 -27 182 -192 -28 -3 -42 -63 203 186 -17 102 54 24 -113 -31 -98 131 56 -66 -41 33 -29 -12 -206
5060b06L03j59n9J89j29J03qJ23j95R1O1k54J49Rk8J19j19Oo7L5M8k2n4J04J53
$$ -206 97 -62 -121 68 -61 42 34 157 -38 53 114 -140 9 18 -10 109 -10 -4 -71 -36 12 -10 -64 40 193
5085A93k73q2K19o9P1K15j86j38J30J00j50n5j8K7k6Q9j82J43j14J9K32k84J56
$$ 193 -80 -162 57 -12 59 274 88 -50 80 180 30 -25 -43 -16 -42 47 -135 8 -106 -87 145 -139 17
5108A7N9o8O6J09j42q8N8l2K0K34k80L0J65j35J02r9K1p2j9J72k65J14j07J77
$$ 17 76 8 74 183 41 -47 11 -21 -1 233 -47 -17 148 13 115 16 37 -35 -54 118 -147 -33 -140 37
5132C7M2j85K20j89J59l1j21j09J72j06J87r2J55o8n1M9j57J07j2j8j07J48n1
$$ 37 79 -106 114 -75 84 53 -68 -177 -5 -111 76 -16 139 71 20 69 -88 19 7 -11 -118 30 -21
5155b1L4K6o3n2J07%j00n0L9K50qq7j66Q9LL9J06j13R4j0k07Q3K01k38J00l4o6
$$ -21 13 39 -24 -76 31 31 -69 -119 -80 170 162 75 -91 -2 1 40 146 33 127 117 -90 -7 194 -44 56 22 -44
5182d4P1j37jJ22j38J5R1J10j29J2q0K40j69N4M7j23J54j34K1N3op1Q8j42J22
$$ -44 27 -110 -111 11 -127 -112 -21 89 -40 -28 -108 132 -37 17 64 -59 95 -39 -18 35 29 -42 46 -96 26
5207B6m8M7p4J42k15J9J98k40J56L7PK3O4j59Q9K18k95P5j59O7p7P6p8K13j96
$$ 26 -22 25 -49 93 -122 -103 95 -145 11 48 55 78 142 -17 72 290 -5 70 -89 -22 -99 -23 -101 112 -84
5232h4JJ18j41J65l4L7r1on6K3%J54Lj24n0J5j63J89J4P9j01O5N3j8mk10J79N6
$$ -84 -83 35 -106 59 25 62 -29 -35 -91 -68 -68 86 89 -35 -85 -70 -233 -44 -30 49 -52 13 66 48 44 -166 13 69
5260F9o2r4J87j10N5K3j35J08l0j48N6M9o5J20j13R9Q4r0n0Q6J01k48K50j96J16
$$ 69 7 -87 100 -10 45 68 -67 41 11 -137 -81 -32 -97 23 -90 9 93 3 -47 39 140 -108 142 -54 62
5285F2r6l4L11k53j39K55m8R3j50J12o9j35K40l2r2l1N6j52J18k62J22J92j43
$$ 62 -34 -68 243 -10 -149 106 58 151 1 113 44 -91 149 117 25 -6 50 -102 16 -246 -124 68 -75
5308g5L4j53J36N2M6R9p2k8J14q2p7l9pQ2j10Q5k6L5j19J37J33n1j22K4R5j69
$$ -75 -41 -194 -58 -6 40 139 67 39 153 71 -6 -45 -52 30 -80 5 -21 14 -105 32 165 114 -8 16 111 -58
5334e8q2j23L87k7j84Q6J30k49J74j80K80j82k4K05k39J60l3l11K70j26J12L1
$$ -58 -140 -263 124 97 -87 -1 129 -120 54 -126 154 -28 -52 153 -86 74 41 -270 0 -126 -14 17
5356A7j54J68k98M21j70r6J58n8j50K10p9l5J25r2o1nQ9k2o6R1O4K1j43J37Q6
$$ 17 -137 31 -267 154 -16 -112 46 -12 -162 48 -31 -66 59 -33 -94 -99 -10 -32 -98 -7 57 78 -65 72 158
5381A58j70R4l0m2q2Q5j19J20n0J7k2q1J49J47j1j09j8RJ7o4m4j47K67r4Qn1K89
$$ 158 -12 82 52 10 -72 13 -106 14 -36 -19 -41 -122 27 174 163 54 36 45 62 -2 -46 -193 74 -20 -12 -63 226
5408B26k01N4j56M0P2J92j21j94J2P0j96J38J0L2J25j98P6l1j04J39rN5j79K16
$$ 226 25 79 -77 -37 35 227 106 -88 -76 -6 -202 -64 -54 -22 103 -95 -19 -50 -154 -15 -24 31 -148 68
5432F8m1p4J66j27j62J37M0j94k4J98q6l7K10o0M6K2o8j9K7j43O8rK05Ok16J33
$$ 68 27 -47 119 -8 -170 -33 7 -187 -211 -13 -99 -136 74 14 60 82 14 -5 22 -121 -53 -62 143 149 -67 66
5458F6Mj09J11O5j82P6J6j29K10j64o6j8Q8N2j14p0J96j15K32k70L9J60qo4NJ6
$$ 66 70 -39 72 137 -45 31 47 -82 128 -36 -102 -120 -32 20 -94 -164 32 -83 149 -121 -82 78 70 6 11 27
5484B7j0K2Pjj60J87j08M9O4q9Q4k02R1o1J55Mk00J48M8o8j53J29K88k35o6o5
$$ 27 17 39 46 45 -115 72 -36 13 77 -12 72 -130 -39 -100 55 59 -141 7 55 -13 -166 -37 251 16 -50 -115
5510a15Q0Q7R2j65q6J18K4m1r0Q3p0K32j71J62l4L9j68r3J76k27J69K7j35J10
$$ -115 -35 52 144 -21 -107 11 35 -6 -96 -13 -83 149 -22 140 106 145 -23 -116 60 -167 2 29 -106 4
5534DR4J1m1Rj33N3o5L2qJ06m9M5j9q0J34m0q3k1O0l1R9k01J44Km1o0J33p2N5
$$ 4 98 109 68 77 -56 -3 -68 -36 -44 62 13 58 39 -41 93 53 -30 -51 9 -22 77 -124 20 22 -19 -79 54 -18 37
5563C7n5R3o7k7r6p2K67j53J07M3j57J53m2k45P2m1J93j33P5L0P3k3jo9J54j03
$$ 37 -18 75 8 -19 -115 -187 80 -73 34 77 -80 73 31 -214 -142 -183 10 -123 -48 -18 55 32 31 -38 116 13
5589A3RL9j24K52j86r2J74l16L44j20j4j7k3J32l05K51p7J20j14J9L0k9p9J33
$$ 13 22 61 -63 189 3 -89 85 -231 113 -7 -21 -38 -61 71 -234 17 -60 60 -54 -35 -5 -34 -113 20
5613B0j15R9p8M4j88J87J02j37%O8J37k51M0PK4j6K6j0J08j99L0J38M1rN8j24
$$ 20 -95 4 -74 -30 -218 -31 71 -66 -66 2 139 -112 -72 -65 -41 -57 -31 -41 67 -132 -102 36 77 68 126 2
5639BK6o4j7Q8n3J09o9M9n1j6J2P5Rq2R1j57J16j78K00j61L8K1j73J91q0J15o3
$$ 2 28 -36 -53 35 -18 91 22 71 20 4 16 91 100 18 109 -48 68 -110 90 -71 -33 -12 -185 6 -74 41 -22
5666b2J17lnL7k05O0L4J21l44K05j02P5K12j50jj91K62j1k05R3P9r2J86m21J34
$$ -22 95 92 87 124 -81 -21 13 134 -210 -5 -107 -32 180 30 29 -162 100 89 -116 -23 56 -36 150 -271 -137
5691a37K8P1R5m5k60L35j82J69j15L9R0j14OL0Q7MPj50Q1K40l72N1J84j97K24
$$ -137 -109 -38 57 12 -248 87 -95 74 -41 -2 88 -26 -20 10 97 101 108 -42 39 279 -93 -42 142 -55 169
5716A69k88O6r1J11J02q7L1n2K8Qk8r4Q7j15K19j42J59o3n2n1NO3L1q7N2qL4j8
$$ 169 -119 -53 -144 -33 69 -18 13 -39 -11 -3 -31 -125 -38 -153 66 -76 83 20 -32 -83 -78 -15 16 -71 -19 -27 7 -11
5744a1j27M0M3n5K27mj02OJ71j32j7J3Qj27J80j95K2N1K7L4o7J14K3j19L6j49
$$ -11 -138 -98 -55 -110 117 113 11 17 188 56 39 52 60 -67 113 -82 -60 -9 18 52 -15 99 122 3 39 -110
5770a10J62K6k3J12j99J22N2m3n8r2k8o8M0O5M8Mj4J96q4k9k6k16J39n7L7j56
$$ -110 52 78 55 167 -32 90 142 99 41 -51 -79 -147 -107 -42 6 10 -4 192 108 79 53 -163 -24 -81 -44 -200
5796b00J0K00l7OJ17j11p9J88J9j57J72k12O0p0J10j49Q7Q5l8P5j42J0N3K12l8
$$ -200 -190 10 -27 -21 96 -15 -94 94 113 -44 128 -84 -24 -94 16 -133 -46 39 1 76 -66 -56 -3 209 171
5821A71j04j65J33j14l5j8K13l0p0M2j25K24p9p5n3j9L5J90r7k70M1J05OJ80j80
$$ 171 67 -98 35 -79 -114 -132 81 51 -19 23 -102 122 43 -32 -85 -104 -69 121 24 -246 -205 -100 -94 86 -94
5846i4R2j09K00j26p2J77j03kR1j31J95j39l8J28p8J2q2K22j29j88N4J45n8m0
$$ -94 -2 -111 89 -37 -109 68 -35 -37 54 -77 118 -21 -59 69 -9 3 -79 143 14 -174 -120 25 -33 -73
5870g3Q4p0L8o7j2J26j12K27j54j1K38r8r7O7j65J85o8j07J3n2R8k3k3J01o7n2
$$ -73 11 -59 -21 -88 -100 26 -86 141 -13 -24 214 116 19 86 -79 106 38 -69 -56 -108 -10 -33 -56 45 -22 -74
5896g4o7K50j1k41L14j54L5j05j9P9n0J35j57p9P5J26L7j99RK16j28j98J54K0
$$ -74 -141 109 98 -143 171 17 52 -53 -72 7 -43 92 -65 -144 -69 57 94 -105 -96 120 -8 -206 -52 -32
5920c2l8J94j43m3J59q3N4K7j11n0J05n7m0J9L1N9j43K37k53R2m3R4O4j58m3J36
$$ -32 -70 124 -19 -62 97 14 68 95 -16 -66 39 -18 -58 -39 -8 51 -92 145 -108 -16 -59 35 99 -59 -102 34
5946C4m4P3Rp8mo5K8J1j37qK39Rk53R9J1J9r5L9Q1o0M9J13k02J70Q4r8m1K0LM
$$ 34 -10 63 72 -6 -10 -75 -47 -36 -173 -181 58 67 -186 -87 -76 -57 -152 -113 -32 -92 -43 70 -132 38 122 24 -17 3 6 10
5976A0K7j7l6j82K69k84N1K22m3l0MJ16k31J91k03K03j19n7J11kn8J29m2k03K19
$$ 10 37 20 -16 -198 71 -213 -162 60 17 -13 -9 107 -124 67 -136 67 -52 -109 2 0 -58 71 29 -174 45
6001D5J78k94K2N7p3K82k69J88j3l11K06j83J20l2J17ok07K54o5l3J4R4j67K9
$$ 45 223 -71 -49 8 -65 217 -52 136 123 -188 18 -165 -45 -77 40 34 -173 81 16 -17 -3 91 -76 -47
6025d7J13j44K17j32l1q7L16k25J46j96J67j81n7K64j19j52J36n3J00J4N0k1j31
$$ -47 66 -78 139 7 -24 -111 205 -20 126 -70 97 -84 -141 123 4 -148 -12 -65 35 49 99 78 -53
6048e3O9Q2n4l8l9j3l2n9K24j14j9R7j77J19Q5k1j21Q4q5mKR4J38r4Mj38R1k06
$$ -53 16 98 44 6 -33 -46 -78 -137 87 -27 -46 51 -126 -7 78 57 -64 20 -65 -69 -67 27 165 71 75 -63 28 -178
6076a78J60lJ04j70J57k5j02M5J29j16kj78K48k07P6N2k4j1q7p1L37l3j64J09
$$ -178 -18 -21 83 -87 70 45 -57 -12 117 1 -1 -179 69 -138 -62 -10 -34 -45 -132 -203 134 101 -63 46
6100D6j9p9J05L1L6j12j6P0l9p0O6Q0j76O9j32J9M2J12j19K00j20J65j48o9J37
$$ 46 27 -52 53 84 120 8 -8 62 23 -47 19 99 -77 -8 -140 -121 -79 33 -86 114 -6 159 11 -58 79
6125G9j69R4n3o2L4J35o0O3j1j11K0Q9P4n9MJ09j47K4K20m73K91Nj50o3K6J50
$$ 79 -90 4 -49 -111 -77 58 -2 61 50 -61 -41 48 122 63 67 176 29 53 273 -200 91 96 -54 -117 -91 59
6151E9O3r0Nr4QJ18o2q2L08p7k14m5J61k00K43j70p4K02j00M4k12M4R2J37k28
$$ 59 122 32 37 -57 -49 69 7 -75 233 156 -58 -103 58 -142 101 -69 -143 59 -41 3 -209 -165 -73 64 -164
6176a64K85k52j34M14j66R7n3J01j80R3j46O2J66j36J22j94j1J37j40J10q7M1
$$ -164 121 -131 -265 149 -17 80 27 128 -52 41 -105 -43 123 -13 109 -85 -96 41 -99 11 -76 -35
6198c5r8Q4RQ4j06N5l5r8LK09q3Rp3J4om3J51j25J04J05l7j17k5J63n4o4qo9M1
$$ -35 -133 -49 -40 44 -62 -7 -42 -140 -137 72 -11 -2 -75 -61 -67 -110 41 -84 20 125 88 -29 -54 109 55 -9 -17 -86 -45
6227d5Lm6R5M3K7r2J39j26O8p0J06j59o0R4K24j92R0j25o6J19q8M6p2%K48j2j47
$$ -45 -42 -88 7 50 77 -15 124 -2 66 -4 102 -57 -117 -23 201 9 99 -26 -92 27 -61 -15 -87 -87 161 149 2
6254BL9kO9j79j61J10K23p2j02J10j43J11J7j37J38L2j02J00n9K17j71nq8M8m
$$ 2 41 39 108 -71 -232 -122 101 29 -73 37 -106 5 22 -115 23 55 -47 53 -6 211 40 35 -53 -5 -9
6279iM5n6KJ9J1J45k08J13j96K11P3j85j13J53Kj01M6Q3Nr1Q4j3qj64O6J75k8
$$ -9 36 -20 -18 1 12 157 -51 62 -134 77 150 -35 -148 5 7 -94 -48 35 40 -51 33 20 12 -152 -86 89 61
6306F1r4p0P1j06J83j41N9M6Q3m3R1k14K6J6l8m6R3n1L3j20Q0R7j78K14j39J4
$$ 61 -33 -103 -32 -138 45 -96 -37 9 92 49 140 -74 -48 -32 -70 -116 -23 -74 -41 -161 -81 16 -162 52 -87 -73
6332g3q1K72j25q0J23J78j59l3l7r1O3N2N7l6q2J69j93J25j02l05L84rJ13K6j12
$$ -73 -154 118 -7 -87 36 214 55 22 -15 -106 -43 9 66 30 -52 117 -76 49 -53 -358 26 17 130 156 44
6357D4j06%M7J17O7o0j21k4j23M38m35N3J5J73k07K61q4J54k87n1KP6K1M5j9k3
$$ 44 -62 -62 -15 102 169 109 -12 -36 -159 279 -156 -103 -88 85 -122 139 55 209 -78 -129 -127 -51 -30 15 -4 -27
6383b7J17p6o9l1J17p5J13j71K53j68J38k34K50k98J74l9Q6k06J82L1j27Q6O1
$$ -27 90 14 -55 -86 31 -44 69 -102 151 -17 121 -113 137 -161 13 -26 60 -146 36 67 -60 26 87
6406H7r6q6J95p2j02J8N1J9J10k26J46Q0k06j76K40O1j28K47k02NJ9J17q4j30
$$ 87 -9 -95 100 28 -74 -56 -5 14 124 -102 44 124 -82 -258 -18 43 -85 162 -40 -35 -16 101 17 -113
6430a13j5K72r3k5L1J2k5j61J01R7j1o0J50j09p8R4J5j67mJ93j11J66j91J76j21
$$ -113 -128 144 51 26 57 69 44 -117 -16 81 70 10 160 51 -27 67 82 -85 -89 104 -7 159 -32 144 23
6455B3p7R0o7n4J41J0qk0J0l6%M3lj03J9O7J88r0j80M9jj30L3Q9j16J0K56K5k81
$$ 23 -54 36 -31 -85 56 66 58 38 48 12 12 55 52 -51 -32 35 223 133 -47 2 1 -129 -96 -7 -123 -113 143 168 -113
6484a13P1Q8j6j3j8M9q9K60k89Nr2J75R4j1j20R9j04L3O3rO9k95K47L0k14rK48
$$ -113 -42 46 30 17 -1 48 -41 219 -70 -65 -157 18 112 101 -19 80 -24 9 72 63 132 -163 84 114 -100 -109 139
6511A39j15N5n3M3j6JN4j60O0J79j84MJ08Rl17K65n1n1J31q4n3N1j15OJ93j49
$$ 139 24 79 26 69 53 54 108 -52 8 187 3 7 115 124 -193 72 21 -30 101 17 -36 15 -100 -94 99 -50
6537e0J07k49J05J24q8j93K06j17k7J78K26j03r2r4m7K03j18L3l4L8K3j12J73
$$ -50 57 -192 -87 37 -51 -244 -38 -155 -182 -4 222 119 27 -67 -114 89 -29 4 -30 8 31 -81 92
6560I2k16j44L25j49L3m9J66O8m9j1O0q4j4n2K1j28J9J15K8j16k0M7n0J56j85
$$ 92 -124 -268 57 -92 -59 -108 58 126 77 66 126 42 28 -24 -3 -131 -112 3 31 -85 -105 -58 -108 48 -137
6585a37lJ12K2J27j3j60N1k00o3M28k59P8r2R6P7n8Nq1R8jP6k07K13j05M0J08
$$ -137 -140 -28 -6 121 108 -52 -1 -201 -264 164 -95 -17 -109 -13 64 6 11 -70 28 27 103 -104 109 4 44 152
6611A52k78O3J61L9p1j92K78j48J53j89J63m4M1j15oJ8j21K6J66k47K64p0Q8j97
$$ 152 -126 -63 98 137 66 -126 152 4 157 -32 131 87 128 13 7 25 -96 -70 96 -151 113 43 131 -66
6635f6J50j71K1K6M7OQ7l8n0K2j49K23k26N9O3n1J04k3q5K80k75Q5k7j7n1OP9
$$ -66 84 -87 -66 -40 7 13 100 62 12 34 -115 108 -118 -59 4 -47 57 34 -51 229 -46 39 12 -5 -56 -50 29
6662B9r5J27r4J83k08J8oRJ54O0j99J26j06O1j59J19n5J43j2j62J19O7k00J97
$$ 29 -66 61 -33 150 -58 -40 -46 -37 117 177 -22 104 -2 59 -100 19 -36 107 95 -67 52 119 -81 116
6686A16j01J13j51J02j80N4J34k91J37R2l5R6r1Nm5J24j39R4j39K27j83J24j10
$$ 116 15 128 -23 79 -101 -47 87 -204 -67 25 -10 86 -5 0 -45 79 -60 34 -105 122 -61 63 -47
6709d7l7J74j73L3J44l4n7j1m6l9Q3q9J05o7k1L8J68k83J06p9m9J12m3K42j96
$$ -47 -84 90 -83 -50 94 60 3 -8 -54 -93 -10 -99 6 -61 -82 -44 124 -159 -53 -132 -181 -69 -112 130 -66
6734f6Q0j1q2j4L9J20k08J73J20k52N3KJ52k02nR5K0j8J56q0o6M7l2L6n3L2j35
$$ -66 14 3 -79 -93 -54 66 -142 31 151 -101 -48 -46 106 -96 -101 -6 14 -4 152 72 6 53 21 57 4 36 -99
6761i9K61k29j8m5K13k07L5P8Q3r9j03J53k4R7j5j39M5O3j5J31j29j08L6K4K06
$$ -99 162 -67 -85 -130 83 -124 -89 -11 72 -27 -130 23 -1 96 81 -58 -13 50 35 166 37 -71 -35 -11 195
6786A95l22P7J37j50J40qk35J53n0j6M2o2J61k59L23j08K4Q3j54J22p9j71K27
$$ 195 -127 -50 87 -63 77 69 -166 -13 -63 -79 -37 -99 62 -197 126 18 42 125 -29 93 14 -157 70
6809G0j64J78M7l5l6K2k87K29k3K2j00J31j47K0kJ50l8j98J73J12n1k5j4j25N8
$$ 70 -94 84 131 96 60 82 -205 24 1 23 -77 54 -93 -73 -75 75 37 -161 12 124 73 48 34 -91 -33
6834c3P9J27k25m8O2J35j22j90J51K59k21j44J95j34O0J58O7k54J93L2j22K5j32
$$ -33 46 173 -52 -100 -38 97 -25 -215 -64 195 -26 -170 25 -109 -49 109 176 -78 115 147 25 50 -82
6857h2k7J76n4Q9k21n1O1Q6O0k6m8M3R9j25R1j51Kj0oJ69J0k03K8J22l7k5n9j4
$$ -82 -109 67 13 102 -119 -170 -109 -23 37 11 -37 6 105 -20 71 -80 -78 -88 -94 75 85 -118 -90 32 -5 -30 -89 -103
6885a03K43n8j12O5K8j07J06j01k8n2K26j43MKO4R4j73K0NJ49j07O4q7J1J28j04
$$ -103 140 82 -30 35 63 -44 62 -39 -67 -119 107 -36 -32 -30 34 128 -45 -25 -20 129 22 86 -1 10 138 34
6911C4o3R9j31j1J26R1j41l4J06k04K12Rm7o6P1j59J71R8j79j23R0J80k67J09
$$ 34 -29 70 -61 -72 54 145 4 -30 76 -128 84 93 46 -20 51 -108 63 161 -18 -141 -51 129 -138 -29
6935b9l6k4K92p3j01N9J3k06J60m4Q9l9q0N8n7k6k9j2mk5Q3M4O9j89Q7M1m0Jp3
$$ -29 -65 -89 203 130 29 88 101 -105 55 11 100 61 -19 39 -18 -44 -73 -85 -89 -114 -31 13 82 -107 -20 21 -19 -18 -91
6964i1Q4j18J10J69m6o9m5l7m8m8J26M5j05Q4q5Q9j06K95j86k5Jr9J8J08o1QJ8
$$ -91 -7 -125 -15 154 108 39 -6 -43 -91 -139 -13 32 -73 11 -74 15 -91 204 18 -7 -6 -105 -87 21 -40 -32 -14
6991a4n7k7O4J19m5J2j02n0k4M1J01q2l3J03R9j17P3k28J16J5j53P5J55o5R3l51
$$ -14 -71 -98 -34 85 40 52 -50 -100 -124 -83 18 -64 -97 6 105 -12 61 -167 -51 -36 -189 -114 41 -24 69 -282
7017b82K57R6j46M1j73J98P3J9r0j43Q9L0J73O2l45RR7P8k46K33j67O2O4k2J19
$$ -282 -25 71 -75 -34 -207 -9 64 83 -7 -150 -61 -31 142 204 -141 -132 -35 43 -203 30 -137 -75 -11 -33 86
7042H6j55J52j51J11j70J46j05mJ20n8J51j21M9j05J28j70J08jq9K25l37N2J48
$$ 86 -69 83 -68 43 -127 19 -86 -90 30 -28 123 2 51 -54 74 -96 12 11 -78 147 -190 -138 10
7065A0K0J3q4N3N6j23p2q4R6Q9pN2K01l25R2r7J37J12j15j46R2J56J13l16K3N4
$$ 10 30 43 -41 12 68 -55 -127 -211 -115 -26 -33 19 220 -105 -13 -110 27 139 24 -122 -30 126 239 -77 -54 0
7091@j6J32j8J50m56K30ML2m1k7Q2j40J39o5o2r8O6J08p4lR9k0Q5k87K03o3k8
$$ 0 -16 116 98 248 -208 22 26 58 17 -10 72 -68 71 6 -56 -154 -88 20 -54 -57 42 22 107 -180 23 -40 -68
7118f8L7k3K7J35m4p9P1o0J08k5j01p0O9j7n2J46J06j32k2O5J5r0p5K7M4QJ42
$$ -68 -31 -54 -27 108 64 -15 56 -4 104 79 -22 -92 -23 -40 -92 54 160 28 6 71 86 -4 -79 -52 -8 0 142
7145A42j61K8M6J6j77n5O3j2O5K04j72K25l22K26j94P2J2J33j94k6J37j55K45
$$ 142 -19 9 55 71 -106 -161 -98 -110 -45 159 -13 212 -110 116 -78 -6 6 139 -55 -81 56 -99 146
7168A46k24N7K4j83L01j79J48r2o3O2J74j53k8rj02J27K10k76P4O1M4k70K91j24
$$ 146 -78 -21 3 -180 121 -58 90 -2 -65 -3 171 18 -10 -19 -121 6 216 -60 14 75 119 -151 140 16
7192A6Jp2L6J8q5J35j0j4rj02O9M5j28n5pRJ65L0j78J96k91K81n9J32m0QK7j59
$$ 16 17 -55 -19 -1 -86 49 39 25 16 -86 -17 28 -100 -155 -162 -153 12 42 -136 60 -231 50 -9 123 83 91 118 -41
7220d1m7R4P4k7j0Q9k52K72j36O2j46P8j24J30Q5j68P5J51j26m7m2K8J34p8o6
$$ -41 -88 6 80 53 43 132 -120 152 16 78 -68 10 -114 16 101 -67 8 159 33 -14 -56 -28 106 28 -38
7245c8l2J28J18k70Q0j73J46J11L9L6j80J45q3KJ04j03K5K9j08J73O9m06J93J06
$$ -38 -70 58 176 -94 -14 -187 -41 70 109 145 -35 110 27 29 133 30 55 84 -24 149 218 -188 5 111
7269A11j24M0J10j35N0n4ln0q4J39n2J2P4O5j64J93j18k9P3K1j37J64k99L05k70
$$ 111 -13 27 137 2 52 -2 -5 -55 -139 0 -52 -40 34 99 -65 128 10 -19 54 75 -62 102 -197 108 -162
7294a62J02N6J47j31J5Q5o3j21j03Q5O5P4j84K88r6q0Q5r7M5J09k18K79j38O0
$$ -162 -60 -4 143 12 27 112 49 -72 -175 -90 -25 49 -135 153 57 -23 62 -35 10 119 -99 180 42 102
7318A02k0L7k58J28ll3O6q8N7Kl0MP9q7O2j25K8j1J71o9N3p4j13J38J38l3Mk14
$$ 102 82 119 -139 -11 -14 -47 19 -69 -12 -10 -40 -36 43 -44 18 -107 -79 -90 81 12 65 -9 -122 16 154 121 125 -89
7346h9J28k6Q0k4j0j14jm5K32j39J2r4k6K37Q2l16K89k65O4O4P3k50J10j56J51
$$ -89 39 13 93 69 59 -55 -56 -101 131 -8 4 -90 -116 121 203 -113 176 -89 -25 39 112 -138 -28 -184 -33
7371c3k7M0J23m9n5N7l8j5L9j82Q5L14k10k64M18j26pO2j45j53K28j33K56j47
$$ -33 -60 -20 103 54 -1 56 18 3 42 -140 -55 259 49 -215 203 77 70 132 -13 -166 62 -71 185 38
7395C8k7q6J02j0ro1n4K26j79J28k6p1J41j78O4L0l4j82J48O6j1j82K39r6J20
$$ 38 11 -75 27 17 8 -53 -107 119 -60 68 42 -29 112 -66 -2 28 -6 -188 -40 26 15 -167 72 -24 96
7420I6q5o9Q1kj94J78J3J60r0l9J6k14K60j13N9q2K50l53K42q7k3Q5j02l5m6K37
$$ 96 11 -58 23 21 -173 5 18 178 88 49 65 -149 111 -2 57 -25 225 -128 114 27 4 89 -13 -48 -94 143
7446A43l19J20O0L4r0J21j08OP1k5l2lO3M2j80M8j07L18k42O8OQJ4q5J40M8p2
$$ 143 -176 -56 4 38 -52 69 -39 -33 38 13 -19 -22 41 83 -97 -49 -156 162 -80 -12 -6 2 16 -69 71 119 47
7473D7j3k50K38m3Q0J4j92P3L7K9J77l14J01J93j32q5o1J83r7J7j21J76o9Lm3
$$ 47 34 -216 22 -21 59 73 -119 -46 -9 20 197 -117 -16 177 45 -40 -101 82 -15 2 -119 57 -12 -9 -52
7498e2J24k13J42P2m1ok94J67J02J8q4K02j23J02m9J32j49j77K25j60N6r8q5K15
$$ -52 72 -141 1 73 32 26 -268 -101 1 19 -65 137 14 116 67 199 50 -127 98 -62 -6 -104 -189 26
7522B6r3K84j42R4j67j83M4J50k5j3N4M4k8Q8k16o5K68j54o4J19n2p4J51N0j08
$$ 26 -67 217 75 169 2 -181 -137 13 -12 -25 29 73 45 133 -83 -148 120 -34 -98 21 -31 -105 46 96 -12
7547a2MJ33k27K3j5k7L47k91kJ9j02J17m8J73j57J31J35l4j50KN4l6l9r2L7J36
$$ -12 -8 125 -102 -79 -94 -121 226 -65 -67 -48 -150 -33 -81 92 -65 66 201 167 17 19 73 37 -2 -94 -57 79
7573G9k31LK46K5J26k51M5R5K0j21r8J69J07j90K0k1L9NJ4p8J8j3oM7l7P5j20
$$ 79 -152 -149 97 122 248 -3 42 137 157 36 -62 107 214 24 44 23 62 67 81 3 21 8 2 49 12 87 -33
7600c3j18K70k61J1J64Rj92J74n4J22k20O5r1N8J22m8j08J58r4Q8k3R0o0n0j0
$$ -33 -151 119 -142 -131 33 42 -150 24 -30 92 -128 -63 -154 -96 26 -22 -130 28 -66 22 -1 89 29 -21 -31
7625c1l8J18j08L7m2KJ10jj54n6L14j57j8J0j04N1l0M7PJ95k93J28m3K73n6n9
$$ -31 -69 49 -59 -22 -64 -62 48 47 -107 -163 151 -6 -24 -14 -118 -67 -97 -50 -43 152 -141 -13 -56 217 161 102
7651A02k2j07R9k09K06j97K60j18k2L2R5j7o2l3o0M4K0MR5p8n5L5L5j65J13n5
$$ 102 80 -27 72 -137 69 -128 132 14 -8 24 119 102 40 7 -53 -9 11 15 110 32 -23 12 47 -118 -5 -60
7677f0J44q0L0n4KN9pJ7m3J08j20J26k04Q0m1Q7j00J19m4Q7n1n4r9J21K8k25P7
$$ -60 84 4 34 -20 -18 41 34 51 8 116 -4 122 -82 -2 -43 44 -56 63 19 106 55 1 -98 23 51 -174 -97
7704i7QR7j31J16l8RJ9K8L2R0n2r1J9O9o8R4q9k0j2j55J54m3O4N5J5j37J15l8
$$ -97 -89 8 -123 -7 -45 -36 -17 11 43 133 81 -10 9 78 10 104 15 -5 -17 -172 -18 -61 3 58 73 -64 51 13
7732A3k6J01M4j6j21K30k66R8j19M7J86m1p3k58R8K88j33p6n0M5L9p0k19M33q7
$$ 13 -13 88 132 116 -5 225 -41 57 -62 -15 171 130 57 -201 -103 185 52 -24 -74 -29 10 -60 -279 154 67
7757F7j01K8q8N9K16j26j24O2J37k34J02q8M5Lj97L32r7Q%n0J2j00J29p9O0P9
$$ 67 -34 -6 -94 -35 181 55 -69 -7 130 -104 -2 -90 -45 -42 -239 93 -4 4 4 -46 -34 -134 -5 -84 -24 55
7783E5Rj51K5J4O6r0j36K22J8j23J53j09j54K01L6J1j03R1L1j71J34JPR4k36J03
$$ 55 64 -87 -62 -48 18 -72 -208 14 32 -91 62 -47 -201 0 36 47 -56 35 66 -105 29 30 37 131 -105 -2
7809bP4n6P8j11p2K57k60r4L26j02j13Q9J7r5Q9q1j37qJ73pQ9K4k01j61J88QJ71
$$ -2 72 16 94 -17 -89 168 -92 -186 140 38 -75 14 31 -64 25 -56 -193 -201 -28 -35 54 78 -123 -284 -96 -88 83
7836H3j64J67l8p0L8P5Pk50M6J61K0q8J56o9j95J41p5j17M8K5Q0Q4j19M9l4m4
$$ 83 -81 86 48 -22 16 91 98 -152 -106 55 75 -13 143 74 -121 20 -55 -172 -124 -99 -19 65 -54 -5 -39 -83
7862h3J89k47K22k52N1J25k27R2J31Ok1J07j73m3K93l08J44n0M8J6n7J53p3m1
$$ -83 106 -141 81 -171 -120 5 -222 -130 1 7 -14 93 -80 -123 170 -138 6 -44 4 20 -37 116 43 2
7886Br7J99k05rK39q6O0r4j04lJ58Jj27K08Q3j29p1Q4j0J0j93K13o0k8J26j84
$$ 2 -95 104 -101 -110 129 43 103 9 -95 -98 60 61 -66 142 225 96 25 109 99 109 -84 129 69 41 167 -17
7912a7J10p4k7P5j68J09M8Q9r4jJ31l68J02n6J56q1l6J22m6o6K12Pj49N5K2n6
$$ -17 93 19 -8 67 -101 8 56 145 51 50 181 -187 -85 -141 15 -66 -102 20 -26 -92 120 127 -22 33 55 -1
7938ao5J48j09k5LJ0J59j75J52j03pj64K07M8%n1P3l7j63J45p3J04j59L0j31J91
$$ -1 -66 82 -27 -52 -49 -39 120 -55 97 -6 -13 -177 30 78 78 27 100 63 -100 45 -28 76 -83 -53 -184 7
7964GJ00j25k6R5r5P4N2o3N7Oj95K16m8l5j55J86rl9k8j29K60l17J78o8J11j09
$$ 7 107 -18 -44 51 -44 30 82 19 76 82 -113 103 55 20 -135 51 42 3 -25 -154 106 -211 -33 -101 10 -99
7990i9J59M4j30L0M1l1p6L0j01P5R2j83J06L5P7k7n1N1O6m1j71J12O0r8J19j28
$$ -99 60 104 -26 4 45 14 -62 -32 -133 -58 34 -149 -43 -8 69 42 -9 42 108 67 -104 8 68 -30 89 -39
8016c9J30m3j40P2N7j25K29j69j03J2O8Q2k15J08L2J70j75J72j80N3n0L5j5Q7
$$ -39 91 48 -92 -20 37 -88 141 -28 -131 -119 -51 31 -184 -76 -44 126 -49 123 -57 -4 -54 -19 -34 53
8040E3k28K89j84O4J51n7M1r8l04K80q1J33j88J71r5Q5r9n2J00M8j3n8k4J86j15
$$ 53 -175 114 -70 -6 145 88 129 31 -273 7 -74 59 -129 42 -53 32 -67 -119 -19 29 16 -42 -66 120 5
8065Em9n4J18J00k56J51n3O9J8N2M2j82R7m9%L0K02j97j54K65j46m5R9J5j64O0
$$ 5 -44 -98 20 120 -136 15 -38 31 49 101 143 -39 58 9 9 39 241 44 -110 155 9 -36 63 78 -86 -26
8091b6M6q3J40m3q5r7O9K19j74J22j38l9J50q9J19j26N2j64l2M32j88j30J16o1
$$ -26 20 -63 77 34 -51 -148 -79 140 -34 88 -50 -89 61 -28 91 -35 17 -147 -179 253 65 -65 51 -10
8115a0JJ10r8M1n8M6k6o0L7o8P6J33k16M6pk1O0kR1j68QK7J60l5k1%j05%J1M1
$$ -10 -9 101 3 44 -14 32 6 -54 -17 -85 -9 124 -92 -46 -53 -74 -14 -16 75 -93 -85 -58 102 67 46 46 -59 -59 -48 -7
8145gl4j43K39k2l4j2L17l78q4m9K53l2n8J30k32K20l8j0N2l0l2j45n4K32j15
$$ -7 -41 -184 55 33 -1 -13 304 -74 -158 -207 46 14 -44 86 -146 74 36 26 78 48 16 -129 -183 49 -66
8170f6O4Mr2K5J75P1j93j36Q1R6k23K58l5K01l11J19j81R2K89l03J23
$$ -66 -2 2 -90 -65 110 181 -12 -148 -67 29 -194 64 29 230 -81 38 -143 -51 238 -65 58
8191E8
$$ Imaginary data points
##PAGE= N=2
##DATA TABLE= (X++(I..I)), XYDATA
0@%%%%%%%%%%%%%qJ6j6J6k3L1l2M0m8N6p2Q0q8J04j26J50j68J92k22K52k85L22
$$ 0 0 0 0 0 0 0 0 0 0 0 0 0 0 -8 8 -8 8 -15 16 -16 24 -24 32 -40 40 -48 56 -70 80 -88 104 -118 134 -151 171
35A71l62M06m57N12n72O37p08P87q73R67j068J179j301J434j581J740j917K115
$$ 171 -191 215 -242 270 -302 335 -373 414 -459 508 -560 619 -682 752 -829 911 -1006 1109
53A109k333K574k846L157l512L922m399M968n659O519p628R110j1209J4444k0134
$$ 1109 -1224 1350 -1496 1661 -1851 2071 -2328 2640 -3019 3500 -4128 4982 -6227 8217 -11917
68a1917L3126j20466k9153J23301k6660Q4981R9278J4687m2973N087m7047p1513
$$ -11917 21209 -99257 -128410 -5109 -31769 53212 152490 167177 124204 129291 82244 10731
80A0731n2548n3027o4962J5558L9853J2083M5828R9527M0807O202L2150K523o0422
$$ 10731 -41817 -94844 -159806 -144248 -104395 -92312 -46484 53043 93850 100052 132202 134725 74303
93G4303l7784l5747q0357m7710K4258r2q384O8746Q2534J2301J5722M8327J388
$$ 74303 36519 772 -79585 -127295 -103037 -103129 -111513 -42767 39767 52068 67790 116117 117505
106A17505m5794k9509l4084n3047l2929j5848j4829K3053N0966K7552K6450N4743
$$ 117505 71711 42202 8118 -44929 -77858 -93706 -108535 -85482 -34516 -6964 19486 74229
118G4229K7153j8503j0755j1670m8939m7386j8833k4738j8480K5246L4393J7079
$$ 74229 101382 82879 72124 60454 11515 -35871 -54704 -79442 -97922 -72676 -38283 -21204
130b1204L5499M9066J4667p854Q16j3016l9589l6258k6072k4554r408R386J4432
$$ -21204 14295 63361 78028 70174 70990 57974 18385 -17873 -43945 -68499 -77907 -68521 -54089
143e4089K6615M2024K9414J1944J3933M875k2491l0762k4326k8421k7098r090
$$ -54089 -27474 14550 43964 55908 69841 74716 52225 21463 -2863 -31284 -58382 -67472
155f7472K881R959K5918L2980K2858J8187J8612L104j7617k1980k0619k6049k7148
$$ -67472 -64591 -54632 -28714 4266 27124 45311 63923 67027 49410 27430 6811 -19238 -46386
168d6386j4908K53J1186J8007K2650K6216K4959J4205L10p691j3516k2148k7696
$$ -46386 -61294 -61041 -49855 -31848 -9198 17018 41977 56182 56492 48801 35285 13137 -14559
181a4559k3266j2366l456L366J3728K2886K4510K0157J4429O376l187j1743j9046
$$ -14559 -37825 -50191 -53647 -50281 -36553 -13667 10843 31000 45429 51805 48618 36875 17829
194A7829k4660k1508j1952p790k570J2356K2607J9219J6707J8021J0991k470j0500
$$ 17829 -6831 -28339 -40291 -48081 -50651 -38295 -15688 3531 20238 38259 49250 46780 36280
207C6280j5421k0301j9503j5224j1856j785J1438J5063J5096K0525K0404Q459
$$ 36280 20859 558 -18945 -34169 -46025 -47810 -36372 -21309 -6213 14312 34716 43175
219D3175l90l720j2830j9976j8197j6311j3551k603P724R366J4880K2425J7937
$$ 43175 42785 39065 26235 6259 -11938 -28249 -41800 -44403 -36679 -27313 -12433 9992 27929
232B7929P574N252K56j1926j7768j6471j6994j3954l918J523O499J6644J9755
$$ 27929 35503 40755 41011 29085 11317 -5154 -22148 -36102 -40020 -38497 -31998 -15354 4401
245D401J4083J1562J0639Kj1033j2532j4355j8632j4172o507k384N460J4539J5218
$$ 4401 18484 30046 40685 40687 29654 17122 2767 -15865 -30037 -36544 -38928 -33468 -18929 -3711
259c711J3678J5895J1349j58n911p879j4788j8044j3064r463m814L682J0596J1665
$$ -3711 9967 25862 37211 37053 31142 23263 8475 -9569 -22633 -32096 -36910 -33228 -22632 -10967
273a0967J5250J6794R452K462j56o277j4885j5267j2204j1029o983J570O939J0521
$$ -10967 4283 21077 30529 32991 32835 26558 11673 -3594 -15798 -26827 -33810 -32240 -25301 -14780
287a4780J4653J4832R275O378K695o448j2059j1901j2481j2756p003o04L538R164
$$ -14780 -127 14705 23980 30358 33053 26605 14546 2645 -9836 -22592 -29595 -30199 -26661 -17497
301a7497J3031J2487J0743Q870K908n014p718r857j3310j2783o984l055J311P107
$$ -17497 -4466 8021 18764 27634 30542 25528 17810 7953 -5357 -18140 -25124 -28179 -26868 -19761
315a9761J0963J1888J1712R030L449j155n021r705j2874j1038q217n626o48N392
$$ -19761 -8798 3090 14802 23832 27281 26126 21105 11400 -1474 -12512 -20729 -26355 -27003 -21611
329b1611R024J0696J1458R565N411J350l275q426j0663j0469r318p124j793K989
$$ -21611 -12587 -1891 9567 19132 24543 25893 22618 14192 3529 -6940 -16258 -23382 -25175 -22186
343b2186O681R293J0760R580O847L092k004n656q320j0057j0068o965l302O40
$$ -22186 -15505 -6212 4548 14128 20975 24067 22063 16407 8087 -1970 -12038 -19003 -22305 -21665
357b1665M289Q017R675R095P048M496M28l767p119q493r115p422n215o60K775
$$ -21665 -17376 -9359 316 9411 16459 20955 21383 17616 10497 2004 -7111 -14533 -19748 -20408 -17633
372a7633O258P950Q254P838M888J736k008n046p394q166p771m876k284J188M456
$$ -17633 -11375 -3425 4829 12667 17555 19291 17283 12237 4843 -3323 -11094 -15970 -18254 -17066 -12610
387a2610O862P645P145N560K721n69l855o250p545o749n411l123N1L180N697O538
$$ -12610 -5748 1897 9042 14602 17323 16754 12899 6649 -896 -7645 -13056 -16179 -16128 -12948 -7251 -713
403g13O999N513L500L25k746m881o090o703n923l332q56J706M434O007O513N627
$$ -713 6286 11799 15299 15624 12878 7997 1907 -4796 -10719 -14051 -14907 -13201 -8767 -2760 3753 9380
419I380L796J169j339l778n693o111n702l569j819N96L372N356N893N413M299
$$ 9380 13176 14345 13006 9228 3535 -2576 -8278 -11847 -13666 -13070 -9698 -4342 1551 6964 11263
434A1263J871n33k629m616o067n119m140k827K75K392M453N147N389M291K414
$$ 11263 13134 12601 9972 5356 -711 -5830 -9970 -12797 -12522 -10130 -5677 -530 4859 9150 11564
449A1564M92j765m249m561m932m587k964l93J476K967M718N245L991K918J257
$$ 11564 12056 10291 6042 1481 -3451 -8038 -11002 -11395 -9919 -6952 -2234 3011 7002 9920 11177
464A1177j180l119l897m526m944l036p87L53J932M529M763M134L170J623k93k121
$$ 11177 9997 6878 2981 -1545 -6489 -9525 -10312 -9959 -8027 -3498 1265 5399 8569 10192 9899 7778
480G778l437m725m145k916k003p53K084L773L775L837L865K211R4j236l197l951
$$ 7778 4341 -384 -4529 -7445 -9448 -10201 -8117 -4344 -569 3268 7133 9344 9438 8202 5005 1054
496A054l870l408k891l82J677K416L208M253L826K096P42n46k201l489l644l772
$$ 1054 -2816 -6224 -9115 -9497 -7820 -5404 -2196 2057 5883 7979 8721 8175 5974 2485 -1159 -4931
512d931k757n53J95J530L237M345L157K251J596K06j804l035l319l505k678j557
$$ -4931 -7688 -8241 -8046 -6516 -3279 1066 4223 6474 8070 8276 6472 3437 118 -3387 -6065 -7622
528g622k34J112K969L404K732K920K197J95j313j927k991l557k746j947p86J089
$$ -7622 -7856 -6744 -3775 -371 2361 5281 7478 7673 6360 4433 1442 -2115 -4861 -6808 -7594 -6505
544f505K032K585K993L243K156M05k71j495k767l303k639k311j130N13J162K376
$$ -6505 -4473 -1888 1105 4348 6504 6909 6638 5143 2376 -927 -3566 -5877 -7007 -6494 -5332 -2956
560b956L174K939J919J076N53j166k452k694k600k327j464k94Q10J942K829K422
$$ -2956 218 3157 5076 6152 6705 5539 3087 393 -2207 -4534 -5998 -6292 -5482 -3540 -711 1711
576A711K288J711N06p43j769k030k720k440j783q13O69J496J837K573K684J715
$$ 1711 3999 5710 6216 5473 3704 1674 -1046 -3486 -5269 -6082 -5413 -3917 -2080 493 3177 4892
592D892P56k50j076j941k399k469j917j039J02Q43J810K334K365K056P91M47n65
$$ 4892 5648 5398 4322 2381 -18 -2487 -4404 -5443 -5341 -4498 -2688 -354 2011 4067 4858 5305 4740
609D740j765k357k032j986j111p87M77J723K016K001J901J618O61l89j379j732
$$ 4740 2975 618 -1414 -3400 -4511 -5298 -4821 -3098 -1082 919 2820 4438 5099 4710 3331 1599
625A599k115j876j837n90J66J108J761J766J855J901M82K33n85j565j894k098
$$ 1599 -516 -2392 -4229 -4819 -4653 -3545 -1784 -18 1837 3738 4220 4453 3868 2303 409 -1689
641a689j434r79j44L76J323J718K050J664P69O70l18j240j782j714j658j051o15
$$ -1689 -3123 -4102 -4246 -3870 -2547 -829 1221 2885 3654 4324 4006 2766 984 -730 -2388 -3439 -4054
658d054K62R35J665J585J517J279Q20k28q32j326j472j818j205r02J75O96J049
$$ -4054 -3792 -2857 -1192 393 1910 3189 4009 3781 2949 1623 151 -1667 -2872 -3774 -3599 -2903 -1854
675a854J442J645J600O55l6m48q42j598j814j065r23k75M35J053J094J627J336
$$ -1854 -412 1233 2833 3488 3452 3004 2162 564 -1250 -2315 -3238 -3513 -3078 -2025 -931 696 2032
692B032Q06N48l26o07j482j445j140j069m88k9O81J203J267J325R85P57mo11j041
$$ 2032 2838 3386 3060 2453 971 -474 -1614 -2683 -3171 -3200 -2519 -1316 -49 1276 2261 3018 3014 2403 1362
711A362j209j057j275o81k6K70J203J137R89J237Q36l0l49q60r92j274r17o69
$$ 1362 153 -904 -2179 -2860 -2886 -2616 -1413 -276 713 1950 2786 2756 2407 1547 555 -719 -1636 -2305
729b305m78J90P84J067J059J370N07L64J9n74j139j158q39r51n03J96M81P91J321
$$ -2305 -2783 -2593 -1809 -742 317 1687 2194 2558 2577 2003 864 -294 -1133 -2084 -2587 -2391 -1910 -1119 202
748B02P90J001N18j20k89q19j137r56q80o37j7K31P46J014R95R47N06K12l29m83
$$ 202 992 1993 2511 2391 2102 1283 146 -810 -1690 -2327 -2344 -2113 -1367 -353 642 1589 2095 2307 1978 1495
768A495o03j406r66l63l98K12N99Q45Q00P76P17L18q4l06q41r20p77o52m05m0
$$ 1495 892 -514 -1480 -1843 -2241 -2029 -1430 -585 215 991 1708 2026 1942 1636 795 -125 -902 -1554 -1959 -1999
788a999M68O43Q77P18O87M60N8l52n78q06o82p43m75j39K01M99Q37P85P00M03
$$ -1999 -1531 -888 -11 707 1394 1854 1912 1560 982 176 -506 -1249 -1724 -1863 -1662 -1163 -326 459 1159 1562
808A562L65l05m27p27o59r00m26j23J11K22O19Q36O96N55K08L9l57o87n72q38
$$ 1562 1927 1622 1195 468 -191 -1091 -1517 -1640 -1529 -1307 -688 148 844 1399 1607 1646 1289 602 30 -808
828h08m10k77r7K81M97Q54N24N58L65M2K0o99n42o50n71m93j77K09M54M01P18
$$ -808 -1218 -1495 -1592 -1311 -814 40 564 1122 1487 1529 1549 850 308 -342 -913 -1406 -1583 -1374 -920 -519 199
849A99P38M36%Q3l34n65n70q67k54l09J31J21M58P88P56K79L55k99j24m07o60
$$ 199 937 1373 1373 1456 1122 557 -13 -880 -1134 -1443 -1312 -1191 -733 55 811 1090 1445 1146 1022 615 -45
870d5m22n79j48j45J71N66N83L25O15K84J45k65k16p09n44k33n36j15K6K04M52
$$ -45 -467 -1046 -1194 -1339 -1168 -602 -19 306 921 1205 1350 1085 869 160 -384 -617 -1153 -1268 -1242 -1038 -586
891e86N90N60M20K58m0l56m45o04k81n88n8J2J78L87M83M47N32J72M0j44l72n07
$$ -586 4 564 984 1242 1202 846 401 -203 -484 -1072 -1130 -1118 -940 -553 -70 377 909 1081 1121 977 605 98
913I8l76l95k03p1o0K09O35L69L96L85o7j07q5n65l69m60l37m0K21R5L16M52K37
$$ 98 -278 -673 -876 -947 -1007 -798 -163 206 602 987 920 813 728 163 -206 -666 -1003 -1043 -822 -727 -411 41 278
936B78L11L66K06l30m25m14l64k04j47k43L98LM50M25M03L73l7m73k10j78m18
$$ 278 589 955 1161 831 406 -8 -372 -576 -723 -966 -568 -565 -115 310 713 1086 1049 576 366 188 -230
957b30k64l26j16J27K80K08M56M62K48J17j14l16l52k95l04l04j68P7K92J74K64
$$ -230 -494 -820 -936 -809 -529 -321 135 597 845 962 848 532 180 -115 -419 -723 -891 -814 -522 -348 -84
978h4L84L38K69j51km21k76l28l06j54O8K59l4L03M47J68J19K35k52k52k80k64
$$ -84 300 638 907 756 754 333 57 -271 -577 -731 -663 -404 -438 -135 312 480 599 834 582 330 50 -214
1000b14j95k56p9L0L97N0L53L23L02j33N7k66n6m63k12j42j27j46J62L29K86K83
$$ -214 -409 -665 -744 -714 -317 -267 86 409 711 578 635 369 313 -150 -362 -504 -631 -777 -615 -286 0 283
1022B83K32O1J62l05l72M8l94k58l5p7K65K9L82K27l0L26N3k9k98J1l58l67n1
$$ 283 515 576 738 433 61 109 -285 -543 -578 -655 -390 -361 21 248 218 544 597 568 270 281 -77 -444 -495
1045d95j43J3L18R6L63J65J02L3J6l1j75k94k33o0j38K8N0J40K66J15L55qm5n8
$$ -495 -638 -625 -307 -211 152 317 419 452 468 437 262 -32 -265 -325 -463 -435 -385 -245 21 136 491 483 438 380
1069C80j91k41p5k79M5j3J51O4K64r2L63J16j94N8n0k27q2l89k59J26R8J82J84
$$ 380 189 -52 -127 -406 -361 -374 -223 -159 105 13 376 492 298 356 306 79 -3 -392 -651 -525 -427 -245 -61
1092f1K61Q8K2M9K4k05k46J16k58q3j35K12K8m5K63J46Q4j04L09k70p0k5k70j9
$$ -61 200 288 310 359 383 178 -68 48 -210 -293 -428 -216 -188 -233 30 176 260 156 465 195 125 100 -170 -189
1116a89j75k8J04Q9J63L12n6q1J21J5n5k04n0k77r4n6L10J64j43J36K10O7Q2j52
$$ -189 -364 -392 -288 -199 -36 276 220 139 260 275 220 16 -34 -311 -405 -461 -151 13 -130 6 216 283 365 213
1140B13j79J2j35j16j8j53R6J46J17Q9J18m4j29K33o1j53j32p5K15j56k67K02
$$ 213 34 46 -89 -205 -223 -376 -280 -134 -17 72 190 146 17 250 189 36 -96 -171 44 -112 -379 -177
1162a77R5n2K81J34RKjq0k71l3j59P7K8J11%j83L85m0m3K63j33q5j63l4qq1q5
$$ -177 -82 -134 147 281 290 292 291 211 -60 -93 -252 -175 -147 -36 -36 -219 166 126 83 346 213 128 -35 -69 -77 -158 -243
1189b43M0J20n6K93J3J49q7j42n8J34k71M6j35N9j23K04K0J20r4K80j43n4K02
$$ -243 -203 -83 -139 154 167 316 229 87 29 163 -108 -62 -197 -138 -261 -57 -37 83 -11 269 126 72 274
1212B74k32j19rj52%j59L18o4K22O7k2J6N3R6j18r2j09k08N0j9L9nO6L3J7Q5M6
$$ 274 42 -77 -86 -238 -238 -397 -79 -143 79 146 124 140 193 289 171 79 -30 -238 -188 -207 -168 -173 -107 -74 -57 28 74
1239G4J36q2r2k44l4oK17j93J31J21J22M9l3J7K4J15k75j60P9j63K07q8L4q0J92
$$ 74 210 128 36 -208 -242 -248 -31 -224 -93 28 150 199 166 183 207 322 47 -113 -34 -197 10 -78 -44 -124 68
1264F8J23p7N7o8J21j78j27K1m0p3j6l1J11O0O7K25k60O6k1L6j83J26j50q4j86
$$ 68 191 114 171 103 224 46 -81 -60 -100 -173 -189 -220 -109 -49 18 243 -17 49 28 64 -119 7 -143 -227 -413
1289d13K20Q0J7R0R5L9K28m12J36R0r6k68O3J57p1j41J45K8O2Q0m8j75J32r5k1
$$ -413 -193 -113 -96 -6 89 128 356 -56 80 170 74 -194 -131 26 -45 -186 -41 -13 49 129 81 -94 38 -57 -78
1314g8R1k78K50l7P1j00J14l1J45R7r9j23J29j16l3k06J28m0P9j04J96q2K01j45
$$ -78 13 -265 -15 -52 19 -81 33 2 147 244 145 22 151 35 2 -204 -76 -116 -37 -141 55 -27 174 29
1338B9rK3P8j28j01N4j32K06k4j6k49J55K0L21p4j29j4J19j09j18k4l3k1J40j00
$$ 29 20 43 121 -7 -108 -54 -186 20 -4 -20 -269 -114 -94 227 153 24 10 129 20 -98 -122 -155 -176 -36 -136
1363a36M0K02j8O5p9k0j33K12o1k9j37P2j60K10k4r2J46O5M9r3l6j70K40k91O8
$$ -136 -96 106 88 153 74 54 -79 133 72 43 -94 -22 -182 28 4 -88 58 123 172 79 43 -127 113 -178 -110
1388a10J07mj73J78K48k82K42r1k5k71K14o9o6P7r6R2r1l3J16J03L7j27Q1K06
$$ -110 -3 -7 -180 -2 246 -36 206 115 90 -181 33 -36 -102 -25 -121 -29 -120 -153 -37 66 103 -24 57 263
1412B63k06L7lj35m7P2j72J27J73P5j56L7j4r0p3N2R6l3j06R3k8L4J07k14J25
$$ 263 57 94 91 -44 -91 -19 -191 -64 109 184 28 65 51 -39 -112 -60 36 3 -103 -10 -38 -4 103 -111 14
1437A4L0J3l5M0l3j0O0k28R2O6j45J35N2j9j46J98l5k2l8Ml3J12j83J71Nj70K96
$$ 14 44 57 22 62 29 19 79 -149 -57 9 -136 -1 51 32 -114 84 49 27 -11 -7 -40 72 -111 60 65 -105 191
1464A91j98L8P6N4j67N8J14n4r3j00Q4k4m8m5J35l6l3L00k66J7M8o6n3MJ13m1
$$ 191 -7 31 107 161 -6 52 166 112 19 -81 3 -21 -69 -114 21 -15 -48 252 -14 3 51 -15 -68 -64 49 8
1490HL7m3P2Q2k52K12m4j05j5J70j50L4Q9rp8r1k3J50j30J61k01K6J95J03l31
$$ 8 45 2 74 156 -96 116 72 -33 -48 122 -28 6 95 86 8 -83 -106 44 -86 75 -126 -100 95 198 -133
1515a33J63j60J03J04j16O0rlK70k68M4p2R3j20LJ24j78p9R9J66k62J20K71k25
$$ -133 30 -130 -27 77 -39 21 12 9 279 11 55 -17 76 -44 -41 83 -95 -174 -75 91 -171 -51 220 -5
1539eO9j65O0R3j34Q0m5j5K6R2p7R0k14K30lO3n0k14J09o1p9J7J30n4m9N1k8J88
$$ -5 64 -101 -41 52 -82 -2 -47 -62 -36 56 -21 69 -145 85 82 145 95 -119 -10 -71 -150 -133 -3 -57 -106 -55 -83 105
1567A05l8l8r1m2J08P5l21J10MJ94j7k3k4m0K22j98N5o0M4J00q0j29k08Q4J34
$$ 105 67 29 -62 -104 4 79 -242 -132 -128 66 49 26 2 -38 184 -14 41 -19 25 125 45 -84 -292 -208 -74
1592g4O6k0M2m7J43r4mm3O7j49K55j25J2J2L2J1k19J28P9j37J30k4n8O6p9n5p1
$$ -74 -8 -28 14 -33 110 16 12 -31 36 -113 142 17 29 41 73 84 -135 -7 72 -65 65 41 -17 49 -30 -85 -156
1619a56J52P0k45K06l1q1N6J09j60J53j22J57L3k34J2M4m6J23k7rN8J51k97J53
$$ -156 -4 66 -179 27 -4 -85 -29 80 -80 73 -49 108 141 -93 -81 -37 -83 40 13 4 62 213 -84 69
1643F9k0k26J51O5j88K02m0R4j36J32o3J23j86J54J23k29m4N2j0J7m3O0j16q6
$$ 69 49 -177 -26 39 -149 53 13 107 -29 103 40 163 -23 131 254 25 -19 33 23 40 -3 57 -59 -145
1667a45K68k03J07j29K41m6q5j49K57j31l3Q9M0q8j43J44j12K29k57O3J3j20L12
$$ -145 123 -80 27 -102 139 93 8 -141 116 -15 -48 41 81 -7 -150 -6 -118 111 -146 -83 -70 -190 122
1690A22j57N1Q2o5j39J84r3k0j13R7R8j1o5j26J39J9r4J03o3L9j1J47j26J00j71
$$ 122 -35 16 98 33 -106 78 -15 -35 -148 -51 47 36 -29 -155 -16 3 -91 12 -51 -12 -23 124 -2 98 -73
1715g3k8K41k74P7J23k44K04jJ15j29M7k16K53j36M6n9K07j36p0J28j48L43l40
$$ -73 -101 140 -134 -57 66 -178 26 25 140 11 58 -158 95 -41 5 -54 153 17 -53 75 -73 270 -70
1738g0K73j75K9j85m0Q5J09L6j40R3k01K67j37J71j7j11j2O9J11j02MK9k30J6
$$ -70 203 28 57 -128 -168 -83 26 62 -78 15 -186 81 -56 115 98 -13 -25 44 155 53 57 86 -144 -128
1762a28O1J79k0M4n1M4R1j83M8k68P4J66k0j53J76m6p3O8l8J76l35J69p6J21M6
$$ -128 -67 112 92 136 85 129 220 37 85 -183 -109 57 37 -116 60 14 -59 9 -29 147 -188 -19 -95 26 72
1787G2k52M1O4K12k2j5l2o6j16J23o6J70p7k03K12n4M6p5j8k9K52j57R0j95P7
$$ 72 -180 -139 -75 137 115 100 68 2 -114 9 -57 113 36 -167 45 -9 37 -38 -56 -85 167 10 100 -95 -18
1812a8o3J17p1M0J8q8L9P3k4r9k6J56j87J36k71J63ML1J15o4Q8m2j15R9K8l1o9
$$ -18 -81 36 -35 5 23 -65 -26 47 23 -76 -102 54 -133 3 -268 -105 -101 -70 45 -19 69 27 -88 11 39 8 -61
1839f1L8O1L0p4o2O2R8j82J9M1N9K3K7J1l8J06k26J51p6k01J23LJ64p4o7P2J49
$$ -61 -23 38 68 -6 -68 -6 92 -90 -71 -30 29 52 79 90 52 158 -68 83 7 -194 -71 -68 96 22 -45 27 176
1866A76l2j16p9oJ38n3k12Q7K17K9j46J61j63N8O0k49O7j4n5J82j49R2q5O0O9
$$ 176 144 28 -51 -57 81 28 -184 -97 120 149 3 164 1 59 119 -130 -63 -77 -132 50 -99 -7 -92 -32 37
1891C7j20J97j35N5j19m2J04M4j20L4j14K64j26j7N4k1l8J31l31J84J35l0Kj5
$$ 37 -83 114 -21 34 -85 -127 -23 21 -99 -65 -179 85 -41 -58 -4 -25 -63 68 -263 -79 56 26 28 13
1915A3k02J60M0j02J86j58R6M4k62K48m6P2k78K82r7j60J54L8l5j32J93p6m2J0
$$ 13 -189 -29 11 -91 95 -63 33 77 -185 63 17 89 -189 93 -4 -164 -10 28 -7 -139 54 -22 -64 -54
1939e4M6j7Q2j13J01j76P7R0o0j3N5J39k47J00M5J15j7q5l1l2K7j00K02j21m3
$$ -54 -8 -25 57 -56 45 -131 -54 36 -24 -37 18 157 -90 10 55 170 153 68 37 5 32 -68 134 13 -30
1964c0p9J67j24J34J15j6l7j35j47R8lN6N6j01K1K22q3q3o3J16j05J41r7n9J28
$$ -30 -109 58 -66 68 183 167 130 -5 -152 -54 -57 -1 55 -46 -25 197 114 31 -32 84 -21 120 23 -36 92
1989I2P7r7J8k7P0j41j76M46k46J4k6l8j23K68k16J00lj2o8J10l7j42K62j35J67
$$ 92 169 72 90 63 133 -8 -184 262 16 30 4 -34 -157 111 -105 -5 -8 -20 -88 22 -15 -157 105 -30 137
2014A37p9o2N9J26j09K0j27M1K8r0k6j23J36O5M1j5L1j6j44J48J2j52q3K49k27
$$ 137 58 -4 55 181 72 92 -35 6 34 -56 -82 -205 -69 -4 37 22 53 37 -107 41 53 -99 -182 67 -160
2039a60J19k4K6P6K1N0j32j4k4Q5k6J20j20O6N6r5j07l1R2j6LJ35J03j61q4N0
$$ -160 -41 -65 -39 37 58 108 -24 -38 -62 23 -3 117 -3 63 119 24 -83 -114 -22 -38 -35 100 203 42 -42 8
2065HJ42j82o2J73j35K8J41p8O7j53Jk9J51j24j6J17M7j55J81n7kn8k7Q5j86O3
$$ 8 150 -32 -94 79 -56 -28 113 35 102 -51 -50 -79 72 -52 -68 49 96 -59 122 65 63 5 -22 63 -123 -60
2091f0J32k11P2Q3jq5Q4l2K6m0j8J39l8J0k9J41j34%J06j04o0P5O7p8l1km9j9
$$ -60 72 -139 -67 16 15 -70 14 -18 8 -32 -50 89 51 61 32 173 39 39 145 41 -19 56 123 45 14 12 -37 -56
2119e6J17j31l7J58O0J09k95J6J82o4n7j15R9j08J17m9O7J9j7M7j13k2L1j83L71
$$ -56 61 -70 -107 51 111 220 -75 -59 123 59 2 -113 -14 -122 -5 -54 13 32 15 62 -51 -73 -42 -225 146
2144A46n9p3n5PJ22oq6j02J83j78J55q1K0p4J72l9q4O6J53r6Q7r2MJ04k09q2K34
$$ 146 87 14 -41 -34 88 82 -4 -106 77 -101 54 -27 -7 -81 91 52 -32 34 187 91 178 86 90 194 -15 -97 137
2171A37k30K91k29P6j13l5N9P3K6j10o9Q8o3K45j40J09k09P3o6K7O5l1N0J0J41
$$ 137 -93 198 -31 45 -68 -103 -44 29 55 -55 -124 -36 -99 146 6 115 -94 -21 -87 -60 5 -26 24 34 175
2196A75j48N7j80O4j40J49J8j46K4K29j00j27k4R9L3K6Qj18K34m0j43J04L1o9
$$ 175 27 84 -96 -32 -172 -23 -5 -151 -127 102 2 -125 -149 -50 -17 9 17 -101 133 93 -50 54 85 16
2220A6R7n4J7r2J43j02k55L59k9j40O3K4k47J00K06k8k9m0j7J30pJ8j43Q4M3k33
$$ 16 113 59 76 -16 127 25 -230 129 100 -40 23 47 -200 -100 106 78 49 9 -8 122 115 133 -10 74 117 -116
2246a16J03J6n5oK03j84R9j94M6J99j11j91J54K3P6o1j03o1J95j21K48j63r2P6
$$ -116 -13 3 -52 -58 145 -39 60 -134 -88 111 0 -191 -37 -14 62 1 -102 -163 32 -89 159 -4 -96 -20
2270b0j83J9J69l4MP0k9J57j52J03r3m9J7K0l0k8J22M9j02nJ2RN5j78K25j84J63
$$ -20 -203 -184 -15 -49 -45 25 -4 153 1 104 11 -38 -21 -1 -31 -59 63 112 10 5 17 26 81 -97 128 -56 107
2297A07r6J8nn6M7p2L9k9m7J83R9N2l26K8J89l1j08q0m4N2K72k30j01J09J44j13
$$ 107 11 29 24 -32 15 -57 -18 -47 -94 89 188 240 -86 -58 131 100 -8 -88 -132 -80 192 -38 -139 -30 114 1
2323AK6J37K9l05J46j65J30j62K48j6Mj29Q6L9rr5J17o7J06jn0k28L49j13j49
$$ 1 27 164 193 -112 34 -131 -1 -163 85 69 73 -56 30 69 60 -35 82 15 121 120 70 -158 191 78 -71
2348g1K02j5j21o8L2l7J92oj88q3J93Ml8J27o5J7J9l34J45J39j89Q1m1j7o4O8
$$ -71 131 116 -5 -73 -41 -78 114 108 -80 -163 30 34 -4 123 58 75 94 -240 -95 44 -145 -64 -105 -122 -186 -118
2374a18M1J23j6mK8j4k6Q6k12J38K5J3k04J08O8k25M21l18Q5O7K9m5j17K17o1
$$ -118 -77 46 30 26 54 40 14 100 -112 26 51 64 -140 -32 36 -189 232 -86 -1 66 95 50 -67 150 89
2399H9k02j1J10K1j06R5J20j84J70j41J15k6M6o7J05k40J03j29J24Q8q7J08m4
$$ 89 -113 -124 -14 7 -99 -4 116 -68 102 -39 76 50 96 29 134 -106 -3 -132 -8 80 -7 101 57
2422E7k4Oo3J46p5n9j38K4J68l5j2J00j20j17K26K5j67M3q3P1N0o0j4J01K8l11
$$ 57 33 39 -24 122 47 -12 -150 -126 42 7 -5 95 -25 -142 84 109 -58 -15 -98 -27 23 -37 -51 50 78 -233
2448b33K98J2k19M8K7M5j3J14n2K6n7L7q6jJ12jn3J6L6m0n3o4L2K26k20K2M3n
$$ -233 65 77 -142 -94 -67 -22 -35 79 27 53 -4 33 -53 -54 58 57 4 20 56 16 -37 -101 -69 157 -63 -41 2 -3
2476cp4M8k2n8K3J40j51RJ41j3N4j3j14J5Q5j11N8J7N6r6l7J82K2K0m04K47k4
$$ -3 -77 -29 -51 -109 -86 54 -97 -88 53 40 94 81 -33 -18 67 -44 14 31 87 -9 -46 136 158 178 -226 21 -3
2503cj44J19m8J75j27Nk6n1J18p6q1Q2J05M5J1n9k62K82K3k26K97j28Q2N1k56
$$ -3 -147 -28 -76 99 -28 -23 -49 -100 18 -58 -139 -57 48 93 104 45 -217 65 88 -138 159 31 113 164 -92
2528i2N0J83j76J35m3N4rp6R8j47P1J6o6l0J43j05K6N5q0L4o6L0r5oP3J54j48
$$ -92 -42 141 -35 100 57 111 102 26 124 -23 48 64 -2 -32 111 6 32 87 7 41 -25 5 -90 -96 -23 131 -17
2555a7J26n8J28M1m48J76l5K3J33k56K27j34L5j3j03L4LJ13J71k46%o3N2K7R9
$$ -17 109 51 179 220 -228 -52 -87 -64 69 -187 40 -94 -59 -72 -175 -141 -138 -25 146 -100 -100 -163 -111 -84 15
2580A5JL7k42K00p0nJ81j45j3j37K14P2j23LOL5no6n0J56Q1j17q3J07j02J2N3
$$ 15 16 53 -189 11 -59 -64 117 -28 -41 -178 36 108 -15 -12 -6 29 24 -42 -92 64 145 28 -55 52 -50 -38 15
2607A5j82K62R6j56q6k1J00N5j23J07j9l52K41L4K5Mp9J53ql0K9n0m2l1J57j55
$$ 15 -167 95 191 35 -51 -72 28 83 -40 67 48 -304 -63 -29 -4 0 -79 74 66 36 65 15 -27 -58 99 -56
2633e6M9ol2O9L0L0Mq9l4P4jJ04k24K02o6j47J12K2K16j82q8j14J06k1N6J39j64
$$ -56 -7 -13 -45 24 54 84 88 -1 -35 39 38 142 -82 120 54 -93 19 41 257 75 -13 -127 -21 -42 14 153 -11
2660a1J22j46j22OK48m4m8Q9kJ11j66n3J13K9l6j53J12j68M6J46j40Q3N8p7O2
$$ -11 111 -35 -157 -151 97 53 5 94 92 203 37 -16 97 126 90 -63 49 -119 -73 73 -67 16 74 -3 59
2685E9O3p6j36J42o8o4l2J00KJ5Pk30L17qm0O9k28K47j42n1M3J2J55q9N7j24L0
$$ 59 122 46 -90 52 -16 -80 -112 -12 -10 5 12 -218 99 91 51 120 -108 139 -3 -54 -11 1 156 67 124 0 30
2712C0l9J0k7j20K17j79N3N2j04KN7P2pq2l8K76k01rJ33j78N9P2k8P5J14k32k7
$$ 30 -9 1 -26 -146 71 -108 -55 -3 -107 -105 -48 24 17 -65 -103 173 -28 -37 96 -82 -23 49 21 96 210 -22 -49
2739d9J27K3j39l2PJJ41j18q9K18k7o5K4L0k2jj10P2j07N7p3J31l0j02K34Lj20
$$ -49 78 101 -38 -70 -63 -62 79 -39 -128 90 63 -2 22 52 30 29 -81 -9 -116 -59 -132 -1 -31 -133 101 104 -16
2766a6J2Nj11K01r6Q1k66K23P2o0j11J77k01J65J83k27j04K24j01j26J40k43K36
$$ -16 -4 1 -110 91 -5 76 -190 33 105 45 -66 111 -90 75 258 31 -73 151 50 -76 64 -179 57
2789E7j59K01m8j09R5m2R0j47N3m4J13j82K77m9p1o3k8N7j03J54Q3j34j42K56
$$ 57 -102 99 51 -58 37 -5 85 -62 -9 -53 60 -122 155 106 35 -28 -56 1 -102 52 135 1 -141 115
2813A15k47J12L7k07L01j12j53K33l4j03L19j43l61L21n9j87J73J3rJ34j9r9j94
$$ 115 -132 -20 17 -190 111 -1 -154 79 45 -58 261 118 -243 78 19 -168 5 18 9 143 124 25 -169
2836a69P0R7J9%J33j50K3m0L2l0o7J64j56J48r5j0J07m9p9N2k4J64n3j1Q6p6r0
$$ -169 -99 -2 17 17 150 0 23 -17 15 -15 -82 82 -74 74 -21 -31 76 27 -52 0 -24 140 87 76 162 86 -4
2863dj03J8J76K4p7k1k0j58J13L0J41j56OO2J02j09K49k75n2N9ln8j9o0K45k6
$$ -4 -107 -89 87 111 34 13 -7 -165 -52 -22 119 -37 -31 31 133 24 273 -2 -54 5 2 -56 -75 -135 110 84
2889H4j77N0Lj30L9J28LJ5J29r0P7o8k91O8L25j88Nnp2R5j9R1j56J11l9L5p7O6
$$ 84 -93 -43 -40 -170 -131 -3 0 15 144 54 131 63 -228 -160 165 -23 -18 -23 -95 0 -19 72 -84 27 -12 23 -54 12
2917A2n1L2j01L56k22K6l4j32J46k10M36l00J79l2J52l86J68J1j07J50L3n3k3
$$ 12 -39 -7 -108 248 26 52 18 -114 32 -178 258 -42 137 105 257 -129 39 50 -57 93 126 73 50
2940E0j47j34K31J11M4j09j17Q3J11j90J89J04k15p9J46k02J87j79K64j91m4Q8
$$ 50 -97 -231 0 111 155 46 -71 12 123 -67 122 226 11 -68 78 -124 63 -116 148 -43 -87 1
2962An2M9N2j0K7j6o1M7O8j17L6p4R8K2j22O7M5J4l1L5j24J58m0j44j06R3j40
$$ 1 -51 -2 50 40 67 51 -10 37 105 -12 24 -50 48 70 -52 15 60 74 43 78 -46 112 72 -72 -178 -85 -225
2989b25K54M7n0n6p8J15q4J07j23K6J46j05J15j32RJ22M3j1q1n1J31j02pk2J10
$$ -225 29 76 26 -30 -108 7 -77 30 -93 -67 79 -26 89 -43 -34 88 131 120 39 -12 119 17 10 -12 98
3014I8o3j61K31l1m7n9O7j7O4Jk58K14j96J14k0R0l5J12oj79O1j24J80n8K43j33
$$ 98 35 -126 105 74 27 -32 35 18 82 83 -175 39 -157 -43 -63 27 -8 104 98 -81 -20 -144 36 -22 221 88
3040H8j04r0J3J97k04J24k2n2J42o5j87J29J10J5j40N4m7L7K9Q1j35Q8M7k41J69
$$ 88 -16 -106 -93 104 -100 24 2 -50 92 27 -160 -31 79 94 -46 8 -39 -2 27 108 -27 61 108 -133 36
3065C6n9j15o1K17pM5L9j70Q4r8J40k61J21JL5P5j5M3m5q4P3k6j07LL9J12n5m0
$$ 36 -23 -138 -199 18 11 56 95 -75 9 -89 51 -210 -89 -88 -53 22 7 50 5 -79 -6 -32 -139 -136 -97 15 -40 -80
3093h0nL4J25J41j16j12J21o0j7o6J46j81J31j17l1K79j95J55j69j36J62j65J40
$$ -80 -85 -51 74 215 99 -13 108 48 31 -35 111 -70 61 -56 -87 192 -3 152 -17 -153 9 -156 -16
3116a6K04k31Q5j50J20J6n3L1q2N7l6L1J25K4o6kj31k9R1J0k3L3n3J95j54p2j7
$$ -16 188 -43 42 -108 12 28 -25 6 -76 -19 -55 -24 101 125 59 57 -74 -103 -12 -2 -25 8 -45 150 -4 -76 -93
3143i3J27k00J89j4k9O0o4R3K8j02q2J71n8j23J99r5K4J05k38K16o7k5k5J8l5
$$ -93 34 -166 23 9 -20 40 -24 69 97 -5 -87 84 26 -97 102 7 31 136 -102 114 47 22 -3 15 -20
3168b0Q0Q4qk29L12k21J3q8J59j73K6J78Pk21J91o3M3oj4j1J4o2J03q5l2jj5J06
$$ -20 60 144 136 -93 219 -2 11 -77 82 -91 -65 113 120 -101 90 27 70 64 50 39 53 -9 94 9 -23 -24 -39 67
3196F7q8o9J11l1j10R6l6K5n5K30k48K29j1q1j14J39L2q2J27k79J24N3Q7k19J84
$$ 67 -21 -90 21 -10 -120 -24 -60 -35 -90 140 -108 121 110 29 -85 54 86 4 131 -148 -24 29 116 -103 81
3221H1q7J35o5r8j29J88L4p3N3Rj04J34j43KO0l2o2k7M1P7lo7M8j2pJ17j76K52
$$ 81 -6 129 64 -34 -163 25 59 -14 39 48 -56 78 -65 -63 -3 -35 -97 -124 -83 -6 -9 -76 -28 -40 -47 70 -106 146
3249A46j55P0O8J1r7j24P5L4k64J74J6p1J36R5j12N4l3j51N4j03J70k1j1M1l3
$$ 146 -9 61 129 140 43 -81 -6 28 -236 -62 -46 -117 19 114 2 56 23 -128 -74 -177 -7 -28 -39 2 -31
3274c1J32j84J55j65P2o4J63J36l95O1J53M9m47L59M5N6j79m1R5K52j48j59j7
$$ -31 101 -83 72 -93 -21 -85 78 214 -181 -120 33 82 -365 -6 39 95 -84 -125 -30 222 74 -85 -102
3297a02J96j81M3J59k64Q5J44l9O6O9j27r5J07K1n6o6o1K42j39P4k10R8M8p2J04
$$ -102 94 -87 -44 115 -149 -64 80 41 107 176 49 -46 61 82 26 -40 -101 141 2 76 -134 -36 12 -60 44
3322D4r4O0n9k3J05L9l3J1M1k23K15q3K2j27P6KKp2J44l3lrj48J69o3j40K09k33
$$ 44 -50 10 -49 -72 33 72 39 50 91 -132 83 0 22 -105 -29 -27 -25 -97 47 14 11 2 -146 23 -40 -180 29 -204
3350b04K87K3k70M8J59J79j04o5J33p4o2m4K6o9J02j64L7j4J41O4k81M3L01k18
$$ -204 83 106 -164 -116 43 222 118 53 186 112 50 6 32 -37 65 -99 -62 -76 65 129 -152 -109 192 -26
3374b6Q4p4J64k13K5J63l14J41J22K3n1k36J45J75j73k7J72m4J15p2l1l8J19J01
$$ -26 58 -16 148 -65 -40 123 -191 -50 72 95 44 -192 -47 128 -45 -72 100 56 171 99 68 30 149 250
3398B50m48J83O4k20J00o7J13P9p3k9J77k49K68j14l9R4l7k12J25P8l8P3o8M0
$$ 250 -198 -15 49 -171 -71 -138 -25 54 -19 -48 129 -120 148 34 -5 89 52 -160 -35 43 5 78 10 50
3422E0j52L10l26K17mj30RO3J41k37R5k2r0J17kN8j83K30p7j02Q0j07P2q1J20
$$ 50 -102 208 -118 99 95 -35 -26 37 178 -59 36 14 -76 41 39 97 -86 144 67 -35 45 -62 10 -71 49
3447D9mL0j2o5k2p3J67O9k28J76j22O3r7m3M2O2nj22K69o7j13Q6rj65P2O9J9j
$$ 49 45 75 63 -2 -24 -97 70 139 -89 87 -35 28 -69 -112 -70 -8 -13 -135 134 67 -46 40 31 -134 -62 7 26 25
3475B5r0P3L1Kl0p4Pm4L6kK85j86nJ8j56J61L0p4p9J59l14K75j4Q3p1j38j1J43
$$ 25 -65 8 39 41 11 -63 -56 -100 -64 -66 219 33 28 46 -110 51 81 7 -72 87 -227 48 34 117 46 -92 -103 40
3503D0k3l2P6j94Q6J33k43J04O7K7j24J35r4Pn6K3o9LNP8j6P6J13j38j6j01J57
$$ 40 17 -15 61 -133 -47 86 -157 -53 14 41 -83 52 -42 -35 -91 -68 -137 -134 -129 -51 -67 9 122 -16 -32 -133 24
3530B4L5J18j87k9N5R4m0j93J0Q2m3O9l7L0Kn5J4KjJ40p1j4kM5r6J10m6R4Ok1
$$ 24 59 177 -10 -39 16 110 70 -123 -113 -31 -74 -5 -42 -12 -10 -65 -51 -49 -50 90 19 5 3 48 -48 62 16 110 116 95
3560I5rj45K21j75rJ21j49N7M4J15Kk25K8K87k74Q4n5r0J09j00K5J2J69o2pJ1
$$ 95 86 -59 162 -13 -22 99 -50 7 51 166 168 -57 -29 258 -16 68 13 -77 32 -68 -43 -31 138 76 69 80
3586H0j55J36l4r1L4K7n2n1kJ27j8N7jj35M9L5J26j20j7P8p5j54K11j06oJ76k35
$$ 80 -75 61 27 -64 -30 -3 -55 -106 -108 19 1 58 57 -78 -29 6 132 12 -5 73 -2 -156 55 -51 -57 119 -116
3613a16J98j50K3R5j62M0M1M9J3N3q0q5J10k48K92j16J65q0Q6k02P2j0j12J74
$$ -116 82 -68 -45 50 -112 -72 -31 18 31 84 4 -81 29 -219 73 -43 122 42 128 -74 -2 -12 -124 50
3637E0K8n3l00K15J70k8j37j4j0j14M4P0J16P5l34J58J82k81Q4O4o1l2J23k8R1
$$ 50 78 25 -275 -60 110 82 -55 -69 -79 -193 -149 -79 37 112 -222 -64 118 -163 -79 -15 -76 -108 15 -13 78
3662G8m9l4r5K44j70J57k09J03K43l09j1Q6O5L4j49J66r1n5j19K33l27O1J8P1
$$ 78 29 -5 -100 144 -26 131 -78 25 268 -41 -52 34 99 133 -16 150 59 4 -115 118 -209 -148 -130 -59
3686e9L3J1k50J14K24j86K25l1r3j04L4n8Q9J07j39P5J09k44L04q9p1Rl0PK1k3
$$ -59 -26 -15 -265 -151 73 -113 112 81 -12 -116 -82 -140 -51 56 -83 -8 101 -143 161 72 1 10 -20 -13 8 -15
3712a5k4k8R3o5J25J05k50L04k75%Q7k58K12Q6j30K49j41j88N9l0J84j79O8J31
$$ -15 -39 -67 26 -39 86 191 -59 245 -30 -30 57 -201 11 97 -33 216 75 -113 -54 -84 100 -79 -11 120
3736A20M1j99R7j44P7Q1%p2J44l0n9k7R5k80K07lL8l7j19J88m8j87K41j31j8Q4
$$ 120 161 -38 59 -85 -8 73 73 1 145 115 56 29 124 -156 51 48 86 49 -70 118 70 -117 124 -7 -25 59
3762E9j18q7J07O5N3K1l7ojj23J41Kj58Q5n7P8p9nK40j55j02j4Q1j9j21O6J82
$$ 59 -59 -146 -39 26 79 100 63 57 56 -67 74 76 -82 3 -54 24 -55 -60 180 25 -77 -91 -10 -29 -150 -84 98
3789I8j04J04j2J3R0l35j5J35j52P7J03J6J23o5j16N4L3j3J26l16K76r0QN3J3
$$ 98 -6 98 86 99 189 -146 -161 -26 -178 -101 2 18 141 76 -40 14 47 34 160 -156 120 30 38 91 104
3814A04r5Ro9J06j13m3K20j4r7q6N9Rj15L25k07m5K26k22J97m0k33J73p5Pl3L4
$$ 104 9 18 -51 55 -58 -101 119 105 8 -78 -19 -10 -125 200 -7 -52 174 -48 149 109 -124 49 -26 -19 -52 -18
3840a8N2m4r8m6J88m7P6j14j00K37j35nK39k69J41k3r2Nr7J82o5Q3j94J33p4J36
$$ -18 34 -10 -108 -154 34 -13 63 -51 -151 86 -49 -54 185 -84 57 34 -58 -53 -150 32 -33 50 -144 -11 -85 51
3866E1j55rJ92l6r1R7n0n9J19j30M3p8N1k3ll2K5J39j25L9oN4J8J4p8j18P4n4
$$ 51 -104 -113 79 43 -48 49 -1 -60 59 -71 -28 -106 -55 -78 -81 -113 -88 51 -74 -35 -41 13 31 45 -33 -151 -77 -131
3894a31J37R7l52J11K29m1NK2O1j52J20ork4j35J04q9J42r8q9K43j07j54R2J49
$$ -131 6 103 -249 -138 91 50 55 77 138 -14 106 100 91 67 -68 36 -53 89 -9 -98 145 38 -116 -24 125
3919A25k52j5jJ04K3R7k59L31j82j23Q9K5ln7J69j19R0j79K28p7N5o9J38j93J37
$$ 125 -127 -142 -143 -39 -16 81 -178 153 -29 -152 -63 -38 -41 -98 71 -48 42 -137 91 14 69 0 138 -55 82
3944H2j48J42o1j53K00j27O3J23j73L0n8K24o6o9j68J59K5r0J3J11m0Lj26O9L7
$$ 82 -66 76 15 -138 62 -65 -2 121 -52 -22 -80 144 78 9 -159 0 25 -65 -52 59 19 22 -104 -35 2
3969BJ7KNL0j84N1j53K85j58j4J08q6J17J2K6K9l8j4j13J23rl2m7K03j67k19J94
$$ 2 19 21 26 56 -128 -77 -230 55 -103 -117 -9 -95 22 34 60 89 51 37 -76 47 38 6 -41 162 -5 -224 -30
3996c0%Q3Mn4n6M1L1j00K71p7Oj42J17j01N6K18k86J66l6j26r8J40j47J58j11
$$ -30 -30 53 57 3 -53 -12 19 -81 190 113 119 -23 94 -7 49 267 -19 147 111 -15 -113 27 -120 38 -73
4021g3O8m8j12J05J16n3J6oO2j81J2J06Qj2j06J54p2J11j70Mn4J84j19o7K8K47
$$ -73 -5 -53 -165 -60 56 3 19 13 75 -106 -94 12 20 8 -98 56 -16 95 -75 -71 -125 59 -60 -127 -99 148
4047A48m6q2Q4k56J43J1m8J47p2j02K75j42j43J15k4K2n3j17J99p6J14j42j0J79
$$ 148 102 20 104 -152 -9 2 -46 101 29 -73 202 60 -83 32 8 30 -23 -140 59 -17 97 -45 -55 124
4071A24j15ro0K7P8K5j29K57j94J45p7J4p8J14qj18K4j8Q8j29O0L2l5k6nrl6O4
$$ 124 9 0 -60 -33 45 70 -59 198 4 149 72 86 8 122 114 -4 20 2 90 -39 21 53 18 -8 -13 -22 -58 6
4099Fjj5p9J61m9o1J6k4kl2R5N0j28J74j65K17k51PO6l3J15k02J18l7J3J41j74
$$ 6 5 -10 -89 72 23 -38 -22 -46 -48 -80 15 65 -63 111 -54 163 -88 -81 -15 -48 67 -135 -17 -54 -41 100 -74
4126g4N5N9n5q4M5J69r2k34K90m5q6j0Q0OJ42j87J70K3o4j25K4j20j00K69R3j42
$$ -74 -19 40 -15 -99 -54 115 23 -211 79 34 -52 -62 18 24 166 -21 149 172 108 -17 7 -113 -213 56 149 7
4152GK7k24L59M5k93j3O2M0Mo1n9J71j18O0p0rO1n0Q1K5p1Kj31J11j39J51m4K37
$$ 7 34 -190 169 214 -79 -92 -30 10 14 -47 -106 65 -53 7 -63 -72 -11 -61 20 45 -26 -24 -155 -44 -183 -32 -76 161
4180A61j71o1lL3k6r1K73j28o9pK51k49N5q5O5mr6J66Nn6J59j65M4L2k06J74j5
$$ 161 -10 -71 -74 -41 -67 -158 115 -13 -82 -89 162 -87 -32 -117 -52 -56 -152 14 19 -37 122 -43 1 33 -173 1 -14
4207a4L1O6j43K04j66kJ72Jj30j8l2m7n0K32k35R7m0P3nK9L5q5j41J62RJ25n1
$$ -14 17 83 -60 144 -22 -24 148 149 19 1 -31 -78 -128 104 -131 -34 -74 -1 -6 23 58 -27 -168 -6 3 128 77
4234G7p4M1J0K06l48l7J0K2J35j84L08j74L4J42k37N7j11J81j43NL7n2Mj7r9J56
$$ 77 3 44 54 260 -88 -125 -115 -93 42 -142 166 -8 26 168 -69 -12 -123 58 -85 -80 -43 -95 -91 -108 -207 -51
4260e1oo5K33k06Q7m5L6L0j95K21j3J0o4Q0q8j38J82j54R8j67J09M0J42r5r3K54
$$ -51 -57 -122 111 -95 -8 -53 -17 13 -182 39 26 36 -28 52 -36 -174 8 -146 -48 -215 -106 -66 76 -19 -112 142
4286A42Rj80J33k1o0j07j8J17n6p8J49n4m6O2q6J36j95K15n1Q2j52P0p8k1J59
$$ 142 151 -29 104 83 23 -84 -102 15 -41 -119 30 -24 -70 -8 -94 42 -153 62 11 93 -59 11 -67 -88 71
4311G1j82q5J88j4R7r4p1K01k36R2Q1P9k22K4J11m7j51N1K46o8q8R5j21L7J5n8
$$ 71 -111 -196 -8 -22 75 -19 -90 111 -125 -33 48 127 -95 -71 40 -7 -158 -107 139 71 -17 78 -43 -6 9 -49
4337d9Q6q8P3o2J28j24j63K20j00o3J91P3k6Rj00r9J69n1J11k15Q1q5K1Q8k24
$$ -49 37 -51 22 -40 88 -36 -199 21 -79 -142 49 122 96 105 5 -94 75 24 135 -80 1 -84 -63 25 -199
4362a99K1J75LrJ40l75J80K9N2o0j89K90j52L7J15o3o6r3M11k16r8J70L5k06K17
$$ -199 -178 -3 0 -9 131 -244 -64 -35 17 -43 -232 58 -94 -57 58 -5 -71 -164 247 31 -67 103 138 -68 149
4387A49n5j60J24m1%L6j34M9J01j92j2J28pp2L1K26k02J94j64k9L7Q5j57J87k71
$$ 149 94 -66 58 17 17 53 -81 -32 69 -123 -135 -7 -14 -86 -55 171 -31 163 -1 -30 7 92 -65 122 -149
4412a49J89R6j23p7p3M6J33j95J97p8j1O0N9L8j73rm8Q8J68r9P9r8J85l23J31
$$ -149 40 136 13 -64 -137 -91 42 -153 44 -34 -45 15 74 112 -61 -70 -118 -30 138 39 118 20 205 -118 13
4437A3j3pN2k5j04kO7j71K23q9R8p4J76k44o8J24J16j6j92KM6L7O2N4m4l2jK6
$$ 13 0 -7 45 20 -84 -86 -19 -190 33 -56 42 -32 144 -100 -168 -44 72 56 -136 -134 -88 -51 11 65 21 -11 -12 14
4465A4q3j8K37l41J66m9m9J54M6j1j29o8O5P9O3m6r2J6k6R6j11J63q4j72M25k91
$$ 14 -69 -87 150 -191 -25 -74 -123 31 77 66 -63 -131 -66 13 76 30 -62 -46 -72 24 -87 76 -8 -180 245 -46
4491d6r1L02k78J54r0N0P2r1Q7k00n4M20j77k1P7l9P1k18M7p5J60o8k4q4J10k0
$$ -46 -137 165 -113 41 -49 1 73 -18 69 -131 -185 235 58 37 114 75 146 -72 -25 -100 60 -8 -32 -116 -6 -26
4517b6q7P6K08k32N1J50k56N0K07j80Q2R5k10Q9K1q4J33j62NJ01LoMo2NK8l5m3
$$ -26 -113 -37 171 -61 -10 140 -116 -66 141 -39 43 138 -72 17 38 -46 87 -75 -70 31 34 28 32 -30 -25 3 -32 -75
4545g5J46o6J20j13m4K03j51J7o0J41j40j11J21R1j68Q9J14q3n8j03K8M6L3J22
$$ -75 71 5 125 12 -32 171 20 37 -23 118 -22 -133 -12 79 -89 0 114 31 -27 -130 -102 -56 -23 99
4569I9j46Lj63L57j30P0j46J89m0p0j11L21m16K03m6k0J12k00K57J20k84R1m4
$$ 99 -47 -44 -207 150 20 90 -56 133 93 23 -88 233 -183 20 -26 -46 66 -134 123 243 -41 50 6
4592FJ50k70J47j5R1r0k1J0j7N5j11R1R5m8n8O3k21M1J40j07L3Rl6J72j16j04
$$ 6 156 -114 33 18 109 19 -2 8 -9 46 -65 26 121 73 15 78 -143 -102 38 -69 -36 -27 -63 109 -7 -111
4618a11J00J01l7JN5k07P8N3m2J02j56R2K9Q1Pn0j15J00m8J2j4k3q8n2O5J37l2
$$ -111 -11 90 53 54 109 -98 -20 33 -9 93 -63 29 58 139 146 96 -19 81 33 45 31 8 -80 -132 -67 70 38
4645C8o6J56l0k03Q1J17o8P2k83K16j63Q5p8K62j10k01J91n6q3J38l3R5k36J05
$$ 38 -28 128 98 -105 -24 93 25 97 -186 30 -133 -48 -126 136 26 -175 16 -40 -123 15 -18 77 -159 -54
4669e4M6m4J38P5r7Qk84K46l0O3Lk81K74M5p5j3k7J48k61J92K8k80J56MJ44k14
$$ -54 -8 -52 86 161 64 72 -212 34 4 67 70 -211 63 108 33 20 -7 141 -120 72 100 -180 -24 -20 124 -90
4695i0J10j13O5Q3j58K3J25R0j91Q7j78L03j92qP2k00P5J75Lp5N6o0N6r7j41K57
$$ -90 20 -93 -28 55 -103 -80 45 135 -56 31 -147 156 -36 -44 28 -172 -97 78 81 6 62 2 58 -39 -180 77
4721G7k31J3j4Q5Q9p3K52k68J7jj16L18n5j93J3K42p6o0j42j4J08M4J02o8r2M5
$$ 77 -154 -141 -155 -70 19 -54 198 -70 -53 -54 -170 148 93 -100 -87 155 79 19 -123 -137 -29 15 117 49 -43 2
4747Bk8RL5mn8m1J01lm5j55L18k30R2l1m9K02j75N8j35K68j91M1J9J15n6J00j11
$$ 2 -26 -17 18 14 -44 -85 16 13 -32 -187 131 -99 -7 -38 -87 115 -60 -2 -137 131 -60 -19 0 115 59 159 48
4774D8j26N6P4j10Q6l3l5l9O7p3M7O0j63K24j38LJ63m5n5P8p7q7J15N0L8j22n6
$$ 48 -78 -22 52 -58 28 -5 -40 -79 -12 -85 -38 22 -141 83 -55 -52 111 66 11 89 12 -75 40 90 128 6 -50
4801e0N9Ol3P1N2j6o2q5l9Q5L3r8K31k92J02P6l9N7J5j43J67j55p7k5K37o8pq6
$$ -50 9 15 -18 53 105 89 27 -58 -97 -12 21 -77 154 -138 -36 40 1 58 73 -70 97 -58 -135 -160 77 9 2 -84
4829h4pJ80K8J1j7l2k3J52k68J3R5o6J35j70J56p5R4j21j4N4%L4O0n6j45J24j37
$$ -84 -91 89 117 128 111 79 56 208 -60 -47 48 -18 117 -53 103 28 122 1 -13 41 41 75 135 79 -66 58 -79
4856g9o4K90j37j03J39j24K48j47K4N3j09l6R3mj06n1M6l1J61r9M4J35j59qJ74
$$ -79 -143 147 10 -93 46 -78 170 23 47 100 -9 -45 48 44 -62 -113 -67 -98 63 -36 8 143 -16 -24 150
4881A50j74j53k6L1J07O1J34j68K1J15N2j81J3%o9J21J68k07P9r4p4R6j1o2J0
$$ 150 -24 -177 -203 -172 -65 -4 130 -38 -17 98 150 -31 -18 -18 -87 34 202 -5 74 -20 -94 2 -9 -71 -61
4906f1R5j52J02p2J17J15N0k2j63j19J02O0o7J72r4j86K03k13J7J8P7p2K4K09
$$ -61 34 -118 -16 -88 29 144 194 172 9 -110 -8 52 -15 157 63 -123 80 -133 -116 -98 -21 -93 -69 140
4930A40o5J60k09j44K57j61Q5o6K81k46O9J1j1KO8j63J90k58J48j64j03J63O6
$$ 140 75 235 26 -118 139 -22 63 -3 278 32 101 112 101 103 171 8 198 -60 88 -76 -179 -16 50
4953E0o1K19j78j62J90j84J76K23k81L2j27J22%n1rK9j0N1m4Q0j12Q1m3KP3j00
$$ 50 -11 208 30 -132 58 -126 50 273 -8 24 -103 19 19 -32 -41 -12 -22 29 -15 65 -47 34 -9 -7 66 -34
4979c4J13p9J40k34j4R1j6q6J79j59J82p8k34J56j1k0O9J21Oj41J92k25K17j33
$$ -34 79 0 140 -94 -108 -17 -33 -119 60 -99 83 5 -229 -73 -84 -104 -35 86 92 -49 143 -82 135 2
5003Bo6N4P4o3k2M3r4Q3j6O4l3kk1k1l7n1J44o4J36Kj08k14J94J02RJ8p1j10o6
$$ 2 -64 -10 64 1 -21 22 -72 11 -5 59 26 24 3 -18 -55 -106 38 -26 110 112 4 -210 -16 86 95 113 42 -68 -134
5032a34J34J7L4l4j77K29j6Rk6j13P5Ok4J17K5r9q1nJ66o7j87K40j70J2J32k2
$$ -134 0 17 51 17 -160 69 53 62 36 -77 -2 4 -20 97 122 23 -58 -63 103 36 -151 89 -81 -69 63 41
5058D1J12j78J23j95P4j7L7k3P5j07J90r3l1MJ0J03k33J77n9j9J96p6N9j27k01
$$ 41 153 -25 98 -97 -23 -40 -3 -26 49 -58 132 39 8 12 22 125 -108 69 10 -9 187 111 170 43 -158
5083a58J37J23j69Ko9n3K24J1q1l1L4l9Q3P0j79K9N4K19j60r1J78m2m7o2L1J02
$$ -158 -21 102 -67 -65 -134 -187 37 48 -33 -64 -30 -69 14 84 -95 -66 -12 207 47 -44 134 92 45 -17 14 116
5109A16o4j1r6J76o5p5J9l3K6j39P1M6n2M0J68j48R3Q2k25J36M2k09J28L5M9k13
$$ 116 52 41 -55 121 56 -19 0 -33 -7 -146 -75 -29 -81 -41 127 -21 72 154 -71 65 107 -102 26 61 110 -103
5135a03Pp4L27k07p5J94Lj9j14Q4j00q8J45j4J54k43J39j08P5J81j29m8j83K88
$$ -103 -96 -170 157 -50 -125 69 72 53 -61 23 -77 -165 -20 -34 120 -123 16 -92 -17 164 35 -13 -196 92
5159I2lm0n1n7Ll7n7J71Jo7K23j49j36J45m2J74j58j20J31r4j6j9K2J39k62J41
$$ 92 89 49 -2 -59 -56 -93 -150 21 22 -45 178 29 -107 38 -4 170 12 -108 23 -71 -87 -106 -84 55 -207 -66
5185f6M2O3Qj9J31l11R5J11j0K6k00J15L7j09J81k7M9q5P0r7J48j38K8J0r7K7
$$ -66 -24 39 47 28 159 -152 -57 54 44 70 -130 -15 22 -87 94 67 116 31 101 4 152 14 42 52 -45 -18
5211a8rK6p4j3M9k5Q5P5j90J67q0L1K4j81J82O4j16J58j38N6P3j37k7j51K60J8
$$ -18 -27 -1 -75 -88 -39 -64 21 96 -94 73 -7 24 48 -133 49 113 -3 155 17 73 146 9 -18 -169 91 109
5237A09j08J0q5k5J00k4J52k08L9q2J69n6J62k25K3QL5n3O4J10J6j54j02K84k36
$$ 109 1 11 -74 -99 1 -23 129 -79 -40 -122 47 -9 153 -72 -49 -41 -6 -59 5 115 131 -23 -125 159 -77
5262g7kK5l0l0J54j74J79Rj11p4J62p7J68O5k34J09m6j47J24j6P5j02n1K32k36
$$ -77 -79 -54 -84 -114 40 -134 45 54 -57 -131 31 -46 122 187 -47 62 16 -131 -7 -23 52 -50 -101 131 -105
5287a05K16L9j75M8l2j0L8J65k43L9L9m3J5m8R5j26J18j23r3P9J95K9mj34jJ60
$$ -105 111 150 -25 23 -9 -19 19 184 -59 -20 19 -24 -9 -57 38 -88 30 -93 -186 -107 88 117 113 -21 -22 138
5313A38j22m7J08o8l5J53k92J24J29j09n4K11j97J12q7M6j5%n6J52q3r5J38o6
$$ 138 16 -31 77 9 -26 127 -165 -41 88 -21 -75 136 -61 51 -36 10 -5 -5 -61 91 8 -87 51 -15
5337a5J28p7j55J54k7j44N4j6N7Pk6R2j61K91j94M8J75k99J59j54J20rQk2P1j95
$$ -15 113 36 -119 35 8 -136 -82 -98 -41 -34 -60 32 -129 162 -32 16 191 -108 51 -103 17 8 16 -6 65 -130
5363a30K66j3j93J84lk88J95O4k44J15J22k85J95k8L3J62j53J18j56K7Q4n5J65
$$ -130 136 123 -70 114 111 -177 18 82 -162 -47 75 -210 -15 -43 -10 152 -1 117 -39 -12 72 17 182
5386A82n4p6L8j14NJ55j87LJ15j66k2qJ39J5J6K5q7J38j32mnK8j35Q0m6j2Q3j45
$$ 182 128 52 90 -24 -19 136 -51 -48 67 -99 -121 -129 10 25 41 66 -21 117 -15 -19 -24 4 -131 -51 -97 -109 -26 -171
5414a71Q4m6Q0j5M9J61j45l7N4N9m2j40NO6l9R5j7J6O4n3j36M2l7K4n6J05J16
$$ -171 -87 -133 -53 -68 -19 142 -3 -40 14 73 31 -109 -104 -38 -77 18 1 17 81 28 -108 -66 -103 -79 -135 -30 86
5441H6k8j22J07p7K1O8l4P3M0k2r4j02P4l4J16j22J03J13j89J9O2r1M8q8Q7L4
$$ 86 58 -64 43 -34 -13 55 21 94 134 112 18 -84 -10 -44 72 -50 53 166 -23 -4 58 -33 15 -73 14 48
5467D8j02K1j52J52j7J32r2l6O0O5j09kN1q4j50M94l43P5J06j23J21j79r2K89
$$ 48 -54 -33 -185 -33 -50 82 -10 -46 14 79 -30 -32 19 -65 -215 279 -64 11 117 -6 115 -64 -156 133
5491A33j54J7j20J52ll8n2J20j67J47J87l72J93P2r3p2p6J19N6l2J9j27R9J36
$$ 133 -21 -4 -124 28 25 -13 -65 55 -112 35 222 -150 43 115 22 -50 -126 -7 49 17 36 -91 8 144
5515A44j67PK4kl7Oq5J11l7P0J6j24J99j96K04mk12l0J15o9J1P3j55R4RqK0Q6
$$ 144 -23 -16 8 6 -31 -25 -110 1 -36 34 50 -74 125 -71 133 129 -83 -113 2 -67 -56 17 -138 -44 -35 -43 -23 63
5543F3K5k8k80J47nM3J62j20rk05K99p3k7J84k83J20k4J07j08M6K3q0J9%J22k45
$$ 63 88 60 -220 -73 -78 -35 127 7 -2 -207 92 19 -8 176 -107 13 -11 96 -12 34 57 -23 -4 -4 118 -127
5569a27J8L8L6O9q7P5J35j16Mj89K27lk61K34m8lk4m4J78k58R9J46QP9j81M1j65
$$ -127 -109 -71 -35 34 -53 22 157 41 45 -144 83 80 -181 53 5 2 -22 -66 112 -146 -47 99 107 186 5 46 -119
5596a19J43R7k9j06J60j15n8p8J65k78J92L0l9J78j74J40r0l2ON4L2J39j72p5
$$ -119 24 121 92 -14 146 31 -27 -105 60 -218 -26 4 -35 143 -31 109 19 -13 -7 47 79 218 46 -29
5620b9L0O9j82p5K40J3N0j7j38J32r9l3N5L0j31J19M6r8m7J05j69P5J03r3J12
$$ -29 1 70 -112 -187 53 66 116 99 -39 93 -6 -39 16 46 -85 34 80 -18 -65 40 -129 -54 49 -44 68
5645F8j2J43j75j74K33p4j42J19L1J1o2P8n7p2M9R1j22J4J2J19o5P2j98J11M9
$$ 68 56 199 24 -150 83 9 -133 -14 17 28 -34 44 -13 -85 -36 55 -67 -53 -41 78 13 85 -113 -2 47
5670D7Q6o1r3J28J6k2j57J85J0j42N2O6r8j63Q3K54k01o6M3p7K5P9q9J05J8m7
$$ 47 133 72 -21 107 123 101 -56 129 139 -3 49 115 17 -146 -63 191 -10 -76 -33 -110 -85 -6 -95 10 28 -19
5696a9l5M4J22j23L0j94L48j86K28k85P4O2M5k01K31k46J34j0r3Q9o5OM2j7Q4
$$ -19 -54 -10 112 -11 19 -175 173 -13 215 -70 4 66 111 -90 141 -105 29 19 -74 15 -50 -44 -2 -19 65
5721F5N1r0r7K12j35Q9k36J22Q8q6p7J9J62j73O3N1mj07J78j19n7J22m1jn3j4
$$ 65 116 26 -71 141 6 95 -141 -19 69 -17 -94 -75 87 -86 -23 28 24 -83 95 -24 -81 41 0 -1 -54 -68
5747f8p2J01M2j21J58m0m0L9j15J53L6M3L5p0j11pJ84q2Q0r5p5J2k3K8P7q7J54
$$ -68 -140 -39 3 -118 40 0 -40 -1 -116 37 73 116 151 81 -30 -37 147 65 145 50 -25 -13 -36 -8 69 -18 136
5774A36k27Q7L1k36K23J20k7j33O4L3Q3k40K16j03J25k71K94J4l69O8J56q6J53
$$ 136 -91 -4 27 -209 14 134 107 -26 38 71 154 -86 130 27 152 -119 175 189 -180 -112 44 -42 111
5797A11l08K04p4J22q4Nj27K18R8k14J65k19Q8j2m0J39O4j79K5Q4j23L8O9p0J80
$$ 111 -197 7 -67 55 -29 -24 -151 67 165 -49 116 -103 -15 -27 -67 72 136 -43 -18 66 -57 -19 50 -20 160
5822A60k01O1r3rO7J56n8j88Q5K7p5l5J29q4J2J08N2o2k03J08J4j46J63N0Qj17
$$ 160 -41 20 -73 -82 -15 141 83 -105 -20 7 -68 -103 26 -58 -46 62 114 52 -151 -43 -29 -175 -12 38 46 -71
5848g1K3L2J7j57K05M0j30M3j01J03q2J63l5q2M5R4jj0j32J16k1p9Q2q1J08n4
$$ -71 -48 -16 1 -156 49 89 -41 2 -99 4 -78 85 50 -32 13 107 106 96 -36 80 59 -20 62 -19 89 35
5874C5q7P5J29k10n2J37p4J71l1p2J00o6p5j55P2J60r5R7j71K58k40Q3J22k81
$$ 35 -52 23 152 -58 -110 27 -47 124 93 21 121 55 -20 -175 -103 57 -38 59 -112 146 -94 -11 111 -170
5898a70qK62j66k9J62O5o8k18L28k75J50j59K11p1j01J16p8J51r9M6k19n9J67
$$ -170 -178 84 -82 -111 51 116 48 -170 158 -117 33 -126 85 14 -87 29 -49 102 3 49 -170 -229 -62
5921f2o6J94j34P7R4j47K2q0L46M1j62k83R0J57j85K01p9p0k2j9m2K24r0j67L9
$$ -62 -128 66 -68 9 103 -44 -22 -102 244 285 123 -160 -70 87 -98 103 24 -46 -68 -87 -129 95 5 -162 -123
5946a23M6J20l1M6ll7j7J04j26m2J23j80J31L3%qm5o7J1O8j14k9K4K26j94O8J2
$$ -123 -77 43 12 58 55 18 1 105 -21 -63 60 -120 11 44 44 36 -9 -76 -65 3 -111 -140 -116 110 -84 -16 -4
5973dM1J3j29K31n9k3j46M9N4k32K49l3M8r5j68J77K0Lr2K05k20J55m9K60j71
$$ -4 37 50 -79 152 93 70 -76 -27 27 -205 44 11 59 -36 -204 -27 -7 -4 -96 109 -111 44 -5 255 84
5998H4k52Q6L17k00k09K10o9R9j09P7N0k10J78q0OJ08j29r2J91l1L4n1o0J13m6
$$ 84 -168 -82 235 35 -174 36 -33 66 -43 34 84 -126 52 -28 -22 86 -43 -135 56 25 59 8 -52 61 15
6023A5pr6L50k61p2K3l9J76r6j93K21j21P9J63p1j22QJ7q9J01k4J12q2R2N1l4
$$ 15 8 -88 262 1 -71 -48 -87 89 -7 -200 21 -100 -21 142 71 -51 -43 -26 -115 -14 -38 74 -8 84 135 101
6049A01k01J30m0J3j9K1m4p9J99L1j17J45l4q1j29P4J12J0j86K50j90K31k95L2
$$ 101 -100 30 -10 3 -16 5 -39 -118 81 112 -5 140 106 25 -104 -30 82 92 -94 156 -34 197 -98 -66
6073f6R4kK3j07R8p0J71k57p9L51k33R3M4J8r8L8n3J41o8l5M7J16m1j84P4N6j53
$$ -66 28 26 49 -58 40 -30 141 -116 -195 156 -77 16 60 78 -20 18 -35 106 38 3 50 166 125 -59 15 71 -82
6100h2J19p4m2O4l4l5J58Q1k37j6j26K61j2LL2o2LJ9j8o1J38j4M7j63J41n8n9
$$ -82 37 -37 -79 -15 -49 -84 74 155 -82 -98 -224 37 25 28 60 -2 1 20 2 -59 79 65 112 -51 90 32 -27
6127b7Qk4K27k26j3l7L2L3MJ7r5J43R1q9O7o2K0ro8k5m9R9j6o3J41k98J15jJ83
$$ -27 -19 -43 184 -42 -55 -92 -60 -27 -23 -6 -101 42 133 44 111 49 69 60 -8 -33 -82 17 1 -62 79 -219 -104 -105 78
6156G8j14l8J96J1k8j93L19k00P7j7j21q0M7J68k02L4K0j31J78L4K4n3n0r4L6
$$ 78 -36 -74 122 133 105 -88 231 31 108 91 -30 -110 -63 105 -97 -63 -43 -174 4 38 62 9 -41 -135 -99
6181i9K87j21j51J47R1j66k69K26M8J8r8Q4p4n5P1lQ6K2j61J18k01O7J95j97Q6
$$ -99 188 67 -84 63 154 -12 -281 -55 -7 11 -87 -3 -77 -132 -61 -64 22 44 -117 1 -200 -133 62 -135 -49
6206d9Q2l9O9n4J19k08K54j92oJ69q7j2j42L32m2j4j35j41J22R6j92Q0kJ77j03
$$ -49 33 -6 63 9 128 -80 174 -18 -24 145 58 46 -96 236 194 180 45 -96 26 122 -70 10 8 185 82
6231H2j06J14k19K60k82O1K4J93q6j02J38j02J33j95p0ON2J44l6J9J2J26j03J7
$$ 82 -24 90 -129 131 -151 -90 -66 127 41 -61 77 -25 108 -87 -157 -151 -99 45 9 28 40 166 63 80
6255H0J60l14R7J9j93L2K98j34q1R5j83J36m5m3K01j48mK5O3j08O5q8J31j05J42
$$ 80 240 -74 23 42 -151 -119 179 45 -36 59 -124 12 -33 -76 125 -23 -27 -2 61 -47 18 -70 61 -44 98
6280I8j4Q1j81qQ6j64J03p0N8p5P7j65J32pk29K27J23j14o9J62r2J08J6j74J03
$$ 98 84 165 -16 -24 62 -102 1 -69 -11 -86 -9 -174 -42 -49 -278 -51 72 -42 -111 51 -41 67 83 -91 12
6305A2N9j43J07n4Q8N1j19L6k2r0J65m9Q7o8l9J56k71K4J34j33K48j10M7k33L25
$$ 12 71 -72 35 -19 69 120 1 37 15 -75 90 41 128 60 21 177 -94 -70 64 -69 179 69 116 -117 208
6330B08j99Q0j72J69k20K04j2j60K40k61J03nJ23j52J52k57J15n0J98o2m1o1K87
$$ 208 9 89 -83 86 -134 70 58 -102 138 -123 -20 -25 98 -54 98 -159 -44 -94 104 42 1 -60 227
6353B27j63mj18N9n8p1J02J73j52r7o5R5J11j08J7J42k09J22J75j61M7J6m1j69
$$ 227 64 60 -58 1 -57 -128 -26 147 -5 -102 -167 -72 39 -69 -52 90 -119 3 178 17 64 80 39 -130
6377a30J63R9j61mk5q2K36j99O8J5j13K35q2nR7k27oK19o9J1O6k34O7J28j2mn4
$$ -130 33 132 -29 -33 -58 -140 96 -103 -35 -20 -133 102 20 15 112 -115 -121 98 29 40 106 -128 -61 67 55 51 -3
6404cP8p8PN7O8l5j8Ml5R9j35J9L9Kj30J02P8K7j42o1Q3L3j0j38J32p1J41q5J0
$$ -3 75 -3 4 61 129 94 76 80 45 144 9 28 67 69 -61 41 119 146 4 -57 26 59 49 -89 43 -28 113 28 38
6433C8o9n7K44j49j32J32m4kJ5M1J5p5K1MO1k6j01q3J40m0j8J94j32P8J71j26
$$ 38 -31 -88 156 7 -125 7 -37 -39 -24 17 32 -43 -22 -18 43 17 -84 -167 -27 -67 -85 109 -23 55 226 100
6459A00r2jk74K70Q3j74RJ28R5j74J20o3%j60J55L0n5L4q9M5N4j80J60j7j01J97
$$ 100 8 7 -267 3 86 -88 -79 49 144 -30 90 27 27 -133 22 52 -3 31 -58 -13 41 -139 21 4 -97 100
6485A00j77J84k91K30J8O0k02l3KO8M8j85J42L6q4J14O5j11l4j08J56l7K28k08
$$ 100 -77 107 -184 46 64 124 -78 -111 -109 -41 7 -178 -36 0 -84 30 95 -16 -50 -158 -2 -39 189 -19
6509a9K07k42J10k4l3J04Kl8j17J11J6j55j5qL88k24j33L0l7N7K0Qp1l2l7J76
$$ -19 188 -54 56 32 -1 103 105 67 -50 61 77 -78 -93 -101 287 63 -70 -40 -77 -20 0 8 -63 -95 -132 44
6535D4q3N4K43j64j47j38M7K42j4Mn4J24j90j5L5j0n4J3J42o3p0K69j45L7nj81
$$ 44 -39 15 258 94 -53 -191 -144 98 84 88 34 158 -32 -47 -12 -22 -76 -63 79 16 -54 215 70 107 102 -79
6561g9K9ML7qj25J86j03M9J27j42J69j70j2P4n0p2J13j66J85j20J07J64j54j84
$$ -79 -50 -46 -9 -17 -142 44 -59 -10 117 -25 144 -26 -38 36 -14 -86 27 -139 46 -74 33 197 43 -141
6585a41J19M3O0L8J00k41P6o6o8J2J74L4k09n9j1K31j4j61J29j53R0m7J07r5O2
$$ -141 -22 21 81 119 219 -22 54 -12 -80 -68 106 140 -69 -128 -139 92 78 -83 46 -107 -17 -64 43 -52 10
6610A0L7J5k11n0L02n4p8N5q3J36NO7k49J01N6L4j50R0K12j80k60J79j67J14O5
$$ 10 47 62 -149 -199 103 49 -29 26 -57 79 84 151 -98 3 59 93 -57 33 245 65 -195 -16 -183 -69 -4
6635dR2q2r0J3l4O2R7k7j48K50m2p3O9o7j42J63k17K14n8J73j66o1L2L6J1K7M2
$$ -4 88 6 -84 -71 -105 -43 54 27 -121 129 87 14 83 16 -126 37 -180 34 -24 149 -17 -78 -46 -10 1 28 70
6662G0k11K09k1m4j35K07m7L5j41P7KL0j09J09j59N8J23l7k2R9R0j33n3n4l1q6
$$ 70 -141 68 47 3 -132 75 28 63 -78 -1 1 31 -78 31 -128 -70 53 16 -6 93 183 50 -3 -57 -88 -174
$$ [...]
8191I9
##END NTUPLES=NMR FID
##END=
