##TITLE=1H_DE-54_DCM_KTFA
 CDCl3
 8 sc, 
 6.5.2024
##JCAMPDX= 6.0         $$ Bruker NMR JCAMP-DX V2.0
##DATA TYPE= NMR FID
##DATA CLASS= NTUPLES
##ORIGIN= UXNMR, Bruker Analytische Messtechnik GmbH
##OWNER= root
$$ XWIN-NMR		Version 3.5
$$ Mon May  6 15:42:35 2024 Russian Standard Time (UT+4h)  she@DPX200
##.OBSERVE FREQUENCY= 200.1309
##.OBSERVE NUCLEUS= ^1H
##.DELAY= (6, 6)
##.ACQUISITION MODE= SIMULTANEOUS
##.ACQUISITION SCHEME= undefined
##.AVERAGES= 8
##.DIGITISER RES= 18
##SPECTROMETER/DATA SYSTEM= spect
##.PULSE SEQUENCE= zg30
##.SOLVENT NAME= CDCl3
##.SHIFT REFERENCE= (INTERNAL, CDCl3, 0, 15.7039)
##AUDIT TRAIL= $$ (NUMBER, WHEN, WHO, WHERE, WHAT)
$$ ##TITLE= Audit trail, XWIN-NMR		Version 3.5
$$ ##JCAMPDX= 5.01
$$ ##ORIGIN= Bruker BioSpin GmbH
$$ ##OWNER= she
$$ F:/spectra/data/she/nmr/H-F/1/audita.txt
$$ ##AUDIT TRAIL=  $$ (NUMBER, WHEN, WHO, WHERE, WHAT)
(   1,<2024-05-06 15:40:53.43 +0400>,<she>,<DPX200>,
      <created by zg, POWCHK disabled, PULCHK disabled
       configuration hash MD5:
       00 E9 B6 7A A2 85 ED C7 34 08 36 98 17 FE 4E 26
       data hash MD5: 16K
       70 C5 5B 70 60 85 0E 2A 47 CD 5A E4 E4 1E E7 78>)
$$ ##END=
$$ 
$$ hash MD5
$$ 14 A9 CA F8 42 73 DA 83 DE 0E D1 5E 49 9A 19 D7
##$RELAX= 
##$RELAX= 
##$RELAX= 
##$RELAX= 
##$RELAX= 
##$RELAX= 
$$ Bruker specific parameters
$$ --------------------------
##$DU= <F:/spectra>
##$EXPNO= 1
##$NAME= <H-F>
##$PROCNO= 1
##$TYPE= <nmr>
##$USER= <she>
##$AMP= (0..31)
100 100 100 100 100 100 100 100 100 100 100 100 100 100 100 100 100 100 
100 100 100 100 100 100 100 100 100 100 100 100 100 100 
##$AQSEQ= 0
##$AQ_mod= 1
##$AUNM= <au_zg>
##$AUTOPOS= <>
##$BF1= 200.13
##$BF2= 200.13
##$BF3= 200.13
##$BF4= 200.13
##$BF5= 200.13
##$BF6= 200.13
##$BF7= 200.13
##$BF8= 200.13
##$BYTORDA= 1
##$CFDGTYP= 0
##$CFRGTYP= 5
##$CHEMSTR= <none>
##$CNST= (0..31)
1 1 145 1 1 1 1 1 1 1 1 1 1 1 1 1 1 1 1 1 1 1 1 1 1 1 1 1 1 1 1 1 
##$CPDPRG= <>
##$CPDPRG1= <>
##$CPDPRG2= <>
##$CPDPRG3= <>
##$CPDPRG4= <mlev>
##$CPDPRG5= <mlev>
##$CPDPRG6= <mlev>
##$CPDPRG7= <mlev>
##$CPDPRG8= <mlev>
##$CPDPRGB= <>
##$CPDPRGT= <>
##$D= (0..31)
0 1.2 0 0 0 0 0 0 0 0.06 0 0.03 0 0 0 0 0.0002 0 0 0 0 0 0 0 0 0 0 0 0 
0 0 0 
##$DATE= 1714995653
##$DBL= (0..7)
120 120 120 120 120 120 120 120 
##$DBP= (0..7)
150 150 150 150 150 150 150 150 
##$DBP07= 0
##$DBPNAM0= <>
##$DBPNAM1= <>
##$DBPNAM2= <>
##$DBPNAM3= <>
##$DBPNAM4= <>
##$DBPNAM5= <>
##$DBPNAM6= <>
##$DBPNAM7= <>
##$DBPOAL= (0..7)
0.5 0.5 0.5 0.5 0.5 0.5 0.5 0.5 
##$DBPOFFS= (0..7)
0 0 0 0 0 0 0 0 
##$DE= 6
##$DECBNUC= <off>
##$DECIM= 32
##$DECNUC= <off>
##$DECSTAT= 4
##$DIGMOD= 1
##$DIGTYP= 9
##$DL= (0..7)
0 120 120 120 120 120 120 120 
##$DP= (0..7)
150 150 150 150 150 150 150 150 
##$DP07= 0
##$DPNAME0= <>
##$DPNAME1= <>
##$DPNAME2= <>
##$DPNAME3= <>
##$DPNAME4= <>
##$DPNAME5= <>
##$DPNAME6= <>
##$DPNAME7= <>
##$DPOAL= (0..7)
0.5 0.5 0.5 0.5 0.5 0.5 0.5 0.5 
##$DPOFFS= (0..7)
0 0 0 0 0 0 0 0 
##$DQDMODE= 0
##$DR= 18
##$DS= 0
##$DSLIST= <SSSSSSSSSSSSSSS>
$$ [...]
##$SUBNAM2= <"">
##$SUBNAM3= <"">
##$SUBNAM4= <"">
##$SUBNAM5= <"">
##$SUBNAM6= <"">
##$SUBNAM7= <"">
##$SUBNAM8= <"">
##$SUBNAM9= <"">
##$SW= 18.0517689322627
##$SWIBOX= (0..15)
0 0 2 0 0 0 0 0 0 0 0 0 0 0 0 0 
##$SW_h= 3612.71676300578
##$TD= 16384
##$TD0= 1
##$TE= 0
##$TE2= 300
##$TE3= 300
##$TEG= 300
##$TL= (0..7)
0 120 120 120 120 120 120 120 
##$TP= (0..7)
150 150 150 150 150 150 150 150 
##$TP07= 0
##$TPNAME0= <>
##$TPNAME1= <>
##$TPNAME2= <>
##$TPNAME3= <>
##$TPNAME4= <>
##$TPNAME5= <>
##$TPNAME6= <>
##$TPNAME7= <>
##$TPOAL= (0..7)
0.5 0.5 0.5 0.5 0.5 0.5 0.5 0.5 
##$TPOFFS= (0..7)
0 0 0 0 0 0 0 0 
##$TUNHIN= 0
##$TUNHOUT= 0
##$TUNXOUT= 0
##$USERA1= <user>
##$USERA2= <user>
##$USERA3= <user>
##$USERA4= <user>
##$USERA5= <user>
##$V9= 5
##$VALIST= <valist>
##$VCLIST= <CCCCCCCCCCCCCCC>
##$VD= 0
##$VDLIST= <DDDDDDDDDDDDDDD>
##$VPLIST= <PPPPPPPPPPPPPPP>
##$VTLIST= <TTTTTTTTTTTTTTT>
##$WBST= 1024
##$WBSW= 4
##$XGAIN= (0..3)
0 0 0 0 
##$XL= 0
##$YL= 0
##$YMAX_a= 576489
##$YMIN_a= -506225
##$ZGOPTNS= <>
##$ZL1= 120
##$ZL2= 120
##$ZL3= 120
##$ZL4= 120
##$ABSF1= 10
##$ABSF2= 0
##$ABSG= 5
##$ABSL= 3
##$ALPHA= 0
##$AQORDER= 0
##$ASSFAC= 0
##$ASSFACI= 0
##$ASSFACX= 0
##$ASSWID= 0
##$AUNMP= <proc_1d>
##$AZFE= 0.1
##$AZFW= 0.1
##$BCFW= 1
##$BC_mod= 2
##$BYTORDP= 1
##$COROFFS= 0
##$CY= 11.3945322036743
##$DATMOD= 1
##$DC= 2
##$DFILT= <>
##$DTYPP= 0
##$F1P= 15.6554695791079
##$F2P= 12.8336369535428
##$FCOR= 0.5
##$FTSIZE= 0
##$FT_mod= 4
##$GAMMA= 1
##$GB= 0.15
##$INTBC= 1
##$INTSCL= 1
##$ISEN= 128
##$LB= 0.24
##$LEV0= 0
##$LPBIN= 0
##$MAXI= 10000
##$MC2= 0
##$MEAN= 0
##$ME_mod= 0
##$MI= 1.114404
##$NCOEF= 0
##$NC_proc= 0
##$NLEV= 6
##$NOISF1= 3.799351
##$NOISF2= 2.8
##$NSP= 1
##$NTH_PI= 0
##$NZP= 0
##$OFFSET= 15.70392
##$PC= 1
##$PHC0= -25296.89
##$PHC1= 10.18749
##$PH_mod= 1
##$PKNL= yes
##$PPARMOD= 0
##$PSCAL= 0
##$PSIGN= 0
##$REVERSE= no
##$SF= 200.130013532006
##$SI= 16384
##$SIGF1= 3
##$SIGF2= 2
##$SINO= 400
##$SIOLD= 16384
##$SREGLST= <1H.CDCl3>
##$SSB= 0
##$STSI= 0
##$STSR= 0
##$SW_p= 3612.71676300578
##$SYMM= 0
##$S_DEV= 0
##$TDeff= 0
##$TDoff= 0
##$TI= <>
##$TILT= no
##$TM1= 0
##$TM2= 0
##$TOPLEV= 0
##$USERP1= <user>
##$USERP2= <user>
##$USERP3= <user>
##$USERP4= <user>
##$USERP5= <user>
##$WDW= 1
##$XDIM= 8192
##$YMAX_p= 0
##$YMIN_p= 0
$$ End of Bruker specific parameters
$$ ---------------------------------
##NTUPLES= NMR FID
##VAR_NAME=  TIME,          FID/REAL,        FID/IMAG
##SYMBOL=    X,             R,               I
##VAR_TYPE=  INDEPENDENT,   DEPENDENT,       DEPENDENT
##VAR_FORM=  AFFN,          ASDF,            ASDF
##VAR_DIM=   8192,          8192,            8192
##UNITS=     SECONDS,       ARBITRARY UNITS, ARBITRARY UNITS
##FACTOR=    0.0002768,     1,               1
##FIRST=     0,             0,               0
##LAST=      2.2672688,     0,               0
##MIN=       0,             -506225,         0
##MAX=       2.2672688,     576489,          0
$$ Real data points
##PAGE= N=1
##DATA TABLE= (X++(R..R)), XYDATA
$$ [...]
1739d32J7N85M64j085J4N29L24q19k53N03M63l24q46O07R10o83n94N10O99l90
1759A99o79L7R70j29p43J58J76O16q09o39J179K60q70m30P95K99k84r03P56O10
1779E69n96n99O36K60j63m88J21O59J06r00J46M30j2l88n95R24M55r78qL20M47
1800C46k97o71N00O98l65o09N40R3j39l47j83R81l87o48K61N49j89M5o71N53N88
1821F48r28l45O19L85n02k50M21O28m23q39O27K40j89m23j43Q61N2p77K66N01
1841D29j55m83k53M98O64r79k82P30M29m72n12M80M43l35n73K66N00l53k15j11
1861b84O84k75m21K36L22J05m94k28K87Q20r20j86N12P9j44k67K40K83j04n63
1881c18J95N61k86k18n1M42j9m47l40P34L3n05r5O09K18n29l37N08O3J1m35J85
$$ y = [-432, -415, 170, 634, -451, -437, 92, 416, -403, -656, -153, 310, -14, -860, -253, 657, -26, -620, -110, 589, 199, -480, -443, 527, 398, -345, -187, -11, 605, -204, -843, 336, 596, -274, -704, 91, 390, 106, -797, -41, 569, -27, -626, 10, 270, 107, -381, -260, 399, 505, -395, -249, 181, 169, -219, -814, 110, 565, -413, -421, -101, 346, 49, -622, -122, 576, 211, -398, 142, 235, 96, -251, -434, 547, 160, -488, -227, 322, 133, 178, -493, 60, 648, -280, -625, -6, 379, -123, -373, 48, 676, 253, -586, 41, 281, 92, -331, -474, 387, 439, -338, -72, 429, 274, -209, -462, 36, 700, -279, -561, 169, 598, 126, -386, 94, 537, 202, -371, -105, 395, 42, -173, -284, 400, 125, -296, -60, 262, 367, -127, -355, -68, 752, -168, -354, 158, 237, 93, -174, 66, 349, 245, -318, -123, 438, 152, -66, -117, 325, 306, -141, -481, 253, 286, -219, -314, 295, 513, -16, -353, 155, 218, 229, -206, -21]
1903b1L52J3o50N15J22K3n43q1L56Qj42j09N42l4k96l39L91J54o25j26N07L32
1925C49l06n82Q63J61l11m73J55M17j32l28J35N0J71m12Q9N51l11j5l61K03K36
1946A49k42k31L85M88o53k46J78L34jp15M70K38l1l41K3L48j06m81J07N72j9n62
1968c36J25L19l3rl10J69L00m35o1O5K70N5m50K95M83l04n15K58J44J74n24J46
1990a74M31l12k04O5M2J46l15k16L23O11m51l33L13M11k91n35M31M59l67m22M70
2011H2Q8K08q79L25L39J16l66k67O09l8n56J99J85L83j75m88K97k12R2n46N55
2032d9J46k39p2R3M24k29k33r5K23J45o38M52M5J15k25l0J81K44l49n04M20J81
2054FQ7n03N07K77m84J2j11M51j34j76j23J91J76m59jN21n0j31n3r5L69m48K7
$$ y = [-21, 331, 344, -306, 209, 331, 354, -189, -270, 86, 94, -48, -157, 385, 351, 55, -284, 107, 261, -364, -490, 17, 349, 43, -539, 324, 485, 174, -299, -144, 273, 141, -187, -52, -2, 169, -243, -154, 397, 86, 71, -290, -87, 149, -93, -324, 61, 549, -104, -350, -172, 162, 161, -554, -84, 154, 123, -218, -195, 153, 47, -434, -327, 245, 226, -336, -211, 108, 75, 66, -244, -75, 225, -210, -271, -206, 64, 119, -331, -36, 447, 143, -372, -114, 30, 204, -320, -174, 257, -55, -259, -194, -152, -6, -321, -537, -214, 397, -54, -387, -74, 337, 46, -489, -58, 401, 34, -388, 82, 170, 378, -501, -176, 163, 279, -87, -354, 255, 217, -339, -140, 45, 428, 253, -235, 62, -150, -58, -604, -49, 97, -142, -214, -121, 303, 74, -159, -254, -31, 114, -524, -72, -27, 88, -137, -167, 14, 258, -91, -595, -175, 6, 93, -410, 97, 374, -110, -98, -209, 242, 108, -68, -191, 0, 176, -283, -284, 237, 187, 56, 3, -92, 277, -171, -144]
2077a44J20J30j83k53J59K68j56o5L0M71m04q3j01K98P1k18L0J05J48j41p4J34
2099A42k8m61J19L17J23k7k90J14L0P6j20m03N37O5k1l57M70r1l94L0M58k21j47
2122g9K15j26J19k50QJ43J89ok57O4O0K49l63k25M11N6k95K03J62q4j85j57J29
2145a9j11J80j85K21M62q44K68L54j56k38q0qM02j61j87J03K01n1r4j19o6K96
2167A68k61j3K75j70M6j71pRJ41q5K62K53m56l2K19Q3k53n3j46J93j75N21l56
2190hL3J29k45J18J85o7k33J99N5K77l35o5K41J90m50q0K20j54J66l90O8J37J20
2213A11k68R6O2K56l21q4L15k23J08J56j54L40n9m64K27K1J62j79n8j08O4J8k6
2236hP3K42l80j16K18K33n15l43O89L54n62J88p8L01k60j70L8L53k9m05j12M89
$$ y = [-144, -24, 106, -77, -330, -171, 97, -59, -124, -94, 377, -27, -110, -211, 87, 158, -60, -30, 75, 223, 82, 8, 142, 114, -347, -228, 89, 212, 185, -105, 9, 39, 115, -5, -408, 129, 194, 173, -184, 286, 195, -199, -169, 289, 68, -79, 136, 10, 129, -121, -113, 30, 219, 213, -44, 20, 80, 329, -34, -259, 152, 208, -87, 116, 278, 194, 9, -148, -19, -130, 50, -135, 86, 548, -296, -28, 326, 170, -68, -148, -156, 246, 85, -102, 1, 202, 151, 57, -62, -128, 168, -93, -106, 169, -1, 45, -126, -133, -124, 17, -68, 194, 447, -9, -41, 178, 261, 8, -45, -191, 2, -173, 348, -8, 25, 154, -91, 27, 212, 145, -88, 111, 166, 443, 108, 43, 284, 474, 24, -56, 164, 10, 176, -214, -146, -9, 111, -157, -61, 1, 257, -64, -148, 167, -56, 52, 208, 54, 394, 335, -129, 98, 119, 281, 102, 44, -64, 0, 18, -8, 65, 307, -73, -189, 29, 262, -253, -596, 93, 447, -115, 73, -5, 296, 36, -134, -96, 257, 228, -177, -289, 200]
2258B00l3k42J40m7J19j57m3K1L03l61K9M0L19k97n6J54K2l87K84J2j9j5K78l28
2282f4l8J79l79J77J66m6K4k70N78q5l01P9m8O4P3M4j37J95j95k85N27l23j39
2305b04K61p6k10M45m33K50K04n96J34K17J51j43j10M9J44j68j38J50J16n0M9
2326D2j58L54k39J9q3n4L31j26m11R5L46J01l27l5L4J26j55N9L05o9k7l43K18
2349CL19l92o6J14R3k46JL23k02k54J81J73j04j70K41R9r7Q7j24m6K71k65O2k2
2373b1J56jo4mk28L20l24J49J47K48m01k95M3L96k76p1K41n9K86k85O8M8j97J91
2397F7j40K65Q2j19j28O8J17k15j70J34l74L86j56J40Pp8or5L52k32M9l7m0J42
2421A9k5j33L03j57%j96K09q6JJ35N3l62K39j06J17R3k0j73L66k69P2k09j38M69
$$ y = [200, 167, -75, 65, 18, 137, -20, -63, -42, 261, -100, -71, -31, 288, -9, -65, 89, 111, -276, 8, 20, 1, -14, 264, -64, -102, 77, -302, -125, 41, -5, 19, -251, 327, 242, -59, 20, -28, 36, 109, 153, 16, 211, 16, -269, 258, -65, -204, 57, -19, -229, 216, -217, 33, 237, -359, -225, -8, 143, 0, -110, -61, 83, -85, -223, -73, 43, -7, 42, -116, 238, -1, 18, -65, -119, 212, 86, -325, -230, 116, 217, -110, -145, -111, 15, -140, -81, 224, 155, 128, -215, 3, 322, -70, -136, -22, 71, -175, -174, 149, -53, -307, -126, 47, -57, -227, 14, 113, 16, 103, -21, -67, 204, -61, 1, -21, 135, 134, 70, 66, -162, 158, -166, -17, 130, 378, -23, -318, -275, 121, -155, -226, 15, -44, 242, -43, 25, 73, -124, 67, -73, 192, 274, 155, 27, 95, 212, -3, -173, -39, -413, -27, -183, -43, -36, -114, -120, -215, 137, -95, -46, -83, -123, 19, -6, -139, 164, 7, 7, -189, 20, -66, -65, 70, 123, -239, 0, -106, 11, 104, 84, -89, 277, 8, 80, -129, -267, 202]
2445B02k42r7J21r0j14Kp6K25M37j88l12K26j12j7J95j79o9R3K7l5L16j62k53
2468a02K39J5j93n2p7M39k03P6k48K26r8J20l08R3J16o4k13J6M15j20k00J04J04
2491H5R3j65j36K85n9j28P1K91k63j62P9L1j34q4K40k8l7K38k17J94O7l37l1j41
2515b48L67l39j26J86J13K83n05K72L07l17J46l38J49J48K83k16k90K27J66l68
2535a00L29j65J01l41N28m68J79m9Ro1m2J04k07K95N2j52K56j70n4j72K02m7l2
2558eM32o16q1M06J96m37L23o3m08K56N14p13L15%p9K41k64P6q5J64j70j54J86
2581C4%J40r7j40L03l20r0K25P2l9%r6j38K87j94n9J44l72N55j23k42K03p6j11
2605a34q1K11m1J78j57J6N6K0j26p1K78j16j19J1K01j10nl0J57q9k75L15n9j9
$$ y = [202, -40, -137, -16, -106, -220, -218, -294, -69, 368, 180, -132, 94, -18, -35, 160, -19, -88, 5, 32, -3, 313, 151, -102, 137, 152, -41, -93, -170, 269, 66, 142, -106, 120, 22, 142, -166, -73, 43, -21, -234, -218, 197, 77, -123, -19, 85, 178, 13, -123, 162, 103, -25, 46, 337, 74, -88, -9, 22, -112, -196, 44, 16, -21, 217, 0, 194, 261, -76, -107, -248, 119, -220, -346, -160, -47, 236, -269, 3, 310, -7, 139, -199, -50, 98, 381, 165, -125, 102, 268, -100, 229, 64, 165, -176, 352, -116, 63, 14, 23, -38, -80, 24, -183, 112, 164, 12, 268, 98, 44, -128, 74, 27, -5, 427, -189, -270, 136, 332, -105, 218, 155, -253, 3, 517, -196, 119, 119, 40, 281, 17, 93, 8, 172, 2, -152, 34, 34, 174, 77, -63, 240, -80, -170, 55, 127, 88, 88, -8, -146, 141, -53, -112, 32, -340, 215, 92, -150, 53, -23, -134, -215, -4, -45, 133, -24, -8, 48, 68, -58, -129, 149, 33, -86, -75, 126, 16, 11, -19, 138, 49, -226, 89, 30, 11]
2629A1J08j01j67K55j26m4J08K06k86o2L02j38r2J01N1j43O4l22M66j54k0j93
2651a76j20O3M58m77L69o5k65K29K9j01P7N7pO5l16K14j37j89M54j27o8J38J3
2674A18o0j54L3K06k06p6K58m23L82J08m28rM22p6q6j23M69m11j52J01J47j8j29
2697a07k00L06K42k23j83J96J04J78k24l12L39q6j77r9L83m44pJ76J71l4J0P7
2719H6k51j1J24l6k17L97K10k6k60j19O8L6J58R7k88j44L26kj25j83K43K0o7L
2743C9k7L2J13J6K9l94P9P7K85l24QJ41k79K17k12K24l03M93k99L2l01K72J75
2766I3l39K22j18M71l10j52j16j2N32m16J07K02k35r7Q8J83l2n3m8j61J34K18
2788A61k26K21J72l53m6K18L3n0k43K61k50K16K05l96nk1O5RJ09m3m0j42K91k50
$$ y = [11, 119, 18, -149, 106, -20, -64, 44, 250, -36, -98, 204, 66, -26, 75, 126, -17, 47, -275, 191, 37, 17, -176, -296, -233, 225, -252, 117, 52, -213, 16, 45, -56, 21, 78, 71, 136, -180, 34, -103, -292, 162, 35, -33, 105, 118, 58, -96, -63, 143, -63, -139, 119, -304, 78, 186, -242, -251, 171, 95, 9, -114, 355, -56, -208, -107, 40, 22, -107, -307, -1, 241, 18, -165, 31, 135, 313, 89, -223, 116, 30, -147, -246, 137, -307, -314, -138, 33, -1, 9, 86, -165, -176, -52, -88, -305, 92, 302, 276, 16, -103, -35, 1, 159, 256, -32, -176, 150, 148, 23, -160, 83, 103, 36, 39, 12, 44, 157, 173, 202, -192, -113, -36, 249, -75, -67, 74, -205, 12, -200, 24, -279, 214, -85, -53, -354, -82, 93, -246, -24, -142, 329, 19, -133, -249, -261, 271, -145, -38, 164, -71, -168, -80, 103, 71, 18, -30, -191, -57, 161, -65, 156, 328, -25, -71, 147, 180, 130, -113, 148, -102, 114, 319, -77, -82, -103, -38, -29, 80, 37, -3, -145, 146, -104]
2812a04K17k21L8M46l15k15K16j8J1j2j7O8j8K9p2o1j9J14J86p8j59r4K2M6j6
2837b6j07Q4k19L71Pj59q7k16L35J28o9j95l0J12J41K66k32k54J13j93J58Q2j48
2860a38L06j18j56o6M78l36K25l02J96j55K09j25r8J79K9l14J02K2O9k05K4K7
2882a47L20j7j68J18j73q8J29m8j17K13k12K48M9o5l31L92j03O9J35p4Oj53j04
2905a21R8k15J55J77l4j38j85L52q5n7J73k26J70k50K46J21l27N25l94k56M93
2926B22l85J34K0P7k0J53k12j74K96kk9n0j55K80r4k39M37k73j14K78k73K5L2
2949f6j9K7N4l22M77k91K28j99K8J8M4j8k64K88q1k97M70j21K08m12q9J13L27
2972A03j98J94q3j45L7K8J01k59J14OL1K18%K02j37k79L6p6J0J13M9n3r9O4K7
$$ y = [-104, 113, -108, -70, 376, 61, -154, 62, 44, 55, 43, 26, 94, 76, 105, 33, -28, -47, 67, 253, 175, 16, -78, -56, -10, -26, -133, -49, -268, 103, 110, -49, -136, -352, -17, 111, 42, -153, -183, -71, 70, 336, 104, -150, -37, -230, -72, 10, -138, 168, 50, -106, -172, 306, -30, 195, -107, 89, -66, 143, 18, -80, 99, 128, -186, -84, -62, 7, -198, -174, -147, 173, 156, -12, 106, -67, -155, -26, -74, -191, 22, -190, 58, 107, 42, -289, 103, 0, 69, 204, 130, 136, -17, -121, -23, -238, -83, 94, 60, -78, -263, 89, 4, -53, 120, -106, 64, -186, 60, 181, -146, 379, -15, -271, 222, -163, -29, -9, 68, 48, 201, -11, -185, 111, 109, 80, 30, -125, 155, 61, -178, 259, -14, -128, 150, -123, -98, -66, -85, -58, -4, -326, 151, -140, 88, -111, -83, -65, -21, -39, -303, -15, -96, -393, 77, -44, 164, -248, -337, -224, 103, -95, 99, 16, -129, -92, -64, 37, -222, -108, -102, -71, 147, 147, 349, 212, -67, -31, -107, -97, 16, 65, 12, -87, -23, 4]
2997DO6n1n8K89n76L42l3j06O3K23r9J12r3k91O2K01l64N94l91J54j39RJ02k00
3021a80K16j02j51N09j62O1j09j8k90J35N7j71M92k73J11j68n1o8M38m62K22O
3043D2j57p4K49j95M07r0l5O1k36k2jJ16k66J88Q8M6k53J38J18j06N0nj62J20
3067B1j77K60K3k34j88K77m1J92k26N9r6j09K56k11L19l6J5q4j47j35L02j95J15
3090d0K20j66P2l32K38P4K8J29l36O2q2J53L60l59j96L11k84J17l3r9L62m5O7
3113B21l44K05o0R5R4j72K09k61O1K7J27n04K67o3K23k0QK0L2l38K02K59k61Q4
3137A11k8r3M0j10k6j8K94j11l01J92o3O6o3J18J43j25L1N9Q9l60M10j38Nk33
3161a11K45J3l02L04l31Q5L05m01J91J6O6M0j78O1J78k39K01K61n10j19N42m28
$$ y = [4, 70, 19, -39, 250, -326, 16, -17, -123, -60, 163, 64, 176, 83, -208, -146, 55, -309, 285, -106, 48, -91, -82, 20, -180, 36, -66, -217, 292, 130, 191, 82, 64, -226, -91, -34, -205, 287, 14, 125, -43, -94, -162, 276, -186, 36, 42, -115, -189, 60, -135, 272, 182, 147, 208, -28, -50, -51, 65, -201, -13, 75, 121, -132, 6, 124, 18, 68, 63, -99, 21, -156, 104, 127, -107, -295, -18, -59, 133, -93, -34, -130, -239, 17, -194, 125, 89, 104, 20, -127, -262, 40, -155, -40, 180, 14, 86, -246, -8, 66, 94, 223, -113, -51, -133, 20, 380, 21, -175, 136, -148, -31, -64, -163, 199, 154, 221, -123, 82, 22, 117, 211, 39, 248, -13, 48, 75, 202, -302, -35, -98, 125, 105, 113, 133, 165, -173, 29, 288, 27, 111, 83, -10, 30, -80, -106, -124, 170, 59, -242, -50, -113, -47, -110, 8, 151, 26, 57, 116, 205, -155, 255, 117, 122, -111, 134, 147, -155, 149, -182, -97, 208, -193, -2, 14, 80, 120, -58, 3, 181, -58, 143, 404, -106, -225, 317, -111]
3183a11j4M35m48K35q0Rm9j73K24NK68k34K4j42K69j37N7j72j50P4k5L86j79n1
3207B1j53J07R2k31J96j95L9K90j71L30k94J05k82L31l57M48l21J0j42L13j44
3228hJ65N4l04P1L7m2R1p9J38J4l03J90K23k70M9J78q4J59l31N6N3Q9k40k5L54
3253B35j83o3r4q9M55jj4k42J36j56j20L66k38r0M6J24j44j08K98k1k64J65j98
3276b00J36k36M77k89J01J45p0J3j0J54j77Nj23j0K21j69j06L15l9j68p6J7MN0
3300c5J9J6j12K85k34J65J08j37r4m5l0O4L2P4j15j3J50j25O6R0J45j47n6k6J07
3325A52k28K71j56L6j05L6l9jJ2lj59l2J38J00Lj36L34l36K78k05l1N3q6J38q
3350B6j93M2P6J1J86q6j57j2J24J3J1n5J25l36j32L33J11J39m14K78k16n6m9O9
$$ y = [-111, -125, 310, -138, 97, 17, 26, -23, -196, 28, 33, 301, 67, 91, -51, 218, 81, 138, -34, -184, -110, -135, 251, 72, 21, -132, -25, 67, -164, 32, -163, -124, 166, -5, 325, 31, 136, -146, 185, -172, 276, -45, -35, -177, 136, -8, 157, 211, -93, -22, 15, -27, 64, -15, 123, 137, -166, 24, 247, -23, 26, 204, 120, 279, -52, 4, 57, 146, -94, -119, 235, 52, -11, -105, -194, 261, 260, 246, 4, 140, -16, -136, 230, -8, -98, -52, 72, -72, -180, 118, 97, -167, -2, -200, -64, -300, 177, -112, -11, 134, 64, 77, 67, 221, 44, 49, -74, -84, 137, -32, -138, 177, 138, -30, -106, -89, -85, -35, -16, 0, -112, 173, -61, 104, 212, 75, -19, -64, -94, -30, 2, 76, -39, -52, 98, -27, 39, 129, 274, 127, 71, 45, 152, -76, 195, 39, 75, -30, 6, -33, -34, -22, -25, -184, -216, -78, 22, 25, -111, 223, -113, 165, -40, -71, -18, -104, 34, 26, -167, -125, -49, -38, 148, 62, -95, -107, 17, 30, 41, -14, 111, -225, -357, -24, 87, 226, -188, 90, -126, -182, -231, -162]
3374a62L57j43j96K89j52j29q6L19r0j4j96J51j90K36M5p7P3J10J8L4q1k08K92
3397B00n68L45j05j38J74J58k30J10J87j9k7j1k9K7N3j56j92J44K51j21J5o3J20
3420A25j92J37j80L5Q2k15M4K46j04j49L31j52k02K27J4J55rJ93n05o6N3K89j64
3443gr1J53J8q9k3K97j41L0k01J89l81K84K95m44L31k21j42K29l37J48o8J47J22
3466I8j07O7l0P5l57K20L2J08n9j74J35j99K9L04k43K25j80r3J19M3J25j85P8
3489C1k30J4L79k26o8K19q2J49K8j30k05K21j05l6J38K06k62j9j7N8j14J26p6
3512aJ04j24N8k6l74L66O3Q9o9pN7p5q6p1L69k12J18l12L79j16j38O1k27O3l7
3537a48K60l22K30rP5k14L06J35l21p8K24Rl62J11L08l44N3M3j97L95Q4n1o7k89
$$ y = [-162, 195, 52, -144, 145, -7, -136, -222, 97, 7, -7, -203, -52, -242, -6, 39, -38, 35, 145, 163, 197, 116, -92, 200, -368, -23, -128, -266, -92, 66, -164, -54, 133, 114, 87, 76, 47, 74, 127, -29, -221, -77, 174, 53, 68, 5, 125, -67, 70, -110, -75, 7, -208, -164, 82, -22, -171, 160, 8, -194, 33, 47, 202, 193, 386, -119, -185, -132, 157, -7, -98, 55, 73, -16, -39, 258, 117, 147, -54, 135, -246, 38, 333, -111, 220, -1, -143, 86, -251, -103, -171, -24, 98, -9, 58, 28, 103, -254, -34, -2, 106, 47, -127, 8, -191, -162, 142, -101, 124, -56, -149, -30, 13, 138, -47, 31, -199, -185, 194, -32, -100, 119, 37, 186, 214, 84, -121, 100, -5, -41, 97, 303, 41, 22, 5, 63, -51, 75, -1, 103, -21, 37, 11, -363, 3, 66, 155, 86, 79, 136, 61, -25, -96, 273, 61, 179, -133, 246, 130, -8, 53, -174, -111, -148, 112, -210, 20, 11, 86, -128, 178, 313, -8, -86, 138, 147, -215, -104, 204, -140, -87, -44, -241, 154, 238, 187, 120, -169]
3561a69J23o8K06k11K23J61l25P9NN0j75j50M23j54J81l34J17k78L58k07K17Q0
3583A52j16J01o7o6K0Lm24L84j1L6J10k16j43L18j07n5J08J14l39Q4J71j40J4
3606f9L20l74J41k15K42l35J98LK39Rj22j52L37o6M8m46L63j66P9K25k01L3M1
3629A32j71J24Q9l89M50P5k81p2J21k73L15j19l7oL65p7k04j59J52n1n8J53k33
3652a54K53n6j98j0K44l15Q9J52jJ54k98kN1O6J04k84L01l87N79l37M9j2l5j42
3676a89K12K0l3r1J11j33MK2P5q7j2P9J45j10p1K42k41K03j59j1J36k7j65K5j50
3701b05K99j51K82l30J58J12K1l25j08L6K07o7j46m8K72K52k92j17j70L35O2k21
3723a44L04k08p1N7k3L9j0M7k93K79M9j70K01j65j98L35k96M23Qj69n8J1k23M40
$$ y = [-169, -46, -114, 92, -119, 104, 265, -60, 19, 24, 74, -101, -251, 172, 18, 199, -135, -18, -296, 62, -145, 72, 152, 36, 137, 70, 4, 24, 27, -397, -13, -24, 12, 122, -94, -237, 81, -26, -81, 27, 141, -198, -114, 57, -83, -69, 251, -123, 18, -197, 45, -290, -92, -89, 150, 159, 37, -115, 222, 156, 204, -242, 121, -45, 34, 259, 58, 91, 132, -39, 85, 174, -215, 235, 310, 29, -43, 78, -195, 120, 1, -36, -42, 323, 246, 42, -117, 35, -16, -74, 79, -154, 99, 43, -155, -165, 79, -236, -147, 5, 4, 158, -140, -142, -91, -25, 79, -205, 96, -291, 288, -49, 0, -12, -47, -189, 23, 43, 10, -81, 30, -103, -99, -77, -2, -89, -101, -22, 123, 13, -58, 184, -57, 146, -13, -24, 112, 85, -80, -55, -205, 94, -57, 225, -105, 53, 165, 186, -139, -247, -211, -4, -71, -217, -265, 7, 259, -33, -150, -320, 15, 77, -144, 160, -48, -119, -62, -85, -46, -56, -9, -302, -23, 26, -144, 57, -108, -306, 29, -267, 156, 164, -5, -63, -52, -275, 165]
3747A65j60RJ9k76J26L02j62O8P4m49K65J53l09n7L39r4p1J45k25m9J78qM3m8
3771b2Q9k32J82p7p4N6J51R6j37k4N1n0J17MK6k31J63J4o6Oj40N0K01N2k64q9
3797a48J40J96l48L31m61M13j86M41l42l5J38j65J95j7o0M4j86j52J92R8Q5j71
3819Bo4Po0J62J59l42K72L2j12l8m1J86j43j17J51j17o1L07j86j07m6m0K83L23
3843D10m35J06N1j41J65j59O7l0j3j36J94r4Q0j53K36k12K31j61l8J11j37m4O1
3866d1k14J47j06L41k11j44K72J88l80L12j59K3J03m22J32K31j34j0J22l4k46
3887b30r8N69k29jj34L8J86l8k41J06J31n5l12M76j68j30j56K33J25j82m5J73
3909A8j22n7M84k56J88l08P5R3j17J02j39K80j88J13p6k16on1M05n45J77m1J43
$$ y = [165, 5, 14, 33, -243, -117, 185, 23, 91, 165, -284, -19, 134, -175, -232, 107, 13, -58, 87, -138, -187, -9, -17, 26, -22, 67, -165, 17, -60, -134, -78, 73, 169, 32, 8, 59, 9, 126, 130, 156, -75, 88, 102, 36, 42, -98, -48, 153, 205, -59, -148, -8, 188, -160, 171, -290, 123, -63, 378, 36, 1, 139, -26, 169, 152, 92, 136, -50, -202, -10, 88, 173, 2, -62, -55, -115, 47, 206, -136, 136, 168, 56, 18, -23, 163, 20, -97, 54, -63, -124, 183, -3, -110, -156, -196, 87, 410, -25, 81, 132, -9, 156, -3, 64, 34, 21, -115, 79, -15, 65, -88, 148, -64, 167, 6, -32, 79, -58, -102, -41, -255, -108, -214, 127, -84, -228, 44, 232, -148, 164, 5, 28, 131, -291, -159, 72, -62, -72, 50, 16, -230, -328, 241, 12, 11, -123, -85, 101, 63, -178, -72, 59, 4, -308, 168, 0, -130, -286, -53, 72, -110, -155, 18, -104, -161, 323, 67, 255, -53, 22, 115, -2, 100, -39, 241, 53, 166, 90, -126, -132, -183, 222, -323, -146, -187, -44]
3932d4J27J5k79N5L30l12o3K02m04N47j48k24K13j47K18k00m4K69r8M8j10J8K20
3955A89j08j38KOm9N18m09K41m57l9J73J20J4o7P1m6k45J76j60M15k74J18L3q6
3979bll0R4J5k97L64n0k32J06J82p5j35Q3k48K57l1n3o7P6Q1k02J31l0r9J80j9
4005dj00n3K05j22j65J51J13n05M27K8k1o2J01P2n5j75R3K01L0L5k51J49j33r6
4029a37pM05k26m8j10L44l70J61K44l65O0K01K56m20K7j9j86L25N3j73j93J42
4051c6L5q4L4J15j54K59j09J99k03N8l71K81J8N1m34M33L9p2J64k97J16K65l64
4074e7j54J12P7K5J5k1L4l0j32j0o6K75l92L45J60l39J30Q5m9J18l17K07L8oj68
4099a20N4L4J5J89K5k06l1K5P7Q1L2K0l33L33k2J77m91L78l44Q7K71k67N5Q7j46
$$ y = [-44, 83, 98, -181, -126, 204, -108, -171, 31, -373, 174, 26, -198, 15, -132, 86, -114, -158, 111, 13, 61, -49, -31, 189, 81, -57, -55, -49, -98, 420, 11, 252, -205, -244, -71, 49, 63, -4, 67, 21, -224, -48, -208, 207, -67, 51, 84, -2, -5, -35, 59, 74, -223, 141, 91, -141, -35, 147, 72, -63, 20, -228, 29, -2, -55, -122, -46, 35, -167, -36, -66, -165, 15, -4, -104, -157, 48, -74, -239, -88, 25, -480, -53, -25, -46, -108, -7, 65, 10, -165, -72, 129, 159, 194, -57, 92, -41, -137, -144, 261, 35, -13, -123, 221, -149, 12, 256, -109, -49, 152, 408, -12, 15, -4, -190, 135, 188, 15, -178, -36, -1, -85, -51, 64, -90, 169, 60, 259, 56, 114, -257, 24, 42, 93, -341, 92, 131, 59, 223, -74, 42, 307, -57, -211, -99, -22, 3, 18, -3, 31, 1, -131, -141, -207, 68, -324, 21, 181, -158, -28, 57, 8, 126, -191, 16, 54, 48, -120, -66, -32, -17, 172, 197, -9, -40, -15, 62, 143, 175, 195, -138, 195, 173, 350, -141, 237, -107, -20, 251, -16, 39, 126, -20]
4124b0J75j17KJ30k09J16Q2L4k65K20j43j78J43J13r9J53k51j9J33N9K25m02K02
4147H4k40rK09J48k00l6Q7P4o6l13J86k09L32r2r2K71J6j35k52L38l10J57K7Q
4171a7K60l27R9k05L9J48J48j79L1N5k45L47k27N9J18K39n14L97l13j29L38l35
4193b13R1L5j66L62o5O1n6K01P9m71M8L10j51p8L55l36p1m8K50m2j9k4j3r8R0
4218C1J79L7k90K15k32K18m7k55o0J62O6J05j8J12k08k1o2J71l4j98P9R8L3k3
4242E8J1k1j67k8K29k70K07q0n6J4j72M97J0l00Q3J00q7j14n2J13J19k7K01l08
4266d0mO4KM8l85J14N1K23k61l1p6K68p0J47j53J21J80j34l4Q4l2j1J52j87j85
4291a49J31K97l03n8L77k57k2L4lk28L0J83J38q1K9O2k0j72J14k77L01j22q3J69
$$ y = [-20, 155, 38, 40, 170, -39, 77, 159, 193, -72, 148, 5, -173, -30, 83, -16, 137, -114, -133, 0, 59, 284, -118, 84, -156, -165, 44, 192, -8, -44, 43, 117, 51, -262, -76, -285, 47, -45, -137, 134, 150, 15, -237, 101, -209, -52, -25, -17, 243, -84, 15, -190, -151, -3, 145, -34, -3, 52, -193, 154, -73, -14, 104, 343, -171, 226, -87, -216, 122, -213, -122, -87, -253, 109, 44, 105, 49, 250, 329, -142, -94, 216, 65, -13, 342, 6, -65, -113, 137, 95, 76, 52, 39, -59, 31, 210, 247, -43, 172, -60, 158, 111, -144, -204, -42, 24, 129, 111, 223, 15, -6, -68, 103, 69, -129, -50, 48, 81, 58, 69, 48, -119, -147, 82, -188, 19, -61, -117, -103, -275, 222, 232, -68, 15, 115, 28, -86, -138, -25, 94, 67, 268, -40, -44, 20, 22, 70, -315, -201, -150, 73, -188, -219, -295, -27, -97, 50, -103, 18, 198, 64, 30, 114, 82, 71, 223, 36, -149, -18, 279, -24, -82, 295, 38, 16, 50, 47, -181, -151, 32, 170, 89, 118, 180, 160, -12, 102, -175, 126, 4, -79, 90]
4315I0k85L49j61k1K9q7K33j16qo7r6J49J54mn7l16J38R2J29Q7l38p9L43k7Kj39
4341fp0J90j33J09j23J4J21j96j19L53k17Q4k84L01J15m7O0l15J65j93K42p9J48
4364A20j06K1n0k3Qk22M06k27R2l3j42L26j93K61k11O5L1k74K14k12L5L87k39
4387C4qJ06k51J76Jn5K35n46L12n8J88j39NjK70n15K92p2l5K9j15J29K96m4j97
4412C7j47K26J22j82j32j39K7M0J07N9k0j96K90q3R6j48J62L6l20J36K46j70N4
4435A01j70J13K7k00M24l32J44N6l56L97l09QQ3J6k52M32k94K20k27j57L86k14
4457a04J69J51k41qR8K14r0l22R7L37n89M09J08j82O1j0K08j75k48J53Q6k40M30
4480C12k87M2m3k94L57j89J58j48j77M62k30M2l3J06k15K15J22k46o5JM76m17
$$ y = [90, -195, 154, -7, -28, 1, -86, 147, 31, 23, -44, -140, 9, 163, 159, 102, -214, -76, 16, 145, 232, -106, -185, 158, 131, 133, -6, -76, 114, -19, 90, -33, -19, 102, -94, -213, 140, -77, 7, -277, 24, 139, 92, 152, -163, 2, -191, 51, -28, 120, 14, 35, -15, -38, -30, -252, 154, -73, 19, -14, -156, 170, -23, 238, 27, 92, 123, -151, 63, -149, -114, 273, 34, 26, 132, -119, 57, 58, 3, 238, -308, 4, -54, 134, -5, 0, -1, 269, -246, 46, -26, -61, -32, -147, -18, 278, 234, 37, -110, 116, 238, 56, -76, -215, -188, -148, -41, 18, -2, -198, 92, 9, 105, -43, 119, 155, -165, -29, 217, 47, 101, -69, 44, 71, -129, 295, -37, 107, 163, -193, 204, -105, -97, -14, 2, -250, 182, -112, 108, -119, -276, 110, -104, 65, 216, -25, -33, 65, 279, 189, -133, -36, 301, -288, 121, 229, 47, 108, 98, 306, 131, -117, 36, 122, -118, 312, 25, 67, 24, -270, 87, -102, 56, -92, -269, 193, -37, 5, -28, 78, -137, 78, 200, -46, -111, -110, 366, -51]
4502e1j44K30j1p4n7M04k80j22K35j33Nj38J22J4M5k94J58o4J04m4J59j60r7j14
4526c07N21j62o1K13j22j49N3K1Q2o9j43J95n1L94m12q7K1K5J26J70o7o7j37J38
4550A25k30N9R0j49k1J01J88p7j67L74l35N6J3L6j57L2J39j81k63M68j48O2r5
4573h0j41M42l3l37K01j30L64l20j11J45J1lk13L27Ok9j95J05Q2j88K02Lq4Lk74
4598b47K24L7J66k61K31K32l03l03N02j65N8j72K4N3q5r6J9L81k80J2j12Q4P5
4621G4n1k77L55J93k54k72M56k85j76L86k11J8L6q9J78p1%j67L06j36Q8k72K8
4644a43P9J01J17k70L30k27j02j22J94m9J05j62J52J28m14j1J53R7k37K01K08
4665A28L2r7l5k36J81J69J17k37mj08P4K05l74j4K05j32O9j30K53k61M10j92N9
$$ y = [-51, -195, 35, 24, -50, -107, 297, 17, -105, 130, -3, 2, -136, -14, 0, 45, -249, -91, -155, -51, -95, 64, -96, -193, -307, 214, 52, -9, 204, 82, -67, -14, 7, 89, 20, -123, 72, 21, 415, 3, -84, -63, -38, 88, 258, 191, 124, -13, 125, -105, -46, 44, -105, -126, -25, 163, 86, -81, 293, -42, 14, 27, 63, -94, -62, 77, -104, -367, 101, -47, 15, -80, -221, 221, 188, -149, 52, -78, 286, -34, -145, 0, 11, 8, -205, 122, 128, 99, -96, 9, 91, -97, 105, 108, 24, 27, -247, -23, 14, 180, -81, 150, 382, 79, -224, 278, 113, 171, -1, 23, 76, -9, -105, -86, 295, 15, 27, -85, -1, 74, 23, -254, 101, 294, 40, -232, 224, -61, -237, 149, -62, -44, -8, -97, 81, 10, 10, -157, 149, 13, 101, -171, -143, -64, 37, 154, -116, 214, -13, -115, -237, -43, -92, 13, -149, 3, 131, -283, -294, -141, -44, -281, -80, 128, 160, 63, 28, -208, -27, 142, 259, 22, 18, -90, -16, 189, -185, -199, 6, -126, -57, -187, 66, -195, 215, 23, 82]
4688H2JJ6k89K11j33J69j12J39n9R5j09R4j97J90J14j96k7N4l22J98j09K79o6
4711B3J65j82JK08j74k3j70L98l56m5J70j53j00J03L74O4j29m34J66J74k61K07
4733B6m0Q0L6q5k18J22J92K6j26j29J08o0P7Pl79N29p6l74N08k39QK6J10k95J04
4758f2m6L44k71L8J3l9j01J98j58K43j63n4J15j04N6j57j8O1J47J09j91q7J87
4781F0m7k35L17j7o6QJ63l69L23j7j60k06J05K23N2k21K59o3l4j10p9O9jJ88j19
4806B3N2k73J12Q3J50k08J43r9R7k29j04J50K79j30j89L2m9K76k08kQ2q6j15J41
4830g2K97l74K07J70k98j35K63J15j61j23P0O4q8M1n4R2j66J16J17R7k48K73j23
4853H0Pk50K19J2l63R9Q2p6J9R1j00L9K66j53j53J28OJ84k97L85k67lL1R2j52
$$ y = [82, 83, 99, -190, 21, -112, 57, -55, 84, 25, 120, 11, 105, -92, 98, 212, 16, -11, 43, -279, -81, -190, 89, 23, 188, 6, 7, 215, 41, 18, -152, 246, -110, -155, 15, -138, -238, -135, 239, 303, 174, -260, -94, 80, -181, 26, -14, 66, 102, 17, -201, -79, 113, 139, 13, -116, -8, -68, 9, 16, -363, 166, 90, -284, 224, -15, -7, 19, 129, -166, -62, -108, 236, -35, 3, 16, -23, -124, 74, -84, 159, -4, -58, 57, -47, 9, -148, -166, -105, 42, 151, -40, -127, 60, 13, -222, 95, 78, 12, 20, 183, -186, 137, 120, -40, -246, -141, 82, 134, -87, 172, 109, 75, -35, -114, -45, -46, 142, 23, 75, -198, -86, -3, 147, -61, 82, -17, 80, -149, -253, -103, 176, 46, -143, -111, -160, 116, -92, -94, -12, -98, -213, -72, 225, -149, 58, 228, -70, -205, 58, 173, 12, -111, -41, 23, -65, -24, -78, 14, -152, -36, 81, 178, -70, 203, 80, 87, -163, 56, 68, -295, -196, -114, -190, -171, -80, -180, -141, 125, -28, -181, -53, -47, 137, -160, 225, -42, -45, -14, 78, -74]
4878g4N6R4j94K53j55j51K27k5J82k89Pl12L30M4j00O5J31L00l59J11j33K0j97
4901a69J76Q4J11l54J2K41o3k38L39k13Q6q6Nk51M01k21J46J28l60J71OL71k64
4924E8k05pO9q7K12K15j90m1l9J67j89m7R0p1j61L46j07j51K20k51K01l8j95L53
4948A52l70J84Jp5j24K79m1K47k00m7J33k63K30J05l48j7J12J23j61R1J49j94
4970c4P1j91K5L05k86K55J44n57L57P1l29J1J23L25l03j42qL76l84Q1K1j98K65
4993bj52L56k5m12L26k5J37p9j65J80k81K22j33J77j18K27r5l27L26j59n9M6n4
5016h9r9J33j0K0K04J0r4kj23j86j12N50k96O4j11M7J64M2j70ML04m08q3J93p4
5041a22K64k39j2K25k00R7k27P8q6r0K69J45J7r2j89K07n7R3k31K07M3k61M5k3
$$ y = [-74, -18, 76, -118, 135, -20, -171, 56, 31, 213, -76, -69, -381, -51, -7, -107, -42, 89, 389, 30, 141, 8, 28, -169, 7, 91, 202, -152, -140, 101, 38, -200, 139, -74, 12, -74, -69, -320, 81, -140, 6, 134, -226, -55, -49, 322, 58, -147, -154, -85, -172, 40, 255, 65, 24, -15, 152, -37, -84, 6, -65, -226, 120, 13, -138, 82, -169, 32, -6, -201, 152, -218, -34, -33, -108, -232, 47, 6, 253, 53, 6, 139, -124, 106, 211, -137, -154, -42, 81, -80, 11, 160, -34, 37, -154, -129, 176, -110, 145, 289, -268, 89, 160, -169, -158, -35, 290, -13, -155, -163, 213, -171, -90, -69, -267, -2, -154, 202, 177, -235, 91, 66, 203, 124, -41, 139, -142, 80, -53, 124, 6, 233, 138, -189, 137, -22, -81, -35, -89, -188, -55, -65, -45, 159, 169, 75, 73, -50, -236, -348, 202, -94, -30, -141, -94, 70, 112, -58, -54, 250, -158, -241, -48, -122, 142, -97, -109, 116, -84, 13, -214, -136, -222, -312, -43, 102, 119, 27, -162, 45, -12, 81, -150, 57, 100, -161, -116, -139]
5065a39O0N7k20J88R7j13L9J65r1k25J41j51M36m15J80n6J98M6j66j33N8q9J80
5088D7j03J93j2j74K95k36K19j58N9j43k51K26J40k11K23j56k39K34J65k87j7
5109a86L70m31Q4Q7J18j99K12L2l02K36j51J51m7J48j91j96K58M4q0J93k22L18
5131B46n02K18j04j02oL56j55Q6J05M2j74ok56M5K14K29k04p0M2K82k75O0qJ1
5155G4J8l87M23k2J00k91J98q0l5q1J65J7l27r4J34N49m42K88j62j89%J32J05
5178I3j35J18k9J60l12O9K33k61J62k02K20M2k66J31j42j10Q8J20o1R7L2K02l78
5201a29qL8r6K18J20m7p7M6J0p4j65M63j98k18q9K18k09L71j73q1K00r9p5o8J41
5226A9L6j40jJ5j20M23l26L48K1k15k84M31M9m63K35n8k78K53p6K11J58k79J37
$$ y = [-139, -79, -22, -242, -54, 43, -70, -31, 134, 43, -182, -41, -192, 244, -171, 9, -47, 151, 197, 31, -102, -44, -133, 47, -56, 137, 125, -49, 246, 10, 229, 71, 130, -13, -264, -38, 102, -109, 114, -42, -281, -47, 118, -169, -186, 184, -247, -163, -76, 42, -157, 55, 87, -215, 21, -130, 21, -26, 122, -69, -265, -7, 37, -43, 150, -72, 246, -256, -38, -142, -244, -250, 106, -49, 37, 142, 184, 10, 4, -252, -207, 7, 236, 32, -38, 4, 286, 11, 71, 63, 74, 92, -295, 128, 106, 206, -85, 113, 33, -2, -83, 82, 99, -228, -322, -188, 361, -81, 207, 45, -144, -144, -12, 93, -42, 76, 47, 207, -105, -36, 197, -64, 98, -104, 116, 158, -108, 23, -119, -229, -141, -21, -82, 15, 47, 249, -129, -137, -99, -195, 23, 143, 96, 19, 65, 75, 1, -164, 299, 101, -117, -206, 12, -197, 174, 1, -80, 120, 21, -54, -122, 19, 55, -85, -86, -71, -191, 232, -94, 254, 275, 60, -224, 207, 256, -207, 28, -30, -308, -55, -131, 80, 238, -41, 96]
5249I6o0nJ96l57j7K71l07QK25J2Q9r9o5M4j04n9J88k07J21J16J0j72O7M9p9N2
5275A3ko1Nrl2o5o9L02p8q7M2mq8J91M6j94J93J04j41r9m6J20k24J20Q6k18K49
5302E4j45P3J51m9l72M96j58M4k70K7l1L42j53Q1k9N3p0j82L7K10k19q5Q9L06
5326B00j75L5L0k4J25k97J20j11J45j24q0k4K80k7j18n4J6L1j37KL53m75Q8J92
5350b9Oj92N42l07r1Rmj8J96r9k50L23N9n1M2l44L03q7k1m4q8J20J47N9l34K59
5376A06r5j70L25p1K8m8n9j67L44k75J19N2o6QJ6J21l75L36j52K1j4QOJ71k79
5401a10J86Lj47J89j36m0O9L0k30R2j00N3N8QN1L00k61J66o8j24O0j97J77J32
5425A61K5l36O8K61jj31k41J40J17R0l79J49J80j06J06k19j43J17Q8J54j67P6
$$ y = [96, 36, 31, 227, -130, -147, 124, -183, -175, 50, 62, 151, 52, -13, 31, -73, -132, 56, -151, -30, 86, 96, -76, -9, 40, -39, 13, 11, -50, -45, -54, -86, -151, -220, 82, 4, -83, -41, -45, -133, 58, 104, -90, 103, 207, 66, -33, -79, 41, -183, -63, 23, -195, 54, -91, -18, 133, 84, -288, 208, 50, 94, -176, -149, -180, 162, 9, 90, 61, 114, 44, -138, -101, 109, -110, -195, -106, 200, 25, 60, 90, 66, 191, -106, 14, -97, 48, -76, -156, -180, 100, 73, -45, -99, -83, -52, -189, -187, 166, -309, -221, -29, -23, -215, 327, 20, -71, -62, -66, -84, 112, 13, -237, 86, 145, 94, 136, -208, 95, 8, -13, -57, -145, -25, 122, 181, -153, 106, 11, -159, 166, 95, 123, 75, 16, -151, 193, -82, 37, 89, 23, 31, 47, 168, -207, 129, -23, -2, -16, -8, -2, 169, -110, 76, 79, -68, 121, -15, -55, 14, 44, -186, -94, -194, -141, -83, -75, -24, 276, 15, 181, 113, -11, 49, -148, 29, 161, 186, -150, -82, 179, 178, 47, -194, -54, 63, 153, -226, -77, 103, -3, 103, -116, -259, -142, -54, 100, -67, 9]
5447Ij05Q3R0l03m8K37Q7J74j82r1J1K15k67K48k70L17l20L7J33k81J57L06k30
5470GK51j24R5k03m5o6P2L4k03N33k47K36m57R7j77L48p7k03k30K39L28l84p5
5493b51K19r8l02M13o1J50k25K39o2o7O4m18M58j94J32Q7j12J22n4k03J41j93
5515b15M7L45Ll36K94J85l27j27n7K19j3j35J1L42j4k70K08q7o2N7j52j40k5L14
5539F5J80k80k61K41N7L23l64J13J25k52k3L2K23j85j02l35L57J7K29j10J33l10
5561a27k0K24k55m3R0K08j59J15k2j49K59n9K79k27ok7l7J19k43o4L40j77J09
5584A28k47j20l6L26N7n8j15l5o3M9O7L67k59j92J21l80N63k45MJ40j23K54k95
5607i2j79J17L01J52m45Kk9J53P3J24o7j17r1P3K3QJ67k38J18k28K69k08J74m7
$$ y = [9, -96, -13, 77, -226, -274, -37, 50, 224, 42, -49, -38, 177, -90, 158, -112, 205, -115, -78, 55, -226, -69, 237, 7, 258, 134, 229, 26, -19, -85, -13, 21, -182, 351, 104, 340, -117, -20, -197, 151, 74, -129, -359, -120, 208, -176, -251, -32, -130, -432, -19, -80, 70, -155, 84, 22, -45, 19, -399, 59, -135, -3, 84, -28, 94, 40, -163, -22, -215, -168, 177, 180, -156, 138, 323, -4, -131, -188, 31, 18, -117, -106, 236, 222, -48, 160, 73, 11, 68, -84, -224, -249, 65, 245, -35, -296, -55, 2, 325, -39, 74, 199, -53, -76, -44, 179, -6, -108, -443, -86, -69, 160, 50, 183, -127, -147, 77, -178, -221, -131, 77, -82, 33, 11, -138, 121, 62, 341, 114, 108, 81, 44, 163, -80, -144, 196, 19, 128, -119, -239, -275, 51, 108, 50, -65, -100, -163, -114, -47, 320, 61, -131, -10, -390, 173, -72, -68, 72, -51, 203, -92, -271, -154, 147, 299, -146, -144, -173, -20, 53, 177, 110, -7, -98, -25, -2, 6, 173, -65, 53, -175, 94, -114, 60, 13]
5631A3j64r1N75l40j31j2K75j11j21J34JJ56l52K30J83l04R9J05k25j5K30k83
5653a48K79l95J44j2J25N9j90O7k02J22J16J45j33k29K50P3K2j9j20J07o9L4r9
5676g3P0k5N3J7O8j17K17j69j09K66m35K30J74l40P9l7O2J2m7K15j47o4rJ38J26
5701A55k96m0N0J26J68j01K9j76m5Q6J6J40p1j06J53L7p0P8o0o2J7j14R9k28M74
5726B59k94J36m4j45Q2k22M91j79J10j92J75l8k70j57J38O2OK1K7pJ47k38J12
5749b0l4n4K55l28M16r5k47k15M23n82O24m34K08P6n4j84K78N2k41K51K2j14L8
5772D1L9q0k01L67l06J99J42M2k22J3%O2k71oK39j22J31K39k89l1K4qp1N6J07
5797I4P3q6j54L96j52q9j09K23j79R8M2j75j43L23j48m5P3k11L51m11K35P1j3
$$ y = [13, -151, -242, 333, -7, -138, -150, 125, 14, -107, 27, 28, 184, -168, 62, 245, -59, 40, 145, -80, -95, 135, -148, 131, -264, -120, -132, -7, 52, -138, -71, -273, -151, -35, 110, -23, -252, -2, 71, 93, 74, -46, 61, -8, 26, -73, -3, -28, 25, 42, 110, -7, 210, 41, -68, 198, -237, -7, 167, -173, -94, -131, -69, -57, -104, 111, -36, -100, -109, 29, 155, -141, -181, -131, -5, 163, 62, 91, -85, -130, -44, -28, 112, 41, -65, 88, 125, 55, 133, 73, 11, 28, -86, 13, -215, 259, -35, 101, 57, -88, -6, -228, 263, 84, 194, 2, 177, 139, -131, -288, -150, -88, -82, -61, -34, -41, 106, -132, -20, -54, -108, 147, -181, 235, 140, -107, -322, 101, -481, 143, -291, -83, -7, -61, -245, 33, 85, -156, 95, 117, 3, 41, 80, 0, -201, 166, -140, 59, 201, 243, 21, 34, 34, 96, -175, -181, 58, -64, 67, 306, 17, -14, 10, 2, -69, -13, 94, 167, 81, -73, 323, 171, 82, -27, 196, 17, 115, 157, -18, -161, 162, 14, -31, 42, -169, 182, -229, 6, 77, 64]
5820F4%n9n1K36M0n19J55j11M15n1m12L73j59J2k02L8L36k03K0J99k88L3j4J51
5844Cj1l38K72K4Q2j13J25m6m7J79j41J15K0k49J15J21j18R0l95L16L0q5j60K28
5868A7L0O2j49J59kr3j10J94J47k6k60M3k66K34J23J31l02j2P3j07L6R7j6q0K21
5893A44r8o5r0R5K3q8M7j27J10n1J55j25Q0JK63P0l75Q9k9p1J49j07p8K02k33
5918a09J15K71o1l44j43M21k8N0k40J7L9L4K56l56L42l8J00j26l84J15J77J12
5940B20j34n7kp8J12rj11L27m5p1k05J1J04m4P6L8p7k13K92j38n8R6Pj72M6J32
5966D7j26J95J28k60j10J86O4l5P2J45l85K4J54N1j14Pp2L1j83K22L8j20O6k06
5990a81O0J77l16N46m31J64P6j28K48n69O02k42k5K10l3k35L7K08l23K02J5q0
$$ y = [64, 64, 5, -46, 190, 230, -289, -134, -245, 170, 119, -293, 80, -79, -67, -269, -231, 105, -98, -78, 121, -167, -134, -148, 3, -8, -346, -74, -50, 32, -81, 44, -2, -49, 130, -11, 104, 124, -125, -10, 111, -7, 83, -312, 4, 34, -51, -211, 17, 47, 109, -40, 119, 117, 24, -86, 108, 255, 229, -31, 12, -254, -20, 103, 234, -68, -80, -7, -114, -78, 19, 3, -77, 144, 46, -19, -109, -14, 9, -79, -32, -159, -49, -100, 55, -70, 10, 11, 274, 344, -31, 58, 29, -42, 107, 0, -78, 124, -109, 6, 277, 216, -128, -271, 150, 122, 172, -68, -51, -12, 22, 278, -78, 264, 226, 326, 200, -184, -69, 108, 220, 86, 29, 27, -51, 61, 52, -59, 268, 223, 152, -53, -42, 62, 18, 94, 132, 55, -158, 134, -4, -62, 34, 41, -131, -85, 47, -79, 116, 244, -16, -126, 60, 124, 89, 161, 306, -79, -55, 99, 150, 36, 43, -29, 2, -181, 41, 79, -41, 25, -181, -121, 56, -260, 286, -145, 19, 95, -33, 215, -354, 248, 6, -19, 191, 158, -77, -40, 168, -155, 47, 62, -18]
6012a8J50k49O5O8r5K83k73k7k9JJ48l30L5L93Nk0Lq2m2K8K4o0m4M1p5K06jk29
6040a24j25M78n21J49J60Q1Rk13P9o0K5J76k68j30R0L28l50K47Q9q8k5N7O7l55
6064b24K04k9M2J41k23K34J30l34J44n3k0q4J81J07j56k80L10k15Q9K06k05P3
6086C8J06j74l1R9R4j07K0J41k33J23k7m3L3N0j55J31M5j57N4nL21l81k4p4O2
6111i4l5K98j44k05J02R9l66K50j5J4L6J96L0Q0k45r6K31k79L22l05L95k68j63
6134a62K47k29R7J68j63K48m32J38L13l28j42j03M45j74K59j64j15k9j7j66K43
6155f6K26mj38k92J97M7k6R8k3J28k54M27k27n2J56l52K79M6p8k75K35j30M1P1
6179C4p2N4J26l6L0j86K14k52J31r1r9K96j83j96K18j61K75q2k5lj37J47o8J28
$$ y = [-18, 132, -117, -52, 16, -79, 204, -69, -96, -125, -124, 24, -306, -271, 122, 127, 107, 110, 28, -14, 14, 38, -22, -66, -25, -100, 106, 105, -124, -249, 229, -292, -143, 17, 98, 107, -106, -27, -87, -62, 114, -154, -284, -194, 134, -216, 31, 120, 32, 7, 64, 131, -224, -20, -49, -7, 134, -89, 145, 275, -59, 85, 32, 12, -72, 109, 216, 60, -220, 90, -125, -36, 170, -35, 38, 144, -30, -61, 38, 132, 25, 45, 186, -47, 76, 49, 6, 39, 89, -66, 65, 110, -47, 7, 2, 323, -58, -82, -156, -94, -129, 169, 25, -180, -78, 21, -345, -95, -110, -96, -60, 136, 166, 246, 1, -95, 136, -143, 179, -126, 269, 1, -162, 85, -144, -47, 121, -42, 206, -226, -88, 225, -103, -245, -348, 97, -77, 182, 18, -97, -126, -143, -309, -66, 160, 156, 18, -274, -77, -30, -56, 42, 19, 147, -107, 320, 93, 41, 197, -155, 124, 170, 92, -183, 52, -78, -37, 34, -38, 16, 142, 106, 136, -50, 164, -88, 43, -48, -147, 149, -34, -230, -12, -173, 102, 20, -5, -8, -145, 2, -66, 62]
6203F2j71J38o7k24K39%KP0k08K15j81nJ20k27p8J57mj1J38N4r6o3J70j01j01
6228a72M13k74J36j28M3o9m0J85j85J4Pj12J15K62k10k68J86J45J12o7n2j25J0
6251g4P3m9M64o09M5nJ92J98O2k97K4K7p0p3K39k03m8J24j79K69j11p6K60j31
6275E2Pp1O1R9l8j41k0J46N6r6J29k22L13j22j69J51j24k10J8q5M66j00k66K24
6299E8j80r1L28n0j33P7j31R1L24l12q5Jn9L84j61q6Q1k8k72K67j05K52j46j28
6323a04j2N0J59p6k12K3L31n33K93j12J53M0K4l31L10k54K33r7O7k07L87m6k26
6346a40J01K1K87l31J71l37J91R4j69L8L04m08J59k71K26K26k01K41n7j51J88
6367A82j57%m0o0j58J71k4J27Q5k17K64k49J85j60J48K31l40k1o4J0O8J1k9N2
$$ y = [62, -109, 29, -38, -262, -23, -23, -21, 49, -159, 56, -125, -130, -10, -237, -315, -158, -162, -173, -35, 19, -77, -140, 30, -71, -172, 241, -33, 103, -25, 18, -51, -91, 94, -91, -77, -70, -182, -67, 195, -15, -283, -97, 48, 160, 93, 41, -84, -74, -1, -50, 414, -195, -150, -155, 37, 235, 297, 0, 24, 51, -19, -92, 147, -56, -104, 20, -159, 110, -1, -77, 183, 52, 59, -12, 49, 148, 110, -31, -51, 95, 151, 55, 184, -38, 275, 153, -16, 135, 11, -199, -181, -266, 200, 100, -166, 58, -122, -213, 115, 65, -68, 9, -122, -31, 293, -19, -104, -103, -162, 222, 61, -25, 56, 28, -244, 23, -82, 170, 24, -104, -116, -66, 93, 17, -195, -172, 159, -374, -81, -193, -40, 0, 24, -307, 3, -251, -18, -115, -48, -255, 132, 86, -140, -39, -18, 269, -62, 109, -228, -37, 57, -112, -74, 230, -178, -19, -290, -64, 162, -39, 202, 145, -6, 182, 25, 25, -15, -75, -233, -62, -86, 41, 126, -91, 173, -76, 109, -51, 97, 328, -12, -33, -97, -87, -19, -8, -37, 15]
6391A5M0K04m68K54J28J2l10K14K07l16lO2o4n4l1N0j7J19p6O4j21p6J01l8J35
6416C1j11R1n0j65J91p3P2K39l89L48k82J31r7J47j39kK03j13L5o5O1j45K74j84
6440Hj18L12k04N7LJ27k42Q8No0J03k49L35q8o9J32k29N2j50J18J0J29k21K97
6464A46k38O6R2n2j9O4j10o2J51j54Q5k15O3K08k27j3M91r7o0p6J47l08N9N1j4
6489b2J50j85J85k56M0n1k22M65j28J15Qk89n8J17m8K55k51M11k03o8P8o2N0J33
6513A64o3j55L31j41k78k06M18L0j7j15j5J4k7J15j22K32P4l08K61j12k74K95
6535A01j07Q6k18J55oj82K80m4j66J03R2j98PK37j3J01k27j08J12O6o1mJ70m42
6559b66K50n9M12l49J28n04L03p6K5K80L3k88j04N62l18j53l9k2M4oK17J14j51
$$ y = [15, 55, 259, -209, 45, 173, 185, -125, 89, 296, -20, -23, 39, -25, -79, -110, -60, -77, 42, -34, 30, -91, -167, -66, -104, 31, -80, 11, -39, -204, -13, -86, -14, 225, -164, 184, -98, 33, -64, 83, -56, -58, 145, 32, 67, 2, 63, -82, 192, 8, -110, 202, -2, 55, 58, 185, -57, 31, 36, -24, 79, -170, 165, 77, 8, 140, -89, -37, -187, -69, -59, 70, -151, 146, -92, -26, 66, 14, -5, 59, -51, -113, 38, -116, -31, -246, -183, 25, -202, -215, 276, 179, 119, 43, 190, -118, -59, -8, -22, 128, -57, 128, -128, -88, -139, -361, 104, -24, 91, 99, -190, -248, -131, -179, 76, -175, 236, 33, -35, 43, -19, 31, 164, 101, -54, 277, 136, -142, -348, 70, 100, 83, -32, -47, -33, -60, 55, -67, 165, 239, -69, 192, 80, -194, 101, -6, 80, -138, 17, 11, -171, 109, 65, -101, 2, 94, -104, -97, 140, 127, 228, 1, -107, 5, 71, 10, 6, 176, -266, -16, -75, 337, -12, 116, -388, -85, -161, -136, 144, 177, -111, -215, 347, 29, -124, -163, -185, -141, -147, 70, 184, 33]
6582C3J67k14o2n5J15L64k39j31p0J54n02L56J85k66L49m1k9l2k57K18q3R2o3
6605a1J54j7k1k08N4n3K37Q1q4l1K8R7k82K5j8N0L9j26J86J46l95K44M0k14Q3
6630DJ86l28j16J10K49K6m24J26K09k39K27O0n3j47j07K96k80J60O0k34K86l35
6652b64K27J71k25N1j61M65r2r7k48K55k2j36J52Q3m5Q6l11N5N0o2K0K3j88r0
6676c03J37K48k0J24j45J0r3J08R0j41J40l1k95K34r2K70l20J6J12l9P6q6m1M2
6700ARk34O2R9J83j45N5K6j63o5K90l05O5K63k78K11m41L85j48K3K91m0k64K34
6724A14l17J48j39R6j9J95k13J89m9LJ45L9k91J09j16J24J96l38K22k5L6j59O
6747d4J77J10k70J55J70k69m61K22O4P9k6k0J7K40l72J1N12k88K02l25N4m6K15
$$ y = [33, 200, -14, -76, -131, -16, 348, 109, -22, -92, 62, -440, -84, 101, -165, 184, 143, 114, 82, -175, 43, -40, 52, -11, 143, 126, 105, -103, -49, -102, 135, 216, 132, 101, 129, 226, -56, -31, -49, 1, 40, -86, 100, 246, -149, 95, 135, -79, 4, 190, -138, -254, -144, 105, 131, -293, -167, 42, -197, 30, 90, 37, -110, -217, 79, -201, -41, 19, -215, 71, -264, -37, 134, -91, -40, -201, 264, 172, 75, -173, 82, 60, -76, 76, 159, 114, 200, -111, -56, -6, -68, -48, -25, -213, -303, -166, 82, 62, 186, 41, 51, -42, 66, 156, 15, 155, 124, -171, 63, -29, 241, -79, -63, 49, 10, 86, 0, -41, 1, 10, -224, -162, -63, 120, -25, 30, 56, -107, -172, 118, -187, -122, 141, -137, 74, -367, 18, -130, -107, 184, 144, -120, 114, -203, -55, -194, -98, -117, 78, -135, 54, 5, 8, 153, 192, -99, 10, -106, 18, 214, -124, 98, 73, 109, -50, -44, 133, 243, -27, 128, 298, 29, -432, -210, -146, -67, -93, -113, -96, 144, -228, -217, 295, 7, 209, -116, -62, -108, 107]
6770A07m69L42N3J23j43l7J9M3K1n1j13L64l99K11J26k25O0j37L59j93J28L3j97
6793B5K50k60j50LJ19Q7j04n9L5m3n0Koq1J61j16n7J88kj1k03K66P1M3Q8k66K7
6820d3O4k81M07k01L5j83K62l2m11L49j89L55%j77l29N19l49L77N2k58o7K04m6
6843E8n7j52K20r8J09r6pJ39j34J50k04k8J65j20k8n8pK88m1Jj03j77K68j29O5
6868B4r5R3K3j03K03j02j40jJ16r8J51k75Q2K02n2l16M99l4l89K52J48N1j76m62
6892c99M58k82K88l1Q5j99J09o8n2r7l5J11J89m2K6K0j85K45J5j38K24j61j9N9
6916A21k34K02l86L06M5j84P5l8J3K89m7k96N9P4K26l32J64J84P2o7l13K36k56
6939h7R3j01L42m5m71K63R2o0Q5k49K50j2q9J37o0m4j14M00j47m82K40M5j26J01
$$ y = [107, -362, -20, 33, 156, 13, -24, -5, 38, 59, 8, -105, 259, -140, 71, 197, -28, 32, -105, 254, 61, 189, 222, 25, 275, 15, -135, -132, -13, 74, -30, -89, -54, -97, -147, -145, -151, -232, -71, -187, -244, -56, -58, -69, -272, -6, 65, 108, 196, -70, -43, 21, -260, 147, -54, -19, -202, 60, 28, -383, -34, -223, 132, 132, -45, -374, 145, -204, 173, 225, -33, -100, 104, 58, 1, -151, 69, -29, 80, -16, -23, 116, -18, 132, -72, -100, 65, -55, -83, -141, -148, 140, 99, 100, -3, -180, 88, -41, 24, -71, 22, 45, -58, 145, 43, -97, -98, 18, -80, 71, -204, -122, 80, 28, -288, 211, 177, -212, 40, 188, 239, 63, -399, 59, -223, 65, 34, 119, -80, 29, -39, -91, -188, -223, -112, 77, 35, 61, 81, -104, 141, 156, 18, 242, 81, 62, 121, -113, 89, -297, 9, 54, -130, -55, -93, -80, 209, 162, -134, -75, -1, 225, -107, 57, 241, 313, 246, -67, 169, -87, 6, -95, 247, 202, -269, -6, 86, 26, 111, -138, 112, 100, 11, 148, 88, 44, -70, 330, 183, -299, -59, -14, -140, -39]
6963c9n3J91r4J04k12R2k03K27J12k0j22j0P8K4n8Q3o0L3j30J11k1q3k55N85m0
6988B40k50r8J18j35M50j52j15L00k14r6j85J83j25Pr0J42K60l70j46M34j06q6
7010c4q2M1O8L39l07k26J82O1p7q5K99Mk21j67o4J78J58J92l80k7L4J91J45j25
7034I7j53R7j25K78j08k3j19L6r7R2K12l25J66Q0j88O8J56k8K1J7n2m3p1J46k32
7059i8J26n2j10K14r9L9j02j31M84j64l4q2n4J62R2j31k21J82j31rQ5k10K04M6
7083Fl4J38k42o5J19K2k49M79j53p1q5J10j69J97P2j62p3l0J50K28k16J7R8Ll0
7108F0n4k1P9j6l0m7K4K39j58MQ5k28j37L67o3n2j01k0R1l0J24J7l13O7J68k58
7134b03K11k56K91j10k4P3k8R9o1J46j63K54n10J21Q4rJ8K1j34K14o0k3L5k1n2
$$ y = [-39, -92, 99, 5, 109, -103, -11, -214, 13, 125, 105, -17, -27, 51, 75, 17, 100, 40, 73, -57, 54, 33, -50, -305, 280, 240, -10, -108, 10, -125, 325, 173, 58, 358, 144, 48, -137, 46, -79, -72, -162, -20, 240, -130, -276, 158, 52, -34, -116, -75, -7, 332, 25, -201, -19, 42, -35, -120, 179, 183, -38, -205, -269, -91, 67, 259, -121, -148, -114, 77, 222, 97, -56, 41, -84, 194, 86, 63, -56, -20, -117, -25, 187, -138, 28, 108, -80, -12, 144, 116, 137, 154, 102, 59, -12, 134, -98, 28, -24, -134, 80, -19, 20, -82, -213, 271, 107, 73, -9, -63, 99, 191, 60, -161, 21, -110, -119, -34, -244, -40, 6, -28, 110, -132, -197, -78, -56, -305, 174, 21, -50, -135, -25, -194, 3, 75, -87, -160, -190, -40, 188, -28, -11, 87, 90, 60, 6, -15, 64, 48, 18, -29, -5, 234, 76, 80, 165, -63, -200, 167, 104, 52, -49, -69, 22, -8, 116, 133, -180, -113, 55, -203, 8, -248, 43, -67, -91, -18, -46, 53, -8, 138, -25, 229, -281, -160, -76, -85, -67, -46, -180, 34, -26, -49, -14, -35, -87]
7159h7n4l2J45J86r5K2o9Q0k89P1j03L85k27J75m7O4N5mj14o6J61j78O9j77L2
7184i7K26l46R0J58J80j83j68R6J59l0lK39n87O2R2P9K70m75M10j95q4O9R2K39
7208B93l71J26l50L86o3J75j51j83K28j84j18J43J40l8P3j61J46O5k14n6K18l
7230A01j59k1k71K33J57L1J60j14j30K28j40m5r7J2K54k81J24M1ll11N6oL78k17
7254b0J89j35j10K00j35J60j14p0O3lj51J87M3P3j68k84M20k27J65L9r2q7J32
7277G5j18J17k27P7O1k12L79k49RJ96J78k27j86K01RNj30J61j79n2L88m58R1Q2
7301ij00J87j97J39m8k7J06N5k5K2l39K98k8k5j37M4K19j08l39N21Jk27P1q3O1
7326C2J53l49L39m5k15k6l5K24j5m5m3j86M9N8J0K62n6q1k25J36o0J14J57l63
$$ y = [-87, -141, -173, -28, 158, 63, 85, 16, 96, -193, -122, -225, 160, -67, 108, 61, 125, 180, 176, 62, -4, 157, -21, 48, -129, -97, 129, -217, -127, 31, 211, 28, -140, -44, 115, 85, 82, 321, -266, -204, -112, -33, 237, -238, 172, -23, -107, -38, 54, 293, -78, 48, -302, 84, 21, 196, 45, -138, 90, -94, -212, -69, 71, 33, 106, -55, 91, 156, -58, -114, 104, 101, -58, -79, -350, -117, 40, 71, 231, 117, -13, 215, 75, 30, -67, -55, 199, -82, 42, 83, 80, -231, -175, -181, 197, -20, 169, 34, -76, 124, -11, 149, 35, -35, 28, 25, -126, 61, 104, 177, 9, -275, 145, -82, 83, 122, 30, -57, 75, -43, 74, -153, -76, -15, -227, 152, -97, -88, 108, 286, 59, -127, 74, 83, 88, -42, 119, -60, -112, 276, -182, -91, -9, -109, 78, -119, 20, -28, -55, 51, 106, 81, 103, -236, 62, 34, 9, -128, -84, 135, 27, -312, 209, 210, -17, 54, -29, 32, 185, -164, 175, 130, -85, -111, -146, 78, 63, 18, -25, -211, -162, -104, -94, 168, 112, 31, -194, -58, -118, -4, 153, -210]
7350b10K9N07j74k80J54L0j35J88J73l82k0L3jO3L80m83J01k51Q9K15k10L32l53
7373b05J28P9KJ70k56j8l6K22l46L60k53R5J34n7k3K70m50J81K55k99j25k02M54
7396H0j19j5K46j30l48K43J26p3Lj33OJ51j99M35l9j04j07q8JN2k9K64l03J34
7420E4J09qj35M6P5q7J55k26n2K72l96M23j65M8L9j92j3k18N33j92J02r0k99K39
7444B2N1j64K1R0%N7k98K49j36J37L9K18l62L1J12J81K1l79K53j23m3k16M67j8
7468B10l08J24k60K46o8K06m16J96L00l22KJ8j4L5j00L02k88K44j24j6K51k27
7490iL7k1l13L43Lk2L79l55J01j21N4l12J56N2R5j60K3J05J27j61J65j35J04j57
7514b2J14J10n3l25J01P4j09J06J92j91r7J69lj54Q4n4J24j23j86K91k44M85q4
$$ y = [-210, -181, 326, 152, -128, 26, 56, -79, 109, 282, -100, -120, -87, -88, -25, 355, -128, -27, -278, -189, 26, -184, 148, -205, -77, 2, 4, 174, -82, -100, -136, 86, -260, 100, -153, -58, 76, 19, -4, 266, -184, -3, 252, -47, -172, -374, 80, -39, -54, 192, 62, -286, -43, 83, 10, 13, -120, -114, 37, -162, 273, 234, 130, 23, -65, -64, -12, -41, 223, -80, 54, 163, 155, 20, 66, 141, 54, 209, -17, -69, 203, -193, 230, 65, 113, 152, -40, -53, -271, 262, 70, 172, 82, -217, 22, 73, -91, -70, 20, 20, 77, -221, 28, -108, 29, 68, 286, -76, -45, 67, 248, 269, -110, 143, 20, -23, -239, 228, 210, -98, 26, -234, 12, -56, 150, -266, -70, 230, -92, -90, -72, -86, -51, -151, 151, -137, 107, -17, -33, 218, -9, 28, 7, -306, 37, 40, 18, 397, 42, 143, 22, 76, -236, -80, -28, 67, -93, -70, 35, 162, 1, 166, 31, 135, -22, 92, 202, 149, -176, -75, -1, -110, -4, 188, -3, -100, 69, 66, -88, -4, -58, 66, -57, -243, 48, -196, 289, 205]
7537B05p4l45R5k8J55J4K6P1k26M28j68n4j56J07j0L2p0k0R2k77R2L08o6k31J28
7562B8J31L1k07JO9j57j1oK91m19J71J61j78j67N06q2j50r3JJ89j50L0qj0J1p8
7588i6L36P6j52P8m37J55j05K74p3R0o2k3J66k01K28l49J91j53K02j58J52k19
7610h0L35m45M3J39K65k54j22K09m2q4J52j12j46N28l65j38j0J66qk23J79J10
7632I7j14K8J68k56N7j4J74n0j43J80k02k07M82k0k6o8Oj41j91L11n2K59k74M5
7656D9j39j59M22k85P0J11j24N9r3j1L8n6J43J8k17L82m82K30j3J8O3J27j15J02
7680A38j60j00J51k8L7RQ4l67J33nP1j11K98J16l78L02j49q9J03Q9j88m8R0q3
7704h5K65l19J66p4J48k03pK01r3P6m6j69PP5p9m3K75k52J88N8j82mJ23j51J11
$$ y = [205, 131, -214, -119, -147, 8, 22, 48, 119, -107, 321, 153, 99, -57, 50, 40, 72, 2, -18, 74, -203, -111, 197, 131, -100, 28, 159, 190, -17, -16, 53, -104, -115, -121, 170, -249, -78, 83, -95, -262, 244, 162, 12, -81, -80, 109, -41, -11, -19, -29, -18, -96, 240, 316, 164, 242, -195, -40, -145, 129, 56, 146, 84, 61, 227, 26, 254, -95, 96, -57, 145, -13, 139, -80, 255, -190, -147, -8, 257, 3, -119, 90, 48, -36, 116, 4, -142, 386, 21, -117, -127, 39, 31, -192, -13, 97, -17, 11, 179, -77, -20, -34, 140, 90, -53, 127, -75, -282, 200, 180, 154, 86, 92, -49, -240, 71, 19, 278, 4, 49, -90, -249, 173, -112, -42, 69, -55, 4, -89, -100, -62, -118, 25, 43, -174, 208, -274, -44, -57, -39, 24, 151, 36, 138, -22, -122, 29, 1, 38, 47, 131, -236, -103, -108, -37, -148, 150, 266, -112, 190, 41, -48, 55, 144, -44, -92, -2, -85, 180, -139, 27, -47, 101, -102, -109, 92, -1, 75, 29, -140, -133, -58, -137, -180, 95, -157, 31, 89, -93, -97, 26, -125, -14]
7729a4p0O7J45Om04K90J62j02l5R9l03K12k0r4J36j24J38k15J85M6j34L13l15
7752c1J75l54K73k91L43j5J14j80J3k37Q0N4N8k21o0K20J00J02l9J69l56J18j56
7775a21l1M02n36M85k58M5l49J88K25j8k48L44m81M08P4j81J87J8k43j12K89k4
7797F3M4p0j35J28q1Q9Lj48o7L17k71J31k52K26k8Q7on4k23J16L16l64Q0p2j50
7822c21M3K75k05L37m6L4lj69j8J0K89l48J42J29k19n5O2J06r6o0J0J04K4J99
7846B24k76k4l6O4k80M72k18J15O3J6o6Q2k97M6l6K15p6Pm8K12l56J89q3J1j64
7871b44J24j73M36k7j62J76l43L02k58N3K62m4k05J33j62J52M7J27l58M65l32
7892c1j31K39k34K02j07J21N9k35N40j57k66k7Q1k98J21O3j39J34n0O4j00K06
$$ y = [-14, -84, -17, 128, 134, -270, 20, 182, 80, 45, 144, -159, 53, 33, -61, 75, -49, 89, -126, 59, 105, -29, 284, -31, 144, -210, 63, -228, 115, 100, 214, 34, 47, -190, -110, -56, 2, -219, -279, -59, 41, 143, 104, 273, -83, 35, -121, -152, 250, -286, 199, -59, -14, -363, -175, 50, 32, -216, 128, -353, 55, 129, -52, 135, 153, -90, -202, 87, 63, 107, 37, -98, 30, -51, 38, 41, -107, -174, 143, -128, 3, -249, -23, -51, 36, 30, -24, -247, -131, 185, -179, -99, -171, -321, -278, -3, -208, 129, 83, 117, 114, -55, -73, -63, 226, -122, 20, 149, -70, -125, -63, 43, -53, -113, -103, 1, 25, 224, -52, -76, -112, -48, -328, 144, -74, 41, 104, 120, 54, 136, -161, -115, -151, 64, -12, -5, -53, 159, -197, -8, -91, -80, -244, -120, -293, 143, 116, -46, 130, -213, 89, -169, -116, 146, 102, -103, 30, -132, 20, 67, 194, -164, 301, -31, -162, 77, -157, 45, -62, 59, 118, -117, 423, 266, 0, -27, 54, -244, -123, -60, -199, -65, -115, -51, -151, 55]
7914E5j90L30l79L25l91N29j70k80q7K54k40N15m00k5L97m64M56k1j74r6j32L73
7936A85j59r4Q7k2n4K42o0j83J03j51L08n3j68J95L5l73J19J60j04J37l3l8k19
7959a40J54k6J20J79k46K5j08K49m32L63k02K57k24Q6J31k91l7J33L93l13L9l02
7981a92M57j94J75k97K02k17MK84k63J70j30K42k69j16J9m3j45M30j81J43k78
8002a99J56R7k62Q6L8K20N1j44j27l6O4KJ67k06J75n4j63L1J12K50l41K8R7j48
8026a06L17j75J80j33k8k48J51O3j53P2j43L06j37l6L61l09J44j7k40n9K22l37
8048c05M60j86j00M1K12J10j93Q3N5j16kk44k8J5Q0J34jj14K6O1R2m4J6m9J47
8073A50l81K8R9k34M34q6o1Lr6L48j67k14L26m36K71K21p8L0j74J71K57o05J04
$$ y = [55, -135, 195, -184, 141, -250, 279, 109, -171, -258, -4, -244, 271, -129, -154, 243, -221, 235, 214, 40, -56, -188, 185, 26, -68, 19, -3, -57, 185, 125, -58, 45, -106, 202, 149, -19, 176, 211, -162, -43, 117, 13, 150, 117, 79, -140, 14, -12, 108, 287, 41, 66, -42, 207, -225, 138, -64, 193, -31, 55, 186, -105, -142, -9, 384, 71, 110, -192, 265, 71, 246, -51, 151, -66, -62, 222, -41, 129, -1, 241, -28, -144, -125, -168, -313, 117, -64, 79, -199, -43, 54, -208, -122, -84, 136, 187, 43, -84, -120, -56, -54, 113, -93, 82, 28, -135, -104, 8, 258, -83, -55, 42, -106, 211, 36, 216, 83, 55, -193, -42, 21, -132, -60, -203, 103, -34, -70, 291, -18, 126, 109, -131, -190, 32, -305, 155, -31, -131, -90, 122, 232, 39, 122, 177, 61, 59, -185, -213, -198, -118, 16, 15, -99, -73, -12, 80, 36, 52, 3, 150, -231, -203, -104, -338, 96, 10, -51, -48, -144, 204, 37, -177, 149, -287, -16, 205, 127, 157, -17, 154, 411, -194, -90]
8096i0N9J85l69Q0J13qN6j37L16Oj58P7j3m3k02j26J25O2M9K5J3j32K07j91R6
8121@L3j52J05k27J54J60P1J0n4m4J62l27r3M83l53K56k74Q8m3k87K85J94j22
8144B5R6j87j42K78l18K02o5j5J7n8K40j82L03k19L5J8K4p0J81kj45L08j91l6
8168I7j05m0J84j92P5m3K14j73j19J51k10K46o4m5m3LJ8m1L20L5m38J42J2
$$ y = [-90, -31, 154, -215, -135, -22, -30, 26, -111, 205, 211, 53, 130, 117, 74, -128, -254, -129, -67, -18, 7, 20, -112, 95, -96, 0, 33, -119, -14, -241, -87, 73, 144, 154, 100, 56, 218, -109, -202, 281, -72, 184, -90, -2, -45, -332, -47, 147, 25, 121, -66, -208, 70, -248, -46, -111, -126, -109, -167, 73, -109, 194, -25, 10, 28, 52, -18, 163, 161, 16, 324, 133, 97, -8, -48, 136, -56, 19, -24, 190, 17, -102, 49, -161, 85, 21, -24, -67, -64, -46, -87, 233, 268, -170, -28, -16]
8191a6
$$ Imaginary data points
##PAGE= N=2
##DATA TABLE= (X++(I..I)), XYDATA
0@%%%%%%%qJ3j3J6k2L0l2M0n6P2q8J04j26J50j76K14k54K96l44M00m65N37o22
30c34P16q12R20j048J188j335J497j682J886k104K342k607K894l205L546l922
46b060M332m776N263n801O391p039P756q555R448j0448J1583j2884J4385j6140
60h545J8233k0776K3937k7998L3431m1105N2851p3261J18513l94023J84193P11039
72E76489n99549m01544K40347N57039j31694o78512P5790P64143j33108o14447
82c45046K811N64404J58772n94489k82064O54406K60968n52572k90454M31529
92H265M01854l82168n34176M18451N32227l73394m73952K42466M87286j03839
102B23020n85894N9303O07516m7696n32205k9346M72977J79463n14945k71048
$$ y = [0, 0, 0, 0, 0, 0, 0, 0, -8, 5, -8, 8, -14, 16, -16, 24, -32, 40, -48, 56, -70, 80, -96, 118, -136, 160, -184, 216, -249, 288, -334, 382, -430, 490, -558, 630, -705, 792, -890, 996, -1108, 1234, -1373, 1521, -1684, 1862, -2060, 2272, -2504, 2759, -3042, 3349, -3690, 4066, -4489, 4959, -5489, 6094, -6790, 7595, -8545, 9688, -11088, 12849, -15149, 18282, -22823, 30028, -43233, 75280, -318743, -134550, 576489, -23060, -424604, -184257, 372782, 241088, -437424, -361634, 402509, 269401, -345046, -342235, 222169, 380941, -213548, -495612, 158794, 419762, -132810, -423264, 8265, 410119, 27951, -506225, -87774, 444453, 71059, -402893, -160427, 326859, 223020, -362874, -303571, 303945, 256249, -275956, -305302, 167675, 347138, -167807, -438855]
112d38855N72358K57351n29438k35294M01561L13824l08800m36116L08188M81175
122C85954l16807m35180K47520M06279j22600m51219L3054N05807m220m97252
132b48664k3607M56144R9311m37620j79414M44537K12889m26579k26129L68323
142C9191K73106l07167l39452K79344L71625k56760l61330J95637L61267j07678
152A47783l97974M7949M38195k5175m34000N07L98705O3072l77501j37475L80176
163A04262J79429l73976j91933L36116K18356k81594k65358K39833L06018k10004
173F1149l22186J71627L32772j18443l52789P2740L68287l7740l63127m75L48524
184A60339N4246l46517j03777L48841J29493l27647j43049K82664J80770k38006
$$ y = [-438855, 133503, 390854, -138584, -373878, 27683, 341507, 32707, -403409, -95221, 385954, 69147, -366033, -118513, 287766, 165166, -286053, -252999, 252808, 248588, -248664, -272271, 183873, 283184, -154436, -333850, 110687, 323576, -103003, -329132, 39191, 312297, 5130, -334322, -54978, 316647, 59887, -301443, -105806, 255461, 147783, -250191, -202242, 235953, 210778, -223222, -222715, 175990, 239062, -138439, -275914, 104262, 283691, -90285, -282218, 53898, 272254, -9340, -274698, -34865, 271153, 61149, -261037, -89410, 243362, 124919, -227870, -155130, 213157, 175417, -187710, -188185, 160339, 214585, -131932, -235709, 113132, 242625, -85022, -228071, 54593, 235363, -2643]
194b643k37463K15807K75733k03697k77768J72571K75459j15179k96982O2128
204a32034L26351l5641l33209J9538L15914J6990k97012p1170K89864J12296k82918
215g1031j31769K61124J54736k27471j92949J97139K26507j77429k39568J54187
225d6524K46253j13261k63246O9209K83813m4587k88639K9754K74520M743k56999
236a04964n7369K51232R7898k54190j11991K42573J24240k07795j54754J69559
246e561J93470j52016k18925J45771K24478j21591k24264P7293K31051l9239k45506
257a35039J8588K51669J434k40319l2443K21633O7149k12615r6053K07913J18907
268A70824j91770j39779J65400J59857j43786j79913J27900J94868j05980k00758
$$ y = [-2643, -240106, -24299, 251434, 47737, -230031, -57460, 217999, 102820, -194162, -132034, 194317, 158676, -174533, -154995, 160919, 177909, -119103, -190273, 99591, 211887, -71031, -202800, 58324, 213060, -14411, -207360, -10221, 216286, 38857, -200711, -46524, 199729, 86468, -176778, -107569, 176244, 131657, -156982, -127228, 147292, 152035, -104964, -162333, 88899, 186797, -67393, -179384, 63189, 187429, -20366, -175120, -5561, 187909, 35893, -183032, -37261, 187217, 65626, -158638, -81345, 149706, 110467, -135039, -116451, 135218, 136652, -103667, -136110, 85523, 152672, -59943, -155996, 51917, 170824, -20946, -160725, 4675, 164532, 20746, -159167, -31267, 163601, 57621, -143137]
278a43137P3927K05337m4733k14900K3170K20379k520k11675k4251J95908N4707
289A32212j88502q3687J86443J05101j76333j18514J53453J32627j29739j53422
299a40361J10743J73955r4215j83027P5289J81858n1798j82974K4407J87402K348
310A03627j88474k4141J82586M2929j74342o3943J63373Q6897j49858j07476J35801
321F979J22980j21782j37320J06485J48640q7202j55990O5411J60520m4122j65815
332a01216K2856J69169j782j68010j7517J61875L6822j54543n7100J45895P8071
343A14520j37031r5096J25567J07715j12960j18148R6409J28392p7019j38362
353a06013N8951J44700m2387j48114K5314J48160n319j45440j6762J43146L5410
$$ y = [-143137, -69210, 136127, 91394, -123506, -100336, 120043, 117523, -94152, -118403, 77505, 132212, -56290, -139977, 46466, 151567, -24766, -143280, 10173, 142800, 13061, -140361, -29618, 144337, 50122, -132905, -57616, 124242, 72444, -110530, -86123, 101279, 103627, -84847, -108988, 73598, 116527, -57815, -121758, 41615, 128512, -21346, -128822, 6979, 129959, 8177, -129143, -22658, 125982, 38780, -117210, -51799, 108721, 64599, -101216, -78360, 90809, 89027, -78983, -96500, 65375, 102197, -52346, -109446, 36449, 114520, -22511, -117607, 7960, 115675, 2715, -115433, -19024, 109368, 32349, -106013, -47062, 97638, 55251, -92863, -67549, 80611, 75292, -70148, -86910, 56236, 91646]
364I1646j39707n1661J34268O6364j24764q0318J11356R3564r8471j05900Q6647
375a6976J16265p2403j22947N6239J25660l9034j28418K1360J30922k518j32147
386f3997j5135J30778K8738j26159m2073J19040N7208j09299p2961R9825Q4871
397I0836r1622r2356Q1180R9005o5359j05438M7361J11345l2610j17067K0421
408e4304J19889o143j17506r768J13864K4442j11165l8840J08662N1305j01160
419b0724o1814R1023P1214q1714p9442P0717Q7411n6631r4391M2603J00110l1025
431C7337j04675K0155J06082o053j03459r716J01367K3287j01865l3726R9801
442B8535M2297r0679n0457P8831O0995o9444p2723O2478Q0146n3000q2601M0167
$$ y = [91646, -48061, -99722, 34546, 100910, -23854, -104172, 7184, 100748, 2277, -103623, -16976, 99289, 26886, -96061, -39822, 85838, 46804, -81614, -60254, 70668, 68150, -63997, -79132, 51646, 80384, -45775, -87848, 31192, 88400, -20899, -93860, 5965, 90836, -786, -93142, -11962, 87043, 21684, -83754, -36393, 74952, 42342, -74725, -54304, 65585, 59442, -58064, -67832, 46032, 70474, -40691, -79531, 29131, 80436, -20724, -82538, 8485, 79699, -2015, -81457, -10740, 76671, 20040, -74351, -31748, 68362, 37337, -67338, -47183, 58899, 52846, -50613, -60329, 41038, 64325, -37540, -71266, 28535, 70832, -19847, -70304, 8527, 69522, 78, -72645, -10167, 69979, 16979, -65622, -25455]
454b5455Q5926k7158r0701J4180R5945l772r5716n967R2468J6250q9063k8274
466f1337Q4994L9813p9119m7817P2119N5002o4350o3038N5530O9899m5783p4095
478e8182L5833P8305k5218q2982J4805Q6026n567q5411k681Q2119J2804p8259
490b8408k4897P5182L5169p1647m1338O5643M6604n7527n3448M7886O1287l8777
502A5729o8748L3399P2488k6887p3269J6565P3268n074p4321m583P5321J2575
514D6463p3900j8806O8486K6134o1420l5858N6437M4114n1837n0352M6780N4889
526E1130l9988n7953L1183O2202k2728o5948J5057O7466o563o8151j330O6925
538C1302Q887o4215j6329N9688K4783n5919l2454N1573L9511m8098m4364M3535
$$ y = [-25455, 60471, 33313, -57388, -43208, 52737, 48965, -46751, -52718, 39750, 56000, -33063, -61337, 23657, 63470, -15649, -63466, 8653, 63655, -695, -63733, -8203, 61696, 15913, -58182, -22349, 55956, 30738, -52244, -37439, 48587, 43020, -42391, -45072, 37047, 49851, -28408, -53305, 21877, 57046, -14601, -55939, 9704, 56308, -1219, -54667, -6781, 54506, 15729, -53019, -19620, 52868, 25981, -47288, -30723, 42545, 37471, -36850, -41433, 33888, 46463, -27437, -46243, 22243, 48377, -13043, -48901, 7536, 51650, -187, -50539, -3759, 51130, 11142, -46811, -15628, 46574, 23846, -42102, -27045, 40421, 33858, -34293, -35623, 31302, 40189, -24026, -40355, 19333, 44116, -11803, -44257, 7316, 46827, -1271, -45635, -2100]
550b100M7429l5491n1454K6947N6406j9952o1107J5090O1728r019n8993O29N6204
563B6317R449n5958j7825N6077K2904n3364k6363M7080L1892m0766l9789L6651
575c695M6040l3379m8930K9046M8957k0961n0777J1680N3755m445n5669j86N4045
588B5481N248n0673j2826M7760K1002m6409k5739M3764K9655l9362l4973L3994
600c078M0701l0044m3920K6017M4725j9518m5730J0913M7910l426n0679M74M9403
613B3748L143m5495j0243M1097J9745m0626k5954M2087K7345l9430k8692L1469
625a806L2900k3232m0134K0868M3758j9060m3283J3494M1161m918m1210k682M4197
638B0053O143m3951r481M0020J4943l6827k1306L6046K5338l3882k8187K9350
$$ y = [-2100, 45329, 9838, -41616, -14669, 41737, 21785, -39322, -24232, 37496, 28477, -30516, -29887, 26317, 35766, -20192, -38017, 18060, 40964, -12400, -38763, 8317, 40209, -557, -40346, -3695, 42345, 8966, -39964, -10918, 38039, 17078, -33699, -22019, 31736, 27291, -28378, -28564, 25481, 30729, -19944, -32770, 14990, 35992, -10417, -36156, 7608, 37263, -2099, -37072, -3078, 37623, 7579, -36341, -10324, 34401, 14883, -30847, -19934, 27976, 24550, -26129, -25655, 23748, 26891, -18604, -28847, 12250, 31995, -8631, -34585, 7502, 34847, -4583, -33275, -1806, 31094, 7862, -32272, -11404, 32354, 13294, -29989, -16495, 24666, 19748, -21462, -24144, 20053, 26196, -17755, -27236, 12784, 27727, -9100, -30406, 5640, 30978, -2904, -31091, -1741]
650a741L0453k3287l4569J9051L8387j6649l8151J1538L6335l687l7525k650M0262
663A7767O021m0332p903L6012J2301l1601j9382L0433K5253l0605k7175K8270
675i41K6715k2038k8944J5748L3346j1493l6284R074L5601n432l4085k96L3827
688A4798O253l4742r771L3840J2671l1484j6376K8844K0216k6214k3383K3591
700a757K5396j9776k7752J5511L0002j1758l0955P868L1385l979l0910r50L1264
713A3589N033l1055q205L0324J0856k8245j4200K5337J7997k2683k1072J9921
725b403K4039j7682k5286J4387K6346j0447k7052N888K8226k105k9702l07K9628
738A3530K979k7913o162K5533J0488k4161j4500K3713J6750k2117j7867J8755
$$ y = [-1741, 28712, 5425, -29144, -10093, 28294, 11645, -26506, -14968, 21367, 17680, -19845, -22495, 17767, 23788, -16544, -24447, 11565, 23866, -7735, -27117, 3316, 28569, -2036, -29211, -941, 25774, 3736, -25208, -9460, 23886, 12393, -23891, -14817, 20784, 15352, -18733, -19029, 14798, 21051, -13691, -23462, 10378, 23049, -8435, -24811, 4033, 24249, -1965, -25348, -1757, 23639, 3863, -23889, -8378, 21624, 9866, -21089, -13221, 18164, 14185, -16725, -17675, 13589, 18622, -12433, -20638, 9686, 20542, -7703, -21903, 3434, 21431, -1252, -22324, -2403, 21636, 3954, -21332, -6945, 19401, 8954, -18098, -12210, 16016, 13911, -15791, -16098, 13530, 16509, -11404, -17566, 7967, 18455, -5706, -20206, 3507, 20257, -1860, -19727, -972]
750i72J9602j4433k2888J1548K5448r748k6169P591K5080l443k5045o76K5939
763A1834L589k5792o069K4197Q893k1694j2447K0739J5327j9756j6561J6410J8511
776A7181j3249k0894J0667K3349r009k3560O776K2152k520k2164j401K2926M727
789A4981k3647n938K1882P679j9345j1128J7641J4892j7134j6318J5651J7005
801A6221j2956j8149R538K0319p109k1509N185K1723l245k0985J55K0209L817
814A3214k0295o306J9897P972j8502j0335J7018J2484j5041j4517J3634J5479
826A4702j1726j6764R334J8174o770j9149M695J9476k680j8917l37J8562L689
839A2289j8571n789J8488P161j7531r059J5752J0700j3253j3075J2233J4668j1258
$$ y = [-972, 18630, 4197, -18691, -7143, 18305, 8557, -17612, -10021, 15059, 11616, -13429, -14105, 11834, 15423, -10369, -16438, 7759, 16652, -5042, -17489, 3250, 18577, -1179, -17740, -1330, 17181, 3932, -16962, -6295, 17054, 8045, -15515, -8739, 13413, 10893, -11271, -12672, 10254, 14981, -8666, -14604, 7278, 14957, -4388, -15516, 2125, 17017, -117, -16435, -784, 16221, 3265, -14884, -5346, 14973, 7864, -13645, -8460, 13263, 10018, -10967, -10812, 9397, 13214, -7081, -13387, 6510, 14482, -4020, -14355, 2663, 15147, 106, -14411, -777, 14702, 2976, -13788, -4454, 13720, 6950, -12199, -7504, 11972, 9292, -9625, -9962, 8600, 12289, -6282, -12071, 6417, 13578, -3953, -13012, 2740, 13440, 187, -12888, -655, 14013, 2755]
852B755j5464R208J5779o161j6884L821J7458j746j7442o14J7650K564j6893m514
866a0483J5924O620j5527q473J4325J0401j2785j1677J1056J3304r846j3901P433
879c629J4690n292j5229L157J6107j599j6320k83J5839K171j5041m290J4459O491
893A1231j4363p900J3419Q822j1604r942R627J1794q166j3268O736J3967n238
906E115j4202L296J4861j586j5026l13J4533J997j3983l683J3054N785j3139o504
920i795J1531Q223j0033r506Q576J1275p636j2581O721J2510m815j2659K364J3223
934G398o26j3995L3J3532J582j2886k615J1147N180j1421o726J0859P956r840
948d22q672P902R899o576j1084N621J2067m856j1883K994J2136j414j2359P8J1987
$$ y = [2755, -12709, -3501, 12278, 6117, -10767, -6946, 10512, 8766, -8676, -9290, 8360, 10924, -5969, -10483, 5441, 12061, -3466, -11939, 2386, 12787, 2, -11675, -619, 12685, 2839, -11062, -3629, 11061, 5769, -9460, -6303, 9804, 8205, -8115, -8398, 7441, 9612, -5429, -9719, 4740, 11231, -3132, -11032, 2387, 11209, -395, -10337, -710, 11084, 2918, -10350, -3614, 10353, 5115, -9087, -5791, 9070, 7484, -7542, -7855, 6678, 8675, -5308, -8991, 4063, 9848, -3291, -9795, 1736, 9959, -74, -9580, -1004, 10271, 2635, -9946, -3225, 9285, 4470, -8189, -5825, 7398, 6772, -7223, -7190, 6342, 7924, -4962, -7577, 3570, 8750, -2671, -9397, 1462, 9418, -422, -9094, -1192, 8707, 2131, -8953, -3332, 8735, 3879, -8004, -5010, 7126, 5712, -6647, -6569, 5418]
963E418J366j1299k854J0367M668r749o758J0313O828r022p179O809Q997n686
977B219j0676N010J1600m913j1175L937R632n89j0641j180J1623J389j0880k573
991g217J0209L594q805n554Q387P155q081p978P284Q753o299r681N607R346l940
1006B780r279K359R535p63r950p11J0279J186r776j676Q260L819p913n995Q301
1021D56O910q291o572P256O534m928q012L335R155l100r530L237Q773j402q746
1036d925m46Q803J632q942k355Q756L487q110n055Q145N495p569n961O635O342
1051E932m438p993L615Q655l437q395L104P316r49p348j169Q321K187r526j372
1066e497Q675K007p097m165O174O006o545o245O457N853n056n772K784P161j974
$$ y = [5418, 6784, -4515, -7369, 2998, 7666, -2083, -8841, 1472, 8300, -722, -7901, -1092, 7905, 2219, -8457, -3447, 8153, 3240, -7935, -3998, 5634, 5045, -5596, -6776, 4847, 6236, -4644, -7217, 2992, 6586, -2219, -7773, 614, 7769, -312, -8290, -1006, 7747, 1448, -8233, -2626, 6720, 2780, -6499, -4140, 5395, 4632, -5318, -6029, 4250, 5436, -4340, -6016, 2244, 6063, -1850, -7845, 456, 7366, -925, -7497, -241, 6293, 1365, -6647, -3312, 5843, 2743, -6787, -3550, 5223, 3821, -4925, -5371, 3432, 5064, -3878, -6233, 2523, 6010, -2100, -7155, 990, 6485, -1084, -7045, -410, 5932, 1494, -6499, -2884, 5771, 2334, -6061, -2957, 4359, 3410, -3938, -5107, 3214, 5401, -4125, -5497, 3178, 5185, -1912, -6077, 97, 6103, -442, -6687, -230, 5623, 567, -5205, -2421, 4740, 2766]
1081B766p922J920P817j446p198j57P580J098q069j484P564K229o334l745N579
1096A98N590o177n673O287N004m509n131K241O683j651q088K240P669k261n926
1111c504J37N935K053p471k577Q459J761o829k365N130M014m136n903M890N636
1126E230m662m945K871N579j741o467J445O959j386o426K82O396J008o580k094
1141d531P063K071o310j912M187L782l904n230M625N428m736m963L843M153j278
1156B288n551M80P096j369o630J083N342O26n155j833N648K508o003k500N111
1171A141K775l963l875L588M728l600m642K935M627k079m793Q83N921o96n974
1186c024L52N323N03n078j434N605J673n351j924M693K440l939l311L175M661
$$ y = [2766, -5156, -3236, 4581, 3135, -4063, -4220, 3360, 4458, -3611, -5095, 2469, 4698, -1636, -5381, 198, 5788, -389, -6062, 225, 5229, 720, -4411, -2170, 4513, 2862, -5226, -2986, 4683, 2422, -3504, -3367, 2568, 4621, -2850, -5427, 3032, 4793, -2036, -4401, 729, 4743, 607, -5296, -406, 5230, 568, -4377, -1506, 4073, 2332, -4135, -2690, 4269, 2883, -3543, -3261, 3135, 4143, -2437, -4531, 2532, 4603, -1707, -3619, 568, 4350, 446, -4784, -159, 5269, 533, -4430, -587, 3566, 2288, -3263, -2783, 4313, 2944, -3686, -2603, 2739, 3365, -1790, -3623, 2025, 4533, -1470, -3970, 1141, 3916, -47, -3922, -334, 4394, 794, -3848, -913, 3714, 1635, -3158, -2275, 3646, 2950, -3024, -2672, 2651, 3154, -1924, -3358, 2247, 3920, -1431, -3355, 1338, 3778, -161, -3472, -297, 4364]
1201D364l464m775L434L733j772m169O34N232n45n286M71M972L1m679q67M677
1217A991J684m753k188M268K367l409l249L477L365k815l921K495L826j958l737
1232b557Q93M719m97n009M44M669l44l819r77L858J947m711j550M118J893l530
1248d53k383K730L654k681l979K614L744k228l820J106M345k99m830O10M394n34
1264A990l413q38L620J480l900j921L802K008l054k522K270L579k446l820K767
1279c98L213k141l147J287L273j49m355N64M009m95l420m02K976J773l265k319
1295b996L649K036l320j915K515K576j887l615K196L617k292l090J594K717m11
1310A374l173k40L846K9l283n48K790J436k998j862K934K607l505j475K024K012
$$ y = [4364, 900, -3875, -441, 3292, 1520, -2649, -2015, 3217, 2672, -2614, -2143, 2829, 2860, -1819, -2686, 1991, 3675, -1078, -3266, 1002, 3369, -40, -3289, 188, 3553, 738, -3183, -688, 3138, 1180, -2557, -1664, 3055, 2558, -2451, -2007, 2662, 2318, -1501, -2478, 1380, 3327, -1384, -2934, 1184, 3077, -453, -2836, -106, 3548, 867, -3112, -498, 3246, 1018, -2802, -1696, 2649, 2350, -2480, -1870, 2524, 1990, -1423, -2261, 1359, 2839, -1061, -2982, 820, 2828, -226, -2748, -478, 3101, 655, -3165, -398, 2815, 674, -2473, -1186, 2087, 1938, -2417, -1853, 2156, 1661, -1759, -2161, 815, 2588, -677, -2996, 653, 2689, -631, -2546, -31, 2545, 658, -2957, -761, 2856, 564, -2526, -932, 1785, 1374, -1799, -2039, 1807, 1836, -1447, -1995, 795, 2231, -767, -2629, 305, 2912, -593, -2068, -44, 1968]
1326A968j459l003K103L026k073k813J325K729p47k714k95L387K78l395j28K551
1342G40R62k293j931L104J982l036j989K629J918j931k321J442K866j654k655
1357b167J031K968p60k275k16K566M95k884o14K727R84k526j318K230K075k676
1373c60j684K158J776k013j866J351K409j646j871Q06K558q56k252J59K537M75
1389A681l024o23L035P93k736r81K805O65j951j565K209J421j540j866J390K047
1405A760j234k315P58K305l23k364J00K455J33k409l89K465O14k087r75K137J232
1422A863k315j339J913J421j604j516J359J834j056k238J124K036p07k062L32
1437i55K288k87k101m07K479O52k498m76K049Q66j986j113J470J611j546j310
$$ y = [1968, 509, -2494, -391, 2635, 562, -2251, -926, 1803, 1056, -1658, -1953, 1434, 1712, -1683, -1811, 740, 1702, -591, -2522, 582, 2564, -472, -2461, 168, 2086, 155, -2166, -724, 2142, 488, -2167, -1136, 1832, 1072, -1203, -1419, 1147, 1642, -1242, -1856, 871, 1855, -671, -1989, 241, 2316, -360, -2044, 114, 1890, -123, -1989, -638, 1771, 125, -1746, -940, 1618, 762, -1490, -1331, 1206, 1681, -1343, -1966, 1069, 1862, -874, -1855, 950, 1615, -336, -1901, 308, 1729, 189, -1677, -287, 1760, 526, -1789, -1031, 1274, 951, -1413, -1313, 1142, 1275, -1134, -1523, 942, 1556, -531, -1506, 631, 1863, -452, -1791, 122, 1543, -61, -1577, -218, 1616, 560, -1678, -554, 1482, 775, -1287, -955, 1333, 1046, -1055, -1462, 1017, 1669, -829, -1305, 744, 1610, -376, -1489, -19, 1592, 46, -1264]
1453a264R45K000r11k171Q44J878j98k088j44K308J89k565p5J879O43j884o15
1470a229J797P12j733o47R86J377j049j583J301J331q31j603L80K102o51k009
1486a349L36K372k73k167K47J832L56j782p45J635Q55j585q50J272J058j063j449
1503a300J058J456o44j579M41J642l27j773J10J872k26j238n90J777L61j406p72
1520a138J425Q84j486n52P73J260r19j316Q74J755j346j482J184J228l28j715
1536h99K51J842j99j624m35J863Nr41j024J440Q56j278j027J148J425j192j355
1553a144J106J162j424p35L45J742m16j788M52J637l91j159q4R38K93q51o54J272
1571C01P50j591k86R34P03o91j158N73J302m92j683P72J440k62j395L09J167R1
$$ y = [-1264, -319, 1681, 770, -1401, -557, 1321, 1123, -965, -1109, 1199, 1388, -1177, -1252, 627, 1270, -614, -1229, 568, 1280, -453, -1100, -114, 1263, 214, -1369, -68, 1263, 432, -1171, -791, 1311, 660, -1349, -1013, 1359, 1086, -1081, -834, 998, 1354, -428, -1173, 462, 1317, -268, -1118, 154, 1212, 149, -1300, -242, 1214, 570, -1009, -568, 1074, 747, -1026, -916, 956, 730, -508, -1098, 679, 1040, -366, -1138, 287, 1171, -315, -867, -94, 1166, 247, -1069, -195, 1560, 214, -1268, -84, 1144, 816, -899, -648, 1194, 995, -629, -1064, 799, 804, -137, -1161, 279, 1135, -143, -1170, -22, 1403, 211, -1144, -38, 1124, -300, -1035, -690, 1052, 636, -1152, -700, 937, 546, -613, -697, 241, 534, -317, -971, 301, 1051, -540, -826, 108, 811, 120, -1038, -465, 837, 345, -1338, -566, 874, 612, -783, -474, 693, 784]
1589G84j203l40Q62L76q09o78J435N35j237o61J000N40q35r57J062J259j515n20
1607i02Q91M25r0r93j15J114J95j286N8J179J9j221k38J193N67j167n07R23P31
1626G76j063p40P38J120r05r34Q48P70j77j016k58J355kj293K65N31N49j042l95
1645h73Q49P81j231o59J637M9q08m41J56J511r03j060P86R19o86r35K95J006P20
1664A113j550l73J317j37p46l68Q82O57j059n41Q59L50m33j208R20J205r45p98
1682h55P89N22k00q88j86J234M93j581Q9J219j11r04j59O27M34p97n36R32L62
1701D84n19m75J14P95k51r73O45O80k59r40J28J009L4r96K46M62L24o44m20R43
1721C87K85r18m79J112R8o36m62L58R84m39r38L82O21o1p22jQ70K00j043n3J040
$$ y = [784, -419, -759, 103, 479, -330, -1008, 427, 962, -275, -936, 64, 604, -231, -1188, -126, 1133, -382, -902, -11, 414, 324, -669, -784, 330, 525, -761, -703, 476, 495, -726, -964, 229, 796, -371, -878, 45, 776, -287, -1027, -289, 831, -74, -1008, -160, 610, 433, -583, -841, 514, 512, -781, -516, 15, 564, -478, -873, -24, 757, -474, -1133, 504, 553, -255, -696, -540, 971, 68, -992, -206, 713, 27, -908, -613, 393, 1113, -437, -810, 507, 370, -376, -744, 138, 795, -264, -805, 54, 404, -29, -1237, -317, 888, -57, -855, -66, 456, 256, -632, -818, 416, 909, -672, -583, 636, 525, -379, -538, 89, 523, -274, -810, 122, 484, -35, -510, -396, 399, 148, -825, -180, 500, 241, -699, -571, 438, 472, -524, -278, 184, 508, -136, -556, 387, 672, -246, -725, 387, 485, -151, -613, -255, 729, 290, -648, -266, 355, 294, -428, -429, 441, 641, -402, -455, 585]
1742E85K26j002k61P51K56o64o28J133K91n25q67O80O10k29j179O80R26m74p16
1761d07J0J002m8q12k2R32j86n91l23N42M74o54l33O80M46o04l03P9P59j39q72
1782c70M56N56m95m21l9P69Q7r54N1Q50K71j036L27Q0J40k50n04Q02J93k13q01
1803e01O67N34n41o40L19Q12o66j56j05O91p8m98l36J057k54n70M3M81M40p00
1823ak85L49M11n60J5J14M66j49p23K44O13q8p40J25O03l3m77k34O21L33q11q2
1845b89K06M00n82k97O12M22m88j89K05K66Kn42J44M66k98n00M92K70N0l10k09
1866a69M13j00m01k5M70L7m48l02N96L94k86n42K41M43j00n66K90M90p2q63L95
1887a05K56J25p81L08L80L24o41k39O51j3l12m12L92L94l44j90M19j49j61j30
$$ y = [585, 811, -191, -452, 299, 555, -109, -737, 396, 687, 162, -705, -25, 585, 356, -823, -143, 783, 309, -407, -397, 605, 557, -255, -277, 655, 469, -122, -445, 97, 571, -83, -416, 264, 710, 106, -197, -118, 641, 502, -370, 86, 642, 147, -274, -313, 456, 543, -411, -360, 490, 761, -275, 52, 132, 272, 22, -482, 320, 513, 300, -501, 166, 700, 159, -481, -162, 650, -16, -172, -277, 414, 336, -162, -498, 559, 305, -265, -222, 259, 699, -1, -286, 63, 474, -86, -71, 43, 509, 360, -363, -119, 494, 406, -334, -209, 394, 361, -116, -350, 271, 604, -207, -289, -83, 317, -265, -562, 50, 472, -16, -205, 0, 266, 268, -274, -130, 336, 38, -462, 30, 300, 350, 40, -169, 244, 144, -257, -282, 188, 225, -223, -525, 71, 465, 179, -363, -122, 321, 221, -345, -55, 435, 363, -500, -105, 151, 276, -505, -197, 183, 507, -134, -373, 278, 265, -47, -459, -67, 327, -17, -207, 212, 63, -98, -228]
1907b28L30O3K70j049N68L82j66n30K10K99J92l26m89N81Rj56m93M36M55n68l06
1928e16K85K62J13m09K06J13r1k87R1L24J83l93k67N00j37m91L72K77j6o8m97
1949d46L60K53k05l59L79L82m78k91M50K57j97k99j23L49nk43j64L74K51q5m60
1970c00M31l9j72j38J15L25l25k47R6L61J3o27M13J88k26m07J71N83j39k68J77
1991a5P5L22o66O7L93K68o85j65N58J58m62j40M61M6k42m24L81j65M01l23pL03
2013A39k83O5l14O34R1n56L2N11n43P9j09J34L25l40J9p2J79j07n9N0L98J87o00
2036a40K49L83j12o33P2L82J7l93j53N93k7k22m40M30p0R0k51M17l26M14l08l95
2058d23O95j15k77l10N68j99k52L38P0Q8m51P7L07K50k62k51JM74k44n69L92M91
$$ y = [-228, 102, 165, 435, -614, -46, 336, 170, -360, -150, 149, 341, 15, -474, 107, 116, -40, -533, -97, 358, -210, -516, -231, 31, 144, -265, -59, 54, -37, -324, -233, 91, 274, -119, -386, 114, -23, -514, -142, 135, 119, 51, -446, -86, 167, -38, -397, -18, 364, -114, -405, 45, 302, 105, -194, -317, 32, 27, -216, -380, -6, 245, 160, -300, 131, 92, -80, -218, -103, 222, -103, -350, -254, 107, 120, -507, -94, 94, -132, -539, -368, 215, 76, -192, -15, 60, 382, -284, -217, 176, 444, -241, -406, 152, 310, -152, -292, 169, 215, -27, -451, -70, -235, 166, -157, -164, 139, -144, -79, -393, 241, 332, -224, -192, 319, -224, -145, -254, -120, 205, -135, -116, -188, -9, -116, -175, -125, 273, 460, -140, 109, 492, 380, -253, -181, 201, 218, -175, -328, 265, 238, 16, -424, 6, -64, 26, -225, 192, -134, 280, -28, -423, 272, 157, -120, -430, 138, -61, -313, 25, 95, 183, -268, -191, 116, 366, 104, -147, -146, 328, 84, -485, -93, 398]
2080C98l67k08l9M36k61j31K15J27p1j75J3L34n9m27PL89K01k25m41J80N46o29
2102a87J10L0K13j25j99K15J25j94l02R1M41k27J21j02J80M8l89J61K95l23rK44
2124B17j85K12k84Lj2M76n58q5K48O5j08j2K95l22j09k7j6M81j91k28M1K12L02
2147D15n32k57L69J29L8l40L53L88n79J9J73j5j42J56m28L13M9l06%R1L61k55
2169@j32K4K58k64k06J96J67J15m90J77L30k85q4N9J56K02l40j15L86nj41J01
2191A09J3M6j57j46N6K96l89J85oj91J57n2j23L40N6k71J43q2P4k85J34J56J50
2214B13oj14q1J28q4j02N5o0L6j49L76l7j79m0Q1K34N4n47J97j44J97j84J34L01
2238B79j38k18J26M6l3q6O2J39p1j28j9m7N0mL45l87J31p0l2mK62j75L4k39K82
$$ y = [398, 31, -177, -216, 220, -41, -172, 43, 170, 99, -76, -63, 271, 212, -215, -208, 181, 382, 157, -284, -104, 442, -187, -77, -47, 166, 41, -158, 57, 182, -12, -314, -223, 218, -9, 112, 10, 190, 238, -151, 10, 305, -18, -27, 217, 32, 244, -40, -37, -49, 427, -131, -216, 32, 97, -11, -23, 272, -50, -159, -186, -202, 279, 88, -140, -99, 113, 415, -117, -374, -5, 124, 162, -178, 175, 563, -16, 3, 176, 161, 19, 175, -253, 60, 109, -197, -197, -106, 255, 0, -132, -108, 150, -114, -320, -124, 43, 158, -332, -155, 175, -110, -194, -135, 21, 223, -117, -232, 154, 149, 8, 109, 122, 168, 11, -135, -79, 217, -172, 13, 7, -184, -27, -79, -202, 138, 194, -77, 66, -16, 58, -227, -93, 63, 213, 207, 93, 12, 140, 56, -46, 9, -51, -15, -164, 212, 175, -4, -44, 37, 271, 325, -222, -25, -169, 28, -156, -22, 279, 141, -77, 49, 95, 62, -24, 38, 177, 106, -22, -41, -88, -38, -42, 303, -84, 47, -23, -55, -59, 203, 28, 62, -177, 105]
2263A05p3q6P7J41j18l2m2J98Qm45J74L34j82j53j49O9M72k13m16K05M0L6j91
2286b41P0L67N8k57k54K77N3j60k11M94q2j74pL9J5R4j97J12L8k1j79K2K86j66
2310b4M1PJ62j25K2j88K41j51J15m63K92P0k66J24J30R4J91m10M39m41K05l43
2332b78L25K52l45k85K15J51j8K18n26N25j8m58J53K42J24l04n2k0K95j05j88
2353i7r2J69J1m0OM00k41j99J09QK99k83l5o0L4K8l22M80nk95k7N20l97Oj02J0
2379a15K91k07k4K21j17r1k99L70J61k15K62l87MQ3j21K34P2m8m2m6J6l2R4k16
2403a52L60l42J59J44k76J39O6r9m9J12L8Q5j66N3K97n17J09R4j26O1j80J73J63
2426A46l32K59k57j7L24j44o2L5NJ8J86j89m0q1l38M74n0J57r1J24k6r1O7j16
$$ y = [105, 32, -54, 23, 164, 46, 14, -28, 170, 178, -267, -93, 241, 59, -94, -243, -174, 298, 85, -331, -126, -86, -50, -241, -171, 196, 254, -3, -257, 20, 73, -87, -298, 196, 114, -60, -67, -28, -13, 81, -116, -4, 34, 13, -166, -144, 142, -24, 17, 24, 186, 61, 83, -105, 136, -15, 100, -363, -71, -1, -267, -143, -13, 81, 272, -138, 301, -140, 65, -278, 47, 299, -46, -331, -116, 35, 17, 235, -291, 234, 216, -242, -89, 153, 277, -27, -79, -99, 196, 91, -97, -189, -20, -9, -49, -43, 357, 116, -83, 26, 34, 333, 50, 15, -45, -11, 17, -305, 175, 170, -125, -152, 368, -29, -23, -125, -115, 176, -31, -55, 166, 49, -42, -341, 29, 190, -25, 237, -150, -146, -63, -184, 50, 122, 74, 32, -14, 2, -30, 64, -152, 208, -134, 25, 169, -107, 32, 98, -1, -50, 62, 100, 185, 19, 72, 369, -148, -39, 55, -71, -10, -190, -17, 146, -186, 73, -184, -201, 123, -21, -83, -48, -43, -25, 161, -28, -68, -149, -487, -13, -63, 94, 3, 127, 101, 10, 77, -39]
2450c9L13k39J67j00o2mj36J40l8J06j02K24j25l26P2J42L11l71K16J00l56O6
2472d1j53J5M83l08r1J21J18J6J8l12K71j99K0j10J30L39j46l78K84J0j09J41
2494A19k53m6J53l9j0J08j17J72k36K61n6k20K38k27K70j52N2j82K94Q8j68j05
2516e6L44j81J27k66J58k37M5J14k42R7L3K44j76j49J34m6nM88m03k3q6Q0P1j69
2540a04j53K23l0p9j39J63Qj15J03K86j51J22p1j04Q1m9j22j59N16m38LL24k44
2563a29K29q7Q1l8Jj63J17p3P6k6k15K00J26k32J30Mk0P6n9o0K96L9n48L12l7
2588@l5j47J09K94m51K37J4l43K24J48L4j18K86k85k27J99K10l51L6q9j13L13
2610e5k9j5L8k46M50k43J55R7k89pO1J44l46R2M2J83j04n0J16J82l8j66j39L49
$$ y = [-39, 274, 35, 202, 102, 40, 36, -100, 40, 2, 108, 6, 230, 105, -221, -149, -7, 304, -67, 149, 249, -107, -41, -194, -179, 304, -4, -95, 26, 144, 160, 178, -134, 137, -62, -42, -152, -22, 317, 171, -207, 77, 87, -22, 119, -134, -180, -27, -66, -76, 32, -85, 87, -149, 112, 56, -164, 74, -153, 117, -35, 17, -165, 129, 217, 49, -56, 288, 107, 234, -32, 126, -111, -66, 48, -194, -97, -64, 180, 4, -145, -11, -57, -62, 426, 23, 0, -86, -6, 65, -104, -257, -34, -64, -143, -282, -119, -111, -226, -123, 163, 12, 134, 63, -41, 40, -9, -131, -290, 226, -212, -209, 115, -129, 100, 13, 94, 56, 57, -106, 11, -62, 14, -12, -227, -27, 99, -133, -3, 1, -19, 57, -2, -62, 234, 273, -275, 37, 0, -35, -182, -73, 221, -230, 7, 21, -322, -98, 50, 84, -34, 252, -33, -260, -61, 149, -202, -166, -255, -368, -55, -84, -99, -61, -307, 143, -100, 55, 152, -137, -144, -83, 61, -285, -193, -151, 32, -72, -122, -6, 176, 138, -28, -167, 182]
2634A82o8q4K01m13k6J23j52K93M2k89K37p7J23j09jj54J79N0K00k47J92J57m25
2657f6L38l28J22j19L8J04j94Q6j8j35K42p6j98J13j10J04mL08q5n2j53L6R8k31
2681a80L2K72j27J29k76qJ80J19o5mJ68q6l13o8J90Rl6q9J74J0K52l64J39Lk07
2706a46Q3J97j81K03l97J32J52r1M6J9J6K6nj87R7po1K38k07J28j65M05l04j14
2730a23L1J72k81r5M35q0o4j84J53J76R2k20K2K56o68Q1L84J6R8k25K43m16K90
2753I3K18k63Nj80O1K64j30j32J1J20J46k69J07q8q7L00m76J81K6k27J82M0N0
2776d8mk21L50j27O1M6j56K35rk81J04L02k88q3J58K19j52K1j95K78j35j7l22
2799b64J62K0N3p8J03p9K92k41j02J02J30k3J02K5k35p8J40K01k84j5m6J51j40
$$ y = [182, 114, 30, 231, -182, -208, -85, -237, 56, 98, -191, 46, -31, 92, -17, -18, -172, 7, 57, 257, 10, 202, 359, -66, 272, -56, 66, -53, -15, 89, -105, -19, -37, -172, 70, -6, -204, -91, -201, -97, -101, 207, 122, 70, -83, -47, 51, -180, -148, 124, -3, 126, -150, -158, 22, 141, 76, 72, 240, 154, -159, -227, -37, -28, -64, -153, 21, 31, 283, -81, 58, 61, -146, -63, 134, -47, 156, -241, -109, 43, -48, -2, 17, 33, 59, 54, -133, -36, -43, -104, 134, -73, 55, -110, 295, -9, -123, -92, 80, -201, -296, 139, 59, -5, -189, -36, 140, 232, 12, 34, 290, -378, -297, 87, 103, 201, -24, 219, -197, 93, 311, 48, 53, -127, -66, 198, 68, -64, -53, 67, 213, -56, 51, -37, -124, 176, -300, -119, -93, -320, -138, -98, -48, -52, -273, 77, -50, 11, 57, -99, 136, 127, -154, -50, 252, -36, -119, 39, 258, 106, 127, -68, 210, 75, 58, -264, -102, -82, -29, -107, -4, -83, 209, -32, -134, -32, 98, 75, 177, 202, -33, -111, 29, 230, -54, -69, -115, 36, -104]
2822a04K12j06%m5J75l29K27or8qJ58k92Q9L85m96M76k80j66L47j29j48J31k08
2845b15l6M35j59j18j22p8J44K1m7N1J7j40L21p8J23K20l49j07K04k6p0k08J19
2868i8P1J30n9l3K9L17k74j68p4K43K5j44n7R7j6m5j6J36j96J37j82J97oJ61K2
2893A97m24K38l07M4J72l4j5Q0M8O1j76J91k94j28K55n0K28J19p6j29j49J90j32
2916i1L3Nq7L46m19L04q2j04L54l67P1j6J17j06j7J51jj72p1K95%k96K28k62J34
2941e3M7J65l03J61j21Jr9L27k9J37l93K98k32j7J42k63K7O7L42l83J85p0J64
2964A00j26K16j35k14J39J00j68R4L4j6p9K5j02j43K35K51l32J59qqJ98j08k83
2987a71K26j19K40l74J28Q7p4J38QP7L2j29j91L38k51Mj31J70J61l92J36NL3P2
$$ y = [-104, 108, 2, 2, -43, 132, -197, 30, 24, -74, -82, 76, -216, -127, 258, -238, 238, -42, -208, 139, 10, -138, -7, -215, -251, 184, 25, -93, -215, -293, -149, -128, -175, -124, -107, -247, 74, -4, 119, 339, -10, -117, 87, 61, -9, -217, -98, -27, 103, 44, 11, 40, 357, 83, -85, -159, 84, 109, -35, -92, 5, -11, -56, -72, 64, -132, 5, -177, 20, 14, 175, 197, -227, 11, -296, -252, -80, -114, -129, -49, -1, 60, -116, 75, -219, -347, -92, -142, 86, 205, 129, 0, -149, 41, -91, -58, -53, -140, 206, -213, 91, 9, -95, 259, -108, -37, -53, 64, -42, -59, 92, 91, -81, -152, 143, 143, -153, 75, -187, -53, -6, 159, -144, 17, -104, -103, -202, 125, 96, 233, -160, 138, -94, -111, 31, -232, -205, -138, 204, -179, 6, -64, 100, -26, 190, 55, -159, -20, 80, -88, 6, 40, 24, -55, -30, -132, -275, -40, 211, -121, 38, 30, 22, 220, 112, -171, 55, -64, 176, -198, -70, 17, -57, 81, 89, 166, 198, 69, -122, 216, -35, -31, -162, 8, 169, -223, -87, -82, -49, 23]
3011B3k56J23K11j14Q5o5j7O1o2J98j95k02J85RJ24N9j10l5j18O3j27p4M92n04
3035b46J97J15l7J16j97J41J08l95K12nj38K71J5l04L5J71j13O6M7j7J07m4m2
3058F3K2j02k22J62M3j66m7L29j70J06j18n8K3Q0j23L71lL8k04J73q4k2j01PL30
3083C27m81K48j29j02M08k87M8j95K08K02l33L17k53K6M2j01q9M02j54J0p0k53
3105b09L04j30j39J19J02j58K07o9j22L14k04L2J59k98K99j49N6r1q8J65p9jj24
3128a04J99j75j35L67l3M3M0j17k79K01k13J37Q9J82j70k38Q2m1K15k40M0L19
3150A69j82M9L28k06l19L70j08n0L3j78RJ43J03j10q5j33L27j50l9j78J84o0K30
3173A47k3k69J48j78L08J50j66N9j54j41N2NK53j49j05k10K57JJ19J5k59K28J4
$$ y = [23, -233, -110, 101, -13, 72, 7, -10, 51, -11, 187, -8, -210, -25, -16, 108, 167, 57, 22, -96, -33, -160, -234, 258, -246, -49, 66, 29, 145, -52, 89, 197, -198, 14, 9, -129, 142, 157, -147, -112, 59, -54, 12, 59, 42, 149, 105, 63, 85, -17, -239, -77, -34, -200, -247, 82, -88, 18, -100, -158, -135, -55, -178, 193, 190, 228, 24, 197, 113, 91, -10, -3, 327, -154, 94, -35, -137, 271, -16, 32, -163, 45, 247, -86, 231, -22, 4, 46, -55, -144, 258, 104, 114, 44, -209, 95, -35, -174, -55, 47, -111, 96, 27, -95, 219, 15, 47, 206, -92, 207, 58, 114, 23, -65, 100, 21, 20, -104, 95, -80, -215, 152, 119, 162, 202, 85, -194, 7, -206, -69, 20, 202, 32, -206, -124, -165, 50, -190, -150, 169, -13, 36, 364, 158, -161, 209, 101, 51, 84, -94, -85, 58, 161, 51, -34, -167, 160, 10, -29, -207, -23, -83, 147, 124, -145, 3, -175, 133, 283, 117, 176, 22, -119, -67, -62, 191, 42, -63, -273, -16, -15, 104, 119, -140, 88, 102]
3196A02J10n52L03J19R7j07j20o4L14k39j11J75j74J12k3J10p6j79K30m6J97k26
3218d8Kq1O9N4L07j12k46J78j96q1J10J44n0RQ1p1k39l8K91J51l45J37L0k86L27
3243I7k58O6k27K16P2n3N9j21L16j28j23J28k7p6n0J53J20m2J26j43m94L18M7
3266b4K13k60p0K14j66J87k07J77p3j73jQ5Q3q0K13k32k5L46k71O0j12K14j80
3289h2q0K60J14k08q9K2P5K10l53R5K4K33k21k49L22j41R2On2q8J80j00r8j61
3313b89L47m1J7m6kL9k0J73l69K85o2k54L97k59J40J54k42J70q7K26k48K7J02
3336A58j0Qk31J7q7J93K90m95J70N3r5k3j61J63J38J29l05J57k36J05jM1j3J54
3360A19j73lJ84k18J17J0l3J10l62J84L33m3l61J06mK0J9k9J7K9j44J54o9N1J97
$$ y = [102, 212, -340, -37, 82, 179, 72, -48, -112, 202, -37, -148, 27, -147, -35, -58, 52, -24, -203, 27, -19, 178, -48, -46, -127, -58, -4, 303, 191, -55, 123, -73, -154, -44, 100, 50, 59, 140, 69, -170, -208, 83, 234, -111, 26, 56, -230, 97, -161, -95, -322, -106, -34, -87, -28, -149, 167, 39, -84, 44, 17, -59, -109, 44, 164, 122, 248, 105, -389, -71, -24, 189, -71, -141, 73, -93, 94, -113, 64, -9, -182, -183, -98, -15, -95, 118, -114, -139, 207, -64, -4, -116, 98, -82, -162, 98, 212, 4, -85, -63, 12, 222, -131, -36, -12, 221, 0, -249, 73, -68, 24, 30, -22, -110, 70, -30, -128, -289, 58, 17, 34, -12, -14, 25, 5, 178, -191, 94, 32, -222, 175, -84, 56, 210, -32, 138, 51, 277, 29, 56, 158, 148, 156, -75, -58, -145, 48, 338, -157, 13, 66, -29, -52, -213, -50, 88, 217, -88, 69, -167, -62, -63, -22, -35, 119, -54, -57, 127, -91, 26, 36, 3, 113, -249, -65, 268, 225, -136, -30, -34, -14, 5, -24, -7, 22, -122, 32, -37, 14, 211]
3385B11l19M4K16o1j93J31j4r6J34j09R1M8p9K98j89k47N1K66l96J56j20O5J95
3408H3j03m5K84Kj42j34J37J45k94L72j36L6j67L63k83J7J81r7L4k82J8K50k26
3431A3j79l2N0o3J93p2J26k66J97M0L7k25J14K95l33P5O7m0J16Q5l6k04k74K37
3455g9j03Q0J75J00j18q1j8R5L3k2k67K92O5k77L33k1j10j73K47l31J75p8J22
3478C9M33m22j42k8J86j04R7j52O5o3R1m2j17J12%K55k67q1K54L6k8M4q6k4k13
3503a57K3J55K09j61k10O1P3L1l2j44K96j12Q3k63J63J27j93j70R9J27j50J65
3525B0l9J34m6k49L62k86J21l22K18J41j11o4J61jj41J18k0m4P8N2p4N6k1j04
3549f1L48o07L67N6M6k81j0K35k7o8O2K64m27Q8j70K48Rn1p2M1Q4k01o7K03p7
$$ y = [211, -108, -64, 152, 91, -102, 29, 15, -81, 53, -56, 35, 83, 4, 302, 113, -134, -83, 183, -213, -57, -177, -112, 83, -20, -65, 219, 221, 79, -55, 82, 227, -67, 305, 169, 205, 38, 401, 118, 135, 316, 219, 253, -29, -11, 239, 13, -166, -198, -148, -211, -18, -90, 36, -230, -33, 7, 44, -181, -67, 228, -105, -30, 37, -3, 113, 198, 162, -42, -316, -79, -182, -102, 73, 173, 55, -26, -44, 51, 84, 62, -205, 87, 152, -125, 208, 187, 77, -96, 151, -180, -5, -83, 39, 472, 50, -92, -120, 66, -38, 59, -93, -28, -91, 0, -42, -159, -47, -47, 208, -59, -140, 114, 150, 122, 166, 80, 56, -157, -134, 21, 230, 69, -141, -80, -7, 24, -8, -152, 144, 32, 115, -148, 15, 142, -51, -221, -122, 5, -145, 20, -19, 115, 69, -180, 182, -104, 17, -305, -87, 54, -57, -121, 40, 39, -102, 16, -4, -48, 30, 82, 8, 64, 43, -61, 287, -320, 47, 103, 149, -132, -142, 93, 66, -2, 60, 324, -103, -15, -185, 63, 72, 21, -51, -10, 74, -127, -194, 9, -68]
3574f8J42J67l00J31j22R2J72m93J49N8l4N2m8n9J91M5k93Q8Q9O2j03L3r7L35
3598A89k51J7j25K56J49k28N4k26M1K93q8Qk75J92L0P4j42m7r0l06N89k14k9j22
3622b51M92m32J20P2n9J04o8j39j81K29J07P9L80o51O2N7P2O2o0J73k76L49k48
3645gl71K89J36Q7J18m66J68K42l68J61j58NJ4J58J08j0r2L33j97j09q4J46o4
3668C9j70L26o2J08j29j99J20Lj96J48%k64L14K37J3k89K70l04J06j74j42K10
3690c5M9J08J28j80O4j77O4j71R2M2J16q6Q0j35K16k86J30K62l75k08N23n19Q5
3713b13K47j3Q2L7J8k1j79J0m7K40k04M8K4l46M24k1j95rk93N65j32l1J05O4j97
3738c7M7K05k74K35k61K03r6J25k90K46j68j18Q7O7j43L19k82L17L2k55k21K30
$$ y = [-68, 74, 241, -59, 72, -50, 42, 214, -279, -130, -72, -106, -54, -102, -161, 30, 75, -218, -130, -41, 21, -82, -49, -146, 189, -62, -45, -170, 86, 235, 7, 61, -165, -124, 169, 81, 89, -186, 6, 36, 110, -32, -79, -169, -475, 114, -100, -129, -251, 241, -191, -71, 1, -58, 46, -22, -161, -342, -113, -6, 73, 453, -198, -136, -79, -7, 55, -5, 168, -108, 241, -7, -378, -89, 47, 134, 252, -214, -46, 196, -172, -11, -169, -164, -150, 8, 116, 106, 14, 347, 150, 41, -43, 103, 39, -131, 195, 133, 241, 112, -87, 33, 36, -160, -12, -12, -276, 38, 275, 288, -1, 269, -35, 71, -103, -245, -35, 14, 122, 250, 70, 134, -43, 21, -150, -58, -16, 100, 14, 94, -41, 175, -111, 19, 281, -94, -302, 221, -298, -213, 34, 21, 103, 140, 158, 137, -42, -32, -79, 161, -43, 5, 29, -317, 107, 86, -109, -118, -411, 154, 22, -9, 96, 160, -37, 10, 215, -59, 176, -85, 118, 22, 147, -143, 103, -65, -183, -96, -29, -172, 147, -135, 182, 214, -41, -262, -32]
3760c2J14m28M27J71m32M2K03j4j05J01J11RO3k04j86k8K9N9N2q6J63J9j34K15
3784A29k79J96j20k65L25R5M1k52n7J46q4m0P9j47J82k24M95m76J51K99j45o7
3806a8j05J43o1j9p5m7n0M25l59N13k54j33n0J74k3o5j40M0r8M44l98K51O2m6
3830A11l6J06j6k13J40Nj86kj97J03K03k38K99l34M18j95n1lR0k3K61k56J27Q
3854A21jj68K46k37q2O9L8K45j95K55k37n3j52L20k28J17j57k20L31j5R9r9p0
3877g3j8N9j25k38L40mK6j9m0J7J2J20r0K94m65J38n7J62k6J23N0O5k63J01p2
3902A7j18N8j10J02J34L3j18J24l28J32J32J10J2m21M6L65l70K41m6L38n50K72
3924E5k6n1mo9K17K26m21J3J83j18K21m27K22R0%L0j12J07k99L90k48J75j73J01
$$ y = [-32, 82, -346, 81, 252, -180, -138, 65, 51, -54, 47, 158, 167, 230, 26, -160, -188, -159, -100, -48, -134, 29, 48, -86, 129, -150, 46, -74, -339, -14, 81, 122, -130, -187, -41, -125, -165, -86, -233, -51, -275, 220, -256, -105, 194, 49, -18, -123, 20, -41, -60, -135, -182, -232, 193, -166, 347, 93, -40, -90, 84, 61, -4, -144, -104, -202, 242, -156, 95, 157, 111, 75, 181, 165, -48, 92, 97, -89, -91, -288, -185, 18, -220, 79, -255, 163, -32, -83, -86, 4, -19, 242, -14, 113, 121, 120, -48, 198, -39, -121, -52, -14, 231, 36, 291, 54, 1, -151, 169, -59, 58, -99, -319, 12, -3, 96, -3, -73, -91, -32, -157, -395, -55, -59, -33, -52, -92, -75, -63, 57, -33, 261, -204, -66, -123, 39, 13, 136, 186, 251, -12, 89, 17, -101, -43, -153, -51, 83, 116, -2, 122, -206, -74, 58, 168, 180, -241, -195, 170, -200, 41, -5, 333, -217, 55, 29, -22, -26, -95, 122, 348, -73, -60, 123, 5, 226, -201, 21, 111, 111, 141, 29, 136, -163, 227, -21, 154, -19, 82]
3948H2J03l81O3J46K00m72J38J22J5J56j06k70Q7K37P4m06K96K0k69J32r7j43
3970b73K82o9J0J35k8j9p8j27J76P7J32m63K57lk8q3R8J20l58L84k60j33M28m8
3994A29l07J40J14l54J35K81j43o8J54K12k23Oj10J07m5k7pj92K71j39J8L24q4
4017A92k06j60K04J78k87K5J56k07Q7L26k58j06m8J70M35l92P9q4kl31J93Lj36
4040a69K21J26L2k94l9K36j43J55K25l30Q1k15K16Mo1l87K81K12j77p7K83k45
4062f5K8O7K19k19j42K18o7j58K47k12J31L7j6k85J68J91j13L7k35J67J64L1l64
4085a71K62l31K11J28k82L76K6j99j58L56J47j91l12L51q5j35K52l89J83j16K15
4106A38j00q1K40j58k21R9K03k36M4k7L78J8l72O7J30K34l26k3Q4j03P9J70o7
$$ y = [82, 185, -196, -133, 13, 213, -259, -121, 1, 16, 172, 66, -204, -117, 120, 194, -212, 84, 104, -165, -33, -130, -273, 9, -60, -50, 85, 57, 38, -40, -167, 9, 86, 218, -245, 12, 9, -19, -102, -4, 116, -242, 142, -118, -251, 177, 129, -178, -38, 76, -278, -143, 138, -5, -73, 81, 293, 70, 76, -34, 73, 28, 1, -6, -198, 73, -66, -48, 276, 192, -14, -174, 30, 208, -79, -54, 102, -105, -18, 308, 50, -56, -104, 66, 501, 109, 188, 104, 102, -229, -36, -33, -169, 52, 178, 210, -84, -123, 113, -30, 125, 350, 20, 101, -114, 102, 106, 45, -342, -61, 151, -26, -103, 180, -65, -37, 30, 249, 30, -112, 106, 39, -119, 128, -84, 47, 84, 68, -217, -49, 142, 29, 66, -169, -2, 162, 193, -171, 91, -240, -29, 99, -183, 193, 219, 20, -138, 218, 365, 174, -138, 213, 128, -7, 245, -144, 39, -77, 138, 38, -43, 197, 39, -182, -83, 120, -116, -72, -99, 279, 297, -75, -8, 122, 356, 30, 7, 91, -12, 67, 237, 170]
4129A70j53l63J97K70J04k60PK37n5n06M48K30m49P1j69J93Ok30J4J38k6L15l
4152A86k27J30j29j2m7J29N8J1k98J6j03J47L54l53K63l58k3K11J6j61K46Pm3
4175B0pj55Q8M1K9p9m2k46J39L53k76J88j43O6K30r3l16L62l49R6J73p1M5O1j25
4200a1l9J50j69L77l91l5L26m03k76K91Q1K00J03j72J90k98K27k41J13q6q9r5
4222b47R3L11l54O0J40k40J0N52l15j55J87j34o8P0K6J97Q4k83opK56m19L03j35
4246g4J08n5pL17j03P3l05J13k02j80M39j07o8q5J58o5l4J28J4K51j25j99J21
4269A13j10j24k52L48n3L2j7j79J66p6q5J87M3Km9l0k89K31J25r6m8r7K19N9K49
4294B69k59l14K60N6J44j11q3J23J33k29j09m4J24j4J27l9N2rk0j61K40k38J08
$$ y = [170, 17, -346, -149, 121, 225, -35, -28, 209, 154, -352, 96, 326, -123, -52, -221, -28, -22, -252, -238, -100, -126, 189, 186, -41, 89, -40, -52, -99, 30, 88, 99, -199, -183, -286, -139, 215, -138, 125, -233, -256, -45, -29, -190, 56, 63, 20, 13, -142, -54, -13, 16, -63, -105, -351, -212, 141, -135, 53, -90, -24, 206, 113, -203, 159, -190, -94, 79, 8, 53, 114, -11, -50, 100, -69, 308, -83, -118, 208, -195, -471, -180, -99, 101, 204, 32, 222, -76, 151, -90, 23, -63, -152, -247, -154, 157, -197, -137, 3, -237, -227, 325, 10, -145, 42, -92, -160, -90, -64, 133, 217, -66, -72, -79, 177, -242, 61, -74, 34, -21, -28, 289, 186, 259, -46, 67, -135, -315, 124, 17, -51, -136, 22, -43, -77, 51, 65, 316, 191, -8, 113, 3, -121, -373, -25, -78, -46, -63, -242, -76, -152, -237, -50, -7, -5, -54, -84, -373, -142, -17, -113, -161, -258, -39, 20, 269, 10, -304, -44, 12, 156, 45, -38, 85, 218, -11, -120, -164, -40, -54, 73, 34, 86, 77, 57, -104, 136, -102, 6]
4317Fk86L60n9J12j47j12J9K28o5o0J04nl76L82j47j13K35j35l5N2j11J35mj28
4341a50L13r4j57J4J51o4k8J69l62K23j8J6r1K31l43J47j12K15L4j00J32Q0k39
4364c3J42L9j75l5O3O8m0j0J60j12o3n8M3M2N4k72%L08l98L13k3j73K90j22j22
4389a14K71m01l1M36q5J0j47k74N25k45M3Q4j5J00k32J52%j02o5J96J1j55K74
4412B36j70J40m19O8J58j62q4L6J81P5J0J67j92k67K22j92K98k79L77l56JJ21
4434c1j46K19N1N5L8k12K01k25j47K16K49l88l2J4K20k8o2l1q3m6J25j54L42j38
4458GL3l0nQ7l07L24r2j10K95k03q1J04m2M55j12l03J03j25l4n5J30p4J7Qo4K07
4484A33j42J45J3l75M26KK07k99j58K5R1k44n8K21K2k07N2n5N22l06m2J23l6j15
$$ y = [6, -280, 80, 21, 133, -14, -126, -107, 121, 56, -4, 100, 95, -281, 101, -46, -159, 76, -59, -94, -42, -153, -18, -22, -150, 163, 69, -88, -74, 77, 13, -15, 154, -208, 15, -3, 13, -78, 153, -190, -43, -155, 60, 94, -6, 126, 206, -33, 109, 148, -27, -62, 1, 69, 29, 19, 179, 67, 4, -54, -11, 31, 85, -187, -187, 121, -277, 36, 13, -160, 130, 8, -114, 157, -244, -275, 161, 76, 86, -61, -335, 190, -55, -12, 72, 57, 157, -75, 77, 77, -25, -90, 106, 117, -38, 236, 66, 206, -213, -145, 13, -149, -233, -197, -16, 59, 69, 236, 44, -223, -1, -193, 105, -174, 203, -153, -152, -31, -177, 42, 93, 148, 186, -26, 175, -50, -197, 19, 268, -120, -152, -138, 82, 54, -8, -39, -122, -168, -43, -197, 145, 7, 40, 10, 5, 92, -215, 109, 17, -93, 202, -1, -82, 22, -20, 435, 323, 20, 123, -2, -36, -91, 39, -35, -18, -10, -74, 133, -9, 136, 149, -226, 200, 202, 409, 110, -48, -23, 68, -176, -234, -13, 9, -198, -146, -201, 321, 15, -27, 96, 60, -55]
4508e5o6J20M1k62J60O1J77k33j05K25m09N77l46k8KK43J24l14Q7j81K2J78n0
4531c2J08l4j36j3M2j28N6K88j28k0L77k91o7K58k50j82N1K05p0J7pJ0o0K28j89
4556C3J40p8O0k81Q1m3q4J01K58j20j7J5m0j39J99K4j64j2J48J09L7k23K05j27
4580H2j02L94n24j0J91n0j52J67o3N8l4j09J56r5K74m13N5K54j41O1J85j9q4l35
4604b54N17m26j6K34K9j47M8q2K54%k99Q8J65o6%j37p0j6r0L57N3J2k8j18o4J26
4630G0j41j25M44m71K66j03j76M01l17J99K54m87L02P5k70n7K36j42kJ24Q2M0
4652B02l00LJ2J36RL9N6k17Qj4K10j31J26j83L7J72pk78J92P2o8k88L71n28L60
4677iP7nq9K5j2L5l3q9L14k18Q7n2j06r8J4K52L5k95K84j04r1R5K08k65j1Q9K72
$$ y = [-55, -121, -1, 40, -222, -62, -1, 176, -57, -162, 63, -346, 231, -115, -143, -141, 102, 226, -88, -1, -182, -160, 18, -32, 76, 42, -94, -107, -65, -193, -137, 151, 23, 3, 380, 89, 22, 280, 30, -152, -101, 104, 34, 51, 44, 54, -6, 222, 33, 173, 95, 155, -126, -45, -88, -172, -71, 187, 67, 50, 65, 25, -114, 85, 109, -55, -67, 81, 190, 227, 4, 209, 82, -20, 374, -150, -160, 31, -19, -171, -4, -67, -9, -43, -152, 4, -91, 183, -230, -175, 79, -62, -1, 184, 165, 81, -254, 263, -163, -179, 55, 84, -63, -15, -97, 157, 157, -142, -54, 111, 45, 45, -92, -162, -178, -268, 89, 142, 154, 126, 8, -56, 70, -71, -196, 248, -223, 43, -60, -236, 165, -152, 47, 301, -186, 116, 191, -79, -136, 100, -42, -44, 80, 162, 202, -98, -95, -83, 53, 62, 101, 157, -60, -52, -66, 144, 13, 139, -44, -7, 165, 158, -120, 72, 144, 76, -212, 159, -369, -9, 68, 63, -26, -1, -13, 22, -11, -100, 214, -4, 83, 31, -75, -173, -159, 93, 128, -167, 117, 13, -78, 17, 225, -40, -51, 38, 310]
4704C10k83m1L3j48J54j75K79j34R7J36j28n9l59J70J84m1k8k4Q5J48k68J79m7
4727D0K1K5M9j58o0J96L5l54L50k1j61mJ91m0L9Nk56J15O2k08j89J95K78p0O7
4752A47j64Lj42N7J24j61j4J35J49k03J07P3k84L40j24O3j38NL8k2K91k90j07
4775a17L90k81K3K75k04k5Q7qQ7l84Q1R6j14j05K50J5l15K66L7k9r8j2K04l32
4799b13L7L03O1k25p0j41J28M28k67M9j72k4J12k02L54j92o0J54j04n2n7Q2o0
4822a31J41j96J65p3L8K57l43J32q6l1K84j59o1J4J63j50l5n7O0J29L1j80k47
4845c35K84p6J4J24n1o7L5J55j79O5n5J78k83O5L2R6K9k96L78m29K65PO8mK2P5
4871A17j51o5L80j65L6k11j18K53J3M0k56L52n47K71l1j50L43j9j82J0o2lK22
$$ y = [310, 27, -14, 19, -129, 25, -150, 129, -5, 92, 228, 100, 41, -318, -148, 36, -5, -33, -57, 28, 176, -92, 87, 40, 61, 86, 135, -23, -83, 113, 148, -206, 144, 123, -38, -42, 149, 109, 148, 153, -103, 12, 74, -134, -323, -128, 150, 80, 147, -17, -14, -156, -99, 25, -136, -150, -15, 134, -69, 38, 111, -173, 167, 43, 106, -32, -27, 11, -11, 280, -10, -117, 273, -8, 15, 290, 86, 61, 148, 140, 227, -157, -76, 20, -94, -199, 51, 66, -249, 17, 54, 25, -73, -85, 119, -213, -176, 127, 188, -37, -107, -248, -120, 308, 41, 90, -82, -106, 6, -196, 158, -34, -94, 60, -44, -96, -153, -71, -131, 10, -186, -21, -94, -56, 201, -142, -10, -96, -127, 157, -2, -63, -49, 114, -36, -71, -128, -68, 61, 92, -88, -335, -51, -127, -113, 11, -40, -107, -72, 83, -96, -31, -86, 92, -191, -126, -94, 2, 31, -265, 113, -316, -51, -44, 24, 20, 42, 117, -34, -99, 281, 116, 152, -59, -177, 76, 89, 129, -127, 225, -322, -51, -82, -232, 111, 92, -90, -80, -142, -145, 77]
4894G7o7k0j69j64P7K09q9QJ68J49K2j45k01K52l14J88p2J74j55L6Q4k38L43k27
4918g4j10J82J94j89O9j39M11k11k74J30J35jp7K8N5j8k21N16k95l9p6j7K6l0
4942b5l9J18j09J80q2l14L14l0J3m3L9Q3J11k98J11PQ8j82K33q6k93K84l9J07
4966A48j55k7J31k34J72j1NM9j18O9l3l35K44n9K02p0J98l02J50K00m18L54m1
4989A19R5k85Lj95L85m88L64l0m9K14l6n5n4J40k67K46n5o1m1K1n8r9M18k83K67
5014B16k26j54J17K49k09j97L19J08k34m1K51n13J60J64k1J15r5L78k02l58L1
5035a42M03j98J19j80k69J64n4L45k03J5L68n09K36k53L13p9k88J32J82q3J80
5056A99k20J05j17k9j27J54j33N0J99%j13L8j64J49n9j99M06j15J0J99j83j45
$$ y = [77, 10, -10, -179, -343, -266, -57, -146, -138, 30, 179, 201, 56, -145, 107, -207, -19, -91, 83, -72, -36, 48, -190, 153, -74, -184, -2, 192, 3, 72, -67, 344, 133, -141, -11, 124, 123, 46, 74, 129, 111, -110, 406, 111, 72, -4, -21, 5, -25, -64, 54, -55, 125, 43, -271, 43, 13, 26, -17, 22, 105, 216, -82, 29, 36, 124, -58, 175, 89, -204, 80, 41, 148, -7, -34, 97, -137, 35, 24, 29, 78, -40, 29, -4, -339, -95, -154, 48, -22, 176, -126, 24, 224, -194, 160, 119, 214, -71, -68, -263, 122, -366, -2, -32, -81, 133, 97, 42, -12, 128, -139, 107, 52, -9, -50, -29, -87, -186, 232, -51, 216, -10, -164, -47, 202, -7, -204, 115, 223, -11, -52, 199, -314, -154, 10, -11, 104, 9, 387, 185, -173, -142, 261, 63, 182, 2, -267, -103, -157, 188, -15, 0, 368, -141, 95, -158, 155, 76, -212, -80, 102, 19, 199, -21, 84, -33, -62, -189, -35, -168, -118, 81, 81, -32, 6, -158, -9, -68, -267, 139, 24, 34, 233, 50, -95]
5078i5J01R4j01K90k54J31j53J33J69m58R2n4q2K24L4k17K60l51K12M5J71k35
5100d4p7J24k9j1j78R6N5nL23j91m4j89M59m24n9J39J42r7j23K4QJ52kP0l12K08
5126A5J93n25L91r3Q0j08j41N6J62LK4l5n5K5J87j09m8M9J98k45j27J76p6J2N0
5151E9j59J40j69J83P1l81N74l48J32k3j19J86k1k75P4k65J72LK44n6O1j10R4
5174F7l22P7j31J69J78j2P3q7qJ3k92L44P1k08J33K40l16j19L12r5n4r5J03k3
5198A8k23M2K77R1L2k57L3j03j9K0j7J61r5L42l44K31m8J43k28K41l97J21J78
5221A99k38J05j97PK24m2j65L43l08R4qJ82r1O5k32O7j26Q9K34l27J05J17j70
5244g3J67k1m3O0J95m88K16L3l51J77K91n3l72L50L7j34r2J01L61j56k61n3K25
$$ y = [-95, 6, 100, -1, 289, 35, 166, 13, 146, 315, -143, -51, -105, -187, 37, 71, -146, 114, -237, -25, 20, 191, -44, -121, 3, -26, -37, -215, -119, -64, -69, 254, 63, 19, -170, 289, -135, -194, -55, 87, -10, -133, -109, -101, 51, 49, 119, -193, 15, 208, -317, 74, -19, 61, -47, -188, -132, 30, 33, 57, 22, -33, -8, 179, 70, 22, 71, 269, 24, -103, 73, -3, 9, 59, -100, 40, -129, 54, 125, -256, 318, -30, 102, 79, -40, 146, 125, -150, -76, -341, -169, -166, 78, 22, 83, -27, 67, -255, -178, -309, -140, 38, 26, 99, 12, 4, 17, -275, 69, 140, -68, 65, 305, -11, -130, 182, 87, 33, -62, 41, 18, -205, -163, 114, 205, 237, -20, 13, -90, -109, -89, -106, 55, -40, 302, -42, 189, 141, 284, 56, 297, -100, 21, 199, -39, 66, -131, -124, 100, 58, -107, 236, -72, 22, 14, 196, 105, 170, -62, 5, -121, -32, 202, -125, -20, 97, -73, 94, 73, 30, 90, 285, -203, 13, 46, -305, -128, 163, 110, -262, 88, 125, -9, -101, 0, 361, 205, -56, -109, 116]
5267A16m62J30J63k5o1K48j82J05q4qRk8J99n6K9j27n7L44p8j87J60o8J5j67k1
5292i3j35L22k80M8L02j88J00l7O8j54J00J32k8k73J96k70J42N6J26r8r7P2J81
5315A92p1k48K39j20N0N9k16J05M9J17j26j07R3N6o5J31j47P0q3k8J29n4j06o0
5339a41K2L2J25Q3Rj61n3K5j4O3l78O71l28j88K54K3P8l72L63rj43q9k4L25l84
5364b11K34M5nJ35k15k55L62p9p6O2N3r8L5Q3j28J4j65K92j05Q5J21k11J22P1
5388A66j69KJ66j35j79n5M36j06j53o1J78j33j50o9J60N8K7N8p4q4K10l46J00
5411a53J51N0Pj0j1Qk55K78j03J19r8K19k15J68q8m4K5j53J98J12Kj91P9j05L10
5436C00m70j13L23P6M9l83K15J40J28k33J41j56j67K7J17J20r9j70J25j6k5J08
$$ y = [116, -346, -216, -53, -78, -139, 109, -73, 32, -52, -60, -51, -79, 120, 64, 93, -34, -91, 253, 175, -12, 148, 80, 95, -72, -93, -228, 94, -186, -138, 164, -24, 76, 39, 107, -47, 53, 185, 157, -116, 80, -190, -48, 8, 134, 36, -61, 11, 192, 121, -127, 112, -8, 42, 101, -115, -10, 39, 156, 30, -77, 16, 72, 7, 138, -9, 61, -22, -50, 79, 25, -81, -141, -119, -87, 38, 121, 130, -31, -84, -59, -73, -10, -388, 283, -45, -233, 21, 44, 122, -250, 113, 104, -39, -128, -152, 173, -211, 23, 68, 63, 198, -17, -272, 90, 11, -65, -3, 50, -48, -13, 70, -58, -44, -209, 83, -22, 63, 184, -27, 95, 166, -3, -1, 165, 30, -149, -204, 232, 126, -27, -88, 90, -43, -193, -262, -102, -44, -17, 41, -33, -117, 93, -253, -153, -2, 48, 55, 45, 34, 42, -213, 65, -38, 81, -17, 202, -13, 155, 67, 23, 48, -105, 93, 205, 207, 16, 95, -10, 300, -170, -283, 40, 116, 165, -218, -3, 137, 265, 32, 173, 17, -150, -123, -6, 114, 15, -155, -30, -46, -71, 37]
5458C7O6j17k51L14n9l2J80j27j3j20J55J46o7k36L01k53j1p1L28l35J27J92l25
$$ y = [37, 103, -14, -265, 49, -10, -42, 138, 11, -2, -122, 33, 179, 112, -124, 177, -76, -87, -158, 170, -165, -38, 154, -171]
$$ [...]
8191D
##END NTUPLES=NMR FID
##END=
