##TITLE=1H_DE-54_1
 D2O
 8 sc, 
 1.7.2024
##JCAMPDX= 6.0         $$ Bruker NMR JCAMP-DX V2.0
##DATA TYPE= NMR FID
##DATA CLASS= NTUPLES
##ORIGIN= UXNMR, Bruker Analytische Messtechnik GmbH
##OWNER= root
$$ XWIN-NMR		Version 3.5
$$ Mon Jul  1 13:51:30 2024 Russian Standard Time (UT+4h)  she@DPX200
##.OBSERVE FREQUENCY= 200.1313
##.OBSERVE NUCLEUS= ^1H
##.DELAY= (6, 6)
##.ACQUISITION MODE= SIMULTANEOUS
##.ACQUISITION SCHEME= undefined
##.AVERAGES= 8
##.DIGITISER RES= 18
##SPECTROMETER/DATA SYSTEM= spect
##.PULSE SEQUENCE= zg30
##.SOLVENT NAME= D2O
##.SHIFT REFERENCE= (INTERNAL, D2O, 0, 15.7039)
##AUDIT TRAIL= $$ (NUMBER, WHEN, WHO, WHERE, WHAT)
$$ ##TITLE= Audit trail, XWIN-NMR		Version 3.5
$$ ##JCAMPDX= 5.01
$$ ##ORIGIN= Bruker BioSpin GmbH
$$ ##OWNER= she
$$ F:/spectra/data/she/nmr/H-F/1/audita.txt
$$ ##AUDIT TRAIL=  $$ (NUMBER, WHEN, WHO, WHERE, WHAT)
(   1,<2024-07-01 13:50:24.81 +0400>,<she>,<DPX200>,
      <created by zg, POWCHK disabled, PULCHK disabled
       configuration hash MD5:
       00 E9 B6 7A A2 85 ED C7 34 08 36 98 17 FE 4E 26
       data hash MD5: 16K
       F2 0B 29 6A FA 27 7D 85 BA 46 7B B9 D9 32 87 19>)
$$ ##END=
$$ 
$$ hash MD5
$$ 21 D5 4C B5 F9 49 74 8C 59 48 3A 4A A9 92 70 C2
##$RELAX= 
##$RELAX= 
##$RELAX= 
##$RELAX= 
##$RELAX= 
##$RELAX= 
$$ Bruker specific parameters
$$ --------------------------
##$DU= <F:/spectra>
##$EXPNO= 1
##$NAME= <H-F>
##$PROCNO= 1
##$TYPE= <nmr>
##$USER= <she>
##$AMP= (0..31)
100 100 100 100 100 100 100 100 100 100 100 100 100 100 100 100 100 100 
100 100 100 100 100 100 100 100 100 100 100 100 100 100 
##$AQSEQ= 0
##$AQ_mod= 1
##$AUNM= <au_zg>
##$AUTOPOS= <>
##$BF1= 200.13
##$BF2= 200.13
##$BF3= 200.13
##$BF4= 200.13
##$BF5= 200.13
##$BF6= 200.13
##$BF7= 200.13
##$BF8= 200.13
##$BYTORDA= 1
##$CFDGTYP= 0
##$CFRGTYP= 5
##$CHEMSTR= <none>
##$CNST= (0..31)
1 1 145 1 1 1 1 1 1 1 1 1 1 1 1 1 1 1 1 1 1 1 1 1 1 1 1 1 1 1 1 1 
##$CPDPRG= <>
##$CPDPRG1= <>
##$CPDPRG2= <>
##$CPDPRG3= <>
##$CPDPRG4= <mlev>
##$CPDPRG5= <mlev>
##$CPDPRG6= <mlev>
##$CPDPRG7= <mlev>
##$CPDPRG8= <mlev>
##$CPDPRGB= <>
##$CPDPRGT= <>
##$D= (0..31)
0 1.2 0 0 0 0 0 0 0 0.06 0 0.03 0 0 0 0 0.0002 0 0 0 0 0 0 0 0 0 0 0 0 
0 0 0 
##$DATE= 1719827424
##$DBL= (0..7)
120 120 120 120 120 120 120 120 
##$DBP= (0..7)
150 150 150 150 150 150 150 150 
##$DBP07= 0
##$DBPNAM0= <>
##$DBPNAM1= <>
##$DBPNAM2= <>
##$DBPNAM3= <>
##$DBPNAM4= <>
##$DBPNAM5= <>
##$DBPNAM6= <>
##$DBPNAM7= <>
##$DBPOAL= (0..7)
0.5 0.5 0.5 0.5 0.5 0.5 0.5 0.5 
##$DBPOFFS= (0..7)
0 0 0 0 0 0 0 0 
##$DE= 6
##$DECBNUC= <off>
##$DECIM= 32
##$DECNUC= <off>
##$DECSTAT= 4
##$DIGMOD= 1
##$DIGTYP= 9
##$DL= (0..7)
0 120 120 120 120 120 120 120 
##$DP= (0..7)
150 150 150 150 150 150 150 150 
##$DP07= 0
##$DPNAME0= <>
##$DPNAME1= <>
##$DPNAME2= <>
##$DPNAME3= <>
##$DPNAME4= <>
##$DPNAME5= <>
##$DPNAME6= <>
##$DPNAME7= <>
##$DPOAL= (0..7)
0.5 0.5 0.5 0.5 0.5 0.5 0.5 0.5 
##$DPOFFS= (0..7)
0 0 0 0 0 0 0 0 
##$DQDMODE= 0
##$DR= 18
##$DS= 0
##$DSLIST= <SSSSSSSSSSSSSSS>
##$DSPFIRM= 0
$$ [...]
##$SUBNAM2= <"">
##$SUBNAM3= <"">
##$SUBNAM4= <"">
##$SUBNAM5= <"">
##$SUBNAM6= <"">
##$SUBNAM7= <"">
##$SUBNAM8= <"">
##$SUBNAM9= <"">
##$SW= 18.0517328524113
##$SWIBOX= (0..15)
0 0 2 0 0 0 0 0 0 0 0 0 0 0 0 0 
##$SW_h= 3612.71676300578
##$TD= 16384
##$TD0= 1
##$TE= 0
##$TE2= 300
##$TE3= 300
##$TEG= 300
##$TL= (0..7)
0 120 120 120 120 120 120 120 
##$TP= (0..7)
150 150 150 150 150 150 150 150 
##$TP07= 0
##$TPNAME0= <>
##$TPNAME1= <>
##$TPNAME2= <>
##$TPNAME3= <>
##$TPNAME4= <>
##$TPNAME5= <>
##$TPNAME6= <>
##$TPNAME7= <>
##$TPOAL= (0..7)
0.5 0.5 0.5 0.5 0.5 0.5 0.5 0.5 
##$TPOFFS= (0..7)
0 0 0 0 0 0 0 0 
##$TUNHIN= 0
##$TUNHOUT= 0
##$TUNXOUT= 0
##$USERA1= <user>
##$USERA2= <user>
##$USERA3= <user>
##$USERA4= <user>
##$USERA5= <user>
##$V9= 5
##$VALIST= <valist>
##$VCLIST= <CCCCCCCCCCCCCCC>
##$VD= 0
##$VDLIST= <DDDDDDDDDDDDDDD>
##$VPLIST= <PPPPPPPPPPPPPPP>
##$VTLIST= <TTTTTTTTTTTTTTT>
##$WBST= 1024
##$WBSW= 4
##$XGAIN= (0..3)
0 0 0 0 
##$XL= 0
##$YL= 0
##$YMAX_a= 303777
##$YMIN_a= -366966
##$ZGOPTNS= <>
##$ZL1= 120
##$ZL2= 120
##$ZL3= 120
##$ZL4= 120
##$ABSF1= 10
##$ABSF2= 0
##$ABSG= 5
##$ABSL= 3
##$ALPHA= 0
##$AQORDER= 0
##$ASSFAC= 0
##$ASSFACI= 0
##$ASSFACX= 0
##$ASSWID= 0
##$AUNMP= <proc_1d>
##$AZFE= 0.1
##$AZFW= 0.1
##$BCFW= 1
##$BC_mod= 2
##$BYTORDP= 1
##$COROFFS= 0
##$CY= 11.3945322036743
##$DATMOD= 1
##$DC= 2
##$DFILT= <>
##$DTYPP= 0
##$F1P= 15.6554695791079
##$F2P= 12.8336369535428
##$FCOR= 0.5
##$FTSIZE= 0
##$FT_mod= 4
##$GAMMA= 1
##$GB= 0.15
##$INTBC= 1
##$INTSCL= 1
##$ISEN= 128
##$LB= 0.24
##$LEV0= 0
##$LPBIN= 0
##$MAXI= 10000
##$MC2= 0
##$MEAN= 0
##$ME_mod= 0
##$MI= 1.114404
##$NCOEF= 0
##$NC_proc= 0
##$NLEV= 6
##$NOISF1= 3.799351
##$NOISF2= 2.8
##$NSP= 1
##$NTH_PI= 0
##$NZP= 0
##$OFFSET= 15.70392
##$PC= 1
##$PHC0= -25321.55
##$PHC1= 12.58748
##$PH_mod= 1
##$PKNL= yes
##$PPARMOD= 0
##$PSCAL= 0
##$PSIGN= 0
##$REVERSE= no
##$SF= 200.130013532006
##$SI= 16384
##$SIGF1= 3
##$SIGF2= 2
##$SINO= 400
##$SIOLD= 16384
##$SREGLST= <1H.CDCl3>
##$SSB= 0
##$STSI= 0
##$STSR= 0
##$SW_p= 3612.71676300578
##$SYMM= 0
##$S_DEV= 0
##$TDeff= 0
##$TDoff= 0
##$TI= <>
##$TILT= no
##$TM1= 0
##$TM2= 0
##$TOPLEV= 0
##$USERP1= <user>
##$USERP2= <user>
##$USERP3= <user>
##$USERP4= <user>
##$USERP5= <user>
##$WDW= 1
##$XDIM= 8192
##$YMAX_p= 0
##$YMIN_p= 0
$$ End of Bruker specific parameters
$$ ---------------------------------
##NTUPLES= NMR FID
##VAR_NAME=  TIME,          FID/REAL,        FID/IMAG
##SYMBOL=    X,             R,               I
##VAR_TYPE=  INDEPENDENT,   DEPENDENT,       DEPENDENT
##VAR_FORM=  AFFN,          ASDF,            ASDF
##VAR_DIM=   8192,          8192,            8192
##UNITS=     SECONDS,       ARBITRARY UNITS, ARBITRARY UNITS
##FACTOR=    0.0002768,     1,               1
##FIRST=     0,             0,               0
##LAST=      2.2672688,     0,               0
##MIN=       0,             -366966,         0
##MAX=       2.2672688,     303777,          0
$$ Real data points
##PAGE= N=1
##DATA TABLE= (X++(R..R)), XYDATA
$$ [...]
2078D12P26P09l38r94j167o44l94j20J474P02R70L78k17o94j391r90j51J93M95
2097a041J332Q48O81k84j026r33n98o33K09P55J043O13N92J49o83r97j304k76
2115a553j34O71R47R75N55K47p49q85j078p66J08O49J001Q23R75R6r75q76p41
2134g10m72j48N32L69J162N98M80o67j013j030p32J49J94P39J268P74K91m07q76
2153E01j222q17n3P17L60J062Q75L9o8q91j090o13n10L59J117R71N88n0J11j018
2173C68q44r53R0K03Q27J114M17M59k84q79p37j237k60J83P30J011J182J67q6
2192A471m93r75j146n59J58M89J392O05K62M09n80j347p27m13j27Q36P13J021
2210I89O47k71k18j145j126n30J20N05R90R65L72J83j44j352j261n0m17O69R01
$$ plain form
2078 412 1138 1847 1509 515 -652 -1296 -1690 -1810 -336 366 1336 1714 1497 803 -588 -1578 -1729 -1536 -1041
2097 -1041 291 1139 1820 1536 510 -423 -1021 -1654 -1445 -690 353 966 1558 1707 1024 27 -1277 -1553
2115 -1553 -1687 -1016 -69 906 1461 1708 959 74 -1004 -1770 -1662 -1013 -12 811 1786 1882 907 31 -710
2134 -710 -1182 -1330 -798 -429 733 1331 1811 1144 131 -899 -1631 -1482 -1288 -549 719 1493 1784 1377 501
2153 501 -721 -1538 -1591 -874 -514 548 1423 1462 1394 503 -587 -1200 -1710 -1351 -234 737 1325 1275 1386 368
2173 368 -476 -1429 -1339 -1136 -309 805 1222 1681 1397 518 -219 -1456 -1716 -1533 -803 208 1390 1557 1471
2192 1471 978 3 -1143 -1702 -1544 -1055 337 942 1204 1613 1033 -314 -1041 -1454 -1581 -745 -32 989
2210 989 1636 1365 1147 2 -1124 -1654 -1534 -1029 -39 926 1298 1481 1337 -15 -1276 -1326 -1743 -1074 -173
2229a73J057Q23k48k79r35j028o46q2M17Q18R16O27M28o56o09j166m75o51N81
2248a281Q69J267N22K43p74l32j136o11l36J24J017R78R16l6k38o08r06q73k65
2267a460K21R28M23Q64O36k16q37q73p40l71K34O84N11J148M70n23m20p35j340
2286a396J47k99P36R79Q80O87k05o55j028p55o42O8M49J011P95L07L34p57p59
2305a03o11q86J78M70P24J091M65K30m63j011r93m95J49K78O16J332K58J08k22
2324A115q30q65o97J48nO95J230M77J99m12p51j013o98N9K22Q92P63R04L4j62
2344A305o69j257n09m59L41R72P10P69J27J0q21j076p21k74L83M54Q42J079J19
2363A325j2q46o73r55l25M33K41J142R28L01m11l61o94j404j03L54K52R37P99
$$ plain form
2229 -173 884 1707 1459 1180 245 -783 -1429 -1511 -1094 -276 640 1267 1695 1039 430 -736 -1211 -1862 -1281
2248 -1281 -412 855 1377 1620 846 514 -622 -1233 -1569 -1445 -428 550 1466 1430 1192 584 -322 -1195 -1460
2267 -1460 -1239 -311 112 976 1612 1396 559 -314 -1054 -1425 -1191 -507 4 1152 1622 1099 679 -56 -1396
2286 -1396 -1249 -1548 -812 167 1047 1734 1529 874 -154 -909 -1551 -1483 -1034 -23 772 1079 1413 656 -103
2305 -103 -714 -1600 -1422 -952 -228 863 1328 1558 1095 84 -909 -1404 -1255 -977 -361 971 1229 1337 1115
2324 1115 285 -580 -1277 -1129 -1134 -439 791 1268 1467 1055 304 -709 -1407 -1348 -1126 -234 529 1433 1467 1305
2344 1305 636 -621 -1130 -1589 -1248 -276 434 1203 1330 1340 519 -557 -1278 -1552 -1169 -715 127 1206 1325
2363 1325 1313 467 -206 -1161 -1486 -1053 -812 330 1258 1559 1148 787 93 -1311 -1414 -1060 -808 129 928
2382I28K88k1n16o30q73o21K93N71N77P01N76J18n85r69o70n98K36K01J059P18
2402G83O53j35m62o66q65p32j5M55P29Q99O62m7q6q76r67n37l84N42Q86Q57M71
2423A165J55j79r80p81n89l29O61N38Q28P65K2o4j074p27k34m92o1J096N07O42
2443H69Q24m64m51j278q19m76O78L42J262N59M02j20q92q67m77o23K52P76R48
2462D45M12Q14m23p13m80j137j47j00M13Q58J151M40k98j03j179o25p63K09M26
2481h00R06Q77N54qm90j064q17o74K05K92R49N87P47k24j98q11r53k18k52K59
2501a133Q87Q71O43m5k52o36r62m42m72N39P26R57J88M02Rr78q92m16n00M91P31
2522b84P85Q54K3k92q68o62n76l56O09N62N12O06M05l54l26j025p02l65M14N66
$$ plain form
2382 928 1216 1195 679 49 -824 -1445 -1152 -581 -4 697 1273 1391 806 -163 -833 -1431 -1195 -994 65 783
2402 783 1436 1301 839 173 -692 -1424 -1439 -984 -255 644 1306 1259 1173 297 -670 -1207 -1591 -1049 -163 694 1165
2423 1165 1320 1141 161 -620 -1209 -1538 -877 -339 489 1254 1276 1212 138 -589 -823 -1315 -1376 -280 227 869
2443 869 1693 1229 778 -500 -1319 -1795 -1117 -775 487 1046 1448 1328 436 -431 -908 -1531 -1279 -503 445
2462 445 857 1671 1248 535 55 -1082 -1229 -1329 -916 -58 1093 1533 1235 1132 -47 -672 -1435 -1226 -800
2481 -800 106 983 1537 1529 1039 -25 -842 -1516 -1311 -1019 -70 517 1264 1040 842 31 -922 -1140 -1392 -1133
2501 -1133 -246 625 1268 1223 971 335 -627 -1069 -1541 -1002 -276 681 869 1271 1280 302 -590 -1006 -1506 -1015 -284
2522 -284 501 1355 1378 1086 218 -444 -1020 -1376 -767 -205 307 913 1318 964 638 -387 -1089 -1454 -1040 -474
2542d74O62P08L74j73l69j287l45o67M50P31R10M42Q0J80n73j091l98m82L9Q49
2562d34K36R94L50n6k98q04j115k5L2N70O28O89N15J10m23p83p91n18q9L29R39
2583E6O94L89K68p91o37q24p57N56L9P91J095L89m1o27o13n60m14k09J42R55O78
2604E79L87J51k7r07p85l14k79M29M84Q39N14J56l72n78n77p76k81M40O91P31
2624E05M53K31j09r01m02j008Mj8N21J073K05P90m54m22q49m42l65K78O39N91
2644C20O03L52k13n26o79p29m80L22K86Q43P76L27l11m04l89r91l76L1M32Q40
2664C4P50K03J36l38q19p09l17L0K62O96O62N77j68j37p51o62n05j18L05Q77P22
2685G30N22j81k19o63o49l34m92O41N69N81Q03m51O3p55p30m55j67K27O53P87
$$ plain form
2542 -474 188 896 1270 1097 728 -559 -904 -1571 -1121 -390 520 962 1042 1222 649 -442 -840 -1322 -1283 -434
2562 -434 -198 796 1146 1090 792 -12 -1127 -1152 -1120 -550 78 767 1282 1392 969 186 -605 -1123 -1212 -883 56
2583 56 750 1139 1407 616 -21 -845 -1602 -1046 -1007 -216 879 1268 1227 600 -13 -573 -987 -1196 -1054 -99 579
2604 579 966 1117 1090 183 -602 -916 -1195 -766 -282 557 1071 1227 855 277 -300 -1076 -1357 -917 -226 505
2624 505 958 1189 1080 179 -223 -1231 -1227 -1245 -724 349 554 1344 890 468 -381 -823 -1188 -910 -271 320
2644 320 923 1275 1062 536 -143 -872 -1352 -1030 -744 99 875 1202 891 487 98 -893 -1269 -1238 -806 34
2664 34 784 987 1123 785 -34 -743 -1060 -1030 -768 -72 590 1167 999 862 111 -551 -1056 -1174 -869 8 730
2685 730 1252 1071 852 189 -460 -794 -1286 -645 -76 505 1308 857 920 165 -565 -1020 -1187 -960 -307 480
2705D80K73M24l54m91p73o10J19K16L69Q46L14M05l79m82p32l87n89L26Q66M22
2725B63N30L19j97p23n86o09k97K89O01M70P33L36k8n72o49l71m91j33N69M40
2745a06O98Q51n49m12o15o53j68k13M69P55N65O59m37j74p16m39p94j38R61N66
2765A10M82L69P1j41p10p30l30j58N82L79O39M59o3j74p15o64m10k76N75P08L46
2786C49O94J5l87l79o51o90J52J27O42M88L76J46m33n4j013o2n56K78O55P45L15
2807G57Q0M8m84r31j38o53N10P29L55M91J60J05o76o10o93J56K6L37N38R14N6
2828A077l23k65o69m98n45O44L18K34Q23j8m0k01o16n74k02j73L61Q15N44M18
2848A110k85l49l66o59l22K0M04N97M71J12K24m41m44n87k35j46M48M91N77M66
$$ plain form
2705 480 753 1177 823 332 -441 -1051 -932 -716 -347 499 813 1218 839 357 -375 -762 -1351 -1025 -159 263
2725 263 793 1112 915 192 -394 -1003 -1300 -1011 -410 60 793 1129 1101 529 -120 -491 -982 -1115 -546 -106
2745 -106 592 1443 894 482 -133 -786 -954 -1167 -698 57 622 1281 844 670 -46 -485 -1279 -1417 -456 110
2765 110 592 961 1032 891 181 -549 -879 -1037 -455 -76 563 1022 959 785 70 -594 -1004 -1280 -705 3 349
2786 349 1043 1058 671 292 -359 -1049 -897 -770 -128 360 736 882 449 395 -618 -680 -1236 -958 -303 442 757
2807 757 837 885 401 -530 -668 -1321 -811 -82 273 764 924 1029 353 -257 -950 -794 -768 -431 107 1021 1077
2828 1077 754 489 -180 -678 -1223 -579 -261 -27 796 778 738 537 -79 -653 -855 -1028 -667 148 692 1110
2848 1110 825 476 110 -549 -871 -851 -447 150 621 733 957 516 72 -515 -750 -896 -448 43 620 1086
2868A086j93k98n56n69l63j80N29N79O31k8K97m61n14l76k15m33N09J61Q31M36
2888H73k07L7m01n67k93l50K30L96Q15K40J19k08m71l28o47k99M22N96N35K43
2908G35J91l33l96l75o65J65l09N88N11N12J29q0m36m28q46J96J94N0O34P68J74
2929I79n2l54q36l73k47m1L99L26R65k92J16j7p46n00j82O5L46M88L07Q13Q0o99
2951E45m82l26o66P9mJ021k09N71r9K52n55o62j3k68J57M62N91M23P8j13n81p01
2973e00m63L16J67K81P29J01L73o47j55o03l07P5k66R19J43L82M60j71o77q83
2993g26j26lJ70K23N97M16J35K54q47k73o56R1J60M24L72L85L33j55l13r87k60
3014g86j9l3O27K29N05Q2j84M5p38k69m66L14R0O24O89j43J33k92o58j42k66j18
$$ plain form
2868 1086 893 595 39 -530 -893 -1073 -544 35 666 638 935 474 -40 -416 -631 -1064 -555 -394 437 873
2888 873 666 703 302 -265 -558 -908 -678 -282 533 773 892 684 213 -115 -762 -1061 -639 -43 492 735
2908 735 926 593 197 -178 -843 -678 -987 -399 112 624 753 673 237 -191 -1037 -841 -647 -597 37 805 979
2929 979 927 573 -263 -636 -883 -924 -525 -199 766 474 590 573 -173 -673 -855 -790 -444 44 351 1164 1244 545
2951 545 63 -263 -929 -850 -854 167 -42 529 430 682 127 -535 -548 -816 -659 -197 394 817 895 782 201 -500
2973 -500 -963 -647 -480 -199 530 631 1004 357 202 -401 -708 -633 -899 20 163 545 1005 834 157 -726
2993 -726 -852 -855 -685 -462 135 551 686 940 93 -180 -836 -745 -585 -161 211 596 929 774 461 -526 -786
3014 -786 -805 -838 -211 18 523 605 421 466 -272 -541 -1007 -693 -603 21 710 567 700 408 -250 -392 -658 -776
3036g76L86N19L45K21j31O0p30l76r1j25L51L21M64M55O3o57m34l50m69K08J58
3057e88M18M19K70L14l98j52n62p60L67K14M28M15J84K40j61o06k17m14j42J65
3077e66N86M88J74J24J7q74j46l89k23L12K98M00L77M58m25k69n19m68n3K4L56
3098c18M79L26K00j37l13o06k35k96N02m4M32N60J68p0j57m81n18J1o1J43O05
3119A90N47Q1J39o52m41j92k78J11J85M71L73J53j84P7m53o69j69J62J71L61L47
3140C30M19J4l19l64n25m69L06K79N54L56L40j39k24n75m76M4k88J42N46K31L92
3161E74J80k8m17l79o39q1K02K73N22N37j25l6m72k91n61r8N6P77K27K74K53j19
3183F29m46o45J16l30M06p6M39K34K98l7k78l08n34j9J8K71M16J80L9J06l79R8
$$ plain form
3036 -776 -390 129 474 695 564 624 -106 -482 -573 -698 -347 -26 438 893 956 299 -135 -485 -954 -746 -588
3057 -588 -170 249 519 833 435 283 -279 -1039 -672 -458 -30 385 569 809 648 42 -175 -589 -731 -566
3077 -566 20 508 682 806 823 -51 -197 -586 -809 -497 -199 201 578 1036 611 342 -177 -645 -698 -674 -318
3098 -318 161 487 687 550 237 -369 -604 -900 -398 -442 -10 550 718 648 491 10 -508 -497 -558 -415 190
3119 190 737 818 957 305 -136 -328 -606 -495 -310 161 534 687 503 580 127 -542 -711 -549 -378 -17 330
3140 330 749 763 444 80 -445 -914 -608 -329 225 581 921 782 558 -17 -493 -449 -737 -595 -49 182 574
3161 574 754 726 309 -70 -709 -790 -588 -315 207 744 619 583 111 -180 -741 -839 -783 -6 221 495 748 629
3183 629 183 -462 -346 -676 -270 -346 93 327 625 588 310 2 -532 -551 -533 -262 154 334 373 479 100 198
3205A98p86n4M8J35P39K76J73o0n13l36l52j38R1k9O89J80J9J53k41l13k34l44
3227f99j39L11N16K87J68L56l61r6q70m9K37j29L65O13J68l16K03r14K86n46j45
3248g54N24J05M15l6L90l18m28l57L1j01K13K03K03P80l69Jm79j73l32j35J30
3269d87J79O47K32K11k14m04p17k70L43J41L9P84R3K79l31l57l16l69p1K29P4
3290b85N52r6N81j41n49j14n3o16J99K79K72K63L55m2m64l60r8m37M89J64J47
3311D6M17K22N1l72l61n08K4L1%M92O23m0j61P2m82m88j26R9M36ML91K08K1k49
3335C50l92m24o1j14M69N1N61q5L0p4j64n97j86K74J9K18L11J36K56j46m71p6
3357a15k68j09J5M58K44K42K67m89k92k60L1l0k22N52M6N58J8j13m74k63m67J51
$$ plain form
3205 198 -588 -642 -594 -459 280 556 729 669 156 -180 -532 -670 -579 -608 81 261 280 433 192 -121 -355 -699
3227 -699 -838 -527 -11 276 444 800 439 343 -527 -576 -339 -468 -103 510 678 362 565 -349 -63 -609 -754
3248 -754 -230 -125 290 254 644 326 -102 -459 -428 -529 -316 -113 90 870 501 502 23 -150 -482 -617 -487
3269 -487 -308 339 571 782 568 164 -553 -823 -480 -339 -300 484 577 856 525 168 -148 -517 -588 -359 -285
3290 -285 267 171 752 611 62 -52 -105 -721 -522 -243 29 292 647 605 141 -219 -317 -754 -265 -101 46
3311 46 463 685 736 364 3 -505 -481 -450 -450 42 665 625 464 536 54 -434 -560 -461 -25 -21 370 578 599 350
3335 350 -42 -466 -527 -641 -172 -121 440 355 385 311 147 -450 -636 -362 -343 -125 186 322 578 432 -39 -115
3357 -115 -383 -492 -477 -19 225 467 734 245 -47 -307 -276 -306 -528 24 70 628 646 533 59 -204 -671 -520
3379e20%L63J81J95L94l08j3l5n78m09N73p6J29L67J80j33k6m56l47J23O6J83
3401a47O8M33J23j87ok58k30k81J27j08Q18K9q3K9j55L6n05k30P8K36K11K55N7
3424C10k5K5l82m79P7j50J76M83K68K43q8m19L99p27m88K84j15M30N38K68j29
3445D99q3k47l66k77Q1J24R2M55J28m5o0j20l55j94j50L24q1O42j01K46k73k81
3467d2l22N8l89M38J84J68J15L5j82J33l84q2l28N2P12j75L97p1J07k28l34n21
3489f59L8L72J99J64K57J0n6j05k49j66j89J43j02M56p8N14j95j29m04Km95M35
3511b37J82K00L14l46M21l98l49j2r1j49L20L66K2K24j15L5j62o23j04J98J78
3532a26K88K59k53P2J47k40q8l87l2J46M1N00p4j11J14r3k55k45k3O4J59M74m4
$$ plain form
3379 -520 -520 -157 24 219 613 305 292 257 -321 -730 -157 -233 -104 263 443 310 284 -172 -519 -396 -330 -147
3401 -147 -79 354 477 290 284 26 -204 -485 -358 -466 352 381 298 327 172 208 -297 -527 -449 -213 -2 253 310
3424 310 285 310 -72 -551 -474 -624 -448 35 303 546 458 39 438 -289 -777 -493 -608 -178 360 628 499
3445 499 416 169 -197 -474 -393 -269 -177 278 406 361 301 181 -174 -368 -518 -194 -275 367 266 512 239 -42
3467 -42 -364 -306 -695 -257 -73 95 210 245 63 196 -188 -270 -598 -546 166 -9 388 317 424 196 -138 -659
3489 -659 -621 -249 -50 114 371 381 325 220 -29 -195 -384 -241 -343 113 35 549 354 225 -179 -177 -672 -237
3511 -237 -55 145 459 113 534 136 -213 -225 -316 -465 -145 221 243 467 352 387 225 -398 -502 -304 -126
3532 -126 162 421 168 240 387 147 59 -328 -360 -214 -173 327 253 142 256 163 -92 -337 -360 -296 -137 337 293
3555B93J61m77J60k89m09K73p1J72K64L98p3j37j64k21j07k81N97k1l4M40q8k1
3577C65k61j98l98M2l4K57L76R9LK59N8o60j03l23K46r9O17K38n5o5k59L7k96
3600a54m41J20J84L07J41L66p4j80l40k82K06k75M7L13M23J15k03r5j65Nm33J47
3622b68LL59J13K91K83m39m51k42K15j93L03k08L18P6K84j3n12j08m22L53j83
3643d41M17J88J94l0J68n51j6l5l04K73O5K2K90J60k02J23n11l81M59k54J80K61
3665G5J57L51R4l71l12k95j99K84o9N19J12K3P2j95l30l59p6O1K52L46P7j4o4
3688A39J56k19k31k26m8K81K43J60K81Rl09j95j31k28l0j26M33M40j56o4M1j98
3710B2j16j39M7J69j27K56K60k45K57m15q4k8k9j58J21L42M8N3J18l93m21J14
$$ plain form
3555 293 454 -23 137 -152 -561 -288 -359 -187 77 475 402 265 101 -120 -227 -508 89 68 34 474 386 365
3577 365 104 -94 -492 -450 -484 -227 149 248 251 510 568 -92 -195 -518 -272 -371 246 484 429 364 105 142 -154
3600 -154 -595 -475 -291 16 157 523 449 269 -71 -353 -147 -422 -375 -62 361 476 273 178 13 18 -415 -268
3622 -268 -265 94 207 498 781 342 -109 -351 -136 -329 -26 -234 84 160 444 431 -81 -189 -611 -258 -441
3643 -441 -24 164 358 328 496 -55 -71 -106 -410 -137 -72 -50 240 400 198 321 -190 -571 -112 -366 -186 75
3665 75 232 583 677 306 -6 -301 -500 -216 -285 234 346 369 441 246 -84 -443 -519 -458 -206 140 217 203 139
3688 139 295 76 -155 -381 -429 -148 95 255 536 545 236 41 -90 -318 -348 -474 -41 399 243 179 220 22
3710 22 -94 -233 -186 -17 -144 112 372 127 384 -31 -115 -143 -172 -330 -209 133 181 234 352 -41 -462 -348
3732c48R4Q0J96J22j3p5Q0j35k03J58k14l3K34K88jM9o4k30j52O4m27K27K72Q7
3756E6P2L18j64n44M56n18J90j35J74J98L8K42l30K14j50m60n0k5N93j77L38k64
3778G2J99R2j82k25l08J03K97JJ21L37k34m4k15k25K5j18J65j9M80k28J04Ql09
3801a03k99L61l24J96L55QQ4l8q1M7l85j27J28r5L40K63j28j36K83j22l37k47
3823c57JJ0L47K85m3J24l39J11k44K9l02pK92K28K70j25l64L79m01m5N6k1K49
3846A33j03j97L63P1q5l07j76J26j06J05P7N48R7l80j40k86J49j28j90K62L22
3867A55j04J35j22q4J0oj7N5q9L0K38p0J05k98N8N3j15p0MJ60J08p5O0j46m8K2
3893e1k15k4K37k19M62j86K08o9k41P4m3j10K10j21qN40J38l46P6l01k60j45K75
$$ plain form
3732 -348 -254 -174 22 144 131 56 136 1 -202 -44 -258 -291 -57 231 230 279 215 -15 -167 -103 -530 -303 -31 56
3756 56 128 446 282 -262 194 -324 -134 -269 -95 103 141 383 53 267 117 -343 -393 -418 175 -2 336 72
3778 72 271 363 181 -44 -352 -249 48 49 170 507 273 229 14 -211 -186 -304 -139 -158 322 94 198 206 -103
3801 -103 -402 -41 -365 -169 186 194 278 240 159 206 -179 -306 -178 -273 67 330 202 66 349 227 -110 -357
3823 -357 -356 -346 1 286 243 367 28 139 -105 -76 -378 -385 -93 135 405 280 -84 295 -106 -151 -95 -116 133
3846 133 30 -167 196 267 182 -125 -301 -175 -281 -176 -99 449 546 166 26 -260 -111 -239 -429 -167 155
3867 155 51 186 64 -20 -10 -16 -33 22 -67 -37 201 131 236 -62 -4 49 -66 -136 -132 28 136 61 121 -25 -73 -51
3893 -51 -266 -290 -53 -272 190 4 212 143 -98 -24 -67 -177 33 -88 -96 444 582 236 312 11 -249 -394 -119
3916a19J5L21j25J61q9j67l1j54Q0P5l10M63Qj26L12j52j72k49r4K72Q2m7P3M88
3940E15k92m12K23l09R2l4N1K9K93o8K5k05M3k43L43j82P3J13L5K13k50L9k31
3963a39oj43L2J38j58K66R8J34j89j82Q2j40J10j93K35J00ok18M65l36j44J08
3985h6k52J25O8L47j78K99j57m4j54k67K03j00O7K29o1J61L0k08j2l41L56l78
4007c53L34R3k99M98j14N8m2m88K51K77k14J79Q2N4M1k06o9m18K78oN3K31L6j83
4031G3L37k99p8j33OP9N5J11J6J02r7n5j32k06J36P8l29N06l30M63K61m00l1k20
4055h7O7j63q5J35KK74L2O0l5m71J02j72K37K43j09K0J06j18J67q3Qk83P5J0J17
4080D9L36P5n11J53o33K46J09j9j46L69L30p9j57k00O9l92M13k38K37J20N1o6
$$ plain form
3916 -119 -104 217 92 253 164 -3 -34 -188 -108 -33 -343 120 128 2 314 162 -10 -259 -353 -81 1 -46 27 515
3940 515 223 -189 34 -275 -183 -217 -166 -137 156 88 113 -92 -49 -292 51 -131 -58 55 90 303 53 92 -139
3963 -139 -145 -288 -256 -118 -276 -10 88 222 33 -149 -67 -207 -97 -290 -55 45 39 -179 286 -50 -194 -86
3985 -86 -338 -213 -145 202 24 323 166 122 -32 -299 -96 -196 -129 100 39 200 230 22 10 -331 25 -353
4007 -353 -19 74 -225 273 159 217 175 -313 -62 215 1 180 262 316 357 151 82 -336 -58 -64 -11 220 256 73
4031 73 410 111 33 -100 -94 -15 40 151 167 269 172 117 -15 -221 -85 -7 -336 170 -160 303 564 164 133 -87
4055 -87 -20 -183 -268 -133 -131 143 175 235 200 -271 -169 -341 -104 139 30 50 156 38 205 122 130 -153 -78 -68 49
4080 49 385 460 -51 102 -531 -285 -176 -195 -341 28 358 279 122 -78 -9 -401 12 -226 11 131 182 116
4102A16j56o3R6j95q1J40Q4Q1o1J23m3r7K61m11n2J55J56P2O1J4k5J30n61q0M
4127c32L81q8R8JK64j07k08o5k01J51n7J11k23N65m27L62n0O5l11J57k03k00K62
4150e5j95O19m17J29k41R4o4K6Kj10K06K03j80q0J00m8j06L2K2k27N13j85L32
4173C70O0k43j80J32l20J41J04R4r5JJ07J72l43l37J82J67j10l0J93J05Rj19j25
4196f5l6j22q5K25L24j15l8J16P1l15m3K2l4j65J11K83J1nN9N0m32L27j26j59
4220a41J50K07N5q1k22J30K7m25j4L56J34q8k71K79j78R9p8j29M5LJ45J6o2K62
4244B19o3R0j74q0n6j94L22l77M31j42J21K1j76K03k26j06m0K49N7j83K82j7k17
4267e6j60Q0l6Q8J7P7J60k5j56P5p0l89M18k5j32J96P0J4m4k98K22l8J74k13J03
$$ plain form
4102 116 -40 -103 -7 -202 -283 -143 -59 22 -39 84 41 -56 205 -206 -258 -103 53 125 186 200 175 305 -256 -336 -332
4127 -332 49 -39 59 60 324 217 9 -56 -257 -106 -163 -52 -275 290 -137 225 175 240 -71 86 -117 -317 -55
4150 -55 -250 369 -48 81 -160 -66 -130 -104 -102 -212 -6 197 17 -63 37 -11 -117 -85 -63 -290 223 38 370
4173 370 430 187 7 139 -181 -40 64 158 63 64 171 343 0 -337 -155 12 -98 -128 65 170 179 60 -65
4196 -65 -101 -223 -308 -83 241 126 88 204 275 -40 -83 -61 -95 -260 -149 134 145 140 199 249 -183 144 18 -141
4220 -141 9 216 271 190 -32 98 125 -300 -314 42 176 88 -183 96 -82 17 -61 -190 -145 -142 3 19 -43 219
4244 219 156 246 72 -8 -64 -258 64 -313 118 -24 97 118 -58 145 -81 -187 -227 22 79 -104 178 161 -56
4267 -56 -216 -136 -172 -84 -67 10 170 145 -11 64 -6 -395 23 -2 -134 62 132 146 102 -196 26 -12 162 -51 52
4292E2J43n8P5O9k50j82j41K05j3L14j81R2J04j88j52J09J7Nn4j71L85k05K02
4315A77j51J00p4m1k41J59K2kL22k77J80k83L7L2l18K79k9L33q1j02M2j79k35
4338c30K09J83j61k61J66L53l7Ll22M16k97j98K89j2J6p5J95k52K82j33K5P7j21
4361A5O9J13L2jj51k62J5O3K28k32J06q6J68j66o9K95k6n0j01l71L01L88N1k18
4385A11K11l58P3kj64pn1K90j30K88r9m1J9m92j5L40j09K00n6M2L6j17L04r4l07
4410a28j31L9L15k45L27l27J1k7j19J94n1r9M4M14k92K73p1p9k34j38J42J54Q8
4433F0n0L51o3k88K26r6m31J93j98J60J46n9j11L67j33n3l53J23J76L5J3r0L13
4456B38n0j42q7j25J16j46K01k22J67K49j25kl0j11n9n8l3K84j59M58l17o3m7
$$ plain form
4292 52 195 137 212 281 31 -151 -292 -87 -100 214 33 125 229 41 -111 -2 15 20 -34 -205 180 -25 177
4315 177 26 126 52 11 -230 -71 -49 -51 271 -6 174 -109 -72 -40 -358 -79 -108 225 144 42 84 -95 -330
4338 -330 -121 62 -99 -360 -194 159 122 125 -197 219 -78 -276 13 1 17 -58 137 -115 167 34 59 136 15
4361 15 84 197 229 228 77 -185 -170 -107 121 -111 -5 -91 77 -89 -158 137 111 61 -40 -411 -110 278 329 111
4385 111 322 -36 37 35 -129 -136 -187 103 -27 261 162 121 140 -352 -367 -27 -136 64 8 50 86 -31 273 179 -128
4410 -128 -259 -220 95 -150 177 -150 -139 -166 -285 -91 -142 -241 -197 217 -75 198 127 48 -186 -324 -182 -28 60
4433 60 10 361 298 10 236 140 -291 -98 -296 -136 10 -49 -160 207 74 21 -332 -209 -33 2 15 -75 238
4456 238 188 46 -41 -166 -50 -196 5 -217 -50 199 74 72 42 -69 -128 -186 -219 65 -94 364 47 -16 -63
4479f3Q6l60Q1Q6J67j85M0K15K4j55P1J1k59L68k69j0N3p2O6K12l88K85o2j89
4503b47J44r5Q9L52j41J9Rk47k3j13J58L45Kj4n0m01J99oj4o9n0J97P8M6k4j93
4529d9R6k4l6l05P2N15m94J45Q0K23k45j28q3R3n9K39O0J95k10m1Q4n2k21J98
4553E3mj12o4L25j8j06j65Pnk1j92p1L56R1o7K57j66K7l07J52l22L12K5P8n8J30
4579A35L3k96L04k94K58m30L8L50J39k15J35j51k3j00J87j26M19l87K49j22J31
4600B34j31j61N5J03k93K61l7J7M9l13M60m77L04m48Q4J61J45P5j6j74O3K05%
4623A66j67k12J69K74q4j80J67j32j34j24q0j66L67K21J82j87K84k17m80J11J93
4644b9J74j11lk18J07J99l9J1q0n4q5j40K91J10o0q6Q8K9k89J89Q1k19L39l21
$$ plain form
4479 -63 23 -337 -256 -170 -3 -188 -148 67 91 -64 7 18 -241 127 -142 -152 -99 -171 -105 107 -281 4 -58 -247
4503 -247 -103 -198 -109 243 102 121 130 -117 -140 -253 -95 250 252 238 188 -213 -14 -20 -34 -103 -153 44 122 168 144 -49
4529 -49 47 23 -13 -318 -246 269 -225 -80 0 223 -22 -150 -233 -140 -199 40 100 295 85 44 128 76 -145 53
4553 53 49 -63 -127 198 180 74 -91 -84 -89 -110 -302 -373 -17 74 7 264 98 125 -182 -30 -352 -40 -15 63 5 135
4579 135 168 -128 176 -118 140 -290 -252 98 237 22 157 6 -17 -117 70 -56 363 -24 225 103 234
4600 234 103 -58 -3 100 -193 68 31 48 97 -216 244 -233 71 -377 -293 -132 13 88 72 -102 -39 166 166
4623 166 -1 -213 -44 230 146 -34 133 1 -133 -257 -337 -503 -136 85 267 80 364 147 -333 -222 -29
4644 -29 145 34 31 -187 -80 119 80 91 11 -43 -128 -268 23 133 73 -13 75 104 -185 4 85 -134 205 -116
4668a16K24J54j81o7l4j66J27K09R9l02J85j15K47o5k39Lq4L01l35K0K67j12M8
4691F8k67J98K8j80L1m8n0N9K38l8j79J0j33J89Q5j52l4J18J93j61j13m1J63O1
4715D5lO8q0l5K31j78J5K0k38M3K47k4j87K05N6j39K9q5j95j49JK29K17j22K16
4740A87k13j71K06m9k29J54K6K8JOL00j35k02j0J39R2k56J0K48j99l7L35l41J95
4764H5l07J09L43k72N1L29l5k71K9J70k51j38J81O6j67M13l18K0j0k21K42k37
4786a89R6m3L18k16K09L8M0l07L2j88o9J21K70k62J63J56P3m59K48Kj23j55J35
4809a10P9J74n3J41k09l75J50M6J22j0L3Q5J59j14j8l14K75N2j11M7Q8l2nk8j2
4834F0j17o8qo8L37q7j0JJ16m02N9j24K06J19J00j53J9J14k7k00l4K88n6k52M40
$$ plain form
4668 -116 108 262 81 14 -20 -186 -59 150 249 -53 132 17 264 199 -40 -37 -121 180 -155 -135 132 20 68
4691 68 -199 -1 27 -153 -122 -170 -220 -161 77 39 -140 -130 -263 -74 11 -141 -175 -57 136 -25 -138 -179 -16 45
4715 45 42 110 30 -5 226 48 63 83 -155 -112 135 111 -76 129 185 46 75 -10 -205 -354 -353 -124 93 -29 187
4740 187 -26 -197 9 -40 -269 -115 -89 -61 -60 -54 246 111 -91 -101 38 130 -126 -116 132 -67 -104 231 -110 85
4764 85 -222 -113 230 -42 9 338 303 32 61 231 -20 -158 23 89 -78 335 17 37 27 -194 48 -189
4786 -189 -93 -136 182 -34 175 213 253 -54 -22 -210 -279 -158 112 -150 13 169 242 -217 31 33 -90 -245 -110
4809 -110 -31 143 90 231 22 -353 -203 -157 -35 -45 -12 73 232 118 100 -214 61 113 2 49 137 105 100 72 60
4834 60 -57 -125 -133 -201 136 49 39 40 156 -246 -187 -311 -105 14 114 -39 -20 94 67 -133 -167 121 65 -187 253
4859B53l45J92J42k40j70K60k80J0J76Nl1K28k79J11J03l43J89m6j04K20k4K5
4881E2l5k48P8k9J11L4j82J78K87k04j02kl1J34k25J78l32L00J84L4O5q4l16L31
4905A76j84l93M14j6J83j62K17m30J74j61J03J95j70K46j10j49p7K01j77J24J25
4926A29k18P1p8p5N32l59K02j54j24r9RJ07K36k61P2K21j01O0k93O1pJ28r0J60
4950A29N5j00L9j15j34j46L04P6m13Q5L39J9j01j62N58k32l26j39K19J13M2r2
4972A8L02j96j61l03L40k1LK58j98j03L90k45O5q9k20J65o0M04k28j53J45P1m52
4995b68M01k47L44m17K20m8K4K22m49L76M9k86L3M8j15L76l19L8l6r5J83k4j08
5018i8J84Kp9J23RJ07k12N9k04nK47J39n96M82K4j51J27j98m5L4j04L09j49J15
$$ plain form
4859 253 -92 100 242 2 -168 92 -188 -178 -2 3 -28 200 -79 32 135 -208 -19 -65 -169 51 27 52
4881 52 17 -231 -153 -182 -71 -37 -219 -41 246 42 -60 -62 -93 41 -184 -6 -338 -38 146 180 245 161 -155 176
4905 176 -8 -401 13 -3 180 18 235 -195 -21 -182 -79 116 -54 192 82 -67 -144 57 -120 4 129
4926 129 -89 -18 -96 -171 361 2 204 50 -74 -173 -164 -57 179 -82 -10 211 110 170 -123 -62 -69 59 -31 129
4950 129 184 84 123 8 -126 -272 32 108 -305 -220 119 138 37 -125 433 201 -125 -264 -45 68 110 18
4972 18 320 124 -37 -340 0 -21 -18 240 42 -61 329 84 149 60 -160 5 -55 349 121 -32 113 184 -268
4995 -268 133 -114 230 -187 33 -15 9 231 -218 158 207 -79 -46 2 -113 263 -56 -18 -54 -149 34 10 -98
5018 -98 86 88 9 132 141 248 36 95 -109 -114 133 272 -324 158 182 31 158 -40 -85 -51 -155 154 5 120
5042A20l80L85l44K57j66j9o0L17r7M3j9k00M33p7l38p9M99l80J73P2r2K58j45
5065A61P3k93kJ60k12K98r3r4q5J08N2k84K71k49n1J96J80m2j12j36J21r3kO2
5089f6J19k46M91k72J25k0l54P6k36K13J2J83Q5k03K09k11k18J49J16j82j46M00
5111B4k39J30Q0j50J59L31n71M79j04j69j38L50j95M1N5k00J8K92n68L36Q6j84
5133a37J44K3O6j11L5o3P2j88J86R7K5j44J54n5J64l77L18l71K12l3J94l82J71
5156@M4Q7j72j88K97M5j46J70l9mL0n0k6j59k42Q0L55j27PK31j34p%J33p6k73
5182a64J34J72n6j73J24l0r8j40M78k2l34K84k10P3K38j25j47J76j65l5K21qj89
5205DL16j08l81mK1K0P3n2M32k84k25K43Lj15l1K6K15l88K70j1J59l13J08Q7k38
$$ plain form
5042 120 -260 125 -219 38 -128 -147 -207 110 13 56 37 -163 270 193 -145 -224 275 -105 68 140 48 306 161
5065 161 234 -59 -61 99 -113 185 92 -2 -87 21 73 -211 60 -189 -240 -44 136 94 -18 -154 -33 -126 -128 -66
5089 -66 53 -193 298 26 151 131 -223 -147 -383 -170 -158 25 110 -93 116 -95 -313 -164 -48 -230 -376 24
5111 24 -215 -85 -5 -155 4 335 -236 243 139 -30 -168 182 -13 28 83 -117 -99 193 -375 -39 47 -137
5133 -137 7 30 96 -15 20 -43 29 -159 27 124 149 5 159 104 268 -109 209 -162 50 17 211 -171 0
5156 0 44 131 -41 -229 68 113 -33 137 98 94 124 74 48 -111 -353 -273 82 -45 -38 193 59 52 52 185 109 -164
5182 -164 -30 142 86 -87 37 7 -91 -231 247 225 -109 175 -35 38 276 151 4 180 15 -20 201 193 4
5205 4 320 212 -169 -173 -152 -132 -59 -111 321 37 -188 55 58 -57 -88 -62 153 -235 35 24 183 -130 -22 65 -173
5230a73K46p9m25M73M1P1p4n9k15J09M4p8K88l54J70K31j96k27J81j28J3J98n14
5253d57M85L1k6r5M5r9pK0Qn1L55Ok04K3J15k47k19M33L3k72O9L47l63pK89l77
5279a65N6r6J33j90M54j75k10L89n5J39k89l2K94%k95J89K03l87n9j17K18j40
5301a35J28K09l55K26J41j44j33K66k54j79K93j84K4K88k49J67j60K41k17q0P4
5322c3n3L3J68j2j85j24m2Q9K83p8j75K56j41J26q4j9J43m17J74j5q0J49J95j62
5346dj27K64j77J66j48K3O8l50L09M6L1j8p0J63l08k89K83L2Q6p8N4J22j1k81
5370b14J6L18l05J4J79j7M4j27L61k97j46J21Q4j35K15O9Q5j14k00J92l83p8M14
5393I6l11J15R1L37l46P2k43J30K63o13M75p8J00P8m8k07j15M39p2n9oQ3r5j95
$$ plain form
5230 -173 73 -6 -431 42 83 154 80 21 -194 -85 -41 -119 169 -185 -15 216 20 -207 -26 -154 -141 57 -457
5253 -457 28 59 33 -62 -17 -116 -123 -103 -95 -146 209 215 11 34 149 -98 -317 116 149 -123 -54 293 -70 -77 212 -165
5279 -165 -109 -205 -72 -262 192 17 -193 196 141 280 -9 -41 253 253 -42 147 350 -37 -96 -213 5 -135
5301 -135 -7 202 -153 73 214 70 -63 203 -51 -230 63 -121 -97 191 -58 109 -51 190 -27 -107 -33
5322 -33 -86 -53 115 103 -82 -206 -248 -159 124 46 -129 127 -14 112 28 9 152 -265 -91 -106 -186 -37 158 -4
5346 -4 -131 133 -44 122 -26 -3 65 -285 24 70 101 83 13 176 -132 -421 -138 -106 -20 -98 -44 78 67 -214
5370 -214 -198 120 -185 -171 8 -9 35 -92 269 -28 -174 -53 31 -104 111 180 265 151 -49 143 -240 -318 96
5393 96 -215 -100 -9 328 -18 54 -189 -59 204 -409 66 -12 88 166 118 -89 -204 235 163 104 98 181 86 -109
5417a09K48j56l27M92n2k14M8M7J6J3o8M2J16k09j69K66l9K11k20J01l0k00o3
5440b56K30J86j97J0JO8M2m3l22K00J48k30r9K37O5J25m8n5k15J16J78l18k6J52
5464e1N6j41O7J47L1M1l1j94J20o0k6N7J48k27J99j33N5j6N5k88m4L75o0L3k00
5489h7J17l44K71r7L86l26K24J09j20j43J16o2k15OQ4J0K47K8j79l6K33k52Q2
5512E2J26m30K75k07L57j70Q7J93j61j16J22k42K65k48J20J24l03K71l60J91J
5533e3J53k50J1M61l81P4p6J38r9M1k33J2L29q9P6q4j06p3l6K41n0o1K0K2J36
5558A23J1j18J20j61O6nj91J6L28L5k17Q7l7j47oJ93j73J5J67j82P3r7j0k35M12
5583F7j28mj47J96J26J78k34P8NJ14k21k68J60K39K1j14J83L1m60L25j75K0M2
$$ plain form
5417 -109 139 -17 -344 148 96 -118 -70 -23 -7 6 -62 -20 96 -113 -282 -16 -55 156 -64 37 7 -193 -256
5440 -256 -26 160 -37 -27 -26 42 84 41 -281 -81 67 -163 -262 -25 40 165 117 62 -153 -37 141 -177 -203 -51
5464 -51 5 -136 -69 78 109 150 119 -75 45 -15 -41 16 164 -63 136 3 58 42 97 -191 -235 140 80 113 -87
5489 -87 30 -314 -43 -140 246 -80 144 253 133 -10 106 44 -171 -165 -81 -71 176 204 25 -11 222 -30 52
5512 52 178 -252 23 -184 173 3 90 283 122 6 128 -114 151 -97 23 147 -156 115 -245 -54 -53
5533 -53 100 -150 -139 322 -59 15 -61 77 -22 19 -214 -202 127 38 114 30 -76 -149 -185 56 6 -55 -35 -13 123
5558 123 134 16 136 -25 41 36 -155 -139 189 224 7 94 57 -90 -96 97 -76 -61 106 -76 -3 -100 -110 -345 67
5583 67 -61 -65 -212 -16 110 288 54 132 137 251 30 -238 -78 161 182 68 251 282 -178 147 -28 -8 34
5606C4J5J5K28m08K8j29M38k91J01l40K46L02k02J9j47p6j01L00n9J85j64%O2
5629E6K39k9m83j40K78Q1J06k02O2L6M1j30J1J12M8J93l03K9J75j28J31k90M5
5652f2j31K03J83l80K79J49k48L7O5j65rj47L48k79J99k5K63l94k4J48Q0Pj72
5675g5M0K00r9j72J39j14p3J91p1k65J97J7K16k47J18ML3k60J55J18mj6j22K61
5699A71L7k19k32K48l18l6L49j73M9J55Q6P7r7p0k4r0J95m46L20J3J93k07r6K73
5723A58j41n9k77K65q1R0J41m4j87M1O3k0j25L40m9k02J95j88J15q8K01j33m35
5746d20L01K62k12o7J70o0j27R3J84k07M9J52k61J67j09Q3k5M1j35J61l33L05
5768A2q2P1J27j88O8j05L51k10p4k33O59m07J28k06jO8k85J63J36J93j85M4q6
$$ plain form
5606 34 49 64 292 -116 -88 -217 221 -70 31 -309 -63 239 37 56 -91 -167 -268 32 -27 158 -6 -6 56
5629 56 295 266 -217 -357 -79 2 108 -94 -32 4 45 -85 -74 38 86 279 -24 5 180 52 183 -107 -62
5652 -62 -193 10 193 -187 92 241 -7 30 95 -70 -79 -226 122 -157 42 17 280 -114 -138 10 90 97 -75
5675 -75 -35 165 66 -106 33 -81 -154 37 -34 -299 -102 -85 131 -116 2 6 39 -221 -66 52 48 32 -90 171
5699 171 208 -11 -243 5 -313 -349 0 -173 -124 31 117 194 97 27 3 -87 108 -338 -18 -5 188 -19 -115 158
5723 158 17 -42 -319 -54 -135 -45 96 52 -135 -94 -31 -51 -176 164 115 -87 108 -80 35 -53 148 15 -420
5746 -420 -119 143 -69 -136 34 -26 -153 -60 124 -83 -34 118 -143 24 -85 -2 -27 14 -121 40 -293 12
5768 12 -70 1 128 -60 8 -97 254 44 -30 -263 396 -11 117 -89 -90 -22 -307 -144 -8 185 0 44 -42
5791d2j49K02J5j62J3J58Q3q4K36k32J0J93kl69M7j51J11J59k4J46j25lK2J9j94
5816a23J26J65m00K95J05k60K93k43P4j90k25L05n2M0j61J45N61n08k41K88J05
5837I9K6L6j70M69l94K8r2m6j34M12k95J4L0M7LO6O3k12J31J14J15l58M7r5j00
5862a96J2K31j68L87m10o8K5O6K03r0Q2m2J01k69j00J59j21J20L3p9m6K32K3J46
5886B31j77j09l12L39K32j84J0L5m3r4rj88K31n7M38l63J01R1j52k1J68j53q8
5909g4N1R0m3J35r4KP5mj27J16j83Q8K88l46qm6J48k29M6J31L8N7k24O6j01J58
5935A0P7J2Nk70J73j58qJ85K58k00q8J40q6r7Q1RK02m12O1Q6M2k17J7j2L98O7
5961B75j99o7n9J20j31P9N6k10oN8Q9kl9j93M02j79m22K53J13Q0k34K21J85o5
$$ plain form
5791 -42 -191 11 26 -136 -123 35 118 34 270 38 48 241 239 -130 -83 -234 -123 36 12 158 33 30 52 71 -123
5816 -123 3 168 -232 63 168 -92 201 -42 32 -158 -383 -78 -130 -90 -251 -106 455 -53 -294 -6 99
5837 99 125 161 -9 460 66 94 2 -44 -178 234 -61 -47 -17 30 33 99 162 -50 81 195 310 -48 -1 -96 -196
5862 -196 -184 47 -121 266 -144 -212 -187 -121 82 -8 74 32 133 -136 -236 -77 -198 -78 -45 -124 -170 62 85 231
5886 231 54 -55 -367 -28 204 20 30 65 22 -72 -81 -269 -38 -95 343 -20 81 172 20 -1 167 14 -74
5909 -74 -23 67 24 159 65 67 142 138 11 127 -56 32 320 -26 -34 -80 68 -161 -115 16 54 111 -113 -47 -148 10
5935 10 87 99 104 -166 7 -151 -159 26 284 84 -4 136 50 -47 34 43 245 -167 -106 -20 22 -195 -178 -190 208 275
5961 275 76 9 -50 70 -61 18 74 -136 -142 -84 5 3 -36 -229 173 -6 -428 -175 -62 18 -216 5 190 125
5985A25k17m3k6K11k10K46q6J94j50j14K07l07p0K43q1J85k07Q4J51lR3n53L18
6008a0M7pj62K14j33J21J31k52J10j64J71j23r6K7J11j81J05j2J10m9J4L55l11
6031A6Q7k26K28l14K5L03j27J26j65K03m5l13J26j94M07o2k22l7J57p1K5j9L04
6054B12j55J81m15n5K19n7K53k15P2p8K22p6K1j00n2j30K85j40k8J18r2k0m5K62
6078A87j45j29KMj49L95j95p4p4K03p5q4P9j62L65k03J79j53J71j84M3J10j57
6101d6n6R9J87r8m2k55J04M3K20j29L2j57L62j98k68K10L3K0j23j86J31K49l3
6124I9j56J15k5P0n5l07L06M2m9p0rr8J55l81M10k21J96J1J83l63M2O7K00l65
6148b03L16j63k60K65j2O2p9J36j00o2K08m12J16r4L88k24J40K6m58M06j0K81
$$ plain form
5985 125 -92 -135 -161 50 -160 86 0 194 44 -70 137 -170 -240 3 -78 107 -100 -16 135 132 225 -328 -10
6008 -10 37 30 -132 82 -51 70 201 -51 59 -105 66 -57 -153 -126 -15 -196 -91 -103 7 -42 -28 327 16
6031 16 103 -123 105 -209 -184 119 -8 118 -47 156 111 -202 -76 -270 137 75 -147 -184 -27 -98 -73 -92 212
6054 212 57 238 -177 -232 -13 -70 183 -32 40 -38 184 108 129 29 -23 -153 132 -8 -36 82 -10 -30 -75 187
6078 187 42 -87 -85 -81 -230 165 -30 -104 -178 25 -50 -134 -55 -217 148 -55 124 -29 142 -42 1 111 -46
6101 -46 -102 -3 184 86 44 -211 -107 -64 156 27 59 -98 264 66 -202 8 41 61 -62 -248 -117 132 99
6124 99 -57 58 33 103 48 -259 47 89 40 -30 -39 -137 18 -363 47 -174 22 33 216 -147 -105 -38 162 -203
6148 -203 113 -50 -310 -45 -57 5 -74 62 -38 -100 108 -304 -188 -282 106 -118 22 48 -410 -4 -14 267
6170B67l03J94m47K34K99j41j80L34l38j2J16m2N6J36k97K64l12L83k09J52j62
6191hk64J59J07J31jk01J8l3L44m34Q6M46k22O2j35k49K57j26J00j77K63J5q4
6214E4L2k6J0j47KK04j90J0K90k04K0j6K7j34JJ33k26Lk5K60r6K51k37k98M35
6239A33j18n3J51l22L44m3r2J5J50J21o51N08r2j14J83l32J30K48k38J52j07j26
6261a53M4R0K35j55q3P0N4k18L96j57m9k65O1O9K17l31J02j54J50q4k9J26m2K0
6285h6K61j78l77L70q5J1p8L02Q0j49Lk61L30N9n42M41j15l21N44k38J26j41K00
6308A56r2r4J85J10j62m20M24J24j25N3j02j53l0oK42n8q8O8q7j42J93q4KP0J28
6333A12j17j55N4K76k63M3j7M15m21L34j30j01J96n82L09k1j27K88j84n8J29j04
$$ plain form
6170 267 -36 158 -289 -55 244 103 -77 257 -81 -93 23 -19 37 173 -124 140 -172 211 2 154 -8
6191 -8 -272 -113 -6 125 124 -77 -59 -92 252 -182 -96 350 128 190 55 -194 63 -63 37 -140 123 138 54
6214 54 86 60 70 -77 -75 129 -61 -51 239 35 55 39 66 -68 -67 66 -160 -157 -182 78 -18 233 -4 -302 133
6239 133 15 -38 113 -209 135 92 0 15 165 286 -365 143 51 -63 120 -212 -82 166 -72 80 -27 -153
6261 -153 -109 -19 216 61 -22 48 102 -116 280 123 74 -191 -130 -61 156 -175 -73 -227 -77 -161 -190 -64 -106 -86
6285 -86 175 -3 -380 -10 -95 -84 -162 140 220 71 74 -187 143 202 -340 101 -14 -335 209 -29 97 -44 156
6308 156 64 -30 155 265 103 -317 107 231 106 159 57 -96 -126 -132 110 52 -36 32 -55 -197 -4 -88 -86 -16 112
6333 112 -5 -160 -106 170 -93 -50 -67 348 -73 261 131 30 226 -356 -47 -68 -195 93 -91 -149 -20 -124
6355a24K99j32j24K28k37R2p0Q5N7k07j32K14j44K83J50k75j8J18k23J62p6K0
6377e4J26J13j91o9J48j41K24l18J45J63k05Q8L8J18m9j96K03j1k8j34q8L32j66
6400D8k1k36J05J37O0j76Q4K16k5k23oJ75J30m00k8L26k06k9J46o6NK40m08J08
6424d4rM0J5J61k37m1q9K25J49q5j92L08k39RM8J53Mo7q5k84K43j39K81J1k23
6449h7j2K86o1l1k23k3K81j74K6J90Jk64K21o9L37k35o3K9p1j93J61m1J80k33
6473f8J09k60K88j47P2m0o4J15m0j15R0O0J64k24L03l38J29p7k25K66O7k79K65
6496E1L1j56J90j42Ln6J36j02K39k22R9k0Km35M80K57l98j76m1L88j88O3J05j89
6520h1O7J56N7m8j88J95j24p9N4J5L0j57P3L8j00J84q2p6Q3O6q1J20o2j85N8j45
$$ plain form
6355 -124 175 43 -81 147 -90 2 -68 17 74 -133 -265 -51 -195 88 238 -37 -55 63 -160 2 -74 -54
6377 -54 72 185 -6 -75 73 -68 156 -162 -17 146 -59 29 67 185 136 -60 143 132 104 -30 -118 214 48
6400 48 27 -209 -104 33 93 -83 1 217 192 -31 -37 138 268 -132 -160 166 -40 -69 77 11 16 256 -152 -44
6424 -44 -53 -13 2 163 -74 -115 -204 21 170 85 -107 201 -38 -29 19 172 176 109 24 -260 -17 -156 125 136 -87
6449 -87 -99 187 126 95 -128 -151 130 -44 -18 172 173 -91 130 61 398 163 100 129 58 -135 26 -15 165 -68
6473 -68 41 -219 69 -78 -6 -46 -110 5 -35 -150 -60 0 164 -60 243 -95 34 -43 -268 -2 65 -214 51
6496 51 82 -74 116 -26 -23 -79 57 -45 194 -28 71 51 53 -382 98 355 -43 -219 -260 128 -60 3 108 -81
6520 -81 -14 142 199 151 -37 158 34 -45 9 24 54 -103 -30 8 -92 92 10 -66 17 83 2 122 60 -125 -67 -212
6546b12K41k5k44K76OP1m9k18J59j47L00j30J34o5l25Q4N5J62k14J08n6K5J42
6569G8q1P8k28P1LK38N1n5k36J02n7m3j19K03L7J5k09K5J85k92K98j0j74O7L7
6594a6K1j39K69R4l34o6J57N4mk94N60m12O8MJ55k94J32q3J20r1O5r0l30M73O6
6619H5L3l0k54J95j01m3J44n2J16n0r2N0N8k9M9K2m1q5pM7J2p5J77L6j21j73L02
6646A73o8k07K68k00m0K25l45L31k59MJ94n8J01O6O6j84j07n4n9R6J17L55l60
6669E5k10J70j15K83j26j62R2L6Rj79m4K27j60l43M79K6k51M13l40J72R5j56k05
6692b34J03k45K57J94n8J29j52K76k05j16J42j11O5j13K53j30K5l16J94K21m57
6713b78L93N4n04M49j66K14j98J41K73m35K37k71J56J05k52M7j16J39J49k06M
$$ plain form
6546 -212 29 4 -240 36 42 113 64 -154 5 -142 158 28 162 97 -228 -144 -89 73 -141 -33 -89 -64 78
6569 78 -3 75 -153 -82 -79 159 210 155 -81 21 -36 -79 -198 5 42 57 -152 -127 58 -234 64 54 -120 -53 -16
6594 -16 5 -134 135 229 -105 -171 -14 40 36 -258 302 -110 -42 -38 117 -177 -45 -128 -8 -99 -34 -124 -454 19 85
6619 85 118 88 -166 29 -72 -115 29 -23 93 43 -49 1 59 30 79 101 60 -25 -32 15 27 -48 129 165 44 -129 173
6646 173 105 -102 166 -34 -74 151 -194 137 -122 -118 76 18 119 185 251 67 -40 -94 -153 -57 60 415 55
6669 55 -155 15 -100 183 57 -105 -13 23 32 -147 -191 36 -124 -467 12 38 -213 200 -140 32 127 -29 -234
6692 -234 -131 -376 -119 75 17 146 -6 270 65 -51 91 -20 45 -68 185 55 80 -236 -42 179 -278
6713 -278 115 169 -335 114 -52 162 -36 105 378 -57 180 -91 65 170 -82 -35 -151 -12 137 -69 -65
6734f5L04l39J35k94J28Q1p5K53q8pJ2j10L55j66l45K94qQ1j94n2J86P6m57N09
6758B14Pp9J77k60R6k01R0P4p4J21j01R7j31p7P5n7P0O0k80J22q6K92k08j10J96
6783B7m7k81L7L38k80L51q9J81j58l8o4o4K12l65M9L37j74J2J46j92J40k63L66
6806A81l66K49j18J41r3l3m5K4K82r3q6J38k27k02L25K4k7lJ55J4k91m2J35K23
6830B65j93j87j16M05j05k71L57l33J71l9M3k5J89k71J15K01j58K1K2Rm01L59
6852E8k03q4L49j96K65q1l79L57n2O7j99M6n9K16O0k11q2J78l3M1m3m8J22j10
6876b1J2p9J02m9L19o4k23j71J2J36O3k03K7M3o3M55j43k03J47o8m1j32J20q4
6900a08P0K65l5k4q6oj74kj44R7K07k4J44k66j9L7j18p7M5L67P0m47J79L0L02
$$ plain form
6734 -65 239 -100 35 -259 -131 -50 -125 128 40 33 45 -65 290 124 -221 73 65 146 -48 -100 86 162 -295 214
6758 214 221 142 319 59 155 -46 44 118 44 165 64 161 30 -47 28 -29 41 101 -179 -57 -143 149 -59 -169 27
6783 27 -20 -301 -264 74 -206 145 56 237 79 41 -23 -87 125 -240 -191 146 -28 -16 130 -62 78 -185 181
6806 181 -185 64 -54 87 -6 -39 -84 -60 222 129 43 181 -46 -248 77 101 74 71 226 240 -51 -93 42 265
6830 265 72 -115 -231 174 69 -202 155 -178 -7 -46 -3 -28 161 -110 5 206 48 69 91 100 -301 58
6852 58 -145 -229 120 -76 189 108 -271 86 34 101 -98 -52 -111 105 165 -46 -128 50 17 58 15 -33 89 -21
6876 -21 -9 -88 14 -35 284 220 -3 -174 -162 -26 37 -166 -139 -96 -159 296 153 -50 97 29 -12 -144 -24 -108
6900 -108 -38 227 192 168 82 76 -98 -100 -244 -147 60 36 180 -86 -105 -68 -186 -263 -218 149 219 -228 -49 -19 283
6925B83m38J71k08K34J14n4k5P6k15j41P3J21j10M02l81K03j95J95m65j1N03J48
6947B80k50o4Q4j58J41L0L5k63n2K16k80J64Q9M6K42j49l03J05J81Q1k29j16J64
6970fMJ69l76J01l7Jr7M61N2l62j72L48R6k80L99l71M6N2j26k60N58l1m42K44
6994b9L59k16n46L48q2J29M8J38L7j79O0K42l02j22L1k0K22J00k74o7J41j29R7
7017a4Km6p5R7j00L09j76J31r3j72K34l48R6J87r2J10J37k71K96o85O75l26L2
7040i2J22K28j62k5J60j49K4k26K95j66j01J35J51m16J92m2K38P8p5r3k32J31
7062b5K82k59o1m0Kl6J74p2K41l96K44k23K54np8N4J14m15J76k6J47j99O6J65
7086H4k76J01n0J03j53M26j03L15m14J41J7l9k47J43K83l51M6Qj12J19pJ34m16
$$ plain form
6925 283 -155 16 -192 42 156 102 77 153 -62 -203 -130 -9 -119 283 -98 105 -90 105 -360 -371 132 280
6947 280 30 -34 50 -108 33 63 98 -165 -217 -1 -281 -117 -28 18 260 111 -192 -87 94 175 -54 -170 -6
6970 -6 -2 167 -209 -108 -145 -144 -241 220 272 -90 -262 86 182 -98 301 -70 -24 28 -98 -358 200 169 -273 -29
6994 -29 330 114 -432 -84 -166 -37 11 149 186 7 67 309 7 -115 -84 -104 118 218 -56 -123 18 -111 -14
7017 -14 -12 -58 -133 -36 -136 173 -3 128 35 -137 97 -251 -155 32 -60 50 187 -84 212 -473 202 -124 -92
7040 -92 30 258 96 71 231 82 106 -120 175 9 -92 43 194 -222 -30 -72 166 244 169 76 -156 -25
7062 -25 257 -2 -63 -103 -101 -137 37 -35 206 -190 54 -169 85 80 2 56 170 -245 -69 -95 52 -147 -81 84
7086 84 -192 -91 -141 -38 -191 235 132 447 33 174 191 152 -95 48 331 -20 26 34 -78 41 34 168 -248
7109b48J50l6J74k5J68k41j66J33P1K30j85l6k9l8J45K06m55K62l90K70P1m6m8
7132f3K58j28K3L1R2k83o1L2KJ20J49L5r2k20J27l3L3q0j41K70l9j00J18j17K42
7157A75Q7l38P4j57L21k12j72K73j64K70j53q3O0Q3j69K51k1r3LM3k47J49j6m7
7181h3j85K63k11K88mr0Q3k11L47l65K29j43K26o5O3j77M9J77o8m26M88m56L52
7204H1k44L31j03j72j3J20q4M3J65k89N88l67j07l8n2J04m0K00j33k04j75L64
7226b5J20j10Jn6K70l5p1M3j22p9K38j81J34K17k09j86j93M4J77O9R4j28r3k2
7250a03J04K05l66L2N1l5j37m7J04K54j20L1o1J14Mj29L79l69O1R3l37L46nj00
7274c1r6J23p8N9j07K70m05J27N0r2Q4K58P3k75k42M24j20K8p5L64j31l27k7L31
$$ plain form
7109 -248 -98 -134 40 15 183 -58 -224 -91 -20 210 25 -11 -40 -78 67 273 -182 80 -310 -40 31 -15 -63
7132 -63 195 67 90 121 213 -70 -131 -99 -97 23 172 207 115 -105 22 -11 22 -58 -199 71 32 -68 50 -67 175
7157 175 262 -76 -2 -159 162 -50 -222 51 -113 157 4 -79 -19 64 -105 146 125 32 35 78 -169 -20 -36 -83
7181 -83 -268 -5 -216 72 68 -22 61 -150 197 -168 61 -82 144 79 142 -35 14 191 123 -303 185 -271 81
7204 81 -163 168 65 -107 -120 0 -84 -41 124 -165 423 56 -51 -89 -141 -37 -77 123 -10 -214 -389 -25
7226 -25 95 -15 -14 -70 200 165 94 137 15 -64 174 -7 127 344 135 -51 -244 -200 -23 46 140 12 -81 -103
7250 -103 1 206 -160 -128 -77 -112 -249 -296 -192 62 -58 -27 -88 26 30 -99 280 -89 -28 65 -272 74 69 -31
7274 -31 -127 -4 -82 -23 -130 140 -265 -138 -88 -180 -96 162 235 -40 -282 142 22 50 -25 339 208 -119 -146 185
7298A85q3Ooj43J92l44j07L70j0L3J09Q0l54q6L27j39J26l06M33k89n1M06p4l50
7322g5K91j03l2r8J90k99K43k1k99k04K18L36j52m7J1J48r2j94N6J38p7l2O0K35
7346B01k47k11M26p9n6j4n1Q7j18q3J17J56k62K73l60K68J42l37J30j0K48R2l17
7369el82M03j75j91L75O6J03k00P7j18m8R5J75j23q9j62J77M2j44j62L84j22l
7392b7O5o3J16j32M0J76k17r1L7O0J83m22K90j59J86L7k31qM43n54K29J19k00
7415a23K66j50m2K8J05r0M9o7j55Q8K2K14j21l21L72J9l32K59J13k39k1J27q5
7438h4j61M10p3j63K13j52J75lp7l63L28O0n8L49l30l69J15J22K25jk19m8mj07
7462b15J45N2k15M8K46jk7j16O4j5K18l05K34j59j4J48l5J70l14K24r3Q9k4j76
$$ plain form
7298 185 102 108 102 -41 151 -193 -300 70 60 93 202 282 -72 -158 169 30 156 -150 283 -6 -57 349 275 -75
7322 -75 216 113 81 -17 173 -126 117 96 -203 -407 -189 147 -5 -52 -41 107 15 -179 -123 15 -62 -94 -34 201
7346 201 -46 -257 169 90 34 20 -31 56 -62 -145 -28 128 -134 139 -221 47 189 -148 -18 -28 220 312 -5
7369 -5 -387 16 -159 -350 25 91 194 -6 71 -47 -95 0 175 52 -37 -199 -22 20 -124 -286 98 -24 -27
7392 -27 38 -25 91 -41 -1 175 -42 -133 -96 -36 147 -275 15 -144 42 79 -152 -160 283 -271 -42 77 -123
7415 -123 143 -7 -49 -21 84 -6 43 -24 -179 -91 -69 145 24 -297 75 94 -238 21 134 -105 -126 1 -84
7438 -84 -245 165 92 -71 142 -10 165 162 85 -278 50 110 52 401 71 -298 -183 -61 164 163 -56 -104 -108 -215
7462 -215 -70 -18 -233 -185 61 60 33 -83 -19 -34 184 -121 113 -46 -60 88 53 223 -91 133 40 129 105 -71
7486g1j10O1K34j50L51j95n9k06l8L26k16J82q9k56Q1J48K6k6j21k42L50j32K75
7509A23j18K5J56O4n38K29N4J80k12m4n9K26k58L39j66J69j24k6m9L7j20J73j48
7532h7J14k02K5M14j61k20M9J31K0qK2m2N7j41LK34k81O8J64j19Q4k39J06J7k32
7557b24J75L2O3j63L0l06N82m69K37J4N6N9j23m7j71M12j81j41L23m26J56O2j28
7580a78K44k63n3L06p3J68k60o7K09n8J26P0o2k69K81L3k18P8P6j13m8j95K61
7603eJ6J70j63j53j78K90j71J53J6K1j00N1J65m3q8o0K16j67o2L15k37p7K04q9
7627B4K18j5o2k99K4j6J41K93m86L10j79j13K30J15j70Mr0J03J20k28J17j23J94
7650A12Kk02LJ73j28J21l63J75J89r5o1O1J5n5Qj84K80ml5P9j46j28K58k62k9
$$ plain form
7486 -71 -181 -120 114 -36 315 120 61 -145 -183 143 -73 109 20 -236 -155 -7 19 -7 -128 -370 -20 -152 123
7509 123 5 30 186 250 -288 -59 -5 175 -37 -81 -140 86 -172 167 1 170 46 20 -29 8 -112 61 -87
7532 -87 27 -175 -150 264 103 -117 -68 63 83 75 97 55 112 -29 -26 208 -73 -5 159 40 124 -115 -9 8 -224
7557 -224 -49 -17 46 -117 -87 -393 189 -280 -43 -29 27 86 -37 -84 -255 157 -24 -165 158 -268 -112 -50 -178
7580 -178 66 -197 -250 56 -17 151 -109 -176 33 -25 101 171 109 -160 121 154 -64 14 90 -23 -71 -266 -5
7603 -5 11 181 18 -135 -313 -23 -194 -41 -25 -4 -104 -53 112 69 -19 -79 137 -30 -92 223 -14 -91 113 24
7627 24 242 227 165 -134 -110 -126 15 308 -178 132 -47 -160 70 185 15 19 -71 32 152 -76 41 -82 112
7650 112 114 -88 -85 88 -40 81 -282 -107 82 -13 -74 -13 2 -53 -45 -229 51 47 12 91 -55 -183 75 -187 -216
7675b16N40j89o2j38m0J56j14R1lL6%j22J40j97K20p7j51p6P9K42QO0k6j24q4
7700d7o4J27Kl39M48j42M15m08m1j0jK15j07J42J63n0l01Q2n1Q7j42l8K81j89
7724C2p6N4m8j79J77l7k5j13L54m8J03n35L92j4L89m37L23l52k11K05r3K03l33
7747b69K26k45K38n3Q1j07O75n52J73rJ9J51k95j70K03j42k4o2L89m96K21J00
7769E2j30O1J94k4l69L08j54P3j74j20L38j9j32R0j14K42j74jMR8J43j14n8J81
7793B01j54j24K4J88j07J31j92J17j4k77M43r3j10j51J7J33r0N7j79K87O4j3P3
7816B31j38l34J55N0j80K70k11L16L6l76M94o62J32K48J4j24L3J98j61j1J89m87
7838c18L58L73n50L9jk0K04k07K59o0k42K10O9k63K77k03J34J29j65k44K19L1
$$ plain form
7675 -216 324 135 73 -65 -105 51 -63 28 25 61 61 -61 79 -118 102 25 -126 -202 -123 119 127 187 161 37 -47
7700 -47 -111 16 18 -321 127 -15 400 -8 -49 -59 -60 155 48 190 353 303 2 84 33 120 -22 -60 221 32
7724 32 -44 10 -38 -217 -40 -77 -102 -215 139 91 194 -341 51 37 426 -11 312 -40 -251 -46 -139 64 -269
7747 -269 -43 -288 -50 -103 -22 -129 546 -6 167 158 177 328 33 -137 66 -76 -100 -162 227 -269 -48 52
7769 52 -78 -17 177 153 -216 92 -62 11 -163 -283 55 36 -96 -6 -120 122 -52 -53 -49 49 192 78 20 201
7793 201 47 -77 -53 135 28 159 -33 84 70 -207 236 143 33 -118 -101 32 -58 -1 -180 107 171 158 231
7816 231 93 -241 -86 -36 -216 54 -157 159 195 -181 313 -349 -217 31 45 -79 -46 152 -9 -20 169 -318
7838 -318 40 413 -137 -98 -99 -119 85 -122 137 77 -165 45 114 -149 128 -75 59 188 23 -221 -2 29
7860B9q2k9j87K96LJ41l06K15p8j85J69J30n2n8m7J37l60N1K72J51k26J31l06
7883a91K15K01l32%J20j19R2J68r7n3o2j53K26J30j08j52M1O1j4J11j13J99j34
7906C6Q3J93l78RL77l60k09L95j93j26l4M83k38L1j3J80j1l40J23k5N3L9l21n2
7930b98J51J59L8O7j40k48L42j05J2j7j5N2M2p2L9q5M05j16o7m9l13K94K9j53
7954d8K96l15K62j14n8l6R9R8k02K19j13j31n4J07k4j04J9L4r9R5K0j5j12j5K71
7979H0kQr1j51J27R3j52J44P7p4q7k03K67j70K16j78n6J05J76j21q5jK24j8j53
8004b5m5o4j76M04j6K22j57o4l43N3K45R0Q9k82j9L62k86k6o6m3J97m80K91J29
8028a0L7lJ56j21l28J56K99m12K42q9R3m2J54o0l45J26L72m31L6O0O1J36j94Q7
$$ plain form
7860 29 -53 -82 -269 27 30 171 -135 80 2 -183 -14 116 64 6 -41 96 -264 -213 59 210 -16 115 -191
7883 -191 24 225 -107 -107 13 -106 -14 154 57 4 -58 -211 15 145 37 -115 -74 -13 -27 84 -29 170 36
7906 36 119 312 -66 -57 320 -40 -249 146 -47 -173 -207 276 38 69 56 236 225 -115 8 -17 36 75 -246 -298
7930 -298 -147 12 50 117 -23 -271 71 -34 -22 -39 -54 -2 40 -32 7 -78 327 211 144 95 -218 76 105 -48
7954 -48 248 -67 195 81 23 -13 86 184 -18 201 88 -43 -97 10 -14 -118 -99 -65 -164 -69 -49 -64 -176 -191 80
7979 80 78 86 -5 -156 -29 64 -88 56 133 59 -28 -231 36 -134 82 -96 -152 -47 129 8 -77 -78 146 128 -25
8004 -25 -70 -134 -310 94 78 300 143 79 -264 -211 34 124 213 -69 -88 274 -12 -38 -104 -147 50 -430 -139 -10
8028 -10 27 24 180 59 -269 -113 186 -226 16 -73 20 -22 132 72 -273 -147 225 -206 -170 -110 -49 87 -107 -20
8052b0K8R5j32K14q4k43K93j96k60L10q8n4j7M57k92J92jj41J17l19L8J85j4k30
8076a62J80l30K06J67j38L06k40j87J79j70J36O3j13l5L73k00j10k6J91J18l65
8097a57J74N7o0N5r5J48j14K04j23q3L01k37J3Kj70j48K46k9L80k28j35o1O9k76
8121b67M76k77m8J35%m30P36j38j80j35J13j07L71j04k03J47M0k79J16j71K16
8142A1J44j90j3j82j06L48J79j51j41l8O17o67L95k43rL05j8k15p7L3K60m11K88
8165A19j78K96l52R1L46o47J3K97O0j35M2J36j19J73k29R7N1k97J40P2ln3L01
8188B21l27K30O7
$$ plain form
8052 -20 8 103 -29 185 101 -142 151 -45 -305 5 -83 -137 -154 303 11 203 202 61 178 -141 -103 82 68 -162
8076 -162 18 -312 -106 61 -77 229 -11 -198 -19 -189 -53 10 -103 -138 235 35 -75 -101 90 208 -157
8097 -157 17 74 14 69 -26 122 8 212 89 6 307 70 83 85 -85 -233 13 -16 364 136 1 -60 9 -267
8121 -267 209 -68 -116 19 19 -411 325 187 7 -128 -15 -122 249 145 -58 89 129 -150 -34 -205 11
8142 11 155 -35 -48 -230 -336 12 191 40 -101 -139 478 -189 206 -37 -46 259 241 26 -51 -18 242 -169 119
8165 119 -59 237 -115 -24 322 -325 -312 -15 45 -90 -48 88 -31 142 -87 10 61 -236 -96 -24 -27 -80 221
8188 221 -106 124 191
8191A91
$$ Imaginary data points
##PAGE= N=2
##DATA TABLE= (X++(I..I)), XYDATA
0@%%%%%%%%%jRj6J6j6K4l2M0m8N6p2Q8j04J21j45J76k06K39k77L17l65M20m79
32b55N44o17P00p89Q87r96J115j246J389j546J716j902K106k325K565k832L122
49A636l439L790m174M600n074N603o196O867p634Q519r556J0788j2281J4136j6513
64h928J9682k4147L0964m2787O9072k37559N3220K38644j71912K23141J11433
75B60823k04749j15357K7387j25271J8781P4854L7429J67781J43436j18614k4074
86A42426k188k22626j18761R5266l4365K3559J69101J2349j7596R0384j33484
97D065j78954P2116p695r6415J97545J95727o3765J3284O5315j34444j17970j0493
109f1684m0957K1938Q0916K0919P6867O5950j18811r6485j90j10865p1502J16801
$$ plain form
0 0 0 0 0 0 0 0 0 0 0 -1 8 -8 8 -8 16 -16 24 -24 32 -40 48 -56 65 -80 96 -110 129 -148 169 -196 224 -255
32 -255 289 -328 372 -417 470 -526 589 -657 732 -814 902 -1000 1106 -1219 1346 -1486 1636
49 1636 -1803 1987 -2187 2413 -2661 2942 -3254 3613 -4021 4498 -5058 5730 -6551 7585 -8928
64 -8928 10754 -13393 17571 -25216 43856 -193703 -140483 98161 -73751 149390 260823
75 260823 56074 -59283 -31896 -157167 -138386 -63532 -26103 141678 285114 166500 142426
86 142426 140238 -82388 -201149 -105883 -140248 -116689 52412 64761 47165 137549 4065
97 4065 -174889 -102773 -110468 -206883 -9338 186389 122624 135908 201223 66779 -51191 -61684
109 -61684 -102641 -80703 213 21132 97999 163949 45138 -51347 -51537 -162402 -233904 -117103
121a17103P5130L6376J32033M3181o6929q924p0380j42487R023O6516m478Q9965
133D1923J34211j6388o4210l4339r8383j00135k7108L151N8603R8877M9007M2231
145H7440M1968o5225j01610k5360k3728k3692O9828R4755M9966M3170P50o6557
157H1705o5263o8471p9390k381O5018M4015M6487O6576L332o5827o0896m0518
169g5613l2906m566M4095Q3063P3912L0898M842j6283o6001q5121m0874M944K0146
182e9464M1376O4780M5567n969m2097n3807o0274n0041j2039L4864O8208P2704
194D3808M5022J6840o015n1994p7640l6157K243L988L8976P6048M4486k646k1530
207G5429m8476o8184n4841k6777J8988N7403N1378M1578M2150p839n8808m4037
$$ plain form
121 -117103 -41973 -5597 126436 169617 102688 93764 23384 -119103 -110080 -43564 -48042 41923
133 41923 176134 159746 95536 61197 -37186 -137321 -164429 -161278 -102675 -3798 45209 87440
145 87440 129408 64183 -37427 -62787 -86515 -110207 -40379 54376 104342 147512 148262 81705
157 81705 16442 -52029 -131419 -133800 -68782 -24767 21720 88296 91628 25801 -35095 -75613
169 -75613 -108519 -113085 -68990 14073 87985 118883 123725 107442 41441 -43680 -84554 -79610 -59464
182 -59464 -18088 46692 92259 86290 44193 -9614 -69888 -119929 -131968 -97104 -28896 43808
194 43808 88830 105670 99655 47661 -29979 -66136 -63893 -59905 -20929 55119 99605 96959 75429
207 75429 26953 -41231 -96072 -122849 -103861 -46458 4920 46498 88648 80809 22001 -22036
219b2036l0165l0219J4714N6086N1172M7707K6149k5645m3077m7184o7471l3418
231a03387K6193L0739L4326N9963K8920k2349l2689m4878n0058j4533J1536L2271
243d3946O9100N4306J0493M123k0623o9698n3603j3742p826K1328N6073M0317
255D6302K1586M781m0087n4737l3601l4443j1837M5814N3557L5861M2340J5554
267I1090l2559l9530m0017l8809m38K6228K7612M8442M0287j2011k8066k7850
279A4379n6398m4869L558J9992L2497N3193L4254N508p636l9328n0093j8459l719
292e7121O684M7262N4077K1580P607j1557m7022m9562l3035j9813J5152M2072
304b3676L4582L4217K5022k0761m3712l1417l3366k2581K0530M3457M1687M0459
$$ plain form
219 -22036 -52201 -82420 -67706 -11620 39552 87259 113408 87763 44686 -2498 -69969 -103387
231 -103387 -77194 -46455 -12129 47834 76754 54405 21716 -23162 -73220 -87753 -76217 -43946
243 -43946 25154 79460 89953 94076 73453 3755 -49848 -63590 -71416 -50088 5985 46302
255 46302 67888 72669 32582 -22155 -55756 -90199 -102036 -56222 -2665 33196 75536 91090
267 91090 58531 19001 -21016 -59825 -60263 -34035 -6423 42019 82306 70295 42229 14379
279 14379 -42019 -86888 -83330 -63338 -30841 22352 56606 62114 54478 15150 -34943 -53402 -57121
292 -57121 -50437 -3175 50902 72482 80089 68532 21510 -28052 -61087 -80900 -65748 -23676
304 -23676 10906 45123 70145 49384 5672 -25745 -59111 -81692 -61162 -17705 23982 64441
316F4441K0067j1827k9937m5086m5427j5383Q236J8815M1079M2627J0816j0529
328D7892k1640m1347m0265j5812N235K5565M2475L7602K1709L290k3208l8882
340B614k9815j8577k723K3245L5826K9260J7262j476k5513l7276l5490k3414J269
353f4808K3583L3472L5906K4785j89k0076k9528l3041k3629J739K3728L3361L6126
366D1429K4667J071k3160l7299l7125k6967p826J5854L4479L6383K4769P505j3513
379D0267l3606l7717k3936m405J4321L2499L9879L0020Q700j1840k8304l7052
391a1174l1143j2945J0462K6362L0690K6333J1738j0583k7919l1576k5731j2281
403e7767P583K6937L4040K8650J3050n156k0371l0492k8086j1498P019J9488K8097
$$ plain form
316 64441 84508 72681 42744 -2342 -47769 -63152 -54916 -36101 4978 47605 58421 47892
328 47892 26252 -15095 -55360 -71172 -65937 -40372 2103 39705 61414 64704 41496 2614
340 2614 -27201 -45778 -48501 -25256 10570 39830 57092 55616 30103 -7173 -42663 -66077 -64808
353 -64808 -41225 -7753 28153 52938 52749 32673 3145 -29896 -53525 -51786 -28058 5303 41429
366 41429 66096 67167 44007 6708 -30417 -57384 -65210 -49356 -14877 21506 46275 53780 40267
379 40267 6661 -31056 -54992 -59397 -45076 -12577 27302 57322 66022 54182 25878 -11174
391 -11174 -42317 -55262 -44800 -18438 12252 38585 50323 39740 11821 -19755 -45486 -57767
403 -57767 -50184 -23247 10793 39443 52493 47337 26966 -3526 -31612 -43110 -36091 -16603 11494
416A1494K7564J1784q457k3845l1451k7141j4322L454K2560L1845K5446J4496
428D3427Q81j9279l0383k5468j2953K400K0518K9876K7777J7239k919k2033k7828
441A255k8791k2851j107J9311K5218K7994K1472M37j6415k6058k9561j7602K375
454d4323J3522K5986L4175J9409m02j0530k4379l2030j9747l988R482K5601K6468
467A9244J5042O993j0381k9387k6511j4099q850Q786K9312K7500J8953Q821r302
480C6121k2301k3740k2969p922J5032J8888J9160K4869R268j6266k1017k1501
492a2378k4464j0131Q239J9363K8169K1507N351j769j3652l1516k1394j090K894
505c0871J2837L0710K3434O630l726j8578k6229j9978j5586l36K2886K2701J3554
$$ plain form
416 11494 39058 50842 42385 18540 -12911 -40052 -54374 -50920 -28360 3485 28931 43427
428 43427 44308 25029 -5354 -30822 -43775 -41375 -20857 9019 36796 54035 51116 29083 1255
441 1255 -27536 -50387 -51494 -32183 -6965 21029 42501 42938 26523 465 -29096 -46698 -44323
454 -44323 -30801 -4815 29360 48769 48367 37837 13458 -18572 -38319 -42307 -32825 -7224 19244
467 19244 34286 41279 30898 1511 -25000 -39099 -47949 -39163 -9851 17649 36602 45423 36121
480 36121 13820 -9920 -32889 -40811 -25779 -6891 12269 37138 46406 30140 9123 -12378
492 -12378 -36842 -46973 -38734 -19371 8798 30305 35656 33887 20235 -11281 -32675 -33765 -30871
505 -30871 -18034 12676 36110 42740 39014 20436 -5793 -25771 -41357 -41693 -18807 3894 17448
518A7448J7094L545k2355k4685j4892j3957k60J8053K2825K4591J5134n765j2672
531B4104j6077k8738j8314P700J2841J3548K4812J7236l925j4262k0990k2569
543b4634j0810k742Q636K7502K5074P044M141l267k5009k4973r048k462Q085K0263
557b200J9688J6240M695j6259k0481j4244j9333j1218J5541K2079J4107J6564
569B5179R934r231j8256j9784j6372j262O765J2456K4419K0910j362q098r493
582A5805k2645k2646m132P038J3377J8814J6009Q444k746j8531k1122j0786p661
595c0782n05J8435K3918J4476O467q00j3334k0668j9484r019N434J2879J4302
608A319J8771J3180o567j5736j5738j6611j2177J411J4515K0206J6883Q691K265
$$ plain form
518 17448 34542 38087 15732 -8953 -23845 -37802 -38062 -20009 2816 27407 42541 36776 24104
531 24104 8027 -20711 -39025 -31325 -18484 -4936 19876 37112 33187 18925 -2065 -24634
543 -24634 -35444 -38186 -29550 -2048 23026 30070 34211 30944 5935 -19038 -28086 -30548 -22463 -2200
557 -2200 17488 33728 38423 22164 1683 -12561 -31894 -43112 -27571 -5492 8615 25179
569 25179 35113 25882 7626 -12158 -28530 -29792 -23027 -10571 13848 34758 33396 25298 15805
582 15805 -6840 -29486 -33618 -26580 -13203 5611 21620 30064 27318 8787 -12335 -23121 -30782
595 -30782 -31287 -12852 11066 25542 32009 31209 17875 -2793 -22277 -31296 -25862 -12983 1319
608 1319 20090 33270 26703 10967 -4771 -21382 -33559 -32148 -17633 2573 19456 28147 30412
621C0412q865k1502j9197o587Q73P049J7951J9994R800j874j1320j5383j6866
634a5515j4755k123J3172J6060J3493J3359M819r500j6347j5847r652j712N712
647a8836J4920K0177J0970j399n630j1730k0241j3773n00O499J2327J5685J1948
660B0417N237o302j6936j4025p786p943L683J9114J6650Q702O537k728j4812j6578
674f770j3569n646O569J0769J2885J6482P174r529j1890j1260j6421q279O596
687b2889J2593J4753J4497N731j368r033j8163j4300k727J98O495J8750J5341
700A9878L532j459q831j6119j4082p740m85J2333J4572R754J0152K756j2324j4551
714b614r369q323j952J0212J3487J2985Q808j630q138r724j5649j1681K718P778
$$ plain form
621 30412 21547 45 -19152 -25739 -24866 -17817 134 20128 29928 28054 16734 1351 -15515
634 -15515 -30270 -32393 -19221 -3161 10332 23691 28510 19010 2663 -13184 -22836 -24548 -18836
647 -18836 -3916 16261 27231 25832 20202 8472 -11769 -25542 -26042 -19543 -7216 8469 20417
660 20417 25654 19352 2416 -11609 -19395 -27338 -23655 -4541 12109 20811 27348 24620 9808 -6770
674 -6770 -20339 -25985 -19416 -8647 4238 20720 27894 18365 6475 -4785 -21206 -29485 -22889
687 -22889 -10296 4457 18954 24685 23317 14284 -3879 -18179 -20906 -20708 -14213 4537 19878
700 19878 23410 21951 13120 -2999 -17081 -24821 -25306 -12973 1599 11353 21505 24261 11937 -2614
714 -2614 -11983 -20306 -22258 -12046 1441 14426 23234 21604 13466 3742 -11907 -23588 -20870 -13092
728a3092Q306J3873J1753p62p422j1097j2669q055k237M961J4619J4332O099K307
742B0916k458j3577j5125p273j325L627J0543J2536J0084L143p195j0921j0143
755g168j1014o145P487J2465J0657R641O267m188j1358j2864r942k492K849Q142
769g663J4711J1539P42m052p012j3406j2567l506M245Q484J1065J0699O248j634
783A7893j0410j1561p816n443p38R831J3090Q763M767k86p956j1733j1100n908
797a8607J924P252Q949J0869P557k091q150q663r773p154Q94P448J0362J0434
811A1251N532N44m884j0863j2096n177L8L617J0385J1737N994m2n625r449j0131
826i169p593j777O403J0715Q700P661L250m907j0889r104o710k817M068R022J1006
$$ plain form
728 -13092 -4786 9087 20840 20078 12656 1559 -11110 -19165 -21402 -16441 -1822 12510 18609 20916
742 20916 18458 4881 -10244 -17517 -18842 -15215 -4672 7864 17948 21091 13896 2975 -7168
755 -7168 -18182 -24327 -16840 -4375 6282 15923 22190 18002 6644 -6220 -16162 -18654 -15805 -7663
769 -7663 7048 18587 19329 15277 8265 -5141 -17708 -21214 -16969 -8485 2580 13279 19527 17893
783 17893 7483 -4078 -11894 -17337 -18075 -8244 4846 13609 18376 18090 10134 -1599 -12699 -18607
797 -18607 -16683 -9431 -482 10387 17944 15853 7703 -960 -10733 -17887 -16993 -9545 817 11251
811 11251 16783 17327 12443 1580 -10516 -15693 -15655 -12038 -1653 10084 16078 16036 10411 962 -9169
826 -9169 -16762 -18539 -12136 -1421 7279 14940 18190 13283 2394 -6710 -13420 -16237 -12169 -3147 7859
841G859P373J032m237p098j1204r295j996N022O824R609R355L230l583q376r425
856d910o693l676K018Q835J0498O424K888j210p520j1166p937k257J818O491Q594
871B197Q592M004k869o927p356q172m725K089P331Q483P737M685r84o537r047
886a499q138l800M73N076Q777Q696M114j111m991q382q851m741N63N457Q237Q152
902H032N907L55n482q118p698n331j194M573Q075Q582N465Q18m629p796q807n798
918a3046j003M065P361P985O413J238l536o914q102n921j105L174P127Q106N772
933A1614J217k915o349q182o059j987K720O205P614N976K511k983o226p197n952
948i993k611K342O742P504N943K340j659n706p751o331k738K207N383O709O699
$$ plain form
841 7859 15232 16264 12027 4929 -6275 -15570 -17566 -12544 -5720 3889 13244 16474 12891 4515 -4910
856 -4910 -11603 -15279 -13261 -4426 6072 12496 15384 14174 6654 -4512 -12449 -14706 -12888 -6397 2197
871 2197 10789 14793 11924 4997 -2359 -10531 -15256 -13167 -5836 2647 10384 15069 14085 7548 -1499
886 -1499 -9637 -13437 -12964 -7888 889 9585 13699 12588 7597 -785 -9636 -14377 -13814 -8357 -120 8032
902 8032 13939 14294 8812 694 -7004 -12335 -13529 -8956 -881 7701 13166 13984 9355 1559 -7248 -13046
918 -13046 -14049 -9984 -2623 5362 11775 13013 9477 2563 -5539 -11460 -12565 -9391 -2264 5842 11614
933 11614 12831 9916 3567 -4615 -10674 -12661 -9941 -3736 3878 9854 12365 9382 3156 -4041 -9993
948 -9993 -12604 -10262 -3520 3984 9927 12267 10608 4902 -2849 -9180 -11918 -9711 -4328 2381 9080
963I080K420j510n215p057o227l596J222N318P057O343L605k60m962p027o263
978g072l630J33M483O821O359M002l16m326o976n993m372N4M379O102O392M055
994A0095N97l893o436o235m127n93L695O560O378M157N69l684n686o823m366p44
1010a0536L288N895N958M928R21l490n363o221m654j038K466N627O593M428J065
1025I867j943m737o648n231j469K319M560O452M984K001k417n225n567m792k244
1040a0090J804N100O005M336K591j425m341o025n100j705J326L674N179O018K623
1055I970k219m012m656n573l351J190M347N366N104K867l88l903o078n207j914
1070h457N9L128O082N630K180k09l030n381n620l086K46L366M851M888L882N75
$$ plain form
963 9080 11500 9990 4775 -2282 -8509 -12105 -10883 -5565 1492 7835 11440 11180 6218 -809 -7072
978 -7072 -10702 -10569 -6086 735 7094 11096 10780 6454 -522 -6515 -10887 -10833 -6454 -352 6040 10095
994 10095 10692 6799 363 -5872 -9999 -10592 -6897 -337 6041 10198 10767 7083 1397 -5426 -9792 -10536
1010 -10536 -7248 -1353 4605 9533 10454 6964 1601 -4620 -9274 -10312 -7846 -2219 4374 8802 9867
1025 9867 7924 3187 -3461 -8692 -10161 -7842 -3282 3170 8154 10155 7738 2513 -3054 -7846 -10090
1040 -10090 -8286 -3186 2819 7155 9746 8321 3980 -2045 -7145 -8850 -7524 -3850 1329 7347 9970
1055 9970 7751 3739 -917 -6490 -9841 -8651 -4304 1062 6166 9033 8645 4742 -1336 -6543 -8457
1070 -8457 -8398 -5270 812 6442 8622 8413 5383 2 -5618 -8704 -8458 -5092 -241 4647 8529 9104
1086I104l826n311m246l750j071L129N554N085L255N34k373m975n609l443n1K500
1102e494L856N203M419R0k687l830m866l853r90K135M744M703L180J256j162m786
1118A918n408l391p49J152M020N348L610J520j861l686m655m187j772J693M405
1133b043M186L514K577j165m306m867l146k348M83L478N253M127J833r90k993
1148C593m257n094j852J012K915M242M499K776n97l452m329l727k742m48L303
1163d158M736L847K137L61k455m381m598k554M95K049M030M555K958m26k618l374
1179F04m180k912k02K554L989L572K214J042k051m200m183j969o64J021M423M411
1195C469K640L17j929k918m396l440q33K714L223L356L511J538k104l778l607
$$ plain form
1086 9104 5278 -33 -4279 -8029 -9100 -5971 -417 4668 7923 8457 6084 1109 -4500 -7943 -7994 -5494
1102 -5494 -1638 3565 7984 8074 5387 1557 -3309 -7162 -8152 -6017 -1273 3430 6610 7866 6704 1918
1118 1918 -3490 -6881 -7630 -6478 -2458 2890 6500 8020 6159 2473 -2182 -6369 -8141 -6448 -2043
1133 -2043 2143 5657 8234 7069 2763 -2104 -5250 -7598 -7115 -3637 1616 5743 7576 6586 3593
1148 3593 -664 -5758 -7610 -6598 -3683 559 5058 7834 7237 3785 -544 -4271 -7013 -7461 -4158
1163 -4158 578 4425 6562 6923 4468 87 -4511 -7065 -6570 -4521 -491 4064 7022 6596 3978 604
1179 604 -3576 -6488 -6690 -4136 -147 3425 5639 6681 4630 430 -3753 -5722 -6386 -5365 -942 3469
1195 3469 6109 6426 4497 1579 -2817 -6257 -7090 -4376 -1153 2203 5714 7252 5148 1370 -2237
1210b237k981j346Q07L420M796K851P02n27k512m571l945p56J080K447M069L743
1226E040J570j100k930l580l064j927K53L004M107K525J707N99l213l994l175
1241d178j307J45K101L443L942J793q69k234k665l747k795J074K535K952L200
1256C390K064R9k361l718l079j530m88J501L894L727J751j97j154l251l683k202
1272e237k44K049K729L229K636R42k362k927l074k539j355J998L452L140J907
1287D344P84r16k927l413k716m18J341K412K932L335O12j576k106l088k682j016
1303e098O29K880L299K130J105l50k817l612k208n15P7K121L793K639J028r71
1319D130j934l048k764j852J131K497K632K426J912m03k778k832k144j656o2K005
$$ plain form
1210 -2237 -5218 -6564 -5757 -2337 2459 5310 6012 5485 2973 -1598 -5543 -6299 -5219 -2772 1297 5040
1226 5040 6610 5510 2580 -1000 -4064 -5991 -5738 -2734 1373 3898 5605 6204 2991 -1003 -4178
1241 -4178 -5485 -5340 -3239 204 4146 5939 5070 2836 171 -3576 -6371 -5297 -2762 190 3390
1256 3390 5454 5553 3192 -526 -3605 -5135 -5623 -4122 -228 3499 5250 5053 3899 648 -3035 -5237
1272 -5237 -5481 -3432 -703 2526 5162 6104 3742 815 -2259 -4798 -6153 -4155 -703 2437 4344
1287 4344 5128 4212 1285 -2128 -4844 -5262 -3921 -1509 1423 4758 5370 3794 1688 -1400 -4082 -5098
1303 -5098 -4469 -1589 1710 3840 4945 4595 1778 -1834 -4042 -4557 -4480 -2359 1434 4073 5101 4130
1319 4130 2196 -852 -3616 -5468 -4337 -1840 792 3218 5130 4727 1949 -883 -3027 -4683 -4745 -2740
1335b740L439K646J040j04j334k967l418j347O38J628K391L016J958m66j721k515
1351A44k646k096l67J896K931K337J749N38j104l054k897j250l22R20K236L243
1367B258J929M20j399k167l072k126k69J253K402K252K134Q86j033k514k744j677
1383c467j050P11K370L061K144M59n35k210k717k274p00Q76J940K210K432P80
1399D030p06j714k439k533j110N96K090K459K685N40m32j505k697k140p83K44
1415c415J415K527K328J066k25j728k141k149j556J97J597K315K229J277M8j536
1431B249k335k174j295L5R13K457K519J360k29j116j888k604j595j37J339K240
1447b61K194J502K68j017k013k335j650k54N79K189K379J780M33p50k100k255
$$ plain form
1335 -2740 699 3345 4385 4281 2947 -20 -3438 -4785 -4147 -2519 -128 2888 4846 4380 2659 144
1351 144 -2502 -4598 -4965 -3069 -138 2199 3948 4486 3382 328 -2569 -3819 -4141 -3221 -985 2258
1367 2258 4187 4607 3208 1041 -2031 -4157 -4426 -3173 -771 1481 3615 4501 3468 954 -1790 -3467
1383 -3467 -4517 -3806 -1436 1625 3769 4228 3693 1483 -1234 -3508 -4208 -3332 -1392 818 3250 4030
1399 4030 3324 1610 -829 -3362 -4472 -3876 -1786 673 3358 3898 3466 1961 -736 -2876 -3659 -3415
1415 -3415 -2000 527 2855 3921 3696 1968 -173 -2322 -3878 -3681 -2084 231 2460 3737 3785 2249
1431 2249 -86 -2260 -3555 -3520 -2607 -150 2369 3729 3500 2384 496 -2108 -3703 -3840 -2501 -261
1447 -261 1933 3435 3703 2686 673 -1662 -3312 -3566 -2987 -798 1581 3361 3794 3044 944 -1311
1463a311j748l51P47J906J827J925Q87j054j845j973j799j035P60J486K635J447
1479B504Q88r3j692k613j449p67K22J628J987K063O82o22j162j981k024j007M09
1496c027J316K080J990N10L13j588j847j952j050K46J276J938J755J275k1j141
1512B073k041k235q67n9J099J790K066J260o0j155j488k188j277P3R38J628K186
1529A743J131L97p65k078j969j112m25O70J972J581J839K98q84j731j842j428
1545b603p17Q44J322K165J576M68o16j334j960j730l91N07J545J814J398J040
1561C328o01j878j698j352n63O1J524K104J079P84l30j370j545j641o74O8J368
1578a336J830J306J046N5j472j429j762j251K64R39K026J462J171l57j128j618
$$ plain form
1463 -1311 -3059 -3410 -2663 -757 1070 2995 3882 2828 983 -990 -2789 -3824 -3064 -1578 1057 2504
1479 2504 3392 3299 1607 -1006 -2455 -3222 -3000 -1372 615 2678 3360 2738 1576 -405 -2429 -3436 -3027
1496 -3027 -1711 369 2359 2869 3182 1594 -253 -2205 -3255 -3009 -1733 205 1960 3235 3214 2073
1512 2073 32 -2203 -3070 -3129 -2030 -240 1826 3086 3026 1871 383 -1805 -3082 -3009 -2071 -443 1743
1529 1743 2874 3271 2506 428 -1541 -2653 -3078 -2408 -436 1145 2984 3282 2398 667 -1175 -2603
1545 -2603 -3320 -2476 -1154 1011 2587 3055 2439 1105 -855 -2585 -2976 -2469 -924 890 2288 3328
1561 3328 2727 849 -849 -2201 -2764 -2703 -1179 925 2004 2788 2458 1088 -457 -2098 -2772 -2704 -1336
1578 -1336 494 1800 2846 2901 1429 0 -1762 -3013 -2749 -1810 216 1678 2849 2492 1364 -254
1594b54j536r93J75J144J412J819P70P0r33j519j618j045l72J039J608J650J076
1611B493J68o64j795j564j037o9M23J754J842Q45K48r07j063j609j437j98O34
1628a936J653J054J666J65n51j306j850j117q51P55J483J542J382O39p35j193
1644H00j496j370l51O48P03J603J557O02o95j114r91j795p98L83J053J675J264
1661A678Q40l63o75j763j457m75K52M74J690J378P72J20j059j356j527p79k03
1678b453J095J250J292R88L39j105j376j292r95m66Q30J692J321J033K47n80r69
1695H51k018r52m14J025J064J298J431J24q26j001j381j056o76Q57J065J386R31
1712A708P21p23r61j454j436j09N19R67J738R56K58k54q47j710j257o41O45J224
$$ plain form
1594 -254 -1790 -2783 -2608 -1464 -52 1767 2537 2607 1674 155 -1463 -2508 -2880 -1841 -233 1417 2493
1611 2493 2661 1997 202 -1362 -2399 -2468 -2045 -291 1551 2396 2644 1737 674 -935 -2372 -2570 -1936
1628 -1936 -283 771 2437 2602 2051 745 -1105 -2222 -3073 -2318 -835 707 2089 2728 1993 800
1644 800 -696 -2066 -2417 -1769 -1066 537 2094 2696 2001 887 -104 -1899 -2697 -2314 -1261 414 1678
1661 1678 2518 2155 1480 -283 -1740 -2215 -1963 -1489 201 1579 2351 2471 1412 56 -1471 -2250 -2453
1678 -2453 -1358 -108 1184 2172 2511 1406 30 -1262 -2257 -2723 -1893 -201 1120 2153 2400 1820 851
1695 851 -1167 -2119 -2533 -1508 -444 854 2285 2409 1583 582 -799 -1855 -2531 -1674 -609 777 1708
1712 1708 2429 1706 745 -709 -2145 -2254 -1735 -768 970 1926 2184 1930 1083 -627 -1884 -2525 -1880 -656
1730f56R67J391N37k17j011j597j123l47j23J074J183J694M25j21j009j213j318
1747a464p24K64Q93R41J220J138k88q99j250j157o68k1N86J587J103O51L96p73
1765A535j254j640n00N5O33J014J047R59L03p56j187j131j012m27R45R28J233
1782G45J302L2l92j107j801n88j13J67J237J282J150j07j6j380n77j404o15N45
1800a640J119R93R71O49j27j257j257j065j15R0Q60J099J462J93l17r02q25j224
1818a293q63K04J129J081J171O38q7j070j061p03j220K61J058J233O43M99K20
1835A840p52j244r49o85J94J52J377J290P13J43r86j048r38j151q0M80J405J154
1853I15R51N6l17j444r02p98m39O50J247J079N93K75m58q56j336r75J06L89L48
$$ plain form
1730 -656 311 1702 2239 2022 1011 -586 -1709 -2056 -2179 -1105 78 1772 2197 2076 1067 -146 -1464
1747 -1464 -2188 -1924 -1031 -90 1130 2268 1980 1081 -169 -1326 -1994 -2015 -1429 158 1261 1912 2308 1535
1765 1535 281 -1359 -1859 -1804 -1171 -157 890 1849 2152 1396 209 -922 -1934 -2361 -1416 -488 745
1782 745 2047 2079 1687 580 -1221 -1809 -1922 -1755 -518 764 1914 1807 1791 411 -166 -1570 -2185 -1640
1800 -1640 -521 472 1443 2092 1965 708 -549 -1614 -1729 -1639 -779 320 1782 1975 1658 756 -69 -1293
1818 -1293 -2156 -1952 -823 258 1429 2067 1980 910 -151 -854 -2074 -1813 -755 478 1121 1620 1840
1835 1840 1088 -156 -1105 -1790 -1596 -1444 -67 1223 1936 2079 1093 45 -893 -2044 -2124 -1644 -239 915
1853 915 1866 1922 1605 161 -741 -1539 -1978 -1328 -81 998 1591 1866 1408 552 -784 -1759 -1653 -1264 -916
1872i16J569J083L79o53j075r38p14q75P23Q08J196Q57M19j84j033j448n67j83
1890a552k09J175R50Q05Q03m72o10j175q16n70J59P56J177P83N64j5r83n87j653
1909a470j41m9M57J299J440K05jo35p33j556p38j2R17O35J577O26K33q72j056
1928A26p25j187K25L23R89J001Q29L02m99q92j301j003j51P91J103O81R66L30
1946A908m88j154j047m74p24P83Q35J047J018J02m09r22j014q85l47O0R77J088
1964C54J161J26j01j037r70m35o45P7O84Q32J223P08m38n61j193r48m64j74Q12
1983i89J003J388J53J22r25q16j061r71L14Q44R77J193N07J76q60j281o94m00
2001a320n78Q16R36J011O28q3P9j338j054r24j54O44J195R35R97M4q72p01j067
$$ plain form
1872 -916 653 1736 2115 1462 387 -551 -1265 -2140 -1417 -609 587 1444 1863 1679 646 -802 -1369 -1552
1890 -1552 -1761 -586 364 1169 1972 1500 890 -285 -1101 -1671 -1512 -756 421 1204 1768 1753 770 183 -1470
1909 -1470 -1611 -1660 -1203 96 1536 1741 1740 1105 372 -1184 -1922 -1934 -1017 -382 1195 1821 2054 1182 126
1928 126 -599 -1786 -1561 -1238 -249 752 1581 1883 1384 492 -809 -1812 -1963 -1172 -69 612 1578 1908
1946 1908 1420 266 -781 -1255 -1979 -1196 -361 686 1704 1806 1397 475 -539 -1424 -1771 -1711 -734 354
1964 354 1515 1641 1540 503 -467 -902 -1547 -1470 -786 46 1269 1977 1539 978 -215 -1163 -1627 -1801 -989
1983 -989 14 1402 1555 1677 752 -64 -1125 -2096 -1782 -938 39 1232 1739 1915 1055 -226 -920 -1320
2001 -1320 -1898 -1082 -146 865 1493 1410 1489 151 -903 -1827 -1981 -1337 -142 793 1790 1834 962 261 -806
2020h06j112J67L87J207J067O60L13o03p48j210j018Q9L68N68J210Q61N09p30
2038A179n30j268r90k0K32J044Q33P16N39k9r20j032j189o77Q59L25J001J431
2056A504K8J05q48j122q18n88J26R05Q37J047L46K48o02j100j346m92J38O29R56
2075d7R99Q61l86l10j228j025m19M7M23Q90J138P48o8q00o34r74p06k67O57J072
2095b9J094N93j15k49r57j010p61k73M17R49J253P40k39l54q03r26q10n78Q65
2114a193Q90J017R15j62j47o38j228p71l35L73M98J138R34K58j76o31j250p09
2132a217l00J22P76J184Q80J00k99n72j087p49l95j8Q26Q51J233L44l39o38q42
2151a40r96l60l06P28J253Q11Q34n91m62r22j028p03K51O48J050O22P59K96p41
$$ plain form
2020 -806 -1918 -1751 -1364 -157 910 1570 1883 1280 532 -678 -1696 -1607 -1239 -671 539 1400 1909 1179
2038 1179 649 -619 -1609 -1629 -1397 -353 480 1196 1735 1706 786 -246 -1435 -2112 -1253 -928 73 1504
2056 1504 1532 1637 789 -333 -1151 -1739 -1613 -708 129 1176 1522 1770 1168 68 -1278 -1770 -1632 -1003 -47
2075 -47 952 1813 1427 1117 -111 -1136 -1555 -1508 -1085 -195 943 1691 1623 823 189 -785 -1491 -1758 -1101 -29
2095 -29 1065 1658 1543 1294 337 -673 -1434 -1707 -1290 -341 912 1652 1413 1059 256 -670 -1480 -2058 -1193
2114 -1193 -303 714 1629 1467 1320 682 -546 -1317 -1652 -1279 -781 357 1291 1549 1373 742 -508 -1217
2132 -1217 -1517 -1395 -619 565 1445 1545 1246 674 -413 -1162 -1557 -1575 -749 102 1335 1679 1340 702 -140
2151 -140 -1136 -1496 -1802 -1074 179 990 1824 1233 771 -151 -1179 -1882 -1631 -983 67 689 1448 1744 1003
2170A003p51j178p03J71M79P92J284N96r8l18j171j051n88j60L77J259R08P43
2188A594j31m06q66q07p94l39N12O89J084P45M02o56p93r13l54l05J36Q06J002
2207F06O59M89l69p57j119q19l89M90Q47Q33N65N26k94p82r27o69m73R8Q99P59
2227A73J095K69j66n39j222o63m81L4P58R62R41K46K24q86q29p41p09Q8Q25O79
2247E8J073M02jn81q47j015o32J02O37J088P00N71J03r54p13p35r56J91M79O61
2267c69J241Q40k31m94r00r26n20m16R17O37J150P18j29k31j198p89n26j50K55
2286a121J139Q98M43J43m96n81j048o27m02M61P53P14J096K44k07r21p61r77k99
2305a549J67P82J242M95M29o3q19j219p70l9J70L73J043J082K23l31o55n28j329
$$ plain form
2170 1003 252 -926 -1629 -1458 -979 -187 1097 1693 1595 1277 106 -945 -1533 -1693 -1316 -57 851 1594
2188 1594 1463 1057 191 -616 -1410 -1749 -1237 -548 536 1281 1683 1027 234 -679 -1033 -1338 -1202 -396 606
2207 606 1265 1754 1385 628 -491 -1310 -1699 -1209 -362 471 1036 1562 1268 486 -441 -1110 -1583 -1485 -586 173
2227 173 1268 1537 1371 832 -390 -1053 -1534 -1500 -742 220 1161 1407 1631 745 -84 -825 -1534 -1446 -621 58
2247 58 1131 1533 1532 951 104 -911 -1543 -1441 -804 284 984 1555 1658 704 -9 -744 -1700 -1509 -1030 -369
2267 -369 872 1712 1481 987 87 -839 -1359 -1775 -858 -221 929 1647 1518 1287 89 -700 -1226 -1376 -1121
2286 -1121 18 916 1359 1502 1006 425 -623 -1250 -1652 -1191 -438 276 1372 1616 1409 488 -273 -1250 -1549
2305 -1549 -1382 -600 642 1137 1566 1503 684 -535 -1305 -1344 -1174 -801 242 1324 1547 1216 561 33 -1296
2324a296Q6PN18R36O85P61m03p03r13n42m93j04O88R39Q52NJ35l81o84r33n83
2345a423L35L68Q99P73L18O36j026o49j097l64l64N15J140P08N71r8j02r27j117
2364i04m45m1N54N78P20R16J11o58p73p38n10m26M01J367L51P36K49m25q04q01
2384e42o21l55L14P59R79P55K75n45n99p09j023k37M25Q73M98R34M26o01o60q71
2404e25m04l21P1N74Q60P77N30m41o32p14j047k46L16O57O59R72J06j16m67q32
2424b23n18n54l4P23O51P31P49k49n42q54r13k31j2N51P97P29L84L07p51n81r73
2445h13m55p5M31P63P54L18L50l46q72r40l08l59M71J067P36N93j2j14r77o87
2465d75m91l80K18J329M58N02K88o73m42p07o64m60Q5R76O88J028K9mp18j117
$$ plain form
2324 -1296 -1210 -1203 -685 251 936 1697 1294 591 -322 -864 -1357 -1461 -773 166 1018 1023 1158 777 93 -840 -1423
2345 -1423 -1088 -720 179 952 1270 1906 880 231 -866 -1230 -1594 -1079 61 769 1340 1242 1140 213 -904
2364 -904 -1349 -1390 -836 -258 462 1378 1489 831 58 -680 -1190 -1616 -1215 152 503 1239 1488 1063 259 -542
2384 -542 -1163 -1518 -1204 -445 534 1289 1564 1019 420 -289 -1312 -1549 -1124 -251 247 1181 1607 1006 346 -525
2404 -525 -929 -1250 -1179 -605 255 1032 1562 1121 489 -225 -1272 -1518 -1202 -545 114 1086 1192 1076 609 -223
2424 -223 -741 -1295 -1329 -606 45 776 1525 1276 734 -120 -1033 -1264 -1276 -725 72 801 1185 1492 741 160 -813
2445 -813 -1268 -1343 -912 -149 605 923 1273 927 55 -885 -1193 -1552 -1081 -14 722 1315 1303 1189 212 -475
2465 -475 -966 -1346 -1128 201 659 1161 1449 776 334 -373 -1037 -1497 -1412 -436 252 1280 1309 1305 587 -530
2485e30o64LJ32N91R36P76L4O5r22q69o57k54J11N20J041O65K48j47k02j049q77
2506a049m3k0L65J085N95Q17l52n15r10q75m88L69N23L97J020K42k03k60q22o79
2526h03n12p6O90O03J056L66j75j15q07j105l99k51R14N74Q64L30R7m20p77p63
2546g09o67M9N72N69P64M40L31m26o17q06n24j74R6O57J232K75J4k13n69o97p06
2567a109l62N54N14Q14P99j64K20q91p71n82r1L42M16R34O02K4j58p21r09l96
2587i35m57N20L43O85P96L77k23n43r92k68n24L5N87P80O60K44j51k03o01j197
2607a067j07j52O19Q16M75K74L02n01m86o09j026L26J92J372L54L59P1m87p01
2626B4m99p66R9Q03L90P51M83p1m19o16r48m60J97K44R36M93J95J51l73m50r66
$$ plain form
2485 -530 -1194 -1191 -1059 -468 468 1244 1278 1343 421 -448 -1105 -1359 -1248 -728 313 978 1226 1079 877 -172 -1049
2506 -1049 -1092 -1112 -747 338 933 1750 1398 883 -27 -902 -1390 -1021 -498 -101 919 1161 958 698 -124 -803
2526 -803 -1315 -1391 -701 -98 958 1324 1149 1034 227 -878 -1277 -1528 -614 -40 824 1154 1251 831 54 -709
2546 -709 -1376 -1327 -755 -186 578 1018 1349 923 306 -500 -1024 -1198 -1102 -445 787 1062 1076 863 294 -403 -1109
2567 -1109 -1471 -917 -403 411 1210 1046 1266 375 -396 -978 -1069 -727 -311 623 1225 1249 1091 370 -539 -935
2587 -935 -1392 -872 -529 156 952 1329 1106 563 -429 -697 -1221 -1186 -599 181 841 1085 934 731 130 -1067
2607 -1067 -1174 -1326 -707 109 584 858 1160 659 173 -436 -1462 -1136 -944 428 782 1141 1212 725 24
2626 24 -475 -1241 -1142 -339 51 802 1285 1214 795 179 -769 -1229 -1032 -788 148 641 836 987 614 164 -802
2647h02k65k77M03Q34M01R28J60m69o23p89l99j17N7O53O43O75K32n12m47o58
2667c72n05l62L50O33O56P33J41k87o10q21n34K2l4P46M99O56K86m4p42n66p91
2688i46k16J11N29Q15N49K27j4m05p33j076O6k0O50O08P06M09k05l47q57q98j8
2709a065l6L16Q71O60O46m43J42j237n20k63k91N46O64P83K12J87n54l88r22n53
2729a245J67K98N65O37N49j37N9m71j285p8k66P10M40O84M76k02m1o88q20k81
2749i29o3J61O38M82O81N0k69m40n40p28k76M40M74O56R01k10m55l85k76p06j99
2770i93L36L87O02P86J5j57o49p23l97j83J28N89L75N37L44J83o46j015m97l88
2790a366N39L59O98N72K33j70m22o21l34m68k12O81N56P23L84l20o9r78m40l89
$$ plain form
2647 -802 -1067 -1344 -941 -107 294 1222 1382 913 290 -499 -898 -1015 -958 -305 338 1013 1245 733 286 -372
2667 -372 -877 -1239 -889 -256 400 1133 1274 987 377 -444 -978 -956 -990 -244 255 911 1197 1153 411 -155 -946
2688 -946 -1162 -1051 -522 293 842 1069 1055 650 -83 -1159 -1093 -1113 -463 145 851 1260 1055 708 -149 -1047 -1065
2709 -1065 -1101 -785 86 746 1392 949 1091 -146 -666 -929 -1220 -674 -10 773 985 1172 618 230 -692 -1245
2729 -1245 -1078 -780 -215 422 971 834 893 422 -863 -941 -1207 -497 -57 627 1103 901 860 172 -648 -929
2749 -929 -992 -831 -193 289 970 1020 751 311 -229 -957 -1233 -793 -319 337 1238 1028 573 188 -88 -794 -993
2770 -993 -657 -270 332 1118 1133 976 327 -396 -793 -976 -848 -259 116 653 997 1180 534 -481 -978 -1366
2790 -1366 -827 -468 230 802 1035 865 443 -178 -512 -980 -1192 -511 45 768 1152 832 763 -215 -655 -1044
2810a044q1N18P45M72K72M7l74m48p02n45N9N13M42P47L53j7k94p57l97n83J45
2831i29K53N98O05K03L82m44o31p41k53j06M21N20M19P59j65j8o09m95l82k79
2851h92J09L65O91J75M61m2o12n92k23k93J7M84N45N95K70l31m54o54k72l35J83
2872h05N18N29O34j93K25o52l56q04O3J93K48L66Q13R2K0l93q02k10n50K96O22
2893a46J41O03J66K60o19m70m09m93L03O3O29O69K63L13o15o33n24k82j46L51
2913e76O15K37L80M22n25m14p36j20k64L15Q78L63K30J28k46p42l58m06K01r0
2933g08M68P34L61M8k57o35k99o62M8J8O57O56K81L6j25k74o00j82l15k9M92O53
2955C66Q73l39l41k04q54p7l24K35K87N79N19J47k31l31m58o09l2k49Q07M91M75
$$ plain form
2810 -1044 -1125 -607 138 610 882 929 555 107 -595 -1140 -1081 -568 -126 621 974 957 663 -94 -491 -1074 -929
2831 -929 -676 -78 527 730 1112 668 37 -704 -957 -1063 -642 -122 297 1056 891 873 264 -231 -613 -892
2851 -892 -783 -418 273 448 909 867 255 -337 -560 -853 -836 -352 193 788 1058 727 273 -381 -653 -988 -805
2872 -805 -287 242 876 683 908 256 -100 -904 -841 -648 -400 -34 779 871 891 498 -304 -514 -1064 -768 -146
2893 -146 -5 598 764 1024 405 -65 -474 -967 -664 -601 28 697 960 1273 658 25 -499 -781 -927 -576
2913 -576 39 276 656 1078 553 139 -597 -717 -981 -666 212 575 805 933 687 -55 -413 -819 -618 -708
2933 -708 -240 494 855 903 646 11 -288 -950 -902 -884 -227 429 710 746 621 347 -253 -435 -750 -779 -287 366
2955 366 1239 900 559 355 -499 -576 -900 -665 -378 201 720 867 636 305 -153 -762 -794 -1043 -236 255 730
2976G30K31m24j05m64r59J9K08K99L85M82L60N5m04m92m44j23l97N89O58J1N18
2997G33J46o71k77m05k51N0K03O31L02M52l6l99j39p85J9m14L31M58L03M84K73
3018A008l68o68k46k89n7K13K51N81N33k56J03n74l81m73J1R2O20K19K35K40k33
3039E61m85l71j63j82J72J83O58R0L03J07n00n60n09pK39M34K60N67j86K22k54
3060E79q09l45m70O23L49O81Rk20L32l93m97m49k11J62J57N62L41L76j63l57j88
3081F9l31m06m4L8R98L23j5K33l46o35k61j60n6J40N31N36L32m58j18k33m14k83
3103e60l90M38M22N56K88K09n45m43m04o3l56M08M43N30J73q0k30l88l14k41j97
3124g44j9P33L21M4M10k98m15l09m27j5J48M95K75J64L23k37l4n88m42J14n2L04
$$ plain form
2976 730 961 537 432 -32 -991 -972 -764 -465 -80 402 762 817 413 -79 -523 -646 -1043 -454 204 215 733
2997 733 879 208 -69 -474 -725 -675 -472 159 461 913 877 478 339 -446 -427 -841 -510 -52 251 735 1008
3018 1008 640 -28 -274 -563 -620 -407 -156 425 958 702 805 231 -150 -623 -612 -520 100 319 554 794 561
3039 561 76 -295 -458 -640 -468 -285 373 463 766 873 373 -187 -696 -703 -464 -30 230 797 611 833 579
3060 579 -230 -575 -1045 -422 -73 608 617 397 729 336 -161 -610 -821 -659 -502 60 401 777 614 257 69
3081 69 -262 -668 -712 -674 324 647 632 865 519 -116 -377 -537 -593 -453 78 614 946 488 370 137 -277 -560
3103 -560 -950 -512 -90 466 754 963 418 -25 -429 -492 -848 -440 3 533 706 626 396 8 -306 -547 -744
3124 -744 -763 -30 291 335 745 447 32 -277 -704 -719 -571 -76 199 363 686 449 415 -173 -615 -501 -553 -249
3146b49O56K48O4P3m79l84o22j3o3N17L49O0N70m80o8m12l40j79J47K96N20L56
3168E67nk69o4p8n50k93K98J66L37K58M65M0n59n56O2p67K33L50K11O60p5J13
3190E44j46n27j60m24J79K03K28N04L76k77J31q09j16l71j53R5J068K24LJ97j94
3211E75n75n16k97J54L58L76l6O13m9k59l8o25j88k64K56L05M56L26J89j64m92
3232A05k82k92j6L24j99N62K30N31n51l90qn09j58J29K88M94J87J57k22K8k56
3253A52n29l65J43P2O25K39J16J89k72k99o24N4j85N79J13K71J60J04k57m81j82
3274c77j23Lq8O37K90R1j5n1k10m83J10l20K26L93K13K55r8j65k12l30k15j92
3296f61L51M56K38K07k38J10j6p43l04N6M22J08J37L52K05pm96l06k31j12n2M33
$$ plain form
3146 -249 407 655 719 792 313 -71 -693 -706 -769 -252 97 157 727 247 179 -233 -573 -752 -605 -309 211 567
3168 567 562 293 229 151 -399 -692 -394 -228 109 367 832 872 313 -243 -181 -948 -715 -365 -154 506 431 544
3190 544 398 -129 -289 -713 -534 -331 -103 401 777 500 631 -178 -294 -665 -818 -723 345 569 572 769 575
3211 575 0 -516 -813 -659 -301 75 39 652 603 344 306 -319 -507 -771 -515 -210 246 572 761 597 105
3232 105 -177 -469 -485 -161 -360 202 432 963 412 22 14 -495 -653 -524 -236 258 445 602 380 408 152
3253 152 -377 -742 -599 -527 98 337 453 642 370 71 -553 -499 -684 -105 8 279 439 543 286 -195 -377
3274 -377 -500 -497 -585 52 342 433 418 367 157 -326 -216 -536 -310 83 296 551 453 288 76 -254 -469 -661
3296 -661 -310 146 384 591 353 463 447 -296 -600 -544 -122 -14 123 475 680 673 177 -129 -360 -472 -524 -91
3318i1K62M36m44J02k8k11o07K34K4K74M47R0J49l65j79j01o05n6Q9M28J33K48
3340B29M43j03k02o58L7m00K07L5L56M21M00k51m69j58j03r4j4j13J068l81M22
3361F72n3m09n08l31J82J00L15n6O57n2k15J28o32l49r6K80kJ93O99k10P1J50
3383E34m83l11m8k61O88j36N24n2L3j12j01m92l42L50J54J92m9J86J16J21j80
3404C31n49k72q4M49J01O6L43P7j23j56l82r2k08J17L79O2M76l77J0J19n92j64
3426d69J8J56K61K95N3N3Rm18J74l30k72N6J43M74q9L26K05l34n10J00m29K13
3448c15R2J62M68L14l90p9l91m26mK80J63K10J62J26j30l61K58m49j96M7L23J27
3470iJ89M33k71N9n44k74J41j25J73L16K80O6j90J26n94q7k40K57L08m0L84j95
$$ plain form
3318 -91 171 607 163 265 237 26 -581 -347 -323 -49 398 488 637 272 93 -8 -613 -669 -580 -152 -19 229
3340 229 672 569 367 -291 -254 -654 -447 -412 -56 365 765 514 45 -113 -216 -310 -324 -437 631 250 672
3361 672 619 210 -298 -629 -447 -347 -32 -88 569 517 302 430 -202 -551 -647 -367 -369 -176 523 313 384 534
3383 534 51 -260 -308 -569 119 -17 507 455 488 376 275 -217 -559 -209 -55 137 88 274 390 511 331
3404 331 -218 -490 -574 -125 -24 42 385 462 339 183 -199 -291 -499 -382 -3 59 535 158 168 287 -305 -469
3426 -469 -451 -295 -34 261 314 367 376 -42 132 -198 -470 -414 -271 203 114 440 645 311 -199 -99 -528 -315
3448 -315 -223 -61 407 721 331 252 -139 -565 -569 -289 -126 84 246 372 242 -119 139 -310 -506 -459 -136 -9
3470 -9 180 613 342 401 -143 -417 -276 -401 -228 88 368 434 244 370 -224 -311 -551 -294 14 -26 358 163
3492A63L75o1l77k01k47k2K01m6M70K92K0l39J55o55K44k62nJ60L81K13j39Q8
3514D08l59n5j74m02j0M53L49J82j4J01o05j75J05k26j91M49M27%L71k02l28l10
3536b06Q2l50j24M29L05J59K44o7m66o9k50k20M13k68M54M6Q8j7q8j99k27j98
3558e29L51JJ76K66n8K26l17m45J69l39J19M4M61J79J6q9J10l11l03q9j76K54
3580b84L17L2K91N3j64l1k71j46k19J46L15K25L48j23o9m21k45J60m54L21R5K07
3602H3J16M25k30l07l24Kq9J3L35O4L29o6J08k60k58j36j28J78J49K28L22k76
3624B78J57k62o5n14K8L02l29P12j8L36j48m18j94j34J0jN3L68n1J89k5M3k65
3647E2j22k13j49L71K42j79K25Q4j39J19k43n65l5K33N84k31J79J0J47m44j40
$$ plain form
3492 163 538 477 100 -101 -348 -370 -169 -215 255 547 567 228 383 -272 -28 -290 -295 -135 246 459 320 408
3514 408 49 -6 -180 -582 -592 -139 210 392 378 479 -126 -301 -196 -422 -613 -164 263 263 634 432 104 -206
3536 -206 -124 -474 -598 -169 136 295 539 472 6 -63 -313 -533 -120 -388 66 112 200 183 95 -104 -331 -529
3558 -529 -178 -177 -1 265 207 433 116 -329 -160 -499 -380 -336 125 304 320 231 341 30 -273 -362 -538 -284
3580 -284 33 65 356 409 245 214 -57 -203 -422 -276 39 264 612 489 420 -1 -246 -86 -540 -219 -124 83
3602 83 199 624 394 87 -237 -235 -324 -311 24 88 417 351 459 199 -59 -195 -323 -145 4 232 554 278
3624 278 435 173 108 -406 -378 -76 -405 307 289 625 477 59 -135 -269 -259 -260 -207 161 110 299 274 317 52
3647 52 -70 -283 -432 -61 181 2 227 311 172 291 48 -517 -552 -319 265 34 213 223 370 -74 -214
3668b14r9J74k30K95L41O7K4q9j96l1m01K7J12J27K47m4J81k41J1l05K2j28L5
3691c15j39N57k6K61j26r2q7p15O70l23L79P7J25O4q9O0o16K46n9K0m2K62KK31
3715C25k4l09j34m47K99j75M80K23r3J78p9k55K6l29k67L44K62J82J36J02l04
3736A41K56n26m6Q4L2m7N53m82J35K76k82n6m01J51j8k6J27P9N26q7p1m02j03
3759a87R1k04J45R9J68M8j88K02k81j36k53J87K2K27L03n6Q8L0j98k15l37L4J94
3782b17L78m8M10n25J44k61K5m49L18QK90J34J08j85J93k85J7l23L0l2K98J76
3804B04o8k5J87k3j29l16j74L6Q6K49O5J64l7K47n40Q1k19O9K13K01L05m58P2
3827A90R3j97m14k06N30j02J37J34K1o1k19m0q5K11j78R9j49K64R2q5J92k30r6
$$ plain form
3668 -214 -313 -139 -369 -74 267 334 358 269 73 42 -359 -332 -220 -93 154 110 291 50 61 -244 -222 -350 -315
3691 -315 -454 103 77 338 212 120 33 -682 -12 -335 44 121 246 310 221 281 -335 -89 -148 -128 -170 92 94 325
3715 325 301 -8 -142 -589 -290 -465 15 238 145 323 244 -11 15 -314 -581 -237 25 207 343 445 141
3736 141 397 -129 -175 -91 -59 -106 447 -35 100 376 94 38 -363 -212 -230 -256 -129 -50 476 389 318 -84 -187
3759 -187 -96 -300 -155 -56 112 160 -28 174 -107 -243 -496 -309 -287 -60 243 187 275 305 107 -108 -445 -411 -217
3782 -217 161 113 523 -2 142 -119 -94 -543 -225 -217 73 207 315 130 323 38 55 -268 -238 -270 28 204
3804 204 136 111 298 275 146 -170 -344 -308 -222 27 92 256 219 466 -74 7 -212 -143 70 271 576 118 190
3827 190 283 86 -328 -534 -4 -106 31 165 186 125 -94 -134 -219 -8 -186 -87 -236 28 120 35 227 -3 -99
3850i9j07J2K18K46r4R4j08K42k19j60m71L48N2j22J68k4K10k35M7l57L08j56
3872b07p8Q5L66r7K94j31l53K97l51j29K9L06n3L51k15J60j40l71J04j42j33L40
3894f8J05K52k58j47L69j81k58j31K17J8m3L63k22L8K22l58q8n6K8M1J42K00j85
3917@RK49j63j77k34P5J29L58j70o8J31K27l00l25M5j81m6M23k9K05Q0j54j00
3940a6Q9k07k44L00K09M0j42J2J97j83k39Nj06n0K68P8P8M0K68k10l4l00N7r6
3964a86K75j79L97J56k98o2j65J33n30J04M80l63M37J0j65J52k56K4k32j50M30
3985A2J08J00j0k0q9k69L87l37K49j83R0J36J26j86J32k54k00R8k06J62K19m6
4007A9q2M69k74l4p2j68j67J57K75l88N40r2j91q8j46j75K94j00J16Q8K46J24
$$ plain form
3850 -99 -206 -194 24 270 176 270 162 404 185 25 -446 -98 -46 -168 0 -24 186 -49 -2 -359 -51 -207
3872 -207 -285 -200 166 69 363 232 -121 176 -175 -304 -275 31 -22 329 114 274 134 -237 -133 -275 -408 -68
3894 -68 37 289 31 -116 253 72 -186 -317 -100 -82 -125 238 16 54 276 -82 -170 -226 -198 -157 -15 185 0
3917 0 9 258 95 -82 -316 -241 -112 246 76 8 139 366 66 -259 -214 -395 -441 -18 -47 158 238 84 -16
3940 -16 73 -134 -378 -78 131 171 29 41 238 55 -184 -179 -285 -335 -67 11 89 129 397 187 153 -147 -90 -186
3964 -186 89 -90 307 463 165 103 -62 71 -459 -355 125 -238 199 209 44 196 -60 -36 -268 -418 12
3985 12 120 220 210 190 101 -168 219 -118 131 -52 38 174 300 114 246 -8 -208 -110 -316 -154 65 19
4007 19 -63 406 132 98 26 -142 -309 -152 123 -265 275 183 -8 -96 -242 -417 -123 -223 -107 -19 227 351
4029C51l42n0J1l70K31j13K34J31K7m6j09k02J03J47j59M32o22K83K86k1L6j85
4051E3j68r9J42N7J33l49N78m09J70j97oMK13l92L76J88l05J69k1j95l5j61N2
4074b02k0K94k01J5L54J42l13oj55k7K17m03K34m7K03k56K98r3j89M3j54L28o7
4097ej01K0K61p2k61K42O7j08K4M4l34K36J61l1j05k27J34p7K54l48J69L37j09
4120A71R4k18q3o0K87k49r8K75N8j78l6n9J19q9K6ql55L53qQ3J94k70K7n7J34
4145E3j39p5J49J23k66J74l8J77j54l50L07O5j18J73O7k04J28j74l23J36Q2O3
4167a44r9N62L3l16J19k25K06l95K22k7%L23j11k15J38J04l90n5M4L48k24mj05
4190b11N21n1o2j31p1j90K95k46J11K32o2L9q6j59n0J85J19j94%J19j43K55j28
$$ plain form
4029 351 9 -41 -30 -400 -169 -282 -48 83 110 64 -45 -247 -144 3 -156 276 -346 -63 223 202 238 53
4051 53 -115 -214 -72 -15 118 -231 347 -62 108 -89 -95 -91 122 -270 106 294 -11 158 137 -58 -93 -254 -202
4074 -202 -222 72 -129 -114 240 382 69 63 -92 -119 98 -305 -71 -118 85 -171 127 34 -155 -112 -266 62 -5
4097 -5 -106 -86 175 103 -158 84 151 43 67 111 -223 13 174 143 38 -189 -55 -132 122 -226 -57 280 171
4120 171 265 47 -36 -96 191 -58 -156 119 177 -1 -37 -96 23 -66 -40 -48 -403 -50 -58 25 219 -51 -24 -81 53
4145 53 -86 -161 -12 111 -155 19 -19 158 4 -346 -39 26 -92 81 148 -56 72 -102 -425 -289 -207 -144
4167 -144 -243 319 352 36 155 -70 136 -259 -37 -64 -64 259 148 -67 71 175 -215 -270 -226 122 -102 -106 -211
4190 -211 310 259 197 66 -5 -195 100 -146 -35 197 135 174 88 -71 -121 64 183 -11 -11 108 -35 220 92
4213I2K4J86l85K5K17j79J06Q2q9N0j23j18M3k57K7L83j36K91j78K1p7J02j85
4236g8J38j23R4M4J5R4j3k27q6p1J74M6j35J31K05j08k52R3R4k53J39jJ94j36
4260b2L88k84l2j39l15K80J50k85L76J48l96K72j45k40o5J41j0J59j00NO16k52
4282B50k24j62k3K43m0j69J89J93l36K27J0k04J59l30J70r9R0K54l67M26j28k55
4304a26K30r6j82O7J52k0OJ04j34O8j88L5r3J2L88j86J7M72o07J42j89J19Pj29
4328a31r4K98M4J06k24j50L09k22j02K18j96n7K57J81q4j23M7k68Ll4J30M9OK54
4352B17J19l05K39m46J77K74m26l2K42p1J71M2k41m5M3OK03l6j36J38m6J29j10
4375A06l41K76q0J7j2n4j01J02K75j1k15j55M4k64O1N26l70N0J99O1J92m78J23
$$ plain form
4213 92 116 302 -83 -58 159 -20 86 168 79 129 6 -112 -69 -326 -299 84 -52 239 61 82 5 107 -78
4236 -78 60 -63 31 75 90 184 171 -56 -142 -213 -39 7 -128 3 208 100 -152 -59 35 -218 -79 -80 114 -22
4260 -22 366 82 50 -89 -404 -124 26 -259 117 265 -131 141 -4 -244 -309 -168 -178 -19 -119 -114 502 250
4282 250 26 -136 -159 84 44 -125 64 257 -79 148 158 -46 113 -217 -47 -146 -56 198 -169 257 129 -126
4304 -126 104 8 -174 -107 45 25 31 135 1 69 -119 -84 -177 -165 223 37 54 526 -81 61 -128 -9 -2 -131
4328 -131 -225 73 117 223 -1 -151 158 -64 -166 52 -144 -201 56 237 153 30 77 -191 -188 -222 -92 -43 -37 217
4352 217 336 31 270 -176 1 275 -151 -183 59 -12 159 201 -40 -85 -42 -36 167 131 -5 133 87 216 106
4375 106 -235 41 -39 -22 -34 -88 -189 -87 188 177 -38 -193 -149 -413 -352 174 -196 -146 53 114 306 -172 -49
4398d9K5J14j26k63M30j61l9r6J02R3k48J71j65M79m48N84k15k95O0o8J44p0K
4421c9J58m62N03R6k10j25j0Q6J9K3j3K54l16N8L03k07k22J95j34O5O4j33K93
4444B46j3l64K81l82R6N5J69j0l50N78n28L65j86L9k8N7j19j44M50j01kJ63k24
4467D8j46k53M62j05J86j88j31K90q5j16j29K03j19o0K25j80K76r2J97k22k57
4488a96p0L50l03K59k23M8J51N4o4J58j24j66n1j8M73l28K93k25j0K79m37J48
4510bJ0k90J89N0M37l82J06r4K14j81j46N9K61l86J71n6n1N53n36p8L6J50j82
4533a48J28k7qJ7N7m2O2j87K52j46r9K22j28J83l07M34k66J12k94J85J94j75K04
4556B23K51m38l16K01r9M99k56j46N7J41j08l7k54L80k56m1LL53k52R1J0Q9J07
$$ plain form
4398 -49 -24 90 -36 -299 131 -30 -69 -165 -63 30 -218 -47 -212 267 -181 403 188 -107 -47 -115 29 -41 -39
4421 -39 119 -343 160 256 46 -79 -89 -3 16 39 26 280 -36 22 325 118 -104 91 -43 22 86 -47 246
4444 246 233 -131 150 -232 -136 -81 88 78 -272 306 -222 143 -43 -4 -32 25 -94 -238 212 111 109 272 48
4467 48 -98 -351 111 6 192 4 -127 163 78 -38 -167 36 -83 -143 82 -98 178 86 283 61 -196
4488 -196 -266 84 -219 40 -183 -135 16 70 6 164 40 -126 -177 -195 278 -50 243 18 8 287 -150 -2
4510 -2 8 -282 -93 -43 394 12 118 24 238 57 -89 -30 231 -155 16 -40 -91 462 -74 -152 -116 34 -148
4533 -148 -20 -47 -55 -38 19 -23 39 -148 104 -42 -141 81 -47 136 -171 263 -3 109 -185 0 194 19 223
4556 223 474 36 -280 -79 -178 321 65 -81 -24 117 9 -28 -282 98 -158 -199 -196 157 -95 -4 6 95 202
4579B02j87j15K8J24l6K7j65K27K8q1o7%J33m3j51J09J41O7j0K0k46J12P6k79
4603h6P6J08j74L90j93n4RN0k58L70lo6q9m11L33q2j82L52p4O8J43j58O7j07K09
4628B38k72J6J74k21k05K70J41j53j0o0Oj35J33J8j60K71kl8K32l29J55l60L45
4651E4n0p9L4J58oJ4n0o8k15QJ92J7J18m2j42L17j51j48J12J1p5J67l36M30j73
4676I7k61qK21j04p4n9J49L8J66K82l71N7k31J20j37J01L5l94L63n9R1j07L34
4699B49o7m25M65n28J18J04J99r8P0J57j75l11j04L72l13L43j15M5K7J10J05j57
4721G1l8pP5l7K39j38J45l47J5o3R9k52L84j14K76j72k20L31k27n3o3k07K54N2
4745CK21j20J09j44L7N8r2k90K90j2l84N56j32o3j23p6n8L1Q9Q7m4L39l00L4k31
$$ plain form
4579 202 15 -100 -72 52 16 43 -122 105 133 52 -15 -15 118 75 -76 33 174 241 231 251 5 117 193 -86
4603 -86 -10 98 -76 314 121 67 76 126 -132 238 235 169 80 -331 2 -80 -262 90 16 84 227 69 136 29 238
4628 238 -34 -18 156 -65 -270 0 141 -12 -22 -82 -76 -211 -78 -60 -220 51 49 11 243 -86 69 -291 54
4651 54 4 -75 -41 117 111 125 75 7 -208 -200 -8 9 127 85 -57 260 109 -39 73 84 9 176 -160 270 97
4676 97 -164 -172 49 -55 -129 -188 -39 -1 165 447 76 133 -98 22 -115 -14 21 -373 -10 -69 22 -85 249
4699 249 182 -243 222 -306 -188 -84 115 17 87 244 69 -242 -346 26 -287 56 -59 -14 13 123 228 71
4721 71 33 26 101 64 303 165 310 -37 -22 -85 14 -238 146 32 308 136 -84 247 20 -33 -96 -303 -49 3
4745 3 224 104 213 69 106 164 72 -218 72 60 -324 232 100 37 -86 -162 -220 -189 -100 -13 -57 282 -18 16 -215
4770b15J32K02m72K40K73P3l51J83j5M9J75l62j63L91p3k61J52K14k46R6r4Pj60
4793b25K29l1K57j40q3m1K34j80nK07Oj03j53j47J15K58q2pL6j67k90M76l76M23
4817B11j74J63j33k42K41J2r1l64M92M7k34J12n0j04M6m1j05R2K05OO6j84J69
4840A40l7J14j53j72n3lL53J88m87J11J37k60l76N34j78O1K72mj91J38n7j09j06
4863a38J70o7j45J96j19O9J85J54k39q6L3j39K26n6K38k96N8qk1N3k88K72j97
4886a45L29k44L94j75J9l34k98K66J87J36m8kP1p5j81p1K35l22J99K85j17l5J68
4909B42j46J04l65J82K4L9J28j38om20P24k12j01j25K39k46j50L71J5q8J9j77
4931h7Q6j49J5J30j03K06j59J58L1j12p8k48L83m94L23K34O3J48m47K84m58M09
$$ plain form
4770 -215 -83 119 -353 -113 160 233 -118 65 50 99 274 -88 -251 140 67 -194 -42 172 -74 22 -72 -65 -225
4793 -225 4 -27 230 90 7 -34 200 20 15 222 228 125 -28 -175 -60 198 116 109 145 -22 -312 164 -212 211
4817 211 37 200 67 -175 66 78 -13 -377 115 162 -72 40 -10 -114 -68 -109 -214 -122 83 89 155 -29 140
4840 140 103 217 64 -108 -161 -164 189 377 -110 1 138 -122 -498 36 -142 -81 191 187 -4 134 77 -32 -138
4863 -138 32 -35 -180 16 -103 -34 151 305 66 -20 13 -126 100 44 282 -14 44 36 15 68 -220 52 -145
4886 -145 184 -60 334 159 178 -156 -454 -188 -1 135 87 85 156 81 -100 -171 64 -258 -59 226 109 74 242
4909 242 96 200 -165 17 41 80 208 70 64 -356 368 156 55 -70 169 -77 -227 144 159 71 90 -87
4931 -87 -1 -150 -135 -5 -108 98 -61 97 128 16 -62 -310 73 -421 -98 136 199 347 -100 184 -274 135
4953A35l66k1L56ml13K27q0J02l27M51r7m8J15M2k78l8L53l46J94M3P2k19LK5
4977a9j7R2m3O2k48L51j36k77K95j42N1m30L47L73M5j83l70J03j87J89P3K49k05
5000b7J55J2l25J27O3j34K74l06K68k08L28O2k50J01p5k23l5M89k55p4M0l9pj25
5024a64k99J37M6K97J26rj81J78m3j14k5K08j98n5r6J45R7j54J82k63O8r2J69
5047d0k1J81q7L07n28J60n5J47j32j23J41J16m0K4j6J72n06J58K21r5J74k83J45
5070B0L7L2j17O6l33L66J43m51J14K37Q0m75K14p9K99l16K34k19K89J88m37P8
5092c0j11M9J01j32oqK9J54m6n5j60J55l7o6J64K02l9j24j83J84P4j47k6k03J37
5117a24j55O5N06k23q7p7P6K35k45j90J23J75K0J16jR4j01l05n9j92M75j19j7
$$ plain form
4953 135 -231 -252 104 100 -213 14 -66 36 -291 160 63 15 130 172 -106 -144 209 -137 57 100 172 -47 -44 -19
4977 -19 -36 56 13 75 -173 178 42 -235 60 -82 -31 -461 -114 259 304 121 -249 -146 -333 -144 -71 178 -27
5000 -27 128 140 -185 -58 5 -129 145 -161 107 -101 227 289 39 140 65 -158 -193 296 41 -33 7 -32 -39 -164
5024 -164 -463 -326 -280 17 143 134 -47 131 88 -26 -51 157 -41 -96 -192 -47 50 -104 78 -185 -117 -209 -40
5047 -40 -61 120 33 340 -188 -28 -83 64 -68 -191 -50 66 26 50 34 206 -300 -142 79 -16 158 -125 20
5070 20 57 89 -28 38 -295 71 214 -237 -123 114 194 -281 -67 -146 153 -163 71 -148 141 329 -108 -30
5092 -30 -141 -92 9 -123 -129 -137 -108 46 0 -55 -215 -60 -97 -163 1 203 164 40 -143 41 115 -32 -58 -261 -124
5117 -124 -279 -214 292 69 -18 -95 -19 216 -29 -219 -96 79 99 215 214 308 207 -98 -157 -349 126 7 -10
5140a0J13n1p5J37R4m93J07Q4L9J73l18N96L2n42L55m36Q9oO9J98k36L01k70m5
5164i5J13j1J5l17K59L2J94q5k76J11K85k34p0j6J29m3P5p9L47j5j17k48k03J29
5188a20J19O0l2J52r2m4Lj78K07j01o8J29OJ4j14Jq8K00r5n2n8K02J63l0J28k53
5214E9o1N7j21P4K34o64O37p3j10r0L05o2l13P7j74K24p2M25r7k99K0L9R6J04
5238B15k92J14k51L98L1l97Q5J21J76k52J10j82K34P3l60Q2j92K69r9K9N9j55
$$ plain form
5140 -10 103 52 -23 114 208 -285 -178 -94 -55 118 -200 396 428 -114 241 -195 -106 -112 -43 155 -81 220 -50 -95
5164 -95 18 7 22 -295 -36 -4 190 105 -171 -60 225 -9 -79 -95 34 -9 66 -13 334 319 202 -46 -249 -120
5188 -120 -1 59 27 179 87 43 46 -132 75 -26 -94 35 41 55 -59 -58 -146 54 -41 -93 -151 51 214 184 312 59
5214 59 -2 55 -66 8 242 -422 215 142 32 -58 247 185 -128 -51 -225 -1 -73 352 255 -44 -24 15 111 215
5238 215 -77 37 -214 184 215 -182 -97 24 200 -52 58 -124 110 183 -177 -95 -287 -18 -117 -88 -29 -184
$$ [...]
8191b7
##END NTUPLES=NMR FID
##END=
