##TITLE=1H_DE-54EAK_d6
 DMSO-d6
 8 sc, 
 8.5.2024
##JCAMPDX= 6.0         $$ Bruker NMR JCAMP-DX V2.0
##DATA TYPE= NMR FID
##DATA CLASS= NTUPLES
##ORIGIN= UXNMR, Bruker Analytische Messtechnik GmbH
##OWNER= root
$$ XWIN-NMR		Version 3.5
$$ Wed May  8 14:26:06 2024 Russian Standard Time (UT+4h)  she@DPX200
##.OBSERVE FREQUENCY= 200.1309
##.OBSERVE NUCLEUS= ^1H
##.DELAY= (6, 6)
##.ACQUISITION MODE= SIMULTANEOUS
##.ACQUISITION SCHEME= undefined
##.AVERAGES= 8
##.DIGITISER RES= 18
##SPECTROMETER/DATA SYSTEM= spect
##.PULSE SEQUENCE= zg30
##.SOLVENT NAME= CDCl3
##.SHIFT REFERENCE= (INTERNAL, CDCl3, 0, 15.7039)
##AUDIT TRAIL= $$ (NUMBER, WHEN, WHO, WHERE, WHAT)
$$ ##TITLE= Audit trail, XWIN-NMR		Version 3.5
$$ ##JCAMPDX= 5.01
$$ ##ORIGIN= Bruker BioSpin GmbH
$$ ##OWNER= she
$$ F:/spectra/data/she/nmr/H-F/1/audita.txt
$$ ##AUDIT TRAIL=  $$ (NUMBER, WHEN, WHO, WHERE, WHAT)
(   1,<2024-05-08 14:24:28.71 +0400>,<she>,<DPX200>,
      <created by zg, POWCHK disabled, PULCHK disabled
       configuration hash MD5:
       00 E9 B6 7A A2 85 ED C7 34 08 36 98 17 FE 4E 26
       data hash MD5: 16K
       1E E7 E6 42 9D 6D 3B FC 5F 1B 25 7F 8F BB 2A 79>)
$$ ##END=
$$ 
$$ hash MD5
$$ 8D 65 DA D2 49 BE DD EB F9 60 FA 37 54 72 8A 58
##$RELAX= 
##$RELAX= 
##$RELAX= 
##$RELAX= 
##$RELAX= 
##$RELAX= 
$$ Bruker specific parameters
$$ --------------------------
##$DU= <F:/spectra>
##$EXPNO= 1
##$NAME= <H-F>
##$PROCNO= 1
##$TYPE= <nmr>
##$USER= <she>
##$AMP= (0..31)
100 100 100 100 100 100 100 100 100 100 100 100 100 100 100 100 100 100 
100 100 100 100 100 100 100 100 100 100 100 100 100 100 
##$AQSEQ= 0
##$AQ_mod= 1
##$AUNM= <au_zg>
##$AUTOPOS= <>
##$BF1= 200.13
##$BF2= 200.13
##$BF3= 200.13
##$BF4= 200.13
##$BF5= 200.13
##$BF6= 200.13
##$BF7= 200.13
##$BF8= 200.13
##$BYTORDA= 1
##$CFDGTYP= 0
##$CFRGTYP= 5
##$CHEMSTR= <none>
##$CNST= (0..31)
1 1 145 1 1 1 1 1 1 1 1 1 1 1 1 1 1 1 1 1 1 1 1 1 1 1 1 1 1 1 1 1 
##$CPDPRG= <>
##$CPDPRG1= <>
##$CPDPRG2= <>
##$CPDPRG3= <>
##$CPDPRG4= <mlev>
##$CPDPRG5= <mlev>
##$CPDPRG6= <mlev>
##$CPDPRG7= <mlev>
##$CPDPRG8= <mlev>
##$CPDPRGB= <>
##$CPDPRGT= <>
##$D= (0..31)
0 1.2 0 0 0 0 0 0 0 0.06 0 0.03 0 0 0 0 0.0002 0 0 0 0 0 0 0 0 0 0 0 0 
0 0 0 
##$DATE= 1715163868
##$DBL= (0..7)
120 120 120 120 120 120 120 120 
##$DBP= (0..7)
150 150 150 150 150 150 150 150 
##$DBP07= 0
##$DBPNAM0= <>
##$DBPNAM1= <>
##$DBPNAM2= <>
##$DBPNAM3= <>
##$DBPNAM4= <>
##$DBPNAM5= <>
##$DBPNAM6= <>
##$DBPNAM7= <>
##$DBPOAL= (0..7)
0.5 0.5 0.5 0.5 0.5 0.5 0.5 0.5 
##$DBPOFFS= (0..7)
0 0 0 0 0 0 0 0 
##$DE= 6
##$DECBNUC= <off>
##$DECIM= 32
##$DECNUC= <off>
##$DECSTAT= 4
##$DIGMOD= 1
##$DIGTYP= 9
##$DL= (0..7)
0 120 120 120 120 120 120 120 
##$DP= (0..7)
150 150 150 150 150 150 150 150 
##$DP07= 0
##$DPNAME0= <>
##$DPNAME1= <>
##$DPNAME2= <>
##$DPNAME3= <>
##$DPNAME4= <>
##$DPNAME5= <>
##$DPNAME6= <>
##$DPNAME7= <>
##$DPOAL= (0..7)
0.5 0.5 0.5 0.5 0.5 0.5 0.5 0.5 
##$DPOFFS= (0..7)
0 0 0 0 0 0 0 0 
##$DQDMODE= 0
##$DR= 18
##$DS= 0
##$DSLIST= <SSSSSSSSSSSSSSS>
$$ [...]
##$SUBNAM2= <"">
##$SUBNAM3= <"">
##$SUBNAM4= <"">
##$SUBNAM5= <"">
##$SUBNAM6= <"">
##$SUBNAM7= <"">
##$SUBNAM8= <"">
##$SUBNAM9= <"">
##$SW= 18.0517689322627
##$SWIBOX= (0..15)
0 0 2 0 0 0 0 0 0 0 0 0 0 0 0 0 
##$SW_h= 3612.71676300578
##$TD= 16384
##$TD0= 1
##$TE= 0
##$TE2= 300
##$TE3= 300
##$TEG= 300
##$TL= (0..7)
0 120 120 120 120 120 120 120 
##$TP= (0..7)
150 150 150 150 150 150 150 150 
##$TP07= 0
##$TPNAME0= <>
##$TPNAME1= <>
##$TPNAME2= <>
##$TPNAME3= <>
##$TPNAME4= <>
##$TPNAME5= <>
##$TPNAME6= <>
##$TPNAME7= <>
##$TPOAL= (0..7)
0.5 0.5 0.5 0.5 0.5 0.5 0.5 0.5 
##$TPOFFS= (0..7)
0 0 0 0 0 0 0 0 
##$TUNHIN= 0
##$TUNHOUT= 0
##$TUNXOUT= 0
##$USERA1= <user>
##$USERA2= <user>
##$USERA3= <user>
##$USERA4= <user>
##$USERA5= <user>
##$V9= 5
##$VALIST= <valist>
##$VCLIST= <CCCCCCCCCCCCCCC>
##$VD= 0
##$VDLIST= <DDDDDDDDDDDDDDD>
##$VPLIST= <PPPPPPPPPPPPPPP>
##$VTLIST= <TTTTTTTTTTTTTTT>
##$WBST= 1024
##$WBSW= 4
##$XGAIN= (0..3)
0 0 0 0 
##$XL= 0
##$YL= 0
##$YMAX_a= 42962
##$YMIN_a= -98694
##$ZGOPTNS= <>
##$ZL1= 120
##$ZL2= 120
##$ZL3= 120
##$ZL4= 120
##$ABSF1= 10
##$ABSF2= 0
##$ABSG= 5
##$ABSL= 3
##$ALPHA= 0
##$AQORDER= 0
##$ASSFAC= 0
##$ASSFACI= 0
##$ASSFACX= 0
##$ASSWID= 0
##$AUNMP= <proc_1d>
##$AZFE= 0.1
##$AZFW= 0.1
##$BCFW= 1
##$BC_mod= 2
##$BYTORDP= 1
##$COROFFS= 0
##$CY= 11.3945322036743
##$DATMOD= 1
##$DC= 2
##$DFILT= <>
##$DTYPP= 0
##$F1P= 15.6554695791079
##$F2P= 12.8336369535428
##$FCOR= 0.5
##$FTSIZE= 0
##$FT_mod= 4
##$GAMMA= 1
##$GB= 0.15
##$INTBC= 1
##$INTSCL= 1
##$ISEN= 128
##$LB= 0.24
##$LEV0= 0
##$LPBIN= 0
##$MAXI= 10000
##$MC2= 0
##$MEAN= 0
##$ME_mod= 0
##$MI= 1.114404
##$NCOEF= 0
##$NC_proc= 0
##$NLEV= 6
##$NOISF1= 3.799351
##$NOISF2= 2.8
##$NSP= 1
##$NTH_PI= 0
##$NZP= 0
##$OFFSET= 15.70392
##$PC= 1
##$PHC0= -25293.79
##$PHC1= 1.587482
##$PH_mod= 1
##$PKNL= yes
##$PPARMOD= 0
##$PSCAL= 0
##$PSIGN= 0
##$REVERSE= no
##$SF= 200.130013532006
##$SI= 16384
##$SIGF1= 3
##$SIGF2= 2
##$SINO= 400
##$SIOLD= 16384
##$SREGLST= <1H.CDCl3>
##$SSB= 0
##$STSI= 0
##$STSR= 0
##$SW_p= 3612.71676300578
##$SYMM= 0
##$S_DEV= 0
##$TDeff= 0
##$TDoff= 0
##$TI= <>
##$TILT= no
##$TM1= 0
##$TM2= 0
##$TOPLEV= 0
##$USERP1= <user>
##$USERP2= <user>
##$USERP3= <user>
##$USERP4= <user>
##$USERP5= <user>
##$WDW= 1
##$XDIM= 8192
##$YMAX_p= 0
##$YMIN_p= 0
$$ End of Bruker specific parameters
$$ ---------------------------------
##NTUPLES= NMR FID
##VAR_NAME=  TIME,          FID/REAL,        FID/IMAG
##SYMBOL=    X,             R,               I
##VAR_TYPE=  INDEPENDENT,   DEPENDENT,       DEPENDENT
##VAR_FORM=  AFFN,          ASDF,            ASDF
##VAR_DIM=   8192,          8192,            8192
##UNITS=     SECONDS,       ARBITRARY UNITS, ARBITRARY UNITS
##FACTOR=    0.0002768,     1,               1
##FIRST=     0,             0,               0
##LAST=      2.2672688,     0,               0
##MIN=       0,             -98694,          0
##MAX=       2.2672688,     42962,           0
$$ Real data points
##PAGE= N=1
##DATA TABLE= (X++(R..R)), XYDATA
0 0 0 0 0 0 0 0 0 0 0 0 0 0 0 0 0 0 0 0 0 0 0 0 0 0 0 0 1 -2 4 -4 4 -5 5 -5 6 -6 7 -7 8 -8 9 -10 10 -11 13 -14 15 -17
48 -17 18 -21 23 -24 27 -30 33 -39 46 -52 61 -72 90 -113 144 -191 268 -401 655 -1237 3078 -17382 -98694
71 -98694 -5252 23001 -45983 -8539 31932 20623 24100 5455 2565 37152 10825 -16340 16751
84 16751 18590 8487 11912 -17446 -4321 29906 -20997 -37497 19929 5167 -27227 -2409 8216
97 8216 11066 5092 -31540 -10442 24454 -26038 -39942 13877 3571 -23162 -5911 -5581 1706
110 1706 12510 -15595 -3112 36679 9018 -13077 11578 14786 6607 -4783 -19013 10936 22949
123 22949 -22607 -8477 41330 12778 -15420 12295 16583 2168 -2407 -11638 759 11090 -16278
136 -16278 -22728 599 -3069 -16007 -14412 -5927 11681 5649 -18125 754 23324 -6482 -23176
149 -23176 844 6478 -10192 -17406 -5049 14353 5920 -14072 5830 25118 3911 -4113 11440
162 11440 13451 8182 1184 -6435 4310 8792 -13827 -16076 9079 9469 -7481 -4725 11856 14762
176 14762 -2493 -11503 5292 9096 -14678 -19138 1405 1622 -14486 -14281 -2175 3838 -2808 -8999
190 -8999 1754 14447 5040 -5868 2629 10771 1048 -11973 -6667 7040 3430 -10509 -2013 16846
204 16846 10547 -4096 3775 15888 8480 -4197 -2027 7690 4942 -9423 -10344 1432 478 -10831
218 -10831 -9384 1644 5824 -978 -6239 2445 10536 -2790 -13942 -1386 4834 -10073 -14458 -1237
232 -1237 4488 -1924 -7810 661 11507 4385 -4251 5375 12829 4145 -2830 1060 5196 2203 -6866
247 -6866 -6734 5795 5825 -4698 -1046 10763 8363 -1720 -2441 5437 5644 -6971 -9455 1604 1447
262 1447 -9602 -9105 -828 776 -4183 -6027 1158 8698 1854 -5077 3070 6997 -2000 -7782 -2995
277 -2995 2648 -568 -7726 -1596 9583 4333 -3698 3957 11078 4803 -826 2402 6319 3746 -4190
292 -4190 -4831 2657 740 -6785 -5070 2681 3905 -1141 -2222 4774 6652 -2705 -5962 1134 1631 -7200
308 -7200 -8747 -1668 805 -4989 -6518 457 5141 -119 -2061 4223 6850 2553 -1090 251 3672
323 3672 832 -5663 -3020 3650 1810 -3572 589 7451 5474 -470 1096 6562 3992 -3319 -2614
338 -2614 2414 -466 -6094 -5221 -435 -478 -3725 -3406 2196 4058 443 -2103 1797 3823 -2025 -5929
354 -5929 -2154 1356 -3152 -6407 -885 3687 49 -2281 2807 6782 2860 12 3428 5626 1488
369 1488 -2159 -638 1457 -279 -3475 -2096 2168 2841 -472 -116 4519 4475 -1007 -2464 1777 1222
385 1222 -4807 -5429 -593 -1060 -5158 -4655 60 1806 -667 -1091 2989 4062 638 -936 622 1329
401 1329 -1346 -3887 -2072 1394 -236 -2610 479 4790 2951 -204 2460 5141 2700 -1085 -58
416 -58 1837 -466 -3762 -2660 -558 -1093 -2190 -1366 1553 2763 502 -669 2117 2259 -1388 -3153
432 -3153 -938 -501 -3373 -4847 -1620 940 -1556 -2519 1651 3570 1099 785 2742 3222 994 -1151
448 -1151 -694 475 -1145 -2778 -796 1067 1114 217 1358 3499 3257 602 634 2497 953 -2191 -2092
465 -2092 -924 -1454 -3483 -3245 -837 375 -955 -216 1996 2372 665 -732 319 231 -1845 -3566 -1612
482 -1612 -612 -2001 -2449 220 1400 595 1051 2260 3227 2708 697 806 1735 -133 -2164 -1501 -394
499 -394 -582 -1650 -178 1435 1889 887 661 1977 1487 -672 -1340 -221 -1008 -3257 -3050 -1851 -1514
516 -1514 -1863 -1426 247 1504 853 1124 1848 1942 505 -903 -619 -146 -1083 -2108 -1209 777 263 -637
534 -637 1625 2670 2120 1635 2174 2182 1037 -614 -725 -309 -1525 -2074 -1648 -1056 -384 -25 336 994 1664
553 1664 579 -228 710 106 -1315 -1802 -1508 -1371 -1520 -2313 -792 401 -397 49 2093 1885 1242 1683
571 1683 1596 718 144 -952 -1428 -555 -987 -624 101 189 1193 1393 718 1739 2027 107 -177 911 -511
590 -511 -2024 -1625 -1424 -1629 -1655 -1263 94 808 -178 1060 1515 265 471 370 -700 -543 -488 -1778 -1395
609 -1395 -213 -232 -582 460 1367 1411 1271 1467 2128 1417 13 340 -17 -1484 -1337 -706 -971 -634 416
628 416 441 487 1176 772 609 444 51 -67 -792 -1332 -948 -1336 -1969 -1018 -10 -764 -298 1283 1252 883 1308
649 1308 1344 594 -195 -561 -306 -752 -1175 -214 -143 -333 879 1508 684 1054 1831 1130 580 731 30 -841
669 -841 -1096 -822 -1242 -1549 -860 -198 -255 -45 835 1039 122 358 726 -552 -821 -425 -1070 -1397 -910 -505
689 -505 -505 -164 615 1168 1381 1242 2001 1688 162 508 423 -771 -830 -287 -729 -656 -82 682 540 577 1077 829
711 829 471 427 548 -356 -814 -634 -890 -1522 -1317 -452 -775 -217 639 1010 566 577 901 235 -159 -429 -350
732 -350 -642 -880 -477 -324 -303 236 693 528 922 1381 1283 973 458 551 -313 -595 -468 -760 -708 -809 2 -14
754 -14 229 897 502 642 210 604 9 -713 -477 -738 -1071 -1074 -694 -842 -363 65 72 727 1017 938 1020 564 377
777 377 127 -316 -665 -100 -511 -418 148 420 125 707 810 709 847 614 547 78 -536 -403 -758 -1241 -889
798 -889 -659 -443 -247 411 268 215 378 716 300 -156 -196 -629 -588 -825 -802 -451 -421 -318 305 585 545 1021
820 1021 963 699 915 472 67 -308 -407 -585 -356 -428 -109 56 353 314 603 574 435 635 59 -281 -160 -666
842 -666 -724 -840 -1070 -912 -351 -318 -31 259 704 792 622 276 242 -79 -408 -519 -244 -245 -144 -2 65 336 537
865 537 704 751 672 584 533 277 -225 -268 -747 -655 -468 -331 -180 -153 334 281 215 200 402 126 -94 -268 -65 -433
889 -433 -658 -842 -577 -602 -174 155 377 606 557 651 653 738 258 33 -31 -153 -341 -353 -147 -71 -128 285 814 683
913 683 651 853 639 385 8 13 -322 -899 -818 -450 -459 -365 -216 350 20 435 505 306 146 42 -144 -382 -505
936 -505 -461 -425 -722 -241 271 118 309 521 881 630 645 872 140 -10 28 -186 -473 -493 -129 -271 -29 464
958 464 631 473 480 642 249 -103 31 -225 -333 -708 -487 -649 -610 -354 95 142 204 318 400 297 474 53
980 53 49 -224 -368 -398 -460 -195 123 -5 44 573 411 356 611 933 323 367 35 -96 -528 -719 -567 -373 -561
1003 -561 -47 278 144 358 294 281 93 19 -238 -357 -298 -395 -483 -602 -473 -99 97 -6 243 720 659 774
1025 774 272 320 42 210 -221 -546 -111 81 -341 88 206 266 273 427 756 384 393 88 -63 -439 -467 -567
1047 -567 -570 -415 -598 35 21 -64 146 418 450 193 238 114 -414 -190 -630 -563 -61 -324 -13 30 454 10 418
1070 418 740 290 733 228 58 -15 -409 -284 -534 -83 -194 -309 -86 223 174 351 343 37 329 -61 -225
1091 -225 -488 -614 -525 -551 -577 -559 -175 135 317 97 340 485 146 542 61 -177 -290 -264 -252 -407 -54 -2
1113 -2 123 258 424 520 551 264 668 167 -97 269 -255 -483 -306 -274 -574 -423 -174 137 52 518 167 233
1135 233 -217 -192 -128 -348 -312 -314 -385 -386 -103 97 -103 239 245 296 450 217 336 238 205 -249 -287 -348 -249 -170 -93 27
1161 27 227 361 432 307 490 270 158 -183 68 -192 -410 -403 -487 -375 -189 -99 -93 402 345 -54 223 152 -21
1184 -21 -255 -404 -341 -160 -399 -197 -20 106 113 119 460 382 486 404 174 -41 -81 -151 -228 -295 -265 -216 -88 -81 210
1209 210 -40 462 331 313 -17 -49 17 -38 -512 -206 -500 -378 -106 -92 174 112 290 292 426 169 76 251 132
1232 132 -199 51 -186 -554 21 -3 -304 306 254 -61 314 346 -53 243 -30 -152 75 -484 -353 -217 -395
1253 -395 -118 76 -64 -103 286 515 273 267 198 76 -270 -317 -459 -389 -323 -114 -72 38 202 110 229 215 357
1276 357 134 -244 -110 145 -159 -308 -153 -292 -164 31 -5 361 183 192 377 330 68 298 -27 -356 -293 -423
1298 -423 -365 -664 -372 -207 -3 -19 229 270 110 95 -118 -137 -84 -302 -442 -376 -322 111 -67 204 92 232 328
1321 328 243 266 177 235 129 -141 -238 -137 -192 -271 -420 -272 43 122 236 172 368 330 117 -207 -194 -249 -377 -506
1345 -506 -264 -340 19 50 134 277 195 407 92 397 123 -117 -152 -140 -311 -287 -354 -216 -102 118 -14 237 190
1368 190 399 319 36 417 -175 -224 -95 -273 -544 -337 112 9 11 257 313 122 65 403 260 247 43 -189
1390 -189 -495 -260 -177 -118 -217 215 213 107 338 523 502 266 135 100 -10 -262 -117 -382 -66 -64 -56 -197 13 234
1414 234 266 253 126 191 89 70 -11 -215 -419 -11 -313 -326 -21 24 81 227 533 517 267 165 45 -123 -298
1437 -298 -201 -207 -141 -454 -47 324 173 248 164 429 280 272 71 241 -169 -330 38 -271 -228 -354 -93 227 -44
1460 -44 229 269 277 79 34 -151 64 -228 -222 -286 -436 27 -242 -78 65 115 -99 321 168 256 334 92 -302 -34
1484 -34 -230 -143 -218 -173 94 -116 210 153 226 264 529 128 16 -66 -58 -271 -499 -323 -198 -274 -72 -82 62 109
1508 109 235 247 148 80 -165 -146 -117 -377 -260 -361 -24 -133 -50 248 122 182 146 257 409 112 32 89 89 -169
1532 -169 -174 -45 -3 83 -93 139 98 156 85 122 377 342 -27 -321 -204 -89 -314 -466 -224 -145 -129 -33 174 352
1556 352 -47 85 30 33 169 -178 -64 -150 -361 -455 -119 127 198 167 376 332 192 199 -35 286 176 128 -144 -170
1580 -170 -279 -290 -486 -65 24 43 70 471 343 167 -38 123 24 47 -196 -92 -173 -510 -138 45 -46 157 -56
1603 -56 306 165 456 200 84 43 117 -145 -354 -118 -163 -354 139 200 71 58 -152 65 -14 50 -132 -57 11
1626 11 -283 -259 -345 -104 -180 -173 -29 302 205 16 180 200 24 -102 81 32 -392 -283 -276 -236 -7 -73 181 337
1650 337 78 245 231 187 78 65 0 -220 -24 -163 -121 -49 -25 -265 -35 177 136 -94 -162 -29 67 95 -93 -268
1674 -268 229 -96 -69 105 106 7 -28 380 227 -109 141 78 100 -211 -295 102 -239 -99 -24 58 156 272 144 -100
1698 -100 379 251 -84 101 364 84 -35 -130 1 -362 -256 -224 228 57 120 113 413 83 -109 194 -93 -142
1720 -142 -295 -83 -140 -151 -411 -151 291 94 41 85 133 226 132 -8 -108 47 -237 -241 -5 191 -28 -155 236
1743 236 136 -7 182 309 -14 47 -202 -83 -181 -175 -18 -230 -215 176 -156 -82 331 6 77 -9 -6 0 -244 20
1767 20 -120 -41 -169 30 163 -23 -17 53 205 318 16 -41 8 236 -212 -155 -134 -107 -115 -348 -307 -49 -94 0 -197
1792 -197 169 25 -63 -70 1 -134 -492 -323 -130 -83 -247 -182 13 -22 201 35 -86 222 -218 38 -71 -102 -469
1815 -469 -296 -202 -239 204 -483 217 384 375 21 -130 144 83 -190 -21 121 -229 -466 23 -18 37 -138 198
1837 198 42 -6 81 7 207 116 -276 -111 -81 -188 -139 76 30 100 44 61 284 213 236 190 76 -38 -25 -224 65
1862 65 -195 -151 -170 -196 10 -211 -3 199 372 391 57 28 -98 -24 -200 -141 -155 -136 -141 -31 84 -40 211 116
1886 116 236 107 56 -106 61 35 -183 -206 -57 -151 -312 -55 266 158 75 -169 424 107 20 -32 162 -88
1908 -88 -282 6 -264 -133 75 50 12 228 156 67 98 297 87 -269 -78 95 27 -199 -543 -53 -316 -262 20
1931 20 52 97 30 -5 127 -185 -147 350 70 -82 -197 -30 -184 -18 -89 -24 385 461 -209 54 246 0 -130
1954 -130 -17 -182 0 -141 -285 -130 56 243 -163 3 83 1 105 126 -66 -56 -149 45 122 -49 -159 -306
1976 -306 238 32 87 -23 48 289 -51 -4 321 93 -113 -198 100 95 -130 -159 129 -25 271 53 -202 262
1998 262 147 -303 6 37 -149 28 -296 23 -399 -100 -59 236 190 -101 78 104 183 44 12 43 -31 -100 -175
2021 -175 40 -277 -46 81 -50 139 192 -25 -214 -160 -251 -361 -54 -47 197 -274 -68 -52 -18 -3 -32 3 266
2044 266 160 -308 -72 -125 123 -136 22 -175 -92 -232 66 47 35 296 76 178 -15 -44 118 43 -85 -347
2066 -347 -60 -45 -237 -288 -140 40 117 43 234 217 361 50 -126 215 -98 -135 -265 -60 -348 -138 -139 -24 26
2089 26 283 109 228 44 112 -36 -54 -88 -165 -92 -159 258 -387 -94 372 -219 -217 17 65 22 -27 127 30 79 37
2114 37 -232 73 78 -46 -308 -13 355 85 89 347 138 -83 -90 371 53 -234 -218 -64 34 -113 -91 173 -7
2137 -7 -20 103 48 57 -79 -60 80 144 -95 -85 73 -195 202 67 -217 4 -167 -56 -145 310 50 81 -31 -227
2161 -227 -269 -52 -130 3 163 120 61 -176 306 147 132 -42 -73 -90 96 -121 -239 -110 -191 -247 -106 71 224
2184 224 -5 70 14 43 -7 44 27 -304 85 -246 -218 209 -78 -99 -36 208 9 239 1 94 126 -138 200 -90
2208 -90 88 -180 -109 37 -26 258 207 73 -383 -98 81 -77 96 -61 0 -2 91 -160 139 0 -9 134 89 102
2232 102 -27 -142 96 42 113 112 -221 146 -132 -46 45 300 -38 -238 234 -11 66 77 286 79 211 -256 -157
2255 -157 -166 -197 116 -161 -119 215 -1 272 233 161 79 -88 -43 74 -47 -25 -15 -94 -163 158 230 -58 107 59 26
2280 26 12 -242 7 -212 -3 -101 232 -8 -166 110 214 -78 -52 134 -70 255 263 -122 127 -195 -151 22
2302 22 33 -280 34 89 53 -291 -44 -15 214 219 -139 -323 -29 -16 -171 19 -102 -40 -193 124 17 -163 -78
2325 -78 241 55 181 -63 29 59 -94 -105 -20 -186 -222 166 -119 60 74 164 -17 258 87 20 -81 104 -211
2348 -211 31 27 221 99 18 -166 -69 -19 -45 176 9 214 230 -227 83 -144 -34 155 30 60 16 236 96
2371 96 82 142 327 19 250 -86 176 -120 214 -24 186 -138 -5 -272 42 8 38 -8 -169 -102 61 86 35
2394 35 -180 15 71 -18 74 -173 93 -103 16 -110 34 -5 -192 -182 174 -46 -78 142 120 92 -14 -156 75
2417 75 128 -82 141 37 47 -150 -1 58 57 -71 -250 -101 155 -63 -207 194 -13 78 7 10 35 170 -144 -165
2441 -165 31 -17 -174 141 -186 62 -141 -205 158 32 39 199 -19 226 -35 -11 -236 5 -12 -4 32 132 -67
2464 -67 -8 -88 18 42 -41 -40 -34 77 -100 -92 -94 15 -21 0 -160 103 -4 127 72 275 98 -29 68 -71 208 86
2490 86 -114 127 -136 32 60 -132 -39 -227 143 31 59 100 -106 82 46 95 -82 49 -394 -37 8 82 -68
2513 -68 -29 170 -228 -115 28 44 -153 97 35 -85 64 71 270 31 29 -196 58 136 -139 -100 10 46 -65 -19
2537 -19 28 -257 289 2 28 -58 9 -37 54 16 384 152 -96 244 54 153 137 73 -37 -290 -10 -108 -228 137
2561 137 90 -121 104 326 113 -58 42 151 27 170 -38 -32 76 92 -30 65 124 115 -180 -179 -367 -28 10 25
2585 25 205 -267 105 100 168 141 126 59 -90 -239 -7 -54 -253 73 -63 311 53 30 23 -173 203 303 36 5
2609 5 -170 129 -98 -149 94 89 -17 -168 229 -102 -151 -83 -68 -167 -46 -116 -7 7 -86 -72 117 -75 -179 63
2633 63 -180 -127 353 172 -23 -15 -137 79 84 200 -61 78 -76 -39 -242 65 -185 5 136 -229 42 -36 121
2656 121 9 24 71 -14 -19 -6 84 -152 223 -3 109 102 -61 282 -110 172 65 -46 125 14 -38 -4 -435 88
2680 88 -96 198 -54 -21 19 3 229 -316 87 -37 363 -225 -249 -212 67 83 154 -51 -134 93 -97 27 -25
2703 -25 -80 -41 -103 -74 -74 78 -157 8 -245 -85 142 -42 117 -16 -110 -280 21 39 29 19 -98 58 123 110
2727 110 41 -4 -168 6 -40 25 194 -144 126 195 85 -243 -13 172 107 -58 -121 -287 132 223 290 -107 13
2750 13 142 -96 -246 -9 84 129 45 -359 -61 20 -155 61 107 18 365 -5 87 53 -97 87 94 -118 129 26
2774 26 -79 -67 51 122 -131 -73 -12 -4 -179 -135 2 -212 64 -6 205 218 -70 -17 91 311 120 115 255 80
2798 80 -31 124 -37 157 -34 -16 -157 -85 -90 51 154 17 84 51 28 152 -109 -61 81 129 -95 -49 -201 -57
2822 -57 6 -83 222 146 12 52 129 235 -271 -258 -72 157 74 -171 -270 -83 -151 53 -280 -129 3 -56 124 70
2846 70 229 -124 237 4 -165 -113 -71 78 0 -99 -50 -29 65 -289 135 -174 173 105 -150 68 120 -62 -79 87
2870 87 -1 -293 62 -189 111 -140 -72 -9 40 183 -211 354 73 64 -107 -255 35 -67 -87 -145 -88 93 189 -121
2894 -121 -149 166 309 -31 96 152 122 -65 190 197 -41 74 41 -39 62 -25 117 -58 128 -104 -148 -29 43
2917 43 178 -180 109 103 -141 52 74 -123 108 -45 69 -102 156 129 -150 35 194 85 -59 -74 8 24 -133
2940 -133 -70 192 -35 -29 24 -357 267 7 48 -64 -122 -168 2 206 67 -146 -26 -110 39 -49 -110 -70 154 307
2964 307 30 19 175 163 59 -133 128 -37 -114 -59 -200 136 -25 -27 210 -112 -156 113 6 -170 -45 87
2986 87 368 -77 -117 103 -113 -161 56 -332 57 204 -59 118 21 -124 157 214 79 207 -107 -88 -83 246 7
3009 7 -26 -105 29 -255 29 -44 -154 -175 -169 -16 223 -85 -78 53 -308 -173 -69 -194 -146 71 91 -24 0 -82 160
3034 160 -223 85 144 54 122 -22 63 -164 -201 60 -213 64 75 -100 -52 -89 82 114 28 113 -70 -238 39 -121
3058 -121 -96 -137 67 -123 140 -6 6 -43 64 0 -16 194 31 -188 215 -244 29 -395 49 73 81 129 -119
3081 -119 -91 69 -288 9 170 -175 204 52 -114 -83 130 -73 91 67 -151 44 121 -96 107 81 111 32
3103 32 -145 153 280 -69 -85 61 132 -146 -85 57 62 165 -6 -12 23 -33 -216 176 -203 151 -45 184 181 -102
3127 -102 15 39 229 -63 -138 199 -46 219 -317 -61 194 13 23 80 26 -162 149 -82 99 115 415 203
3149 203 -24 6 -65 236 -59 60 12 -155 -28 31 -133 -193 -25 6 -158 145 164 25 47 -102 28 -62 -36
3172 -36 193 -39 -247 -134 -116 -40 -141 -13 203 29 216 33 126 166 58 40 37 4 -1 131 42 -8 109 70 77
3197 77 -9 -171 221 -111 241 29 -3 -23 152 -96 -56 31 -46 -111 -58 -27 -117 -16 -41 55 73 23 -35 206 -234
3222 -234 -195 63 -30 77 -228 232 -173 -175 15 -68 -16 6 67 152 123 -14 57 232 158 139 -157 148 23 -161
3246 -161 97 -81 18 -21 154 69 -91 -9 241 289 -31 165 59 47 80 128 -90 -248 -41 61 -118 63 96
3269 96 343 27 3 41 -32 125 18 36 -177 -167 -186 -209 -49 -24 -280 18 -165 -147 0 -14 -61 -97 -93 30 -78
3294 -78 6 -64 -11 -190 159 17 103 -53 -113 -100 253 102 43 20 106 -131 143 117 -150 250 103 -86 -122 8
3318 8 35 4 -153 -71 -186 -98 -216 -7 229 105 -28 172 19 -14 -160 -91 69 -212 -11 4 101 87 278 185
3342 185 -33 -113 20 131 -56 131 41 -263 187 -310 -144 -8 -10 -168 -35 -182 -22 1 10 -100 115 -4
3364 -4 -27 63 -16 -20 -152 50 -41 170 -142 -34 -47 -129 40 -83 -238 130 -84 69 -204 62 368 -96 136
3387 136 -200 -103 88 56 34 90 52 -69 2 104 196 141 19 30 94 127 -99 7 244 -68 -4 41 140 -148 -219
3412 -219 -211 -28 -33 -246 112 -72 -83 -162 -116 108 -35 24 -53 187 -153 87 -25 -32 -69 -232 255 76 -89 45
3436 45 177 53 8 54 -47 -117 -81 128 266 -9 159 -52 186 -4 27 -35 28 -29 76 -144 78 16 -176
3459 -176 5 119 93 40 -46 -143 58 49 140 277 -123 11 3 -11 -46 237 85 -18 85 16 95 52 -157 -370 13
3484 13 160 -154 16 -95 -63 87 -70 101 108 -109 -17 158 -98 77 112 3 -99 41 -52 -30 -77 -72 -43 43
3508 43 73 108 106 -36 -64 -4 9 81 195 -216 115 33 81 94 -17 -113 -225 -13 -217 -76 14 -115 -56 -258 101
3533 101 -244 -259 -145 139 -218 -28 164 -67 -130 -62 -118 84 158 -72 137 78 96 16 35 97 241 -163 -127 79
3557 79 -47 -140 14 62 8 -12 78 203 51 -234 188 6 9 6 178 30 -143 173 162 -22 -144 -131 -135 32 -59
3582 -59 322 81 -83 9 160 94 309 153 -3 -153 -41 -89 -113 164 1 30 -160 173 85 60 210 -132 -281
3605 -281 144 19 66 -375 -186 137 128 92 -98 -33 224 -53 -199 -138 113 109 166 66 -199 10 178 87 30 -21
3629 -21 -77 -88 -7 122 -10 -168 84 -53 -56 193 161 -106 87 86 46 -122 -170 193 -27 -298 171 176 137 98 -87
3654 -87 6 62 202 97 -45 97 20 59 112 -119 60 152 -16 149 7 135 -98 62 4 -175 70 -88 147
3677 147 -7 109 180 -118 60 28 -275 -40 -127 -98 -49 34 -291 54 90 27 -180 -164 -71 -163 63 -65 -55 60
3701 60 -109 -269 -89 -54 121 -73 133 208 -67 60 -116 -165 -47 54 -61 96 18 331 -156 141 109 -39
3723 -39 21 149 39 -197 -3 -18 219 42 -58 -237 44 159 -22 -162 34 18 -85 44 -123 -27 2 -228
3745 -228 -125 -77 204 -110 11 242 -16 -34 -7 -12 -76 83 -95 133 -46 -278 -82 -25 54 -116 -13 -3 7
3768 7 25 44 327 38 145 129 -164 -185 -169 49 116 111 -280 10 46 -39 63 334 116 -44 128 5 -82 189
3792 189 196 -137 -164 339 -72 -63 -75 72 -15 60 -39 -116 37 -289 -348 6 -29 41 -185 -97 -132 -26 48 32 -47 152
3818 152 304 -26 45 148 58 33 -68 -31 81 7 167 -44 -123 28 167 142 69 -149 -112 11 -224 121 -20
3841 -20 -115 -36 107 144 160 38 18 -223 184 114 -61 -52 199 -37 88 33 -240 -231 -89 54 44 -40 -132 -268 -248
3866 -248 39 97 -37 -83 -3 -105 -48 -6 -114 -39 -210 -220 -32 -147 263 -155 -16 -267 -84 100 5 -56 254
3889 254 -131 114 -165 -189 68 -113 -8 -184 121 132 -159 -227 -119 -13 -118 -51 219 -4 -167 -14 -76 -193
3911 -193 -55 90 144 -37 -10 -132 63 281 -26 -115 54 -34 38 71 134 115 69 278 34 78 -48 -244 212
3934 212 -143 -6 -151 92 -171 -12 147 163 -27 -177 93 238 2 33 -189 -130 210 33 74 20 13 -78 -57
3957 -57 28 174 251 446 -21 -68 -139 -60 101 86 -189 -236 -51 -12 -31 15 -116 49 108 -19 -31 -301 118 255
3981 255 346 -135 49 229 136 49 -46 104 99 -315 -96 45 79 94 64 29 -39 52 -38 -83 -17 -95 -61 -89 219 -20
4007 -20 -320 29 -11 129 -163 -39 198 182 -176 69 151 181 -22 -27 -71 -137 -15 -8 -153 77 -255 -98 9 111
4031 111 -15 239 -72 -6 -48 55 48 78 -28 -203 -214 -4 210 -353 -10 215 -53 119 64 43 -270 212 158
4054 158 -225 247 -88 -85 99 -180 50 -107 79 -96 45 25 -224 -155 79 141 -70 -51 -3 -145 32 -178
4076 -178 -73 -74 30 163 426 3 56 255 -110 -88 -88 -72 -43 -122 -156 78 -40 -32 171 -112 -102 259 -42 -44 -114
4101 -114 -93 -42 183 -8 134 -52 164 3 205 40 185 151 -137 -17 -1 220 -72 -63 -158 129 5 -104
4123 -104 -258 -14 -81 -299 -137 -27 -142 -230 -146 61 25 216 52 108 127 -91 87 -41 -173 149 138 -17
4145 -17 11 1 132 -129 372 265 29 67 -24 -110 -2 205 139 89 -195 81 -208 72 -23 14 91 -31 91 16
4169 16 283 -39 -111 -213 68 -180 -207 -21 -206 -39 -185 -32 25 -46 -56 -49 -9 41 25 37 -19 131 88 16 -244
4194 -244 -4 144 -160 -42 22 -218 -61 -98 152 -313 -110 124 104 60 19 23 46 375 48 -70 -118 -208 -172 16
4218 16 95 -134 -60 103 -74 -80 -3 -57 -133 104 -121 -13 -148 23 76 -92 281 61 -55 42 186 -366 -32
4241 -32 -51 -91 132 -141 80 58 -72 -19 -135 157 75 5 -132 -59 -87 148 162 -18 120 49 70 112 -33 -124 -64
4266 -64 59 -152 -3 225 -228 331 157 15 -160 203 -131 3 -13 162 -54 79 -78 -36 -25 -183 -45
4287 -45 21 343 -42 78 81 134 -1 -75 -49 -56 61 36 -115 104 -157 -200 7 226 -72 27 67 84 0 9 -37 79
4313 79 -78 122 12 5 92 -52 128 -314 256 -299 83 -195 58 223 -114 96 -69 -35 -124 -87 -231 -94
4335 -94 175 -147 7 -56 130 -71 -219 177 131 -149 239 -33 -266 -138 -190 -10 -54 134 -11 22 127 197
4357 197 39 -5 178 154 1 22 61 -59 48 -230 19 70 142 -284 -1 -13 153 -49 5 115 2 -301 -25
4380 -25 40 223 80 142 222 19 -247 -174 -23 141 -10 17 -1 -248 141 186 58 171 -101 52 -38 186 63
4403 63 -138 8 82 -15 -74 -122 -41 -235 -98 -15 -60 -225 222 42 -86 -174 -100 -72 -23 -32 70 199 -125 221 -195
4428 -195 -218 15 102 365 181 24 -299 213 -12 -58 -144 -139 -52 -113 -5 -154 -30 71 57 -149 -57 -61 193 -60
4452 -60 261 5 180 85 95 -82 -65 109 33 -173 287 -32 2 202 -107 47 103 -374 -47 108 -25 -37 -79
4475 -79 77 8 -319 -277 -312 -124 -63 74 -86 14 28 -90 122 9 -91 -126 -94 205 45 77 -86 166 -227
4498 -227 57 -18 -39 170 -238 2 22 -76 -82 -162 60 2 -72 95 -5 -344 3 137 43 -72 -176 -269 -194 15
4522 15 -175 -256 -86 63 -177 62 52 21 -4 170 123 -68 259 2 -246 18 135 -81 -14 -222 -13 -37 156
4545 156 -306 108 -167 -150 84 121 -131 -220 136 -26 -41 132 -120 103 20 -107 -64 -118 175 177 -32 -16 314
4568 314 292 28 144 81 -103 62 128 25 110 24 -188 17 -15 -103 136 50 -216 -31 -122 -22 -167 187 -122
4591 -122 100 108 39 -3 120 113 -137 8 -2 220 -75 94 -119 -30 -2 249 -144 16 0 -166 238 217 -36 22
4615 22 -39 52 95 -168 -117 -101 -122 -58 -45 -13 272 -188 46 103 94 -27 -288 -376 61 88 -125 127 -199 -92 414
4640 414 229 -124 -110 -65 192 -99 -150 -98 27 -76 77 162 -102 -24 -134 131 134 -149 352 -22 -71 95 -13
4663 -13 135 -139 235 -314 -29 379 66 -114 -64 -11 -96 -96 -128 68 216 146 16 -85 42 113 -14 36 -73
4686 -73 181 206 -279 -139 18 -161 -25 -103 -9 -78 34 -92 -105 -12 -9 197 167 178 -157 173 -11 6 71 53 -112
4711 -112 22 77 -27 -77 -55 -298 175 -126 23 -165 -27 137 -124 -113 -9 -90 179 67 -130 21 -148 181
4733 181 -191 -187 103 328 -111 -98 -4 -103 -244 149 -135 -15 28 200 63 -114 144 75 -115 -240 199 -40
4755 -40 -166 -223 -21 -86 101 -221 -29 -110 63 61 -69 -90 -3 113 -179 -151 160 -54 -86 -92 -181 -136 -270 201 -200
4780 -200 141 -251 -27 134 -130 -40 -244 -11 92 36 -153 83 -25 37 132 -128 221 98 136 -149 108 -25
4802 -25 -84 29 -65 -137 138 -186 68 -204 -166 -3 111 5 73 -40 -103 -84 -82 119 -121 40 9 -42 34 432
4826 432 5 66 -168 59 8 -298 -106 64 -298 62 -59 109 -289 193 120 -80 32 12 -188 -48 -265
4847 -265 -54 168 116 -82 36 65 -177 166 231 71 -155 59 -173 -52 -79 -51 -51 11 152 71 -149 -44 -135
4870 -135 -69 174 -99 64 -12 -218 -56 -75 218 144 -88 -309 -52 -182 99 -168 16 14 0 -114 -104 -74 53
4893 53 -173 118 -79 105 309 -96 59 -104 79 256 137 89 152 179 -26 -10 -78 -84 -140 25 -111 -70 82
4916 82 377 -47 -50 -297 -158 49 -31 -135 56 -157 -56 243 -156 -98 60 -86 44 47 -5 -77 -158 -16 116
4939 116 11 -21 132 -184 -100 63 -66 -45 -5 -88 171 226 106 -226 15 198 75 2 61 210 -115 45 -60
4962 -60 85 237 144 -183 44 125 -246 88 -147 -180 -384 62 30 -218 25 -54 -215 -245 -3 -79 -137 169 59
4985 59 336 -16 -126 160 61 137 -167 -48 222 16 96 -311 -187 -79 -31 -351 -122 64 137 -177 -113 155
5007 155 262 -311 -39 -132 -41 476 196 -42 -244 121 184 137 -95 34 -281 425 226 24 186 90 -3 18
5029 18 6 145 -12 -169 -96 140 -86 37 -77 -189 250 190 121 166 -34 -113 -97 196 -18 121 226 -80 -50
5052 -50 -196 -250 -116 -40 1 -30 -136 -316 -7 -147 155 -121 -251 51 145 -76 17 250 44 172 59 24 -18
5075 -18 47 -95 -6 -125 -99 -50 -172 32 -73 -223 128 -24 90 36 163 -132 -55 -201 -212 -53 124 -121 86
5098 86 -26 62 -1 -138 162 39 159 -166 72 -223 105 -109 204 -169 120 -198 37 104 -220 -101 141
5119 141 112 -43 -137 -22 215 -28 115 -101 -192 80 80 173 -195 -29 319 -82 -23 -266 192 -14 -20 -332 57
5142 57 129 -15 -55 44 -260 -102 291 -85 -177 89 -87 -172 -206 34 103 -83 -143 -371 241 35 -37 49 -181 72
5166 72 -123 157 -212 -27 -252 -8 -10 75 -12 52 -332 62 114 -241 -24 -15 -45 62 55 -19 103 28 41 -178 -76
5191 -76 180 126 5 194 168 -245 -133 304 -26 -14 71 -55 -13 -36 -91 133 178 74 -127 -124 249 168 -145 -100
5215 -100 -7 -274 -48 -42 124 83 10 59 123 -85 16 42 -133 116 -93 190 -70 89 -21 -67 84 -224 189
5238 189 95 87 32 29 87 5 -239 -252 -166 1 98 -352 -40 -143 79 29 165 -284 100 -209 -48 -75 -72 10 -195
5263 -195 111 113 -152 -53 -58 -127 -48 127 167 96 -223 -72 147 50 -11 32 -123 -326 124 -82 36 92 -3 56 14
5288 14 -22 -57 -331 -42 -14 -259 16 -102 -9 -64 26 -44 -44 -158 92 79 172 -12 -67 171 -141 -46 22 55 34 190
5314 190 42 188 36 19 101 222 161 -26 8 -67 -91 65 -91 -160 -24 86 14 41 126 -203 231 137 83 -82
5338 -82 -128 -138 -214 -24 158 193 -169 -266 68 -99 210 -87 45 -27 -93 20 -97 -15 83 -108 -96 -135 -24 93
5362 93 137 -105 -49 31 119 173 -49 -33 25 -42 106 16 -171 -172 -163 -114 119 155 47 168 55 -26 -155 280 -73 181
5388 181 57 -247 412 56 246 21 -7 -184 68 34 267 219 -208 -140 10 -44 135 -4 -101 67 -106 15
5410 15 -58 87 258 -44 -120 170 -56 57 173 -73 200 -33 143 -62 35 -8 189 4 -261 -147 39 63
5432 63 -108 -102 13 -125 -27 -100 0 -130 -20 -60 -193 -189 35 -71 -108 244 174 -291 -80 75 112 -88 -56 130
5456 130 161 225 16 -26 -198 -59 21 -340 -108 -64 -119 -144 50 30 108 137 101 -232 -216 -85 98 -16 85 299
5480 299 45 103 -252 -55 163 -56 -84 131 47 270 53 -115 155 -76 -47 -110 -80 106 80 -48 72 -29
5502 -29 -190 15 -211 -52 -50 172 130 385 212 180 -154 157 119 119 33 -130 -146 13 5 42 161 -84 170 180 -55
5527 -55 171 111 61 280 226 -22 76 -260 85 -149 -183 101 -153 -36 -229 221 122 158 -8 -190 113 -34 -115
5550 -115 -3 16 174 207 -40 -89 -200 166 -61 23 68 -147 190 153 -56 34 93 180 -117 167 5 -28 -63 -9
5574 -9 -42 60 -200 -248 -48 -259 221 165 -124 77 75 -41 -137 50 146 -214 41 245 39 -71 121 77 227
5597 227 69 200 202 43 -443 -95 -197 5 289 -73 -316 -186 323 -5 -15 -40 175 29 -95 -81 138 65
5619 65 -255 -228 136 91 -74 -49 25 -184 51 -97 -50 -254 56 84 -258 -385 118 72 -17 -44 7 248 249 107
5643 107 -31 -64 266 -17 -138 296 3 45 -168 50 -21 -4 41 -77 -73 183 68 -210 6 32 89 -70 57
5666 57 -114 -30 -19 20 166 -398 237 -14 -94 27 -149 -31 38 -58 46 2 -75 -254 -77 -94 -47 169 84 79 65
5691 65 -95 48 61 -219 232 -85 304 -24 81 229 -115 -50 52 82 158 55 77 -67 -190 -61 -152 56
5713 56 -43 70 100 -139 -89 -31 -106 -37 131 -293 9 -24 -134 -20 203 109 186 -187 93 -111 -74 -47 259 -179
5737 -179 162 -139 -21 262 -46 64 151 -90 -81 21 60 -210 48 -283 -55 -56 -145 -68 237 51 76 -82 -114
5760 -114 -192 -15 27 -227 -140 -134 337 -40 -23 -217 318 -148 -101 -14 -27 -126 141 153 -78 -28 49 119 -33 -120 97
5785 97 121 -123 133 -54 -262 -282 -92 166 -131 51 146 -10 79 -44 -38 -62 -254 164 -19 -13 -91 19 175 -8
5809 -8 162 173 6 -4 -1 195 77 43 16 -14 -149 10 31 95 -103 -70 109 83 117 1 233 -201 -7 68 -142
5834 -142 257 30 -34 -80 -108 154 110 36 4 -120 123 17 241 -118 -71 -99 -211 73 -89 169 62 -4 -135
5857 -135 65 64 23 27 164 359 -134 -33 -16 -14 202 86 227 -287 51 -8 82 244 57 -19 15 84 259 -41
5881 -41 -41 -99 -108 80 -138 67 12 -31 -298 54 -133 172 -100 88 54 -39 -1 -71 122 -158 304 248 -64 65
5905 65 -53 -86 -195 18 -9 13 67 128 -134 -115 159 55 213 225 -174 -38 157 186 13 -58 -211 -143 -2 -9
5929 -9 -16 -95 124 -112 182 -14 106 197 -110 -49 -11 428 52 -268 24 104 156 -108 -183 120 -267 4 -12 35
5953 35 269 107 116 -155 16 37 -49 -26 191 77 -26 -112 228 125 216 -291 -26 -10 87 -7 85 79 14 71 -119
5978 -119 -218 -153 -22 30 48 392 -83 50 86 -207 -40 219 -6 6 -46 38 29 59 27 -171 20 -199 -98 56
6002 56 -125 65 53 -99 -39 137 42 -167 -387 -111 46 -6 -219 -128 190 183 -75 -73 124 -65 9 -173 -17 96
6026 96 -71 -252 -55 116 -240 53 -215 -139 65 351 159 -98 -145 -261 221 91 2 -12 -8 -74 -87 289 -203
6049 -203 276 202 -101 192 -115 153 123 -152 -60 -186 -39 343 -97 -118 115 -164 117 -72 103 -79 -57 -156
6071 -156 -225 44 -79 -73 229 82 -187 -52 20 -62 -7 -18 -53 -54 -217 10 -295 -16 -182 115 -129 -150 75 -120
6095 -120 22 -7 30 -70 223 137 -16 82 -11 -21 -171 100 -83 -183 -149 -187 -236 63 424 248 -190 -53 -51 127
6119 127 -134 173 -95 -1 190 144 -221 -94 69 251 142 223 202 -106 196 -38 112 122 206 -90 14 -142
6141 -142 282 -297 -24 53 -49 -3 -211 -169 231 -70 34 77 -286 240 122 -88 -100 -47 99 55 -102 -163 15
6164 15 146 -8 -133 -102 236 -60 -38 -182 149 88 -5 91 -100 -104 130 272 -105 118 -111 -9 76 -303 203
6187 203 -105 -114 18 -86 303 -143 -159 66 -1 386 230 113 -58 -284 -2 61 110 -171 -84 -41 39 -58 195
6210 195 -446 -165 -199 -57 -44 32 20 52 251 -175 -66 181 153 16 -21 -45 -197 -28 -114 -91 -168 -138 -148 178
6234 178 -127 -167 -250 62 -101 174 -187 69 76 -33 -115 145 49 130 -139 -145 -55 -91 -99 -234 -151 286 -216 28 -159
6259 -159 -56 316 -16 121 36 -16 14 -35 219 -249 -69 -36 -281 -161 2 228 -78 88 -17 68 186 -70
6281 -70 -159 -111 -94 -67 -161 81 -106 -64 -97 -107 -93 77 44 -199 46 206 -20 -201 -223 39 3 114 -1 -142
6305 -142 21 112 204 -68 40 -236 149 257 -56 -259 -92 -64 -92 28 94 102 101 49 -22 138 158 -11 270 70
6329 70 31 7 -176 115 -74 179 97 135 -223 2 -37 73 126 -74 293 90 22 -126 -30 175 -173 145 -329
6352 -329 59 7 -27 -21 -157 66 -103 83 66 -20 -47 257 302 105 -145 20 13 -197 43 -228 -53 -1 19 28 136
6377 136 -11 -227 111 -2 -173 -167 39 -149 30 146 -22 145 219 -108 328 -180 -19 -13 -135 118 174 91
6399 91 17 -98 312 371 -250 288 -240 -117 80 192 87 21 -16 -305 159 350 -102 193 -18 115 269 -9
6421 -9 -36 -204 58 -273 -29 -214 -104 -4 -110 24 22 -28 -57 132 -359 319 191 -192 -13 -7 -318 -74 -16
6444 -16 143 210 -172 -127 -124 42 -61 -23 -2 180 86 -63 248 38 -2 254 185 -33 -25 -176 -94 12 -79 -123 -53
6469 -53 -20 -156 170 -24 23 176 -71 -91 14 426 117 -136 -104 134 -100 223 91 -92 -51 -50 -216 -170 -95
6492 -95 26 -105 -51 44 -107 -73 256 -83 -17 207 203 -63 24 39 -155 12 -100 184 -211 232 -93 -318 -55
6515 -55 -14 -313 -53 -41 117 23 -115 176 -87 245 -39 -87 42 -64 -4 92 45 -175 -55 218 174 -82 3
6538 3 11 13 47 -244 12 38 -14 28 -36 -205 -140 -38 91 -239 -232 -10 142 58 -148 34 29 -144 41 317 155 46
6564 46 68 220 47 117 325 -331 -100 -37 194 -77 93 273 168 27 170 -87 -211 -91 89 -203 38
6585 38 63 132 -12 6 11 -128 -10 -265 -145 -15 -37 88 -71 254 43 110 -232 -124 -177 -15 -191 102 26
6608 26 233 -175 -115 -153 -39 -211 -55 344 42 23 55 -195 4 39 -70 56 87 -117 22 -15 -98 56 -155
6631 -155 101 112 148 -232 293 33 28 42 -25 -41 141 -48 -9 -40 -14 195 -11 105 234 -216 64 45 -96 -82
6655 -82 120 65 -15 -77 -23 33 -140 -24 77 -218 40 -150 -9 -1 4 -200 67 -10 38 33 -160 15 -73 237 70
6680 70 206 -71 65 -63 -113 -201 9 101 -57 -235 122 162 -18 25 -263 141 165 1 202 -39 34 112 -135
6703 -135 20 -217 47 115 -184 33 188 -78 -493 46 -152 -115 -88 -125 60 -17 223 -31 -217 117 -124 -117
6725 -117 186 202 59 72 105 123 232 -152 -307 -9 -116 -266 -108 55 37 -219 65 130 -224 50 173 -71
6747 -71 164 -41 -63 92 15 -305 -210 86 -6 76 -2 46 -68 93 306 64 -80 43 -88 125 73 52 -104
6770 -104 -87 188 139 30 -42 -36 -257 -190 173 -313 -56 -167 -98 -28 -54 -177 -12 153 -52 193 106 -124 104
6793 104 -88 -110 -30 113 -125 -20 -10 -29 -24 34 54 -59 118 -250 55 176 -24 58 291 110 -25 -107 19
6816 19 -210 -137 -293 115 -57 -67 65 -295 -60 228 -25 -139 127 75 -38 -231 100 63 25 -117 -34 0 -75
6839 -75 -46 132 -204 -32 -8 -90 16 204 13 250 70 175 -87 -235 51 41 -69 46 -121 -64 146 -134
6861 -134 -34 -73 165 107 111 116 117 -20 69 -28 125 263 363 71 119 -106 10 119 67 -134 60 108 -57 155
6885 155 61 -139 -99 -37 219 -151 -175 284 26 281 -142 -48 -320 -66 -25 37 94 272 78 14 97 66 19 45
6909 45 134 102 -314 -283 -1 26 -38 -95 6 65 -102 151 -1 -246 101 -42 -83 -64 257 -171 -98 98 -33 -104
6933 -104 -252 -159 145 24 56 -189 -165 -69 -187 333 -142 -153 -58 -201 -60 33 -105 152 -32 -112 -13 -129 -218
6956 -218 -290 158 -44 39 357 41 5 373 -113 -44 5 -6 87 -80 288 -88 -16 226 308 -83 -122 33 -21 91
6980 91 -86 -60 171 180 51 -8 123 11 -164 154 10 214 5 -280 -149 90 -178 16 70 -36 -222 59
7002 59 -172 -27 131 25 122 -125 41 -111 -34 -300 212 124 93 53 81 -44 1 -284 164 77 58 97 -147 -18
7026 -18 -18 11 -49 -59 187 12 -42 20 144 -48 269 -11 -123 287 29 90 -1 218 29 -231 114 -57 10 22
7050 22 -279 98 -91 -158 -87 -40 -122 -7 -62 392 -27 -50 -177 106 -116 -174 -7 -90 64 -77 -189 -6 31
7073 31 -183 -80 -41 -25 112 69 352 -109 2 42 -133 -13 43 106 -108 -176 14 179 28 114 -13 102 10
7096 10 -100 -160 218 -70 137 -355 -61 -109 -3 -229 35 -143 -7 -91 -16 -53 126 -50 -20 -44 -1 102 -165
7119 -165 17 13 118 66 -127 -159 180 206 -141 -112 -138 178 -210 197 -14 95 -60 302 -67 -146 523 -94 -168
7142 -168 6 39 -79 -202 76 60 -209 -325 -19 -33 83 226 83 -76 44 -208 7 170 -35 62 -88
7163 -88 -86 35 43 -57 178 -23 146 93 56 117 101 -300 -299 168 -43 -188 -105 180 89 -9 10 -119 58 202 -130
7188 -130 129 49 73 -179 19 -62 0 -91 -202 25 156 75 95 -46 118 22 58 -144 -301 18 -124 -125 -259 -55
7212 -55 -74 225 81 -267 -81 -49 177 208 265 298 -174 -60 43 62 134 7 16 74 -48 140 -172 -99 27 -231
7236 -231 -84 -186 275 144 66 223 -321 196 123 118 182 -180 -7 -20 287 45 -29 -124 -30 39 -265 -76 -33 -38
7260 -38 -28 -250 80 -25 -38 10 -255 203 -72 164 76 105 225 3 60 -31 -241 -74 34 61 15 280 106
7283 106 147 34 -208 144 29 -218 67 -131 -36 -158 234 88 -31 33 -438 94 -219 202 112 -133 107
7304 107 -58 -186 -55 -276 -259 51 -87 68 -96 -172 100 -15 -240 11 -56 16 -36 100 -163 -13 80 291
7326 291 -105 327 76 209 30 25 26 120 -20 -76 53 159 -106 -113 -78 7 -109 -79 168 83 -113 -8 -89 -83 -96
7351 -96 186 -168 -52 29 276 32 206 53 57 -12 -42 11 -18 -91 129 139 93 -28 -266 24 38 95 204 44
7375 44 7 -29 -31 -175 78 22 -48 -27 -56 11 -30 48 -55 131 97 139 295 -88 -11 -3 178 296 128 -130 -66 -59 -209
7402 -209 -166 75 95 -14 85 219 105 60 -130 141 -115 41 -18 -139 -47 -46 -133 2 -283 50 60 225 36
7425 36 29 -28 223 -93 43 131 -169 -20 -174 107 28 167 -17 -151 -92 1 -74 50 0 -307 80 75 44 200
7449 200 -64 15 -155 -32 -51 135 294 -32 58 60 190 -177 107 -157 222 160 185 -230 8 123 -128 -128 -2
7472 -2 -75 -10 54 -69 -325 171 28 104 124 -64 -17 53 77 -59 278 45 -59 149 99 -27 101 -60 75 -198
7496 -198 -24 151 196 -241 -38 -111 39 -1 -146 -60 -181 -241 316 -13 43 70 -49 40 16 209 -91 -115 -170 -71
7520 -71 344 42 109 -6 50 43 -306 -36 -60 -115 30 127 80 -61 -101 -176 96 -193 -36 18 42 -12 -75 179 -22
7545 -22 109 78 -78 5 -51 129 17 63 -22 63 122 -83 -176 -343 7 106 -170 32 -53 125 -81 173 -126 -137
7569 -137 25 -125 154 -110 -51 48 -268 -18 155 33 73 25 122 7 235 87 -193 92 22 206 221 241 -77
7592 -77 -38 -163 180 -47 -240 0 141 209 69 380 -149 -29 82 119 148 -110 80 144 98 -30 128 339
7614 339 -227 -124 -128 114 81 106 -280 59 110 -146 51 89 -82 -115 29 85 76 67 156 42 31 -158 -166 61 237
7639 237 -153 -387 -108 140 -109 -80 -76 -102 61 207 5 -20 52 -345 184 114 42 -250 -57 -130 62 -71 -272
7662 -272 84 -103 127 103 114 244 164 -186 -96 9 -25 -213 22 -81 12 78 -23 -126 -37 240 89 -91 -159
7685 -159 -41 -164 -55 -215 198 -179 -205 0 -93 78 -138 135 -76 -112 -79 -439 -49 311 215 174 -237 -103
7707 -103 -41 89 35 307 162 21 -63 -261 174 -158 -39 154 -1 -79 44 72 17 39 -29 40 142 33 142
7730 142 -104 139 260 -166 14 -13 -143 -17 -46 187 117 -56 89 -155 -141 43 -213 -160 38 -127 181 3
7752 3 -39 78 -110 63 265 244 -26 109 187 -119 -301 59 -19 92 51 102 74 -142 89 -90 -82 20 104 52
7776 52 152 -108 -118 -152 55 -14 206 132 -78 92 -26 -140 -6 86 12 63 -233 -20 12 -229 -7 131 -55
7799 -55 -154 126 77 -54 251 26 54 179 77 180 70 -127 -203 46 -183 178 19 67 40 80 -94 -157 105
7822 105 -58 280 9 35 -13 5 -170 -144 47 -111 52 -94 12 -130 105 12 240 312 -14 37 -18 56 -22
7845 -22 284 -94 -25 103 24 24 136 339 -49 -3 -252 -130 -55 243 -322 75 209 70 83 81 17 -64 -60 88 -160
7870 -160 101 5 162 -24 -123 148 129 -69 177 -68 36 -84 88 74 -69 113 43 -187 51 -99 -79 -43
7892 -43 -113 -32 -34 -62 -102 -25 -20 171 4 -73 161 -109 102 105 -134 156 -249 75 -61 40 31 -124 -68 176 28
7917 28 211 70 -113 4 7 273 -156 46 -94 137 -60 -23 160 -346 206 256 -155 213 50 -16 24 -12 -41
7940 -41 48 -60 -223 -193 28 37 -76 170 114 -8 -30 57 -19 178 -62 -168 -110 85 -251 -11 -192 109 -15
7963 -15 165 262 252 -135 -7 -305 -48 50 16 164 -189 -28 3 -118 -203 73 -34 133 5 -49 159 -51 121
7986 121 220 -89 -141 268 102 57 180 -205 133 -115 83 195 -134 3 230 5 -47 119 -255 86 105 78
8008 78 -24 -313 -97 24 118 5 147 10 -53 27 -34 144 200 152 -25 159 193 152 -178 398 221 51 -75
8031 -75 349 198 -234 -64 50 260 127 -61 56 -8 34 -157 -47 18 -121 129 -241 109 11 218 -37 236
8053 236 135 21 75 20 -167 154 -78 115 114 -84 0 61 -58 109 47 46 0 202 245 99 -254 -64 82 20
8077 20 222 223 92 -11 20 -205 152 -174 -31 29 87 93 -218 -148 327 -151 61 31 108 -107 -42 -7 102 -18
8101 -18 -263 -210 348 -30 16 -108 -57 212 -139 73 -63 -257 -118 183 -132 -125 11 62 -63 -3 -148 -110 -107 121
8125 121 49 -49 -14 -12 -149 119 46 58 293 77 -180 -68 -230 -47 -58 129 -20 42 -332 -32 -215 -34 -20
8148 -20 110 146 -329 -70 -239 -15 55 14 -66 -206 -84 -167 -223 151 -277 -114 -167 -34 151 -103 -208 -71 -232
8171 -232 131 86 -202 34 -60 116 83 -10 62 102 91 -114 -169 28 123 255 40 -134 -210 -150
8191a50
$$ Imaginary data points
##PAGE= N=2
##DATA TABLE= (X++(I..I)), XYDATA
0 0 0 0 0 0 0 0 0 0 0 0 0 0 0 -7 7 -7 7 -8 14 -14 21 -21 28 -28 35 -42 49 -56 64 -77 85 -98 112 -126 143
35 143 -160 180 -201 227 -252 281 -312 347 -384 424 -470 518 -571 629 -692 763 -840 925 -1021
54 -1021 1128 -1249 1387 -1546 1728 -1944 2203 -2523 2922 -3446 4159 -5193 6837 -9865 17318
69 17318 -78680 -64850 42962 -47905 -13142 39259 20098 418 2719 -10443 22366 4698
81 4698 -28722 114 17414 -8205 549 -9794 -4275 32505 4544 -22652 39251 39053 -9316
94 -9316 10862 27524 8556 632 -25256 -15927 22058 -14959 -40822 16870 18349 -23171 -5781
107 -5781 6206 -1510 7072 -12712 -14939 20495 -2437 -36718 -8016 3779 -13052 -14936 -17173
120 -17173 5110 25010 -11279 -9095 42609 19057 -22480 7362 21216 -1515 -4181 -2367 4536
133 4536 16629 -4324 -13440 14235 14737 -3697 316 9120 15455 7756 -15999 -6436 15880 -11545
147 -11545 -32794 -4491 6184 -13017 -16830 -2307 12022 3623 -16410 -2270 18287 -3079
159 -3079 -16639 2471 6872 -3348 -6408 -7757 1006 8962 -7161 -8905 17279 19454 -1248 384
173 384 15884 14251 -2785 -10229 5241 11579 -9759 -14243 8399 10226 -8017 -7938 6083 8744
187 8744 -440 -6832 647 9457 -1371 -14489 -6497 2177 -7416 -17605 -9207 5755 3362 -9144
201 -9144 -2115 15283 8561 -7725 -460 12828 4376 -7725 -3260 7571 5289 -6386 -5087 8372
215 8372 9162 -2309 266 11828 12788 3031 -2704 3219 8370 -4236 -15672 -3066 5678 -8322
229 -8322 -13110 1657 6791 -2496 -7542 25 8363 605 -9629 -1472 6490 -3503 -10982 -4629 991
244 991 -1408 -6854 -4299 8111 9884 -1081 1138 12829 8842 -2571 -2563 5347 5290 -5551 -7431
259 -7431 4659 6035 -5282 -4220 5937 6367 -60 -1795 3856 7502 -236 -8663 -2194 2398 -7245
274 -7245 -11841 -4802 1584 -1114 -6557 -1018 8870 3850 -5946 923 7987 138 -5866 -1220 2860
289 2860 197 -5051 -4205 4284 4707 -1879 878 8943 8735 1985 349 5266 6138 -2905 -6787 754
305 754 2266 -5477 -6579 1864 3898 -1780 -3816 2277 5782 -730 -4358 937 2373 -3215 -7190
320 -7190 -4274 -809 -2295 -7008 -3315 4661 3004 -1958 1575 7794 4550 -2165 -522 4396 2401
335 2401 -4518 -3427 3238 1618 -3686 -1505 4576 4136 684 767 5357 5468 254 -2904 -479 1076
351 1076 -4306 -7488 -3010 1023 -2676 -5068 243 4268 15 -3212 1832 4403 -367 -4355 -1458
366 -1458 1143 -2635 -5460 -2558 1103 299 -1309 957 5186 5476 2011 1442 4655 4336 -1269 -2988
382 -2988 1384 1463 -3785 -3837 1401 2301 -2093 -1227 3356 4033 438 -1055 1889 2016 -2193 -4811 -2435
399 -2435 -1475 -3221 -4911 -2160 1574 917 -1592 1054 4924 2463 -1437 551 2851 -68 -3625 -2233
415 -2233 793 -972 -3314 -853 2550 2291 747 2198 3933 4436 844 -578 1271 865 -3070 -3947
431 -3947 -976 -130 -2328 -2802 385 2501 151 -1456 2062 3038 -869 -2165 -445 -686 -2931 -4323
447 -4323 -2725 -684 -1074 -1915 513 2988 2305 759 1921 3221 2139 -375 -848 1064 186 -2684
463 -2684 -1896 758 760 -430 526 2852 3076 1230 972 2252 1782 -1207 -2256 -1095 -1156 -2977 -3793 -1475
481 -1475 609 -919 -1243 1112 2172 461 -153 1068 849 -482 -1929 -1734 -868 -1673 -2358 -1143 966
498 966 1245 963 1958 3208 3009 1404 892 1903 782 -1363 -1728 -223 -274 -1657 -1209 414 828 218
516 218 819 1983 1817 684 -307 -143 -638 -1936 -3128 -2606 -1477 -1664 -1800 -692 1639 1126 83 1666
534 1666 2506 917 -193 394 407 -434 -1711 -1172 -76 -300 -613 1072 2075 2046 2361 1851 1623 1828 373
553 373 -1134 -503 -450 -1992 -2154 -1152 -738 -451 -673 506 1572 394 178 1333 911 -938 -595 -992
571 -992 -1899 -1528 -1553 -1340 -233 201 656 1536 1771 1817 1897 1042 923 1312 -406 -1100 34 -306 -1666 -750
591 -750 114 317 485 858 1597 1779 656 299 984 -830 -1377 -948 -2096 -2170 -746 -1303 -1184 263 444
610 444 -366 620 1110 562 375 -274 -6 -265 -1771 -1193 -339 -1173 -623 853 1184 855 2179 1823 1398
629 1398 1269 1032 113 -245 -485 -689 -933 -1283 -563 -67 -1133 183 1559 484 306 1551 624 -263
647 -263 -292 -158 -1281 -1586 -1389 -777 -800 -871 121 824 399 1127 1813 547 437 911 -18 -755 -93 -439 -1037
668 -1037 -632 -34 389 -51 873 1689 1263 1187 1236 948 24 -564 -233 -1033 -1779 -798 -852 -1183 -216 302 394
689 394 160 755 711 138 -3 289 -546 -1308 -1071 -520 -1168 -646 325 393 340 1087 1227 1073 812 1042 526
710 526 -357 -114 34 -706 -1032 -691 -224 -721 21 1196 500 412 1062 1007 57 -158 -239 -716 -1540 -1142 -948
731 -948 -1055 -704 155 10 94 870 871 392 291 686 329 -634 -589 -255 -1032 -946 -407 7 163 667 944 950 1127
754 1127 974 826 166 -61 -199 -337 -953 -710 -486 -736 -304 222 138 213 728 632 417 155 -208 -296 -727
775 -727 -1196 -912 -789 -720 -234 -187 29 747 674 743 478 810 432 216 12 -264 -497 -778 -496 -308 169 363
797 363 1011 858 851 788 1030 191 -5 -284 -564 -655 -788 -716 -674 -595 -378 -94 198 158 335 466 207 354 -36
820 -36 -225 -478 -720 -1350 -693 -610 -357 58 610 697 701 841 714 736 385 47 263 42 -588 -135 -225 -374 -261
843 -261 -130 283 564 542 580 642 308 29 -393 -482 -749 -734 -806 -915 -531 -151 129 259 446 257 473 528 742
866 742 448 230 -62 -387 -480 -326 -174 -131 163 321 542 640 1016 791 249 689 19 -120 -534 -319 -531
887 -531 -428 -570 -317 -245 130 188 325 475 351 267 -158 -254 -520 -891 -973 -551 -372 -283 -6 75 457 553 552 826
911 826 317 471 -78 95 -28 -238 -548 -388 -437 -257 149 462 355 586 539 638 363 77 -219 -431 -416 -496
933 -496 -613 -513 -379 -549 -373 281 165 319 228 306 433 75 -203 -243 -331 -787 -446 -193 -217 -33 341 348 586
956 586 881 617 340 451 275 140 -429 -258 -257 -639 -381 84 -41 3 58 477 385 606 280 201 -9 -325
978 -325 -466 -819 -496 -530 -550 -332 4 200 110 472 616 322 59 308 212 -235 -573 -556 -357 -402 -398 95 97 327
1002 327 963 496 499 506 241 -189 -117 -108 -513 -533 -231 -295 -357 -208 217 451 399 65 247 478 -131 91 -292 -368
1026 -368 -652 -697 -274 -240 -15 233 35 494 592 467 423 333 214 53 -56 -56 -107 -382 -592 75 -135 130 296
1049 296 490 385 325 243 509 236 -80 -291 -476 -636 -656 -435 -140 -157 -97 219 385 490 562 227 -49 115
1071 115 -203 -473 -317 -299 -392 -63 -288 395 400 318 552 572 793 212 85 286 169 -376 -240 -396 -87 -328
1093 -328 -311 140 440 353 208 319 178 226 -5 -370 -198 -361 -577 -478 -270 -136 -165 130 311 292 607 237
1115 237 138 415 -15 -230 -135 -253 -168 -332 -5 -93 128 8 389 483 485 561 278 174 -44 -315 -188 -488 -363
1138 -363 -196 -526 -12 -49 -236 226 249 286 361 -31 26 81 -173 -514 -428 -531 -292 -141 118 169 330 206 343
1161 343 493 283 -11 289 -37 -141 -232 -37 -68 -125 -12 107 230 31 371 205 378 49 262 -80 -520
1182 -520 -138 -434 -311 -428 -432 -208 -293 231 195 218 432 431 99 122 -176 -125 -280 -455 -175 -206 -29 103 241
1205 241 194 479 676 538 119 289 -61 -218 -80 -310 -249 -381 -112 85 183 209 168 355 130 351 373 -48
1227 -48 -361 -652 -392 -198 -521 -284 -59 -311 -87 181 196 102 252 385 360 115 -36 -166 -27 -255 -269 -182
1249 -182 -347 73 236 169 599 472 298 539 196 254 -5 -216 -523 -590 -283 -189 -198 -116 179 313 135 328
1271 328 -92 271 173 48 9 -411 -283 -240 -217 -264 -93 223 385 196 453 266 191 -54 295 40 -203 -35
1293 -35 -276 -591 108 -124 147 276 471 239 71 265 230 406 -223 -48 -86 -344 -361 -298 -180 92 -69 255
1315 255 308 241 375 6 12 256 -159 -186 -131 -215 13 -517 -207 -5 -200 85 200 636 292 219 70 236 -249
1338 -249 70 -89 -42 -492 -344 -124 120 -255 83 313 112 203 76 -42 -187 -122 -259 -513 -175 -372 -541
1359 -541 -86 2 243 169 492 411 229 50 250 231 27 -396 -421 -183 -154 140 -132 98 135 328 575 423
1381 423 418 182 -1 56 -110 -85 -368 -54 -143 10 -219 56 92 306 535 -16 76 113 -58 -261 -248 -408 -315
1404 -315 -92 -318 -29 61 12 449 585 292 333 54 -26 31 59 -477 -356 51 -187 -283 -270 -94 -2 504 154
1427 154 141 64 219 49 -88 -268 -497 -65 -61 -359 -285 -180 278 254 190 288 245 342 46 -75 -7 -131 -228 -198
1451 -198 -226 27 71 -125 253 272 415 430 125 -1 203 -14 -14 -291 -126 -175 -229 -414 -68 -88 -36 376 137
1474 137 441 210 -69 96 122 -276 -457 -146 -291 -237 -158 -78 7 189 41 227 352 192 355 244 -27 -279
1496 -279 -229 -44 -61 -164 81 330 -88 -30 274 294 183 68 -100 -38 166 -449 -382 -193 -229 -160 1 198 -22
1519 -22 -101 253 194 298 -73 131 -139 -422 -298 -103 -131 -122 -222 54 -40 262 1 305 250 -48 123 70 -108
1542 -108 -60 -241 -280 -157 -26 36 101 253 80 325 293 244 -85 -182 -150 -121 3 -444 -495 -208 -201 43 136 260
1566 260 426 340 137 35 319 5 -22 32 -205 -226 -204 -133 -149 -87 -132 84 106 330 122 201 482 312 -226 -254
1590 -254 -28 -198 -329 -384 -42 91 131 384 174 100 198 45 208 -18 184 -210 -171 -243 -189 46 -120 43
1612 43 149 159 83 391 305 90 147 117 -25 -170 -144 162 -116 -367 -114 77 116 -152 511 300 122 155 9
1635 9 31 -125 -226 -480 -24 -276 -254 23 116 -23 -31 139 213 228 97 68 -198 -151 -261 -334 -196 37 -16 -52 156
1660 156 213 11 99 108 264 238 -232 -156 -154 81 -165 -122 -111 222 -139 -43 80 130 316 139 315 281 108 -106
1684 -106 -35 -167 19 -325 -28 159 -14 -72 205 146 356 102 -58 -72 -175 -223 18 -52 -300 92 0 -105
1706 -105 -12 162 238 208 95 57 15 187 206 -157 -350 -85 -99 -60 -453 -91 56 205 78 59 -23 307 -169
1729 -169 73 -60 -42 -204 -197 -190 79 -270 186 81 -41 31 168 -2 27 -241 -201 149 -16 41 -111 147 -154
1752 -154 -133 -45 119 271 -247 264 241 -13 -56 -259 -166 22 -189 -231 -49 86 -363 -138 64 430 73 118
1774 118 146 267 -108 -95 -308 -2 -276 -244 -288 62 103 -203 299 404 -84 -75 297 274 109 -404 -487 89 10
1797 10 -18 -93 -101 54 -63 9 450 272 -76 246 -44 101 -417 -81 -52 102 -31 -160 18 226 -43 174
1819 174 -12 122 212 -223 202 129 -108 -453 -297 -158 -122 -114 168 103 186 153 316 232 152 60 -109 -213 35 -133
1843 -133 -517 216 76 -441 -25 405 195 116 48 -18 101 22 -83 -22 97 -206 -297 -296 412 -217 -34 325 357
1866 357 33 -123 348 118 82 -59 -209 159 -110 -11 -6 -215 -46 -100 -50 325 402 120 14 -75 4 -73 -63 -167
1890 -167 -206 -325 187 -54 16 -106 -373 104 409 -17 -98 291 232 185 -265 -376 -12 12 -94 -83 153 147 -4
1913 -4 168 167 -91 -65 97 108 -181 -229 -216 -48 -332 -253 -96 158 303 103 202 231 283 -49 42 176 -58 -86 24
1938 24 -145 100 -240 -76 -24 224 412 -13 -26 321 115 -299 106 -33 -216 108 -141 224 108 -160 -69
1959 -69 363 51 165 184 101 184 -118 -113 57 -207 -258 210 150 154 204 158 311 168 28 -90 144 -52 -274 -256
1983 -256 31 136 51 -140 -98 -30 -139 131 208 234 12 -24 -90 116 30 111 -87 60 -93 -414 7 -158 23
2006 23 -85 199 189 77 -97 -341 21 -46 -119 -407 -65 124 177 -158 136 539 213 201 81 282 -89 55
2028 55 257 220 -8 -155 -193 -192 71 54 371 285 277 55 -3 298 28 -111 49 -274 -32 -230 -373 78 -64
2051 -64 -42 -52 -111 -14 31 35 59 67 -191 -50 -78 -93 -217 33 116 -161 -52 -47 166 108 51 209 163 98 95 -2 40 79
2079 79 -264 -59 169 172 -199 -172 -28 236 36 -29 -233 31 -19 41 51 68 -248 367 -168 50 179 38 33 100
2103 100 146 -4 144 96 1 -388 -46 -221 284 -29 -161 221 288 58 -47 -6 1 -55 289 -74 -1 -79 -120 -65
2127 -65 -47 -61 -172 5 274 219 131 271 254 -90 -89 39 170 138 -299 -60 -105 74 127 -11 122 -23 -123 -10
2151 -10 134 173 22 -92 43 -214 -193 144 255 459 -143 74 190 223 67 -151 137 219 -299 -65 61 -173
2173 -173 247 -46 33 -47 -62 10 -204 83 14 108 -60 -100 -82 -55 0 9 74 -31 -133 318 217 -137 127 246
2197 246 17 70 137 0 -1 32 -237 -125 163 -94 -142 35 130 52 184 83 154 -75 -170 -39 211 -106 -283
2220 -283 61 22 47 -61 -329 190 -69 11 106 139 7 104 -15 -116 -213 -87 13 62 77 -163 -8 -243 87
2243 87 199 -120 -145 231 -159 -348 -93 -93 196 -104 3 -245 -1 -55 -140 34 19 -12 -119 192 -164 -77 28
2266 28 -198 148 -12 -48 -98 43 251 57 -100 -140 -186 167 4 238 -199 -267 -31 133 -105 144 199 184 64
2289 64 260 131 -58 -148 -82 -95 -460 29 -134 -294 -8 78 -37 -156 -29 -277 203 -149 117 19 102 -45
2311 -45 15 131 -227 61 92 -222 -216 278 37 129 176 51 265 -32 -165 64 -71 273 -156 -69 -21 393 219
2334 219 18 -63 60 -133 -108 14 -106 -71 -77 136 52 -345 153 -14 132 80 -113 -16 76 19 -30 191 65 -118
2358 -118 -134 8 -150 138 -129 113 -137 -121 129 71 36 153 118 58 90 -45 -5 7 46 140 30 4 -80 -214
2382 -214 230 223 63 -224 38 -15 -21 -37 -172 151 -59 33 15 67 -26 -125 105 184 -40 -69 42 23 138 -26 107
2407 107 207 65 77 -290 163 118 101 140 -184 -264 -143 149 -78 -165 -121 49 191 -197 -274 -115 -22 165 133
2430 133 -9 3 -219 -183 34 39 -282 -47 31 -57 86 -5 -122 3 -197 47 185 238 129 -118 -21 -108 -162 -107
2454 -107 97 -198 -25 219 -90 -68 77 49 -127 -28 -30 79 -322 -132 125 -119 173 -12 -165 -145 -95 -41 -118
2477 -118 24 181 -96 -67 54 -201 140 -2 62 -93 9 -89 188 66 -31 -113 -3 186 -76 183 -217 -273
2499 -273 -111 -163 110 -46 -151 -74 -104 -184 2 160 -54 70 -137 29 131 -185 -100 -126 131 31 -220 21
2521 21 44 215 78 99 -48 77 87 84 -23 -37 174 63 70 -18 28 -43 -59 -90 -68 7 91 158 238 -14 90 -96
2547 -96 10 -10 -85 -195 50 150 -31 -235 109 -47 93 -86 105 258 -305 47 55 284 -79 -69 167 125
2569 125 -230 -189 159 -41 -62 144 271 -322 35 -66 -142 -133 168 -14 -19 -138 174 150 16 -16 245 39 -40
2592 -40 -106 53 -46 -26 231 -257 0 32 214 -139 -7 0 36 130 90 -62 -155 -7 -132 41 74 -92 -43 159
2616 159 -97 -216 -8 267 -5 -72 212 19 46 239 -35 119 135 4 -17 -60 91 -135 10 112 50 -72
2638 -72 -101 11 153 -215 184 -188 -65 -207 84 -180 -221 -27 122 265 31 -77 16 282 2 -155 -75 134
2660 134 -154 -72 -259 -21 125 32 80 29 -68 130 68 334 -59 -107 -19 -135 101 -142 154 56 -94 164 23
2683 23 -108 58 -85 -37 -263 -45 -155 7 -222 0 144 31 80 149 74 117 -6 -129 -161 7 -77 -79 8 25
2707 25 109 -244 -406 -71 8 2 254 249 59 54 266 251 60 -70 -128 -302 -8 -98 -130 202 128 192 66 165 131 51
2733 51 10 200 96 -184 -91 93 94 34 -26 -68 22 85 -15 68 93 -87 103 -247 -35 -98 -239 196 -98 -231
2757 -231 240 96 33 -133 -4 -272 -109 42 -93 53 -56 161 8 92 -138 201 31 -179 57 158 7
2778 7 -169 45 -84 9 -208 -20 -57 -54 -3 -153 96 134 -87 189 17 -131 -208 91 156 260 172 186 141 19
2802 19 171 141 -351 -119 76 28 -205 330 -122 -291 -38 177 210 -2 106 77 -1 56 -74 325 213 191 174
2825 174 -208 -28 18 37 -33 172 9 -90 24 -6 -57 -17 -54 -190 185 11 -75 -82 -249 -146 185 -250 -57 -61
2849 -61 107 271 -84 227 104 179 -73 75 -61 -148 -228 113 -50 121 90 176 202 275 153 144 70 172 179 100 131
2874 131 -66 163 -58 2 -47 26 -163 67 21 -222 -88 -70 -62 -2 -87 69 -56 111 157 -35 -150 -166 -107 60
2898 60 -201 68 48 38 177 -50 4 87 170 11 -88 -238 84 -76 122 -107 405 178 84 -178 119 -40 -71
2921 -71 -66 145 80 -336 -38 -332 -191 -37 56 -33 -290 -133 -25 -129 105 -13 29 48 68 -282 -207 8 48 -38
2945 -38 118 -73 108 47 59 -218 -190 -56 81 80 119 -169 74 -99 -223 122 -244 3 65 138 51 39 91 -168
2969 -168 -74 -63 -24 -277 -5 -40 -63 17 -162 12 21 -50 -112 -69 233 61 66 1 -293 -148 42 -100 14 -7 57
2994 57 -38 74 114 -210 44 93 -174 169 -113 -135 70 87 68 -19 168 -258 -109 -37 5 -78 -111 167 39 -64
3018 -64 -48 -74 -128 -3 20 -90 -55 -37 -263 238 119 419 -147 -81 302 119 -41 -56 148 28 27 -133 31 98
3042 98 23 22 -183 -6 115 -189 -144 3 68 -246 38 219 37 -83 258 29 116 -159 -163 -148 -34 53 212 -222
3066 -222 -79 66 -92 -44 221 68 -290 -86 12 -42 84 3 38 -139 -57 -161 -126 180 125 -220 67 14 -139
3089 -139 -13 -22 -21 21 178 16 -172 -59 -82 -82 51 -61 -129 115 -142 67 -88 -164 -37 -269 -178 91 103 -107
3113 -107 40 116 -71 -35 -203 -13 96 43 -192 -35 -103 190 -95 -71 26 -100 -49 -226 -6 8 -78 -31 0 -1
3137 -1 106 -3 -18 -156 13 20 -206 -204 82 -115 -278 164 264 -212 -32 93 48 195 12 -2 151 -62 -54 -30
3161 -30 -160 -153 -161 -63 -43 183 241 83 298 -150 -196 81 54 -198 22 103 219 -122 -40 40 66 255 49 -58 -250
3186 -250 52 118 69 163 66 -43 32 -112 -208 56 266 203 -202 -147 74 -21 -18 258 30 -68 102 -132 -260 -17
3210 -17 -11 17 126 -264 -16 -48 200 -23 -31 147 -39 16 -27 -352 42 57 70 74 188 116 -119 5 -108 63 -219
3235 -219 24 156 27 186 44 115 73 139 68 -128 -69 -66 106 -173 -167 5 -71 -56 167 -51 155 114 31 -119
3259 -119 33 -42 296 -30 103 49 36 154 376 108 -71 5 58 -173 142 -1 -121 -29 70 -11 27 33 32 5 -415
3284 -415 -20 55 118 -223 -30 -177 -79 -32 71 -23 -236 -65 185 43 -99 102 -100 -35 52 62 95 148 -2
3307 -2 104 130 -176 7 -253 271 -6 90 65 -44 172 -166 -99 97 -83 -71 0 -100 -156 171 -110 181 -184
3330 -184 -176 68 74 -39 8 120 -90 -24 15 -144 -219 -43 -164 119 -345 140 39 -51 38 89 -117 -120 -40 -1 289
3355 289 -13 151 -143 38 -125 80 15 222 -131 -132 -177 -35 315 -13 212 138 148 -32 -192 -11 -191 46
3377 46 -126 50 207 51 -47 1 104 -96 -184 -86 -27 -368 -202 -8 61 34 -157 -122 -60 81 188 82 -132
3400 -132 -55 -165 165 -55 -52 61 166 -12 -71 210 -132 154 260 -39 20 98 107 128 -75 -87 90 -83 -402
3423 -402 -145 -66 -67 -12 7 89 -12 -64 -126 -106 -104 -55 -116 3 -17 -208 164 -80 -253 -22 64 -6 -35 -164 43 -64
3449 -64 103 -191 109 -213 72 2 104 -36 17 80 -31 47 -228 30 218 124 122 -40 77 166 -120 -2 56
3472 56 -108 -67 86 -354 242 90 71 103 -51 -38 -86 244 55 109 -128 -119 -93 176 -77 -278 -64 -191 229
3495 229 6 108 -198 -230 -47 -216 126 -126 -35 -86 193 -221 -101 -109 -1 55 15 65 304 53 -139 -147 207
3518 207 -60 255 -168 74 -247 -80 -9 -231 111 -35 112 -7 217 -221 -19 245 198 -28 285 -203 -39
3539 -39 222 98 -19 -148 125 -168 -12 132 133 69 -178 -121 -142 -81 -230 -323 186 154 11 -119 20 -53 -6 25
3563 25 113 128 -150 109 236 98 88 103 -38 206 77 92 23 51 -110 -113 -228 24 -74 108 -11 13 -65 -20 45
3588 45 -63 137 -216 -75 -66 -66 -21 -35 56 67 -314 -45 165 -185 361 165 6 197 -138 -55 221 -12 -66 -84
3612 -84 100 122 -30 -445 20 -70 74 214 33 25 144 120 19 123 -107 169 -9 179 403 159 185 369
3634 369 236 173 305 43 -113 -181 59 207 -13 -126 361 83 -157 209 -97 59 215 -230 306 169 -65
3655 -65 151 -156 -28 -120 30 -177 3 -39 -81 -299 -18 -240 -102 -108 296 -180 -62 -80 100 -83 -29 87 -260
3678 -260 -132 -21 -31 -219 -66 -47 -452 -192 -93 -97 173 -106 -9 -12 193 25 10 -1 -121 29 214 152 85 70
3702 70 145 -139 -5 80 161 173 -21 247 42 -119 56 -72 1 17 -3 -10 55 274 85 132 276 -56 -253 -124
3726 -124 -132 41 12 147 -44 -74 83 -86 102 -54 63 -98 -242 132 96 -37 -17 74 149 -119 -81 282 -168
3749 -168 279 29 -115 171 164 -27 132 154 -97 320 -182 199 28 45 36 -82 -7 239 98 -461 -66 202
3771 202 15 175 118 14 -20 213 80 258 97 -229 -192 -35 127 156 232 -61 -71 -162 -36 117 119 121 -113 -52
3795 -52 -45 51 -109 133 6 24 141 -7 -397 113 -211 -143 215 -109 -10 57 -67 -224 -31 -60 303 19 66
3818 66 198 105 -18 -10 -177 21 -159 -116 18 5 -116 -55 140 -176 -34 -191 124 143 -79 -28 66 -23 33 -230
3842 -230 -123 -2 -270 87 38 127 -77 33 197 7 -37 -36 122 40 13 101 111 40 -106 83 36 -211 -109 61
3866 61 94 44 -3 40 116 105 77 -163 -186 115 -80 -235 -13 -100 12 -183 192 -123 99 -198 -24 -102 45 -91
3890 -91 -135 -145 5 -6 -88 184 -48 -254 19 -67 71 -41 -119 -163 149 -135 -93 90 13 38 26 -89 -139 124
3914 124 -44 -198 51 -23 78 -118 -35 -49 -84 -230 -50 -40 114 -100 244 -26 -137 418 59 -76 235 82
3936 82 -44 -131 -44 16 73 35 139 -9 -127 -108 -16 -79 193 6 -196 -14 -315 -90 134 -156 -69 -242 33
3959 33 8 -24 -155 35 -78 42 -42 60 -166 63 151 -6 26 -223 -192 27 132 206 -66 39 37 -140 2
3982 2 -149 115 24 -43 -228 122 55 161 -32 -183 163 -75 -21 -217 115 -47 -21 138 -198 -111 -184 40 -78
4005 -78 -157 -3 -107 -158 137 74 -157 -173 -117 -104 -16 310 47 -48 85 -18 -45 87 17 129 44 260 -106 24
4029 24 104 -25 -12 -1 65 38 -221 -111 -65 -100 27 0 -45 42 -165 32 173 1 -2 -76 -173 -144 -313 183 156 -71
4055 -71 181 -13 -43 206 -70 -19 -27 -182 -86 135 128 2 -129 -90 86 59 -37 -30 0 120 65 -220 -79 71 151
4080 151 -298 -128 108 -247 -12 -33 -36 85 -118 144 280 59 -40 -89 -124 225 -12 -19 -34 167 65 195 -183
4103 -183 -65 -101 -57 -74 -82 -417 288 65 -233 -249 -29 -17 142 -85 42 356 53 152 -41 -42 -134 72 97 53
4127 53 105 -109 19 -352 -103 183 33 -246 -20 -91 41 28 -8 -154 49 16 -93 -155 -56 -132 208 -223 -120
4150 -120 -61 117 -154 57 -153 -252 212 25 213 -84 99 -74 -96 163 23 -5 -114 -31 310 -147 88 -24
4172 -24 -259 182 273 300 -162 108 -75 133 109 -37 -99 44 -9 4 -27 -9 176 -138 73 176 357 201 -13
4195 -13 -69 77 240 -114 -15 -20 -158 -217 -7 8 -42 -188 109 77 1 223 106 140 143 12 -201 254 -126 -38 -129
4220 -129 245 -151 24 185 7 -44 -111 -185 -76 35 -7 0 -112 133 134 -256 7 -79 -5 -245 52 -79 -22 -9
4244 -9 -54 100 -171 -81 -214 144 -33 -169 -26 -53 232 150 50 8 -205 -304 -121 -211 118 125 3 116 112 150 42
4269 42 122 223 132 10 206 -42 -133 14 127 122 40 -108 -53 -205 -84 40 212 202 -284 138 -91 2 -32 255
4293 255 51 112 -197 31 67 178 -82 22 -205 203 -136 -2 11 -311 55 -68 138 -99 8 100 -18
4314 -18 -180 -124 46 63 110 -97 30 36 -374 124 143 117 -192 67 212 -151 35 74 217 232 66 153 30 -110
4338 -110 -128 97 -21 110 150 82 8 -22 -71 -139 -23 -95 156 -23 94 -98 4 212 -136 151 144 75 110 -109
4362 -109 -178 52 23 150 70 -94 241 56 7 31 -117 -13 -100 -120 -85 92 40 47 -3 -207 -380 -95 55 -209
4386 -209 -192 -43 39 41 -98 -35 -199 -143 48 99 -101 -54 35 -135 9 -202 16 58 58 96 69 -84 136 134 -253
4411 -253 -180 6 -115 -213 68 -13 -173 -248 26 3 71 -137 279 -81 130 -58 -224 41 60 261 -63 200
4433 200 -31 -96 223 106 -71 81 -90 -37 -50 191 9 110 -117 -132 121 -28 -75 75 41 -133 109 137
4455 137 -64 -40 -71 20 259 383 -52 103 23 -52 88 36 -182 104 27 -233 -85 11 -240 73 64 -31 -103 271
4479 271 152 63 132 -120 -36 -105 -52 -38 175 -12 -223 20 221 -26 95 141 -30 -28 71 -153 2 -269 29
4502 29 172 -173 3 102 -45 -117 -112 -137 183 9 -82 -160 -184 -26 -6 -126 157 -43 123 -134 -12 27 139 -254
4526 -254 -49 -97 119 60 -122 230 -70 -102 63 -41 69 -157 -4 -67 33 222 21 16 188 35 -72 120
4548 120 -32 39 -33 58 -82 -105 11 -3 -167 261 -77 -72 57 105 341 14 -127 -17 -121 -52 191 -87 172
4571 172 -72 18 -162 -65 -50 23 65 -27 -91 136 -172 -185 -176 113 -147 278 296 -269 -66 -3 93 -107 -112 -62 258
4596 258 119 -159 -146 78 131 148 76 -155 -175 -147 44 -78 -105 42 -276 -192 39 -83 64 -173 356 325 -191
4619 -191 -66 57 55 -99 -135 4 -175 10 -318 -72 -114 -91 105 -179 31 -16 -98 91 123 -57 -218 -208 -89
4642 -89 15 6 66 0 -179 -6 -37 -63 -53 34 35 29 51 116 171 201 115 74 122 -6 -41 13 -31 -217 159 -46 -110 136
4670 136 316 221 -56 37 -52 -212 167 -120 100 13 -48 -86 194 -9 150 41 -52 -225 59 43 -220 103 -150
4693 -150 -174 198 118 -382 -65 110 225 178 -105 72 -21 296 -117 355 -192 208 -87 -7 303 -27 -180 -58
4715 -58 -199 59 162 -90 200 -24 -34 45 25 -1 285 111 346 -221 -91 -14 -121 -137 -171 117 216 23 -52
4738 -52 87 -113 -176 225 217 -219 67 -36 -13 -110 64 35 87 80 -159 -26 85 -192 -96 -124 -92 -235 -58 -205
4762 -205 127 167 162 -46 -231 37 -77 94 84 229 127 40 -263 41 -165 -88 -350 59 51 -138 -42 -211 -18
4785 -18 22 -66 -113 262 211 107 175 322 -44 8 60 -82 9 -155 0 37 -137 153 -63 -38 29 76 43 -23 150
4810 150 -38 -95 -225 90 -31 87 -71 31 -46 15 -33 -84 139 -48 -197 159 132 28 16 -66 134 -58 13
4833 13 -201 -45 -32 -306 -45 64 119 124 32 -18 0 -54 -90 72 144 121 -118 114 -352 -196 -73 37 -67 12
4857 12 83 -102 32 -162 -46 -133 4 -188 205 -178 33 -302 -123 -194 -175 233 -3 289 194 -207 110 56
4879 56 -89 194 98 130 395 145 -222 -19 -45 4 31 253 172 -24 90 64 75 60 -283 -8 -372 -81 -363
4902 -363 -40 -15 203 -157 133 136 131 -144 -75 -210 161 -232 -58 146 -42 124 207 43 126 -159 -97 -44 99
4925 99 -44 72 -108 -41 141 -38 142 -47 16 56 -125 -141 -84 28 142 195 11 61 90 -157 -90 193 278 186
4949 186 -149 228 -41 -3 -285 -20 -82 -285 -54 -184 72 77 -72 -105 106 63 85 103 40 165 -76 -5 -66 207
4973 207 96 -181 21 -120 8 -38 190 -14 62 -118 4 -8 -11 14 -24 12 -104 -10 69 -265 98 7 -122 -152
4997 -152 12 -21 -16 148 151 166 -150 -133 198 168 -127 241 -31 175 -1 35 -27 -123 -60 -144 59 -230 -157 27 59
5022 59 39 99 200 -214 151 158 -28 -183 46 -56 48 -29 -5 48 -215 176 -55 -115 -26 42 -18 -171 -45 -195
5046 -195 126 9 -320 17 30 -91 -289 -37 -294 -216 -138 11 75 -27 288 60 -134 -130 55 14 -177 -102 -43
5069 -43 -26 243 -181 139 -13 -309 84 36 32 -31 -18 -171 179 147 -50 -90 -8 84 -9 -75 -113 -212 -129 -83 18 121
5095 121 141 66 -40 157 55 -297 77 -89 -131 -13 8 117 43 -372 251 -178 -2 -279 240 163 112 10
5117 10 145 249 -1 -208 -44 -144 -109 -18 -127 334 71 -128 -193 -7 -25 62 60 -60 69 -141 153 85 -108
5140 -108 154 -21 108 113 -72 -193 -181 -30 103 69 -43 98 45 -221 -99 -21 -122 -154 41 -136 -104 188 -329
5163 -329 -12 -139 34 134 113 50 -255 -321 212 115 9 261 8 108 196 56 83 -25 -143 -85 -148 112 79
5186 79 -165 263 136 -38 -187 107 -296 -121 158 -39 102 182 -245 101 84 -44 -149 61 -46 -171 30
5207 30 -199 -73 17 43 22 -77 -233 -105 11 -32 244 -75 -183 -43 -71 24 91 205 -117 -135 -57 62 -124 -55
5231 -55 155 -13 8 16 178 -66 15 -5 -44 15 90 -30 131 228 -68 -166 -228 27 -178 103 -6 38 -57 -13 -9 4
5257 4 106 -29 -164 -42 -84 -189 -98 -236 -53 99 152 -11 -167 -57 -17 114 121 -76 111 136 -251 37 44 52
5281 52 178 89 -180 -233 69 117 124 44 163 -10 166 151 226 15 -83 -233 201 73 -56 293 99 -98 -257
5304 -257 -158 58 -200 -88 120 -4 111 -421 -72 -285 -164 -78 87 5 -148 63 162 -14 -118 0 -57 208
5326 208 -58 210 10 -66 -57 -59 -324 -114 176 -199 155 15 191 -86 140 -39 -219 -113 121 274 -179 -61
5348 -61 24 107 -93 -31 233 175 61 -206 61 121 -57 -49 -15 -93 216 -110 -193 -47 -182 -53 -239 -16 34 142
5372 142 -98 -210 -129 83 -88 258 168 -224 141 37 67 163 43 -135 -60 109 139 52 -161 20 111 58 -310
5395 -310 -122 33 -5 201 -107 -309 -154 -174 8 32 -38 -35 43 208 81 -47 -2 103 50 -31 -102 -83 -100 -242
5419 -242 179 -7 -141 120 152 -6 -151 -60 278 -5 -141 215 56 -341 -53 191 167 -16 137 -315 -81
5440 -81 -71 -10 -4 117 41 183 -137 157 -3 -38 -58 150 101 116 -156 -200 223 39 86 26 -6 50 -12 104 132 320
5466 320 23 -355 -22 69 39 -32 106 73 44 36 -23 -61 -133 -153 85 187 290 69 146 -83 -120 46 134 -288 -100
5491 -100 51 137 -116 -116 -76 162 -26 284 -82 1 -239 58 -228 -180 69 -114 84 18 45 49 84 -103 -74 -49
5515 -49 -359 46 30 -174 265 55 -183 -16 -98 249 25 41 -98 -42 -27 34 -43 381 -150 -60 151 149 138 38
5539 38 -191 -62 218 -86 90 -49 -87 -18 150 -46 -82 -79 -276 250 -265 -120 -44 4 10 75 196 -62 15 80
5563 80 50 -73 109 103 -248 145 89 -154 168 53 -41 -35 -177 -7 -106 -14 78 -116 129 -25 44 244 100 83
5587 83 -99 -147 3 -24 171 79 -86 77 -173 164 228 -393 183 -247 -110 -57 -51 -11 131 -21 -27 -44 -217 -83
5611 -83 155 20 122 -2 -175 12 -11 -244 -171 -186 -2 47 147 126 -276 271 -69 -15 -53 -258 -10 -29 -22 -85
5635 -85 30 -232 -107 -146 15 -4 -110 -73 -155 303 48 21 -102 382 133 281 58 -23 194 109 -337 -141 68
5658 68 85 -161 -74 28 223 135 -43 304 -124 -67 -117 -50 -157 7 -44 -158 -78 -35 -165 -72 -215 25 9 -215
5682 -215 -132 -26 123 -139 -35 160 62 -30 -175 -258 71 -219 229 104 -125 21 -120 -112 -55 57 257 -8
5704 -8 -76 62 109 90 229 -7 -105 -57 -106 -286 -61 122 41 -8 -146 240 -86 -110 -118 -230 -77 117 -53 204
5728 204 -453 -174 -78 -98 -157 -125 -175 -279 -92 162 -8 223 -24 93 54 -58 -43 13 -123 6 155 331 235
5751 235 110 58 4 -17 27 -39 -140 52 136 -7 125 244 -80 -99 -14 156 -105 187 -42 58 -413 167 -103
5774 -103 -47 304 -61 -194 -182 187 13 18 -116 182 -98 110 304 60 65 15 161 -19 -135 -145 -14 152 -220
5797 -220 41 162 155 49 -24 43 35 -149 -87 -224 -313 -99 52 -31 -221 70 25 -240 41 -146 -19 84 -3 0
5821 0 195 -7 -33 56 56 184 -133 -88 -168 6 -72 -148 -57 -292 -206 -15 82 -68 -147 -53 122 -25 -319 -110 -63
5846 -63 -107 -66 -130 -145 -119 68 -58 -184 17 144 49 -232 -132 46 91 -98 -481 -194 119 -18 323 128 85
5869 85 -305 -13 49 -58 -182 -174 225 -11 -189 17 13 48 -169 -178 48 -215 -100 45 -5 -401 96 -23 -328
5892 -328 -199 -123 33 19 -67 -112 0 77 291 23 -198 208 -173 -84 76 -139 1 118 -174 -4 -77 77
5914 77 -45 -221 139 134 -210 120 -153 -2 -91 -138 -36 200 -118 133 21 -75 104 103 3 -17 96 123 152 -230
5938 -230 146 0 -65 -154 -163 19 54 16 250 -117 156 9 43 -74 246 56 -254 153 50 -39 -120 -157 -52
5961 -52 -126 -45 -24 89 -222 100 -161 4 169 76 135 -78 94 204 202 154 151 -112 110 65 83 -17 177 25
5985 25 -10 40 151 42 -105 -211 125 -114 -37 -57 188 -58 -84 28 -147 -28 251 -50 -61 -48 -78 -52 132
6008 132 79 227 -142 205 16 -5 55 -192 125 6 -172 -86 108 90 51 -95 108 44 80 186 -294 0 205
6031 205 -195 224 -61 -12 18 44 16 -6 -51 -41 -17 40 90 -112 -16 -60 38 -54 63 127 109 -7 122 137 28 -9
6057 -9 318 -62 225 -87 -127 -97 150 -128 190 106 201 33 -256 -64 -85 -6 -153 -76 -104 -5 -110 -29 -66 106
6081 106 -146 -24 159 174 67 -127 -105 -228 85 9 -17 75 -141 -144 50 110 6 -149 -40 27 15 222 -4
6104 -4 -1 100 21 193 164 87 -248 34 -63 -111 173 137 -7 -72 122 54 -100 190 88 52 -3 -99 -18 -172 177
6129 177 180 -10 197 -9 -269 -26 -115 -168 -48 39 160 54 -160 -27 9 88 57 327 -187 92 -151 -108 -360
6152 -360 -34 55 -50 -244 -55 -21 -57 -30 -20 91 -216 -62 -1 108 -124 -171 156 136 30 -280 152 -215 114
6175 114 247 -163 168 40 5 -14 45 127 -180 -34 -17 -25 -222 -10 85 11 46 162 -63 18 -100 187 283 174
6199 174 -197 267 85 -177 -204 -90 -153 84 72 -133 117 -312 132 -169 -28 7 -185 -19 -45 -321 43 -62
6221 -62 -184 28 255 -79 127 245 -132 21 90 -230 -353 95 6 -79 -80 64 0 313 -41 56 -176 -23 -109
6244 -109 59 -71 42 296 103 48 -104 -53 53 53 98 -69 -83 -132 -135 106 -117 28 123 67 73 278 -127 -132 -204
6269 -204 66 128 37 281 -99 -260 -177 127 21 283 -72 94 9 33 58 -279 186 67 -57 -78 -60 117 135
6292 135 144 -198 27 17 -169 -23 -18 299 -78 10 -86 -49 -78 216 -42 213 114 79 56 -19 18 -346 -66 -81 -88 -46
6318 -46 183 -78 25 277 -187 -108 92 167 -293 -44 168 139 108 144 -256 77 -172 -42 -101 -171 -48 -35 9
6341 9 -190 -31 -24 -77 -114 -65 -91 60 -182 153 21 126 -34 36 -143 -47 116 107 183 -114 -18 34 66 -102 -155 -64
6367 -64 103 -13 113 -42 -17 157 -160 -168 -27 61 -168 26 235 20 93 46 -182 -60 231 98 -62 -110 -49
6390 -49 -81 56 155 -119 -168 5 44 -168 -39 181 90 -152 129 52 -94 160 212 66 120 166 197 301 200 -4
6414 -4 176 1 207 -137 -361 37 -148 -241 81 -285 -51 50 -61 -147 -64 196 -36 53 -62 84 231 -212
6436 -212 -94 -59 -141 -183 79 -8 150 -43 113 -226 -61 83 161 -53 17 -205 -86 109 79 16 140 115 138
6459 138 -38 55 -101 -82 6 -139 221 -68 -72 -158 -150 22 -13 -116 28 29 11 160 -171 -66 12 -116 -73 -72 -62 43
6485 43 93 -172 -164 107 -89 -181 109 81 122 -305 279 40 91 63 18 220 210 -58 -118 -49 -117 25 -48 -136 81
6510 81 219 13 -242 51 -43 273 79 105 -119 -128 -76 70 49 17 -252 -21 59 -43 -44 77 -180 -172 1 -172
6534 -172 -164 -206 -100 -2 65 -263 70 -162 237 -92 8 -136 -42 -30 -114 84 -39 -83 -107 -277 56 -34 -73 -293
6558 -293 -103 255 -25 251 141 143 -128 19 -102 1 -137 52 181 35 -236 -100 171 -253 116 41 -51
6579 -51 106 32 -177 25 -181 -162 -78 -106 -197 -148 -10 249 115 10 -86 -57 113 -128 -93 104 173 121 -125 103
6603 103 -50 -12 136 -168 26 291 51 -82 214 32 260 120 130 -76 130 184 36 -77 212 173 4
6624 4 -252 59 -265 284 43 61 98 32 -144 92 100 -212 146 23 196 -314 158 -291 -156 65 -90 -70 -72
6647 -72 -131 -33 -130 -129 -161 -159 127 93 180 -137 -309 244 -194 -193 -214 27 3 40 34 143 96 -174 -172 -163 -147 135 -120 -155
6675 -155 29 -176 72 153 -223 88 122 -182 39 93 -190 142 -64 -169 -25 -68 42 -239 13 -369 131
6696 131 -60 -126 -26 44 -29 -128 -68 84 -3 34 -54 71 78 153 -54 -221 -107 33 -40 95 -19 -96 220 -11
6720 -11 0 152 -22 -126 -21 174 -40 -28 90 -258 8 -71 51 43 -88 -13 157 52 -105 132 240 194 -141
6743 -141 -153 -142 -13 107 -116 -107 188 73 108 35 78 153 65 -190 -60 41 144 66 137 219 165 122 45 -16 48 147
6769 147 37 110 176 35 -82 11 -106 76 -79 -21 38 -78 286 35 22 63 -30 93 147 -65 116 -63 -138
6792 -138 -250 212 37 -117 -13 -119 79 -158 -209 -51 -16 88 344 41 -231 -157 71 -107 -97 176 48
6813 48 44 112 -119 29 -3 158 -31 171 218 49 120 -96 200 98 -70 119 -97 -112 -68 -218 273 -47 -54 64
6837 64 8 71 244 -121 -78 28 291 -96 89 -44 -57 -351 -203 -144 192 -141 -106 315 -93 40 145 51 -107
6860 -107 -26 220 -44 -97 -171 86 -164 73 43 249 -122 -60 234 -122 47 -113 27 -225 11 6 190 -153
6882 -153 239 -34 71 -141 208 28 67 38 -154 -165 70 -91 -2 -196 -265 227 -94 -223 28 -19 81 -95
6904 -95 28 -119 -185 -106 87 104 108 302 129 179 -86 -61 49 -4 -12 244 -67 -382 67 -75 89 -84 76 77
6928 77 40 -9 -133 188 352 -55 -58 224 129 246 16 192 126 41 45 -143 173 -197 -99 37 358 -40 -147 53
6952 53 37 81 139 52 19 109 -24 49 68 61 -181 154 -13 -261 -312 66 -17 214 -95 -33 -52 -322 182 -200 189
6977 189 44 152 -51 173 23 141 -111 -185 -66 -217 -59 -281 144 -78 22 -72 247 45 -124 -180 -197
6998 -197 282 48 2 44 39 64 53 -19 -38 -80 -23 69 164 137 18 -89 117 -1 124 -20 205 -51 -185 107
7022 107 -26 -100 223 312 -226 -109 -21 47 -132 -65 -131 160 -169 -58 -31 186 -169 -387 221 212 -45 -215 213
7045 213 203 71 -102 91 259 -18 -199 -121 -253 122 231 -28 -154 170 -68 -231 128 -272 114 -4 123
7066 123 108 84 94 -98 -55 33 25 86 51 -197 200 -23 -145 -105 67 206 -15 -264 -1 -52 170 51 -106 -120
7090 -120 -289 211 219 -392 212 18 116 -7 -57 74 107 238 141 -234 -166 -72 154 -125 56 -125 -33 -65 203
7113 203 -99 155 -63 12 -158 156 131 77 -83 -128 -147 30 -147 42 -80 -61 123 -64 -162 14 41 -33 93
7136 93 19 -68 12 53 -68 -78 -198 -301 -155 -102 -22 2 -22 4 -46 -115 335 280 30 298 84 -311 132 -97 100
7161 100 -61 4 -249 -98 11 -51 150 130 -46 114 62 118 -1 -45 69 -70 232 -187 -123 -257 -156 -209 -94
7184 -94 12 128 214 145 105 41 102 -25 -16 -43 -218 126 -90 55 -1 59 -73 -9 -93 -30 -194 -105 3 -14 -78 131
7210 131 -253 -105 36 -120 -32 -110 42 126 8 129 134 -103 212 35 -44 110 -161 1 -59 -22 -50 -43 -29 -20 6
7235 6 105 38 -82 -89 -87 21 10 104 -139 -55 -31 160 -79 21 -78 44 -217 -94 -1 -3 39 255 -48 -79 313 215
7261 215 41 80 190 274 72 -31 -211 91 -166 -68 52 273 -3 49 245 -122 39 53 41 -21 116 10
7283 10 -241 42 -72 131 78 -237 83 -18 98 72 39 80 -54 161 130 -275 -28 -154 32 -156 -355 -105
7305 -105 -170 49 52 -56 174 125 37 -159 -166 -9 227 -203 -12 -152 -135 144 115 344 21 -242 139 -118 38
7328 38 -158 -308 -104 -157 -192 259 316 61 167 -67 164 -61 -171 141 -24 189 162 25 -121 -10 133 -177
7350 -177 46 92 101 113 12 -70 57 113 -81 -302 197 37 -84 -45 -77 -17 76 -75 11 -69 1 140 -75 -157 -98
7375 -98 136 167 300 -213 -7 -64 154 204 29 85 31 -145 -85 -321 85 -135 62 265 433 66 -303 -327 13
7398 13 -86 88 -174 132 27 127 75 31 47 53 -155 36 110 -106 -54 81 119 19 -125 -20 48 -70 -151 -43
7422 -43 -138 -5 151 354 -208 -47 88 -71 47 -114 5 223 223 -164 -1 189 44 90 -355 190 98 -47
7444 -47 -3 173 79 -343 -19 97 88 61 -223 -244 165 -215 -112 -4 -72 -57 17 -46 122 12 -10 21 -185 96
7468 96 -214 -4 -16 99 -213 191 341 -14 -28 -11 106 -73 -95 -67 152 -183 68 299 253 181 -59 197 -66
7491 -66 148 -17 -139 -96 113 73 60 -46 88 210 -64 -13 138 -54 251 159 75 208 108 19 -50 -264 135
7514 135 -45 -102 84 202 -106 -75 -119 13 98 128 82 20 209 44 -197 189 59 23 98 -330 63 132 -8
7537 -8 -260 -192 10 -117 -66 70 40 66 13 -125 102 -57 307 46 4 38 61 -292 45 -146 16 -245 -130
7560 -130 45 159 -142 21 -189 -164 -9 65 419 -239 -77 228 134 10 17 125 184 207 39 -137 155 406
7582 406 -446 -115 181 -77 -9 -189 66 91 -78 112 50 51 5 199 -120 164 49 -24 62 -306 -31 80 -5
7605 -5 -8 -276 -79 -78 -65 -148 27 -17 -76 -111 -110 -29 111 36 -96 195 -151 -43 -57 251 -109 -51 -18 -128 101 128
7631 128 -229 78 -30 -83 41 -84 81 -31 -47 194 -84 -20 109 -60 172 191 -28 -30 -306 -52 -47 32 279
7654 279 288 -158 170 126 -104 207 34 -198 -304 -22 47 -42 60 192 307 181 -20 -15 -48 -101 195 -202 210
7677 210 -217 -129 71 -232 -25 46 44 45 -5 148 85 35 55 -199 -317 -150 80 141 -51 9 5 -147 110 135 66
7702 66 -50 -168 -41 -87 56 50 32 374 -93 262 -207 -289 -166 70 9 51 -6 95 -19 40 -140 116 10
7725 10 26 48 60 82 -11 204 -340 125 246 60 -171 -78 -79 -19 123 109 -51 181 134 -108 -208 177 -46 -133
7749 -133 -46 179 216 -154 63 185 -28 -107 273 67 -125 -4 188 252 61 25 30 -45 10 -82 -55 -265 -26 89
7773 89 -266 64 251 107 -125 109 121 1 67 1 -136 -56 -108 -259 -231 190 -35 126 -65 119 329 -223
7795 -223 -183 -23 -74 -125 21 -23 -84 -118 -176 -103 -106 -143 -225 -71 -19 -191 70 -66 -21 -27 -107 77 23 310 82 6
7821 6 -180 62 76 -21 85 -47 -53 -17 171 52 -20 90 1 -360 11 150 -13 -21 114 -160 117 -129 44 56
7845 56 65 140 181 -246 -58 99 127 152 -216 -71 110 -142 34 39 171 78 -83 250 3 118 29 51 9 -11 84
7870 84 -191 19 21 -120 116 322 163 -51 -182 -45 -54 -46 77 -148 -192 -68 52 -109 -117 -45 -132 206 39 63
7894 63 -248 37 162 232 -271 -238 3 -64 303 75 -149 92 107 62 60 -78 -131 -249 -139 243 -27 -103 162
7917 162 -76 213 -144 116 -42 -258 12 -151 -30 78 8 -82 111 197 100 78 -51 154 -27 -126 44 -64
7939 -64 104 -3 -201 -184 -47 -39 280 -136 -61 -26 27 255 339 85 -2 -20 -103 -115 -124 -108 104 29 130 13 148
7964 148 -248 -9 -49 -154 -233 -59 54 -107 -102 15 -9 -85 192 37 -282 -10 -124 -47 208 137 335 -120 14
7987 14 -184 15 282 -67 190 56 -73 274 -60 -9 194 -102 -37 79 140 48 -183 277 88 -17 74 -89
8009 -89 -35 130 -16 -38 311 -35 -397 125 2 145 60 -75 126 -314 158 -44 -224 63 187 115 128 146
8031 146 1 94 -9 108 20 31 295 105 -219 -92 -210 155 197 184 -11 -212 5 216 66 63 -46 149
8053 149 -201 154 288 89 5 -93 -153 -151 179 66 121 -90 -63 -281 38 37 191 -74 -216 -360 -75 82 -78
8076 -78 -82 192 51 -60 11 -121 -17 -4 -56 -172 -63 80 -4 -59 -39 -41 -9 -137 -168 -203 276 -49 -89 -335 33
8101 33 164 -8 49 22 153 -99 109 -276 156 -148 224 -158 -158 21 -193 12 64 61 55 -158 -51 132 -142
8124 -142 36 119 -229 89 -307 15 -154 -6 183 -92 -127 -126 -87 58 225 -135 -211 64 137 10 -58 -251 63
8147 63 -2 10 -151 -80 -326 287 156 54 114 -22 51 -84 -74 183 -18 -210 43 -168 53 153 12 -221
8169 -221 83 -59 -252 50 92 15 103 85 -81 -138 -25 -7 -210 216 21 -84 -73 -233 -172 -64 -26 -131
8191a31
##END NTUPLES=NMR FID
##END=
