##TITLE=1H_DE-54EAK_TFA
 CDCl3
 8 sc, 
 3.5.2024
##JCAMPDX= 6.0         $$ Bruker NMR JCAMP-DX V2.0
##DATA TYPE= NMR FID
##DATA CLASS= NTUPLES
##ORIGIN= UXNMR, Bruker Analytische Messtechnik GmbH
##OWNER= root
$$ XWIN-NMR		Version 3.5
$$ Fri May  3 13:41:11 2024 Russian Standard Time (UT+4h)  she@DPX200
##.OBSERVE FREQUENCY= 200.1309
##.OBSERVE NUCLEUS= ^1H
##.DELAY= (6, 6)
##.ACQUISITION MODE= SIMULTANEOUS
##.ACQUISITION SCHEME= undefined
##.AVERAGES= 8
##.DIGITISER RES= 18
##SPECTROMETER/DATA SYSTEM= spect
##.PULSE SEQUENCE= zg30
##.SOLVENT NAME= CDCl3
##.SHIFT REFERENCE= (INTERNAL, CDCl3, 0, 15.7039)
##AUDIT TRAIL= $$ (NUMBER, WHEN, WHO, WHERE, WHAT)
$$ ##TITLE= Audit trail, XWIN-NMR		Version 3.5
$$ ##JCAMPDX= 5.01
$$ ##ORIGIN= Bruker BioSpin GmbH
$$ ##OWNER= she
$$ F:/spectra/data/she/nmr/H-F/1/audita.txt
$$ ##AUDIT TRAIL=  $$ (NUMBER, WHEN, WHO, WHERE, WHAT)
(   1,<2024-05-03 13:40:07.07 +0400>,<she>,<DPX200>,
      <created by zg, POWCHK disabled, PULCHK disabled
       configuration hash MD5:
       00 E9 B6 7A A2 85 ED C7 34 08 36 98 17 FE 4E 26
       data hash MD5: 16K
       19 B4 89 72 05 B1 59 2F 21 73 42 21 70 5C 79 2F>)
$$ ##END=
$$ 
$$ hash MD5
$$ 53 DE 13 74 65 5F 99 B3 A1 63 43 A2 B6 1D CC CA
##$RELAX= 
##$RELAX= 
##$RELAX= 
##$RELAX= 
##$RELAX= 
##$RELAX= 
$$ Bruker specific parameters
$$ --------------------------
##$DU= <F:/spectra>
##$EXPNO= 1
##$NAME= <H-F>
##$PROCNO= 1
##$TYPE= <nmr>
##$USER= <she>
##$AMP= (0..31)
100 100 100 100 100 100 100 100 100 100 100 100 100 100 100 100 100 100 
100 100 100 100 100 100 100 100 100 100 100 100 100 100 
##$AQSEQ= 0
##$AQ_mod= 1
##$AUNM= <au_zg>
##$AUTOPOS= <>
##$BF1= 200.13
##$BF2= 200.13
##$BF3= 200.13
##$BF4= 200.13
##$BF5= 200.13
##$BF6= 200.13
##$BF7= 200.13
##$BF8= 200.13
##$BYTORDA= 1
##$CFDGTYP= 0
##$CFRGTYP= 5
##$CHEMSTR= <none>
##$CNST= (0..31)
1 1 145 1 1 1 1 1 1 1 1 1 1 1 1 1 1 1 1 1 1 1 1 1 1 1 1 1 1 1 1 1 
##$CPDPRG= <>
##$CPDPRG1= <>
##$CPDPRG2= <>
##$CPDPRG3= <>
##$CPDPRG4= <mlev>
##$CPDPRG5= <mlev>
##$CPDPRG6= <mlev>
##$CPDPRG7= <mlev>
##$CPDPRG8= <mlev>
##$CPDPRGB= <>
##$CPDPRGT= <>
##$D= (0..31)
0 1.2 0 0 0 0 0 0 0 0.06 0 0.03 0 0 0 0 0.0002 0 0 0 0 0 0 0 0 0 0 0 0 
0 0 0 
##$DATE= 1714729206
##$DBL= (0..7)
120 120 120 120 120 120 120 120 
##$DBP= (0..7)
150 150 150 150 150 150 150 150 
##$DBP07= 0
##$DBPNAM0= <>
##$DBPNAM1= <>
##$DBPNAM2= <>
##$DBPNAM3= <>
##$DBPNAM4= <>
##$DBPNAM5= <>
##$DBPNAM6= <>
##$DBPNAM7= <>
##$DBPOAL= (0..7)
0.5 0.5 0.5 0.5 0.5 0.5 0.5 0.5 
##$DBPOFFS= (0..7)
0 0 0 0 0 0 0 0 
##$DE= 6
##$DECBNUC= <off>
##$DECIM= 32
##$DECNUC= <off>
##$DECSTAT= 4
##$DIGMOD= 1
##$DIGTYP= 9
##$DL= (0..7)
0 120 120 120 120 120 120 120 
##$DP= (0..7)
150 150 150 150 150 150 150 150 
##$DP07= 0
##$DPNAME0= <>
##$DPNAME1= <>
##$DPNAME2= <>
##$DPNAME3= <>
##$DPNAME4= <>
##$DPNAME5= <>
##$DPNAME6= <>
##$DPNAME7= <>
##$DPOAL= (0..7)
0.5 0.5 0.5 0.5 0.5 0.5 0.5 0.5 
##$DPOFFS= (0..7)
0 0 0 0 0 0 0 0 
##$DQDMODE= 0
##$DR= 18
##$DS= 0
##$DSLIST= <SSSSSSSSSSSSSSS>
$$ [...]
##$SUBNAM2= <"">
##$SUBNAM3= <"">
##$SUBNAM4= <"">
##$SUBNAM5= <"">
##$SUBNAM6= <"">
##$SUBNAM7= <"">
##$SUBNAM8= <"">
##$SUBNAM9= <"">
##$SW= 18.0517689322627
##$SWIBOX= (0..15)
0 0 2 0 0 0 0 0 0 0 0 0 0 0 0 0 
##$SW_h= 3612.71676300578
##$TD= 16384
##$TD0= 1
##$TE= 0
##$TE2= 300
##$TE3= 300
##$TEG= 300
##$TL= (0..7)
0 120 120 120 120 120 120 120 
##$TP= (0..7)
150 150 150 150 150 150 150 150 
##$TP07= 0
##$TPNAME0= <>
##$TPNAME1= <>
##$TPNAME2= <>
##$TPNAME3= <>
##$TPNAME4= <>
##$TPNAME5= <>
##$TPNAME6= <>
##$TPNAME7= <>
##$TPOAL= (0..7)
0.5 0.5 0.5 0.5 0.5 0.5 0.5 0.5 
##$TPOFFS= (0..7)
0 0 0 0 0 0 0 0 
##$TUNHIN= 0
##$TUNHOUT= 0
##$TUNXOUT= 0
##$USERA1= <user>
##$USERA2= <user>
##$USERA3= <user>
##$USERA4= <user>
##$USERA5= <user>
##$V9= 5
##$VALIST= <valist>
##$VCLIST= <CCCCCCCCCCCCCCC>
##$VD= 0
##$VDLIST= <DDDDDDDDDDDDDDD>
##$VPLIST= <PPPPPPPPPPPPPPP>
##$VTLIST= <TTTTTTTTTTTTTTT>
##$WBST= 1024
##$WBSW= 4
##$XGAIN= (0..3)
0 0 0 0 
##$XL= 0
##$YL= 0
##$YMAX_a= 189843
##$YMIN_a= -162184
##$ZGOPTNS= <>
##$ZL1= 120
##$ZL2= 120
##$ZL3= 120
##$ZL4= 120
##$ABSF1= 10
##$ABSF2= 0
##$ABSG= 5
##$ABSL= 3
##$ALPHA= 0
##$AQORDER= 0
##$ASSFAC= 0
##$ASSFACI= 0
##$ASSFACX= 0
##$ASSWID= 0
##$AUNMP= <proc_1d>
##$AZFE= 0.1
##$AZFW= 0.1
##$BCFW= 1
##$BC_mod= 2
##$BYTORDP= 1
##$COROFFS= 0
##$CY= 11.3945322036743
##$DATMOD= 1
##$DC= 2
##$DFILT= <>
##$DTYPP= 0
##$F1P= 15.6554695791079
##$F2P= 12.8336369535428
##$FCOR= 0.5
##$FTSIZE= 0
##$FT_mod= 4
##$GAMMA= 1
##$GB= 0.15
##$INTBC= 1
##$INTSCL= 1
##$ISEN= 128
##$LB= 0.24
##$LEV0= 0
##$LPBIN= 0
##$MAXI= 10000
##$MC2= 0
##$MEAN= 0
##$ME_mod= 0
##$MI= 1.114404
##$NCOEF= 0
##$NC_proc= 0
##$NLEV= 6
##$NOISF1= 3.799351
##$NOISF2= 2.8
##$NSP= 1
##$NTH_PI= 0
##$NZP= 0
##$OFFSET= 15.70392
##$PC= 1
##$PHC0= -25298.78
##$PHC1= 11.58731
##$PH_mod= 1
##$PKNL= yes
##$PPARMOD= 0
##$PSCAL= 0
##$PSIGN= 0
##$REVERSE= no
##$SF= 200.130013532006
##$SI= 16384
##$SIGF1= 3
##$SIGF2= 2
##$SINO= 400
##$SIOLD= 16384
##$SREGLST= <1H.CDCl3>
##$SSB= 0
##$STSI= 0
##$STSR= 0
##$SW_p= 3612.71676300578
##$SYMM= 0
##$S_DEV= 0
##$TDeff= 0
##$TDoff= 0
##$TI= <>
##$TILT= no
##$TM1= 0
##$TM2= 0
##$TOPLEV= 0
##$USERP1= <user>
##$USERP2= <user>
##$USERP3= <user>
##$USERP4= <user>
##$USERP5= <user>
##$WDW= 1
##$XDIM= 8192
##$YMAX_p= 0
##$YMIN_p= 0
$$ End of Bruker specific parameters
$$ ---------------------------------
##NTUPLES= NMR FID
##VAR_NAME=  TIME,          FID/REAL,        FID/IMAG
##SYMBOL=    X,             R,               I
##VAR_TYPE=  INDEPENDENT,   DEPENDENT,       DEPENDENT
##VAR_FORM=  AFFN,          ASDF,            ASDF
##VAR_DIM=   8192,          8192,            8192
##UNITS=     SECONDS,       ARBITRARY UNITS, ARBITRARY UNITS
##FACTOR=    0.0002768,     1,               1
##FIRST=     0,             0,               0
##LAST=      2.2672688,     0,               0
##MIN=       0,             -162184,         0
##MAX=       2.2672688,     189843,          0
$$ Real data points
##PAGE= N=1
##DATA TABLE= (X++(R..R)), XYDATA
0@%%%%%%%%%%%%%%%%%%%%%%%%%%%%%%KmMnOoOoOnNpQqQrJ1j2J2j4J6j8K1k3K6
55A4l1L4l7M4n3O3p6R4j18J55k13K99m29N33N702N6352K0910k00786j1357K69181
75A40281j0701k06766l0919J27555J19961j17507j73838J28491J56201p3574j21247
86f2063k7677J27047Q2139j51450p3069J24135O7484m4255j13986j8788J65233
97G4750J8979j60822m125J06920L7897n4091r5353L3397J12808k2632q7537j5509
109e5318P2688P0997q8094r6821R9140P9771o8833o1360J1699P2590K8644r0786
121b5683l4596P7438L3449l4155n3167n49Q1417P970r2252p396P5864K0759n0669
134a570m3627L6412N7521k5655n7022O700M8037K0054m0840l9671L7982M7677
$$ plain form
0 0 0 0 0 0 0 0 0 0 0 0 0 0 0 0 0 0 0 0 0 0 0 0 0 0 0 0 0 0 0 0 2 -2 2 -3 3 -3 3 -3 3 -2 3 -4 4 -4 4 -5 6 -6 6 -8 8 -10 11 -12 14
55 14 -17 17 -20 24 -29 34 -42 52 -66 89 -124 175 -254 279 5981 62333 83243 -117543 -128900 140281
75 140281 129580 -77186 -108105 19450 139411 21904 -151934 -23443 132758 59184 -62063
86 -62063 -89740 37307 119446 -32004 -105073 19062 86546 42291 -71695 -90483 74750
97 74750 93729 -67093 -71218 35702 73599 19508 -75845 -42448 70360 47728 -39809 -55318
109 -55318 17370 88367 273 -96548 2592 82363 13530 -47830 -36131 36459 65103 -25683
121 -25683 -60279 17159 50608 16453 -36714 -37263 44154 52124 -40128 -47524 28340 49099 -1570
134 -1570 -45197 -8785 48736 23081 -33941 -27241 20796 40850 10 -39661 -1679 45998
146D5998l0448n1034J5783N2281j296m9941q590M1560J8094k8430k9868J4867
158a1024L9908k826m3814p388L9213J7597l2990k6252K5938L2149j8016l3141
170b0646P024K8899N336k5535j5680K2505K3632j7407k7855R058K8431Q86k8723
183a0075q169K7554J2083k2475j4908J3458J8087k167k2370m760K3158Q929k0576
196b231j3124J4907J8662q997k1210L958K0159L08j7307n723J3272J2238r340
209E572j6023N087J6524o95j6232m099J5202R098j3666j1183Q797J1966l480j3372
223f504k25J3584M246j1987p786P857J0953m809j2900L346J2910p55j1009l742
237f821Q045Q178o756r559N197R131j477r178l645R249O635q815o624O278O731
$$ plain form
146 45998 15550 -35484 -19701 32580 31284 -18657 -27247 14313 32407 3977 -25891 -11024
158 -11024 28884 26058 -17756 -25144 14069 31666 -1324 -27576 -1638 30511 12495 -20646
170 -20646 -13622 15277 20613 -4922 -20602 1903 25535 8128 -19727 -10669 17762 18648 -10075
183 -10075 -18244 9310 21393 -1082 -15990 -2532 15555 13388 -8982 -13742 9416 18345 -2231
196 -2231 -15355 -448 18214 9217 -11993 -8035 12124 12432 -4875 -10598 2674 14912 5572
209 5572 -10451 -5364 11160 10465 -5767 -9866 5336 14434 768 -10415 -1618 10348 6868 -6504
223 -6504 -6729 6855 11101 -886 -8672 -815 10138 5329 -7571 -4225 8685 7930 -3079 -6821
237 -6821 1224 9402 2646 -6913 -1716 7415 5938 -3240 -6885 2364 8999 184 -6440 -162 6569
252F569k889q354m18R460K771q133l745N250N204k915p826J351R036j79p267k015
268d100N135M639m647n914L603O187j261n485j722N116L447n426l717L800M817
283D472j548n579n89N924J096m975k153L384L782j829n492J379N039k62m186r95
299b532L402K846l141l847K003M345j211l690m82L705J840l626k645K854K764
314B585j596l075K80L376Q92l567j504K745K372j738l030J165K895l7l239l99
330a875K760J468k413j914J527K264o23k726k52K484J319k175j565J576J960j089
346G26k159K06K353M30k137q98J448J383r81j925R08J910m01j765m32J690J187
363A543j711r39Q87J407n14j564q4J871K88j269r26J011J107n53j344K32J530
$$ plain form
252 6569 3680 -4674 -5092 4368 7139 -994 -4739 511 5715 2800 -5026 -3675 5361 5182 -2085 -4100
268 -4100 1035 5674 1027 -4887 -1284 4903 3642 -1843 -3565 1551 4998 -428 -4145 -345 4472
283 4472 2924 -2655 -3244 2680 3776 -1199 -3352 32 3814 1985 -3507 -2128 2911 2649 -1537 -2532
299 -2532 870 3716 575 -3272 -1269 3076 1865 -1825 -2307 1398 3238 -388 -3033 -179 2585
314 2585 989 -2086 -1806 1570 2462 -1105 -2609 136 2508 770 -2260 -1095 1800 1763 -1476 -1875
330 -1875 885 2353 -60 -1974 -447 1817 1194 -1532 -1784 700 2019 -156 -1721 -145 1815 726
346 726 -1433 -1227 1126 1556 -581 -1479 -31 1352 371 -1554 -646 1264 863 -902 -1334 356 1543
363 1543 -168 -1107 -220 1187 673 -891 -975 896 1184 -85 -1011 0 1107 554 -790 -558 972
380I72k96j038m61Q65R46o32j099O43Q94%j199j49Q76R12j391o52O54R77m91r80
400f49J41J032L62p89p36N24R14l79j119Q20P86l93q13l41J013K77n62n99L69
419a42N08J81q88m72R15O09o16p48N25J145q18q18M01N13J68k26n06K91O23l56
439B89m51k22J050n7n84m10N75L68l09m30o9M34J42p93J05N19K20l70n32O22N04
460F01n47n34L45L25O9m46n5N17L05k87m14pJ27L68k18m77P00k04l77J8K98L96
482E03l74l54n9M17pk18j95K59O3j96j90J37N04q3j95m3m2J62j81o8Q8L10J06
505C44n80j43K56L89k16n6p7M02l2o18J74J92j13Q3K14k73P6M1l82L40J27j65
527a7o3l6M37k43q1j43K2K71j90j14pJ24K09k07k07O13j07p5l46K46p9K83l50
$$ plain form
380 972 676 -362 -823 42 988 356 -743 -100 794 794 -405 -554 322 1234 -157 -809 -155 822 331 -649
400 -649 -508 524 886 97 -639 -115 799 420 -699 121 907 514 -299 -640 373 650 88 -511 -142
419 -142 366 547 -341 -813 102 711 95 -653 -128 1017 199 -619 -218 295 463 237 -269 22 645 289
439 289 -162 -384 666 609 25 -385 190 558 249 -181 -250 184 326 -467 -362 157 377 7 -525 97 601
460 601 54 -480 -135 190 259 -187 -242 275 580 293 -121 -128 -1 367 149 -328 372 168 -209 -191 107 503
482 503 129 -225 -284 133 126 -92 -287 -28 35 -161 -351 -214 290 207 12 -31 -73 89 -92 -160 -72 238 344
505 344 -236 -379 -123 266 50 -6 -83 319 287 -331 -157 35 -78 5 219 -54 22 63 -319 21 148 -17
527 -17 -80 -116 321 78 -3 -146 -124 147 -43 -157 -164 -40 169 -38 -245 368 261 186 -160 86 7 290 -60
550f0p4j44L31J98l60J60l4lK60k46KL08k49N7k60K08L3j1J14j76J98j35k30L29
574B16Q2k38k9R6k40L09k27j2R2J74l97j3J27K03J4j56j0J58K42j30k63L8M00
597D36n22J76R7K09l65M5M7oj5j45R0j47P0J05j35J12L9lO6r7MJ05k68L45j69
622G4M3J50j58j00J62q5Q1p9q6J60J77k86o4O3J07j24o8P2n9K19l40Q6m2J54q5
647b8l4K55j14K45l01o0P4J02k02M3J41j27K25q4j43J33ol27L49l02N71m00j37
670a27j5L07m3l10K28K3n5m6j99K14L05m12J30n1k53M41j7j8q0o8q5L74j99p4
694c0l3K01mk65Q8J63l16QK02k60K48rp3L8J93m4J93j99j75j16k8K11J84k01k92
719c16P5L52l60J93L10k70j0r9K19j06J2J95k51q4K32O5n10K60R5q1J59J8m25
$$ plain form
550 -60 -134 -278 53 251 -109 51 17 14 274 28 30 338 89 146 -114 94 127 116 230 54 252 117 -113 216
574 216 298 60 31 127 -113 196 -31 -43 49 223 -174 -187 -60 143 157 1 -9 149 391 261 -2 36 436
597 436 -86 90 187 396 31 76 123 117 102 -43 47 -100 -30 75 -60 52 91 88 154 57 61 166 -102 243 74
622 74 117 267 109 9 171 86 167 88 2 162 339 53 -11 52 159 35 -33 39 -20 199 -141 -55 -97 57 -28
647 -28 -62 193 79 324 23 -37 37 139 -63 -20 121 -6 219 135 -8 125 119 -208 141 -161 410 10 -127
670 -127 -142 165 122 -188 40 63 8 -38 -237 -23 282 -130 0 -51 -304 137 120 102 22 -46 -131 243 44 -30
694 -30 -63 138 134 -131 -43 120 -196 -188 14 -246 2 -7 -80 -42 151 107 300 101 -74 -190 -218 -7 177 -24 -316
719 -316 -241 111 -249 -56 254 -16 -26 -125 94 -12 0 195 -56 -140 92 157 -353 -93 2 -79 80 98 -327
742c27K90J5J7J43j64j1R3j72K9L14m22M3N9J18k44J50J73j06j24q6O3q6J53J80
766I8k66L00K5k92MJ64K43k66Mj20J47N5K47j73k69J39m51O49R0n12P8L2O3r6
790a07M5j24Q1Q2P4j07j22j07m6L60N6o1j52J82Qj73J86j41L6j88M71j44j07l5
814c3K31k87N3L05p4k80M9P6j41n2J45k39L20k36L32l8k29NK47k26J61k1j34N0
838a6o1K83j83n7Lk13J24K24j87r9M37k04j32J82k10J41j23J44k0J1j24k9J48
861C9n7m2K84q2p5Q9k14K7l2K08p9m2k35m6K21j16L6n1j51L70q6l8J01r3K00r7
887C9k29N50o06K06J24p1N5Q0J4l09M16n02M62k47N6o3j5K22j47L1j39K07j56
910b2n3j33L90k07n0Pp6K02J41j23l32K34J55k58K49R9m43J06J2J32N7o6k60M14
$$ plain form
742 -327 -37 -22 -5 138 -26 -37 56 -116 -87 227 -195 -152 -93 25 -219 -69 104 -2 -126 -212 -149 -235 -82 98
766 98 -168 132 157 -135 -131 33 276 10 14 -106 41 96 343 170 -99 40 -411 238 328 -184 -106 -74 -11 -107
790 -107 -62 -186 -105 -23 51 -56 -178 -285 -331 29 85 24 -128 54 62 -111 75 -66 -30 -218 253 109 2 -33
814 -33 198 -89 -36 269 195 -85 -36 40 -101 -153 -8 -247 73 -163 169 131 -98 -93 154 -72 89 68 -66 -16
838 -16 -77 206 23 -34 -31 -244 -120 104 -83 -182 255 51 -81 101 -109 32 -91 53 33 44 -80 -109 39
861 39 -18 -60 224 142 67 156 -58 -31 -63 145 66 24 -211 -257 -36 -152 -116 -167 -318 52 -34 -72 29 -64 136 39
887 39 -190 360 -246 -40 84 13 68 148 162 -147 269 -233 229 -18 38 -25 -40 182 35 66 -73 134 -22
910 -22 -75 -208 182 -25 -75 -68 -144 58 199 76 -256 -22 133 -125 124 223 -220 -114 -102 30 87 21 -239 175
934A75k86QM07o12L61J85n08k2K81Rj72K63oj77L32j23k56l1J67o7p8L06j77N3
958C2o2J48l58J43L56j89m3J57l88K11N4j69K58k44j5j03N15R8l81J71j80L99
980D10n42P1J69j84M2j6J73j02j21p9L65l40J14N7J15k10M9R5J68k68N5J93l40
1003a26r6m0K82KJ33k53K77k03j23J06K8Q5j92R9k48L73j61J12J24k22K74k72
1025d1J30k8l26M17j69Q5J57kj96n1QJ31M9k07J74r9k03n7L50k04J19K02l44J03
1049bJ68q6o8J54nk18j09J5M00l95K20o2m3k94J07M08p1k58K01m5p5M3j05J70
1073E0l01J1J98J91n8j33O9R6j22j00J51j11j8J47l2j06NQ2K32o6k15j83K51j61
1097a23m5Q8K64l08j74L59Q8m04M55j86J17j2j46j18J03J60l74L61l0j84P8p6
$$ plain form
934 175 -111 -103 304 -308 53 238 -270 -292 -11 -2 -174 89 83 -94 238 115 -141 -172 -5 -72 -150 156 -21 32
958 32 -30 118 -240 -97 259 70 27 184 -204 7 61 -108 150 -94 -109 -212 303 401 20 191 11 410
980 410 -132 -61 108 -76 -34 -50 123 21 -100 -179 186 -154 -40 17 132 -78 -29 66 234 -34 21 214 -126
1003 -126 -222 -262 20 22 155 -98 179 -24 -147 -41 -13 72 -120 -21 -269 104 -57 55 179 -43 231 -41
1025 -41 89 61 -265 152 -17 68 225 223 27 -24 -16 115 164 -43 131 32 -171 -228 122 -82 37 239 -105 -2
1049 -2 166 80 12 166 161 -57 -166 -151 249 -146 74 12 -31 -325 -218 190 119 -139 62 17 -58 -15 -120 50
1073 50 -251 -240 -42 149 91 -42 27 123 1 -99 52 -59 -77 70 38 -68 -63 19 251 185 -30 -213 38 -123
1097 -123 -168 -80 184 -124 -298 61 149 -255 200 14 131 119 -27 -145 -42 118 -256 105 75 -109 -31 -107
1119a07M1J02J13k72K27k41p3Q6Q5m2o2M02k91j16K28l00P8J74j89K31j96J87
1141F5L9N8l96J15J58j41K87l03p9J51K0j37J37p3R3N1j65KK08l88K96M1K29l87
1165a19P6j65J23J38M0j30J28k57K55n2O5l70M20j25j65O9J99M1j40J2l30Q1K33
1188B7j36K20m2m04L67K9J43k77J74P6P4k15j94J6J69j69L8K56r4M9n1J03j65
1211fJ65j10L8k34J92R6j75K38J2p6k30J41l19K49J04j11P7l28K64o0K80l9k57
1234h9k49L50J48k37M2K76l49j66J91J06j06K19l21K20J22j53j1O2n3R7o0o6Q4
1257E7Qr6L24m74K89j65p0J93J82k23o3l5J13j32J7j1K85j51j18j2K19Nj43K01
1281B00l36N8K44l50J21J59o0J59J17m03j0r0K36k53J22J09J13m3j40M4j36L70
$$ plain form
1119 -107 -66 36 149 -123 104 -137 -210 -124 -39 -81 -143 259 -32 -148 80 -220 -142 32 -157 74 -122 65
1141 65 104 162 -234 -119 39 -102 185 -118 -197 -46 -26 -163 -26 -99 -6 45 -120 -118 90 -298 -2 39 268 -119
1165 -119 -43 -208 -85 53 93 -37 91 -166 89 37 102 -268 152 27 -138 -69 130 171 31 43 -287 -206 27
1188 27 -109 111 69 -335 32 61 204 -73 101 177 251 36 -158 -142 27 -142 -104 152 58 107 56 159 -6
1211 -6 159 49 87 -147 45 141 -34 204 216 140 -90 51 -268 -19 85 -26 51 -277 -13 -73 207 168 -89
1234 -89 -338 12 160 -77 -35 241 -108 -274 -83 23 -83 136 -185 35 157 4 -7 55 2 99 39 -27 57
1257 57 65 -31 293 -181 108 -57 -127 66 248 25 -38 -73 40 -92 -75 -86 199 48 -70 -82 137 142 -1 200
1281 200 -136 -78 166 -184 -63 96 36 195 312 -91 -101 -191 45 -208 -86 23 136 93 -47 -3 -139 231
1303B31j67k36L84l23J32k0N0l0K9P7q3K53m72K75Q3j58j23J3J16k46O2J45P3
1326F5o5M9j10K9j3O5N0O7j82L7j4J72j37R4k12K19j93N1q7J02M4K22k11M4k32
1351a46j86J87J80K63j83j78J40L3N5j93l6R6J81k70J70j56j5J8no8K26l08J57
1374c8J3j4J38j32J77k9j37Q1M7L5k93K19J00k10k86K46p6J65Q3l19K33q7m0J2
1398a12M5qK93j39k01j1J08n1J11K03l41K74j09M3j45N3J23l13P7J30n7k17M57
1421B13l39O9J56j50J78j29j48J81P1k2k05K70l44M02n8j67OQ8J05n05N17n56
1443c67K77Km9Q3J63J99l29l2L2r7L96l57kJ7q8K26P3j52M9m18M54j4p0Q7o5J37
1469A55l45K20j68K05L1N9j15K4l8q2M3K50Rj67N1k7j40L4p0J74p4O3j36J86k46
$$ plain form
1303 231 64 -172 212 -111 21 1 51 21 50 127 44 297 -175 100 183 25 -98 -85 31 -215 -153 -8 65
1326 65 0 49 -61 -32 -45 20 70 137 -45 -8 -22 150 13 107 -105 114 -79 -28 -115 -13 31 253 42 86 -146
1351 -146 -332 -145 35 298 115 -63 77 110 165 -28 -64 32 213 -57 113 -43 -58 -40 -45 -113 113 -195 -38
1374 -38 -25 -39 99 -33 144 115 -22 59 106 141 -152 67 167 -43 -329 -83 -159 6 89 -230 3 -84 -124 -112
1398 -112 -67 -75 218 79 -122 -133 -25 -76 35 238 -103 171 62 105 -40 13 136 -177 -100 30 -27 -244 213
1421 213 -126 -57 99 -51 127 -2 -150 31 102 80 -125 145 -199 203 145 -22 -16 72 177 -328 189 -367
1443 -367 -90 -88 -137 -54 109 308 -21 -53 -21 -118 278 -79 -81 -64 -152 74 147 -5 44 -374 80 66 -4 83 18 155
1469 155 -190 30 -138 67 98 157 42 66 28 -54 -11 239 248 81 132 105 -35 -1 -71 103 29 92 -44 142 -104
1494a04K01J77m85J10J48k2j7k16m4L83l7l14K52k0K16j57J09j79k8j05J37J99
1516B04j73L8nk38K19R4o0k4Rom1m7Q2r5K8Qj52K92L9R1m49K15j17J82k69j40
1542c15M58l31NJ59k0K13k06K0q7QK61j23K33j56j87Q6L56m32K36k90k46M61j47
1565d4P7l19K06j4J33k05K05j20M7qk5L03n8l25k56N03m7q9J79j03J5P7j58j13
1589a39kL74k44J80j71M3Q2k62J13J05k49K06k60O7K02k37J33K3l0P2K16k61K92
1612B53l88L20j26qp7Q1k83J26L34l83L16l16L8l6n2J21P9j38K8K4m4J21j06J79
1636F3Q7k0k35j47J62qK4J17K76l69J1n4o2R0J6M1O5L7l0J9n3M6L1Pl3j55K15
1663A41J31m57O3P7j9oJ30r0k16K68K1j45J05j3m4lJ51j44m4R1L9L9k30K8N5M56
$$ plain form
1494 -104 97 274 -211 -101 47 25 8 -208 -252 131 94 -220 32 12 228 71 180 1 -27 -132 5 204
1516 204 31 69 64 -174 45 139 79 55 64 58 17 -30 52 -43 -15 -7 -159 133 172 263 -186 29 -88 94 -175 -315
1542 -315 143 -188 -183 -24 -44 169 -37 -17 -104 -96 165 42 275 119 -68 18 374 -58 178 -112 -358 103 -44
1565 -44 33 -286 -80 -94 39 -166 39 -81 -34 -42 -67 236 178 -147 -403 100 53 -36 143 40 55 132 -26 -139
1589 -139 -141 233 -11 169 -2 41 123 -139 -26 79 -170 36 -224 -157 45 -192 -59 -36 -66 6 222 -39 253
1612 253 -135 185 59 51 -26 55 -228 -102 232 -151 165 -151 -113 -149 -201 -80 -1 -139 -111 -87 -131 -10 -116 63
1636 63 150 130 -105 -252 -90 -98 -74 43 319 -50 -39 -93 -155 -65 -49 -8 57 94 64 83 30 76 107 114 81 -74 141
1663 141 272 -185 -122 -45 -64 -70 60 -30 -246 22 43 -102 3 -10 -54 -57 94 -50 -94 -3 36 75 -155 -127 -72 384
1689C84l89m2j59M07j60o9K89l8j81j27L09k42p1J7M4L4l8K02m01K20K8j32mR6
1713b3K45ol00M15p3p1n7j10P7p6K7j25K15Q0j98j21M5J94j96NL10q7j77J76r7
1738G2k36Q5O4k76n3L28RJ15k10K71j45nN8P9j77K8o9K77k81J19J76j35j10J10
1762I4j3l88N6J86J29q8o1j1K48j60K3l9j28K59n9n5J0j52K68l4j40K51k38O4
1786B2J89k83J4J05R1j6l13J1kL22j6r6q2mj86K31o2K57j46j34L0k62K34J63J06
1811A73J77j56j08l21L77k26J43j92P0q9KL38k09K15j42J47k29k9J85j36J90l27
1833a47R8K61j55k30L07k54Q1M8k28M37n7l48Q7M2K02l97L88j79j46K00j89K72
1855I3k41J12O4j51J44j05N6K09k93J60J8j07Np1R1j33R2O8j14J58J30k59Kj09
$$ plain form
1689 384 -5 -47 -206 201 41 -28 261 223 42 -85 224 -18 -89 -72 -28 6 -32 170 -231 -11 17 -115 -119 -23
1713 -23 222 216 -84 331 258 187 130 20 97 21 48 -77 138 218 20 -101 -56 138 -58 -53 257 170 -7 169 72
1738 72 -164 -79 -15 -291 -344 -16 -7 108 -102 169 24 19 77 156 -21 7 -62 215 -66 53 229 94 -16 94
1762 94 81 -307 -251 -65 64 -24 -85 -96 152 -8 15 -24 -152 107 48 -7 3 -149 119 85 -55 196 -42 22
1786 22 211 -72 -58 47 138 122 -191 -180 -182 140 124 28 -54 -58 -244 -13 -75 182 36 -98 -68 -330 -96 67 173
1811 173 350 194 86 -235 142 -84 59 -133 -63 -152 -150 188 -21 194 52 199 -30 -59 126 -10 180 -147
1833 -147 -49 212 57 -173 134 -120 -39 9 -219 218 161 -187 -100 -58 144 -253 135 -44 -190 10 -179 93
1855 93 -148 -36 28 -123 21 -84 -28 181 -112 48 66 -41 -36 -107 -16 -149 -57 11 -103 55 185 -74 -72 -181
1879a81J90J14Nq5j54K07j28j14K12r8m7k2L84k95n6m9L54k21M3j81J08j00K32
1902A18j26k5NQ9R1j87j33J18j50K73R8N8j75j17p1L30k16q5Q0j72N9m8J63J13
1926I0O2o0q0MJ5J19k27o9L06k87K66J78l62p6p9J41J03j2k44L63j51j11L6j1
1950h6r7K32J65P0l01N1L7k25J64r0J65rQ2j96pr7N0J02l9j91L75l7l57M51q6
1975A26q6j37K46m49N97j52j47j60K38k3p3j37M4J50j01k5q2J97n2j53N30k21
1997A30J37l18Q0J1j54K29j27Q1K0j49m9J89jk8K36k41K9j22j78L30k10J52j96
2020a49J28K30j33q7j89L9j19K23N9l2J12o3r4k4r9L07L8l58n0K76j6j34K9J88
2044H2n9k17K06N1L1k0k91L07j24J53l31J00P3o6J19q9J32Jqj05l8J28J86m21
$$ plain form
1879 -181 9 123 128 43 -111 96 -32 -146 66 -32 -79 -101 283 -12 -68 -117 237 16 59 -122 -14 -114 118
1902 118 -8 -33 -28 61 152 -35 -168 -50 -200 73 171 229 54 -63 -134 196 -20 -105 -25 -197 -138 -186 -23 90
1926 90 152 92 12 16 31 150 -77 -146 160 -127 139 317 -45 -121 -200 -59 44 32 -212 151 0 -111 -75 -86
1950 -86 -183 49 214 284 -17 34 71 -154 10 -80 85 76 158 -38 -45 -142 -92 10 -29 -220 155 118 -239 212 126
1975 126 40 -97 149 -300 297 145 -2 -162 76 53 -20 -157 -113 37 -64 -89 -171 26 -26 -179 351 130
1997 130 267 -51 29 40 -114 115 -12 69 89 -60 -109 80 79 51 287 46 75 -47 -225 105 -105 47 -149
2020 -149 -21 209 76 -11 -200 -161 -280 -57 2 -30 82 19 -75 -99 -198 109 147 -211 -261 15 -1 -135 -106 82
2044 82 23 -194 12 63 94 74 -217 90 -34 119 -212 -112 -39 -105 14 -75 57 58 50 -55 -93 35 221 -200
2068b00J72k94J80N8j7J98k46L6L42l27J62R4k13qJ6K43l94L60j32P7J40k97N8
2091Hr6L67j87j75J14m6J62p8J27l39N00m69J86j75L07j56N4O5m23L71k1j8L5
2114A13N2p0k40P2j2J6O2j88L47N5l30K79j87j36P0j16J38R8n4R9K6p6j58Q4n5
2139a11k54M21J10l82L65k19RJ00j06K15k37K00P2j42r8J12k92J00j0K43n5j13
2161g2r3L9K27j52M2m9L1J18Ml44K88k10J80K6Q3n2J44l59K00k18lL42j0K09m54
2186h3L26l48J82nj74r9L25j47o4J60j49j27L78j05M9p0o4J21j20J4r3K64j8O5
2210B18j56j93N7J59r0JJ8n7lj21K40p0K98m33J03J1J3j60J89oq3k25J26J04J60
2235A00r1n9J80j6m57K38J69j24J05k26M08M2l25K09m23J06O1K37j77p2L72m44
$$ plain form
2068 -200 -28 -322 -142 -84 -101 97 -149 -113 229 -98 64 158 -55 -63 -47 196 -198 162 30 107 247 -50 8
2091 8 -88 279 92 -83 31 -15 147 69 196 -143 357 -112 74 -101 206 50 104 169 -254 117 96 78 113
2114 113 165 95 -145 -73 -85 -69 -7 -195 152 207 -123 156 -31 -167 -97 -213 -75 23 -31 68 94 18 -140 -56 -111
2139 -111 -365 56 166 -216 149 -70 -61 39 -67 148 -89 111 183 41 -57 55 -237 -137 -147 96 41 -72
2161 -72 -165 -126 101 -51 -9 -58 -27 91 95 -249 39 -171 9 35 118 66 210 -149 51 -167 -170 172 162 371 -83
2186 -83 243 -105 77 72 -102 -201 124 -23 -87 73 -76 -203 175 70 119 49 -15 106 -14 0 -93 171 153 218
2210 218 62 -131 -74 85 -5 -4 14 -43 -46 -167 73 3 301 -132 -29 -18 -5 -165 24 18 -65 -290 -164 -60 100
2235 100 9 -50 130 114 -343 -105 64 -60 45 -181 227 269 -56 153 -270 -164 -103 134 -43 -115 257 -187
2257a87L01j7q6j8j46J12n8L50l02q4M8J45k04J90K07j58Qp5m2j48J53J46j02
2280C3K06l16K84l57k6L72n4r3j79L44j48j37o9M12j65j07q3L0j4r0L35m6l11
2303a79L33k26J12j95r7J68K0P4m6O3k04J91r9L91l89J68Lj61J77j19J26k95J65
2326a9r8J57l3K3j78q7M18m51K14q2L38P6k48K6j63K11j59O5Q4M5k36J88k08K43
2350A26o9j76R4n9L11n07K68k0J87n1j23k6J63j83J7J36k88K46J15q5l08P5O3
2373i4K18j61N2m1L90m91L01l66M69j52l63J99L23l10Nk23L10l29J08L21j72j80
2395a86K59Q1J66l22J62O5k85K6K14K8p4j99K21j26p2M7p4l0J48k73J64p2J26
2418fN4j43J02Om1K05l5k07J18j66P9K49j40k60K61nJ08j57M2r5p6m2J06M80q36
$$ plain form
2257 -187 114 97 11 -7 -153 -41 -99 251 -51 -135 -87 58 -146 44 251 93 101 26 -16 -164 -11 135 33
2280 33 239 -77 207 -150 -176 196 142 49 -130 214 66 -71 -140 272 107 0 -83 -53 -67 -157 178 132 -179
2303 -179 154 -72 40 -155 -252 -84 -64 10 -36 27 -177 14 -85 306 -83 85 88 -73 104 -15 111 -184 -19
2326 -19 -117 40 7 30 -148 -235 183 -268 -54 -136 202 278 30 56 -107 104 -55 10 94 139 -97 91 -117 126
2350 126 57 -119 -25 -84 227 -280 -12 -32 155 104 -19 -45 118 -65 -48 88 -200 46 161 76 -232 -157 -94
2373 -94 124 -37 15 -26 364 -127 174 -192 277 125 -238 -39 284 -26 -21 -244 66 -263 -155 166 -6 -186
2395 -186 73 154 320 -2 160 225 -60 -34 180 208 134 -65 156 30 -42 5 -69 -99 49 -224 -60 -132 -6
2418 -6 48 -95 7 13 -28 177 142 -65 53 -113 -34 215 75 -185 76 71 179 22 64 -31 -107 -149 -43 437 -399
2443c99M38L8k55L8K6J8l0N9p0m2M7p2P3K59P0j65K08l6n38L98p7Q1n1%N2l2m1
2470ck11K7J74l5k41J04j18K59N4L7l11M50j44k70L46j76j84M75m15R6J28m4o9
2493g1M4Q7k08J17q5J94k59L50r7J75l27O4N3j32K86l80j27M33j07K6Rk12K57
2516I0l9rj74K46r4J38j71q3O6N6j53N5J09J97j43K4qL5j06q3J63j26oK26k14
2541dL24l28P8j84K02Lp8K0j30J80J42l08K35k6L3r8J19k13k14K44M6j87j09K2
2565b31R5J95K6j98J91m9j4O1o8J27k29K82k43J2k00J97o8j58L72lj06K20j38
2588G3k5l30J87K64m05r9L28J86o2K09m59K8r2L34j69m8L51l85K58k62Q6M7o4
2611d9K19j74J45j14j92Oq2M21l33J62j5M4K93l70n8K34n10J89p3L64l8j00j26
$$ plain form
2443 -399 39 77 -178 -140 -114 -96 -126 -67 -137 -179 -132 -204 -131 128 198 33 241 205 -333 65 -12 69 18 18 70 38 -3
2470 -3 -214 -187 -13 -48 -289 -185 -303 -44 10 47 -264 186 42 -228 118 -58 -242 233 -182 -86 42 -2 -71
2493 -71 -27 60 -148 -31 -116 78 -181 169 72 247 -80 -16 37 -95 191 -189 -316 117 10 36 45 -167 90
2516 90 51 42 -132 114 20 158 -13 -96 -30 26 -127 -72 37 234 91 115 107 142 36 -47 116 -10 -16 210 -4
2541 -4 320 -8 70 -114 88 91 13 33 -97 83 225 -83 152 126 159 61 180 -33 -247 -3 43 -144 -253 -231
2565 -231 -136 59 85 -113 78 29 15 76 8 135 -94 188 -55 -43 -243 -46 -114 -272 100 97 -9 211 73
2588 73 48 -282 -95 169 -236 -335 -7 179 117 326 -133 -105 -197 137 -32 -80 271 -114 144 -118 -32 15 -49
2611 -49 170 -4 141 27 -165 -159 -241 180 -153 9 -6 38 331 -39 -97 137 -373 -184 -257 107 69 -31 -157
2634a57M70j15m1r0J27j24k67L59l71L27j59N2K7j59j96K14K92k57o9K45r0j68
2656a50J70J48k38N3qJ57m90N63l04K72K52m94M3J30o8O6O1j07k4j17J04j07K3
2679f5r2J76nk11J19J36j22J42j95J73j11J29J33k1L3k16j33L43k95J72l4k3r5
2702f2J85j52J78k35L19k42o9L0K3k03L50k70J77j69K44Kk39Q0J04q7K90l19Q8
2725B3j39qQ4n0K9M9k0K5Q6r7R1m1l65N87l14j3J50n5L38j99k72%K30Kj9l03L44
2752A43j28O8L9p8j75J5L09l01j03J28L20j42l7n0q6P4R4k51K01J03l18J58n4
2775g1q2m0K02J55j65o1Q5L0n0J56j74K0J71R5j74l36J32J8N8L1mJ3j06J68q3
2800a2k87M20N5m36L34j10J24l78O0K96K3P8q1j41L71m04l9K52L9k91R0K04k54
$$ plain form
2634 -157 313 198 157 67 194 70 -197 162 -209 118 -41 11 38 -121 -317 -103 189 -68 -137 108 18 -150
2656 -150 20 168 -70 -17 -25 132 -358 205 -99 173 425 -69 -26 104 36 102 163 56 32 -85 19 -88 -65
2679 -65 -157 19 14 -197 -78 58 -64 78 -117 56 -55 74 207 186 219 3 -130 213 -82 90 56 33 -62
2702 -62 123 -29 149 -86 233 -9 -78 -48 -25 -228 122 -148 29 -140 104 106 -133 -53 51 -36 254 -65 23
2725 23 -116 -124 -40 -90 -61 -12 -32 -7 79 -18 73 32 -333 254 -60 -73 77 22 360 161 -111 -111 119 121 102 -201 143
2752 143 15 83 122 44 -131 -116 193 -108 -211 -83 237 95 58 8 -78 -4 90 -161 40 143 -175 -17 -71
2775 -71 -153 -193 9 164 -1 -62 23 53 3 159 -15 5 176 271 97 -239 -107 -89 -31 0 -4 9 -97 71 -12
2800 -12 -299 121 176 -260 74 -36 88 -290 -230 66 89 167 86 -55 316 -88 -127 125 164 -127 -37 167 -87
2823h7P9J53k09J47p5j5R9j28K94j84l2RJ93l86K57K34l46P6j08m3p8K3K18K2
2847A13J22k31J29r7p8J80L5Q3k24RJ63l24J01m7j2j5K90n5k60J0J14j77J07j1
2871g5K1J02j64N2L17l88L0j3K4M2R6K66l01k58K19K28k22J53k59J0J05J49m5
2894H9K2j55L42m40L9R2Rj46L53l05O8j24K78l9q7M5m9np5O9k6MN5PQ2j63J8J93
2922A51r7K10k75j21R0J45k31K14k47L03j93k2J50j08q4J77K0M0n2J63j16n1q4
2945a8j76m9J46P3N4p7L9J04K3k89k1M0J25J4J30l54nJ99L4%o6K09k07J56k26
2970a42j40K08J5m2L18j08k1Q6l13K28p8K27m63L99k88k1k3L90k46L18k97J3M8
2993F8j56q5L54l30L06j32j30J96j75L3J45q3R4N1J30l09p3J13K5P4l56J92N2
$$ plain form
2823 -87 -8 145 -64 83 8 -7 92 -36 258 74 42 51 244 -142 115 349 3 79 -29 -72 -150 -127 91 113
2847 113 235 4 133 36 -42 138 173 256 32 41 204 -120 -19 -66 -78 -93 197 142 -118 -108 6 -171 -64 -75
2871 -75 -54 48 -116 -64 253 -135 -105 -118 -94 -52 44 310 9 -249 -30 198 -24 129 -130 -120 -15 134 89
2894 89 111 -44 298 -142 -103 -11 -2 -148 205 -100 -32 -156 122 83 -4 41 -8 -13 -88 -19 -45 -41 14 21 103 -60 -42 151
2922 151 54 264 -11 -132 -42 103 -128 86 -161 142 -51 -73 77 -31 -115 62 82 122 70 233 117 66 -18
2945 -18 -194 -243 -97 -24 30 -47 -8 96 119 -170 -191 -151 -26 -12 118 -236 -241 -42 -8 -8 -74 135 -72 84 -142
2970 -142 -282 -74 -59 -101 217 109 88 174 -139 89 11 238 -225 174 -114 -135 -158 232 -14 304 7 20 68
2993 68 -88 -173 181 -149 157 25 -105 91 -84 -51 94 11 105 156 286 -23 -96 17 42 116 -240 -48 4
3016Dj3OJ85k00M2L0k4k51J63Q2K72j74j07J16j31j19p6K57l46L28n5K28j08k27
3040a18L10K53o94L91j80n3J76J13l5j91l3J42l42L13q1k9J24j4K43j77Ojj01
3063B2K2j67M4q6L44k31j77P7J43J01k10K28n92J74O5M56j83p1k57M27k97J01
3085f7O9J60j20J27j66J7K20j53j57j65M61k99N4l3L17j96o6J20J31l61J80k63
3107a90L14Q0k09P5j17K03l72L56j41p6J89q0m1r3L6J69r3k22J94j55K87l29K54
3130C9m1j59lJ80q1L26m1j76j84L42j90j11K05J2k0j23j20J50J68j38l39L31r
3153A8Q0j50j54K23l42R0J64P8o9QJ93j52N7k5L85m38q2J15N2jJ34j94j69K38
3177E9N4j77K6P8J62j28k07K52k58J73j71K82j60r6O3J07M7l33K22J41q3j22Q9
$$ plain form
3016 4 -9 -3 182 -18 24 54 30 -221 -58 24 296 122 15 131 0 -119 -195 62 -284 44 -11 217 109 -118
3040 -118 192 445 -249 142 -38 -91 85 198 163 -28 -61 81 -261 52 -29 -58 66 52 295 118 124 123 22
3063 22 44 -123 -79 -165 179 -52 -229 -152 -9 92 -118 110 -482 -308 -243 213 30 -41 -298 129 -168 -67
3085 -67 2 162 42 169 3 20 240 87 -70 -235 226 -73 -19 -52 265 69 3 123 254 -107 73 -190
3107 -190 124 204 -5 70 -47 156 -216 140 -1 -77 112 32 -9 -102 -66 103 10 -212 -18 -173 114 -215 39
3130 39 -2 -161 -164 16 -65 261 220 44 -140 202 12 -99 106 118 98 -25 -145 5 173 35 -304 27 18
3153 18 98 -52 -206 17 -325 -235 -71 7 -62 -54 139 -13 44 19 404 -34 -116 -1 51 50 184 -10 -179 59
3177 59 113 -64 -38 40 202 74 -133 119 -139 34 -137 145 -15 -111 -48 59 106 -227 -5 136 53 -69 20
3200B0q5R7K40k68q8K20p7k36K00m07L22J24J80l54J78k79J48m1K24o3j81J46
3222B0K21l90K18j92Q4l7r9Q8K55l22M81l79r1J93l0L60j29j35r7P5j68K05J25
3245B56k40J37o9j66N4O9L21l51k80K17j21K04J33j9kk47K27j20Q3l58L04O3N5
3268A50J92l27j13n1J79n5J55k43j2J76m5J28r0M1j60L1J06j17L02o00N19M5k09
3291BO1N2j24J93j17k20K11j77L67j67J39l83Q2K11n9j5L2j65J92J70j48j75m0
3314g8J21J34j75J5J19j17j50j54J30N2M9K73k32J27m08MK31O9j34K36J69l99
3336a18J58J30l17J44J54P4%j23p2L0j52K0K07j97m8j39J51K87k26j13L83l46
3358a13J9K21r7J42q4j43k09L61j78j11PK47o3k60K78J08n8n7q0q1L02j66J62
$$ plain form
3200 20 -65 32 272 4 -84 136 59 -177 23 -384 -62 62 242 -112 66 -213 -65 -106 118 55 -126 20
3222 20 241 -149 69 -123 -39 -76 -175 -87 168 -154 327 -52 -143 50 20 380 251 116 19 94 -74 131 256
3245 256 16 153 84 -82 -28 41 362 11 -269 -52 -173 31 164 145 143 -104 123 3 86 -272 32 95 150
3268 150 342 15 -98 -149 30 -25 130 -113 -125 51 6 134 44 85 -75 -44 62 -55 247 -353 166 211 2
3291 2 63 115 -9 184 67 -153 58 -119 248 81 220 -163 -81 130 71 56 88 -77 115 285 137 -38 -78
3314 -78 43 177 2 17 136 19 -131 -285 -155 -103 -54 219 -13 114 -294 -290 -59 10 -124 112 281 -118
3336 -118 40 170 -147 -3 151 225 225 102 30 60 -92 -72 135 -62 -110 -249 -98 189 -37 -150 233 -113
3358 -113 -94 127 30 172 88 -55 -264 97 -81 -192 -185 62 -1 -261 17 125 67 10 -70 -151 151 -15 147
3381A47j86j6l4K89k30j14J94j59O5J58O6k62J64q0k4J63J18l03k12J49k1J60
3403C2J49j17L7k50r2M77k21O7l5p6R6j73J47Oj35L7L53n26N1J27q3P0j1R2O0
3428H2L0K0k82n8K81j36K71q8j21m2j77M0J28N6O9k15J99j25J01j90K45l03K66
3451E1j84L34k60J14r8mO6J99j59n7K5j34P8R5j21J7J34j0J57l88K30l5K48j71
3475A27qj02K9p9k7P1p7l3J06j8J4k8p0J73j44J53k3l5J79l35lK37k82lN0L34
3501B06jl30K29j75J62m9J50k36J43p2P7j80K09K21n73M14j50j18K28k68L70l92
3523a35L3J57j27j03J34K48l41J20qK05k52K16J42k60j69J01L57j31j97r6j8L75
3545B51m95K72j2O0j25O5j11L71r8k67Q0Q1J3j6o7J11l2M8j70q5K7J85O6j76J28
$$ plain form
3381 147 -39 -55 -89 200 -30 -144 50 -109 -44 114 180 -82 82 2 -22 141 259 -44 -256 -107 -128 32
3403 32 181 64 101 -149 -241 236 15 82 47 -29 67 -106 41 47 -88 -51 302 -224 -173 -46 -129 -59 -70 22 82
3428 82 112 132 -150 -208 73 -63 208 120 -1 -43 -220 -180 -52 4 73 -142 57 -68 33 -157 88 -215 51
3451 51 -133 201 -59 55 -43 -47 19 218 59 2 27 -107 -29 66 -55 -38 96 86 243 -145 85 50 298 127
3475 127 119 17 46 -33 -60 11 -66 -99 7 -11 3 -25 -95 78 -66 87 64 29 208 -127 -130 107 -175 -178 -128 206
3501 206 205 -125 104 -71 91 42 192 -44 99 27 104 -76 133 354 -219 195 45 -73 155 -113 257 -135
3523 -135 -102 55 -72 -175 -41 207 -134 -14 -22 183 -69 147 289 29 -140 -39 318 187 -10 -106 -124 251
3545 251 -244 28 16 76 -49 16 -95 276 178 -89 -9 72 85 69 2 113 81 129 -41 -126 -99 86 152 -24 104
3570A04p4P8j72Q1p7k35N66j89j74L92l85o4N8n0K43K31k95l25N35l86j2J90J94
3593B34l58J29Q7j36n9K02J02o5p5j65J87j3j36nO4pj36K56j95K02k22J06m3l1
3617g7J9p5J97j6k84J57J66j05J22j26J65J2J04L0l16OQ3k46L76k72M0j45J75
3640a0J73j11k25J06L5o0J51j42J89j51J64k75L10J28l48j64J42Jk80O78j87Q6
3662B10o5l32J96N2j42Lk01J75K9q0K80k32R5k79K79J19j43P6K55N8m00N1k08
3685b04J71J0m1P2L9j14L49n79P3M12l4k60J01j82J12j12J75J00p3K9j6J4k58
3708b16J94j17J11l7p2P3J94l67M05m72K85K44N6l58LL09l55P6j14J93Jl2m90
3731d86K64J36Jn1K88k53J89J97l86J42j81kM7K07p9n2j12J30j99L6K53l8M0j23
$$ plain form
3570 104 30 108 -64 17 -60 -295 271 82 -92 300 -85 -149 -91 -141 102 333 38 -287 248 -138 -150 40 234
3593 234 -124 5 92 -44 -103 99 201 136 61 -104 83 70 -66 -71 -7 -14 -150 106 -89 113 -109 -3 -46 -77
3617 -77 -58 -133 64 48 -236 -79 87 -18 104 -22 143 155 259 289 -27 -21 62 -184 192 -80 -40 -185 -10
3640 -10 163 52 -173 -67 -32 -92 59 -83 106 -45 119 -156 154 282 -66 -230 -88 -87 -367 311 124 210
3662 210 145 -187 9 61 -81 -78 -279 -104 -75 -155 125 -107 -12 -291 -12 107 -36 40 295 353 -47 4 -204
3685 -204 -33 -23 -64 8 47 -67 282 -297 -224 188 154 -106 -5 -187 -75 -187 -12 88 15 44 28 42 -216
3708 -216 -22 -139 -28 -65 -137 -64 130 -237 168 -304 -19 225 281 -77 -74 235 -120 -44 -158 35 36 4 -486
3731 -486 -222 -86 -85 -136 152 -101 88 285 -101 41 -140 -142 -95 112 33 -19 -131 -1 -200 -164 89 51 91 -32
3755c2R2j85J13lK69n71L77Ll0o8rL4j78L10k84K94m68J81M9p7L25k22R2J0%K9
3781E1m56L70j28J82o9K1O7R2j8o6K3J38k82M80m83J46k6k04J08m0o6L56Mj66
3805C4J59p3M6l36K57J11k27J55j43J19j36KJ53j80j46K23J0m5J01j51J74k03
3827i6J37L8j61J77J26j38L7k93K32ok47OM14k44m6J24l34L06j52J25R3k29rP6
3851f4M1Q5r8J57K88n10j89L04Q4k5j3l1LO0l04K67l84K68J55j45L6j24J60K6
3875D7n6K48k37j03q6J03L52k95j2K40l08J06j05M3K94l92J17J77j48j16m0K19
3897D8K3O8p2p8j97K90J76l34RK68m43K86J25k26M00m80L24j88K37l62N6J84k49
3920a35P4J2K58m25L23j61L18k28j41J30q4l1n2L01k54k65N35Jk89J22o3r1K69
$$ plain form
3755 -32 60 -125 -12 -15 254 -317 60 63 33 -35 -44 -10 -188 122 -162 132 -336 -155 -106 -183 142 -80 12 22 22 51
3781 51 -405 -35 -163 19 -50 -29 38 130 112 46 69 207 -75 405 -78 68 42 -162 -54 -94 -160 196 200 34
3805 34 193 120 166 -170 87 198 -29 126 -17 102 -34 -32 121 -59 -205 18 28 -17 84 -67 107 -96
3827 -96 41 79 -82 95 221 83 120 -173 59 53 -194 -188 226 -18 -64 60 -274 32 -120 5 98 -131 -140 -64
3851 -64 -23 62 -36 121 409 -101 -290 14 98 73 60 29 32 92 -212 55 -329 -61 94 -51 -15 -139 21 47
3875 47 -9 239 2 -101 -187 -84 268 -27 -39 201 -107 -1 -106 -63 231 -161 -44 133 -15 -131 -171 48
3897 48 71 139 67 -11 -208 82 258 -76 -67 201 -242 44 169 -57 343 -137 187 -1 236 -126 -70 114 -135
3920 -135 -61 -49 209 -216 107 -54 264 36 -105 25 -59 -90 -142 159 -95 -360 175 176 -113 9 -54 -145 124
3943A24m41K58L8j93K76J40n2l67J4O6K23K14j96p5j05p8M04n2k25L5P9k0j8k12
3967a63K53M2j79j62R4K06k07K78r1k43N5J16K58j50R9l38K27k80K26k48o4k3
3989b94K71J51k63M3k35L67j16j01K71J06k83J31j41j49M10k29N5O2j92p6K52
4010D0oJ14r4j42K29j24O1k52L81k18J1O0J33n6j29j67J74K5j90J68j39j17O4
4033a74K18j8r7r2K90K4m93J69l7K43K53k48p3J18Kk10J09m8N0K1Mq9r5L83j26
4058H4J9k88M9j6O3K55K8j69o8p0M5p1J34J26k26l7J54j70J60kl3J4K13m58Q9
4083a75j10K90l4J10n7J74j90J02k0K02o8l35L04j94O9M8k81J77N6j12k6r3L64
4106B01m02J29J23k5k54L48RQ1k89mK67k45K62n8m3N4l9k66L24k89J76j95r3K55
$$ plain form
3943 124 -317 -59 -21 -214 62 202 150 -217 -203 -137 86 300 104 29 -76 -154 250 198 -27 8 87 67 49 -163
3967 -163 90 132 -47 -209 -115 91 -116 162 71 -172 -117 -1 257 107 206 -132 95 -185 41 -207 -271 -294
3989 -294 -23 128 -135 -92 -327 40 -76 -177 94 200 -83 48 -93 -242 168 -61 -6 56 -136 -212 40
4010 40 34 148 54 -88 141 17 78 -174 207 -11 0 60 193 137 8 -159 15 40 -150 18 -121 -238 -174
4033 -174 44 26 -71 -163 127 151 -342 -173 -210 33 286 38 -35 83 85 -125 -16 -64 -14 7 11 -78 -173 210 84
4058 84 103 -185 -136 -152 -89 166 194 25 -43 -113 -68 -139 -5 121 -105 -142 12 -158 2 0 -33 -19 194 -264 -175
4083 -175 -285 5 -29 81 24 198 8 110 90 292 224 -111 193 -1 68 116 -165 12 68 -44 -70 -163 201
4106 201 -201 -72 51 26 -228 120 129 210 -79 -83 184 -61 201 143 100 154 115 -151 173 -116 60 -135 -228 27
4130B7j47j51J16R2J07l2L2j0O2j36O7q0J85kR0l27R9j36K12n1J08n1O8J09k24
4155B7j37K21k9j23K79k62R6J74j17j64Q3qJ86l17K63j13No2J0R8l75K25l9nR4
4180A0M6j9N1j00L9Q0p1J54m47R2L96j97j02Q5j04N0k08L49j92nM5Q0j46J6N6
4205d2Q8k33K39k7n5J69j24j3J02j31o7R9oq2J93J70k46p1K5l05L77Po8O2K05
4230B66l75K40j72lq0K90q3l04L8r8L41j94Q5o2K34j84q8O08l43k21M1m1J43j9
4254A9k3J03n0p7j45L6M06l60J44J49j00l1j01J38k25J80j61J36O3J88m17K57
4276A29k12k9J4L4P3j05q5J86p8Q2O2j66j0o1K47k5j9k67L6J60J31j52N3J05o9
4301C4p4j37M72l53R1R8m08j23M15j28JL23m36L28J84k45j68M13k50q5J79k58
$$ plain form
4130 27 -120 -271 -155 -63 44 12 44 34 96 -40 27 -53 132 130 220 -107 -8 -144 68 17 125 74 142 251 27
4155 27 -110 111 82 -41 238 -24 72 246 129 -35 48 40 226 -91 172 59 64 2 12 110 -265 -40 -79 -84 10
4180 10 56 37 88 -12 27 107 36 190 -257 -165 231 34 -68 17 -87 -37 -245 104 -88 -93 -48 32 -114 -98 -42
4205 -42 46 -187 52 25 -30 139 15 2 104 -27 -94 5 -1 -83 110 280 34 -37 -12 -317 60 67 -1 61 266
4230 266 -109 131 -41 -44 -124 166 83 -221 -183 -281 60 -134 -49 -111 123 -61 -149 459 116 -105 -64 -105 38 19
4254 19 -4 99 49 -28 -173 -137 269 -91 53 202 102 71 -30 108 -117 63 -98 38 101 289 -128 129
4276 129 -83 -112 -98 -64 9 -96 -181 5 -73 9 71 -95 -105 -166 81 56 37 -230 -194 -34 97 -55 -2 103 34
4301 34 -40 -177 295 -58 33 131 -277 -400 15 -113 -112 211 -225 103 287 42 -126 287 37 -48 131 -127
4323a27j75K57L4Kk46K24J25j31n4L6r7M7L61m29M61j79j30j13K44j54J18p9k8
4346c3pj00J12J6k0K32l34J46J0K5Rp0J63j27R7j59L21j94j51P9k7J91j47k12
4370a80J66Pj0p6J34O2J57%lk35M5K7mo9L0J61l31K90p8n9K27j18o0l7j21k32
4396c07M36j42p1L2pkJ5j33J57K31j40o5r4J72J69m60K02K51j67M4q2rj49J40
4420B1Q4K3k76J57j3KK00k93K1R3Q8K4j27J39j66R8j25k03J12K58j27J93k85K64
4444A62q8n7m3J0m3J29L2m03L53J39k38j7QO6n4j32P2J35j60J19RJ05K4l76L32
4469H4j9o9J16j94J15mo4kj96J53J13j9J83k45J01K20n51K74J26O6j36l9L4k12
4493a65K28J64j24k1j61J5K69j21M6j07K05j48o2j11j13J02k6J65p1n2J14p3K13
$$ plain form
4323 -127 -302 -45 -11 -9 -255 -31 94 -37 -91 -55 -152 -105 256 -173 288 109 -21 -134 110 -44 74 -5 -33
4346 -33 -40 -140 -28 -12 -32 200 -134 12 22 47 56 -14 149 22 119 -40 281 87 -64 15 -12 179 32 -180
4370 -180 -14 -7 -17 -93 41 103 260 260 257 22 67 94 90 21 51 212 -119 171 93 34 261 143 83 46 -75 -307
4396 -307 129 -13 -84 -52 -59 -61 -46 -179 -22 209 69 4 -90 82 251 -209 -7 244 77 121 39 30 -119 21
4420 21 105 128 -148 9 -4 -2 198 -95 -74 19 107 131 4 143 -23 75 -50 -253 -141 117 -10 183 -102 162
4444 162 74 17 -26 -16 -59 70 102 -301 52 191 -47 -64 -56 10 -44 -176 -104 31 -129 -10 -1 104 128 -248 84
4469 84 65 -4 112 -82 33 29 -35 -37 -233 -80 33 14 197 -48 53 273 -278 -4 122 188 52 13 47 -165
4493 -165 63 227 103 82 -79 -64 205 84 130 23 228 80 18 -93 -206 -104 -130 35 -36 -88 26 -47 166
4516A66M3j24m2q7J80L0l57K61n5N7k48J78N1J84k20J45r0L4r6k3j00J13j07J24
4540A7j18j85M35m3K1P1j39J5K7M4k16M13n59J60N6j57L08j30r4l6J66k03J83
4563C6K13j54j97N8k0R5q7R1N0j01r9L35j70M9R1k34%M1J9r1P5n4K72J6k99J84
4589A19l6P5J3k36M07k90q8qJ5j13L02k56l2K68K3k09j71K74k75K02M3j21K62
4612A68l22j0J76L16k81L2r2k00K33k25L53J48k65l30L18N2k05K19J2k74L23k17
4634g1R2J16j45K6LJ90j18p4j74K72k05J17M7R3k96K41k5l04Q2p7J64J74R7l15
4658i0K37r7j86L25M1l06O1K8j80J27k1j27P7P2p2J81j52K00j22n8L16m22p5K57
4682A4K03m07j33L07m6K24j95j11K05j31R1J56j36m2N5k34K88k12J06oj57l2L10
$$ plain form
4516 166 209 85 43 -44 136 166 -191 70 15 72 -176 2 53 237 17 162 72 106 10 -13 -113 0 -107 17
4540 17 -101 -286 149 106 127 198 59 74 101 145 -71 342 -217 -57 -1 -158 150 20 -74 -110 56 -147 36
4563 36 249 95 -102 -44 -64 31 -56 35 85 -16 -115 220 50 99 190 -44 -44 -3 16 -75 0 -54 218 234 -65 119
4589 119 83 158 171 -65 342 52 -36 -44 -29 -142 160 -96 -128 140 163 -46 -217 57 -218 -16 27 -94 168
4612 168 -154 -164 12 328 47 79 -13 -213 20 -205 148 296 31 -299 19 71 -134 85 97 -177 146 -71
4634 -71 21 137 -8 18 21 211 93 19 -155 117 -88 29 76 169 -127 114 89 -215 -133 -210 -46 128 225 -90
4658 -90 147 50 -136 189 230 -76 -15 13 -167 -40 -61 -188 -111 -39 -111 70 -82 118 -4 -62 254 -168 -243 14
4682 14 217 -190 -323 -16 -62 162 -33 -144 61 -70 21 177 41 -1 54 -180 108 -104 2 -4 -161 -193 117
4705A17j49J63j45J6L7K39J8m38K04p7L01j48j86L88l12R7j90j46K48n6M31om38
4728c2j39J61J6J48k55r1L41k03P2M6K30l3l19j04K14M8j77R7P0k25J07j16R8
4751d6j5J69j55J36j03lk56l4L40l8o8K80l01j05K36k03R4J72j21k03J42J23L9
4774H0J3j57L0R6j93R0K3J36k40K05K10l09O0R9P0Pl10J71j50J36k27K17j70R1
4798b2j27n1J17K19k06J67k67M8J52%L5k73J18N2J58L5k17P3j12M52j40k79q0
4821a48K9L21k14J12K4J5k30J04Qm9q5R7J93j10j63N7p0p9K01o3k0K62p6K4o1
4846G9J65q6k9l65L39j55K85m52M94l41J25J7R7r1N9k14KJ87m17K47k34J86J1
4869i1p9P1P1R7Qj19JJ6J87l48J56m6J70j05q5K47K03n66K11k18P3K29k56K36
$$ plain form
4705 117 -32 131 -14 2 39 278 296 -142 62 -15 286 138 -48 340 28 125 -65 -211 37 -19 412 406 -32
4728 -32 -171 -10 6 154 -101 -192 149 -54 18 64 294 261 -58 -162 52 100 -77 20 90 -135 -28 -144 -46
4751 -46 -61 108 -47 89 -14 -17 -273 -307 33 -5 -73 207 -94 -199 37 -166 -72 100 -21 -224 -82 41 80
4774 80 93 -64 -34 62 -131 -41 -18 118 -122 83 293 -16 44 143 213 220 -90 81 -69 67 -160 57 -113 -22
4798 -22 -149 -200 -83 136 -70 97 -170 -122 30 30 65 -208 -90 -38 120 155 -62 11 -101 351 211 -68 -148
4821 -148 -119 202 -12 100 124 139 -91 13 21 -28 -113 -16 177 67 -96 -39 -109 -188 13 -50 -70 192 116 140 79
4846 79 244 158 129 -236 103 -52 233 -219 275 -66 59 76 173 82 141 -73 -71 116 -301 -54 -288 -102 -91
4869 -91 -170 -99 -28 69 77 -42 -41 -25 162 -186 -30 -76 94 -11 -96 151 354 -212 -1 -219 -146 83 -173 63
4893F3k05J38O7J01p2M5j77J12j6r0L04m05o0J90j80J32K4L6J54l29J50J29k67
4916a56K63p1J65k08K54k73K3J30k6k15J99j15K15k42M0O1j36J89J04j89j29J92
4938G5Lk03nJ14J84l6l20p4L8K72K7n23L76J4r4J46l7o7L60l58J50k3k5K13l23
4963a16L1j8M5o7j31K21J14O5k43O9m6j12K57J60k23j36J61J9J5k30L32k14J35
4986H8k2k12J54J77j22O7k62M0J90k3k21L03m17K05n0O9P4j41K76m68L17o9j02
5009a49k63K91J50k84L15j83J03k0L8M1J69k51K23k12J64j20n2L9n7J23lr5J78
5032A45p5j04Q8J11l71K44k5j15j20J96j76J95k56J30O7J51p4l46L73Kk07J66
5054aj55L29k3p6pj13l1l8K2q1J0J83L50k90l2l0k7O0r0J77o9K24j80j23r2L39
$$ plain form
4893 63 -142 -4 63 164 92 137 -40 72 56 -34 270 -135 -195 -5 -185 -53 -29 7 161 -168 -18 111 -156
4916 -156 107 36 201 -7 247 -26 -3 127 101 -114 85 -30 185 -57 -17 44 -92 97 201 12 -117 75
4938 75 78 -125 -130 -16 168 132 -188 -262 -224 48 75 -448 -72 -58 -152 -6 -43 -110 250 -108 42 19 -6 207 -116
4963 -116 -85 -103 -58 -125 -256 -35 79 144 -99 -30 -76 -188 69 229 6 -130 31 50 65 -165 167 -47 88
4986 88 66 -146 8 185 63 130 -132 -92 98 75 -146 157 -260 -55 -105 -36 38 -103 173 -295 22 -47 -149
5009 -149 -412 -121 29 -255 60 -123 -20 -40 -2 39 208 -43 180 -32 132 12 -40 -1 -58 65 62 -33 145
5032 145 70 -34 54 165 -206 38 13 -102 -222 -26 -202 -7 -263 -133 -66 85 11 -335 38 40 -167 -1
5054 -1 -156 173 150 74 67 -46 -77 -115 -93 -174 -164 19 369 79 47 17 -10 50 -40 137 68 292 112 -11 -103 236
5080B36j83K2R3j49qK6J7nJ33l74O9N9o0P6K23l91J97j59J18k5J53q7K06j26Q6
5105A47j51J38j28J76k16J42k09Q8n9K16j17j5L9p9J14j07J49j69N9j87K62l08
5127b15J93l8l8j97K57O7j50J20K49k74J62j28J14j29l2k71L90p6J54N5k23l80
5149c90M05r6k5J38p1j48J44j2qK02j71J00l9l2o4j88K52k06J04L5kJ23k50P4
5173a25R3j9N6k71K20o9J58R4k10L84j78q5J91j14MM2j01k6j3M4J39k32K33l19
5197a04J17k70K93l0k2N7J82j62j80J54k06K72k04L5J78m7L7L4j1k72K6j97N42
5220B22j84n2N7j87J04j62J3J1K70K0p9k03l2L91j70k23O6P7J11j84J33p5O4J34
5244A22r9k37K86o0Lj20J40R0j40j42O6J32J19k39k54J98L42j82L4l8j17j00j
$$ plain form
5080 236 53 75 168 19 11 37 54 49 182 -192 -123 -64 -124 -48 175 -216 -19 -178 -60 -85 68 -19 187 61 147
5105 147 -4 134 6 182 -34 108 -101 -13 -72 144 27 12 51 -28 86 -21 128 -41 18 -169 93 -215
5127 -215 -22 -60 -98 -295 -38 29 -121 -1 248 -26 136 8 122 -7 -39 -310 80 4 158 213 -10 -390
5149 -390 15 -81 -106 32 -39 -187 -43 -55 -63 139 -32 68 29 -3 -67 -255 -3 -209 -105 -70 -72 51 -199 -125
5173 -125 -32 -51 5 -266 -46 -115 43 137 -73 311 133 48 239 125 129 171 70 44 31 75 214 -18 215 -104
5197 -104 13 -257 36 6 -16 41 223 61 -119 35 -171 101 -103 -68 110 63 100 134 123 -149 -123 -320 222
5220 222 38 -14 43 -144 -40 -202 -189 -178 92 112 33 -170 -202 189 19 -204 -138 -61 50 -134 -1 -76 -12 122
5244 122 23 -214 72 12 15 -105 35 125 -15 -157 -91 41 160 -79 -333 -135 207 25 59 21 -96 -196 -197
5267a97K14J1J19KQ4m37K49%j57K08j51K66l12M5o2J76j91K8J7L4Q8k72K54q0
5291f4L09n81K12Q4o7L3O1J90j85j79n3L83l10J72j80lP6k99M34L1l37M27J35
5314B89k54k65K25K05K4l98K07O0m5j30j21L13K9l3o0L6m6r0J85k22K12R9r2l18
5338a90K81l00K75j12o7J1L00k12OK2j7K61k58M4j2j2p8j36J90p1R1j84q6J50
5362a04R5k03L43r8j80K45m2j54k17N88j74j64N9K14k44J30k86J67k17L83K1k17
5384e5J60k00J63j93R8Q%q7K1K80l00J9J22k21J77O7J07k18R3K77m38N1k06L42
5408F7J17l30J41j9p2j13K87m6J90j4l96M30l75K52j92m7K06j74L6J72p0j6k07
5431a73L11R9j32j92P6K35k9k48L6j03K04m9l38K91Kj0K16j14k13J05J41J54l11
$$ plain form
5267 -197 17 28 147 149 233 -204 45 45 -112 96 -55 211 -101 -56 -118 58 -133 -105 -88 -54 34 -238 16 -64
5291 -64 245 -336 -124 -40 -107 -74 -13 177 -8 -187 -240 143 -167 5 -175 -178 -102 -401 33 64 -273 154 289
5314 289 35 -230 -5 200 224 -174 33 93 48 -82 -203 110 139 106 46 82 36 -54 131 -91 121 220 128 -190
5338 -190 91 -209 66 -46 -113 -102 198 -14 -8 14 -3 258 0 44 32 20 -58 -194 -4 -75 16 -168 -254 -104
5362 -104 -9 -212 131 33 -147 98 56 -98 -315 273 99 -65 -6 208 -36 94 -192 -25 -242 141 162 -55
5384 -55 105 -95 68 -125 -27 -19 -19 -106 -85 195 -105 -86 36 -185 -8 59 166 -52 41 318 -120 -69 -275 67
5408 67 184 -146 -5 -24 -96 -209 78 32 222 208 -188 242 -133 119 -73 -120 86 -88 -52 120 50 34 -173
5431 -173 138 237 105 -87 -11 224 195 -53 -17 -120 84 35 -303 -12 -10 -20 196 82 -131 -26 115 269 -42
5454d2j83L54j64J00j75J58L6j23K08k53J03J61l93J05L50k11k76K38j02K72j0
5475A53l0k72N4K12l86K23K41j59m7j3j44K84k14L4P7k74K02J51m1l04L16k82
5497b19NL76l34K89j6k39L25l89N1K52j94o3L19L12l56rj12J50j62n8j4L21j69
5520F6k01L40m75L74j58J17k39k4L68l92J77j18J65J78l40L08m12K40L25l18j97
5541b16J6j80M08l1j30K81j45j91P4J59p0L6j33J06k34L73p7j54K13k57L01k35
5563h6k10K12l70L10RJ98J38k22r7Q8j05K91l4k80K35j42K95m79M63j18o4J03
5585A35j25r7O9j8K88rr1p4J7R1j63o0j67R7J99N7k39PK86q2j18j11o2N9K39j86
5611e8oR0L7j1k5lJ4k02K92m46J52p2M5J55K3o2K52l40L54Kj28j98M6L12j21O8
$$ plain form
5454 -42 -225 129 -35 65 -110 48 84 -39 169 -84 19 180 -213 -108 242 31 -245 -7 -109 163 153
5475 153 123 -149 -95 117 -269 -46 195 36 -11 -24 -168 116 -98 -64 13 -261 -59 92 51 -253 63 -219
5497 -219 -214 162 -172 117 101 -138 187 -202 -151 101 -93 -156 163 475 119 110 -2 148 -14 -72 -86 235 66
5520 66 -135 205 -270 104 -54 63 -176 -200 168 -224 -47 -165 0 178 -162 146 -266 -26 299 -19 -216
5541 -216 -200 -380 28 -3 -133 148 3 -188 -114 45 -25 11 -122 -16 -250 123 46 -108 105 -152 149 -86
5563 -86 -296 -84 -454 -144 -135 63 201 -21 -118 -30 -135 156 122 -158 77 -65 230 -249 214 96 32 135
5585 135 10 -87 -18 -36 252 243 152 78 95 186 23 -37 -204 -107 92 149 -90 -83 203 121 3 -108 -170 -111 128 -58
5611 -58 -64 26 63 52 27 24 38 -164 128 -318 -166 -238 -193 -38 -15 -77 175 -165 189 191 63 -135 -89 223 102 170
5637A70r5Q0j74mK61l01j57J23L8j13j23N68j62j07N5K2Ok42L11j98KMJ23M3K8
5662A58J43n7l10j09J61oo4J56P5K0o3K20m47M9L2j39J12n1J14M1j47j14M80j04
5686A50j6q7k21K58k04M5J24l05L49m4J24j64m69M53JL7jN1k70J94j23K8j28K53
5710C5n2j8Q5k06O5J33k3p3M27J33m51l6k10M4K52k49R1J17J17p6Q5l48J05k33
5734b86lK19P2j41M1J64j61K60j89R0K5r7r0j11K4K34n1R4J29j23L8K8j65j36
5758a35Q2J02k4n5kj93J05M23k89q6R0J86j66k01K74k60J34J68j16j02J2oQ8J09
5782A38q3O4j29R8K2J31m19J08J22Ll67J98J07L82n82j6M05j35J20j60O5J24k35
5805c9k6J99K6j32J6l7l46O46n11K35lk5Q8N1k02k56M26J4j77J7K42j2l62L36
$$ plain form
5637 170 75 155 -19 -23 238 -63 -220 -97 -59 -172 -295 273 111 4 59 81 87 -155 156 -42 -40 -36 87 130 158
5662 158 301 244 -66 -175 -14 -20 -84 72 147 167 104 324 -123 -74 -42 -181 -69 -120 -6 35 -112 -226 254 150
5686 150 134 47 -174 84 -120 -75 49 -256 93 49 173 9 -460 -7 -6 31 30 81 -189 5 -118 -90 -218 35
5710 35 -17 -35 50 -156 -91 42 19 -54 373 506 55 19 -191 -147 105 -144 -53 64 181 105 190 -158 -53 -286
5734 -286 -289 -70 2 -139 -98 66 -95 165 -24 66 91 -6 -96 -207 -183 51 0 94 223 100 138 166 1 -135
5758 -135 -53 49 25 -30 -32 -225 -120 303 14 -72 18 204 38 -163 111 -149 -15 153 37 -65 -53 -59 29 138
5782 138 55 119 -10 88 110 241 -178 -70 52 55 -312 -114 -7 375 -207 -223 182 47 167 7 72 196 -39
5805 -39 -65 134 160 28 44 7 -339 307 -204 31 28 3 91 142 -60 -316 110 124 -53 -36 206 194 -168 168
5829A68j28m2K34j86k5R3O0l69K1M26k57m1N3R3k50k12M62p3J30K03m54J45k8
5852B3j38m5L62k40l0J14j51L1J64l6k7j77L43l67L18k23o0J69l7J85R6l16j1
5875e3J80J20k20j84L1J96Qj28J89q9o9N7R3j10Q4j60J68K8o4m6k39Q3q1J5J05
5900h6J20O4Rk06K82j06O5j74L4q5K21J40j89qJ55k19j34K00j54P0k31L93k27
5923f6J70k21J01K7m7J3M1J63j51Q0P6j75M1Kk16K6K85j67J18M5l37K14O5j25
5947c8J12K2k74O5j22N76l48q5n5J13KL1M9M8M9n07O40o3j30K4r8K06j43p5K8
5972B7k24K12L71n80J28K8n6R3J07k18J69j52J1J54j20K05l35M38l90M5k1L3K79
5995B04k29P0N2K5J4p0J74j05k02j0L17j05l9m0j19l4J50k7M3K5q9J09k62K90
$$ plain form
5829 168 40 -2 232 46 21 114 174 -195 -174 252 -5 -46 7 100 -150 -362 100 27 157 360 -94 51 23
5852 23 -115 -160 202 -38 -68 46 -105 -74 90 54 27 -150 193 -174 144 -79 -139 30 -7 178 274 -42 -53
5875 -53 127 247 27 -157 -126 70 78 -50 139 50 -19 38 131 21 105 -55 113 141 77 31 -208 -125 -206 -191 -86
5900 -86 34 98 107 -99 183 77 142 -32 2 -83 138 278 89 81 236 17 -117 83 -71 -1 -232 161 -66
5923 -66 104 -117 -16 11 -36 -23 18 181 30 110 186 11 52 54 -162 -136 149 -18 100 145 -192 22 87 -38
5947 -38 74 96 -178 -113 -235 341 -7 -92 -147 -34 -32 -1 48 96 145 -362 278 215 85 109 11 217 74 -1 27
5972 27 -197 15 386 -194 -66 -38 -94 -1 106 -112 57 -95 -84 70 -50 155 -180 258 -132 -87 -108 -75 204
5995 204 -25 45 97 122 136 66 240 135 -67 -77 240 135 96 56 -63 -97 53 26 69 94 5 114 -148 142
6019A42K58l96MJj60Q3M6L4O7lJ03j38m9j30O1J85p1j70J6J00j45K15k72K45k13
6044a87J72j51J9p9K60l12K20L1O8P0q2k46L51k59K45J01k93j02K37k45L51j12
6066E7k58L22j12P5J96q2k30j7j43J64M3Q1o8J54k78P3k9O9L5r6J09K2m3o1n6
6091g3J33J17L9m12L40j15Km6Q9N2k48Q2J8q6l3J98Mql1j02PN6j18J96r0K77l91
6118a43R4J47k98K16j62J22J10k69K89n3r9j24O8R9J36j65p0n1L21k09N3J51m26
6141b63M75k49J39j68j86J80l3J73j34O1J75l62K26k43K03J07M9k46J24j10J23
6162D1j2n0J33n0o7k03O3j18pL48j69OJ0J43p6N2J85j97o7R8k70M7J92M1l24K65
6188A4j45Q3K95l44j46M41j55j41R5n7O8P4j14m3n5K91j72J22N3k06j5J73j43
$$ plain form
6019 142 400 4 8 9 -151 -68 -22 12 79 76 179 41 -8 -138 -77 108 37 -133 -117 -17 -162 53 -219 26 -187
6044 -187 -15 -166 -147 -226 34 -278 -58 -27 41 111 29 -217 134 -125 120 221 -72 -174 63 -182 169 57
6066 57 -201 121 9 84 280 198 -32 -49 -192 -28 15 96 28 182 -96 -23 -52 17 52 -44 65 87 44 -17 -73
6091 -73 60 177 216 -196 144 29 31 -15 74 126 -122 -40 -22 -108 -141 57 61 53 22 -80 -73 -17 -135 61 -29 248 -143
6118 -143 -49 98 -200 16 -146 -24 86 -183 106 53 -46 -170 -102 -3 133 -32 -102 -153 168 -41 12 163 -263
6141 -263 212 -37 102 -66 -252 -72 -105 68 -66 -5 170 -192 34 -209 -6 101 150 -96 28 -82 41
6162 41 29 -21 112 62 -5 -208 -145 -263 -270 78 -91 -85 -75 68 -8 44 229 32 -35 63 -207 -160 32 73 -251 14
6188 14 -131 -48 247 -97 -243 198 43 -98 -3 -60 8 82 -32 -75 -130 161 -11 111 164 -42 -57 116 -27
6211b7QOMj8L5J07Ok91K35J4j13j27J93n3m8J47j98K34j82J50k3o7Q6l8r9j8K06
6238A29m32L51m06M73p2k08K24j9K0J39l78J13M8J01j50j07M11m9j22j4K8k13
6260a33K02O1j20pJ21j16N2m08L86J06p5l7j94K81j58R2r1J1k56M23k03l4J58
6283F1k62J42o9J86k75J18L17o1j78J57j35J78l25L11K6j01j59k3L28j70r3j47
6305a74L2P4K40j70J70p9L8m1k9j75J52k33K10J5Q4n43L92l4M8m1K5p9N8K33k58
6330h5p8J69Q7j40j45J91J15j51k2J5j48L30j19j40J3L28j08l23J94LM4Q4k01
6353h7K27r6J27k14J58j62j32K35k5J44j8r4k25K71o1j44J36l0J40l17J38n3N0
6376c2J6jj94o7J86J59j20R7J1m09K75j40K47P3O7j45j78p3K01J22j39p0J54J67
$$ plain form
6211 -27 -19 -13 -9 -27 8 115 121 -170 65 79 -34 -161 32 -21 -69 78 -120 114 -68 82 59 -8 78 40 -59 -77 129
6238 129 -303 48 -358 115 43 -165 59 40 60 199 -179 -66 -18 83 -67 -174 237 188 66 52 80 -133
6260 -133 69 130 10 3 124 8 60 -348 38 144 69 32 -162 119 -39 53 -38 -27 -283 140 -63 -97 61
6283 61 -201 -59 -128 58 -217 -99 218 157 -21 136 1 179 -146 165 191 90 -69 -92 236 66 -27 -174
6305 -174 -142 -68 172 2 172 93 131 90 61 -114 38 -195 15 30 114 -429 -37 -71 -23 -64 -39 -118 -60 173 -85
6330 -85 -163 6 93 -47 -192 -1 114 -37 -59 -44 -192 138 19 -121 -108 220 112 -211 -17 -14 30 114 -87
6353 -87 140 44 171 -43 115 -47 -179 56 31 175 157 63 -162 109 48 -96 40 10 150 -167 -29 -82 -32
6376 -32 -16 -17 -211 -278 -92 67 -53 44 55 -354 -79 -219 28 101 168 23 -155 -228 -27 95 -44 -114 40 207
6400B07j09k72L45j00o1O2j76R6l1m2j6j0K54j15M6k80J39J09k04K37k00K56k05
6423g0j07P8L24q3l23P8L66j60j34K98l32J12J5m8N8J03l30O7R2J34j41o9K36
6446A64l7j37k0j57L83n1k90L75j69q4J15n4q2J1j35m9R8j1K9K37k3r3k1l9R0
6471E0j09K89k32q6M4L6n5j62J11L34o6k55K38l4K10k12k3j30K13k65J53j46k5
6494a22K49L6l05K35l8j11J21j33k07L08J4n9P8L7k9k13J02J9k0M7O8Q9K14m74
6518i4J9j93M33j72L37j57r5K50m96K96m10L74k29K17L0j29J7k9j58L8j8M1K68
6541A40k02j20P0r4J42j2L19o6j17o0q1l8p5L26j06j17J23k32J29K42l02K58k21
6564i4J65k64l68O15r9J01q4J54K90l90Jj7K38l11O0K33pl15L6j5J52k24J90M4
$$ plain form
6400 207 98 -174 171 71 10 72 -104 -8 -39 -81 -97 -107 147 32 78 -202 -63 46 -158 79 -121 135 -70
6423 -70 -177 -99 225 142 -181 -103 263 103 -31 267 -65 47 62 14 72 175 -155 -88 4 138 -3 -72 164
6446 164 127 -10 -30 -187 196 145 -145 230 61 -23 92 38 -44 -33 -168 -217 -119 -130 -101 136 113 20 -1 -40 50
6471 50 -59 230 -2 -88 -44 -8 -63 -225 -114 220 154 -101 137 103 313 101 78 -52 161 -104 49 -97 -122
6494 -122 127 163 -142 93 55 -56 65 -68 -275 33 47 -12 66 103 74 -139 -37 -18 -38 9 77 166 380 -94
6518 -94 -75 -268 165 -7 330 173 78 328 -168 128 -282 92 -137 80 110 -19 -2 -31 -189 -151 -169 -128 140
6541 140 -62 -182 -112 -206 -64 -76 243 177 60 0 -81 -119 -194 132 26 -91 32 -200 -71 171 -131 127 -94
6564 -94 71 -193 -561 54 -45 56 -28 126 416 26 27 10 248 -63 -3 230 223 -92 -56 -71 81 -143 47 91
6588I1O5k03p4R5J13K46k28j64Q8L2J47K3o8j54M64n03K27j92j31J04j21K99j14
6611D2J87j19N0j10j85rJ76K09k77l78L02J98j62j26K05K25j12j72K94l41J02
6632aMp4Q9m8J57j41o9j0J40j13k8K01j21K2k27J31R0J61p9j18j05K64K4j05O6
6657A10j46j76J89J28j94Q3q2l2K3K54O6j22j85q3K83j63Q9k2m2L9k53N08r7l96
6681b21L38l27J32J42j59K92r5j36J14j50J89J30m09J50k04N59l56K96n89L54
6701E0k30K74k43M7J54N4q5l9Oj9r4L22l98k6L13j66K2j8R1J68n5q9j90J98n2
6726ek30J76L15j11o1k79J25k7K06j20k07J76J25j64P4J10j62j0N1J49k00K32
6748A63l20K23O1j37j75K35j80K57k47J52P9O5n7k79L37l57J57n0p8K97j62JL7
$$ plain form
6588 91 156 -47 -121 -26 87 333 105 -59 29 61 208 231 163 9 473 -30 197 5 -126 -22 -143 156 42
6611 42 229 110 160 50 -135 -144 32 241 -36 -414 -112 86 -76 -202 3 228 116 -56 238 -103 -1
6632 -1 3 -71 18 -30 127 -14 -83 -93 47 -66 -94 107 -14 8 -219 -88 2 163 84 -34 -139 125 149 44 110
6657 110 -36 -212 -23 105 -89 -6 -88 -120 -97 157 223 101 -84 -167 116 -47 42 20 -22 17 -236 272 175 -221
6681 -221 117 -210 -78 64 -95 197 102 -34 80 -70 119 249 -160 -10 -214 345 -11 285 -304 50
6701 50 -180 94 -149 -102 52 106 21 -18 -12 -31 -125 197 -201 -227 86 -80 -58 -76 15 183 128 39 -151 47 -5
6726 -5 -235 -59 256 145 84 -195 -70 -97 109 -11 -218 -42 83 -81 -7 103 -59 -69 -18 131 -69 163
6748 163 -157 66 127 -10 -185 50 -130 127 -120 32 111 176 119 -160 177 -180 -23 -73 -151 146 -16 -15 22
6771B2j93K73j67m8N8K33k46j0LJ3j12J54K70j81o3R7J0J25k09k11K35j31OJ59
6795H7n4L2J07j35j60K47j56j67K39j69R4%j41L91k83L71k16j54L5n6J39k01K60
6818A10l9nl7q1J94k80K11o2J7j33K47j10oN7j11mM6R5k15P5j88K3Q1q0K47K26
6844B78k81k6J40j02R3j5j61J71k59o8K20M2j33L7J05l2O1%J05Mm67M38l03J41
6868a2Q0k33K96j2k1R1l54L06q3j7r9MJ39j27M3J16l33L93j23j60Q6k1K2j71J50
6893d0j68K30J79l15j63L21j65J79J9j19R8p5J79l00j2J57K00n4K6%J0k65J72
6916I4j95J42j98J56p5q7lJ93l1j64J13J4J5J28k53J74n1J35p9k18L04k34R0M
6940b6l2j99L42L12m16KK31j97l6l0J48J13j45P8k43j44L48l29L38j35P9l6L39
$$ plain form
6771 22 -171 102 -65 -113 -55 178 -68 -78 -75 -62 -174 -20 250 69 6 103 113 238 29 -182 53 -78 -72 87
6795 87 33 65 172 37 -123 124 -32 -199 40 -129 -35 -35 -176 215 -68 303 87 -67 -32 -88 51 -150 110
6818 110 71 66 29 -52 142 -138 73 11 28 -105 142 32 26 83 -28 -32 14 109 -106 -31 -219 -196 -115 -195 52 278
6844 278 -3 -29 111 9 102 87 -74 97 -162 -230 -10 32 -101 -64 41 9 70 70 175 179 -288 150 -153 -12
6868 -12 68 -165 131 119 98 189 -165 141 58 41 -58 -54 85 -42 1 117 -216 177 54 -106 -20 -41 -19 -190 -40
6893 -40 -208 22 201 -114 -277 44 -121 58 77 -42 56 -19 160 -140 -152 5 205 151 177 177 187 -78 94
6916 94 -101 41 -157 -1 -76 -163 -166 27 -4 -168 -55 -41 -26 102 -151 23 -28 107 28 -190 114 -120 -30 -26
6940 -26 -58 -257 85 397 -19 -17 214 17 -19 -49 99 212 67 145 -98 -242 106 -223 115 -20 59 23 362
6963C62n27Q9j00N35k99P2k39J1r4J90L33n32nJ26m7J06p4r5M01j65k22L83j02
6986A07k81O8l4J54J06j1j42j5L4j98N80k53j76j30m9L30m4j30L04l62K26PO2
7009A53m2k81J12l22L14J01l39K49O5o1M7q9R7k62K2L78k06J37K81l02qk3O0j98
7033a17J44l5K5j96J61k1n3R4j6k53K23K16j15K32k56o7O2K21m46J90K1n0k0K18
7057A62k80J80M2l01L41l66K76j49j15L54k60Q2r4N4J56k82J15j51L79m21L37
7078E9n1O3m2J12j53J33k65J60p5j85N3L45q3J8j11L66k05L7k96J03N0J6K84l27
7102Fj6O0j82L3R0m4J35l23P9j29L25j35N6J16P6J02k89r6L26l3j15J76k78Qk0
7127g2O2M3j37J10Q3j92R9J44o8j00J39k20K55k51n5J17J86l82M44k99K10j4P9
$$ plain form
6963 362 -165 -76 -176 359 60 132 -107 -96 -190 0 333 -199 -204 -78 -125 -19 -93 -188 213 48 -174 209 107
6986 107 -174 -106 -140 14 120 109 -33 -48 -14 -212 368 115 -61 -191 -240 90 46 -84 220 -142 84 91 153
7009 153 111 -170 -58 -380 -66 35 -304 -55 10 -51 -4 -93 4 -258 -236 142 -64 73 354 52 44 21 81 -117
7033 -117 27 -8 17 -179 -18 -39 -92 2 -14 -267 -44 172 57 289 33 -34 28 249 -197 -7 14 -36 -56 162
7057 162 -118 62 104 -197 144 -222 54 -95 -210 144 -116 -34 -128 -74 82 -200 -85 -236 143 -278 59
7078 59 8 71 29 141 -12 121 -144 16 -59 -244 -191 154 71 89 -22 344 139 176 -120 -17 33 49 333 6
7102 6 -10 50 -132 -99 -9 -53 82 -241 -162 -291 34 -101 -45 71 147 249 -40 -136 190 157 42 218 -60 -52 -72
7127 -72 -10 33 -104 6 89 -103 -4 140 72 -28 111 -109 146 -105 -160 -43 143 -239 205 -94 116 102 181
7150A81j52j24L27k11J10k77J04R5j71k70N53k90K59k05J46j78L63k33J03K2J50
7171C02k82q5J58j35J29K18q3m15J44m1J04k6J5k08K14J26J23m78O9K71k11qp4
7194a73J79r1K42jm02J50K51j67Q3r0J29p6O5l0J21j61j07J40o5K6K27k31RO1
7218H9Q4l26L36j44J56O8k04j72J26j23J91j46j9L03l18M37l58J54k93J55J15
7239A11j69q6J51J13j72L3N9k13N2K75q1j1l25O9l8J54r3J06K35l71J49J59j93
7262h6NJ5K62k45o3K59j08q5oO3J50q5k42K33j23Jk04M84j39k97L73j95j61J98
7286Dj69J29j38R4L5k10L90j8l29K6L82o6k88n0J10m5J51k17J70j5l5j40J27K98
7310A96k78N1k8Q7p4k1J3K80j89J55k98N5m0J24l6j5K65j79q9Jm08L98L06j64
$$ plain form
7150 181 29 -95 232 21 131 -146 -42 53 -118 -388 165 -125 134 -71 75 -103 260 27 130 152 302
7171 302 20 -65 93 -42 87 305 222 -193 -49 -90 14 -12 3 -205 9 135 258 -220 -151 120 -91 -99 -173
7194 -173 6 -85 157 156 -246 -96 155 -12 71 -19 110 34 99 69 190 29 -78 62 -3 23 250 19 28 89
7218 89 173 -153 183 39 195 263 59 -113 13 -110 81 -65 -84 219 -99 338 -20 134 -159 -4 111
7239 111 -58 -144 7 120 -52 -19 40 -173 -121 154 73 62 -263 -194 -232 -78 -171 -65 170 -201 -52 107 -86
7262 -86 -81 -66 196 -49 -112 147 39 -46 -52 11 161 76 -166 67 -56 -55 -259 225 86 -211 162 -33 -194 4
7286 4 -165 -36 -174 -80 -45 -255 135 117 -212 -186 196 130 -158 -208 -98 -143 8 -209 -39 -54 -89 -229 -102 196
7310 196 -82 -31 -59 28 -46 -67 -54 226 37 192 -106 -51 -91 33 -3 -18 247 68 -21 -20 -428 -30 276 112
7334A12L9l74L97k19K09m03J89J80j50K23l21J5L38j93m6j00K88j03o4P0k29L
7356a39J98j58L5J30j5M7l3o3J07q0O9j87L08l16J09m55M49j34K38j3o3p5R1J49
7380A99j52l73N88p9q9j27J29p5M5j68J94l9J14k62MJ23k78L65m25K41j8J53k5
7403D5k24L08n3m1j64K3j34J03K03q8P6j38p3J04O7m6j40K87n0k10K08o6r9k9
7427a31K02r3j42L45j59J39l6oP9k6K9l08J42o0k21J77K98k82j14J04K67l33J48
7450A9Mq8p7m2K63jmJ35l09J23K3k48M0J32O8j43K15L4l60K88r3k2O1K0J40q7
7476I1k16MNJ22J0k42k02M73j8m12N44j21LN3M1j24J13k39K83j16j22K43l97K79
7500E5j51M8K5j67K55l46L74q7J9L6l41N27k59m2Q2n5qK9m1o9J03J39k44mJ65
$$ plain form
7334 112 151 -223 174 -45 164 -239 -50 130 -20 203 -118 -103 235 42 -4 -104 184 81 17 87 -142 -139
7356 -139 59 -99 -64 66 51 98 65 2 109 29 98 -89 219 -97 12 -443 6 -128 110 97 34 -41 50 199
7380 199 47 -326 262 183 94 -33 96 21 66 -102 92 53 167 -95 -91 32 -246 119 -306 -65 -83 70 45
7403 45 -179 129 76 35 -129 -106 -240 -137 66 -22 54 -84 -157 -53 14 -32 -172 115 65 -145 63 -3 -102 -131
7427 -131 71 -22 -164 181 22 161 125 119 198 172 201 -107 35 -25 -246 -69 229 -53 -167 -63 204 -129 19
7450 19 23 -65 -142 -184 79 78 74 209 -100 23 46 -202 -162 -30 38 -105 110 144 -216 72 -21 -43 18 38 178 91
7476 91 -125 -121 -116 6 16 -226 -428 45 27 -385 159 38 41 94 135 11 124 -115 168 52 -70 173 -224 55
7500 55 -96 -48 -23 -190 65 -281 93 6 25 61 -280 247 -12 -54 28 -27 -35 -6 -47 -116 -13 126 -118 -122 43
7525D3M4mk49J27J24m16L45Q0J71k53PJ7J27m67J49O8L48j65N0J12k08n9O5j6
7549D0j09J44j82J39O8j31J50J0k19j97K92K52lj79N0r3K5k7m4o7L27l22j03L10
7573A31j93nR3LR8j45K11l53J14k9P5j6j43J81J08r6k32M29l97O7J28j46L43M6
7597B72k68q1K51q5q9M5k53J99J13k15O1L3Q5k35M31j70pk19K23k61J11J55k46
7620a50K78l02K5J78q4J59m4l58K30K26k04J49l4j96K66r8j33N0j68P0j61K00
7642a01L42l28l0J71m1k20L52m65N04l61K81j97K81m14P2K97k68K98n9P2J9k33
7664b8J36k3q6J47q8l5R3j94K04l32L81l0j16J87k64K40j26q8j23J72k70M35k54
7687f2n6K05j52P8j36O8L3j00J8L59j58l47K35p5r3L30j21l18M07J91l58J84j05
$$ plain form
7525 43 87 83 -166 -39 85 -331 14 94 265 12 19 36 163 -304 -155 -87 261 96 146 258 50 -9 56 40
7549 40 -69 75 -107 32 100 -31 119 129 -90 -287 5 257 254 75 125 32 57 30 -14 -81 246 -76 -179 131
7573 131 -62 -67 26 29 127 -18 193 -160 -46 -75 0 -16 -159 22 130 34 -198 231 -166 -99 29 -117 226 272
7597 272 4 -77 174 89 0 45 -208 -9 104 -111 -50 -17 68 -167 264 94 87 -132 91 -170 -59 96 -150
7620 -150 128 -174 -149 29 -55 104 60 -298 -68 158 -46 103 69 -127 139 41 -92 -42 -210 -140 -301 -101
7642 -101 241 -87 -117 54 13 -207 145 -320 184 -177 104 -93 188 -226 -154 143 -125 173 114 186 205 -28
7664 -28 108 85 -1 146 58 23 116 -78 126 -206 175 145 29 216 -48 192 66 -22 -145 27 -243 192 -62
7687 -62 -118 87 -65 13 -123 -55 -22 -122 -104 255 97 -250 -15 -90 -183 147 26 -292 115 306 -52 132 27
7710B7k39J29J20r3J42r1q2L1J81k09J70J34n4j37lK60l42M7K43j07N5o2K70l98
7734ho8J52J0r5m9K45l4k86K66j17j37L89m14M73l50J5O0j00J20Q1l58J42L7Q7
7758F1M11n00j73k9J8J98l9n7K23J22r2j28J06r4j2K5J42k88J71M6j40m5J65j92
7782a01L61k85l1N0m2J4o4L10o4j90J07Ml15L08l3j24R8J44k08k0J09M9k27P9
7806g1J48K13k42l21L76q9J0o0p7K54j1n3j48jJ50k09P9m4K41k36J4M38k54j08
7830aj38K38q9K60l08K77k02m3lm1%p4q7L99j90m06M57j64K07k41n0L27j98P2
7854Bj17J05k4oj22K30k34O8MM3J31%l7k95N06k35j9n5K6j59K00p8J48O2q5k18
7880a59J36J28k20L72j95P5l49J39K60j85K83m71K42l7Rr3J79j28k42L21p1K34
$$ plain form
7710 27 -212 -83 37 -56 86 -5 -87 -56 125 -84 86 220 166 29 26 286 -56 -9 234 127 182 120 390 -8
7734 -8 -76 76 86 -9 -58 187 153 -133 133 16 -121 268 -146 327 -23 -8 52 -48 72 153 -205 -63 -26 61
7758 61 472 -28 -201 -230 -212 -14 -53 -110 113 235 143 15 121 27 15 40 182 -106 65 111 -29 -74 91 -101
7782 -101 260 -25 -56 -6 -48 -34 -98 212 148 -42 65 69 -246 62 29 -95 3 147 -61 -81 28 77 -150 -71
7806 -71 77 290 48 -273 103 14 24 -36 -113 141 130 77 -71 -72 78 -131 -52 -96 145 -91 -77 361 107 -1
7830 -1 -139 99 10 270 -38 239 37 -6 -9 -50 -50 -124 -211 188 -2 -408 49 -115 92 -149 -199 128 -70 2
7854 2 -115 -10 -34 -40 -162 68 -166 -98 -94 -51 80 80 43 -252 254 19 0 -55 -29 -188 12 -66 82 144 59 -159
7880 -159 -23 105 -115 257 62 137 -212 -73 187 2 285 -186 56 19 28 -65 114 -14 -256 65 -6 228
7902B28j44k2n6k96L02J20j25j86K61k06M31j38l01K25k6o3K13m00L82j12Kj81
7924i2J94j22p7J23K7J25j27k01P3o2M25j21k95j2j29o6L50j16k9K18k77K13L2
7947E4J4o1J69j81k4qL47k9j77k70k2L56r1j85K20j81R0p6N5l1J52k15O6J32j76
7972g2K1k11K42R5j6j22R6J33k44R1OJ21m5p0J29l00J03M6K32m57K25K60j85k21
7996a43K53j44K17j80L60l60l1J30J72l28j29J97j79J61L01l76k22M03m07L77
8016G2k53J83J28k89J81P1j2l3P8J28k01j04O8P3Pj48j01K31k26R7K22j80J03
8039I5k0p7o6r0J60k26RL02p5p4j66L10P5j54k49K62Jj11J15j99P8L0M52l42j94
8064a54L18k33m3J37PJ24Lm80L72L4j90K32o4j58M6j57J89M5J48m61K23N2Q1o6
$$ plain form
7902 228 84 62 6 -290 12 132 7 -179 82 -124 307 169 -132 93 67 4 217 -183 199 87 89 -92
7924 -92 102 -20 -97 26 53 178 51 -150 -77 -139 286 165 -130 -142 -271 -337 13 -103 -132 86 -191 22 54
7947 54 68 7 176 -5 -29 -37 310 281 104 -166 -188 168 77 -108 112 -69 21 -55 0 -31 121 -94 -28 104 -72
7972 -72 -51 -262 -20 75 59 -63 33 166 -78 13 19 140 95 25 154 -146 -43 3 235 -222 3 263 78 -143
7996 -143 110 -34 183 3 363 3 -28 102 274 -54 -183 14 -165 -4 297 -79 -301 102 -305 72
8016 72 -181 2 130 -159 22 93 81 48 126 254 53 -51 17 90 97 -51 -152 79 -147 -50 172 -8 95
8039 95 75 -2 -68 -158 2 -224 -215 87 12 -62 -228 82 157 3 -246 16 17 -94 21 -178 -100 -70 382 40 -154
8064 -154 164 -69 -112 25 32 156 159 -321 51 85 -105 127 63 -95 -49 -206 -17 28 176 -285 -62 -10 71 5
8088EN6m0J69l76J09K76p1K4j76K38j80J31j55N8P0m73J87L30r3J1j95R3J2k48
8112b38J19K60j80j22K7Q1J30k98M23k56j0j64KK33k43K97K54k0j46J02l27O2
8134a4J20j51O7J72j65J07k49O2J94k02n7j83K33J72k72J71O6j03j60J4L13J35
8156B70L5m88K23j2J43n1j4n8J8j47J30j99K25j2l6j80J77j52J53J2r3k72J91
8179a37L40m27K90j72j42R9Q2m4K45k60n4K08
$$ plain form
8088 5 61 21 190 -186 -77 199 128 152 -24 214 34 165 10 68 138 -335 -148 182 89 100 -95 -2 10 -238
8112 -238 -119 141 -39 -161 -134 -53 77 -221 202 -54 -64 -228 -226 7 -236 61 315 295 149 251 -76 -14
8134 -14 106 -45 22 194 29 136 -113 -51 143 -59 -116 -299 -66 106 -166 5 71 -32 -192 -178 135 270
8156 270 305 -183 40 28 171 120 106 48 66 -81 49 -150 75 63 27 -153 24 -128 25 37 -56 -328 -137
8179 -137 203 -224 66 -106 -248 -149 -67 -111 134 -126 -180 28
8191B8
$$ Imaginary data points
##PAGE= N=2
##DATA TABLE= (X++(I..I)), XYDATA
0@%%%%%%%%%%Pj4J4j4J6k3K8l5M2m9O3p7R1j05J23j44J68j96K26k61K99l40L86
33B05m37M93n56O26p02P85q76R78j088J207j337J480j637J808j995K198k421K668
51A399k939L238l574L947m361M833n375O002o735P606q666R985j1677J3938j7133
66i512K2026l0529M9423j67405O1407K64433k02356r9728J8558J39973N6213j70289
78f7786r4398J80608P3733p5718j18967J6258J70558l067j92300R719J35323N5749
90H9712q6765j29038P7241J53016q9031j09016M1534Q0002M5627q7022j04280
101a18020J07185R7054q9221q6387L9200J07451K770j28703q787J04404J3903
112D0849m8608m9348J0613R8179p363j09595R856Q3076J6648n7125n8619N6898
$$ plain form
0 0 0 0 0 0 0 0 0 0 0 0 7 -7 7 -7 9 -14 14 -21 21 -28 35 -42 49 -56 67 -77 91 -105 121 -140 159 -181 205
33 205 -232 261 -295 331 -371 414 -462 516 -572 635 -702 778 -859 949 -1046 1152 -1269 1399
51 1399 -1540 1698 -1876 2071 -2290 2543 -2832 3170 -3565 4041 -4625 5360 -6317 7621 -9512
66 -9512 12514 -18015 31408 -135997 -74590 189843 -12513 -112241 -93683 46290 102503 -67786
78 -67786 -162184 18424 92157 16439 -102528 -86270 84288 81221 -111079 -101360 33963 89712
90 89712 2947 -126091 -48850 104166 15135 -93881 -52347 27655 73282 -13740 -118020
101 -118020 -10835 86219 -3002 -89389 -50189 57262 60032 -68671 -77458 26946 40849
112 40849 -7759 -57107 -46494 51685 44322 -65273 -55417 27659 44307 -12818 -71437 -14539
124a4539Q1060o1703p1286M0288N2918L010m8253l6864N4242M8858m7530n0922
136e0721K4638N7644k312o5638p360O5828J4704n3101k6408L3657L8775j6207
148A3499m5221K917M4947J4342m1238k9690L7062L9196k9948m0173J9099L8144
160B2936n341l6224p885L4391J8092k6542k5317J5317L1080m525l6213l391L7401
173A3779J0796l1955j6882K2262K1937j2844k6684O201K7131J668k3285j1279
185a9155J8042K0293j3820k5690J0831K6487n944k3430k426J9614J0680j5729
197b47j4786J1970J6248o207j7483k067J8967Q312j7780j1187J4850J3304j0047
210C847j5276M041J6756J002j5045n162J1382R353q524j3175N992J4906j752j4426
$$ plain form
124 -14539 66521 4818 -66468 -26180 26738 29748 -18505 -55369 -1127 47731 201 -50721
136 -50721 -26083 31561 29249 -36389 -43749 22079 36783 -16318 -42726 -9069 29706 13499
148 13499 -31722 -28805 16142 30484 -10754 -40444 -3382 35814 5866 -34307 -15208 22936
160 22936 17595 -18629 -26514 7877 25969 -573 -25890 -10573 20507 15982 -20231 -23622 13779
173 13779 24575 -7380 -24262 -2000 19937 7093 -19591 -13390 13741 15409 -7876 -19155
185 -19155 -1113 19180 5360 -20330 -9499 16988 11044 -12386 -14812 4802 15482 -247
197 -247 -15033 -3063 13185 6978 -10505 -12572 6395 14707 -3073 -14260 590 13894 3847
210 3847 -11429 -7388 9368 10370 -4675 -9837 1545 10898 2374 -10801 -4809 10097 8345 -6081
224f081k891J2860O243j1139q752R087R939m110j0717j256J1250M418j1262n784
238h195R067P703m961j0320J235J1482N72j0630j067P279M672m885q503K935J0221
253F605k050q426n78P038M348p127o665N943O900l630n955J18O540K633q004l544
269e854O387M775l448n845J333O536ko853j334N379L437l656n146K525N571j446
285B359n238l62M683K778m557m005L907L944k207m103J31M929J116m436k237L709
301D11K802k533l440J083M251j47m220j145L565K046k369l181J916L823j081l962
317b181j13L584J229k885j814J985K587j405k874O03K849N22k813j441K295K260
333B388j750k765J242K508k18k526m98K374Q97j811j830J485K222n99k260j98
$$ plain form
224 -6081 -8972 3888 10131 -1008 -9760 -673 9266 5156 -5561 -6817 4433 8851 -2411 -8195
238 -8195 872 8575 3614 -6706 -5471 6011 6583 -4047 -5114 2165 6837 1952 -6551 -3616 6605
253 6605 4555 -3871 -4449 2589 6937 -190 -6855 -912 5988 2358 -3597 -3479 3061 5694 -2310 -5854
269 -5854 533 5308 1860 -3985 -2652 3884 3882 -2971 -4305 1074 4511 855 -4291 -1766 3805 2359
285 2359 -2879 -3241 1442 4220 -337 -4342 -435 3509 1302 -2801 -2670 2259 3375 -1061 -3298 411
301 411 3213 680 -2760 -1677 2574 2427 -1793 -2938 627 2673 304 -2877 -961 2862 1781 -2181
317 -2181 -2294 1290 2519 -366 -2180 -195 2392 987 -1887 -1284 1565 2087 -726 -2167 128 2388
333 2388 638 -2127 -885 1623 1405 -1121 -1619 755 1652 -159 -1989 -504 1718 1119 -1141 -1339
349a339K138O89j834j474J682J645p62k190O03K015J65k053n86J617R64j009j781
366a510R61J858m11j632l50J641N92j371r17P04J366k26j111n77J570K10j011
383b14q11R29J160p59j253M27J216o3j345l64J407N23p40j357R00J110m07j032
401f73L0J101K34j043n45O87O40k1q98l03J179J90j063l54J000L63l57r62O42
420a53R47l69p59m73P24M76n50m16M07L95k38n43q6R10J86n13n57K76N36k9n82
441d11n1P97o1m89l95N77L47l32m07P7O54k26n41K9L32M16m09l54M58r4P7n23
463e29L7O26K56n38j03J37K61k57m08L87L77j41m24M2K0M24j60n76K26M34K05
484B96n14j75M86O9m32j33M52k5Q0n13l2O49k76P0j61K78q1R0m81K26K62l85j60
$$ plain form
349 -1339 799 1488 -346 -1820 -138 1507 745 -1445 -842 1173 1338 -715 -1301 316 1280 271 -1510
366 -1510 -549 1309 898 -734 -1084 557 1149 -222 -1139 -435 931 705 -406 -983 587 797 -214
383 -214 -1025 -96 1064 305 -948 -521 695 632 -713 -1077 330 853 113 -1244 -344 766 359 -673
401 -673 -643 458 692 -351 -896 -209 431 410 -488 -791 388 578 -485 -839 161 524 167 -795 -153
420 -153 794 425 -334 -807 -83 393 -157 -573 -166 229 -9 -552 -638 272 458 -55 -612 -336 200 171 -411
441 -411 -462 335 274 -215 -610 -33 314 -18 -425 -348 306 80 -461 -432 -100 316 -93 -447 11 -83 -6 -529
463 -529 -492 134 390 -148 -251 -114 147 -110 -518 -131 246 105 -319 -277 -257 167 7 -569 -343 91 296
484 296 -218 -393 93 162 -270 -403 49 24 104 -409 -441 208 -68 2 -159 119 38 128 -353 -127 135 -250 -410
507d10L28k30K32K09m18J73L67l31q8j44K34L62m56L9M37l47O8o1n3R9p8j01o2
530b31J41K75O5k64k14M55j81m32L24o8K02k41O3K07oJ32o8m66M18K03j61p9K76
553C50j86l07N8J84K93k16m9j72J20K34l70J66q3K62j34k43J31j39K70k54j31
574b16J67O23n78L28j85j14K11k04L5j17J94j48j2J06K5j18m5o3L46k36j48Q9
596f0K55k09k13L17P9j38J72j9k09j5J89r0j07j14N8J52o0m4N6j89r8J45L0J10
620bJ72k88M3L59l26R7j58L0Mj16K18k53j5J22J15l4j75L94j07j13M3p4rPQ3m2
646b5M2k91J14L29k59J87j48j63N49m84L44k41j35J50k0R2J3j55k45N01m78N05
668A82l21l8P9k8r5N73o32m4K58Q5R6k32p6J91K23m43J40P4M8j43j2j69j9K53
$$ plain form
507 -410 -82 -312 -80 129 -289 -116 251 -80 -168 -312 -78 284 -172 -133 304 -43 25 -36 -89 10 -68 -169 -231
530 -231 -90 185 250 -14 -228 227 46 -386 -62 -130 72 -169 -106 101 95 227 159 -307 111 314 153 74 350
553 350 164 -143 -85 99 392 176 127 -45 75 309 -61 105 22 284 150 -93 38 -101 169 -85 -216
574 -216 -49 574 -4 324 139 25 236 32 67 -50 144 -4 -16 90 115 -3 -48 -111 235 -1 -149 -60
596 -60 195 -14 -227 90 169 31 203 184 -25 -40 149 59 -48 -162 -104 48 -12 -56 0 -189 -287 -142 -112 -2
620 -2 170 -118 -75 284 -42 55 -103 -73 -69 -185 33 -220 -235 -113 2 -32 -207 187 80 -33 10 -64 -73 -66 17 -25
646 -25 17 -274 -160 169 -90 97 -51 -214 335 -149 195 -46 -181 -31 -51 41 54 -101 -346 155 -323 182
668 182 -139 -177 -98 -126 -221 352 -280 -324 -66 19 115 -117 -193 -2 221 -222 -82 -8 40 -103 -115 -284 -303 -50
692e0MJ08k86O1J40M9q4K67l36Q6O7p7K21j26j90K50j57j42K36l22K95l6j51J31
716d2J8k93M04n9l96M69k15J86j34m4j72J41m2P8J91j06k3J23N5j24%m3L3r6J28
741C7l5J19K85k15k65PJ89l70L58p8o9K06k95L6P4J30J15j21k4Q6m43K97j62n
765a43J92k2p5j0N1R7k7M8o0q4j26J73j2Oj81O4K36o8O0r4M7R0l12L48j38l26
791b66K19O8J12k25L52m08K6P0O3j39M5p8J77l92N41p4k71K5J96J01k44j13K31
814A6J24l04J64j20%K46k98L01ol18M02k76l3L65j51nJ33j78k8k3l26O44l34R0
838H5q3K0j58K76r7j04J47L7J6k89J13m1J98J25m56K95q1j05Q5j98L10k63J34
861c4r2J92j03j52J30l3oj05K82k7j89lK57j78K50j84J25n5l6J98l16J59j59P3
$$ plain form
692 -50 -46 62 -224 -163 -23 26 -58 209 -127 -41 26 -51 170 44 -146 104 -53 -195 41 -281 14 -22 -173 -42
716 -42 -24 -317 87 28 -368 101 -114 72 -62 -106 -278 -137 -179 -101 90 -16 -39 84 139 15 15 -28 5 -91 37
741 37 2 121 406 191 -74 -67 122 -248 110 32 -37 169 -126 -90 -16 114 229 108 84 170 -273 24 -138 -143
765 -143 49 27 -48 -58 -7 90 63 111 51 -33 -159 14 2 8 -173 -109 127 59 119 25 72 162 -150 198 60 -266
791 -266 -47 21 133 -92 260 -148 -122 -52 11 -128 -83 -161 16 -376 165 91 -180 -155 41 142 -102 -215 16
814 16 140 -164 0 -120 -120 126 -172 129 123 -195 207 -69 -102 263 112 107 240 62 34 11 -315 329 -5 85
838 85 2 22 -136 140 43 -61 86 123 139 -150 -37 -78 120 245 -211 84 3 -102 -17 -215 95 -168 -34
861 -34 -126 66 -37 -189 -59 -92 -98 -203 79 52 -137 -140 117 -61 189 5 130 75 39 237 -79 80 -79 -6
885fJ14j74L6o4jM7p8R8J3K56l07m1K99j11j21J48p3J8K36l40J04Kk89j09J09
910b34J62M0J14k21L07j03k38Q1k4O3j13K48J5j36j11K56j02m0Q7k54N29l00J7
933D3K7J45p2Lr8k07l2J35LP4j09o5L72k90o5L68l51K81l0j58L04l91M2o7K09
958G1j13K26j12m6j51R5M3k57J98J41k77K35j25L13k10N8j79K93j70j78K24j00
980b1k50K07j93L07j95J27O4o7k95O51j50l02k5m8K80j75J27l3j25J97%q6J16
1003A11j61J49j15J53rk51R2o9J97j86M2N1m2j63K77o3M6j11M08l12j18J81n6
1026E1j0j28K6j93K94j45R5K11j60o2k7J45j94j01M15m41K44j45M4L3N7p5K9k6
1050f3P9J42j07m4j04N3J70R8k29m3P5l0J9J04R2k15j47O1j17K0M30k02J91n07
$$ plain form
885 -6 108 -66 -30 -94 -95 -48 -126 -28 -15 241 -66 -107 192 81 -40 108 35 53 289 -51 53 55 -234 -343 -234
910 -234 -72 -32 82 -139 168 65 -173 -92 -116 -53 -166 82 97 -39 -150 106 4 -36 51 -203 326 26 43
933 43 70 215 143 146 48 -159 -191 -56 -53 21 -88 -153 219 -71 -136 232 -119 162 132 -26 278 -113 -71 -138 71
958 71 -42 184 72 26 -125 -30 13 -244 -46 95 -182 53 -72 241 31 89 -90 203 33 -145 79 -21
980 -21 -271 -64 -257 50 -145 -18 46 -21 -316 335 185 -117 -142 -190 90 -85 42 9 -116 81 81 -5 111
1003 111 -50 99 -16 137 128 -123 -31 -100 97 -89 -47 4 -38 -201 76 13 59 -52 356 44 -74 107 51
1026 51 41 -87 -61 -254 40 -105 -10 201 41 -21 -48 97 -97 -198 217 -224 20 -125 -81 -48 9 -66 -37 -63
1050 -63 16 158 51 7 -97 -44 126 224 -5 -48 27 -3 16 120 212 -3 -150 -89 -206 -186 244 42 233 -274
1074b74K06l5Q9J70j17n4Q7j11J21J2r5J01j03J53k86M79o86N79j78L1pj38j02
1097a58J40j47J43n0J60k0O4l8O9j36M2k65K93k42j54N55j38k10K75J22l14J03
1119I4k24K75j83J29j22k40L46lj99lk0L29j70Q7m4J03j53J76m42K96j53M00k59
1142B0l7J16L09m26j1K95j40ok32R0r9J22k6J98l13PL10R2m15J56P6O6k96L66
1166B22l50j40M83l65K34M1l4J19j57J62j07o4k64M53k70KP6j08j06L99j93j48
1188a15J95j67R2j00K06o6K5J04O0ol54J76k61J42N8j8J33j88J67k58J79J2O9
1211H5r0n2r2j77K48O9R1o2O2j9J97m71K29p1L5lM6l4jk5r3K1n2j02K63j28J33
1238GJ01k79k33M40o8j30N7p6O0j88J67K00Lk2j39J72k23M18K2l04k00J43J22
$$ plain form
1074 -274 -68 -103 -14 156 39 -15 72 -39 82 94 -1 100 -3 150 -136 343 -343 236 58 89 82 -56 -158
1097 -158 -18 -165 -22 -72 88 68 132 94 163 27 69 -196 97 -145 -299 256 118 -92 183 305 -9 94
1119 94 -130 145 -38 91 -31 -271 75 72 -127 -130 -150 179 9 96 52 155 2 178 -264 32 -121 279 20
1142 20 -17 99 408 -18 -29 266 126 120 -112 -22 -121 1 -25 173 -140 -133 177 269 -146 10 86 152 -144 222
1166 222 -128 -268 215 -150 84 125 91 210 53 215 108 44 -220 233 -37 -35 41 -67 -173 226 33 -115
1188 -115 80 -87 5 -95 111 45 70 174 234 228 -126 50 -211 -69 -11 -29 104 -84 83 -175 4 16 85
1211 85 -5 -57 -149 -326 -78 -9 82 20 82 63 260 -211 18 -53 -18 -21 25 -9 -10 -35 -128 -107 -159 -261 2 -126 7
1238 7 108 -171 -404 36 -32 -162 -105 -181 -121 -309 -142 58 61 39 -100 72 -151 267 289 -15 -215 -72 50
1261E0o1l7PK23m41O6M9M43j8k86k6j03R1K4k0K4K8j4R3k96J48P2j60J70n8J82
1287A50l70K52k07L21m24L66K1k30L8P2k65P4L14j27j3J32P9j41K02n00L24J0
1309G8J46l88J18j8L07Kj82j31K6k4J53k23K13k48J85J12r7J32j80j33kJ2p0K66
1333E4J0J3k61L20j90J31q8j65K51j88J37kj57p1J99J81k39Q7j09j94L85M3j92
1356d5J72j77K32k79O4m4oj7K42l38M20r4m6k42K34l3kJ18k16P6J8R0o6M8p9l5
1382ep4J57l05M09n62J99K37r0J90J5k9k5j41j27K24n04O25l42j87J75Q4J13j01
1405f4K70j19k14K7M2J51k3N7J07l40K25m49M51l31L20Q2P8m16Q9K13j03L7k82
1428a92K38o9m2Oj3jJ15j32j00N30j64l99L79j96j84K28lJ91k42r7l7N02l34M03
$$ plain form
1261 50 -11 -48 -41 182 -259 -193 -144 299 281 -5 -31 -134 -43 -19 -39 -15 13 -1 92 -204 -56 16 -144 26 -32 150
1287 150 -220 32 -175 146 -278 88 109 -121 -83 -11 -276 -202 112 -15 -28 104 183 42 244 -256 68 78
1309 78 224 -164 -46 -64 243 245 63 -68 -42 -66 87 -136 77 -171 14 126 29 161 -19 -152 -154 -142 -212 54
1333 54 64 77 -184 136 -54 77 -11 -176 75 -113 24 22 -135 -206 -7 174 -65 22 -87 -281 104 147 -45
1356 -45 127 -50 182 -97 -33 -77 -83 -100 142 -196 224 130 84 -158 76 43 41 159 -57 19 37 127 61 109 30 -5
1382 -5 -79 78 -227 182 -380 -181 56 -34 156 171 142 117 -24 -151 73 -431 194 -148 -335 -160 -76 37 -64
1405 -64 206 87 -127 -100 -58 93 70 127 234 -106 119 -330 121 -210 110 192 270 -146 -57 156 53 90 -192
1428 -192 46 -23 -65 -59 -72 -73 42 -90 -190 340 176 -223 156 -40 -224 4 1 192 -50 -147 -184 318 -16 387
1452C87o24J77K31l22L79n28K22q5M05m56J18j00l2K11J34j67n3M6J2L3Q7j42
1474f7L6O0J05q8J65N5k94q5J26k54K97j16J42k2N1k40J46l1O4J50l20J94r6j10
1498a32J00j11K63J96l84J77m7K72l75J57M2R9k55o1J81o8m2j11J70j38J32M6
1520A11j80q0M10l17qr7J68L6k44K68j47K09l10j1J15J38o3m7L11k46p4l4p1M04
1544B41k67o5K79j82J0J7K30j12l77J63J64j46l0K54k97J47r4J96k16K46q5j65
1566h9n8L0o3J62m5J81k11l34P75k14k13L2J12J8m8j80K15r4j10K18o1j02J16
1589C7j01J78j72o1k01O21m18K52l21L22j31Qo5j06K49R5j10K0m7m12K45J73o1
1612fK1MK06k54K8j4k6K93k71M4K5j4J07l30K2N9oK24n3j52M5M0JRj46J6J06P1
$$ plain form
1452 387 -237 -60 171 -151 228 -300 -78 -163 242 -214 -96 -196 -228 -17 117 -50 -103 -57 -45 -12 75 -67
1474 -67 -31 29 134 46 211 266 -28 -113 13 -241 56 -60 82 60 111 -129 17 -14 50 200 -120 74 -22 -132
1498 -132 -32 -143 120 316 -68 109 62 334 -41 116 158 257 2 -59 122 54 12 -99 71 -67 65 111
1520 111 -69 -149 261 -56 -64 -161 7 43 -201 67 -80 129 -181 -192 -77 61 -2 -49 262 16 -58 -92 -163 241
1544 241 -26 -91 188 6 16 33 263 151 -226 -63 101 -45 -75 179 -118 29 -65 131 -85 161 76 -89
1566 -89 -147 -117 -180 -18 -63 118 -93 -427 348 134 -79 -47 65 83 35 -145 70 -24 -134 84 23 -79 37
1589 37 -64 114 -58 -119 -320 301 -117 135 -186 136 5 13 -52 -158 91 186 76 96 49 -363 -118 55 -6
1612 -6 15 19 225 -29 -1 -15 -41 252 -19 25 50 36 143 -187 -165 -106 -112 112 59 -93 -48 -8 -7 2 -144 -128 -22 49
1640D9j70J71J67j41O3j50j51K86l1o9Qk39L97j42M0j14mJ94k17L7M7L2N0l4j15
1665c6j3L8K5j91K41j14q1J1K5K86l02M4JJ03K4Q1k67K48Q8o0k74K90o8P7k64
1690h8l3K09l8M8o6L3l00M67m28R0L45M9l06K12Ok26j66J10L6m5J66j41p2P0K16
1715A48j97J1J00m0k49L25l1j16K74N0k68q7J81r1l15L72j96j79M04k28J01K2
1737ij93K78J20n6k31K15PP5m43k0M81l07nK69l18J74j29J6K04K0k53m5J78M7
1761G5l6j37L57n19M49k6mq6k86M6J79O3J87l40J74j5j47K35J67l54k19L01o9
1784eP7k00M69j59l23Q8j7L3m8J61j84M1MK90j76k40J10K49k89J00N4j52J03K21
1808B07m85J66n4Q0l2O5K5N2j52P3L51l06m3j62J4J80J96j54J23k79K52l83L99
$$ plain form
1640 49 -121 50 217 76 139 -11 -162 124 93 24 32 -207 190 48 88 -26 -30 164 -53 -16 31 63 113 79 -36
1665 -36 -49 -11 14 -177 64 -50 -131 -120 -95 191 -111 -67 -66 37 61 142 -125 123 211 151 -123 167 99 176 -88
1690 -88 -121 88 50 98 32 65 -235 232 -196 -106 239 288 -18 194 200 -26 -192 -82 -46 -91 75 -66 -138 -68 148
1715 148 -49 -38 62 22 -227 98 67 -49 225 275 7 -80 101 10 -305 67 -129 -308 96 -132 -31 -9
1737 -9 -202 76 196 140 -91 124 131 206 -237 -257 224 -83 -88 181 -137 37 -92 -76 128 148 -105 -150 28 75
1761 75 39 -98 259 -260 189 163 159 73 -213 -167 12 75 262 -78 96 81 -66 169 336 -18 -237 64 -5
1784 -5 72 -128 341 182 -141 -53 -70 -37 -85 76 -108 -67 -63 227 51 -189 -79 170 -119 -19 35 -117 -14 207
1808 207 -278 -112 -166 -86 -118 -53 -28 24 -128 -55 296 -10 -53 -215 -201 -21 175 21 144 -135 117 -266 133
1831A33j44QJ61k67J54j8k49K36k55OL76j45J79k93J22n6M7Qj58J23J35K24l12
1854A5K43m7k79q8J94q7k4K56k71j61K05P5K79k68l8q1K86o0j23J3l7j84J57l9
1878f4p2n1J70pK52j8r7K06j02k83K0J0J52L0P5k25j42J25r1J10j69J26J1k67
1902c01K42L55l69P8L69k82n5k07L92m15R1LJ23j30J38q9r0J08M5K5l1J73%l01
1926a28r1K97J50k92J38l23L15j53j90K39J39l77L12K4J10j49j97L00l12L02l35
1947b21L45k12J70j0j76K16p0k7N1k26J72k01L00j68L7J40j03k40J33k1J78k35
1969a68L27n8kP9j39l46K42qL19l18J48p4l3J1j83M77m39J88l6k38L8L67k35K3
1993e8L74j93p8N7q6Q2j13k1j91Q1K47R8r4k35q7K54L8j48L6J45l8N9m8j46j47
$$ plain form
1831 133 -11 -3 158 -109 45 27 -222 14 -241 -235 141 -4 175 -118 4 -52 -5 3 -155 -32 103 327 15
1854 15 258 211 -68 -156 38 -49 -73 183 -88 -249 -44 31 310 42 4 -77 209 149 26 39 2 -182 -25 -64
1878 -64 -136 -187 -17 -24 228 210 113 319 217 -66 -46 -36 116 146 221 -4 -146 -21 -112 -2 -171 -45 -34 -301
1902 -301 -59 296 -73 5 374 92 37 -170 222 -193 -102 -99 24 -106 32 -57 -147 -39 6 31 0 173 173 -128
1926 -128 -219 78 228 -64 74 -249 66 -87 -277 -38 101 -276 36 60 170 21 -176 124 -188 114 -221
1947 -221 124 -88 82 72 -104 112 42 15 66 -160 12 -189 111 -57 -20 120 17 -223 -90 -111 67 -168
1969 -168 159 101 99 178 39 -307 -65 -73 246 -72 76 2 -31 -20 -203 274 -165 23 -13 -251 -213 154 -81 -58
1993 -58 316 123 45 102 16 98 -15 -36 -227 -146 101 199 105 -130 -217 37 75 -73 -37 108 70 129 81 -65 -212
2018b12M01m03K99o8P4k39o9L54k57K20r2j5J54l43K17J41l52J6K20k07K63k23
2040a21J51n4Q1j99K34kj7j71J34j63M0J96o7J48o3j15N8J45k31J00j62L7K12
2063A71j84K11k32J94Jj96L4q3K64k08K13l26K63j69j0k28M01k71R4N2J6J38l26
2086a81J3p9L28l47L19m1p5K2KK11J23k75j86J49Q4J02n4J3q9j47p1K77j56J20
2110F2o6J60j89k20M62l09K46l10J45O0m24M38J79n4k88N5P8R2N5r9J04k68J72
2133H1n3p0J36j15j65K31r5O1j11J26p7k8O4J41J12l12L50n01L79J37k97k88M92
2156A98k47J5J36qK4j38J69jj44p2k08L33J07k95k9Q5J29k98K67J07j51j50J02
2179f9m4L01j19J62m2j22o8l32J68L03J1l34J37j46L90j03l09J69J28n3Q2L71
$$ plain form
2018 -212 189 -214 85 17 91 -148 -217 137 -120 100 8 -7 147 -196 21 162 -190 -174 46 -161 102 -121
2040 -121 30 -24 57 -142 92 90 73 -98 36 -127 -87 109 42 190 127 12 70 215 -16 84 -78 -41 171
2063 171 -13 198 -34 160 161 -35 -1 -84 180 -28 185 -141 122 -47 -57 -285 116 -155 -61 -9 7 145 -181
2086 -181 -168 -247 81 -266 53 12 -63 -41 -39 172 295 20 -166 -17 67 169 115 128 39 -108 -179 98 -58 62
2110 62 -4 156 -33 -253 209 -100 146 -164 -19 41 -383 55 234 180 -108 -53 25 117 172 73 177 -91 81
2133 81 28 -42 94 -21 -186 45 -50 11 -100 26 -51 -79 -15 126 238 -74 276 -225 154 291 -6 -294 198
2156 198 -49 -34 102 94 118 -20 149 148 4 -68 -276 57 164 -131 -160 -75 54 -244 23 130 -21 -171 -69
2179 -69 -113 188 69 231 189 67 -1 -333 -165 138 149 -185 -48 -194 196 93 -216 -47 81 28 110 481
2201D81m48M3n4j58j9M4J45mK83j31q6J2k70K45j84m1O7K13k2l1j46j01J06L6
2225b0qJ48M0k34l8K55k03jJ45p8j58L62m7l31J13l0L3L4k23Q4K45k90r9J85J74
2250E8N0k32j31K36J57j36RO5j01m9J36n4J03k23lq0L68l09J46R2K8m32M27k12
2274h7K54j21j63L7O8j56L38k15r6j34K5L77k63K96k89K9P1J89q3k47L30m15K31
2297b4J61j81Q9q5n9M9L70l33Q4R6l16J03K56j23R0q7k50K64p4o8j39R2J81j45
2321d9M6k25Q6K7K43k18K5LQ1j57N8J2K3j51J39K75q7j78k5J06k7pmm2k9o3K47
2348A09m7J33M0k67K7j38J76J09n2j52j61K70J76k09LJ57j07j65q6K1L48r1l92
2371b98M25k02L3J2R2j90J38j35K90j69om0N3k26K04K03j77j2J8Ln3R3k49K34
$$ plain form
2201 481 33 76 22 -136 -155 -111 34 30 313 182 96 108 -162 83 -101 -142 -75 138 116 85 -61 -162 -56 -20
2225 -20 -28 120 160 -74 -112 143 -60 -61 84 6 -152 210 163 -168 -55 -85 -52 -18 -241 -157 88 -202 -301 -116 58
2250 58 108 -124 -255 -19 138 2 11 76 -25 -74 62 8 111 -112 -115 -195 173 -136 10 102 130 -302 125 -87
2274 -87 167 46 -117 -80 -12 -168 170 -45 -141 -275 -250 127 -136 160 -129 -100 -29 160 77 -170 160 -255 -24
2297 -24 137 -44 45 -40 -99 -50 320 -13 71 167 -149 -46 210 87 177 90 -160 104 30 -38 -177 -85 96 -49
2321 -49 -3 -228 -142 -115 128 -90 -65 -62 19 -138 -80 -68 -45 -196 -57 218 131 -47 -72 34 7 0 -4 -46 -75 -138 109
2348 109 62 195 235 -32 -5 -143 33 142 90 -62 -223 47 223 14 17 174 67 -98 -184 -163 185 94 -298
2371 -298 127 -75 -42 -30 62 -128 10 -125 165 -4 -10 -50 3 -223 -19 184 7 -5 13 16 -37 56 -193 41
2395D1O3k4l90J55L50k41n3j01L14l24J01J06j70M93l45o0O5J61l11M18j46j04
2417bJ87k18k27N12n72J92L95k15O4j49n1J01J23j10j67OL82j52j59M00m54K7
2439h7k08K17j80J25K69k34j26j10J50RL91k52K17l15J94J43J29m41P9J02nO5
2461A32j07kp6n7K01l03J98K08p9l54J34K6j9J58r5N6K39m05Q7K54l33J96j42
2484h3N6M1O3l9K4K8k30oJ01J97j52Q8m0J40m02K20j41J50K2N6l37R7K27j63Q9
2509Fj93L17l34L49J61k83J08K0p4o6M7j31L75m78L99m9j42m0J3J58j42n5q5L48
2533B29k51Q5j84J94N3j33l18R8J59J11j55K09J00p1K73l83J45j35q5KJ0Oj15
2556a56K52n9o5J65j54l6o3J16k4r9J34j69K61j52J17p9K8L6j21k67J34R6K05
$$ plain form
2395 41 104 80 -310 -155 195 -46 -99 -200 114 -210 -109 -3 -173 320 -25 -85 -20 141 -170 248 102 -2
2417 -2 185 -33 -260 252 -320 -128 267 52 116 -33 -84 17 140 30 -137 -131 251 99 -60 340 -114 -87
2439 -87 -295 -78 -258 -133 136 -98 -224 -334 -184 -175 216 -36 181 -134 60 203 332 -109 -30 72 67 132
2461 132 25 23 -53 -110 91 -212 -14 194 115 -239 -105 -79 -98 60 -35 21 260 -145 -58 196 -137 59 -83
2484 -83 -27 14 77 38 62 90 -140 -146 -45 152 0 88 48 188 -214 6 -135 15 37 93 -244 -147 80 -83 6
2509 6 -187 130 -204 145 306 23 131 151 77 11 58 -73 302 -176 223 174 32 -8 5 163 21 -34 -119 229
2533 229 -22 63 -121 73 126 -7 -325 -227 -68 43 -112 97 197 126 399 16 161 26 -59 -57 -47 -41 -156
2556 -156 96 37 -28 137 -17 -53 -116 0 -24 -123 11 -158 103 -49 68 -11 17 53 -68 -335 -201 -105 100
2579A00j96L8L1P4J54k34o1j12L91k02J10k33L45k48k52J53K01J9j85K06j96P2
2601b5J51k92J59j10L49j63j94O6J62j77K31k81J3J79k04J60J30j27j47K55q3
2622E2j44J28j43J12K09j20J0q8l65L61n2J15j77O7n2J38L6j12L7o8jR9k7O2o
2647G1k28K77q6L8j59Q8Q7k11p8K26K7j06R1J13j4L1j70j50J67l8L9l5m5k50K05
2672a10K19Q0j83J61m15L48k8j10J92q8J7kl5O0k20J27Pl1k06J1K94R6l26J65
2696B3N8j04L2k7J44n9m1j08nL55k41j34Q9j91J25J14k03J45j24K92O8r2j71N20
2720D65m06j46L7Q1k3OoO5k1n5K16l01K50n30L64J8l0m8j1L83m86J79J9mp0K64
2746B10n75M9L91k2m5j61R7K3J85L5k28J35jj68N7N8K7k31K60n2k2M8j39K1K21
$$ plain form
2579 100 -96 -58 -27 47 201 -33 -94 -206 185 -17 93 -140 205 -43 -295 -142 59 78 -107 99 -97 -25
2601 -25 126 -166 -7 -117 232 69 -125 -59 103 -74 157 -124 -111 68 -136 24 154 27 -120 135 52
2622 52 -92 36 -107 5 214 94 104 16 -349 12 -40 75 -102 -35 -87 51 87 -25 12 -56 -57 42 15 77 71
2647 71 -157 120 34 72 -87 1 88 -123 -201 25 52 -54 37 150 136 167 -3 -153 14 -24 15 -20 -65 -315 -110
2672 -110 109 189 6 167 -248 100 72 -38 154 66 83 81 46 106 -114 13 20 -11 -217 -206 88 184 -142 23
2696 23 81 -23 9 -18 126 67 26 -82 -87 268 27 -107 -18 -209 -84 30 -173 -28 -152 140 208 116 -55 465
2720 465 59 -87 -50 31 8 14 8 73 52 -3 213 -88 162 -368 -4 14 -16 -64 -75 308 -178 1 20 16 -54 210
2746 210 -365 -316 75 53 8 -153 -56 -33 152 187 -41 94 93 -75 -18 40 67 -164 96 44 22 70 -69 -48 173
2771A73j45k55M21j11M9j82o1M54m57j28N7J68j33J41j63K32p4J04J06k39kJ03
2793E8o5K00m76J79L02K1k43M5j60K50M8k51l3L5o6K77j28j06L7J29j23L40l28
2816e8J53J1M4k20K09j51r3K71j90M1j56l2K50k78MM8K14M9j44J67l36O1J83j10
2840f3K13m40L60k85K64Qj43K1K06k63K84l88L18P1j60om6J65P0k35J11j2N8k52
2864a44K34Q3k34J8m9K04l40O8J24P3%J19m2p4PJ70l61P5j04N8K43k55O5l4K82
2889A86O4l56kr9L8L6K64k15J81o3J21kl87J37J02m0j48N18m35J26r7k7R4P5k09
2914a38Q1NK27j75p8M4j8J79j52J8j41J34K88l17R8j04M2J38j7k22J10rK7J96
2938B16j38J8J91k71k7K31j88j00R0j29L65l69K24M9j35l5Q7j12k49L65R2j24
$$ plain form
2771 173 28 -227 194 83 132 -50 -111 343 -114 -242 -185 -17 -150 -9 -172 60 -14 90 196 -43 -45 58
2793 58 -7 193 -283 -104 198 219 -24 21 -139 111 159 -92 -125 -90 -156 121 -7 -113 -76 53 -70 270 -58
2816 -58 95 106 150 -70 139 -12 -105 166 -24 17 -139 -171 79 -199 -195 -147 67 116 -28 139 -197 -136 47 -63
2840 -63 150 -290 70 -215 49 57 -86 -65 141 -122 162 -226 92 163 3 -3 -49 116 186 -49 62 50 108 -144
2864 -144 90 173 -61 -43 -92 112 -228 -160 -36 37 37 156 114 40 47 217 -144 -69 -173 -115 128 -127 -62 -96 186
2889 186 250 -106 -108 -207 -169 -133 131 -84 97 34 155 153 -234 -97 5 -35 -183 335 -100 26 -71 -98 -4 71 -138
2914 -138 -57 -52 175 0 -78 -34 -52 127 -25 -7 -148 -14 274 -43 55 -49 -7 131 114 -108 2 -7 20 216
2938 216 78 96 287 16 -11 220 32 -68 22 -107 258 -111 113 162 27 -8 79 -33 -282 83 175 51
2960E1p8Q3j07K9P1J2j74j3K11q3qJ08Rj13K06j59P7o7j22j08J78M3J03l03J5
2985a39j6K79k9m36L81Q8kR6k89J77r9m8O1j60K11j65J47j84J5Q2k0J0J56k20
3009a04L3R8p1N4j58L0K47j26L63n55K95k44o5J70o0R2q5J03M4j49K06L9k81K27
3033A03O4j51r9J10N3j45J72r4K06J0k14R9j59J49q9j99K47R8j74JJ53p3q2rO8
3058D5R4o6l85L70q1J98o5O7m8M0j05r7N4J14j51MJ9m7J11j40J60J19k66j10K22
3083E6l4L06l36J41k22J65pm11L36L06l32j11K09j47j14j6J39J09J4L3L7k27J45
3106C9R5j27J48j9m40J65J84J89k5O7l07J43j52p5L9j0M6J77M5j46j00K05j14
3129B7l23N0J24L09l05J23m9J6k32K23J96l10P6Q0j94j5K66j31K74k54j7j65L85
$$ plain form
2960 51 -27 56 -51 -22 49 61 -113 -126 85 2 -6 102 111 -2 204 45 122 55 -67 -175 3 46 149 -154 -139
2985 -139 -155 124 95 -341 40 128 126 222 -67 110 11 -37 24 -136 75 -90 57 -127 -112 -30 -50 -40 116 -104
3009 -104 -71 27 -44 10 -148 -118 129 3 366 -189 106 -138 -203 -33 -93 -1 -86 17 61 -88 118 157 -124 103
3033 103 167 16 -83 27 80 -65 107 13 219 229 15 114 -45 104 15 -184 63 161 -13 -12 141 68 -14 -23 45
3058 45 139 73 -312 58 -23 175 110 177 129 169 64 -33 21 135 -16 -12 7 -40 71 -69 91 210 -56 -166 56
3083 56 22 328 -8 133 -89 76 69 -342 -6 300 -32 -143 66 -81 -195 -211 -72 37 51 84 121 -106 39
3106 39 134 7 155 136 -304 -139 45 234 209 276 -31 112 -40 -115 -76 -86 -40 137 182 36 -64 141 27
3129 27 -296 -246 -122 187 -118 5 -44 -28 -260 -37 159 -151 -75 5 -189 -204 62 -69 205 -49 -66 -231 154
3152A54j04N3J25n1k28O0l6j32L0J84j47K58l08ML27k42J08k13L04J3j18LK36
3175B80l44P5J05j82Q9j57k8J16r4K20J30k20r0Q3K1j9j00L5k4j4L16j94j43K08
3199F9%n1J97m05J00K08K15k55j70j87L58k0l53K41O1N5J09nk98J60k56L27k04
3222a04r5K08Nl12L93j01j05l8M4L01k48J9O5Rj37K04k13m2m5O3L66k57o8J00
3246A2L3q7P6k5m0q1J28k44J06o2J31n8Q4k6p5L65l59J64o2p6J76k03K1J65j43
3271h0r4R2L50j88J5p1M6n7J18j41j76K81J8k69J14J21k4k19k8J66K44l58L60
3294B20r1k1l4PP8n0N1j51q4K04p7j2k27J89O1J7Q6j42L8k27N63m06P1m43K47
3319a33J65k18J92R2R6l96J39o4k5O3R6P2j81L53j56k13N37p18N60l73K34n1m27
$$ plain form
3152 154 50 103 228 177 -51 9 -27 -159 -129 55 -92 166 -142 -138 189 -53 55 -158 146 159 41 44 280
3175 280 -64 11 116 -66 23 -134 -162 -46 -140 80 210 -10 -100 -17 4 -15 -115 -80 -104 -118 198 4 -139 69
3199 69 69 18 215 -190 -90 118 333 78 -92 -279 79 59 -294 -53 8 63 172 167 -131 29 -227 100 -104
3222 -104 -199 9 14 -298 95 -6 -111 -149 -105 196 -52 -33 32 41 -96 108 -105 -147 -192 -129 237 -20 -88 12
3246 12 45 -42 34 9 -31 -112 16 -228 -122 -184 -53 -111 -27 -53 -128 237 -122 42 -20 -96 80 -123 -102 63 -80
3271 -80 -174 -82 268 80 95 24 70 13 131 -10 -186 95 113 -156 -42 79 55 -164 -192 -26 218 -140 220
3294 220 129 108 74 81 159 109 160 9 -75 129 52 40 -187 2 63 80 166 24 62 -165 398 -8 63 -380 -133
3319 -133 32 -186 6 98 194 -202 -63 -127 -152 -89 7 79 -102 251 95 -118 419 -299 261 -112 122 71 -356
3342c56O12j45k97J77J25j55M72m95p8L04j10l7J69k09L45j07l00J04j89M3k8
3363a55P5K47r9q3K44j24l2j03J91l05J66J36k62l4J05O7k41P7P2J55j48n3K34
3386A30K7j70j7J88j33Q3j27J3J2J62j43k53M57o3m0r4k4k34L33m1j59J32j37
3409i8J2J62K59k91L68l20j33Q1j08J90l13J01J01J30j36J32j82j89J41L51k89
3430c1K10k91K24J01l17J72k60J77m2K3P3J5j79J36R4N7l07K93q0O4p7J8K6k81
3454a82R0K85j31n8p5p1K89m7j59R3N9JJ39l14M8K5m2j27J17J34k89P9J49r6j7
3479a00N1M7p5M7J46Mj91k3J37j5j52J82n0m3J38j52L8j43K91k04j6J95l06K08
3503A4q4j35K65M8j40j40N6J69j92J34o5j09N87k77j67J7K67l80l5K30k09J85
$$ plain form
3342 -356 256 111 -186 -9 116 -39 433 -62 -140 164 54 17 186 -23 322 215 -85 19 -170 -127 -155
3363 -155 -80 167 68 -15 229 105 73 -30 161 -144 22 158 -104 -138 -33 34 -207 -130 -58 97 -51 -104 130
3386 130 157 -13 -30 158 25 108 -19 -6 6 168 25 -228 229 166 126 32 8 -226 107 66 -93 39 -98
3409 -98 -86 76 335 44 412 92 -41 40 -68 122 -191 -90 11 141 5 137 -45 -234 -93 258 -31
3430 -31 179 -112 112 213 -104 68 -192 -15 -57 -34 39 54 -125 11 105 162 -145 148 68 132 55 73 99 -182
3454 -182 -92 193 62 4 -71 -142 147 100 -59 34 93 94 233 -81 -33 -8 -50 -177 -60 74 -215 -136 13 -83 -100
3479 -100 -49 -2 -77 -30 116 120 -71 -94 43 28 -124 58 8 -35 103 -49 -11 -154 137 -67 -83 112 -194 14
3503 14 -70 -205 60 108 -32 -172 -116 53 -139 -5 -70 -179 408 131 -36 -19 248 -132 -167 63 -146 39
3525C9k38K19K05j52j10J70j47k9j2j16J18k54J0L12R5m4j85%L18l39M5J51j08
3548e2J5Lj49L21k54J45k3P6j93m3L66k44o2j17M72j59o6j38j26L32j37K6P4J5
3572H2jj18J65l4Rk73p4L23L3j24k15J8N09l89J27N4L5q7J9J60k43O3q5J71l8
3597H7j66K00k36J38J21k13K7m1K54Rk05j83pK94j29P2K30k56Q9j85lP8M6K16
3621B37J21k57J09r8k30J73j6K74k76Rj74j61K39J14n7j60k27K41J77q7N3P0j42
3644f8K24r0k59L68j73J07k32K61Qj25q1L8N3N8O1m5j33j18L3J15q4N8j84P0J45
3669Gm0K08l61K28k43M31k76Q6r9j63K12J66q4q0J01j05k40K45O2O9lk54j15J09
3693a39J53Q7P8o1j44N8M1J50j07J03k64J21J46j14l70J68QJ37k08N7J24l9j17
$$ plain form
3525 39 -199 20 225 73 -37 133 -14 -43 -55 -171 -53 -307 -297 15 110 66 -119 -119 199 -140 -95 56 -52
3548 -52 -37 -34 -183 138 -116 29 6 82 -111 -154 212 -32 -94 -211 261 102 36 -102 -228 104 -33 -7 67 82
3572 82 81 -37 128 94 103 -170 -244 79 112 -12 -227 -209 300 -89 38 92 127 40 59 219 -24 39 -46 125 87
3597 87 -79 121 -115 23 144 -69 -42 -83 171 180 -25 -208 -215 79 -50 22 252 -4 85 -100 -103 -25 21 237
3621 237 358 101 210 112 -118 55 39 313 37 46 -128 -289 -50 64 7 -153 -380 -139 38 -49 4 74 -68
3644 -68 156 66 -193 175 2 109 -123 138 146 21 -60 -22 31 89 150 105 -28 -146 -113 2 -82 -24 -208 -138 7
3669 7 -33 175 -186 42 -201 230 -46 40 -59 -222 -10 156 72 -8 93 -12 -252 -7 55 124 121 -133 -248 -139
3693 -139 14 101 179 118 -26 32 73 223 116 219 -45 76 222 108 -262 -94 -86 51 -157 -100 24 -15 -132
3716a32L10q5j73K32j01K6r8j1N8M1m5J15J2q3k66Q8J10rJ17k27j65L25N4J06
3740A99j89j12k85M39j17j03K88p8j62K20k61J29J7j79K09J6J76l16O7l7K57l5
3762A43o2o9p5J25k10M24l82Q1J15l06L9L30J3Q9k26o2K9j39J15P1j60j3J08k1
3786d3j43q9N97l50J39j3m3o3J42kJ7j34j57M3K6K9J29J48k73M7j65J7q8K00j47
3811a76L51j22k10J62N2J93n51J67k30L90k0J38j15P7j83J99p8J13p0p5n5K32
3833A89j45j51K81m24K22J40n9j36k07M99l54K98k01Lj85L43r6q1J00Rn9J44k25
3856i5J14R7J68k87j1p2J03j15j00K55j26q3J28N1l5J20p7N1k20j1L96n07m5M68
3880A67J03k20k1K0J15k27l03M40j11k74L06M9k44L78j09q6j57J06J05l57J86
$$ plain form
3716 -132 178 93 -80 152 51 77 -21 -32 26 67 22 137 149 66 -200 -112 -2 -11 106 -121 -286 39 93 199
3740 199 10 -102 -387 52 -65 -168 120 42 -120 100 -161 -32 -15 -194 15 31 207 -109 -42 -79 178 143
3762 143 81 12 -63 62 -148 276 -106 -25 90 -216 -177 153 166 255 29 -33 -4 -143 -28 43 -117 -130 -22 -43
3786 -43 -186 -275 322 -28 111 98 55 -8 134 132 149 15 -142 -99 -73 -44 85 233 -40 7 -158 -141 -229 -29 -176
3811 -176 175 53 -157 5 57 250 -301 -134 -364 26 6 144 29 106 -77 122 44 157 87 12 -43 189
3833 189 44 -107 174 -250 -28 112 53 -83 -290 209 -145 153 -48 -45 -230 113 17 -64 36 45 -14 130 -95
3856 -95 19 116 284 -3 -14 -86 17 -98 -198 57 -69 -152 -24 27 -8 112 35 86 -134 -145 251 -256 -301 167
3880 167 270 50 29 49 164 -63 -366 74 -37 -311 -5 44 -200 178 69 -17 -174 -68 37 -320 -134
3901a34J09O4RJ75p2l2r4J7j52L24J40m29m8J53j2m0K0R5j7M3j27J10k55nK18
3926F0Q0p8j07M0j93J82k84K99J87r2l3j5l12K51N4j53R9O9j33o3J47k09P6J21
3950gJ2J13k24K64J03k02p2j23K70j37J80j42j45M7Q4%l77J85K67j09K90j04k20
3973d7l1J45r9K5j51J63l4l6K3J96k21L7J19k6p5J40j63J64j37K2P1l4L7K7l67
3998b52K76O3J09j6j73j34m4J15r8J05L63r0m67L13p8K51p3k03k35M71j11j58
4020f6K80k67q0N6J13k15L92k35j40J82J98O6k30k8l6oK20Ll55J16K7J91K6j03
4044A09k45R4P9J58p6k08m7J48K51l21L1J9o3K63m39N14l65k17J26J43J19p7P1
4067F7n5j16N36n00R1j57J32L9K00k58K10l97J69K36m04N1P3L7J49j04P0j23o0
$$ plain form
3901 -134 -25 39 48 223 151 119 25 42 -110 214 354 -75 -123 30 18 -22 -2 93 76 119 -8 102 -153 -158 60
3926 60 140 62 -45 -5 -198 -16 -300 -1 186 94 61 46 -266 -15 39 -114 -15 54 -79 -142 5 -204 -128 -7
3950 -7 5 118 -106 158 261 59 -13 -136 134 -3 177 35 -110 -63 21 21 -356 -171 96 -13 277 173 -47
3973 -47 -78 67 -32 -7 -158 5 -29 -65 -42 154 -67 -30 89 63 -12 128 -35 129 -8 14 85 51 88 115 -252
3998 -252 24 87 196 180 7 -127 -171 -56 -154 -49 314 224 -243 70 -8 243 170 -33 -268 203 92 -66
4020 -66 214 -53 -133 -77 36 -179 213 -22 -162 20 218 284 54 26 -10 -16 204 207 -148 -32 -5 186 212 109
4044 109 -136 -42 37 195 119 -89 -136 12 263 -58 -27 -8 -71 192 -247 267 -98 -315 -189 -46 73 -4 67
4067 67 12 -104 432 -68 23 -134 -2 37 237 -21 189 -208 -39 197 -207 -156 -83 -46 103 -1 69 -54 -114
4090a14R8nK74p5q3L2k29K1M0j11L6M8qL56j40k7j33j18M8j35K63mk3Q4k38n9
4116b02J71k14L46k57K3K05j75K72J7M3k69j14M9P3J42j53O2oL4k9q9j58J73l
4140e9J20k9J1N7l84K62K5n8m7n3j60J98R8J72j76K0o7J77J99m30J65l64M26k13
4164a10O4j7ML02j61k9j4l9j66R6k01L33M8k78l3p3K13R7N1o9j64J19m2j40N8
4189a51J74q4J75k97J43J23j49K37k18J20J58k60O0K4M5k04K10K8m09J37L75k35
4211BJ19k21J3J73n6j03K89k35j3m7R1J21j50J9j48L38o5j16R6j58o5J20K52r7
4235A59j85lm3K08n0ql5k83K88r0L5J98l09K43k54J82q3J33j04o6J85l0Ok64L77
4260B07m06L13p7j30j21J60l1j42K79l64L71Q7j22J45p4r3N3J15Pk05K2L1k1Q
$$ plain form
4090 -114 -16 -21 253 178 95 127 -102 -81 -41 -152 -116 -68 -76 280 140 113 -20 -138 -90 -225 38 34 11 95 -143 -202
4116 -202 -31 -245 101 -156 -133 72 -103 169 186 229 -40 -154 -105 -32 110 -43 19 13 47 18 -71 -229 -56 -59
4140 -59 61 32 43 100 -284 -22 3 -55 -102 -155 -315 -117 -19 153 -23 -3 -70 107 306 -124 41 -323 103 -110
4164 -110 -46 -63 -59 243 82 53 39 0 -166 -70 -271 62 110 -168 -201 -274 -61 36 87 18 -146 -27 -69 -209 -151
4189 -151 23 -61 114 -183 -40 83 -66 171 -47 73 231 -29 31 55 100 -104 106 134 -275 -138 237 2
4211 2 121 -100 -87 86 30 -73 216 -19 -32 -79 12 133 -17 2 -146 192 127 11 107 -51 -116 4 256 159
4235 159 -26 -29 -72 136 86 78 43 -240 48 -42 -7 191 -118 125 -129 53 -30 103 -1 -67 118 88 94 -170 207
4260 207 -199 114 37 -93 -214 -54 -85 -227 52 -312 59 146 24 169 95 2 55 170 177 -28 -6 25 4 12
4284A2j60jlK12m4p9J31R0j92R1k08K06p8q6K87k85O5J30L4j56k38k7L65m82K79
4309a37K48j31J48o2k09M9K43l7l04L94J9k77N3K5L2J85k70R8p8j48J89M33k18
4332B45k29k4O2m4n1J72r1j39M45l02j66K39j06L2j22J43J50k91L25l34j4K03
4354A03m35L32J17o4q0R2l6Q0j42M08m35K8J68Pk03o9K92k45N4%Q2j37L43l83
4378a23q2K28nk40Q0J53j85J53M9l8J61l77L53P1k96J10M5R2k49L35k76K90n29
4401b80K51j31J76%j56L68J7j57j62K21n9m8j57j5Q1j33J02j32p0L17k1k59k9
4424b76L74N0l4j43j1L3OJ40o9L22m31r1K44k18o9J53k83K56p1l5J08O9j05P1
4448a0M9L4k94L62l29M31l61J30K26j21j88J42R8q9k8J46K4l15j0j80L06l6r2
$$ plain form
4284 12 -148 -149 -152 60 16 -63 68 158 -34 57 -151 55 -23 -109 178 -107 -42 88 122 -34 -272 -299 66 -416 -137
4309 -137 111 -20 128 66 -143 -94 149 112 -192 202 221 -56 -3 22 54 239 -31 67 -11 -159 30 463 245
4332 245 16 -8 54 10 -41 131 40 -99 346 44 -122 117 11 43 -79 64 214 -77 248 -86 -100 103
4354 103 -332 0 117 53 -27 65 29 109 -33 375 -60 -32 136 143 -60 -129 163 -82 -28 -28 54 -83 260 -123
4378 -123 -205 23 18 -222 -142 11 -174 -21 28 -10 151 -226 127 198 -98 12 57 149 -100 235 -41 249 -280
4401 -280 -29 -160 16 16 -140 228 245 88 -74 147 88 40 -117 -132 -51 -184 -82 -214 -284 33 12 -247 -276
4424 -276 98 148 114 -29 -40 -7 -1 139 70 392 -39 -130 114 -104 -173 -20 -303 -47 -118 -153 -45 24 -81 -10
4448 -10 39 73 -221 141 -188 243 -118 12 238 117 -71 71 169 80 52 198 222 -93 -103 -283 23 -13 -105
4471a05J11n2j83J91j4J06j06m7J06O0p3K89k08n53O81k67J51j16N9P6n3k71K57
4494C9j22J43r2j56K58J40J99m84J65K8j40K95j10j57k3qO4k0K17j39J59m31K8
4517a47p7L98j35j40m1O7n5M7q3L65j79k94J36M70l21L5Jj7j26r4J20L8J36k45
$$ plain form
4471 -105 6 -46 -229 -38 -52 54 -52 -99 7 67 -6 283 75 -478 203 -64 87 -29 30 106 53 -218 39
4494 39 -83 60 -32 -188 70 210 409 -75 90 118 -22 273 163 6 -17 -25 39 19 236 97 256 -175 -147
4517 -147 -224 174 39 -101 -142 -75 -130 -83 -166 199 20 -274 -138 332 11 46 47 30 -96 -190 -70 -32 104 -141
$$ [...]
8191C43
##END NTUPLES=NMR FID
##END=
