##TITLE=1H_DE-5 oil
 CDCl3
 8 sc, 
 11.8.2023
##JCAMPDX= 6.0         $$ Bruker NMR JCAMP-DX V2.0
##DATA TYPE= NMR FID
##DATA CLASS= NTUPLES
##ORIGIN= UXNMR, Bruker Analytische Messtechnik GmbH
##OWNER= root
$$ XWIN-NMR		Version 3.5
$$ Fri Aug 11 13:50:38 2023 Russian Standard Time (UT+4h)  she@DPX200
##.OBSERVE FREQUENCY= 200.13135
##.OBSERVE NUCLEUS= ^1H
##.DELAY= (6, 6)
##.ACQUISITION MODE= SIMULTANEOUS
##.ACQUISITION SCHEME= undefined
##.AVERAGES= 8
##.DIGITISER RES= 18
##SPECTROMETER/DATA SYSTEM= spect
##.PULSE SEQUENCE= zg30
##.SOLVENT NAME= CDCl3
##.SHIFT REFERENCE= (INTERNAL, CDCl3, 0, 15.7039)
##AUDIT TRAIL= $$ (NUMBER, WHEN, WHO, WHERE, WHAT)
$$ ##TITLE= Audit trail, XWIN-NMR		Version 3.5
$$ ##JCAMPDX= 5.01
$$ ##ORIGIN= Bruker BioSpin GmbH
$$ ##OWNER= she
$$ F:/spectra/data/she/nmr/H-F/1/audita.txt
$$ ##AUDIT TRAIL=  $$ (NUMBER, WHEN, WHO, WHERE, WHAT)
(   1,<2023-08-11 13:49:39.28 +0400>,<she>,<DPX200>,
      <created by zg, POWCHK disabled, PULCHK disabled
       configuration hash MD5:
       00 E9 B6 7A A2 85 ED C7 34 08 36 98 17 FE 4E 26
       data hash MD5: 16K
       52 47 AF 8D F8 E1 44 1F 6C E1 17 9E 6F F0 2E 1F>)
$$ ##END=
$$ 
$$ hash MD5
$$ C8 82 C8 6A 8E 4D A0 47 88 EE 28 4C 39 01 99 94
##$RELAX= 
##$RELAX= 
##$RELAX= 
##$RELAX= 
##$RELAX= 
##$RELAX= 
$$ Bruker specific parameters
$$ --------------------------
##$DU= <F:/spectra>
##$EXPNO= 1
##$NAME= <H-F>
##$PROCNO= 1
##$TYPE= <nmr>
##$USER= <she>
##$AMP= (0..31)
100 100 100 100 100 100 100 100 100 100 100 100 100 100 100 100 100 100 
100 100 100 100 100 100 100 100 100 100 100 100 100 100 
##$AQSEQ= 0
##$AQ_mod= 1
##$AUNM= <au_zg>
##$AUTOPOS= <>
##$BF1= 200.13
##$BF2= 200.13
##$BF3= 200.13
##$BF4= 200.13
##$BF5= 200.13
##$BF6= 200.13
##$BF7= 200.13
##$BF8= 200.13
##$BYTORDA= 1
##$CFDGTYP= 0
##$CFRGTYP= 5
##$CHEMSTR= <none>
##$CNST= (0..31)
1 1 145 1 1 1 1 1 1 1 1 1 1 1 1 1 1 1 1 1 1 1 1 1 1 1 1 1 1 1 1 1 
##$CPDPRG= <>
##$CPDPRG1= <>
##$CPDPRG2= <>
##$CPDPRG3= <>
##$CPDPRG4= <mlev>
##$CPDPRG5= <mlev>
##$CPDPRG6= <mlev>
##$CPDPRG7= <mlev>
##$CPDPRG8= <mlev>
##$CPDPRGB= <>
##$CPDPRGT= <>
##$D= (0..31)
0 1.2 0 0 0 0 0 0 0 0.06 0 0.03 0 0 0 0 0.0002 0 0 0 0 0 0 0 0 0 0 0 0 
0 0 0 
##$DATE= 1691747378
##$DBL= (0..7)
120 120 120 120 120 120 120 120 
##$DBP= (0..7)
150 150 150 150 150 150 150 150 
##$DBP07= 0
##$DBPNAM0= <>
##$DBPNAM1= <>
##$DBPNAM2= <>
##$DBPNAM3= <>
##$DBPNAM4= <>
##$DBPNAM5= <>
##$DBPNAM6= <>
##$DBPNAM7= <>
##$DBPOAL= (0..7)
0.5 0.5 0.5 0.5 0.5 0.5 0.5 0.5 
##$DBPOFFS= (0..7)
0 0 0 0 0 0 0 0 
##$DE= 6
##$DECBNUC= <off>
##$DECIM= 32
##$DECNUC= <off>
##$DECSTAT= 4
##$DIGMOD= 1
##$DIGTYP= 9
##$DL= (0..7)
0 120 120 120 120 120 120 120 
##$DP= (0..7)
150 150 150 150 150 150 150 150 
##$DP07= 0
##$DPNAME0= <>
##$DPNAME1= <>
##$DPNAME2= <>
##$DPNAME3= <>
##$DPNAME4= <>
##$DPNAME5= <>
##$DPNAME6= <>
##$DPNAME7= <>
##$DPOAL= (0..7)
0.5 0.5 0.5 0.5 0.5 0.5 0.5 0.5 
##$DPOFFS= (0..7)
0 0 0 0 0 0 0 0 
##$DQDMODE= 0
##$DR= 18
##$DS= 0
##$DSLIST= <SSSSSSSSSSSSSSS>
$$ [...]
##$SUBNAM2= <"">
##$SUBNAM3= <"">
##$SUBNAM4= <"">
##$SUBNAM5= <"">
##$SUBNAM6= <"">
##$SUBNAM7= <"">
##$SUBNAM8= <"">
##$SUBNAM9= <"">
##$SW= 18.05172834244
##$SWIBOX= (0..15)
0 0 2 0 0 0 0 0 0 0 0 0 0 0 0 0 
##$SW_h= 3612.71676300578
##$TD= 16384
##$TD0= 1
##$TE= 0
##$TE2= 300
##$TE3= 300
##$TEG= 300
##$TL= (0..7)
0 120 120 120 120 120 120 120 
##$TP= (0..7)
150 150 150 150 150 150 150 150 
##$TP07= 0
##$TPNAME0= <>
##$TPNAME1= <>
##$TPNAME2= <>
##$TPNAME3= <>
##$TPNAME4= <>
##$TPNAME5= <>
##$TPNAME6= <>
##$TPNAME7= <>
##$TPOAL= (0..7)
0.5 0.5 0.5 0.5 0.5 0.5 0.5 0.5 
##$TPOFFS= (0..7)
0 0 0 0 0 0 0 0 
##$TUNHIN= 0
##$TUNHOUT= 0
##$TUNXOUT= 0
##$USERA1= <user>
##$USERA2= <user>
##$USERA3= <user>
##$USERA4= <user>
##$USERA5= <user>
##$V9= 5
##$VALIST= <valist>
##$VCLIST= <CCCCCCCCCCCCCCC>
##$VD= 0
##$VDLIST= <DDDDDDDDDDDDDDD>
##$VPLIST= <PPPPPPPPPPPPPPP>
##$VTLIST= <TTTTTTTTTTTTTTT>
##$WBST= 1024
##$WBSW= 4
##$XGAIN= (0..3)
0 0 0 0 
##$XL= 0
##$YL= 0
##$YMAX_a= 58285
##$YMIN_a= -101350
##$ZGOPTNS= <>
##$ZL1= 120
##$ZL2= 120
##$ZL3= 120
##$ZL4= 120
##$ABSF1= 10
##$ABSF2= 0
##$ABSG= 5
##$ABSL= 3
##$ALPHA= 0
##$AQORDER= 0
##$ASSFAC= 0
##$ASSFACI= 0
##$ASSFACX= 0
##$ASSWID= 0
##$AUNMP= <proc_1d>
##$AZFE= 0.1
##$AZFW= 0.1
##$BCFW= 1
##$BC_mod= 2
##$BYTORDP= 1
##$COROFFS= 0
##$CY= 11.3945322036743
##$DATMOD= 1
##$DC= 2
##$DFILT= <>
##$DTYPP= 0
##$F1P= 15.7292609196834
##$F2P= 12.9074282941183
##$FCOR= 0.5
##$FTSIZE= 0
##$FT_mod= 4
##$GAMMA= 1
##$GB= 0.15
##$INTBC= 1
##$INTSCL= 1
##$ISEN= 128
##$LB= 0.24
##$LEV0= 0
##$LPBIN= 0
##$MAXI= 10000
##$MC2= 0
##$MEAN= 0
##$ME_mod= 0
##$MI= 1.114404
##$NCOEF= 0
##$NC_proc= 0
##$NLEV= 6
##$NOISF1= 3.799351
##$NOISF2= 2.8
##$NSP= 1
##$NTH_PI= 0
##$NZP= 0
##$OFFSET= 15.70392
##$PC= 1
##$PHC0= -21052.8
##$PHC1= 20.25272
##$PH_mod= 1
##$PKNL= yes
##$PPARMOD= 0
##$PSCAL= 0
##$PSIGN= 0
##$REVERSE= no
##$SF= 200.130013532006
##$SI= 16384
##$SIGF1= 3
##$SIGF2= 2
##$SINO= 400
##$SIOLD= 16384
##$SREGLST= <1H.CDCl3>
##$SSB= 0
##$STSI= 0
##$STSR= 0
##$SW_p= 3612.71676300578
##$SYMM= 0
##$S_DEV= 0
##$TDeff= 0
##$TDoff= 0
##$TI= <>
##$TILT= no
##$TM1= 0
##$TM2= 0
##$TOPLEV= 0
##$USERP1= <user>
##$USERP2= <user>
##$USERP3= <user>
##$USERP4= <user>
##$USERP5= <user>
##$WDW= 1
##$XDIM= 8192
##$YMAX_p= 0
##$YMIN_p= 0
$$ End of Bruker specific parameters
$$ ---------------------------------
##NTUPLES= NMR FID
##VAR_NAME=  TIME,          FID/REAL,        FID/IMAG
##SYMBOL=    X,             R,               I
##VAR_TYPE=  INDEPENDENT,   DEPENDENT,       DEPENDENT
##VAR_FORM=  AFFN,          ASDF,            ASDF
##VAR_DIM=   8192,          8192,            8192
##UNITS=     SECONDS,       ARBITRARY UNITS, ARBITRARY UNITS
##FACTOR=    0.0002768,     1,               1
##FIRST=     0,             0,               0
##LAST=      2.2672688,     0,               0
##MIN=       0,             -101350,         0
##MAX=       2.2672688,     58285,           0
$$ Real data points
##PAGE= N=1
##DATA TABLE= (X++(R..R)), XYDATA
0@%%%%%%%%%%%%%%Kj0J6j6J6j6K4l2L2m0M8n6O8p6Q8j04J20j36J53j72J95k20
36a16K47k78L10l46L86m30M79n29N85o47P15p90Q70r57J053j161J278j408J556
55H17j723J913k130K378k670L021l447L981m668N594o922Q989j2673K1235p7907
70f4212l7138J13817k8124j6088M4882J3480l9380J9679J8836j13K2085J0561
82E8285m3891m991K5803k0673k4152L4872P255l8986j0727P744j5560Q343K3323
95F645j6182j3961K9652q330l9791K5876M7199k3083k6768K6997M714k6604O513
108g123K0148k923N221J158k5706M67K8567j0480k1049K5954J2986l4480j3554
121b0814K3706K972p266M738n670o517R538r338j7853K4211K3383k7375j8749
$$ y = [0, 0, 0, 0, 0, 0, 0, 0, 0, 0, 0, 0, 0, 0, 0, 2, -8, 8, -8, 8, -8, 16, -16, 16, -24, 24, -32, 36, -40, 48, -56, 64, -72, 81, -91, 104, -116, 131, -147, 163, -183, 203, -227, 252, -277, 308, -339, 376, -414, 456, -501, 552, -609, 669, -739, 817, -906, 1007, -1123, 1255, -1415, 1606, -1841, 2140, -2528, 3066, -3856, 5133, -7540, 13695, -64212, -101350, 12467, -15657, -31745, 13137, 26617, -12763, 6916, 25752, 25639, 47724, 58285, 14394, 9403, 35206, 14533, -9619, 25253, 32508, -6478, -17205, -9461, -25021, -16678, 6645, -9537, -23498, 6154, -2176, -41967, -16091, 31108, 8025, -18743, 8254, 12968, -13636, -7123, 13025, 10102, 15323, 16481, -9225, -8758, 19809, 9329, -11720, 14234, 27220, -7260, -20814, 2892, 5864, -1402, 3336, -2334, -8851, 687, -8651, -26504, -2293, 21090, -6285, -25034]
134b5034K6684N322k4759P574K4303m794r813J169n015M455J3338n409j1685J6085
148A2421M167k4643m939K2615J389j3324m45L694l294j147l649n280J5405P875
162A0845k1293r280K3644L778j9209M705K1341m478j7040K236Q309K792j047n551
176b48j538R419k099j4047J743J8607q68j7980K915J0865m241o948J364M864L223
191E031k166j1001k51J4625j808j5083M559J4420p378j4877O882J2359l008n735
205c431J458M895L692m732p209P468J2171p598j3168P642Q325o151j0228O055
219h11P418m445o408l150N875M732o316o449N745Q683o971q720Q238Q884n112
234A193q092M091P875j089q106q6Q818M083p879p063R079P398q800p613P849P546
$$ y = [-25034, 1650, 6972, -17787, -10213, 14090, 9296, -517, 652, -4363, 92, 13430, 8021, -3664, 12421, 16588, -8055, -12994, 9621, 11010, -2314, -2759, 935, -2359, -3506, -7155, -12435, 2970, 10845, -10448, -19728, 3916, 7694, -11515, -6810, 14531, 10053, -6987, -4751, 3558, 6350, 5303, -248, -1786, 7633, 5534, -8513, -6770, 11837, 10969, -7011, -4096, 6769, 2528, -4420, -3056, 1808, 5031, 2865, -8136, -8387, 6238, 4430, -10653, -6094, 8326, 948, -13929, -7047, 5312, 2304, -3431, -1973, 2922, 6614, 1882, -5327, 2141, 14312, 6714, -6454, 1188, 9513, 3362, -6866, -811, 6607, 2162, -4246, -7396, -1521, 3211, -3105, -9554, -3809, 4874, -2097, -10817, -2579, 6305, 1193, -6899, -2808, 5067, 3978, -4128, -4214, 4604, 8687, 808, -6255, 2824, 10222, 1422, -6191, 1658, 9204]
250I204q236q508M328Q719l164q893J88R638L42r568k803R910N227j0475l073
265g164R145M561o748m847O733N472l491n367J657N119L26n686l451O929M028
280G216o299n707N442N664n899q208N035O367k967q117R52R769k49q989r51R476
296B535K786r332l458R570M726o879o483Q100O558o216o542L464P718l647q539
311e639K032Q935j295p918j476P828P27o793k087N392L363m078n424M138O830
326D535j514p782J590P048p29n977j203P293L039n944l417N670M351n050o651
341d741M199P352m586q461L758Q959l011q534J45R230K25q218k899P903L779p614
357b514m407O739N639o308m985N235N562l443n723L163N914j164n230j937N716
$$ y = [9204, 968, -7540, -3212, 5507, 2343, -6550, -6362, 3276, 3618, -5950, -8753, 1157, 6384, -4091, -7164, 1981, 6542, -206, -5053, 1680, 7152, 3661, -1706, -49, 5070, 5396, -290, -3741, 3188, 7216, 917, -4790, 652, 6316, 417, -7791, -2756, 3611, 644, -7473, -6521, 3248, 2999, -5990, -6941, 2535, 5321, -4011, -7469, 2101, 6827, -52, -6535, 1565, 8123, 1907, -4635, -1171, 6547, 2900, -5639, -3607, 5328, 4033, -3885, -5361, 2467, 3194, -3599, -5686, -294, 3069, -1009, -6433, -2295, 4535, 3021, -4761, -3171, 3877, 3148, -2829, -4032, 3261, 6300, 356, -3061, 2609, 6960, 1910, -4741, -542, 6810, 2224, -6237, -2479, 6480, 3469, -5065, -4920, 4310, 4535, -3683, -6582, 1321, 5100, -2514, -6921, -182, 5457, -851, -5836, -601, 4961, 1518, -4205, -1042, 4872, 3708, -1522, -3459, 2257]
372B257L729p315m009O877M172o116n458N259N142k588o391J216O223J99o588
387c391k856Q366M213r403k689P787L034p248k163N016M340l767n685K834N882
402D270J58p939M12Q940p26r559q0Q233Q83o361j072K946K402j799m488J020P634
419D874n51r274r00R782j247q967L395O869j891m379j416K952M852j334o721J838
435b118Q028l732q621M148J0817m349q521M430L184k219k807l13K998L305k806
450A424q810L979Q066m829p716P712O218p301o251O087L571o97l9l245K246L680
466D095l149o357N966J0306q433q293N965M679n832j872M050J082j747j172o764
481g476M380R862n925p828Q050N592j2163k649J0690L125o203j227K375j072L26
$$ y = [2257, 5986, -1329, -5338, 1539, 5711, -405, -5863, -604, 4538, 1950, -4441, -3225, 2998, 3197, -3391, -6247, 2119, 6332, -3071, -5760, 2027, 5061, -2187, -4350, 666, 5006, 1239, -4446, -1612, 4270, 4428, -3511, -3099, 5841, 5115, -4444, -4524, 3709, 4592, -1769, -2841, 105, 2507, 708, -3780, -2760, 4874, 4323, -4951, -5851, 3931, 2684, -6283, -2888, 3981, 2090, -2289, -3705, -753, 4099, 2765, -3956, -2118, 5910, 2178, -6443, -2295, 8522, 4173, -4348, 82, 3266, 1047, -1760, -2073, 925, 4230, 1424, -7386, -3407, 4659, -170, -7886, -174, 6044, -1257, -7508, -1421, 2150, 1453, 1414, -1831, 415, 4095, 946, -5411, 555, 10861, 2428, -5865, 100, 4779, -1053, -2925, 1125, 2207, 460, -712, -7476, -3096, 6766, 841, -6987, 1063, 6655, -5508, -8157, 2533, 5658, -545, -1772, 603, -469, -143]
496a43m5k770P362M562j0679n525R524L798q793J784P501l464n883Q68q6L018
512A029M656n091n358N641L654j0421r86J3926j108r979J156L832l825K025J095
527B46q46M591J609j0810k782J2747K929j3149M149J1678q746q478M711N518n9
542C308p89l101l396L749K125q588K470J2642l829j2927M628O690m609j665O418
557C126J76j528m48o593J83J0565J718j1584K293R638r523p502R994P211n033
572B693j836J33l823K312J787m479L141J0329q212j2605P726P891o062l154Q151
587C992p36p585j781L132J616O217j206q209K926O498o942m192J1026N254j0235
602b25l752N535k094P27K314m78n81K574n667p799Q642P867q657l027R197j591
$$ y = [-143, -188, -2958, 4404, 8966, -1713, -7238, 2286, 6084, -2709, -925, 6576, 3112, -2771, -1903, -1989, 1029, 5685, 594, -4764, 877, 4531, -5890, -6876, 7050, 5942, -4037, -2881, 951, -2874, -849, 246, -600, 3991, 5600, -5210, -7992, 4755, 7684, -5465, -1316, 10362, 1616, -6862, -2151, 3367, 3308, 2519, -582, -3978, -229, 1896, -6692, -4222, 8420, 4591, -8336, -3708, 2982, -1627, -3292, 3126, 3302, 1774, 1326, -5267, -5084, 5481, 7199, -4385, -2092, 7546, -1977, -9479, 515, 7726, 2693, 857, 990, -2833, -521, 1266, -3213, -72, 10257, 2045, -10560, -2834, 5057, -1005, -4159, 3992, 3256, -4329, -6110, -2978, -1362, 4855, 3649, -4560, -1634, 4864, -2078, -6270, 4756, 10010, -225, -3977, 1558, -536, 191, 2505, 2027, 1446, 4020, -1647, -9446, -804, 7063, -1594, -4621, 4576, 2985]
618B985r417J145O241J663L20k145n167L287M690n345k767J1288J174j2386j461
633e895R310j212m158K895L429l561m23l052j853N975M730p511l113P453k706
648C08o465K972P895j885m835K61q90K075L316m659q70O677K86j0081P57R619
664D481m61n515J826N044k878m239M82L072K745l32o571k00N924l256p155M826
680b207P728m930n985K497K065P09k55n78K25K748j052m659K231P378l894n453
696c432M721L343n442j199K361K831L8k348m479J839M349k836n126N363N771o462
712g08o297N102M781j755l825J747K125k11k910k179O909K266n821l935O135L250
728D674o191j889O729J563n586j169J596K041J06l231J34L974K01n293j880N663
$$ y = [2985, -6432, -5287, 954, 2617, 2937, 792, -4375, -1088, 3602, -1743, -4510, 6778, 7952, -4434, -5895, 3415, 2203, -1955, 940, 4369, 808, 385, -2667, -4520, 1455, 6185, -1326, -4439, 3014, 308, -6157, -3185, 4710, 2825, -2010, -1749, -2639, -564, 2752, -1907, -2777, 3900, 4186, -5895, -5138, 4481, 4020, -1495, 331, 5375, 2497, -1742, -1260, 1812, 4557, 4225, -2346, -2546, 3378, 122, -7033, -2207, 5521, 591, -5394, -2897, -832, -123, -378, -956, -731, 2017, 965, -3694, -1463, 5915, 2021, -3432, 1289, 4632, -810, -2009, 352, 3183, 3221, 873, -3606, -1767, 2582, -254, -5380, -17, 5754, -708, -7005, -1903, 2878, 1123, -2702, -955, 1170, 959, -1951, -4130, 2779, 5045, -776, -4711, 1424, 4674, -1517, -3406, 3323, 4886, -700, -1869, -273, 1768, 1874, -1357, -1223, 2751, 2952, -2341, -4221, 1442]
744A442J500n002Q75J318Q65k197k082M2N735R5m580L0N374p0n098M13N173O4
762C897n623M01L432K141n262k077L293L191q33n303j96O130P91p012o19O313
778B664k531k039r67K922P22j537j309J158L656j354m344K854K715r41m151J684
794g98L761L37l538k871M670R58l521o91J486L984m161l347L046K244q59m528
810c828K435K270J7l388J35M330J936m762j996M157J724l736j703K549L666k799
826A007k083O56L985p62l921q93L357J833m047j030L546J219m088k591L096M369
842C653l248m523K128M806j812m216J747L460O79n521m7M985R09m562j516M589
858A511J906k932l452K621N063l188k997P91L182k263k670K03M401n04k983k635
$$ y = [1442, 2942, -2060, -1185, 133, 998, -1199, -3281, -3239, 2496, 2591, -1989, -1959, 3415, 3345, -1753, -1340, 3833, 3897, -1726, -1325, 2107, 4248, -1014, -3091, 202, 3393, 2560, -2743, -2939, 3191, 3982, -3030, -3649, 2664, 133, -1906, -2873, 49, 771, -766, -2075, -917, 2739, 1385, -2959, -105, 2610, 1669, -2482, -798, 2963, 3300, -238, -3109, 1561, 2519, -1002, -1693, -207, 3777, -384, -3731, -685, 1559, 700, -3828, -1393, 877, 894, -2494, -2359, 1971, 3907, -855, -2851, 1306, 3030, -706, -2409, 140, 3806, 1007, -1076, -420, 3565, 2803, -1118, -2011, 1346, 3179, -868, -1898, 1648, 2867, -1221, -3812, -716, 3653, 405, -4118, -1990, 2816, 1004, -3212, -1465, 1995, 2674, -2847, -2894, 2091, 3000, -1562, -3078, 1511, 3417, 485, -2967, -346, 4717, 1529, -1468, -677, 2505, 242, -2428, -2225, 2176, 1672, -1311, -3946]
874c946L730J320l035j288K434L833j434l935J145L141L35m101l86L460J721m922
890a928j32L799J734l293j933J419L572k665k838J631K683j295l245N73M034n92
906A524m961R69M445J038n421o79L509K039k198k578J620K620j434l120J458L883
922B714p21k393O85J197j385j069M3L95L116j341n087J949M557k103l703K362
938g84M640l418k692j34L061R75k496j081K473M100m541m493M720M451l503l942
954b664N062J699n033k012L045K678m08l241k373K748J690l136j762P256j225
969B324m476n90L507M09j662J050J32N21M83k986j713M015M446o183k741N851
985B387q43l645K327J507J713j891j971k467K679K751l629r89M318L29p987K013
$$ y = [-3946, -216, 1104, -1931, -3219, -785, 3048, 1614, -2321, -1176, 1965, 2300, -1801, -2187, 1273, 2994, -1928, -2060, 1739, 3473, 180, -1753, -334, 3238, 573, -2265, -634, 2049, 754, -2491, -1918, 2116, 1524, -3437, -2468, 1977, 3015, -2406, -3085, 424, 2463, 265, -2313, -693, 1927, 493, -2627, -1169, 2714, 1993, -400, 285, 1482, 97, -972, -929, -534, 2582, 1241, -3846, -1897, 2660, 557, -3146, -784, 3856, 438, -2254, -2388, 673, 1648, -848, -1929, 544, 4644, 103, -4390, 330, 4781, 1278, -2664, 2398, 4097, -936, -2948, 97, 2775, 2367, -874, -3247, -499, 1191, -1945, -3707, 3549, 2324, -2152, -2742, 765, 1174, -488, 562, 694, 1215, 1698, -1288, -3001, 1014, 5460, -723, -3464, 2387, 1544, -2101, 226, 1733, 3446, 1555, -416, -2883, -204, 2547, -1082, -2071, 2247, 2576, -5411, -3398]
1001c398O408j549j835O39q96k31o85o46J017M251N81n992j31N763j907m145M076
1018A320L290k751l006J165J77J678j57j950p05L552o75p250M882N903m024m799
1034c350K536K364l307p23K621O45J719m15p357J693P023l186m352N183L010o394
1050b290k189L800M011k368J435j696j653K164r29m171M438L108k885m762K709
1065a278K056k263L48K855L47k093K32l995J610N619j800m503M207J735o534j282
1081d739Q241J101n242J478k93j559J724n99j719M356K832p245k978N548J656
1096B562n651J950M519k991k939R3l04K220L081j580m414M528R16o177N98P280
1112C691q00n082J803K020j777n15L026k543J490J758n524j309P251N01o268K227
$$ y = [-3398, 3010, 1461, -374, 265, -631, -862, -1547, -2193, -1176, 3075, 3656, -2336, -2467, 3296, 1389, -2756, 1320, 4610, 1859, -1147, 18, 195, 1873, 1716, -234, -939, 2613, 1938, -5312, -430, 5473, 1449, -3350, -814, 1550, -1757, -2480, 141, 786, 2505, 2090, -5267, -3574, 3449, 263, -4089, 1094, 4104, -2290, -4479, -679, 3332, 964, 2399, 703, -950, 1214, 285, -3886, 552, 3660, 775, -3987, -1278, 778, -1485, -1137, 1718, 2065, -28, 204, -3791, -2181, 3438, 1638, -2865, 1342, 3077, -3457, -4739, 3502, 4603, -639, 839, 546, -1013, 711, 112, -1607, 2749, 5581, -1664, -4642, 906, 2562, -3089, -1139, 3380, 389, -2550, -2457, -2761, -541, 2540, 960, -3454, 1074, 1990, -4187, -3589, 3691, 2891, -2191, -388, 1632, -145, -660, 2366, -177, 1313, 3071, -2453, -3762, 3489, 3990, -2278, -51]
1128e1L400k621m565K631K787o22J26k242r31L128O16m344J874N899k430o826
1144d171K449M155k500j473L175P80k743j65q35m57L503N06l650R38L814m108
1160g82l073M280K558k164j666n68K65N34J099k055K97N050k513n606K825N900
1176D381m203k489L137K675m030k058K074J392J388j565k934K049L516m348k226
1191c241M903K841m521k825M475k523J20l4M93q17J755j456k510M463N21k589
1207i45j161L214J509m296n24L147p7K49j611o76K387J027l498m72L291J471m046
1224a011p83K437J104k595m17R68O71m19j640j94L192j25k487j408N370j689k825
1241a851P80K187q37q92j071J206J752k09k434J027K717n49l381r22M882j818
$$ y = [-51, 3349, 728, -3837, -1206, 1581, 959, 1085, -1157, -2088, 1040, 1656, -2688, -814, 5085, 2655, -4171, -1722, 2433, -67, -1540, 1635, 2415, -328, -493, -1328, -1785, 1718, 2224, -1426, -488, 3326, -782, -3855, 425, 2983, 819, -847, -1415, -1150, -616, 483, -1572, -1275, 3775, 1262, -4344, -1519, 4381, 178, -2311, 826, 3501, -529, -2587, -513, 879, 2267, 702, -2232, -183, 3333, -1015, -3241, 1662, 4503, -18, -2843, 1632, -891, -771, -805, -312, -1129, 626, -830, -3340, 1123, 1644, -945, -2106, 1108, 2617, -1679, -2203, 944, 867, 1116, -495, -1171, 1216, 2243, -1255, -1727, 1564, 3035, -1011, -1794, 643, 1747, -848, -1265, -297, 374, -45, -1685, -1879, 1313, 1188, -1299, -2707, 2663, 974, -1851, -1071, 1116, 279, -613, -1684, -478, 1274, 1065, -1369, -342, 2375, 1826, -1555, -2477, 2405, 587]
1257E87k449K67L400o14k147j926K309J971j439k611J047M582r37l677J427K079
1273A869o0k041r21L950m21l637O19J521m72l13j912K272K164k474j871K110R81
1290A364p06k144R77J958j034j228r64J849J234q79l567K898K183k294k245J878
1306g20K505p27k818L03K631K18k314J24J529K310l126j747L164J308k983j454
1322a797K019K457k335l329K601L54J242l003N77M58J086j899l57K059P12q71
1338b6j240K313K341l590o69K10K921n09k289M5J313O91j015k728L005J173j578
1355C68j875J261J782j688j691J191K080j893n67j004L203n61j504p65L901m16
1371A822k857m06K491J833m534J710K002Q92j805k573Q84K403j006k523N23K320
$$ y = [587, -1862, -1595, 1805, 1191, -956, -2882, -573, 1398, -41, -2652, -1605, 2977, 2040, -1637, -210, 1869, 1809, -232, -1153, 2797, 2376, -1261, -642, 879, 407, 94, -1818, 454, 2618, 144, -1727, 383, 1364, 658, -1486, -509, 1449, 415, -813, -1777, 72, 1306, 427, -3140, -242, 1941, -353, -2598, -720, 1785, 1058, -1760, -1457, 1174, 1392, -922, -798, 731, 3041, -85, -1832, 1332, 2640, -343, -1797, 222, 2679, 344, -2985, -384, -30, 1212, -1791, -1214, -756, 330, -1569, -1926, 133, 845, -26, -1266, 1047, 3388, -202, -871, -661, 2260, 1751, -538, -493, 820, 1511, 496, -2232, 773, 1946, 368, -1507, -246, 1536, -152, -1843, -652, 1428, -465, -1032, -2036, 1167, 606, -898, -1663, 2238, 1822, -1035, -1441, 1050, 2883, -1651, 59, 2061, 2953, 1148, -1425, -541, 1862, 856, -1667, -1144, 1176]
1387A176j121k015N21K854j165j891P42k0K888k322k030J284L507j380k440J452
1403D0J513j77j483m57J621R51k580j206K392K295k916j912J897J749j878j665
1419a816J625J695q70j054m23K146L49k344k025K972Q54k113j767L159J567k093
1435a38j030L92K008m13r90j221K532J163k691n87J832J638l970j28K198J494
1451B089k873j059K415Q5q32q21N6K468l56k098j116L272m7k305M74L419j475
1468A296k859J476K5K163q76j445m32J922R51k937r9L078j135k282j86K110L48
1485A118j445L86m50J685k68l388O58M638o46m763J859K473j424k801J982K671
1501B285q77j39j481k24J912l15j738J028L174l545l271K614L108k578j200K076
$$ y = [1176, 55, -1960, -1439, 1415, 250, -1641, -899, -919, 1969, -353, -2383, -1099, 2408, 1028, -1412, 40, 1553, 1376, -107, -564, 1057, 2008, -572, -1778, 614, 2909, -7, -1919, -22, 1727, -151, -1816, -191, 1504, 634, -420, -843, 1303, 1652, -692, -2717, 255, 1109, -1004, -2771, 388, 1955, -138, -1168, -776, 1232, 819, -171, -1392, 1140, 2303, -388, -975, 857, 2495, -1475, -1603, 595, 2089, -784, -1843, 572, 657, -175, -996, -940, 1528, 1172, -926, -2042, 1230, 1183, -1122, -648, 2771, 1296, -1563, -87, -62, 2101, 1225, -220, -652, 1270, 2221, -716, -815, 2263, 1128, -1154, -1340, 770, 1118, -327, 59, -391, 1294, 1026, -2362, -1704, 2934, 2288, -2475, -616, 1857, 433, -2368, -386, 2285, 1408, 1269, -212, -436, 1476, 1161, -577, 451, 3625, 80, -3191, -577, 2531, -47, -1247, 829]
1517H29m12k067J278j554J836J456K84l779J167K909k884j530L283J904l071j097
1533a448J385N92k20Q86j925N22L192k069n250M738K819l421j146J927O20k947
1549a745N92J257K1J600j858l180K788K243k742j356N038O24n386k77K861k04
1565B76m61J579n37j044J185k914J45L153J974l602j957K998j67k582J562K706
1581B314p40o44j226k202J980K953l107n54L079J8n198Q02M824r46k551K527l9
1598A290r49n07k06q14K716J418n072k09L553l37l085L602J598k472k622Q39O74
1615e83K6K468j812j711L530k565l094J239N572k379k967K445P68j930L09Q68
1631A84p6Q44L54l146m6M010j142k062J611K740l488k863L309J188j500J648j650
$$ y = [829, 417, -1650, -372, -1926, -90, 1366, 1650, -2129, -962, 1947, -937, -2467, 816, 2720, -351, -1448, -63, 529, 309, 1195, -730, -208, 2984, 915, -4335, 403, 3222, -199, -1345, 582, 1202, -1745, -1153, 104, 125, 1725, -133, -3313, -525, 1718, -1024, -2380, 2658, 3282, -2104, -2381, 480, 276, -185, 1394, 857, -187, 998, -1916, -1771, 1382, 3356, -246, -2203, 795, 628, -1954, -392, 2314, 1574, 930, -296, -2498, -518, 2435, -672, -1226, 1853, 1871, -3327, -2525, 2299, 1353, -1198, 1329, 1290, 341, -166, -372, -1186, 1530, 2948, -2124, -2333, 1220, 883, -2202, 1400, 2998, 526, -2096, -1257, -583, -557, 1911, 99, -1612, 1918, -647, -3741, -2502, 3070, 691, -2276, 169, 937, -993, -684, 184, 108, 952, 1306, -1840, -1886, 2124, 982, -1080, 531, 3271, -217, -3080, 229, 1417, -83, 1565, -85]
1648h5l66Q10m5k130J296K940k766k472K046K056k183pK721p25p27p30r28R98
1666b97K170j209k095K017J659l693p78L641J455l538Q7N61J27n55k2n26R71K296
1684B271l111j525K867J267k953L31K682j113k179O40J220M84l62q00m58J266
1700E27J445k354j269L415K51l097N55J163k37j236K43k1J499k21j649L50J215
1717E79O69k667J058K305n39l039P21J326J343j718p25N78J259L13j868l77K636
1734A854j179k051J21K752k26k730J804J276k272j77l65J124J011l33k273R92
1750f72K458j315k376K153Q95K12j528j29O71j32l35n3R91O40j689q03J595P32
1768A315j747l41M95J285N02k525R32L36j76j075l31K195n85j287l7R43J937k121
$$ y = [-85, -451, 359, 314, -1816, -520, 2420, -346, -2818, -772, 1284, -899, -906, 1815, 1090, 363, -367, -1295, -297, 1873, 664, -1431, 586, 2245, -1448, -2226, 1415, 2870, -668, -581, -20, 107, -448, -470, -996, -25, 2271, -840, -2365, 502, 1769, -1184, -853, 1829, 716, -1463, -823, 397, 881, 519, -281, -739, 527, 1972, -382, -1651, 1764, 2015, -1082, -527, 636, 399, -837, -594, -615, 884, 663, -986, -636, 579, 1248, -1419, -361, 1944, 1405, -1634, -913, 413, 1756, 38, -687, -109, 1150, 1463, -405, -782, 1854, 675, -1376, -1255, 1497, 1271, -1459, 345, 1621, -651, -828, -1193, -69, 942, 609, -1664, -672, 1786, 471, -1905, 248, 1143, 1355, -173, -302, 369, 237, -98, -151, 840, 1480, -209, -1012, 583, 1315, -432, -773, -278, 1007, 1509, -1016, -84, 252, 76, -999, -1330, 865, 280, -1007, -1044, -101, 1836, -285]
1786b85j112K261P59j011j811M82J038j57q70Q2J367r5o21j014J321R24k440k4
1804a206J275J029j171j497J285R41j87p42j083K373j498M71j418J398J147j251
1820a34j050J610J614j843l77J33J930j131j716M78M34R93n46k455L832q87n76
1837C09q85P26J213j130j226N04J779r86j218q2J685r5j336R5P94J073j761l71
1855i12J127Q36r91j115J160J357r37j913J380J516O68k762L52Q40P16k084o9
1872h31K164l24j089j745J398J151j414l62O44J310m14j170N86O32J259k341m88
1889a034K135M2n70n57J278j23o99j426J722Q67j196j900J672J490j520j364p20
1906a903K886J85k596J002M90P48j186j176J843J192j994j86l22J402N76j198
$$ y = [-285, -1397, 864, 1623, 612, -1199, -717, 321, 164, -706, -624, 743, 648, 27, -987, 334, 1258, -1182, -1206, 69, 1098, -73, -1570, -285, 656, 469, -273, -1356, 1017, -481, -10, -1428, -30, 1117, -134, -1184, 426, 2040, 197, -180, -47, 1883, 752, -964, -486, -52, 941, 395, -2060, 1772, 885, 309, -576, 150, 1363, 233, -993, -489, 1290, 304, -914, -996, 689, 594, -742, -647, 147, 1220, -541, -912, 215, 1051, 60, -1055, 105, 1462, 525, -1388, -8, 1508, 2176, -586, -234, 606, 1322, -762, -831, 1333, 1009, -80, -1825, -427, 724, -690, -1052, -408, 902, 488, -682, -96, 536, 1795, -546, -1034, 1101, 1143, 573, 16, 1294, 1171, 472, -954, 768, 1635, 439, -1461, 211, 1701, 181, -1183, -1903, 983, 1168, -1428, -426, 64, 812, -374, -1550, 293, 1485, -509, -695, -1017, 385, 961, -237]
1922b37M6J564j72j138R1O22J83j608K57J219N56j393m61J307j090o49J021j486
1940a368K527k65k133n60L284j016j031J042l87Q06j620K06r9J567J618l059r8
1957e86L079j680j481P65J547j440o11j75Q86p60J756j769Q59J50M7k032J66K433
1975A154q7j749J238J003k404q23J991L49r85P47q24N93l31L93j975K071J401
1992A762r06k758K308J062j811K50m24Q53L25q19j039N89K689j097k407Q18K435
2009A830l369k15J892R01p44p89oK12R76q40l04J362J492k570j926K649J981l287
2027g55M16J559k60j029p00J159j93P36j677l04J191J73j929N00K458m08k319
2044a382M51J110j02J80K87k69J04J349k697j072K934N51j715n65K462r80k429
$$ y = [-237, -191, 1373, 1201, 63, 154, 776, 959, -649, -392, 827, 1383, -10, -471, 836, -254, -903, 118, -1368, 1159, 894, -1239, -1799, 1485, 469, -562, 480, 93, 899, -721, -515, -614, 953, 2571, -488, -586, 2493, 813, -668, 97, 1644, 204, -407, -582, 304, -456, 1300, -469, 390, 540, 587, -1445, -1279, 1154, 1067, -682, 556, 1559, -845, -1668, 323, 672, -313, 434, -390, 203, -128, 265, -1710, 361, 1762, 856, -1902, 406, 1468, -343, -93, -517, 336, 661, -158, -1197, -608, 2081, 984, -1423, -605, 1830, -1539, -1754, 138, 1039, 295, -494, -500, -288, 688, -152, -456, 906, 2398, -172, -2098, 551, 2532, -755, -339, 1220, 960, -69, -769, 390, 197, 933, -744, -1048, 143, 316, -1613, -1113, 1345, 937, -1382, -931, 179, 77, 257, 544, 275, 379, 1728, -969, -2041, 893, 1444, -271, -836, 1626, 646, -1783]
2061a783K377k64m1Q39j441j562K267j37j134L45J816m80j433p03K531j086o47
2078e36Q28N3p78J139j823J66J682J163k296P19R97j283j096K095J540k654L39
2095B55n01o03J034L75p16qK255k438j902K185J193j029j208J295Q49p30l39m99
2113e32J90K571j069k258q0K458j764l53J700J475k199j119J284r35M12R57q33
2130i5J40K61j020j822K205K034j763r84J443m44p02p5N47N60J057j011j288Q43
2148a14J560j647r04K173Q36k744m29K254l07p34J25N66q58L90j233O9Q27J007
2166H37k080j48K100n94j349K63K008q07Q2j214j87K46J143k17m46J568N12k342
2184f25K61J878k47j712M16P51l30n11l61L36J423p11j197r30K084R4j895Q25
$$ y = [-1783, 594, 330, 289, 1128, -313, -1875, 392, 255, -879, -534, 1282, 802, -631, -1334, 1197, 111, -536, 292, 345, -433, 706, -1117, -951, 731, 1894, -402, 317, 1314, 31, -1065, 1030, 2570, -84, 255, -246, -849, 185, 560, -156, -164, 2091, -347, -2249, -64, 1129, 100, -1108, 187, 1036, 306, -33, -532, -342, 2229, 1160, -1098, -1178, 1280, -484, -837, 863, 2338, 139, -980, 304, -631, -219, 738, -95, 45, 306, -714, -2536, -331, 1703, -60, -1044, 399, -45, -747, -822, -275, 285, 1342, 331, -957, -114, 1446, -201, -1105, 1068, 1904, -840, -1269, 985, 678, -56, 69, 635, -223, 167, -1066, -997, -170, 837, -1243, -1391, 709, 115, -1234, -971, 1037, 230, 312, -902, -1089, -843, 300, 83, -363, 1205, 1717, -625, -364, 1514, 1267, -445, -29, 722, 392, -119, -480, -144, 1279, 568, -629, -1559, 525, 619, -1276, -451]
2202d51J633j039j079J205J83m35K8m82p6J423m29j340J65K342j184j220O97N28
2220D69k50p01N5J395Lo08j080L28R19n06j376Q47J453j234r82O48R20J87j076
2239e89M63K55J124j282o18P99J519j770k85O77N20j570J03Q50M51m40k96qJ010
2258I13n47j13n72M86L13j346q11J324J136j510j82P21N53n21P6m7j31M41J25
2277C08q82R62N59j312o06J184M34j045q00J389O33m46o54l02O27m61m55m0J341
2296D34M23k090Q19J242M0j153l03p0J498q42l28L07j62L6K61m30L52R11j668
2315g23O07M50O88j150j97P86O47m51j801J115O85j067r14N14J012p1o41m57J716
2334G48R88k072l69J107O35j550M44L24O67n49j084R58k1o19K28k02J132q23j99
$$ y = [-451, 1182, 143, -936, 269, 452, 17, 45, -437, -513, 910, 481, -859, -694, 1648, 464, -756, -59, 469, 219, -482, -427, 968, 971, 363, -717, -389, 530, 24, -1352, -505, 948, -286, -1268, -620, 300, 487, -589, -126, 129, 1253, -29, -647, 152, 1671, -99, -384, 293, 813, -757, -654, 196, 647, 207, -89, -97, 913, 366, 253, -319, 167, 480, -866, -1677, -353, 783, -727, -909, -188, 365, -156, -80, -127, -258, 183, 308, -574, 388, 947, -365, -971, 213, 647, -398, -1198, 191, 824, 378, -276, -578, 49, -412, -867, -907, 434, 857, -1233, -414, 828, 868, -285, -588, -658, 840, -2, -330, -23, -185, -149, 112, -318, 34, 945, -723, -116, 334, 1022, -128, -325, 461, 1108, 657, -1144, -29, 656, -411, -1325, -811, 201, 130, -511, -968, 748, 1736, -336, -705, 402, 1037, -513, -69, 255, 922, 373, -711, 247, 226, -393, -165, -367, 765, -58, -257]
2353b57n30N13R44j147p28J878p70j654J867j021J602r66k86M25j88J214j319
2370d23J07J029j12m75k22Q2M87k00n38lN04R0q08M56J35K90j98k29j99P48j373
2391h52K17M44Q58p55j412K014O81k28j712N2P28M13j321J291n90O71q95o52K006
2410I58m34j071J24K78J101j047J93o77Q65K79j351kK457o15k205P20N72J139
2428A284j522l58P81J113p36j505R03J368j529m5N11P20j274l0L17J931j606K54
2446E77j086P67j92j63l86l93K102j100j005P23J143q24j065P2J724k37j463l13
2464a119P24J160k14l44M4M97j523J22M70O04j04o86O6R31j79j148J188j86O33
2483I36j306l82L45Q13j077m31K118m70j451n4P49J042n69k47k48J148m66l32
$$ y = [-257, -787, -274, 670, -477, -1205, 673, -97, -1751, 116, -905, 697, -269, -555, -130, -318, 896, -423, -316, 713, 601, 126, -96, -14, 473, 273, -265, -268, 236, 326, -482, -26, 109, 399, 201, -28, -227, 521, -852, -635, -191, 667, -88, -1500, 514, 1195, 967, -745, -693, 35, 448, -873, 418, -172, 499, -396, -1048, 958, 524, -547, -423, -145, 956, -91, 102, -575, 290, 569, -782, -784, 1673, 1058, -1147, -427, 145, 1284, -238, -596, 185, 1298, 562, -943, -40, 1328, -201, -246, 265, 985, -289, -319, -2, 1929, 323, 577, -509, 258, 66, -97, -483, -876, 1226, 126, -879, -156, 987, 163, -902, -830, 894, 657, -806, -1119, -395, 765, 551, 207, 251, 748, -775, -653, -183, 421, 317, -369, -303, 628, 449, -699, 489, 303, 936, -370, -752, -407, 406, -671, -1102, 1016, 546, -905, -959, -210, 832, 263, 16, -232, 916, 450, 118]
2501A18j719K691l5j600k57J421R06k650O03M15Q78n02n71l61J627m28j419K90
2519e93O25L65j176J10J128p13Q23o04Q8M86k00k6m92J220lr50j072J209Jj44
2539H2K97l1m33j342J874j713K201j63l28o00N89J26k195J767M10j90l81L66m11
2558g5Q4p09J152q68J351k30j627K93O98Q13j530O97J087j102j213J287J594j243
2576D59N12j132P9K3o49k28J477J196r74j767P31Q30n73p41J202m34l0q83q8O97
2596b93K27J65k44J65J555j736r00R11P7J89r73R77j319J892j69j522J698P47
2614A447j155r66J121k06r46J30J032m25m32K93m3R6M60n64j146J772n7j111J12
2633e88J661J3j303k86K75j79k87J580q00n04M70j58q00J230P80j402K10J205
$$ y = [118, -1601, 1090, 1055, -545, -802, 619, 1525, -1125, -522, -107, 771, 269, -302, -663, 964, 536, -883, -593, 32, 397, -779, -669, 459, -254, 569, -35, 53, 539, 339, 313, -179, 1041, 1038, 88, -984, 225, 226, 82, 379, 348, -85, -1427, 447, -1266, 935, 772, 444, -156, 433, 559, -1636, 131, 541, 351, -30, 336, -75, 9, -700, 452, -416, 935, 705, -922, -629, 69, 882, -648, 49, 1136, 34, -1179, 108, 1702, 459, 971, -161, -82, -59, -708, -936, 541, 1737, 763, -1004, -273, 557, -16, -757, 445, 11, -19, -902, -990, -293, -66, 99, -145, 20, 1575, -161, -1061, -150, -73, 116, -857, 120, -1199, 693, 524, -998, 700, 1447, 292, -674, 447, 241, -705, -575, 457, 32, -400, -107, -150, -54, 406, -158, -1304, 468, 411, -700, -588, 1073, 1086, -217, -503, -228, -407, -694, 886, 86, -418, 52, -106, -906, 324, 1104, -298, -88, 1117]
2651A117j408m74n33J763l65L14l73k07j94J298r04J76Q16n36k343O75J728l29
2669B21q09K75N1N6K3m64N08J059q55k00l21J478j373q62J167L53Q9k28q62j299
2689a993J693R16l57M54k07N79j496l49J924j313K92L16l29o97J22M35K63Q04
2707A057j382M88n51N81j103P90O39J443j978n17k49l17J46R76J12j95J57o60
2725e63l66K210j75j161Q1P82q16J18l86P74J05p80M04r54J213Q40j737m98P53
2744a56J677k133J263l69j11k83M39r52J577j408j7L01K92O14j490O8R06J017
2762A235k76k006J581n3J05j436J184L13J9j290M68J68j66j9j94k94P85r02J147
2781C69l24M11M49j216L11R21L47k361J029m20J006p96j16M67k57K16k29R75L54
$$ y = [1117, -291, -765, -1298, 465, 100, 414, 41, -166, -360, 938, 34, 210, 1026, 490, -1853, -1178, 550, 221, -588, -313, -262, -206, -183, -647, -139, 920, 65, -135, -456, 1022, -351, -1213, -46, 307, 396, 168, -694, -1993, -300, 616, 259, 713, 506, 1085, -411, -760, 1164, -149, 143, 459, 130, -567, -445, -10, 253, 1057, -325, 163, -388, 193, -910, -120, 519, 1962, -16, -533, -782, -1099, -953, 23, 135, -60, 97, -563, -929, 1281, 1106, -55, 26, 808, -8, 110, -276, 498, 603, -177, 227, -727, 486, 1326, -411, -909, -156, 1521, -612, 651, 282, 171, -112, 327, -625, 952, -456, -473, -172, 120, 734, -756, -688, 218, 1235, 959, -1047, 534, 481, 586, -850, 334, 647, 666, -624, -156, 12, -154, -173, -367, -661, 124, -778, 369, 45, 456, 905, -311, 0, 921, 1268, -1093, -64, -484, 522, -274, -390, 77, -180, 36, -193, 782, 1136]
2800A136j667lK60R94j801P69m02J409k82q80o07J396M34r32J1KO17l69j67k25
2820c07J015j250K63L40n35J300j024k38J566k48j270K37J173j042l14k77K04
2837d07J547l25j762MJ935j076p73P88J064q78o44j92K223j462q1p68J306k19
2855B80p39L21Q94N77j816p7J175L9p6o15m09M72O7l56M36J27J04j011m70J793
2875G16q13j30n23J07R08l4q00R47J98J63n91k63L71rn62P03m41J094j504q47
2895a310K124j252N23l73R09o45r6m60O8J032q43K80p79J120j019P76n86J23J22
2914b86J46j60J20K85L92n71l10N12k12o2J67O23j390J528q50L18N35m45q73R41
2934D08M09l4j341J142L32k21r71K03j50J250j676J216q91N53R3q60P50K44j721
$$ y = [1136, -531, -534, -274, 720, -1081, -312, -714, 695, 413, -467, -1074, 322, 756, -176, -165, -163, 454, 85, -82, -307, 708, -542, -279, 61, -474, 826, -198, -436, 1130, 882, -388, -151, 1022, -20, -334, -611, -407, 1140, 815, -947, -943, 992, -84, -857, -69, 995, 117, -527, -719, 1504, 42, -39, -807, 499, 280, -459, -138, 756, 1333, -483, -560, 615, 654, 578, -37, -446, 26, 93, -263, 173, 300, 404, -607, -1077, 716, -97, -227, -750, -643, 265, 231, -569, 378, 576, 739, 148, -115, 256, 247, -315, 388, -53, 1041, -463, -1310, 814, -438, 85, -288, 621, -24, -120, -580, -512, 520, -323, -43, -822, 298, -721, 55, -531, -408, -286, -140, -300, -180, 105, 497, -74, -384, 128, -84, -146, 21, 644, -746, 782, -68, 250, 785, 340, -533, 408, 817, 783, -558, 584, 916, 695, -276, -73, -223, 1027, -649, 567, -324, 229, 322, -538, 212, 456, -1265]
2953a265L88M55R57r98J09N08K89m04r58Q51l31J580j112j79J6L23N2j359J398
2972C20O01j755M30J95M7Q17o63m15k2P34o52q46N08L67N20M38n03J6p99J343
2992F81m0J13q2n19j43l03J43J20M35m40L91j852M82M82M62J57J39M32j130N68
3012I6j696R31R61P31j897Q68J218r91j935K288J90M07j843K71j78R51j046J09
3030e65l80J733r15k082J814N32K86j175J856j285R4P29r76K31R59J07j438Q33
3048C58N83j199j8o16J572r61L76j73K3M7J76m73N75K38q58n54L95K542k141n80
3068f88M63P5j410L09R84L0O22P70r74q87R22k96l56J164m95j100J476N1o07k62
3088b09n66J797q74P84j492q17K237M84j084j292J731o12l29q4O80N07j439P30
$$ y = [-1265, -877, -422, 535, -463, -354, 154, 443, 39, -919, -68, -399, 1181, 69, -110, -94, 229, 281, -1078, 320, 921, -834, -404, -209, -162, 655, -8, -423, -445, 289, -363, -1209, -701, -334, 186, 624, 121, 137, -662, 681, 641, 754, 672, 153, 10, -293, -150, -30, 405, -35, 356, -1496, -1014, -532, -70, 87, 226, 658, -472, 96, -1600, -669, 292, 1023, -874, -6, 1212, 221, -1714, 574, 764, 1171, -672, -401, -579, 372, -674, -565, -945, 788, -127, -2209, -395, 137, 423, -752, 1104, -181, -87, 642, -334, -103, 856, 963, -475, 358, 941, -258, -276, -892, 680, -281, 95, -78, -55, -8, 168, -305, 270, 508, -350, -904, -509, 2033, -108, -688, -225, -150, -1560, -1251, -267, -237, 385, 1155, 181, -706, 216, -80, -436, 728, 233, -867, 609, 660, 53, -209, -775, 1022, 148, 932, -560, -1377, 860, 1344, 260, -1032, 699, 87, -242, -326, 354, 861, -578, 152]
3106A52n07j05P47n35q5N81N11j400O29J85O86j643J094q36n49J602m71q12K442
3125A686j860o17K39O84m88O21l46l15Q71j025L28k54o1J94n33Q43O88o91j378
3144a414J524Q64j89k27j081J638k61j491J052J02L34o03l09M72k7j15q59k33
3162h23J734n78j503J390l75n24j1O93m88J067j175P31K32P94m72j599N42k04
3180e69M16k90J45M08m26J320j558j08K399j597j65L91O06q32p90J498q26L10
3198C32j009J6QJ491j400j24N70j51J086n65l08R80j469R34Q04j021j059L60M71
3217e4R16L42o32k58J27p24k16O86K89o27k3k18M67n02J044r59l02J315%j193
3237e22L08m27Q63q71k23Q33J214j261k89Q10m24M47k09n5K0M23o46q43J459j145
$$ y = [152, -355, -460, 287, -248, -333, 248, 759, -641, -12, 173, 859, -784, 310, -526, -1075, 527, 56, -756, 1686, -174, -791, -552, 132, -356, 265, -81, -396, 475, -550, -222, -476, -537, -343, -876, -33, 655, -36, -1414, 110, 974, 785, 558, -523, 1115, 854, -637, 415, 517, 851, 248, -61, 411, 384, 269, -590, -823, 911, 333, -1170, 220, -155, -679, -690, 3, -485, 582, -593, 138, 370, 1164, 692, -907, -365, -569, -153, -443, -298, 110, -316, 1004, -554, -662, 1737, 140, -25, 366, 972, 140, -650, 848, 22, 332, -677, -661, -653, 838, -562, -686, -116, -267, 819, 254, -54, 926, -543, 391, 1195, 174, -885, -525, -54, 862, 1204, 572, 314, 441, -283, -499, 187, 476, -151, -174, -392, 75, -427, 617, -342, -644, 671, 671, -522, -214, -641, 222, -649, -872, -39, 1175, -86, -375, 435, 11, 458, 249, 194, 214, 637, -9, -852, 607, -538]
3257e38j61R04N86l19j031J07k99J81L18j08L15M64pj749K475j053P12j172l28
3276g03L79N94k95M34M13O20j734P39q00Q88K94j845N13N99j96k04l03Q25j50
3295F8o66J637j381O39j063N88L53k3L81r63J27Q13n81l18L54L89o72R17j106
3314e07P3M18k35J3L48N12j036O92o49j13L00o7N06j62l08m1Q83j007J339r97
3334c8K74M93n09m86j72K97Q78o39J87J86M4l14n54QJ765k30o40r15M09K02p07
3355d61N92m30P66j392N56M01q2J25j066J077R41q92R06m52o6k22q63N29R50N07
3375A424j465k14lJ048n03q91J080L01k48p56N69j002J042k93l08P98k21m0m03
3394h5K7j10m63N96j16M56n75l05Q56M40j297N45l98Q24R7k38p38L47N92j99k24
$$ y = [-538, -699, 205, 791, 472, -559, -452, -751, -570, -252, -360, -45, 419, 412, -1337, 1138, 85, 797, -375, -703, -324, 270, -25, 409, 822, 1442, -292, 447, -353, 535, 829, -1016, -503, 96, -100, -304, -607, 218, 68, -598, 1039, -342, 297, -766, -178, 175, 152, 533, -430, -303, 510, -71, -389, -35, 354, -318, 599, -507, -434, -16, -251, -238, 110, 622, -414, 278, -371, -484, -184, -251, 255, 93, -215, -256, 627, -380, 959, -38, 236, 729, 220, -266, -438, -141, 737, 98, 285, 471, 515, 201, -353, -345, 1420, 1190, 550, -365, 44, 246, -461, 131, -299, 467, -925, -369, 32, -50, 75, -991, 86, 1027, 135, 1041, 589, 523, 301, -562, -33, 917, 1424, -41, -255, -258, 790, 287, -604, 476, 777, 529, -227, 342, -660, 382, 89, -219, 579, 358, 318, -85, -58, -168, -631, -35, -151, 305, -270, -575, 281, 721, -576, -31, -429, 395, 492, 254, -484, -137, 455, 256, 32]
3415C2L81J57r4o35L1P56k70r55Q42P0l95N12q38M39l99R18k81K70K33o93j04
3436b3k72J091N9p28k30K51L72n0j041K13Q56m35j141Q52P96l57n05K99P00J8
3456G25J12r08m7M72k88k17P52j32q92O92r3m42L5K10J77m28M7P88j75K06r00
3477c06L03n7O68r01O9j7J452j103k88r28J287P86j269n07O33J3k70q53R47Q68
3497E27n72n43K33R21q92Q6m30J025l03j24l85N43P2KR1J40p58N61p96J007l42
3518F3N6k15L38q96P83n01l58Q73Q03n98q90M60L10M29o51O85q08l67L20R41m69
3539C08k11m78O30m28J30K32l99R26N1q88k93J259q77p13P48k18k01O20R1p02
3559d13J38M46j16l17M35p5k77k3k31K12K13j70n61J688o13k67o22J017o88mL44
$$ y = [32, 413, 570, 476, -159, -128, 628, 358, -597, 245, 315, -80, 432, -406, 33, -366, 552, 271, 541, 774, 81, -23, -295, 796, 855, 127, -103, 148, 520, 470, -571, -358, 498, 63, -1078, -226, 570, 213, -292, 7, 707, 725, 837, -71, -118, 354, 66, -151, 601, 469, -423, 269, 176, -266, -231, -21, 156, -272, -225, 563, 388, 594, -306, -3, -60, 608, -293, -224, -241, 1211, 108, -180, -1108, 179, 965, -304, -811, -178, -165, -435, -1288, -341, 527, -45, -588, -355, 566, -326, -240, -670, 355, 52, -72, -457, 86, 158, 160, 251, 391, -367, 194, -602, 405, 63, 119, -96, 242, -654, 129, -372, -730, 143, 946, 348, -542, -82, 228, 657, 6, 691, -117, -484, -164, 777, 308, 97, -381, 249, -179, -49, 183, -216, 710, 761, -127, -420, 839, -38, -751, -3, -221, -422, 198, 289, -413, -275, 171, 55, -262, 173, 98, -179, -202, -433, -221, -8, -178, -739, 949, 336, 69, -553, 464, -224, -228, 116]
3580A16K0L25n47l51K65L40l19J85j02K91K51j001N16Q78m98o14O55m15k84J34
3600a55M82L70p53O0Jk12N82l65O2p4M39J0j165R19K39m62L2m9n12M59L28k91
3622e5j33K54O4j131J017N37n41k18N11K26o86l56P11j88P89k63n07l99N41j5
3642A58m17J069n26k52k57L66m12J22M78l81J9K50j21r02P46O77o08p9K30J07
3662B67m32r7R71m92R4R6m29l90J047m94o19L81N86p34k62J096l89m47K93j49
3682a03P49o10M3q01R95O50j200J13J45J85k23P3m44R3O62j84n34o1J132p04n63
3703e87J014M26j167j39P87j23KK7L61j074M96N60k44k25L24l49q94O36O8j12
3723b13k44N34k29K8n06P20k88J1K83n17P30n3j016P14R37j021j6L07j20J70l96
$$ y = [116, 136, 461, -86, -437, -172, 168, -151, 34, -68, 223, 474, -527, -11, 867, 369, -245, 410, -5, -289, -155, 327, 697, -56, 4, 5, -207, 375, 10, 72, -2, 437, 447, -718, 201, 440, -22, 10, -39, -551, -92, 236, -55, -188, 66, 130, -1001, 16, 553, 12, -206, 305, 531, -155, -511, 200, 12, 801, 538, 31, -368, 173, 158, -259, 810, 284, 32, -225, 141, -271, -149, 329, -52, -33, 217, 96, -806, -60, 617, 9, -70, 160, 267, -165, -262, 709, 217, 311, 407, -22, -412, 635, 141, -478, -97, 489, -245, -507, 589, 200, -247, 46, -103, 646, 36, 79, -722, 273, 923, -277, -164, -19, 166, -57, 16, -428, -335, 327, 143, -391, -452, 680, -24, -587, 427, 853, -314, -453, 334, 211, 213, 240, 601, -473, 23, 583, 339, 114, 438, 89, -805, -169, -101, -213, -457, 77, -152, -124, -630, 90, -198, -187, 96, -421, 309, 256, -760, -46, 891, -130, -146, 161, 41, 211, -185]
3744a85L43j14M50j026L12RL80l4m57L94K0L0l40N09n32M15m97N52j32J37m67
3765b33k54L51N05n17m56R35M3m90l03N69P68j096J86j1J22j37k38M5K50l56k01
3786e18K75M34k31N46l85oj05j6R4k99P69k07l69L0L81k60k44m26M34L07N03r48
3808b41m1L41l36R8J73K25nk53L24n05L98k26K20k21J90l47j61J0L85L80m42k16
3830b50K75l2o9L05k9J97k07m52j12P16m10L13l71R8O2m03K66K88l79l69L28K46
3852A1j97j75L99P8l72L35m62R82j62n98M02L3l15O66j072O84m92L73k63l60N51
3873D6j4l72K17m13J25P56n6l63K27L51r26R97q48L82q49M74J52J67p7R4m0J54
3895A84o2l48M35l46Kj47R51j000k64P84rm22J75M15n51J37j49P5p39J124J59
$$ y = [-185, 158, 44, 494, -532, -220, -211, 169, 135, -322, 72, 92, 122, -218, 291, -241, 174, -323, 229, 97, 234, -233, -487, -136, 369, -148, -604, 331, 374, -116, -419, 150, 918, -178, 8, -3, 119, -18, -256, -211, 39, -317, -518, -243, 191, -40, 506, 121, 115, 10, -6, 88, -211, 558, 351, -18, 12, 393, 133, -111, -537, -103, 204, 707, -241, -282, 59, -277, -179, -6, 219, 214, -39, 285, -220, 178, -48, 172, -49, 141, -206, -367, -357, 28, 408, -34, -250, 25, -7, -76, 229, 200, 397, 190, -262, -374, 342, -68, 245, -126, -28, 34, -369, -103, 185, -194, -563, -235, 11, -186, -361, 38, 116, -256, 79, -383, 599, 437, -161, 241, 274, -41, 625, -447, 237, -255, 118, -145, -505, 46, 32, -340, -123, -536, -411, 345, 289, -74, 153, 504, -422, 575, -273, 109, -740, -266, -114, 53, -24, 70, 30, 184, 122, -226, 209, -137, -135, -282, 669, -331, -595, 189, 180, -242, -67, 348, -203, -66, -215, -140, -879, 245, 404]
3916D04P0o3p95R42p8m45J16J46K47q06l75Q76j51m44K30N6J26N98p37M5M78j42
3938B98n34L66M6M57m99J87m98j96P2O71j25M10q11k15M53J10j29O9l14M87M50
3959G55o83o2M36k98m40J23O99k21J63p43q0M05p6k62l64R23p92J50J09Q68l17
3980B93j89k00K22k50Q6M0k25L09L1r4N4M92J41r07NO85k44p33K85R6L15o6j08
4003C8N74l53p6l40L23j00J2J21k66O8r3p6J74m52O14j15K8k85L35l24Q1Q0L55
4026C23n38M56j32k4j47K08k79M90k17k35J86J81o15j72J085m54L5n81K93k83
4046d20O16k09J32l22O89j78q54P99j79o5L5o28L53N18o65K59Q9j09J59J5j83
4067a48J78l4p35M53M78ol19l04J012l58j125Q13j9N38j73o47j9P04k23o38J0
$$ y = [404, 474, 411, -384, 558, 480, 35, 151, 297, 544, -262, -637, 239, 88, -356, -126, -70, 56, 654, -83, -38, 440, 298, -236, 130, 176, 633, 134, 321, -177, -373, -301, 370, 245, 655, -156, -371, 82, 192, 63, 132, -182, 305, 755, 72, 10, 446, 148, -292, -169, 530, 309, 472, -271, -351, 54, -22, -284, -648, 275, -517, -367, -258, 610, 293, 104, -96, 126, -124, -38, 2, -223, 86, 117, 23, 77, 569, 710, -197, -192, 493, 249, -484, -199, -103, 212, 146, 38, 612, 259, 183, -157, 166, 66, 78, 199, -67, 1, -92, -168, 6, -446, 168, 53, 81, -204, 131, -193, -112, -32, 323, -215, 241, 109, 85, -62, 146, -133, 357, 140, -95, 91, 272, -343, -515, 570, 116, 151, -430, -137, -420, 196, -13, 119, -203, 486, 308, -546, 253, 74, 9, 44, -584, -231, 287, -378, -119, -30, -139, 20, 35, -148, 30, -4, -739, -286, 192, 186, -133, -437, 575, 217, -908, -95, -114, 424, 251, -396, -415, 289, 66, -572, -562]
4088e62Q50m00K64J21n6l36j56J091j212R32m75j88M28o41j12K07N81K87o28m65
4108d70K37M18j95L69l49K80j21k35k32O76n49Q36o23n81Q51K0q80J329r44L1
4128a32J43j87p4M70m51p5M73L92o45J20k39K05M50r42J1O2Q6L76J7o42J371j272
4150d83l2Q47K71m77o9K99m85K12m5Kj96M13k13p7J68K5j50k00m88P46n97K40
4172b89K40k8j27L88K49l11n6k8j26O1L92j28NK68j07n72O50l03n4l42L07po85
4195f03O52j4k98M44j19j90k62M65k16l42J98L51j06J7M9l46mL1L37j6R07j027
4217i2k99M75M28k61o09L70J01l00m0k85L11K2k52O13o00J40M54m6j76J74j79
4238e1L37k43k30K94N78j069N7J42J29J53k69M97p7l33k58J97P95j085K29n63
$$ y = [-562, 288, -112, 152, 273, 217, -119, -275, 816, -396, 536, 61, -127, 301, -340, -452, -245, 336, 623, -5, -470, -233, 185, -10, 359, 10, 290, 169, -66, -298, 378, -171, 665, 42, -539, 312, 332, -548, 781, -163, -132, 11, -176, -250, 220, -231, -306, 167, 559, -86, 34, -205, 0, 450, -492, -481, -419, -333, 43, 60, -582, 789, -483, -515, 332, 603, 126, 57, 356, -129, 83, 38, 40, -156, 257, 44, -33, 135, 160, 10, -190, -678, 68, -529, -289, -49, -77, -204, 184, 433, 122, 66, 38, -88, -27, 365, 237, 242, 510, 403, -169, 481, 178, 124, -218, 89, 82, -603, 49, 35, -263, 181, 62, -128, -390, 75, -141, -483, -285, 66, -40, -23, 26, -320, -324, -293, 44, 28, 935, -92, -391, 84, 512, 251, -358, 12, 113, -187, -227, -512, -201, -179, -431, 182, -418, -278, 176, 130, -46, 128, -51, 286, 43, -187, 107, 685, -384, -327, -185, -56, 97, -172, 325, 248, -85, -343, -146, 649, -436, -207, -770]
4258g70R75l74K60m98J08j5r5N27l69r6R20r85J030l57p30P72r85Q85p8n75Q32
4279C82m43l8q8L16J63p85o1Q50m40n43J419m44m9R7k20m19M10K47m7p42R07o32
4301a60k76l7R8L71q7k14j54R62J82j215M23m56J567q30q33R20J3k50n32k20J074
4322C46J42p01P12K07o56J52K2j5N80p97n30K66P14p38M99l58RK33q46O01j26
4343b84R5p2O04l85K37o84O87j81K77k97M77n05j1j80N16k7M6j21k79N4P04j017
4365c46k10Q16l44l1L96k74J76j67r3j13R4K00o5L34n8k90K58r76L88J43O98o06
4387g0L76k49J62r97J230o75L56j68p7L4J04k50P9M21q6p3k36K81L66k80q88O69
4409B9l77O48j86J91m22L51P4J99m39M56n86K30j5J71j23m43K41m8n34O77l5l55
$$ y = [-770, 205, -169, 91, -407, -299, -314, -409, 118, -251, -347, 573, -412, 618, 261, -469, 303, -682, 203, 125, -450, 382, -61, -99, -187, 129, 292, -493, -554, 296, -144, -687, 732, 288, 239, 336, 116, -303, 107, 354, 307, -435, 472, -160, -436, -473, -375, -4, -91, -305, -459, 503, 685, -530, -107, -563, 1004, 174, -659, 261, 274, 24, -508, -728, 346, 488, -213, 499, 706, 50, 202, 224, 209, 789, -8, -538, -272, 442, -296, 203, -155, -146, 87, -759, -158, -284, -189, -261, 343, -42, 195, -489, 198, 17, 294, -3, 474, -31, -42, -222, 294, 267, 313, 192, -87, -33, 671, -346, -556, 260, -84, -115, 281, 7, 183, 16, -77, -190, -96, 104, 39, 373, 315, 25, 283, -693, -305, -162, 536, -70, 306, 57, 219, -778, 452, -223, 133, -35, -112, -78, 26, -224, -145, 276, 190, 117, -119, 162, 528, 248, -640, 29, -348, 300, 114, 305, -117, 234, 308, 507, 68, 524, -62, 168, 153, 324, 201, -242, -1, -49, -583, 94, 59, -296]
4431b96P68p18r8j70J12R6M1P82k46o01P77l05P8K00n24M50n57O83m10r2J22O82
4453G74p53J69j11k43M13n57L95j70l85K31O64l44l92L99L20l56j99K39j58k28
4473b92Q94j000m19R14L61r05q0L27K12m68L54l02N53m83O28m57j87M11l43M20
4493A38o16K81L40n2m09L10K32J24m7o54n0J52J44L41n0r0m33R63p89l4P24R2
4515F17j173R44o18J64P0l7j01N52k85Q9j49k13M69o66Q36p94O07l78K1K41q6
4536A10L9K37j74L8m22J37K92m88N45j50j9j58J70j14L61n01P87j52k29o27L11
4557gQ90j048n67J772n31n73O7m91N71Q3l48Q50k3n21l49N9K13J36l05K1J026
4578I25q11P27j239Q38L7K27p96l36L32J25o39Q65J26l53O14r55P9o31J154l57
$$ y = [-296, 472, -246, -344, -514, -402, -306, -265, 517, 271, -330, 447, 142, 220, 420, -104, 346, -211, 472, 62, -30, 92, 774, 21, 190, 79, -164, 249, -308, 87, -83, -468, -237, 427, 83, -309, 90, 410, 54, -145, 94, -64, -292, 602, -398, -817, 97, 458, -447, -527, -200, 12, -456, -102, -404, 149, -334, 294, -163, -350, 61, -282, 138, -478, -197, 143, 91, -318, -8, 224, 348, 301, -353, -403, -251, -107, 234, 184, 94, -339, 624, -165, -199, 525, 617, -556, 388, -230, -66, 4, -33, -134, 418, 133, 222, 73, -140, 329, -337, 499, -295, 312, -66, -45, 196, 110, 149, 386, 212, 250, -172, -35, 257, -231, 314, 164, 145, -13, 157, 43, 404, -97, 690, 538, 309, -318, -7, 883, -165, -732, 1040, 509, -64, 3, -488, 83, 166, -182, 668, 645, 124, -225, -166, 47, 183, -122, -101, 925, 114, 841, -398, 440, 477, 704, -92, -428, -96, 29, -610, 255, 381, 28, 642, -313, -234, -865, 289, -68]
4598f8o9R20m32j150J323o68J170j060l48N14o7J4o3N86o86k4L20P01j468J118
4618E63l94L51m78m16q8N41q9K86j38J28j70M79j83l47j7k01R5l1J65o95k07Q85
4640C9L23k70q18J343p20L04K43l41j71K79j81m01J7J33M5j84L73k85K54M6l69
4661c41K06J97J0j28n39Q18n2K13j179O71M09Q14l82q50j53M27o20M25j09Q57
4681F94j50p4J66m34O33r22n76J454j249O1j22J71L05M39j092R12l77q66J482
4700D55j93k1j3r68J238l13K96p70O49m69J63j299J231q7m50J004q18K82O1q10
4720h32P69r20J581j171J131k63k84k88L88l03l32L95J29M74j87l26L30l75n3
4739a37m19Q27r31l8J137J92O6q26Q1M25j058N62l16J022j799J178M53m84l98
$$ y = [-68, -137, 783, 351, -799, 524, -144, 1026, -34, -382, 132, 65, 79, 16, 602, -84, -108, 212, 913, -555, 563, 169, 520, 42, -374, -462, 79, -10, 276, 138, 266, 96, 575, 392, 45, 28, -173, -78, -109, 56, -639, -846, 39, 362, 92, -726, 617, -103, 201, 444, 103, -68, 211, 30, -371, -354, -221, -176, -360, 13, -272, -18, 28, -341, -135, 62, 72, -56, -595, 223, 171, 384, -795, -124, 285, 1099, 717, -133, -286, 141, -479, -54, -163, 694, 544, 470, 636, 202, 835, -87, -663, 791, -458, -397, -519, -348, -43, 396, -696, 216, -161, -1027, 455, 262, 241, 228, -740, 498, 185, 481, -289, 360, -109, 54, -1245, -14, -101, -551, 453, -365, -83, -22, -832, -63, -983, 598, -573, 558, 295, 11, -277, 111, -192, -524, -129, 0, 474, 287, -39, 291, -84, -137, -556, 271, -660, -698, 439, 631, 697, -129, -48, 377, -681, -119, -435, 587, -1212, -34, 419, -65, -463]
4758d63n1J68k00L40J31l7L78l73J32j02K34j12K83l14m36L92O02o57j252J135
4778b02K80j84J99l95R25l91l89J58M31m82J57l48L0Q76J70m54p17k34R56r42
4798e56J420o49R6o00R3M13j95Q35j544N96Q0k98N37O6j196Q19J6k3N07o45K06
4819b2l21j01L45n6L37m97M59j29n65j3P03l92L1K41o28O25l67O84P38q51M2m05
4841a42L96k02L14Ml63p29L92M40p86P46Rk42M82n16q2O81j88k82j014J374m70
4862a78O59p08L36L30o32K22p4P37m13K33q09p8N61o89J004m07N63k15p75M5M85
4883A97K21j81M16j00n61N50r47M01J18j7n6j72k55P74o27j56K51O64q76O83m43
4904a16L59q01P31r1o39J13N73n07PK05L89j84l34l53Q03J7K55l30j35J41n41
$$ y = [-463, -514, -346, -546, -206, -75, -112, 266, -107, 25, -77, 157, 45, 328, 14, -422, -30, 572, -85, -1337, -202, 78, -106, 93, -302, 623, 232, -157, 1, 432, -50, 107, -241, -211, 665, 835, 381, -336, -570, 386, -556, 864, 215, 311, -289, -196, 217, 22, 857, -687, -91, -11, -309, 228, 294, -902, -83, -67, -90, 417, -228, -22, -343, -444, -99, -155, 182, -315, 144, 15, -550, -563, 140, -252, -221, 20, -608, 17, -350, 334, 1072, 221, 263, -142, 254, 52, 366, 370, 7, -722, -330, 110, -676, 70, 79, -163, 319, -197, -279, 402, 214, -68, -1082, 292, -178, 481, -227, 109, 439, -193, 29, -45, 692, 279, 512, -297, -375, 186, -503, 501, 94, 657, 442, -333, -288, 197, 418, 237, 653, 553, -8, 542, -405, -4, 114, 97, 41, -131, -386, 388, -239, -395, -144, 520, -356, 327, -116, 243, -558, 173, 82, -557, -444, 129, -378, -371, -166, 223, 39, -295, -648, 155, 172, 427, 97, -38, 103, -438]
4925d38M62K94on86N04j06k08K73n8l94Q23m21Q4L35q35N92m99k5R7M70j45k82
4947f9j9K32o9J50m98K90j11J15q0k98P93j40N07J07j240j67N24j3n14L26L6L54
4969B16m79P80j14j75Lo32K11O74l03l01K56j49n19Q92j072J92P04q45J28O37
4989A04l10N11q4l61L94r20R62m03Q7L81pK06o26j84N16m39l30J082n54m8J17
5010I4O2j78k9N79p86N95p27L58M39k76k97L92m49M45p67O10J96Q1J25o56P5j09
5032b23N3o27R46n9N9p44O88J22p9k72j36O01J35l17l39L84k30j30n36Q33l07
5053a78J26o40P88L03p05M17m0Rj44P56o53J75K95o75R2L17J95k69j39k20P24
5074E34r19P50o97M64j37R0l79P2O9K88k56kJ90J67j06p9Q5K6l39J64Q3l56N35
$$ y = [-438, 24, 318, 312, -274, 230, 124, -84, 189, 131, -263, 560, 139, 223, 558, -277, 315, -184, -209, -112, 358, 213, -69, -88, 144, 75, 225, -273, 17, -94, 21, -59, -357, 436, 296, 803, 910, -330, -497, 27, 14, -500, -174, -138, 216, -263, 517, 403, 228, 231, -401, -190, 484, 181, -120, 136, -13, -532, 360, -712, -520, 184, -661, -533, 104, -206, 305, 221, -140, 254, -666, 296, -107, -20, 361, 354, 560, -66, -250, 266, -173, -503, 579, 25, -23, 94, 156, -22, -51, 528, -258, 337, -390, -32, 407, 131, -166, 226, -223, 222, -545, 65, 261, 342, 467, -189, -114, -223, -170, -797, 149, 90, 149, -595, 93, 215, 136, -136, -272, 329, 464, 147, -192, 192, -38, -168, -704, 129, -178, -52, -692, 96, 399, -306, 111, 71, 80, -64, 692, 39, 214, 509, -166, -74, 243, 438, 169, 30, -190, 534, -385, 365, -332, 132, -5, 85, -294, -222, -153, 135, -121, -123, 67, 234, 128, 49, 134, 160, -179, -15, 68, -288, 247]
5097B47m60L04j8o57J13Q24l48o35M52K57O12p56k23K25N29n32j56L55j56Q3J44
5118B04J88J24m68j2q1K71j98M6O5j67K99k25J12j22o1N5k03M33K37o62L75p7
5140A33l26J34j15l67L84L89K26l87l62P68l15j21O63p09m8NO0j04J27M9l74j3
5162c03N05j17n50N14L31o79j0N71m55KQ3P19j171O08k06L20n43N10k28n84N07
5183a76J53L06n78M80l58L00J78o80M97J05k38J75l62N48n08J16J34m86P76l1
5203C51k67N6M52k96J83j46n87l01L78K31J69k2ol7j01k01M28l03m9J80j39J3
5225a4K7q0J94p2m90M95P3J31p7K88n06q75R99k18R1p0R2j96M80m39l49O76k83
5248a23J14KM74k30k96n17O18j61L9K60l12J97L65k98pM45q48J29K89l41j66O12
$$ y = [247, -213, 91, 73, -584, -471, 353, 5, -630, -178, 79, 691, -65, -288, -63, 466, -66, -222, 133, -23, 60, 204, 392, 516, 48, 36, -45, 226, 28, 74, 139, -28, 271, 46, 158, 36, -25, 30, -173, 260, 497, -165, 210, 133, -193, -59, -174, -541, -157, 232, 458, 71, -291, 477, 162, 41, 704, -5, -53, -48, 12, -92, 35, 84, -290, -303, 202, 85, -465, 49, 380, -299, -309, 262, -193, -191, -108, 611, -560, 48, -158, 162, -381, 129, -99, -683, -176, -23, 283, -295, 185, -173, 127, 305, -375, 122, 227, -11, 164, -198, 350, -158, -42, 92, -394, 382, 351, 84, 140, 592, 296, 479, 333, -254, -555, -177, 54, 223, 201, 195, 158, 57, -144, 284, -19, -68, 112, -27, -14, 13, -67, 127, 55, -435, 60, 133, 264, 187, 475, -31, -906, 93, -125, -34, -104, -12, -208, 272, -167, -516, 160, -123, -9, -7, 467, 237, -59, -576, 42, -119, -80, 180, -132, 65, 430, 132, 125, 570, -278, -149, 140, -201, -367, 245]
5270B45m43K00N0j16M51k96j12j7L70n42j91P93Q3l64m49K58N24l13l11L25k6
5291A19r1L9nj43K53k30J26o0k8j39o5J51k70N82l98L13m38K31M38l96M01p98
5313d08L16Q93q53N7K31l68L42Q1K8m06K7l13O67k91j62j16K85J67k4J81l73P7
5335C8J25k07m42K49K30k54P62n32j58N51n53l90O63J21M8n80N9K10k1L80j22
5356A77l84j27J94J29j7l90L15J62Q2K30r43M09J00j69L70J50m24OM32l19M70
5377D53m70q7K18p4K07n72M39k82j27k08M98J24L20n09L84k02K6j80q6q0M72k57
5399Gm7r4J42j18L79k04l14R5jl45L02K2J6nk66J70K08K3L30l56k72K54j60O55
5423D21j95k85o5M66m49J88q5k8k53O51m40M76n22M38M1k95k66K13p5L86k18J29
$$ y = [245, -198, 2, 52, -64, 387, 91, -21, -38, 332, -210, -401, 392, 475, 111, -338, -80, 444, 131, -180, 145, 119, 28, 67, 62, -81, 172, -58, 68, 8, -20, -159, -224, -73, -343, 239, -159, 154, -284, -53, 385, -11, 390, -408, -92, 801, -52, 5, 236, -132, 210, 291, 319, -87, -60, -373, 294, 3, -159, -275, 10, 177, 153, 334, -39, 38, 163, -44, -486, -237, -7, -261, 501, -31, -189, 362, -191, -581, 82, 203, 251, -329, -270, -60, -81, 299, 177, -207, -334, -140, -11, -28, -418, -103, 59, 141, 371, -572, -163, -63, -232, 138, 288, -136, -130, 302, -17, 453, -17, -104, 114, 40, 247, -325, 114, -168, -295, -503, -5, 119, 439, -70, 314, 112, 138, -42, -128, -208, 264, 7, -40, -134, 8, -110, 269, 65, -249, -154, -155, -500, -198, -176, -160, -165, -431, -261, -53, -30, 300, -56, -328, -74, -234, 421, 226, -59, -124, 342, -107, 81, -4, -32, -285, 366, -74, 402, -120, 318, 359, 64, -202, 11, -64, 322, 104, 233]
5445B33M99p02L40q22O38m7j75K6p8k27J95L21k19L07k26J50n60N72n07J76j9
5466a25M98n01J65M62p44L05k7l18J86N3m7j12N07l95M4K36n3L2m69K28J8K25
5488A68n20M68o0k58M75k51M03o24L77j48m75L08M99j40K26n91J25m47O27p05
5508e43M08P51j017J070p51J13K43k78O76q24L68mQ1k35j79J42J66j73l1k23K47
5529Gj22j85J98L72o2Pj03k63M01k80K13Q8m26K98m12O91l25q9M70p11M8L09j96
5552g2k13P52o67N8K82l51L02m2N54q20J97J43q02N40K55J40r5Q4j77m9n38M46
5574g3l34L77q8j64J58J46M61j88L15q95J39K8M42l72q1m73J104o64J80j90L16
5595A44O2k46j47NJ40J74K8o1p5m05M22k86q4K94k07O22p5p50L46M84n05r7P69
$$ y = [233, 732, 30, 370, -452, 186, 139, -36, -10, -88, -315, -120, 201, -18, 289, 63, 213, -347, 225, -282, -106, -125, 373, -128, 37, 499, -245, 60, 33, -285, -99, -46, -93, -205, 302, -93, -49, 187, 134, 166, -303, -75, -57, 168, -352, 116, 56, -202, 273, 22, 425, -199, 178, 30, -445, -137, 362, 222, 448, -143, -18, -465, 162, -543, -135, 616, -401, 669, -82, 31, 274, -4, 672, -152, 216, 212, 293, 58, -121, 21, 187, 14, -17, -240, 7, -115, -300, -102, 270, 208, 215, 112, -151, 250, -30, 183, 271, -155, 143, -269, 422, 97, 8, 478, -233, -185, 124, -72, -285, 467, -200, -142, 140, -211, 91, 49, 603, -217, -20, 123, -679, -139, 116, 256, 161, 245, 68, 19, -519, -73, -407, -30, -118, -282, -124, 22, 483, 295, 610, -285, -146, -118, 324, -48, -129, -602, 502, -162, 18, -172, 144, 206, -40, -187, -182, -42, 132, 160, 99, 24, -381, 41, -245, -329, -35, -242, 380, 305, -445, -99, 385, -120, -217, 552]
5618E52m41J41l60L53j96l36N45l41j0p86P15J26O14n67P6J40p94M08j9p9M8K29
5640A8K41o13N24J29j2N3l06j13K93k47L61J45j52n95j91J75L55M84q09m1N58
5661B57j1j83o5K85K2k88O1Jk42J54m07K99q8N22P4j12K62r31M36k65K22j91L85
5684A97m97M99p21J143q23M3M32M08o44j09j4J58m3l22J9q4R7O04o02j17O02o53
5706d27O45p47L79J79m35L57j39O7Q5m25O16J46m06R4Q7j02K66K7m17j87N71j042
5728h08N04L71l54R7M97m75M42k4j78n4Q31p54r21R71p6k44K49k24M81q65J54
5749c80R7j90M94m80L14L66q59N07j13j14L47l19P47q34Q60p61o5L45J49j74p17
5770g80P28m7J37K31p61M58M8M94l88L12k99r5J98j98n11M78M95j035J5M74O94
$$ y = [552, 111, 252, -108, 245, 49, -287, 258, -83, -93, -879, -164, -38, 576, 9, 85, 225, -569, -161, -180, -259, -211, 18, 259, -354, 170, 299, 287, 340, 34, -79, 214, -33, 328, 473, 321, -274, -465, -290, 65, 549, -260, -301, 257, 246, 63, -2, 283, 305, 17, 78, 79, -163, -9, -416, -117, -205, 317, 391, 279, 541, -390, 46, -219, 3, -188, 197, -300, 199, -522, 621, -202, -159, 273, 681, 37, -72, -86, 72, 29, -293, -274, -358, -261, 343, -259, -376, 226, -427, 218, -529, -150, 29, -406, -49, -188, -121, -36, -461, 155, 301, -105, -11, 76, -26, 240, 267, -150, -337, 234, -808, -304, 67, -287, -190, 307, -168, 274, 250, 72, 18, 849, 95, -826, 145, 69, -175, 74, -150, 331, -534, -380, -283, -473, 21, -459, -145, 221, -638, -131, -244, -358, -11, -330, 417, -417, 443, -318, -383, -38, 111, -63, -780, -52, -99, 38, 269, -492, -34, 14, 508, 120, 432, 133, 38, 236, 38, -473, 5, 500, -535, -520, -46, 648]
5791F48j054N97m5J08J57p07O91j130P31p9p0m07R05K0O6L15o91N17n4m71O9M79
5813E95l34p6k62L15l57n45M44m6J12n10O64M38j129L90m22P08p1k0J39l3L34
5834C34N04j125M71k86N96o46J56p04P07p63Q4P72M8L48j62J08j79q66M31K0J13
5855c9L59K77n48n7J75n04N61q81K12M06O0j90J73j015P08o31P60Q3m08lJ69M27
5877I4M41j111Q4L58J213l14j59j024O82l52M7K20K08j76k57j32K74K80j058J175
5897D93l83L12l47K42l14L92K16r50k3R84k06l83K28o26J242q99M36p72M62M9
5917A53K07o88Q9J25p8N17o85l12L09L13n71P91r80R23k41N5J204j699R24p97
5937d41q6O62L43j73q39L20M52n05O53l06M65r47M7k21r0P06L36L98j91P2l01
$$ y = [648, -406, 191, 146, 254, 411, -296, 395, -735, -4, -83, -153, -560, 345, 365, 431, 746, 55, 572, 518, 47, 116, 595, 261, 185, -77, 238, -119, -664, -220, -266, -154, -664, 0, 438, -691, -301, -723, -15, -86, -106, 33, 0, 334, 838, -287, 184, -102, 494, -152, 4, -700, 7, -756, -672, 100, 148, 496, 334, 442, 263, -603, -172, -152, -39, 320, 597, 49, -8, 167, -337, 224, -657, -445, -39, 21, -169, 4, -1011, -303, -934, -174, -91, -499, -502, -333, 94, 535, -576, -492, -134, 1079, 765, 606, -418, 264, -88, -41, 179, 387, 211, -46, -178, 96, 376, -682, 493, 110, 422, 75, 317, 3, 395, 611, -339, -362, 622, 416, 33, 261, -365, 877, -22, 414, -358, 104, 153, 360, -328, -239, -114, -192, 325, -360, -672, -363, -50, -621, 170, -810, 113, -128, -73, 1131, -568, 356, -441, -527, 135, 478, 305, -534, -214, 238, -267, 386, 80, 545, -402, -355, -576, -666, 40, 376, 774, 583, 655, 354]
5958C54l95L81n80L34p96Q10k86L96K99l45j37o67M97r2n2j42P51l03n75P17N44
5979G13r0L72j78j193N83J94l89M62j075O77p79P72m01O23J62j65n0m08K16M98
5999E44q36K35P82j99o82K3l05P46p25L71L32K06n90L67O6n17k74J102l40j118
6019h12R91J74k25j84L53p46O98j62k95M17J53p19m72P05L90o61j71R5L69M42
6039C40k91O0l77k47N09m18Q75l07M11n89j36K72k75j47J71K28j57R6N65k23l71
6060a1K9P7l90M83j45N05j93m77L38k13j56k33M14L81j25l63O8N14j475Q26L10
6081A64J1O02k89l39m04j61L49q8q9K15p3M81l39L02j56J22n83j53q7M47k74J26
6103b16J81O21K46j512Q28J4r02R55k39l15PK38JM21K1l21j37J39k22j18O16q61
$$ y = [354, -41, 340, -240, 94, -702, 108, -178, 218, 517, 172, 35, -632, -135, -227, -279, -421, 330, 27, -548, 169, 713, 623, 995, 817, -376, 207, 401, 12, 474, -601, 76, -703, 69, -332, 291, 453, 288, 238, -170, 46, 544, -292, -57, 725, 526, -156, -133, -438, 308, -417, -46, 286, 492, -98, 269, 335, -182, -456, 646, 306, -812, 179, 353, 128, -56, 297, -449, 249, 87, -208, 209, 362, -357, -829, -124, 266, -395, -566, -471, -102, 340, 49, 109, -268, -515, -6, -424, 451, 144, 555, -34, -170, 102, -173, -320, -149, 79, -78, 18, 583, 360, -11, 18, 95, -295, 188, 43, 548, 355, -122, 216, 3, -153, -386, 28, 409, 284, -79, -11, 503, -972, -146, 164, 175, 777, 488, 149, -255, -416, -67, -155, -244, -29, -102, 379, 40, 342, 186, 308, -275, -428, -515, -68, -342, -216, -35, 586, 832, -680, 148, 162, -740, 215, -24, -339, -332, -94, -93, 328, 349, 28, -109, 30, -192, -310, 306, -555]
6125e55RO78o76Q27n55K98K3m38O08m95O87m46K65J74p23L97k1k07L57o33K69
6146a57j03L04J17Q4J0o97RK68L90L8K62m61k96Q39o64r8L26n8K72K25N11o60
6168D61n58N62j269J243J26j024j06Q38p72J427q87k55m4P61N29r90Q16j218n61
6187i21L29J038r12J46K62j9J107j38q91Q14j093N56k4K12r88n10R42o87M37R35
6207E95q84P2j96L54O67q84M87n40n74J083M42l32k88K5n23N71r76J456m41p33
6227f19O60l01M05L51j410N95%l07O49k95Q38j218m27Q02K25n5L39j211J714q13
6247g8m33K01N5J71Q73l48j250J76P36l92N03J49m30O6r0M35n64L31M25p5o84
6268b23l00P6J036L54j169k98Q50k43j31p09Q50L76m75L5N63j366Q23j13m43J25
$$ y = [-555, -546, 132, -544, 283, -272, 26, 49, -389, 219, -276, 411, -35, 230, 404, -319, 78, 57, -150, 207, -426, -157, -260, 44, 161, 245, 255, -442, -433, -165, 225, 263, 525, 64, -232, 607, -57, -155, 171, 113, 385, 610, 1121, 461, -97, 465, -804, 439, 565, -459, -565, 273, -499, 928, 41, -214, -258, 503, 1032, 42, 858, -360, -921, -592, 446, -466, -320, -58, -77, 1030, 892, 1, 815, -278, 278, 254, 466, -522, -1032, -90, -777, -340, 595, -289, -217, -413, -59, 608, -276, 211, -329, -903, 180, 622, 290, 2, 27, -496, 75, -901, 555, 114, -619, 41, -260, 145, 496, -914, -319, -319, -626, 23, -272, 566, -652, -1079, -277, -52, -107, 232, -979, 735, -78, -511, -310, -255, -84, 789, 441, -809, -633, 103, -289, 214, 363, -67, -1, -91, 344, -220, 111, 536, 461, -223, -523, -447, 589, 943, -226, -524, 326, 83, -48, -757, 93, 469, -6, 29, 592, -774, 49, -64, -507, -382]
6288c82P50L44j061Q56j061O09l94L22n4l4k14K19O82p45Q29k94p9o39M27k25
6308a44M59o16K70j7k21J10J6K22p7m46R2J79M91j018Q76o60O09l94N09M65q03
6329i8J52l8QK51l0o6k34L13k55l00K63m0m04Q54p7L42m76m54J0L72m42J82J080
6352I13j505k1N52n59R10l56M74m32M16p17K57l67J316m05j73k95r0o7J003m99
6372C55p95J02qJ069j182O07j021L43O67q82O08J52M6J032j029J24j00j46K34
6391A76k20r0O0M2O62q93Pl88P76o5J31o93J007j119nQ65j12L84L79n26r21J233
6413F90j014P36m34P0L36j299J606q55o7q2l10J575j393P01k44k86K45l70M91
6432I6M16l00K36n58J042j521Q48L38m53j10K23K06q34j65M67l0N85q89M30K3
$$ y = [-382, 368, 712, -349, 507, -554, 55, -339, -17, -71, -105, -319, -100, 582, -163, 666, 372, 293, -346, 81, -144, 315, -301, -31, -48, -269, -159, -143, 79, 2, -444, -352, -173, 318, -700, 176, -484, 125, -269, 240, 705, -98, 54, 16, 24, 275, 245, 179, -55, 258, 3, -297, -34, -74, -478, 376, 299, 641, 165, -289, -279, 93, -349, -167, 913, -592, -613, -61, -620, 290, -66, 408, -24, 392, -325, -68, -435, 881, 476, 303, 8, -82, -149, 854, 355, -440, -338, -346, 723, -459, 148, -873, -530, 137, -745, -137, 15, 61, 1093, 64, 188, 88, -58, 176, -44, -134, -74, -32, 630, -263, -256, -644, 132, 67, 198, -495, 512, -607, -612, 253, 141, 525, 904, 378, -543, 690, -324, 412, -22, 48, 384, -915, 691, -164, -231, -313, -623, 952, -441, 260, 16, -270, -25, -395, 96, 512, 212, 448, -110, 932, -589, 259, 597, 144, 34, 257, 463, -371, -536, -69, -99, 486, -403, 27, 50]
6452E0m92J40m10J299O6L1m16J42l53L4L64j56O81j714M48K14K7K74n82K56L86
6473B89J10r1p14R57m55n50J070l07p12R68J86q85O08p37j018J426K89J0m45k97
6493b98m09O94j90M00K15r02Q79n66O11j85m91n29K81Q22O59o66J6N77j510P79
6513A87o92j12N44o07K15O72l96Q40j209J026l03Ro52J83p6m56j51J183M25p55
6533a25O6m90J116l91j56j84M06K15m46m09J016l38l44Q52n51k71j23P2M17l9
6553B93j97m31K22pp78P65j96k9n31J295J01l85m23P51k06K53o19k68J19k68O47
6574A08k61K45K2k48L67r2k42N73p51q34J152m85K17j91J65J48J42k35J58L73
6594C31n79n2P4n58J395N0p80n8q5K13o7M27k57M4l41p1Q14l25j76o2M08j245
$$ y = [50, -442, -302, -712, 587, 653, 684, 268, 410, 57, 91, 455, 299, 980, -734, -286, -72, -45, 229, -353, -97, 289, 399, 308, -406, 551, 96, -454, 616, 309, -403, 565, 751, -134, 474, -263, -1281, 145, 434, 444, -1, -298, -707, -13, -203, 197, 412, -490, 389, -177, 434, 249, -242, -771, -490, 332, 991, 325, 341, 918, -592, 187, -505, -617, -73, -680, -465, 207, -189, 651, -558, 468, 165, 174, -478, -295, -371, -827, -978, 205, 630, -125, -59, -549, 567, 176, 20, -164, 242, 457, 11, -398, 618, 280, -64, 788, 237, -34, -157, -85, 332, 293, 96, -335, -113, -120, -898, -133, -329, -358, -889, 406, 507, 122, -301, 450, 244, 497, -122, -390, -271, -539, 108, -153, 92, 114, -134, 233, 141, -101, 472, -279, -1113, 39, -446, -229, -420, -255, -107, 35, -200, -42, 331, -248, -300, -226, -784, 611, 661, -119, -177, -262, -49, -116, 311, 54, 98, -243, -314, 500, 175, -1, -63, 345, -900]
6616i00Q56L0L34n73N74K07r46J008n87l35P63m88M8L24o90L11o86P07o9KM15
6637C05k18M5j10m0M7J49m13M90p83O43J85J93o8n18j54q1j31N12J89k96N16n23
6659f1L4L79k16l62qJ16K71l84M72m44n46N94K67m54K14M29J99j89M52k59l54
6680A50m4K9k32J16j65L46J76k52p6K72j78m76M1J36N44n69Q3P09m21L2K26l76
6702G1j8j28j0M68l67J31m3k56J55l5mo57P39l63M59l77Q44j364R96M1p0k39K5
6725bN13m06o48N22r2p05J160l00k22k05L19K36J35j75J58m89N61l74M55m88L35
6746B88o75P62o54P10n33J19J7k68K80l95M51l75Q4n3K38j80N23p13O99k57n75
6767e07K21O16p44k71M21n18Q64J41L6k02j29K97m03L66J00o31K67L74n50P36
$$ y = [-900, -44, -14, 320, -253, 321, 528, -418, 590, 3, -332, 431, -57, -9, 315, -375, -64, -750, -43, -112, -110, 305, 87, 132, 22, -18, 29, 178, -235, 255, -528, 115, 300, 493, 425, -93, -247, -328, -459, 53, 242, -54, 462, -61, -27, 352, 136, -226, -234, -118, 153, -231, 241, -203, -749, -155, 112, -342, -128, 301, 500, 311, 763, 504, 150, 106, 135, -97, 19, -146, 200, 376, 124, 48, 320, 142, -334, -293, -157, 387, -182, -99, 610, 189, 221, 447, 71, 53, -75, -85, 383, 16, 147, 104, -152, 3, -32, -36, -693, 46, -317, 142, -235, 609, -755, 241, 282, 212, -27, -2, 511, 105, -543, -21, -113, -818, 342, 42, -180, -385, -66, 170, 305, 130, 288, -201, 360, -14, 441, -47, 288, -387, 375, -279, 431, -102, 17, 34, -234, 46, -349, 102, -273, -189, -242, -4, -184, 339, -374, 325, 68, -507, -286, 330, -414, -685, -264, -782, 82, 223, 259, 57, -72, 225, -178, 188, 288, -343, -76, 298, -252, 484]
6787D84n21L98n5p97J005n3J19k90k98m48J68M88m5M75l31j23m44R20o58K92O6
6808C52p23J100p76L54mQ9r10Q60k13O54j031j24L82J39k16O7k14L37Q8j23q46
6829g58J105J34m31Q0o68M38L38N03r53J79k02N29j039J591n08n60M94j25r5r06
6849h54P96J171p72n91K2k11l37J39Q4P31m14M56j35k9m07k57M66J27m82L66M56
6870C25k87k71P21j201K11J24L65l28K07k6P32j130K24L73j019N60M70n25P69
6889B94j91LO02o53K60nl02j09P81n70k92O62J14r78OP20o63R8N64m68p5O76n86
6912a12J68J68M77o60M9k18j2P83L2q00j88L96J65l47k1L0P12K72j21n35q88M51
6934a99r3O73l80R7K70K40o32p28R35j004J108l73L8J292k101R68k2K47l95q9
$$ y = [484, -37, 361, 306, -491, 514, 461, 580, 290, -8, -456, -288, 200, 155, 630, 299, 176, -268, 652, -6, 286, 352, -371, 729, -47, 307, 303, 392, -518, 342, 129, 783, -248, -372, 10, 149, -67, 0, -214, 123, 211, 88, -758, 347, 481, 50, 130, -538, -100, 238, 741, -212, -33, -235, 294, -745, 846, 338, -222, 272, 147, 52, -854, -58, 1113, 341, -250, -228, -439, -776, -637, -553, 178, -236, 220, 85, 56, -351, -608, -142, -15, -497, -131, 325, 38, -233, 488, -713, -502, -378, -13, -341, -134, -160, 572, -558, -334, 39, -980, -420, 50, -475, 294, 103, 106, 708, 55, 315, 310, 8, -101, 680, 110, -182, 480, 594, -384, -378, 342, -321, -223, 341, -127, -202, 474, -112, 56, 224, 701, 41, 90, -128, -140, 643, 675, -125, -313, 83, 248, -99, -120, -90, 622, 894, 773, 238, -650, -199, -292, 381, 1, 98, 368, 608, -24, -752, 183, -821, 287, -86, -48, 1244, -857, 111, 89, 336, -59, -148]
6954a48J48m41J090l05k30l71Q60K03j073NL01m5j56L10q71J002n3n78m95J057
6974B10k02J80J58l97p90L42M10M49N16l26o9r02O80M47n36j254J326o46O69J10
6994C75K35p99J87R98j172L4l27k88L14J053m02o10L17N94q32L48J180j520n21
7013h36K59M32K31m84J273j134O13l03k13L60j04k54L1Q50r13M27P75j114l67
7032d71K98N12p45P09m88K48K0K9k90J90K63M43k44j15l61l94P65j78L10r64R88
7053E25o70L07K2k11N55j56k26n61l2P71p1p24P22l88j96J72P25n47J07l00O6
7074a10l11Q01p6N09o2n23R09j703P63o25N50J99o81N56m28j47R02o16O2j45P7
7095i9l45K8Q89o66O43j40o44J017m91m99M44j34k63k75J091k70k77N5K4k19l0
$$ y = [-148, 0, -441, 649, 344, 114, -257, 603, 806, -267, -262, 39, -6, -162, 148, -723, 279, 226, -352, -847, 210, 8, 188, 346, -51, -841, -499, -89, 360, 876, 550, 481, -421, 259, 706, 170, -1084, 242, -404, 265, 375, 610, -189, -2, 996, -176, -142, -469, -757, -443, 610, 208, -402, -85, 509, -323, 25, 1205, -315, -836, -577, -145, 86, -398, 875, -259, 354, 51, -162, 198, 94, -160, -129, 721, -192, 235, 1010, -104, -471, -173, 339, -406, 303, -185, 63, 83, 112, -178, 12, 275, 718, 474, 359, -2, -396, 369, 191, 501, -463, 525, -145, 162, 184, -27, 528, 372, 146, -415, -447, 324, 253, -471, 251, -137, -333, -161, 564, 17, 124, -176, -110, -421, 380, 304, 813, 751, 228, 1137, -566, 197, -428, 122, 321, -360, 196, -232, -379, 523, -93, -31, -176, -99, -444, -416, 473, -193, 450, 310, -334, 683, 192, -307, 137, 3, -260, -535, 556, 286, 9, 64, 88, -131, -161]
7116a61P29n35k78N48n12j10R40p85j16Q79o27J025k93r64J16j1m97O28J76l72
7136b20J21K2J63l49J217j064O39j109J107n87k06j37k38J252o75k00j00O58r3
7155B01O17m47k34q3n83M41N54n79L53o63R44n87r19L80J246o79o94M00R25o89
7175i6Q40n13n92N36R5k93K60n37K03O96n28l93q8L14j1O48j022Q62m63J67j1
7196G4o85Q05n3Q6n13K34K50L17k89k29M04O3m91n16Q66P7k69o72Q16J57o21J1
7218a78p0m72L59Q94p06N78m64o11P51o36M42p2O04j035P32j82j65L91J06J84
7238D50n55L00o53L74N8K31mp87R31K24j10j68p75L84N14j78p48M57J61j38k85
7259c17N74p85P86k21j28j59j89P7j85L42K56j17R0o47O67j49K56N89n13m13m50
$$ y = [-161, 568, 33, -245, 303, -209, -319, 621, -164, -280, 599, -28, 997, 704, -260, -144, -155, -652, -24, 152, -220, -99, -77, 86, -263, 954, -110, 529, -580, 527, -60, -266, -403, -641, 611, -64, -264, -364, 294, 201, 818, 371, 137, 54, -529, -88, 466, -113, 240, -423, 521, -66, -985, -605, 641, -38, -732, -332, 593, -96, 744, 231, -361, 175, 270, -23, 237, -300, -97, 599, 71, -322, -410, -96, -107, 541, -481, 381, -82, 85, 74, -611, 194, 141, 227, -286, -52, 198, 515, 226, -3, 401, 464, -27, -543, 323, 400, 131, -541, 275, 432, -189, -178, -248, -720, -361, 533, -173, 405, -59, -670, 81, -555, -113, -185, 419, -616, 116, -66, -231, 160, 266, 450, -105, 195, -458, -84, -26, 205, 201, -586, 345, 569, 459, 291, -484, -100, 414, 236, -512, -55, 106, -32, -317, 257, -528, 258, 37, -91, -250, -439, -362, -547, -205, 51, -66, 24, -623, 44, -105, 151, 740, 227, -186, -636]
7280f36L41L2R01q58M4N43n19R41r83M94J45k27J45k79l05L5K54k73L87r2J1m80
7302c79j19O70j93L33k41J40K85o70K39l32M81J41j279Q34K27m60P87K62p27J312
7322A311j990L05L6J057p70k79O72o27J19N29K59n24Q8K51k65l66n08J40L92j96
7342c66k5l34J45J190k70j74O3o83L00J143j074K7O35j150R13j013L19Q26k93
7361A79m4n81k24Q37j75M67L9j006O92P25q43j35O3M19q08k60O53N1m77L91K59
7382B22nm53L8O4K80j06q68M60q9O93j35M6p48k09P84k43K50p8L67j85N93j202
7404e24K22J14J40N5J4j6M17l29K21j47r6p04P22R9L66o6q06M32L81k19p5k90
7426h9m19J23J38p06Q90Q58j144Q51q71M50J021j101J32j87l7q30J124l00L96
$$ y = [-636, -295, -263, 638, -220, -176, 367, -152, 789, -194, 300, 445, 218, 363, 84, -221, -186, 68, -205, 182, 90, 101, -379, -498, 172, -21, 312, 71, 211, 496, -174, 65, -267, 214, 355, -924, -90, 137, -323, 464, 726, -1, 1311, -679, -374, -338, 719, -51, -330, 342, -285, -166, 363, 622, 98, 186, 437, 172, -194, -702, -562, -170, -366, -391, -725, -580, 610, 340, 166, 229, -454, -154, 989, -85, -58, 577, -573, 340, -673, -354, 472, 179, 135, -446, -670, 167, -8, 459, 498, -508, 184, 909, 66, -69, -6, 413, -395, -655, -2, 49, -428, -37, 222, 217, -236, -198, -134, 146, 40, -828, -368, -457, 236, 101, 147, -601, -810, -26, -269, -19, -97, 270, 85, 678, -524, -302, -188, -48, 7, 21, 5, 422, 93, 314, 167, 71, -633, 89, 188, 554, 488, -318, 114, 495, 276, 201, -89, -508, -385, -247, -953, -63, 795, -349, 502, -369, 81, 1102, 1, 133, -54, -91, -921, 203, -97, 299]
7445B99M3l17n0K80J19j1j95l42R4J30m71K25Q59j233M22K91l96O14n18L83o74
7466d48M64L96q67J90K49j43k92M69O63m93m89J10O3J19J01R53j079m2l0k76J09
7487b73j96N07k07J66q0k99J142n54K76j370N19L09L63l62l15N41R1o77O26J14
7507C21q6k48n51M00M02M32l62l73n67N97R0R87l84J41j147j36M32K82k14J25
7527A41n03L23L5j25L51m93P70J0o89O45j063J667j539M31N44M6k9p9l76K58K48
7548E73p9l9J03m38m48Q10p65L69k65K60N89o25k36k69O30j2M50j186P93M37q22
7569a70j54L92J06n32O32j141J353n17O9J30k53M31J70m10k64q36P72O01lp60
7589c84P87p87O27j043J650r82K22l4L37k06o1o9m6L37l32M87q13J06P84n00L29
$$ y = [299, 342, 25, -25, 255, 374, 363, 168, -174, -80, 50, -421, -196, 663, -570, -148, 143, -253, 361, -157, 226, -448, 16, 412, -455, -265, -16, -159, -451, 18, 681, 188, -301, -191, -128, -9, 92, 1045, -34, -76, -106, -382, -273, -469, 38, -169, -3, -83, -382, 760, 206, 482, -888, -369, -60, 303, -59, -374, 167, 258, -419, 207, 321, 235, -13, -564, -164, 238, 670, 308, -65, -632, -35, 55, 1042, 658, 799, -348, -484, -52, 230, 16, 141, -362, -39, -4, -129, 222, -271, 499, 509, -180, 465, -598, 1069, -470, -39, 505, 551, 522, 443, 67, 325, 573, 494, 455, 558, 120, -328, 482, -283, 86, -179, 81, 670, 45, -191, -460, 170, 158, 608, -578, 215, 652, -170, -324, 68, 174, -358, 274, -867, 486, -31, 38, 168, -85, 346, 516, 106, -158, -994, -222, 379, 376, -384, 403, -384, 243, -800, 850, -132, 90, 56, 393, 187, 126, 57, 11, 348, 16, 503, -310, -204, 580, 80, 409]
7610D09k22m50L56j69J63M75o29m38R1O40l29j28J49J81K69p05Q05k26n5p25Q59
7631C21l00n69R1J089q93R2k50j8l04M09L76l94Q55m14M35q86L91J05j48P6J31
7652A95k57r5J37q01P59K56l98r5P91m79j65k75N54k27N50p32L69M94j091Q53
7672C43l09on34O37k82M14K49q68O15l28K37M60o34l48M07l81N19k87n2K96m46
7693b98N27M43m07k51L0k78K45K0J38l24O02N37o85K85l76j69P78n79k89l31J117
7714G35n43o05Q22m77J00j06k55L62M72j55l62l64P0J25n44P45N80l17o2k90l86
7735d55J043o21Mp01k04Q56n3P1m20L96J67R0j54M50J71n17K27j22L09j49m38
7756e0K49N32j39n78kR4p10P64M4l88M73P8r5k22K25k06p9J80k10m53P41q17L22
$$ y = [409, 187, -263, 93, -76, 87, 562, -67, -505, -414, 226, -103, -231, -82, 99, 368, -337, 468, 242, 187, -538, 321, 21, -548, -457, 632, -261, -169, -419, -437, -741, -332, 44, -350, 505, 91, 526, -360, 31, 136, -12, 64, 195, -62, -157, -20, -821, -62, 194, -204, -299, 492, 13, -152, -427, 127, -100, 450, -282, 87, 581, -510, 343, 34, 28, -506, 131, -151, 263, 512, -356, 259, -69, 168, 628, -6, -354, 53, -328, 191, -96, -148, 148, -298, 229, 672, 265, 14, 44, -234, 11, 31, 169, -155, 447, 984, 299, 584, 208, 39, 817, 238, -51, -382, 735, 192, -413, 409, -68, 32, -74, -329, 33, 505, 350, -12, -376, -306, -181, -725, 20, 600, 283, 221, -69, -455, 588, -33, -29, -730, -934, -78, -131, -60, -480, -84, 83, 173, 19, 469, 640, 123, 350, 228, 537, 388, -50, 199, 731, 592, 14, 12, 106, -604, 160, 204, -184, 289, 367, 272, 50, 275, 69, -10, 170, -40, -493, 248, -569, -247]
7779b47M81k08O82j196m7J39R27m91O88n65J76k81K18j54j33J06L97m40J76j76
7799E2M07l75J00q3m06q8n1O56p19l08Q12J73j43m57K67m4P54j256R03M06q90
7820b90K72q60R23L8l58M74r00Q52k34K60Q9j73o01N21P7M16K8n19M67j79J50
7841D53l64j17J59M6l06L19l36Rm39m05J105r4j4m61J359q06j7L82L51kp73l70
7863c21j26L15J75Nm59J00N52n20J93J109p87q16L71N20r8J50n31J61Q12o87l82
7884b64m43N50N94K44P43j797K93K87K21l96q23J90Q81Q77n38p0p0o14R92q40
7904A7N51K48o88K30m11k6O41L13n10j038J256j160J487q38j54J62K03m17J1P71
7924F48j47m53R20o03n52P17l46k93n12k3J576j855M74N23j66k15m28M67l61L80
$$ y = [-247, 234, 26, 708, -488, -535, -396, 531, 40, 728, 163, 339, 58, 276, 122, -11, 95, 492, 52, 228, 52, 459, 84, 184, 101, -305, -393, -444, 212, -507, -815, -3, 170, 27, -430, -163, -207, 547, -709, 194, 600, -290, -18, -878, 45, 83, -275, 199, -701, 151, -83, 177, 266, 93, -508, 13, 90, 506, 534, 15, 482, 303, 453, 89, -28, 131, 177, -129, 190, -146, -137, -576, -981, 124, 30, 16, -445, 914, 108, 91, 473, 824, 822, 49, -321, -447, -132, 43, 48, -411, -311, 241, -279, -86, 1023, 236, -580, -209, 311, 213, 363, -168, -7, 805, 118, -264, -707, -157, 437, 681, 1424, -373, -80, 207, 428, 32, -791, -601, 280, 1157, 619, 549, 479, -135, 857, 17, 568, 816, 128, 358, -53, -79, 562, 875, 365, -673, 583, -577, 910, 72, -82, 80, 283, -134, -123, 648, 501, 48, 968, 365, -187, 530, 184, -109, -621, -644, 932, -923, -449, 74, -92, -307, -735, -268, -629, -249]
7944b49M52M56q39o17Q36R4l9K55Q57k008n8P07O72k71n19L33n07QJ092k55q23
7965d23J346q56j59L61j068K157p41j021J20N69l24N27j65j15R3N59Q5r81j3N43
7985D94q0j528O53J544j310r5O44o67P1o0R96j141L66l43L95L58n18M55k30j03
8005i9J42m60P97N98n47k82J081j433L84j93J073q14k6P25r03J03J27K02K63q80
8025a42P49m90L9L06p47M08O5J98l8M03r78n5Q93R0r7r58R14n22P35j222J96Q48
8047E95j22K87p55L09j36k58j61P32l37l77l43M22K35k39O53o19L43j127P69%
8067a29n13K07Q03n31J11O93j176N30R20j562J107P6j27K42r8j251R94j45q3R72
8087A040j688K54L99j49P37n64j68O02j081O97j142J248l41K01M37p55K55l75
$$ y = [-249, 203, 659, -180, -797, 39, 133, 94, 349, 1206, -802, -860, -153, 519, 248, -271, 62, -445, -437, 655, 400, -423, 923, 67, -92, 269, -799, 1358, 617, -404, -284, 285, -39, 488, 323, 208, 301, 860, 945, -36, -49, 494, 414, -1114, -461, 1083, -227, -322, 322, -345, -274, -334, 662, -479, -113, -456, -61, 297, -221, 234, 4, -99, 43, -417, 380, 978, 431, 149, 1230, -203, 181, -12, 1061, 247, 221, 946, 43, 146, 273, 475, 738, -142, 607, 117, 156, 462, -285, 123, 188, 386, 348, 751, -227, -282, 611, 701, 604, -354, 560, 38, 773, -449, -253, 595, 473, 760, 5, 314, 178, -80, -241, 491, 154, -223, -566, -144, 91, -148, 505, -114, 229, -898, -129, -129, -642, -435, 368, -163, -52, 641, -535, -5, 915, -647, 460, 536, 409, 651, 553, -698, 296, 151, 68, 1040, -648, -394, 5, -144, 593, 29, -139, 463, -618, 79, -1063, 185, -156, 45, 482, -273, -18, -393]
8105c93K24R34q50l88J428r06j093N82J372o22O06k11r57M9m34P71J32J2M4j41
8125A59k89l08n75Q41J96l20N4k68K59o5m3J270l14j124J086r73k81P30r2k00
8145b57P5Q86k71Q9n22n52K44p49J190r43J568j08r59N08m82K67J41R59r62J31
8165B53m87K31M69L30j968K118q61J32Q24r35N57j80j017J098o82L38l08L20q87
8184f55L25P30K69l2j028k16R55
$$ y = [-393, -169, 765, -85, -473, 955, 49, -1044, -462, 910, 288, 894, 683, -274, -225, -659, 112, 244, 256, 300, 159, -130, -438, -1013, -172, 24, -296, -242, -510, -251, -316, -359, 911, 597, -527, 559, -414, -695, 35, -57, -257, -182, 704, 433, 522, 0, -552, -308, -1057, 133, -810, 758, 650, -309, 199, -283, -16, 125, 1084, 122, 253, -234, -3, 466, 796, -1172, 946, 85, 217, 1041, 106, 663, 483, -534, 564, -118, 220, -88, 232, -655, -330, 400, 669, 637, -391, -607, 348]
8191C48
$$ Imaginary data points
##PAGE= N=2
##DATA TABLE= (X++(I..I)), XYDATA
0@%%%%%%%%%%%%%%%%%kJ0j6J6j6J6j9K7l2L2l9M7n3O1o9Q0r1J01j14J30j46J63
39H6j82K04k28K56k83L10l44L79m18M61n07N61o20O82p50Q28r17J016j128J256
59F62j405J582j794K057k389K823l424M314n793Q876k6973L3432j6099p2187L8427
74c7891R613m0165J0729M1576l185J2445J3827k7238k174M5844l149j8518L0533
87C2247J6618m1244j1579K2086m615l374J8539j9377k4935J8413Q04l7420J9073
100a4764M5844k6075l8899K4677J5991k6412L677K6902m742q227J550j6808M54
113a6832L0561j663k4484K0604J6910l2847j1502L1464Q140j3934K101m33r168
126a083O858j371j4723J6941K0505k9069k4695K7313R820k6552R38K4746p735
$$ y = [0, 0, 0, 0, 0, 0, 0, 0, 0, 0, 0, 0, 0, 0, 0, 0, 0, 0, -2, 8, -8, 8, -8, 8, -11, 16, -16, 16, -23, 24, -29, 32, -37, 43, -48, 53, -61, 69, -77, 86, -96, 108, -120, 136, -147, 163, -181, 198, -220, 241, -266, 295, -325, 357, -393, 435, -482, 534, -594, 662, -743, 839, -955, 1102, -1287, 1536, -1888, 2426, -3367, 5509, -21464, 11968, -4131, -76318, -37891, -28278, -68443, -57714, -16138, -19323, -6878, 6949, -20289, -22463, 23381, 20232, 1714, 32247, 48865, 7621, -3958, 18128, 13513, 10139, 28678, 9301, -15634, 2779, 3583, -33837, -14764, 31080, 5005, -33894, -9217, 6774, -19638, -15961, 10941, 6199, -2028, -478, -17286, -16832, 13729, 12066, -12418, 8186, 25096, -7751, -19253, 12211, 20351, 6417, 8518, 8085, -1083, 5775, 4404, -10319, 6622, 27127, -1942, -26637, 676, 10496, -16056, -15118, 9628, 1893]
139A893j7894L793L380K339J1772k655j2856J1374J0041j9962l073K5965L848
152A7965j9071K97P058l166j673k75l176R717M407k0693j0902K2345N697k1692
166a3162K36K0902n273j8454N054J3694l76k498j928m65O015N39j2696K665J7665
181A1918j640j8798K807J3288l173p475J831O093J851l240r470J312J3914j091
195H127j5254K348J5222q030j5256P794J1148m200j0184O27N803J670l439m048
209g672O817R892o231j1922P861J2184o630q752O616P729l595p945J08O184L787
224H431p162p389O368O382q235q679Q360Q814p508q083M500O863k381n453r72
239f144P178M005p411o421R399Q624r350q112R359Q494p536q668O658Q785m396
$$ y = [1893, -16001, -12208, -8828, -6489, 5283, 2628, -10228, 1146, 11187, -8775, -11848, 14117, 17965, -1106, -809, 6249, 3083, 1410, 1135, -2041, 7676, 12083, -8610, -19512, 2833, 8530, -13162, -12926, 7976, 2703, -15751, -10697, 2997, 2621, 123, -1805, -2270, 3745, 4284, -8412, -5747, 11918, 10278, -8520, -5713, 7575, 4402, -3073, -1242, 4851, 6702, 3462, -6008, -4696, 9218, 8127, -7127, -4779, 10443, 2413, -12843, -5049, 6099, 1899, -8285, -7658, -1855, -185, -3624, -7672, -855, 9037, 2806, -9116, -1255, 10929, 4299, -4453, 2163, 9892, 6297, -1648, -1540, 4644, 8431, 1269, -6120, 248, 6630, -1605, -10284, -1924, 6890, -618, -8701, -4201, 2662, 281, -5172, -6144, 1034, 5039, -2372, -8793, 606, 9230, -120, -8232, 1127, 9621, 2085, -6583, 75, 8860, 4464]
254D464q684J423Q118J059j0949j657R078K758r826l684Q284M248q484m142O433
269a561N290m040o087K713P319J05p380n20Q243K483o663l311O856M785o028n651
285c447N329O153l013q325R07Q204q23j0060p34Q648J810r213m242R057N698j0343
301d394m334P378N666m994o623N241Q432l708o896K683P562l91q687l45P932J537
317F059q532k492P293K425o582m383L901N733l663o366R86Q709o28p458n26Q197
333B673K281p267k778O360N487o243n573N437P024l864q913L649R573l451r374
348d979J986P457M27q632j817P667M009q588l283O477N157p310n437N891N217
363D242l655n800K688O184p01o254j577P476J648n533l881O478M759o171m684
$$ y = [4464, -4220, -2797, 5321, 6380, -4569, -6226, 2852, 5610, -4216, -7900, 384, 4632, -3852, -7994, -1561, 3729, -311, -6398, -3685, 3634, 3739, -3641, -4161, 4082, 6565, -98, -3409, 3447, 8232, 2204, -3447, 1882, 8035, 5022, -3303, -2396, 5808, 4985, -5075, -5809, 2839, 4649, -4564, -8806, 251, 5949, -4394, -8728, -1350, 4316, -678, -7301, -2060, 6372, 2664, -4232, -1549, 6013, 5622, -3065, -3410, 4522, 6059, -2473, -4965, 2328, 4753, -1829, -6212, -2311, 3422, -241, -6607, -5621, 3088, 2460, -4998, -5524, 2673, 4954, -2313, -5091, 1269, 6756, 513, -5060, 377, 7401, 3537, -5376, -1727, 7846, 4395, -4979, -2993, 4464, 4891, -3741, -5558, 2109, 6118, -2470, -5753, 724, 5881, -1429, -6866, -975, 4242, 587, -5213, -2525, 3659, 2958, -3296, -4873, 2603, 4251, -1282, -5163, 1315, 6074, -97, -4781]
378d781N392M365k933n439Q39O608p68p162j211P902L420r329l174Q422L350q451
394b950k096N755L565n470l023J533O891l86p251m73R139q57r085J10R098M2p238
411b696O97L287J911k609l297J289O368j265p703q68R556Q0j0590L142P097j256
427C143p645N45M552K870j802o434R18Q404k729r460M780R918m699r695N041P250
443D957l161l842K224K741K088k648p120M431P762m068r485N241O743p566n769
458g472O354N222l238l499r80Q19L853o33n473N074Q308p633r008P841Q014p158
474C91k907O326j92k704k173j707L190O598n173q222O257O229j0651n162J2452
489B552N111j0824j163L930j158J439m10j356L865L195r307n518J2461L314r547
$$ y = [-4781, 611, 4976, 2043, -3396, -2557, 4051, 3283, -3879, -5090, 2812, 6232, -3097, -6271, 2151, 5501, -2950, -5046, 709, 4274, -1196, -4219, -2686, 4205, 3819, -3432, -3905, 5234, 4377, -4708, -4598, 4500, 4542, -2696, -1999, 1288, 3199, 590, -2707, -1418, 4950, 3685, -4018, -4886, 4670, 4750, -5840, -2698, 4399, 3143, -4502, -3957, 595, 3465, 1663, -4771, -3853, 4551, 1822, -7638, -2858, 7060, 2361, -7334, -2293, 4957, 1796, -2046, 178, 2919, 5007, 2359, -4761, -330, 7432, 3364, -6121, -880, 5863, -1703, -7472, -1118, 4104, 866, -2633, -3613, -2794, 1059, 426, -5047, 27, 8335, 702, -8306, -465, 7549, 391, -2516, 3810, 3618, 914, -1259, -2966, 224, 6822, 1649, -6573, -316, 5913, -4738, -9900, 2552, 7663, -3161, -4324, -394, -1552, -113, -523, -1879, 1986, 5181, -4126, -9644, 2817, 6131, -3416]
504c416o53J0317l658q631L252L684J133L207l979o782O027N223r970p74J3115
519H095j342j2268M19P311k020j240L154j263J181j48q200j811J2130K995j1888
534d895n09J1240n709r024P374P440k024k462j307l008L006L587o427J74J0804
549H260m123j4473N070R375m581l220O147j9m901n22j338J417Q168J364j2234
564e610J082R745m337r917R168R341q161n461J643k25J899L561l451O25Q203o301
580A804j1712P779J1575p213n218O935J912j1232P23L941J728K133j817p557J199
595e020Q219m793m120Q700M567r475m518N675L116j952K874l69k080J888m180
610a468n215P913Q260p995p625Q336J530j0063J905R430j696l829k853o72J318
$$ y = [-3416, -4069, 6248, 2590, -6041, -2789, 895, 2028, 5235, 1256, -5526, 501, 5724, -4246, -5020, 8095, 6753, -5515, -5096, 2215, 195, -1045, 2109, 846, 2027, 1879, -6321, -8132, 3998, 6993, -4895, -5404, 5836, 127, -8897, -1523, 5917, 3893, 1431, 124, -2884, 122, 3709, -2718, -2544, 8260, 4137, -10336, -5266, 4109, -472, -3692, 2455, 2436, -2465, -2987, -4325, -2908, 5260, 6624, -5610, -4528, 5217, 880, -9037, 131, 9472, 1311, -4150, -2507, -2732, -833, 2728, -723, -98, 8105, 1804, -9908, -2129, 9446, 2233, -2985, 3950, 5862, -5370, -4647, -706, 1022, 3155, 1338, -6219, -5020, 3199, -1594, -5714, 2986, 7553, -1922, -6440, -765, 2351, 399, 3273, 2904, 824, 2712, -1468, -6683, 1230, 9490, 1495, -6130, 2206, 3736, -6327, -4422, 5008, 3312, -517, -3370, -4042, -2724]
625b724N805l835m787R112K143j1299j981J1741L73n980K056K459l322j544J453
640c30p05L932L352p977l031P229J02o473J680Q820k876o675J18J057J494K757
656B474k407l856N970j87r263J293J0578K54r288J317O449k700m070J588N934
671D086L89k468m834P12N932j552o395L088Q562n206q547N715L298l179k15m06
687a020p04J273j975l332L202O559k492p411L061O354m976k248M311J198Lk151
703c48k70P78M223k295m846K401N206n583n598O357M570m699m504K970K449r75
719a64k047o89L578J607l917m590O880K535n315k165O526J103m669j938L006K797
735B538q29l536Q68L844L88m032j427M960M6n287l99L032K207l092k216K398K320
$$ y = [-2724, 3081, -754, -5541, 3571, 5714, -5585, -7566, 4175, 4548, -1432, 624, 3083, -239, -1783, -330, -1035, 2897, 6249, -1728, -4759, 2470, 2572, -3901, -2221, 6599, 3723, -2952, -2834, -1777, -283, 2474, 67, -3789, 2181, 1994, -7269, -5976, 4602, 4856, -4432, -3115, 3334, 634, -3436, -1848, 4086, 4475, 2007, -2827, -2115, 3817, 2265, -4130, -1042, 7520, 2314, -6233, -518, 2780, -399, -614, -1020, -1724, -451, -2426, -5758, -2556, 4003, 1511, -5900, -2839, 3515, -1461, -3709, 602, 1800, 1803, -348, -618, 160, 4383, 2088, -2758, -357, 4849, -734, -6332, 25, 4595, -104, -4608, -1638, 811, -164, -2211, -2900, 678, 2285, -1632, -6222, 658, 3193, -2122, -4287, 2239, 3342, -1327, -3265, -259, 2538, 1709, -1827, -959, 2885, 3273, -759, -2186, 2774, 2820, -2467, -2866, 166, 2373, -719, -2935, -537, 1783]
752A783r07l510j652N190K084o067K53N443Q86n079q44L928K482l962k364J939
768c97M817k593n593K625M013k80n985J157L805P03m275j254M528m67j143k283
784b622K099K859k282l329O14N589l162l753J716L910M37m493K58M859K86l606
800f20j108L198K237l763j836R45M637k737m032J829L483L23n080n9N262j749
816I30l180r99M077K65k946j798L470L890l649l528L576Q34l81k900M75L427N78
833B141l063j039M164K136m300j892L156L083l882k952J951L271j272m634J653
848a479K456j47k906p92M274J030n403q08M852K674n370r43L373K110k523j857
864a459J606L437k054j958j315L568J284l961j144M432M53k923j859J976J763
$$ y = [1783, 876, -2634, -4286, 904, 2988, -3079, -2826, 2617, 3503, -1576, -2420, 1508, 3990, 28, -2336, -397, 4420, 1827, -3766, -1141, 2872, 2592, -3393, -2236, 1569, 2272, -2003, -3257, 1271, 804, -339, -2622, -523, 2336, 54, -3275, -2661, 2928, -234, -3987, -2271, 1639, 2076, -2417, -2159, 2700, 2986, -620, -1728, 1470, 3707, -56, -1892, -947, 3690, 953, -3079, -1250, 2233, 2556, -2524, -2583, 2679, 930, -2250, -3249, 828, 1093, -1853, -3651, -181, 3709, 60, -3468, 108, 942, 561, -2339, -1864, 1563, 2141, -922, -1961, 2203, 4339, 39, -1853, 1303, 4386, 504, -2448, -497, 2774, 1502, -3132, -1479, 977, 830, -2076, -2868, 1406, 2436, -2967, -3775, 1077, 3751, -1619, -2562, 811, 2921, 398, -1459, 147, 3584, 1530, -428, -1743, 1825, 3109, -852, -1996, 2436, 2889, -34, -1893, 83, 1846]
879A846j796l815J753K837L93k875j288M034j23k195k334M915J132j964k069L699
895B150Q47r47l864J980M663k781m273K364K811q74m518l7N526O48o213J659J122
912B63J525k326j801K929J033k978k516K678M091j730l653J121K686O6k440q23
928a875K711L424k631m028J895K269j5l935J849M199l826k542J208K611J31k095
944f50j576J557L278n219l287N791N852o629j449K700L026m226j972L079K649
959B924j214l453J59K410L264l782k982N455N79n063q89M847m40k699P15l97N94
976B8L33J83l485M387K020m734l354M098K098m266J650M897k009l583O55J016
992f6K361K311m677k033M616L49o514O09P848j971m337R10J321j746o00L98Q76
$$ y = [1846, 50, -3765, -2012, 825, 1218, -1657, -2945, 1089, 966, -1229, -3563, 1352, 2484, 520, -1549, 2150, 2997, 2050, -1814, 166, 4829, 2048, -2225, 139, 2950, 2076, -2442, -2479, 3047, 3695, -2518, -859, 263, 1788, -538, -2339, 590, 1623, -1355, -3871, -1193, 2898, 1168, -2485, -1364, 1322, 1388, -1052, -1875, 836, 4260, 1629, -2399, -504, 1765, 1750, -2185, -336, 3863, 37, -2505, -1297, 1314, 1445, -650, -2226, -669, 2609, -2610, -5897, -106, 5746, -883, -2332, 368, 3394, -832, -2804, 275, 2924, 1710, -1743, -1584, 826, 4090, 308, -2674, 2781, 3360, -1703, -2592, 2255, 1815, -884, -169, -566, 28, 361, 544, -2941, 1446, 3466, -1268, -4622, -524, 1574, -2692, -1042, 3855, 1846, -1737, -1082, -66, 2295, 4606, -71, -2104, 2512, 2861, -3653, -3044, 4804, 2833, -1504, -594, 727, -1019, -1619, -1221, -345]
1009c45Q80J167m603j744O697m79m640J518O198l387n025J945K109J023N76j661
1025B29k804M140J60n526J283O168m17p173L172K868j948j036K187K66K62k130
1041b99l476L83P908j878m893K932K469n688l101O335J954l435L91M91j895J904
1057A02J097k901K244N325m402n500M158K435k780n46J167J152l622J714k463
1072b820J972M077l02o928L172L435o845n33P833Q94m961j224K185k08n97J866
1088A016j787K971J262n779k227O819J778n183n98N428k452n021K458K353N86
1103A624K23j655k653K417J221l178q00O081m68o078j8M590j615j195J521m19
1119d02J583l98j921k422O350J696o673L63N337k638m297K360M036j120l826K270
$$ y = [-345, 535, 1702, -2901, -4645, 2052, 1573, -3067, -1549, 4649, 1262, -3763, -1818, 291, 1314, 1890, 229, -2575, 1565, 1725, -3801, -2518, 3650, 3233, -3940, -768, 2100, 152, -884, 1303, 1569, 1831, -299, -3775, -3392, 4516, 2638, -2255, 677, 3146, -2542, -5643, 692, 2646, -789, -398, 93, -1802, 102, 1199, -1702, 542, 5867, 1465, -4035, 123, 2558, -222, -768, 399, 1551, -2071, -357, -2820, -848, 3229, 2927, -4001, -829, 2606, -4239, -4772, 3061, 3955, -1006, -2230, -45, -253, -850, 1016, -771, 2200, 3462, -2317, -4544, 2275, 4053, -1130, -1728, 3700, 1248, -3773, -1315, 1038, 1624, 1847, 192, -2461, -44, 1177, -2001, -2801, 3280, 2812, -3266, -3284, 1306, -309, -1504, 17, -402, 1181, 783, -1138, -3560, 2790, 4486, -2187, -1824, 3513, 875, -3422, -1062, 2974, 1854, -1972, 298]
1135B98k458J575K320l249N1N102k308p439L708N160l141j491K676L38k946Q75
1151i29q36M65M276j73m367k41M072j626m069L814L586l501j940O42K32R50O94
1168A049l140J560K174m2n348J661N513l727k743L004K310l276j606L318J559
1183B266l69j540l714K362K084j363j940M519J825n002j431L457m56j743L86R21
1199B62n00J630k415k854M361K931m571j288K665J942m718l26L905R36k642r22
1215a604l69K450O56j213p06K540M20m678L73M025N09l846R42M50K016j398k983
1232b416J382M132j477m188J471K303l13k192o67M024j031j788q82J553P93q18
1248a14j075P94J466j222j366J010L045j936j320J53K583l98k302l11J264K853
$$ y = [298, -2160, -585, 1735, -1514, -1463, 3639, 1331, -6108, -2400, 2760, -381, -1872, 804, 1142, -1804, -929, -1765, -1300, 2976, 2803, -1564, -1805, 2267, 641, -3428, 386, 3972, 471, -1469, -827, -595, 355, 1049, -2091, -531, 1643, 1601, -3747, -2086, 3427, -300, -3043, -39, 2271, -1005, -2611, 707, 2266, 1897, 357, -3357, -995, 1089, -274, -2214, 2305, 4130, -872, -2303, 1154, 698, -1045, -659, 262, -238, 1392, -1023, -3877, 484, 3415, -1156, -2444, 221, 2163, -2555, -2881, 1024, 1960, -682, -1604, -1973, 477, 1133, -80, -786, 1754, 2174, -2504, -2131, 1894, 2403, -1443, -501, -51, 1965, 567, -2416, -1034, 3098, 1621, -2567, -1096, 1207, 894, -1298, -1965, 2059, 1028, -760, -1642, -89, 704, -114, -1189, -395, 1071, -151, -1517, -507, 2538, 602, -718, -565, 2018, 1620, -682, -993, 271, 3124]
1264C124m748k01L40L375j254l734J442M036j497l643K12M022k98l407N12J875
1280A56J750l062n84K413J927k268k877J935L439k111j328j71K699j153j745j65
1296a145J818K342m272p09K393J400k056k674K563J499j462k182J421J523n00
1311d1r88j7K201K42k339j24L036L35j770j911J882K728k547j782J033J780k148
1328d30j577O34K261n5l071M73J782J645k519j410J922Q42m41j669J955J686j402
1345F26k069M74K331k14k035K20J888m41j891K19L96L198k468k262K554M09j4
1362I21l136Q45K925j113k751j66L373k17j721p75J618J568k608L82M27K455k725
1379f98o35J230K917j373k291o7K492q83j016J08Q71p25j65j310K227Q57j812
$$ y = [3124, -1624, -1825, -1485, 1890, 636, -3098, -1656, 2380, 883, -2760, -2548, 1474, 1176, -2231, -1719, 156, 1906, -1156, -1740, 673, 2600, 332, -2545, -610, 2829, 718, -610, -781, 1918, 765, -980, -1145, 673, 3015, -1257, -1966, 427, 1827, -229, -2903, -340, 1159, -303, -2485, -1064, 459, -41, -1029, -1046, 1155, 1397, -942, -1066, 1970, 2305, 535, -1376, 506, 3234, 687, -1095, -62, 1718, -430, -2007, -1373, 888, 833, -2238, -1765, 17, 1662, -857, -2267, -345, 497, 56, -1613, 342, 2028, 626, -1443, -969, 1362, 1148, -887, -667, 1221, 780, -1111, -892, -496, 2702, 234, -2028, 526, 935, 921, -2215, -1370, 1555, 442, -2309, -2475, 898, 681, -1040, -1815, -197, 1371, -1237, -855, -428, 2027, -698, -1333, -103, 2814, 1441, -850, -917, 1575, 692, -324, -216, 655, -70, -235, -1545, 682, 1539, -273]
1396b73j437J091K390j899k433P43K805j854q59L55K273l12j372p44K015K168
1412B657l191j377L122R46k689j207J740K390k564r20J041K21M60n47k141K875
1428H16O64k563j786L074J556k502j639K634N60j288j204N91J324J204j757j942
1444b258L499M83k796n99L376K35k370j173J604M41L33qj274O97N90j374k663
1461c257M604K62l376o1L010Lk031Q7J597j49j014l18j212K406J009k049j61K596
1479A946j328k473J282J742q79m87J191j471M48l72j128l52M442r65m120O19L538
1496A633k035k630K455K691j780j088n93L42K307r75k085J097K532k107k489K548
1512a77L712l532j025J505k56j554Q72j09O28J983m25m471J251L059k085j546
$$ y = [-273, -1710, -619, 1771, -128, -2561, -1818, 987, -867, -1726, -1371, 902, 590, -782, -1526, 489, 2657, -534, -1911, 1211, 2157, -532, -1739, 1, 2391, -173, -1093, -52, 169, 629, 82, -2059, 816, 1480, -1083, -2869, 205, 1761, -741, -2380, 254, 814, -474, -1678, -1087, 237, 1441, -316, -2258, 1241, 1724, -1072, -1671, 1705, 1940, -430, -1603, 1, 442, 775, 767, -507, 190, 780, -594, -3257, 1347, 1609, -1767, -1828, 1182, 1185, -846, -759, 838, 689, -325, -643, -1855, 551, 1560, -489, -650, 1946, 618, -1855, -573, 1169, 290, -197, 994, -477, -29, -401, -1529, -1881, 2561, 1596, -2524, -1905, 1633, -402, -3032, -577, 2114, 334, -754, -1347, -1005, 1302, 327, -1758, -661, 1871, -236, -2725, -177, 3535, 3, -1022, 483, 227, -1327, -455, -564, 64, 2047, 1622, -2849, -1598, 1461, -624, -2170]
1528b170K855J131m081j351L148L92K62Q82j666n84L045j233k997L271K818l550
1544A72k673L273N17k438J521Q71l26j24j732j613J882L037k222k209K842J597
1560B375n498o67M300N51j002o5O82k330J404m70o33K699J749l866j130L286j21
1577A264l711K134L030k339j042n30j03J872Q95r59k684L035P60n099P93M833
1593B149Q5l480K6R83n67j11J570m23J398j83l224o99M690m19l356J690K850l091
1611a12k192K050J398r97J746k414o15K002L2k763J414L227j623l430J170K762
1627A655k283k47J643L3m49l45k406R68L437o69k695J396L354m208j989L025J352
1644A572j144j304P35m96K60P83j647J971K245l149k750K279K316l141r6K568
$$ y = [-2170, 685, 1816, -2265, -3616, -468, -76, 186, 1068, -598, -1182, 1863, 630, -2367, 904, 3722, 172, -2501, 772, 1289, -1149, 372, 1243, 917, 793, -939, -2552, -670, 2367, 145, -2064, 778, 2375, -3123, -3790, 510, 1061, 59, -6, 676, -1654, -250, -720, -1353, 1346, 3095, -771, -1901, 1385, 1264, -2447, -313, 2717, 378, -664, -1194, -1297, 575, 1470, 511, -2173, 862, 1622, -3477, -2684, 2149, 2234, -1246, -1220, -237, -804, -915, 655, 232, 1630, 1447, -1777, -2476, 2214, 1795, -1561, 129, 2979, -112, -2304, -254, 1144, 147, 1893, -521, -1136, 866, 898, -1865, -451, 2776, 1153, -2277, -1107, 1655, -628, -875, 768, 801, 352, 7, -2399, -1431, 2006, 1337, -1358, 38, 3392, -816, -2805, 220, 1572, 428, -876, -141, -637, -377, 406, -1241, 730, 2975, -174, -2924, -645, 1671, -1470, -1566, 1002]
1660A002j26j809m19J58M66J804n0k715P20K649k484j569L473J365k998K4O72
1677A63m01K19J24n54R65J177j677k943L083J868k803o47L342q42k900Q87J697
1694G58o05K75j286m1J209O68j913k69L133m86l242M81J486L86j460J291k4J038
1712A399j133l66q94K193N50l293N32J072R89k936J308J913j316n39p83J076J033
1729H05k99j992J444K264o14k520k98K838q97j629J071R73m06j150q0J032l63
1746A79n28l94K44J463j763j627K590Q96k034r78K107o91Q53L62j274o7J417n18
1764B37j074O18J811j163j729R60J756n67j564Q86O62J057k494p03J415K024k167
1781c5n97J156Q76j261j234O54J123q62j604R60J791n97k267R38J672O15k608
$$ y = [1002, 876, -933, -1352, -1194, -728, 1076, 1026, -1689, -969, 1680, -804, -2373, 1100, 2465, -533, -509, 163, -238, -19, 105, -449, 516, 1693, 16, -2927, 156, 2024, -779, -1426, 1916, 1074, -1826, -939, 758, 153, 428, -858, -899, 310, 978, -935, -1204, 1929, 1443, -1799, -1318, 168, 554, -906, 385, 361, 1399, 266, -100, -994, 1199, 1749, -1544, -1012, 60, 1049, -1887, -579, 1334, 18, -521, -1304, -228, 805, 506, -1486, -42, 2222, 1608, -912, -1210, 1628, 731, -898, 173, 1146, 740, -410, -490, 542, 179, -349, -743, -499, 964, -799, -2426, 164, 1060, -974, -1952, 155, -536, 317, 679, -595, -662, 755, 237, -837, -219, 1592, 429, -1300, -340, 1416, 849, -715, 171, 833, 1890, -604, -1307, 108, 2132, -35, -632, 524, 1400, 139, -1095, -441, 682, -180, -1784, -824, 967, 370, -1897, -959, 713, 1328, -1280]
1798a280M88R53J123j894m25J773o3q24m89O89J314j453j133Q43J051K86j793
1815h34M8O92K95j647O19J070M10j265j290J873J577p62k147O55J316J99j725
1832i16r8J938O69k880M95K277o31j671K51J305m11o48m32k20J923q8j780O24
1850b93Q74J35j115q18J753M66q19j690J806N87j050m80M59q7N82j184J276J140
1868A542p6j387oR83J69j393r02J903Q18l042K73J470L80q51j679J559J744r38
1886E67j413J344l41O75j314r50J377J160p52j393J044O81l29k369K000J084j78
1903H93j510l33J354L56p02j305K694j602j006j35J859J49k537P72Q67J016o13
1920B17j065k60J344l02j028q1J588N30j416j039K669l43j572jJ961o54O11k008
$$ y = [-1280, -792, 161, 1284, -610, -1035, 738, 675, -149, -638, 51, 1365, -88, -1221, -378, 673, 959, -834, -786, -94, 201, -1446, -827, 243, 653, -612, -1902, -29, 1548, 786, -1361, -706, 610, 809, -916, -1014, 924, 1593, -1287, -792, 1485, 854, -817, -566, 739, 328, -320, -752, -972, 951, 863, -917, -293, 581, 716, -399, -1217, 536, 1002, 183, -1507, 299, 886, -164, -644, -185, -272, 310, -874, 402, 1542, 1466, 79, 73, 1056, 1225, -168, -1070, 833, 1651, -1391, -1118, 352, 732, -119, -1798, -239, 1505, 567, -846, 498, 157, 832, -482, -1432, -55, 1105, 353, -1040, 4, 685, 356, -2013, -13, 1071, 893, -617, -950, 404, 760, 58, -1247, 1447, -155, -1161, -1296, 563, 712, -1825, -1053, -186, 830, 217, -848, -1108, 236, -66, -1094, -1175, 413, 943, -473, -1512, 1157, 814, -758, -759, 1202, 548, 1159, -849]
1938h49Q60P04N75j405j723K570O31k410K48J062k60l42j476K341l99m74j19o63
1956a129L146j831k117R10J342P63k306L28J592o67j220O10J357Q0m68j174p87
1973a571K814k69k025N01J905j418k339J129J368J019j190L21j039R41n31k22
1989f06O28K129j881k915K231P92K6j241J867r36J61O40j269L61J532o55l141
2006b277J784J364j286j528K661J512l931J096M77p32J188j093L28Q34R82j882
2022e03j924K635K647l484L86K90L24j373L34J013m3J659j013j878o48K929j388
2039c7j277J611J209k953O10m32J779r42J140q70N85k24j419j570L999J125l211
2056h77Q2J892q06j66L55R25J30r03Qk250J454J532k663K92K151o0k964J331R73
$$ y = [-849, 11, 715, 1290, -115, -1838, 732, 1363, -1047, -799, 263, 3, -339, -1815, 526, 127, -347, -466, -1129, 2017, 186, -1931, -1021, 321, 1084, -1222, -894, 698, 31, -1189, -579, 778, 858, 390, -784, -1571, 1243, 974, -1051, -550, 1355, -63, -2402, -1273, 95, 1114, -76, 245, -794, 147, -384, -606, 22, 2151, 270, -2645, -414, 378, 404, -837, 1030, 94, 255, 895, -374, -13, 1519, 864, -2277, -493, 871, -415, -1943, 718, 2230, -1701, -605, -128, -860, 328, -765, -437, 397, 1379, -503, -2427, 208, 2855, -629, -243, 47, 371, -1002, -668, 345, 302, 1961, 948, -930, -1578, 1351, -37, -1314, 297, 1506, -1447, -837, -1269, 510, -432, 708, -162, 423, 199, -1220, -2790, 1209, 2334, -877, -795, 1097, 291, 125, 480, 1405, 1535, 632, 640, -1610, -156, 1376, -1287, -995, 1156, 1096, -1868, -537, 436]
2075D36m81n09L22Q72r33l8o54J32J857J197k922o51K641r73j994J816J753j957
2093h6o74l40J88J031J407o16j437K432j691j754P55L135k089j719J269M47j456
2110a198l99J515l69J851p50j563K09J377o40k266J894R25j529k21J264P66o20
2127B46Q93l13j646J168M83k281J844K540k717j436R86Q54j398N5J146k28j17
2144G9j068q78K029O58r70o32J659Q12k483q39K611O1j125L74O01r33J90n12o12
2163i78J369J195j436j997J646J046j564OK129r76j543K16P2M39J130n76j105
2180i27J128J364l301P26K077L78j842K89P97o33m20M05K3P96J90j769l46J778
2198G13K33k205J153J708r71j977J494M08k80m94k04K90M74j69j451J210J261
$$ y = [436, -45, -554, -232, 640, -293, -331, -985, -853, 1004, 2201, -721, -1372, 1269, 296, -1698, 118, 1871, -86, -760, -1100, -912, 119, 1526, 910, -527, 1905, 214, -1540, -785, 2350, 261, -1458, -189, 258, -1198, -1597, -82, -451, 1400, 650, -913, -704, 673, 33, -2233, -339, 586, -943, -1164, 100, 866, 246, 1139, 826, -820, 348, 831, -1450, 394, 2934, 217, -1219, -233, 621, -777, -722, 424, 196, 79, -989, -1867, 162, 820, -150, -782, 877, 1689, -794, -1633, 978, 1039, -86, 288, 889, -44, 146, -366, -978, 391, 1586, 150, -1847, -201, 845, -719, -713, 1416, 440, -1103, -887, -815, -376, 754, 178, -927, 201, 1565, -1736, -1010, 1067, 1445, -397, -108, 689, 56, -364, 41, 64, 860, 1050, -719, -1065, 713, 946, -1259, -106, 1602, 631, -1346, 148, 556, 276, -218, -422, -132, 342, 173, -1278, -68, 1193]
2215A193j039j070R94N53o43m97Q01J334j439r2o82J56J510l29j514M9K114j430
2233c1j089R26J251p07r19L30k27J164j302Q0J078m33l86n50J136J126k018j76
2251g47P38J047q02r16J419j45N39j744L57J064L06j419n22J302N03j356Km9K3
2270d00L21k42J3P79N94j577K41N2N77j054k99J223R75j196j487J814N41n68p26
2289d19Q59J86l80j420K62J493l8j394O66J117o89q82J35L79J040j082j59J68
2307a58J80P01j004n15J645o54k24k80K44K14l81r0P4J699n77j422K17J126n45
2326B50o16P12P29q1k291Q36P81K3l75l01K46L86j40p19Q66P28j429k96M80J212
2346A001m85l65r47K356q04m94j026J571L90j517p5J595l06l21j053K46J421j400
$$ y = [1193, 154, -916, 78, 631, -12, -509, 292, 1626, 187, 95, -587, -431, 1079, 750, -764, -715, 1399, -31, -1120, -194, 1057, 350, -569, -239, -466, 698, -604, -524, 554, 121, -265, -815, 321, 1447, -571, -747, -9, 1038, 236, -680, 739, 594, 1133, -611, -254, 810, 1116, -303, -825, 477, 980, -376, -374, -423, -400, -79, -321, -308, 471, 1065, -512, -271, -219, 358, -696, -995, 228, 1203, 7, -1480, 334, 875, 307, -419, 440, 626, 246, -1174, -912, 581, 543, -851, -185, 932, 243, -639, -504, -125, 915, -167, -326, -158, 22, 723, -281, -796, 849, 195, -29, -309, -65, 149, -232, -322, -248, 1451, 874, -548, -331, 795, 250, -366, 346, 1075, 994, -1297, -461, 320, 343, -32, -333, -87, 299, 159, -560, 306, 1034, -395, -691, -211, 1001, 516, 151, -796, 1560, 756, 262, -764, 807, 1197, -320, -395, 1200, 894, 573, -480, -234, 1187, -213]
2364b13J62J81j3m42L98j022Q33O21q48K38n69J155q85r32J288R90j002k18N86
2383C08k05n4n90L11M54N93j119k64J387m37n66M8J000k92o22J17n6m4k04k43
2403d78L15M00M74j858J612j59L10j129m98J155O69p38o61P55O1O67o07j207J049
2422A32J212j480m05k45P95J43n31J583n36r45q40M42J199m64q95P4J455l39j349
$$ y = [-213, -51, 130, 117, -325, 73, -949, -116, 505, -343, -105, -674, 481, -404, -1336, -48, 942, -60, -278, 308, 103, 49, -541, -230, 224, 817, -302, -566, 821, 384, -182, -134, 866, 574, -48, 69, 13, -31, -235, -478, -163, 237, 711, -1147, 465, 306, 616, -513, -1011, 144, 813, 75, -586, 169, 230, 897, 290, -917, 132, 1344, -136, -541, -786, 9, 152, -379, 1204, 668, -277, -1117, -675, 524, 60, -835, -761, 694, 355, -994]
$$ [...]
8191B47
##END NTUPLES=NMR FID
##END=
