##TITLE=1H_DE-47EA_D2O
 D2O
 8 sc, 
 12.7.2024
##JCAMPDX= 6.0         $$ Bruker NMR JCAMP-DX V2.0
##DATA TYPE= NMR FID
##DATA CLASS= NTUPLES
##ORIGIN= UXNMR, Bruker Analytische Messtechnik GmbH
##OWNER= root
$$ XWIN-NMR		Version 3.5
$$ Fri Jul 12 13:49:01 2024 Russian Standard Time (UT+4h)  she@DPX200
##.OBSERVE FREQUENCY= 200.1314
##.OBSERVE NUCLEUS= ^1H
##.DELAY= (6, 6)
##.ACQUISITION MODE= SIMULTANEOUS
##.ACQUISITION SCHEME= undefined
##.AVERAGES= 8
##.DIGITISER RES= 18
##SPECTROMETER/DATA SYSTEM= spect
##.PULSE SEQUENCE= zg30
##.SOLVENT NAME= CDCl3
##.SHIFT REFERENCE= (INTERNAL, CDCl3, 0, 15.7039)
##AUDIT TRAIL= $$ (NUMBER, WHEN, WHO, WHERE, WHAT)
$$ ##TITLE= Audit trail, XWIN-NMR		Version 3.5
$$ ##JCAMPDX= 5.01
$$ ##ORIGIN= Bruker BioSpin GmbH
$$ ##OWNER= she
$$ F:/spectra/data/she/nmr/H-F/1/audita.txt
$$ ##AUDIT TRAIL=  $$ (NUMBER, WHEN, WHO, WHERE, WHAT)
(   1,<2024-07-12 13:47:50.68 +0400>,<she>,<DPX200>,
      <created by zg, POWCHK disabled, PULCHK disabled
       configuration hash MD5:
       00 E9 B6 7A A2 85 ED C7 34 08 36 98 17 FE 4E 26
       data hash MD5: 16K
       91 E3 3A E2 9D 6D 78 5F A6 89 8C 46 7D A1 21 80>)
$$ ##END=
$$ 
$$ hash MD5
$$ DD 30 D3 0C F0 BC 72 C9 0B 96 9F 36 D2 3B C4 43
##$RELAX= 
##$RELAX= 
##$RELAX= 
##$RELAX= 
##$RELAX= 
##$RELAX= 
$$ Bruker specific parameters
$$ --------------------------
##$DU= <F:/spectra>
##$EXPNO= 1
##$NAME= <H-F>
##$PROCNO= 1
##$TYPE= <nmr>
##$USER= <she>
##$AMP= (0..31)
100 100 100 100 100 100 100 100 100 100 100 100 100 100 100 100 100 100 
100 100 100 100 100 100 100 100 100 100 100 100 100 100 
##$AQSEQ= 0
##$AQ_mod= 1
##$AUNM= <au_zg>
##$AUTOPOS= <>
##$BF1= 200.13
##$BF2= 200.13
##$BF3= 200.13
##$BF4= 200.13
##$BF5= 200.13
##$BF6= 200.13
##$BF7= 200.13
##$BF8= 200.13
##$BYTORDA= 1
##$CFDGTYP= 0
##$CFRGTYP= 5
##$CHEMSTR= <none>
##$CNST= (0..31)
1 1 145 1 1 1 1 1 1 1 1 1 1 1 1 1 1 1 1 1 1 1 1 1 1 1 1 1 1 1 1 1 
##$CPDPRG= <>
##$CPDPRG1= <>
##$CPDPRG2= <>
##$CPDPRG3= <>
##$CPDPRG4= <mlev>
##$CPDPRG5= <mlev>
##$CPDPRG6= <mlev>
##$CPDPRG7= <mlev>
##$CPDPRG8= <mlev>
##$CPDPRGB= <>
##$CPDPRGT= <>
##$D= (0..31)
0 1.2 0 0 0 0 0 0 0 0.06 0 0.03 0 0 0 0 0.0002 0 0 0 0 0 0 0 0 0 0 0 0 
0 0 0 
##$DATE= 1720777670
##$DBL= (0..7)
120 120 120 120 120 120 120 120 
##$DBP= (0..7)
150 150 150 150 150 150 150 150 
##$DBP07= 0
##$DBPNAM0= <>
##$DBPNAM1= <>
##$DBPNAM2= <>
##$DBPNAM3= <>
##$DBPNAM4= <>
##$DBPNAM5= <>
##$DBPNAM6= <>
##$DBPNAM7= <>
##$DBPOAL= (0..7)
0.5 0.5 0.5 0.5 0.5 0.5 0.5 0.5 
##$DBPOFFS= (0..7)
0 0 0 0 0 0 0 0 
##$DE= 6
##$DECBNUC= <off>
##$DECIM= 24
##$DECNUC= <off>
##$DECSTAT= 4
##$DIGMOD= 1
##$DIGTYP= 9
##$DL= (0..7)
0 120 120 120 120 120 120 120 
##$DP= (0..7)
150 150 150 150 150 150 150 150 
##$DP07= 0
##$DPNAME0= <>
##$DPNAME1= <>
##$DPNAME2= <>
##$DPNAME3= <>
##$DPNAME4= <>
##$DPNAME5= <>
##$DPNAME6= <>
##$DPNAME7= <>
##$DPOAL= (0..7)
0.5 0.5 0.5 0.5 0.5 0.5 0.5 0.5 
##$DPOFFS= (0..7)
0 0 0 0 0 0 0 0 
##$DQDMODE= 0
##$DR= 18
##$DS= 0
##$DSLIST= <SSSSSSSSSSSSSSS>
$$ [...]
##$SUBNAM2= <"">
##$SUBNAM3= <"">
##$SUBNAM4= <"">
##$SUBNAM5= <"">
##$SUBNAM6= <"">
##$SUBNAM7= <"">
##$SUBNAM8= <"">
##$SUBNAM9= <"">
##$SW= 24.0689651099613
##$SWIBOX= (0..15)
0 0 2 0 0 0 0 0 0 0 0 0 0 0 0 0 
##$SW_h= 4816.95568400771
##$TD= 16384
##$TD0= 1
##$TE= 0
##$TE2= 300
##$TE3= 300
##$TEG= 300
##$TL= (0..7)
0 120 120 120 120 120 120 120 
##$TP= (0..7)
150 150 150 150 150 150 150 150 
##$TP07= 0
##$TPNAME0= <>
##$TPNAME1= <>
##$TPNAME2= <>
##$TPNAME3= <>
##$TPNAME4= <>
##$TPNAME5= <>
##$TPNAME6= <>
##$TPNAME7= <>
##$TPOAL= (0..7)
0.5 0.5 0.5 0.5 0.5 0.5 0.5 0.5 
##$TPOFFS= (0..7)
0 0 0 0 0 0 0 0 
##$TUNHIN= 0
##$TUNHOUT= 0
##$TUNXOUT= 0
##$USERA1= <user>
##$USERA2= <user>
##$USERA3= <user>
##$USERA4= <user>
##$USERA5= <user>
##$V9= 5
##$VALIST= <valist>
##$VCLIST= <CCCCCCCCCCCCCCC>
##$VD= 0
##$VDLIST= <DDDDDDDDDDDDDDD>
##$VPLIST= <PPPPPPPPPPPPPPP>
##$VTLIST= <TTTTTTTTTTTTTTT>
##$WBST= 1024
##$WBSW= 4
##$XGAIN= (0..3)
0 0 0 0 
##$XL= 0
##$YL= 0
##$YMAX_a= 62346
##$YMIN_a= -55800
##$ZGOPTNS= <>
##$ZL1= 120
##$ZL2= 120
##$ZL3= 120
##$ZL4= 120
##$ABSF1= 10
##$ABSF2= 0
##$ABSG= 5
##$ABSL= 3
##$ALPHA= 0
##$AQORDER= 0
##$ASSFAC= 0
##$ASSFACI= 0
##$ASSFACX= 0
##$ASSWID= 0
##$AUNMP= <proc_1d>
##$AZFE= 0.1
##$AZFW= 0.1
##$BCFW= 1
##$BC_mod= 2
##$BYTORDP= 1
##$COROFFS= 0
##$CY= 11.3945322036743
##$DATMOD= 1
##$DC= 2
##$DFILT= <>
##$DTYPP= 0
##$F1P= 15.6554695791079
##$F2P= 12.8336369535428
##$FCOR= 0.5
##$FTSIZE= 0
##$FT_mod= 4
##$GAMMA= 1
##$GB= 0.15
##$INTBC= 1
##$INTSCL= 1
##$ISEN= 128
##$LB= 0.24
##$LEV0= 0
##$LPBIN= 0
##$MAXI= 10000
##$MC2= 0
##$MEAN= 0
##$ME_mod= 0
##$MI= 1.114404
##$NCOEF= 0
##$NC_proc= 0
##$NLEV= 6
##$NOISF1= 3.799351
##$NOISF2= 2.8
##$NSP= 1
##$NTH_PI= 0
##$NZP= 0
##$OFFSET= 15.70392
##$PC= 1
##$PHC0= -25687.01
##$PHC1= 67.78748
##$PH_mod= 1
##$PKNL= yes
##$PPARMOD= 0
##$PSCAL= 0
##$PSIGN= 0
##$REVERSE= no
##$SF= 200.130013532006
##$SI= 16384
##$SIGF1= 3
##$SIGF2= 2
##$SINO= 400
##$SIOLD= 16384
##$SREGLST= <1H.CDCl3>
##$SSB= 0
##$STSI= 0
##$STSR= 0
##$SW_p= 3612.71676300578
##$SYMM= 0
##$S_DEV= 0
##$TDeff= 0
##$TDoff= 0
##$TI= <>
##$TILT= no
##$TM1= 0
##$TM2= 0
##$TOPLEV= 0
##$USERP1= <user>
##$USERP2= <user>
##$USERP3= <user>
##$USERP4= <user>
##$USERP5= <user>
##$WDW= 1
##$XDIM= 8192
##$YMAX_p= 0
##$YMIN_p= 0
$$ End of Bruker specific parameters
$$ ---------------------------------
##NTUPLES= NMR FID
##VAR_NAME=  TIME,          FID/REAL,        FID/IMAG
##SYMBOL=    X,             R,               I
##VAR_TYPE=  INDEPENDENT,   DEPENDENT,       DEPENDENT
##VAR_FORM=  AFFN,          ASDF,            ASDF
##VAR_DIM=   8192,          8192,            8192
##UNITS=     SECONDS,       ARBITRARY UNITS, ARBITRARY UNITS
##FACTOR=    0.0002076,     1,               1
##FIRST=     0,             0,               0
##LAST=      1.7004516,     0,               0
##MIN=       0,             -55800,          0
##MAX=       1.7004516,     62346,           0
$$ Real data points
##PAGE= N=1
##DATA TABLE= (X++(R..R)), XYDATA
0 0 0 0 0 0 0 0 0 0 0 0 0 0 0 0 0 0 0 1 -2 5 -7 7 -7 8 -9 10 -14 15 -16 17 -21 24 -25 29 -33 36 -41 46 -50 56 -62
41 -62 69 -75 85 -92 103 -115 125 -139 156 -172 193 -219 248 -283 327 -379 441 -495 380 2647 61700
62 61700 51674 -11942 -41665 -43931 6208 62346 36730 -36828 -54579 -13551 36949 49146
74 49146 7245 -47862 -47356 10780 56299 33267 -25721 -51383 -22116 31234 53788 11805 -47431
87 -47431 -46056 8642 47097 33953 -14663 -51224 -28737 32928 53704 7178 -41538 -41261 -693
100 -693 44577 41559 -16232 -53079 -23168 27634 45135 15231 -34201 -45431 -1404 42584 36277
113 36277 -11933 -46758 -25637 22950 43667 18680 -30193 -48158 -3045 43499 33890 -8345
125 -8345 -38960 -32666 15908 49340 18176 -32361 -39910 -5335 33844 38320 -2762 -43518 -30899
138 -30899 18574 43037 18035 -24782 -40727 -11798 33722 39863 -2805 -39068 -28248 11456
150 11456 38907 23356 -21333 -42691 -11054 32284 35190 -377 -33766 -31324 7734 41690
162 41690 24836 -22725 -39047 -11367 24818 35921 6448 -35506 -33060 9923 36355 21684
174 21684 -14793 -37000 -16043 26008 36322 3919 -31796 -30593 4951 34376 24806 -13241
186 -13241 -36836 -17538 23387 35036 5815 -27709 -30395 750 33362 26148 -13620 -35340
198 -35340 -16091 19758 33333 10161 -26765 -32368 326 32598 25486 -10496 -32800 -18535
210 -18535 16466 33790 11442 -25729 -31103 464 29249 24646 -6609 -31844 -21219 15875
222 15875 34282 10202 -24279 -28405 -3625 25257 28477 -3959 -33533 -19785 15853 29151
234 29151 12424 -18111 -31672 -6351 28477 26841 -5609 -28545 -20255 10206 31312 15623
246 15623 -19161 -30925 -5443 24707 25205 -1230 -26969 -22997 9230 31269 14766 -17804 -28333
259 -28333 -7394 21136 27269 445 -28182 -22534 8851 28329 15897 -13719 -28826 -10269
271 -10269 21825 27641 687 -25255 -22177 5389 27878 18082 -13941 -29153 -10045 19709 27021
284 27021 3336 -24444 -23750 4543 27245 18345 -11691 -28367 -11564 17962 26287 4843 -22145
297 -22145 -24316 3142 27182 18389 -10407 -26621 -13480 16079 27219 6000 -22291 -23871 1437
310 1437 24720 19774 -7676 -27028 -14537 15461 26271 6745 -19836 -24007 -991 24386 21038
323 21038 -7544 -26759 -14206 13401 25499 9349 -18161 -25750 -1787 23885 20051 -5504
335 -5504 -24056 -16237 10648 26932 10263 -18618 -23912 -2096 20467 21454 -2259 -25386 -17809
348 -17809 11908 24922 10060 -15048 -23948 -6150 20541 22958 -3068 -24095 -16506 8599 23651
361 23651 13347 -14310 -25538 -5956 20398 21557 -1102 -21774 -18495 6342 24951 13729
373 13729 -14038 -24195 -6762 17570 21585 1408 -21447 -19593 5836 24191 13692 -11846
385 -11846 -23348 -8664 16029 22768 2648 -20979 -19827 4721 22996 14722 -9446 -23289 -10706
398 -10706 15220 23706 3457 -20053 -19006 2252 21232 16607 -8151 -24348 -10902 15085 21928
411 21928 4183 -17173 -20514 146 21856 17046 -8378 -22397 -11135 11769 21836 7266
423 7266 -17440 -21771 530 20628 16208 -5669 -21350 -13796 10837 23296 7212 -16638 -19982
436 -19982 -1314 18306 18012 -3989 -21977 -14126 10287 21661 7890 -14195 -20838 -3635 18664
449 18664 18751 -3553 -20626 -13776 7906 21198 10237 -13685 -20963 -3803 17266 18193 -1134
462 -1134 -19985 -15603 7370 21057 10389 -12069 -20158 -5262 16236 18712 -687 -19267 -15655
475 -15655 6164 20683 11672 -10588 -20804 -6322 15258 18536 670 -18423 -16014 4778 20211
488 20211 12076 -9547 -20027 -7649 14285 19021 1700 -17166 -16038 3058 19263 13455 -8730
501 -8730 -20428 -7797 13001 18370 3654 -16066 -17536 1960 19422 13026 -7637 -18853 -9278
514 -9278 11167 19683 4208 -16501 -16895 1754 17371 13960 -5056 -19680 -10759 11274 19212
527 19212 4659 -13873 -16905 -909 17090 15428 -5205 -19538 -10001 9730 17758 6636 -12993
540 -12993 -18611 -995 17376 14820 -3957 -17496 -11732 7749 19361 7752 -13338 -17663 -2061
553 -2061 15262 15216 -2318 -17957 -12868 7606 18451 7705 -11703 -17644 -3694 14621 16219
566 16219 -1307 -17107 -12774 6142 17793 9081 -10368 -17487 -4465 14081 16562 -548 -16608
579 -16608 -13517 5507 17482 9747 -9151 -18243 -5514 13570 16264 313 -15609 -13692 3742
592 3742 17457 10820 -8710 -17872 -5900 12097 16274 1812 -15362 -14669 3001 17167 11029
605 11029 -7382 -16797 -7191 11277 16964 2205 -14635 -14537 1694 15721 11875 -6521 -17285
618 -17285 -7753 10840 16264 3568 -13435 -14884 321 16191 12552 -6000 -16284 -8424 8752
631 8752 16727 5114 -13303 -15732 784 15032 12105 -4117 -16392 -10272 8812 17227 4912
644 4912 -12001 -14907 -1454 13911 14055 -3560 -17011 -9568 8081 15793 6562 -10666 -16069 -2127
658 -2127 14345 13694 -3011 -15253 -10588 6137 16062 7300 -10084 -15840 -2836 13077 13573 -1359
672 -1359 -14694 -11324 4961 16147 7655 -9713 -15530 -3727 11616 13950 144 -14462 -12452
685 -12452 4687 15460 8322 -8409 -15215 -4897 11209 15122 579 -14395 -12095 3843 14651
698 14651 9063 -7037 -15654 -5908 11359 15000 803 -13186 -11954 2212 14807 10131 -6518
711 -6518 -15758 -5481 10144 13678 2780 -12109 -13504 1685 14949 9716 -6038 -14045 -6972
724 -6972 8297 15468 3698 -12037 -13112 1055 13753 10544 -4325 -14992 -7819 8611 14918
737 14918 3478 -11089 -13150 -524 13112 11852 -3905 -14666 -8235 7454 14379 4817 -10348
750 -10348 -13739 -1044 12609 11292 -3188 -13634 -8896 6202 14433 5197 -10254 -13629 -1939
763 -1939 11675 11941 -1839 -13596 -9243 5946 13880 6035 -8884 -13372 -2662 11342 11954 -1252
777 -1252 -13040 -9556 5086 13657 6601 -8208 -13485 -3316 11255 12520 -658 -12618 -10142
790 -10142 3976 13470 7640 -7273 -13552 -3932 9927 12275 362 -11828 -10529 3239 13571
803 13571 7803 -7196 -13338 -4320 8974 12488 1756 -11830 -11171 3158 12885 7942 -5343 -12777
817 -12777 -5798 8828 12998 1210 -11267 -10441 1641 12170 9368 -5288 -14054 -5647 8351
830 8351 12137 2607 -9622 -11883 555 12800 9321 -4684 -12721 -5801 7123 12330 3538 -10066
844 -10066 -12180 647 12001 9273 -3436 -12048 -7217 6271 12997 3520 -9730 -11239 -908
857 -908 10538 10060 -2335 -12969 -7575 6606 12478 4356 -8704 -11743 -1515 10697 10364 -2168
871 -2168 -11998 -7892 5168 12099 5277 -7519 -12165 -2444 10893 10388 -2063 -11359 -7971 3971
885 3971 12092 6481 -7545 -12650 -2164 9899 10334 -6 -10995 -9274 3974 12381 5575 -7243
899 -7243 -11315 -3391 8649 11269 108 -11640 -9254 3473 11320 6915 -5445 -12180 -4591 8792
913 8792 11131 544 -10097 -9250 1754 11569 7813 -5773 -12222 -3819 8004 10553 2007 -9705
927 -9705 -10316 1866 11995 7591 -5076 -11205 -5431 7110 11575 2203 -9840 -9846 1582 10390 7751
942 7751 -3289 -11789 -6112 7069 11480 2255 -8644 -10273 289 10187 9104 -3075 -11952 -5825
956 -5825 6108 11267 3473 -7813 -10885 -661 10329 8821 -2965 -10975 -6596 5256 11230 4482
970 4482 -7709 -11256 -922 10285 8605 -1670 -10496 -7402 4529 11549 4682 -7620 -10143 -1032
984 -1032 8508 9239 -840 -10847 -8322 4638 10965 4501 -6218 -10254 -2949 8513 10644 -916
998 -916 -10848 -7254 3532 9892 5807 -5509 -11566 -2900 9245 9446 -731 -8898 -8280 1905 10845
1013 10845 6883 -5825 -10758 -2953 7162 9244 1706 -8900 -9294 2323 10490 5894 -5010 -9816
1027 -9816 -4144 6653 10707 1639 -9452 -8410 1878 9751 6838 -3548 -10591 -5065 6942 10008
1041 10008 1494 -8169 -8465 577 9540 7636 -3803 -10285 -4903 6388 9867 2585 -7627 -9181
1055 -9181 -181 9631 7585 -3150 -9579 -5037 5130 9522 3234 -7701 -9687 -166 8959 7501
1069 7501 -2245 -9309 -6090 4731 10438 3394 -7543 -8804 -992 7709 8212 -1096 -9854 -6509 4648
1084 4648 9659 3527 -5690 -9294 -1962 8388 8745 -1543 -9469 -6349 3267 9362 4992 -5915
1098 -5915 -9652 -1439 8058 7935 -412 -8513 -7150 3237 9866 4707 -5744 -9082 -2245 7026 8676
1113 8676 413 -8950 -7338 3079 9066 5209 -4381 -9380 -3435 7095 9307 230 -8343 -7114
1127 -7114 1944 8951 6035 -4005 -9681 -3367 6845 8485 726 -7722 -7677 1184 8955 6055 -4160
1142 -4160 -9324 -3698 5802 8803 1804 -7407 -8126 843 8994 6043 -3359 -8564 -4266 4903 9012
1157 9012 2488 -7480 -8083 999 7848 6504 -2389 -9022 -5124 5267 9236 2027 -6835 -7338 -460
1172 -460 7649 7460 -2153 -9030 -4679 5128 8779 3015 -5906 -8607 -1096 8187 7122 -1908 -8124
1187 -8124 -5021 3559 8720 4135 -6377 -8641 -652 7317 6753 -837 -8056 -6740 3158 9364 3766
1202 3766 -5607 -8137 -1879 6700 7784 -380 -8320 -6142 3057 8443 4390 -4401 -8449 -2561 6603
1217 6603 8066 -360 -7191 -6279 2033 8270 4579 -4485 -8506 -2762 6214 7684 437 -7392 -6892
1232 -6892 1536 8333 4951 -4019 -8250 -2996 5897 7635 1143 -6954 -6892 1273 8147 5275 -3382
1247 -3382 -8173 -3654 5004 8100 1521 -6922 -6554 969 7431 5533 -2817 -8400 -4052 5140 7937
1262 7937 1643 -6322 -7030 208 7467 6178 -2918 -8037 -3866 4046 7523 2392 -5879 -7532 205
1277 205 7610 6206 -1857 -7290 -4637 3830 7823 2716 -5746 -7149 -281 6275 6210 -1161 -7841 -5126
1293 -5126 4017 7837 2506 -5155 -6669 -1363 6322 6600 -1124 -7650 -4698 3059 7085 3905 -4479
1308 -4479 -7959 -1361 6284 6375 -810 -6724 -5336 2534 7658 3846 -4489 -7441 -1929 5433 6663
1323 6663 48 -6796 -5821 2072 7745 4013 -4114 -6873 -2385 5425 6930 545 -6617 -5491 2089
1338 2089 6952 4163 -3030 -7303 -2934 5031 6910 720 -6337 -5822 982 6610 4815 -2873 -7533
1353 -7533 -2881 4914 6935 1108 -5627 -6115 546 6905 4992 -2949 -6958 -3103 4023 6780 1812
1368 1812 -5475 -6816 692 6647 5004 -1907 -6619 -3935 3725 7542 1642 -5400 -6012 26 5894
1383 5894 5348 -1522 -7298 -4089 3513 7105 2169 -4703 -6280 -571 6412 5818 -1554 -6477 -4329
1398 -4329 3209 6809 3010 -4556 -6489 -542 5994 5930 -826 -6514 -4674 2515 6922 2593 -4188
1413 -4188 -6624 -1332 5513 6108 -438 -6558 -4515 2191 6768 2894 -4017 -6574 -1420 4879 6545
1428 6545 0 -6177 -4843 1735 6348 3853 -3469 -6396 -1921 4885 5947 89 -5841 -4949 1454
1443 1454 6203 3731 -3275 -6706 -2275 4559 6136 448 -5735 -5516 1299 6291 4190 -3213 -6305
1458 -6305 -2659 3836 6389 876 -5561 -5333 881 5697 4601 -2236 -6530 -3005 4382 6215 1062
1473 1062 -4914 -5594 155 5779 4971 -2441 -6359 -2846 3672 5931 1876 -4589 -5966 -68 5960
1488 5960 4606 -1788 -5737 -3749 3031 6333 2120 -4683 -5755 -385 5508 4685 -1169 -5736 -4017
1503 -4017 3018 6216 1978 -4188 -5822 -811 5295 4853 -786 -5738 -3925 2494 5992 2555 -3816
1518 -3816 -5589 -776 4963 5180 -478 -5971 -4023 2279 5746 2906 -3256 -5946 -1291 5082 5207
1533 5207 5 -5573 -4329 1801 5738 3022 -3125 -5606 -1655 4054 5349 598 -5399 -4972 1595
1548 1595 5986 3092 -2837 -5664 -1831 4026 5657 422 -4787 -4582 1050 5362 3436 -2225 -5735
1563 -5735 -2124 3966 5444 818 -4775 -4794 646 5385 3893 -2508 -5650 -2607 3168 5398 1417
1578 1417 -4101 -5112 767 5198 3617 -1810 -5502 -3023 2970 5442 1537 -4383 -5005 -98 4628
1593 4628 4124 -1647 -5653 -3092 3046 5110 1759 -3519 -5231 -513 4784 4089 -1311 -5185 -3395
1608 -3395 2442 5485 1785 -3620 -5330 -531 4362 4286 -892 -5177 -3387 2278 5427 2299 -3540
1623 -3540 -5154 -919 4174 4333 -616 -5127 -3829 2113 5261 2538 -2933 -5162 -1079 3830 4781
1638 4781 -110 -5044 -3552 1837 4997 2846 -2741 -5192 -1318 3990 4427 -177 -4596 -3716 1232
1653 1232 4703 3316 -2565 -5320 -1552 3792 4527 428 -4650 -4208 1137 5216 3312 -2564 -4894
1668 -4894 -1675 3345 4857 564 -4485 -4219 925 4903 3161 -1622 -5024 -2597 3048 4662 862
1683 862 -4161 -4184 269 4746 3101 -1705 -4740 -2457 2905 4884 1419 -3886 -4114 11 4571 3309
1699 3309 -1386 -4958 -2668 2274 4869 1176 -3605 -4356 -131 4484 3676 -1364 -4599 -2855 2035
1714 2035 4591 1644 -3573 -4624 -505 4366 3617 -911 -4463 -3145 2072 4803 2167 -3107 -4572
1729 -4572 -954 3772 3933 -613 -4357 -3250 1849 4873 2219 -2819 -4326 -985 3704 3847 -334
1744 -334 -4045 -3552 1329 4466 2320 -2784 -4113 -1073 3322 3920 -56 -4655 -3662 1205 4565 2084
1760 2084 -2383 -4541 -1753 3500 4253 202 -4325 -3304 1093 4631 3001 -2021 -4523 -1530 3473
1775 3473 3935 645 -3641 -3988 674 4479 2530 -2174 -4234 -1583 2825 4337 1021 -3629 -3812 476
1791 476 4279 2754 -1441 -4278 -1958 2721 4426 892 -3356 -3999 100 4059 3234 -1257 -4409 -2702
1807 -2702 2260 4058 1186 -3114 -3826 -124 4041 3452 -1107 -4235 -2307 2242 4577 1666 -3063
1822 -3063 -3812 -173 3971 3429 -746 -4161 -2563 2114 4365 1526 -2901 -4085 -292 3591 3501 -255
1838 -255 -3967 -2899 1772 4365 1476 -2599 -3929 -977 3384 3769 -373 -4070 -2866 1601 3898
1853 3898 2029 -2463 -4247 -1142 3257 3561 -45 -3641 -2924 1154 4244 2513 -2270 -4034 -1230
1868 -1230 2852 3701 670 -3682 -3531 1022 3924 2235 -1859 -3852 -1327 2794 3887 883 -3610
1883 -3610 -3084 1111 3511 2480 -1494 -3638 -1665 2844 3862 495 -2940 -3034 244 3589 2880 -1383
1899 -1383 -3920 -1735 2358 3806 977 -3085 -3264 126 3647 2842 -1275 -3889 -2057 1982 3812
1914 3812 1197 -3082 -4064 247 3525 2920 -856 -3697 -2230 1775 3966 1155 -2960 -3569 -253 3114
1930 3114 2787 -860 -3722 -2203 2031 3759 1446 -2307 -3618 -842 3176 3523 -715 -3603 -2365
1945 -2365 1549 3364 2085 -2363 -3877 -672 3243 3118 -194 -3562 -2581 1177 4183 2179 -2555
1960 -2555 -3539 -554 2831 3362 325 -3527 -2724 1276 3541 1848 -1958 -3418 -1350 2580 3614 299
1976 299 -3412 -2734 663 3302 2168 -1590 -3515 -1422 2688 3522 292 -2986 -2728 438 3499 2364
1992 2364 -1551 -3597 -1233 2196 3240 492 -3027 -3292 733 3202 2292 -1410 -3574 -1354 2002
2007 2002 3437 740 -2886 -3132 466 3313 2657 -954 -3473 -2021 2117 3614 645 -2488 -2849 35
2023 35 3078 2674 -877 -3437 -1601 1863 3578 1190 -2184 -3056 -366 3317 2526 -1150 -3183 -1964
2039 -1964 1167 3388 1564 -2622 -3346 -219 2717 2685 -383 -2899 -2344 1231 3127 1238 -2220 -3057
2055 -3057 -560 2389 2901 -510 -3727 -2489 1287 3095 1660 -1861 -3381 -1117 2721 3051 -105
2070 -105 -3104 -2394 1063 3264 1855 -1849 -3199 -624 2378 3035 8 -2929 -2605 784 3118 1820
2086 1820 -1862 -3313 -1101 2185 3032 524 -2836 -2465 1063 3113 2039 -1689 -3149 -1072 1974
2101 1974 3028 320 -2671 -2624 629 2892 1983 -1249 -3134 -1532 2049 3080 308 -2825 -2580 29
2117 29 2873 2595 -832 -3305 -1636 1606 2843 657 -2302 -3155 -92 2942 1925 -1283 -2997 -1816
2133 -1816 1572 2902 1068 -2488 -2896 139 2431 2255 -519 -2927 -1784 1491 3083 1112 -2048
2148 -2048 -2503 -144 2777 2429 -450 -3022 -1842 1431 2652 1496 -1947 -3043 -475 2583 2680 -636
2164 -636 -2562 -1935 982 2727 1142 -2126 -2863 -527 2653 2691 -31 -2568 -1831 1199 3057 1260
2180 1260 -1611 -2909 -546 2125 2695 118 -2800 -1954 745 2846 1260 -1475 -2888 -1099 2025
2195 2025 2679 8 -2485 -2063 936 2620 1565 -1263 -2871 -1302 2178 2477 266 -2196 -2170 403
2211 403 2871 1798 -1335 -2577 -746 1795 2721 380 -2254 -2512 478 2523 1595 -1342 -2820 -1578
2227 -1578 1722 2991 817 -2468 -2323 -2 2437 1959 -752 -2648 -1576 1682 2715 639 -2077
2242 -2077 -2368 181 2465 2127 -905 -2659 -1462 1200 2685 805 -1994 -2582 -145 2663 2043 -730
2258 -730 -2647 -1459 1122 2615 1197 -2079 -2316 -29 2419 2299 -292 -2365 -1753 915 2834 1107
2274 1107 -1596 -2715 -656 1792 2353 -296 -2606 -2078 906 2650 1049 -1458 -2476 -817 2185
2289 2185 2291 -585 -2484 -1841 831 2430 1553 -1218 -2570 -814 2001 2232 -32 -2317 -1900 700
2305 700 2443 1698 -1434 -2429 -897 1658 2690 421 -2482 -2183 897 2450 1286 -1301 -2447 -1003
2321 -1003 1750 2460 315 -2311 -2025 430 2496 1772 -1181 -2392 -1019 1894 2194 556 -1582 -2354
2337 -2354 147 2239 1938 -1213 -2535 -1481 1379 2389 903 -1785 -2401 102 2506 1760 -386 -2447
2353 -2447 -1227 1478 2632 521 -2068 -2321 -230 1985 2097 -638 -2256 -1573 1236 2654 573 -1579
2369 -1579 -2346 -243 2032 1770 -414 -2419 -1585 934 2327 817 -1511 -2490 -626 1975 1819 -494
2385 -494 -2252 -1727 865 1929 1137 -1312 -2430 -582 1794 1856 -339 -2349 -2129 533 2345 1093
2401 1093 -1177 -2120 -664 1853 2358 -23 -2067 -1645 702 2045 1123 -1046 -2033 -853 1991 2033 -67
2418 -67 -1913 -1754 359 2121 1754 -1005 -2246 -779 1429 2073 462 -1718 -1948 430 1980 1659 -1036
2435 -1036 -2065 -617 1298 2425 568 -1878 -1817 276 1972 1776 -629 -2264 -1252 1097 2410 439
2451 439 -1818 -1937 -27 2106 1461 -919 -1982 -1052 1137 2036 570 -1521 -1905 -69 1715 1588 -417
2468 -417 -1821 -1215 1018 2044 777 -1697 -1870 32 1779 1569 -515 -2095 -1293 1094 1989 744
2484 744 -1545 -2089 90 1834 1723 -176 -1989 -1520 1017 1972 998 -1491 -2061 -468 1437 2051 -297
2501 -297 -1941 -1194 790 1971 1107 -1181 -1733 -836 1687 1648 -61 -1723 -1466 519 2094 1029 -870
2518 -870 -1923 -624 1417 1550 20 -1741 -1378 646 1950 1249 -778 -1821 -545 1440 1903 47
2534 47 -1718 -1499 192 1817 1111 -1071 -2068 -945 1462 1662 34 -1612 -1441 85 1964 1314 -531
2551 -531 -1897 -931 883 1946 144 -1576 -1821 127 1713 1323 -640 -1943 -711 1140 1831 599
2567 599 -1700 -1558 212 1428 1474 -380 -2007 -855 1005 1931 258 -1299 -1787 -1 1610 1407 -365
2584 -365 -2034 -801 998 1871 703 -1366 -1683 -321 1669 1427 -218 -1817 -1351 565 1797 861
2600 861 -1086 -1827 -231 1703 1482 -124 -1744 -1048 700 1983 904 -1127 -1762 -587 1598 1351
2616 1351 -403 -1420 -1281 478 1433 968 -854 -1621 -426 1489 1730 -372 -1744 -1323 293 1607
2632 1607 945 -737 -1999 -272 1125 1537 4 -1436 -1046 448 2030 972 -1164 -1707 -872 1223
2648 1223 1620 257 -1394 -1421 322 1806 955 -379 -1392 -394 1210 1419 255 -1613 -1551 363 1539
2665 1539 1340 -671 -1668 -834 1316 1453 342 -1378 -1248 238 1603 1054 -511 -1960 -729 1214
2681 1214 1616 612 -1002 -1613 -199 1462 739 -261 -1819 -1002 1037 1495 612 -1220 -1299 -42 1400
2698 1400 1259 -277 -1421 -1056 847 1673 785 -1158 -1765 -4 1503 1205 -388 -1777 -816 762 1631
2715 1631 731 -1127 -1166 -120 1514 1256 -422 -1557 -838 693 1575 725 -1000 -1526 -473 1245 942
2732 942 -170 -1409 -1269 540 1414 683 -738 -1356 -245 1053 1502 -23 -1739 -1022 435 1445 1008
2749 1008 -858 -1192 -658 1228 1371 6 -1389 -944 566 1413 789 -926 -1265 -498 1148 1452 158
2766 158 -1514 -1324 430 1372 869 -501 -1146 -437 887 1811 387 -1084 -1136 196 1169 685 -427 -1597
2784 -1597 -590 931 1354 186 -1130 -1055 31 1009 1204 -345 -1111 -480 918 1367 383 -934 -1235
2801 -1235 70 1384 1272 -268 -1460 -643 865 1648 628 -1106 -1300 141 1396 1360 -269 -1519
2817 -1519 -697 555 1703 349 -881 -1228 -318 1352 713 -509 -1287 -938 639 1133 300 -954 -1327
2834 -1327 -327 1061 823 -280 -1054 -774 863 1346 750 -853 -1544 -277 1182 1432 33 -1184 -824
2851 -824 396 1312 810 -839 -1390 -338 1034 1205 54 -1338 -968 720 1369 450 -578 -1281 -212
2868 -212 1200 997 -336 -1082 -1025 393 1384 1014 -521 -1429 -408 942 1034 13 -1259 -809 102 1209
2886 1209 859 -508 -1498 -733 982 1361 127 -1127 -918 136 1411 665 -404 -1498 -497 857
2902 857 1299 144 -1122 -1033 194 1031 1140 -452 -1247 -452 761 1100 88 -1017 -1272 -176 1059
2919 1059 943 -693 -1286 -759 666 1337 601 -904 -1097 -221 1026 1103 -307 -1139 -762 913 1132 457
2937 457 -842 -1051 -167 1045 1101 -295 -991 -733 622 1342 522 -760 -1043 -133 1170 976 -167 -821
2955 -821 -764 370 1279 460 -613 -1389 -432 1040 832 -68 -1102 -677 69 1371 512 -914 -1205 59
2973 59 755 931 231 -1381 -1046 359 948 531 -696 -1028 62 1125 1099 182 -1141 -717 524 1164
2991 1164 711 -445 -1154 -666 1091 1095 187 -1206 -737 127 891 1004 -419 -958 -572 926 1072 339 -753
3010 -753 -973 -134 1169 690 -515 -1063 -484 770 1098 177 -987 -1292 281 1076 715 -362 -1352 -368
3028 -368 803 953 289 -1301 -953 244 913 783 -148 -945 -669 774 1177 99 -664 -1291 234 846
3046 846 991 -140 -918 -682 457 684 710 -571 -707 -366 947 735 -155 -896 -602 474 1134 331 -641
3065 -641 -968 4 1534 798 -230 -1204 -455 599 1256 549 -526 -1066 -229 1182 892 171 -848 -827
3083 -827 452 691 620 -575 -1047 -61 687 787 77 -1272 -638 45 1167 528 -1095 -1001 -256 977 709
3102 709 -206 -560 -824 182 1223 272 -182 -885 -236 863 743 -1 -996 -961 166 1091 372 -523 -776
3121 -776 -608 697 971 -19 -702 -810 305 1092 457 -403 -1084 -470 489 1056 206 -763 -855 -167 1158
3140 1158 716 -327 -1098 -395 603 1061 456 -905 -709 240 835 800 -402 -992 -597 351 1272 6 -856
3159 -856 -812 79 749 939 120 -907 -751 607 992 297 -595 -1159 -341 863 773 -45 -1112 -288 604
3178 604 865 547 -814 -1002 159 864 729 -100 -998 -381 327 1083 588 -892 -872 70 792 618 -172
3197 -172 -855 -666 345 802 616 -528 -1207 -134 903 1026 -283 -903 -780 614 1026 441 -728 -1199
3215 -1199 -138 703 844 -304 -991 -630 7 1057 860 -701 -830 -207 648 820 200 -809 -639 368
3233 368 854 299 -324 -716 -103 786 957 200 -666 -838 165 1049 161 -584 -786 -406 680 930 262
3252 262 -945 -856 22 495 446 -442 -1026 -548 886 963 -31 -789 -877 143 880 495 -269 -748 -410 504
3272 504 862 132 -626 -865 -42 932 528 -305 -613 -273 351 988 281 -779 -602 -190 929 652 -200
3291 -200 -643 -508 738 793 285 -572 -966 50 874 719 -18 -738 -314 302 812 192 -281 -681 -73 783
3311 783 655 225 -933 -534 378 1207 359 -736 -804 -292 765 555 -374 -1032 -738 385 982 461 -587
3330 -587 -793 -563 588 787 330 -874 -457 417 616 752 -640 -829 -198 718 360 27 -430 -721 109
3349 109 615 305 -193 -786 -443 377 824 186 -756 -963 351 810 611 -188 -413 -153 790 704 -37 -710
3369 -710 -852 155 664 356 -495 -630 -149 508 908 260 -527 -603 157 993 593 -391 -814 -511 413 771
3389 771 83 -575 -586 -5 764 819 -205 -791 -251 473 583 243 -532 -805 34 700 978 -265 -454 -504
3409 -504 274 610 216 -642 -665 -26 739 774 -211 -695 -490 458 1095 300 -600 -507 52 366 682 -287 -795
3430 -795 -238 562 597 358 -813 -759 163 819 566 123 -822 -825 156 974 367 -528 -680 -431 796 398 203
3451 203 -561 -696 450 1001 550 -242 -848 -312 712 660 -511 -671 -479 387 865 313 -208 -771 -475
3470 -475 792 847 -24 -762 -473 202 637 311 -489 -693 -70 583 826 -65 -683 -819 -10 756 465 -392
3490 -392 -734 -40 431 755 -28 -946 -553 -66 624 357 -102 -916 -465 520 687 -55 -567 -491 104 792
3510 792 717 -336 -887 -150 36 423 465 -510 -721 31 741 597 -141 -922 -354 266 743 441 -456 -523 6
3531 6 748 620 -345 -834 -381 373 1098 381 -623 -737 97 482 500 -159 -725 -429 157 777 186 -660 -550
3552 -550 -114 866 614 -262 -662 -219 161 590 372 -639 -658 139 529 696 -133 -708 -363 51 611 243
3572 243 -590 -699 -218 239 435 -24 -545 -694 -220 684 131 -230 -774 76 461 591 -266 -577 -405 -116
3592 -116 850 746 -351 -767 -67 480 739 -92 -756 -489 92 802 524 -488 -508 -359 117 618 114 -562
3612 -562 -649 -118 872 619 -328 -732 -424 284 675 277 -736 -324 128 499 411 -238 -643 -66 524 374
3632 374 18 -466 -764 -15 292 620 -115 -816 -42 381 620 -26 -515 -673 190 492 480 -98 -708 -350
3652 -350 136 585 -10 -523 -746 -177 685 594 -196 -907 -433 106 535 352 -705 -546 -51 761 645 -8
3672 -8 -499 -459 444 370 387 -467 -505 -38 276 509 -143 -816 -294 112 571 515 -893 -993 -102 349 358 4 -360
3695 -360 -672 239 480 467 -317 -735 33 432 781 0 -467 -370 64 591 558 -153 -709 -390 619 586 -200
3716 -200 -428 -70 395 793 375 -54 -433 66 618 780 -121 -638 -416 -115 660 735 -263 -564 -98 339
3736 339 561 -17 -583 -730 91 440 60 -692 -376 -10 521 696 -101 -709 -587 83 577 716 -238 -737
3756 -737 13 369 818 -74 -504 -540 115 460 233 -225 -624 -336 231 424 309 -454 -579 -222 854 600
3776 600 -80 -651 -105 292 364 570 -791 -615 -60 411 309 -198 -533 -329 225 373 -187 -507 -611 12
3796 12 706 525 -140 -806 -217 395 616 166 -244 -465 -7 502 363 171 -797 -533 -45 669 294 -348
3816 -348 -273 -24 474 273 -159 -426 -385 417 414 267 -262 -915 114 359 601 -4 -863 -434 57 858 247
3837 247 -397 -649 -265 562 411 307 -402 -394 418 628 536 -348 -608 -35 466 444 -226 -639 -345 90 576
3858 576 351 -145 -770 -243 274 282 97 -428 -469 221 409 628 -39 -819 -381 522 439 82 -506 -463 81 633
3880 633 31 -325 -402 -462 258 693 11 -377 -538 -33 74 490 -160 -366 -289 372 640 -173 -344 -546 -190
3901 -190 358 531 80 -684 -236 511 491 182 -608 -162 281 615 627 129 -178 -210 -57 752 555 -240 -542
3922 -542 -52 336 369 -502 -521 -187 135 265 175 -621 -373 -325 586 518 -155 -672 -326 11 599 156 -494 -572
3944 -572 143 509 739 -219 -391 -429 396 546 105 -272 -691 -144 402 190 -114 -394 -397 -82 482 -121 -368
3965 -368 -598 -338 361 278 27 -372 -481 76 386 560 -214 -596 54 446 389 -138 -578 -345 -132 487 450
3986 450 -296 -254 -162 438 513 17 -538 -495 -222 693 143 -241 -218 -245 272 320 -169 -352 -195 251 485 166
4008 166 -132 -260 -157 130 161 243 -626 -447 -92 478 384 -27 -188 -83 340 587 155 -371 -225 -265 412
4029 412 390 -445 -822 -198 197 452 242 -59 -628 190 506 508 4 -584 -190 220 327 21 -587 -576 -175
4050 -175 469 594 -61 -433 -229 406 727 -160 -356 -531 -37 314 372 -200 -460 -458 81 267 432 -338 -379
4071 -379 -185 197 618 -22 -600 -149 177 343 285 -156 -561 -254 395 468 248 -485 -432 -23 547 249 -271
4092 -271 -307 -294 571 590 -224 -325 -475 42 426 324 -208 -772 -122 252 537 36 -511 -544 61 573 240
4113 240 -240 -289 37 801 717 -180 -644 -326 -65 646 145 -211 -35 -58 298 850 361 -225 -294 -419 435
4134 435 331 142 -310 128 421 369 38 -338 -381 225 620 494 -184 -803 -643 415 679 -32 -369 -358 42
4155 42 632 63 -253 -265 -238 142 155 79 -346 -364 82 608 396 -296 -452 6 322 633 266 -450 -611 -252
4177 -252 331 461 -350 -522 -544 162 545 363 -398 -254 15 479 152 171 -379 -432 87 470 336 128 -79
4198 -79 -74 174 544 -165 -335 -231 285 269 301 -478 -410 271 556 427 176 -397 -277 268 456 482 -375 -587
4220 -587 36 600 335 14 -293 -656 209 402 23 -509 -470 -235 65 496 -218 -463 -291 386 693 401
4240 401 -348 -620 30 337 528 -220 -262 -285 86 491 483 -191 -239 -107 203 527 176 -238 -203 -62 367 313
4262 313 -434 -618 -359 455 289 99 -222 -207 -110 303 475 -258 -744 -369 225 330 -15 -414 -469 225 276
4283 276 266 -227 -467 -163 421 313 103 -296 -588 87 404 335 6 -419 -124 428 236 239 -311 -493 -242
4304 -242 466 430 87 -415 -341 -5 376 354 -560 -500 -137 284 281 -324 -639 -50 -115 308 126 -466 -599 133
4326 133 493 341 36 -506 -337 193 430 0 -321 -676 24 330 618 -166 -368 -408 5 165 299 -435
4346 -435 -616 -52 363 280 83 -242 -447 -11 398 163 -403 -198 -417 383 242 184 -233 -331 -30 107 145
4367 145 -305 -215 -324 -263 681 -74 -276 -435 -66 519 610 -41 -525 -187 413 259 -241 -469 -435 -5 375
4388 375 542 -386 -554 -221 255 535 -50 -284 -310 -10 402 420 161 -416 -123 299 664 194 -454 -683 -184
4409 -184 267 263 68 -494 -359 457 240 -81 -403 -299 -91 178 479 116 -458 -377 316 477 -9 -281 -356
4430 -356 -264 442 110 -104 -373 -373 128 528 62 -194 -249 23 342 291 -22 -376 -198 47 547 279 -448 -246
4452 -246 341 457 345 -164 -346 -525 158 359 241 -377 -316 18 580 280 -150 -418 -466 38 540 386 -501
4473 -501 -305 -224 372 395 72 -507 -446 42 516 376 -540 -473 -317 106 633 246 -178 -353 336 682 -156
4494 -156 43 -188 -106 234 394 139 -226 -547 -19 170 161 108 -510 -42 130 421 138 -534 -589 -126 519 525
4516 525 -405 -500 -392 379 102 395 -115 -350 68 508 350 -424 -113 -245 146 140 299 -118 -114 -29 310 154
4538 154 -25 -399 -267 217 457 -32 -347 -416 60 269 192 -201 -95 -269 -62 99 333 -297 -502 54 46
4559 46 339 -160 -165 -325 354 257 329 -93 -357 -183 343 301 71 -421 -232 297 451 78 -79 -161 -206 323 586
4582 586 8 -281 -249 294 363 18 -344 -222 97 124 563 86 -161 -309 336 588 207 -189 -284 -297 319 203
4604 203 -9 -404 22 -187 218 236 -379 -350 -9 231 457 85 -262 -591 148 256 367 -80 -263 -221 102
4625 102 520 -76 -322 -150 27 322 124 91 -600 -424 545 206 97 -200 -295 13 568 175 145 -500 126
4646 126 -70 374 -58 -374 -224 196 384 638 -79 -260 -47 252 147 130 -286 -357 132 380 132 -20 -414
4667 -414 -361 35 688 351 45 -283 -173 493 391 -41 -204 -39 90 234 238 -187 -282 -114 328 527 -32
4688 -32 -438 -322 200 712 346 -145 -210 -91 277 378 145 -326 -472 134 157 144 -340 -679 26 212 91
4709 91 191 -240 -242 275 416 310 65 -306 -22 120 375 94 -426 -297 -366 350 129 -60 -278 -363 297 244
4731 244 244 -221 -406 69 102 267 -59 -516 -274 274 -65 108 -297 -479 301 574 102 123 -448 -346 72
4752 72 305 125 -651 -329 131 201 447 127 -259 -447 124 357 132 -269 -260 46 146 474 -121 -447 -195
4773 -195 49 390 -7 -363 -486 -160 151 131 -5 -277 2 -115 148 198 -115 -486 11 417 263 205 -408
4794 -408 -374 44 186 269 -316 -187 -38 307 399 -177 -455 -374 10 748 254 -583 -291 -384 553 520 24 -135
4816 -135 -213 178 85 289 -235 -334 -155 198 448 83 -467 -388 -71 269 -46 -323 -545 -2 562 152 171 -299
4838 -299 -610 32 269 376 1 -420 -129 -9 196 -5 -271 -167 177 331 280 -217 -138 -130 247 340 -117 -115
4860 -115 -242 -24 459 -11 -100 -250 104 425 395 306 -440 -141 65 97 215 -112 -472 -154 183 425 94
4881 94 -286 -218 40 246 236 -253 -121 -218 253 566 116 -503 -468 -206 178 111 -41 -369 -313 188 490 22
4903 22 -514 39 -289 286 391 -204 -374 -345 18 469 189 -258 -399 -135 432 292 75 -91 -147 210 263
4924 263 124 36 -368 78 350 251 -17 -188 -310 345 388 133 -60 -203 -360 409 160 -27 -313 -360 125
4945 125 561 273 -209 200 -154 255 70 158 -642 -185 33 187 129 -243 -483 -68 -35 455 88 -240 -184
4966 -184 255 262 217 35 -265 -366 96 498 283 -467 -354 -261 573 113 -36 -141 -368 -199 336 364 -82 -364
4988 -364 26 380 142 40 -548 -426 610 480 -131 -533 -325 34 278 118 -172 -195 35 49 304 65
5008 65 -161 -499 -89 292 375 247 -259 -330 259 206 201 -23 -390 -154 382 7 155 -292 -388 -227 427 499 -207
5031 -207 -444 -285 399 156 -6 -228 -307 -148 284 297 -206 -399 -187 152 319 -75 -268 17 76 267 284
5052 284 -122 -169 183 217 66 121 161 135 -48 280 -10 176 -426 -323 255 85 -29 -375 -249 81 164 272
5074 272 123 -665 -111 226 224 130 -426 -271 230 418 411 -226 -406 -82 211 456 297 -213 -319 -14 304 343
5096 343 27 -247 -127 32 313 111 -501 -511 187 264 -64 106 -360 -124 66 74 249 -133 9 26 99 -51
5118 -51 110 -288 98 104 291 201 -361 -343 18 124 238 -297 -396 -128 197 285 -10 -66 -223 -206 296 243 126
5141 126 -422 -437 104 220 72 -112 -29 -216 290 107 42 -735 -182 15 395 186 -144 -279 -36 160 384
5162 384 42 -219 -150 107 369 223 -209 -457 -119 357 312 145 -54 -277 450 231 280 -119 -433 -81 154
5183 154 268 102 40 -112 -3 348 -57 -175 -277 -112 71 91 -14 -280 -179 -288 534 531 -302 -173 -231 134
5205 134 257 -247 -199 -186 -164 151 140 -147 -219 -288 309 374 177 -617 -538 1 492 291 -224 -320 -94 232 348
5228 348 66 -352 -274 43 313 208 51 -333 8 -19 340 173 -515 -367 -85 547 530 -36 -133 -288 27
5249 27 68 142 -138 -305 137 391 99 220 -69 -11 441 225 -8 -321 -105 -228 162 155 -4 -591 148 -251
5271 -251 181 124 -275 -280 -173 478 155 62 -116 -546 -235 19 99 -83 -201 -393 312 249 -44 -101 -336 -121
5293 -121 218 -135 -391 -98 -48 161 552 -19 -392 -501 233 315 370 -131 -525 88 119 279 488 -327 -352 -14
5315 -14 266 174 -210 -45 80 129 178 48 -370 -322 65 39 329 -282 -98 -194 -77 357 186 -391 21 149
5337 149 380 282 27 -412 -136 131 275 142 -211 -237 296 594 334 82 -458 -392 -206 321 323 -505 -615 92
5359 92 62 240 79 -331 -161 -162 518 16 -135 -455 -356 88 205 116 -465 74 192 212 287 83 -24 238 -121
5382 -121 185 17 -145 -130 22 307 -125 -59 -413 -308 253 267 -185 180 -257 437 288 60 142 -475 -289
5403 -289 -53 380 66 -248 -226 133 270 433 -25 -285 -283 220 295 155 36 -318 62 248 198 -39 -204 -176
5425 -176 467 296 194 -483 -75 -27 192 499 10 -188 -108 77 333 -210 -147 -183 -118 375 121 -153 -31 -94
5447 -94 219 310 -124 -105 -242 -174 348 434 -177 -266 -221 251 94 17 -373 -100 -128 115 474 -18 -143 66 210
5470 210 34 -145 12 -524 112 195 314 -3 -148 -122 36 463 228 -272 -395 158 365 249 -154 -393 -251
5491 -251 241 263 215 -192 -133 -345 399 501 -146 -159 -122 162 354 -35 -128 -132 -152 26 658 -43 -214 -185 -21
5514 -21 435 342 -60 -204 -80 248 252 83 -29 -251 -36 402 11 -191 -5 -207 -84 14 284 -348 -208 90
5536 90 220 -29 -206 -570 -213 176 215 96 -581 -350 -102 410 258 -32 -672 -390 240 384 131 -185 -140
5557 -140 -41 621 136 -89 -279 -48 205 361 438 -449 -200 -30 29 350 -85 -194 -84 112 657 246 -203
5578 -203 -537 284 206 194 -192 -216 5 -137 256 82 -171 -14 -269 472 226 -338 -439 -526 -182 303 525
5599 525 -175 -383 -18 86 46 51 -506 -60 446 148 -145 -208 -96 -198 284 190 -3 -224 -305 47 -59 26
5621 26 -91 -296 54 561 410 -65 -207 -485 15 324 -31 -53 -222 -176 95 320 -153 -436 -345 259 254 24
5643 24 -260 -270 -124 230 232 -273 -149 -346 41 281 483 -184 -486 151 186 111 -74 -156 92 39 283 -9 13
5666 13 -282 -48 174 71 -4 -26 -192 -217 408 38 -82 -242 -1 -206 -59 147 95 -230 92 467 243 11
5688 11 -274 -110 137 98 221 -7 -245 -52 -81 35 -315 -277 104 125 407 332 46 -420 -226 325 -37 0
5710 0 -146 -135 -231 470 -87 -80 -436 -161 122 28 -13 -414 -144 234 283 481 -37 -338 63 277 340 203 -84
5733 -84 -284 125 233 316 -286 -88 -119 340 425 122 10 -170 48 146 61 -279 -59 -291 207 263 -65 -249
5755 -249 -243 -105 105 -9 -90 -295 -459 -58 -31 225 -353 -201 234 313 185 -274 -83 155 74 124 -135 -90 -71
5778 -71 315 638 384 -62 -294 28 -153 56 161 -204 -115 -244 135 -164 365 -436 -231 128 404 145 -159
5799 -159 -164 -13 314 -28 -103 -234 86 24 502 -117 -195 -574 123 374 370 4 -200 -73 -187 522 28 -452
5821 -452 38 89 -183 336 115 -218 -223 204 288 194 -11 3 324 453 199 68 -324 -188 467 202 259 -302
5843 -302 -305 -129 61 263 -316 -142 65 -36 657 250 272 -365 -348 -24 74 88 110 -93 -101 283 162 -103 -151
5866 -151 118 1 414 249 -138 -76 12 333 376 -62 -119 -135 130 334 203 -136 -245 -234 532 385 -338 -187
5888 -187 -175 -57 313 191 -16 34 76 -23 300 141 -228 -31 260 79 124 -378 -205 -101 102 261 38 -246
5910 -246 -303 15 -81 -11 -77 -64 -194 -133 191 -161 -34 -88 281 165 297 -145 -157 261 288 211 -138 -302 98
5933 98 324 66 6 -233 20 106 323 202 -92 14 -313 -169 348 -22 -96 207 -174 48 131 -58 -262 -319
5955 -319 146 511 277 -235 -309 -136 547 220 -108 -244 -219 104 461 430 -72 -39 -29 317 -177 -63 -424 -457
5977 -457 -184 467 244 -299 -483 -69 405 -145 -139 133 -274 114 103 121 -385 -290 -163 261 23 -183 215 -158
5999 -158 -19 568 -21 -218 -110 158 -46 350 107 -124 -250 -56 241 507 -58 -328 102 -144 310 234
6019 234 -146 -623 -264 115 232 239 -340 -131 272 72 130 -214 -229 323 297 134 165 -88 -207 89 -81 -7
6041 -7 -331 -122 -82 392 290 -117 -258 -96 224 171 -98 -111 -505 -34 516 247 -92 -444 80 -9 180 302
6063 302 -172 48 -217 210 248 -62 -383 -258 195 141 78 -79 -263 -126 444 196 -155 -406 -67 149 -72
6084 -72 358 8 -101 32 187 308 -158 -323 -310 258 127 270 -382 -301 165 118 267 -121 -92 -321 107 325
6106 325 -3 -88 -7 -249 239 231 280 -45 -259 94 313 98 -160 -301 -263 99 504 -119 -110 -171 178 252 60
6129 60 -59 -183 40 -198 266 57 202 -747 37 173 507 -207 49 -114 143 396 22 -23 -316 -38 88
6150 88 151 181 -219 -229 292 -136 288 -270 -49 259 217 109 108 -388 -269 217 191 74 -168 8 -111 123 346
6173 346 87 -413 -314 297 -45 -322 -21 -447 -264 145 15 -341 -152 -212 21 21 157 -175 -328 -99 -43 94
6195 94 -16 63 -146 -133 87 117 227 -134 140 99 96 233 -141 -237 -145 239 190 -58 -402 -276 11 299 154
6218 154 -360 -249 -166 298 248 -24 -425 -236 194 396 -147 -182 -83 -78 218 75 11 -206 -50 24 451 194 115
6241 115 -430 102 -16 135 -254 -508 -253 42 388 93 -82 -369 27 22 173 -160 -152 -92 -59 333 257 -336
6263 -336 -63 225 161 330 -76 -150 -265 120 201 241 -231 -375 -3 231 89 177 -369 -289 139 29 -118 -91
6285 -91 -27 -258 6 240 -8 -80 -132 -66 -25 402 -250 66 -12 313 24 -43 -10 -428 292 292 113 57 -133 -219
6309 -219 -26 -190 -216 -75 -98 -122 145 -140 -150 -339 -314 136 274 19 -283 -122 227 -30 114 0 -75 129
6331 129 75 -98 -144 -209 -187 289 47 188 -88 -127 -208 -23 198 145 -448 25 -193 48 -45 188 -170 -335 -44
6354 -44 139 -2 -48 -73 -110 444 10 77 -316 -207 52 334 155 -211 -376 -91 361 236 58 -14 -78 357
6376 357 -126 84 -56 158 -46 112 372 -95 -100 -28 205 117 193 -128 -167 32 18 396 -111 -106 -348 -48 219
6399 219 -109 -14 -224 -115 280 336 -128 -138 -422 -94 220 330 218 -194 61 271 92 -82 -321 -257 -226 -19
6421 -19 476 -292 -439 -29 193 143 202 111 -80 67 -48 58 92 -279 -401 99 4 191 50 -242 -242 188 269
6444 269 -170 -228 -203 116 28 -46 -121 -166 -45 99 223 227 -105 -226 430 -12 80 65 -121 36 -65 -9 73 -64
6468 -64 -116 297 201 145 -244 -284 29 55 35 -43 -346 -211 49 186 93 16 -198 -45 494 116 40 -188 47 -52
6492 -52 135 -110 -204 -251 -45 225 61 -87 -175 60 -102 373 210 22 -95 -273 13 309 -100 -236 81
6513 81 14 285 63 -59 -199 8 -98 400 100 160 31 165 179 -6 -435 -193 -391 230 306 102 -109 -137
6535 -137 -102 -16 -24 7 -325 103 205 298 20 -148 -43 -25 535 93 -36 -213 134 10 93 192 -50 -383 -174
6558 -174 -139 83 -190 -250 -108 81 3 -98 -66 -181 -186 187 304 221 -26 56 0 -165 59 -230 98 103 61 41
6582 41 103 -140 -220 105 65 284 -163 -247 181 4 224 151 -26 -148 -4 -90 294 200 -273 -26 222 -11 54
6605 54 8 -27 -23 370 63 -61 -115 -14 213 231 3 -182 -290 121 -36 228 -242 -106 -322 225 300 -65 -258
6628 -258 -203 -105 128 152 -34 -128 -174 194 238 173 -193 -170 -122 524 278 -35 -63 -123 84 59 60 -259 -207 -167 82
6653 82 223 180 -64 -197 255 137 139 48 -220 38 -53 -59 174 -82 62 -139 468 74 -162 -65 136 152 417
6676 417 -315 -206 -6 55 178 199 -264 12 121 118 -75 289 57 28 126 41 342 -130 -85 2 313 52 -73
6699 -73 -428 -324 -78 60 15 -50 -378 -31 107 285 143 -104 -288 1 91 47 -1 -153 -192 203 68 -305
6721 -305 -401 -364 -71 178 17 -228 -527 -50 116 122 -11 -156 -278 175 147 161 -37 -347 -352 447 4 -46 399
6744 399 -246 25 290 105 167 -131 -529 -26 332 -55 -185 -252 -11 279 26 -239 -357 -54 -102 360 -262
6765 -262 -283 -35 -107 230 288 74 -377 -7 -100 9 -64 61 -303 -95 481 127 -279 -51 -58 -55 346 -146 -194
6788 -194 -103 -263 323 -30 -101 -58 73 -86 508 23 -23 109 -128 464 321 -44 -207 18 -197 207 456
6809 456 -156 -377 -89 231 295 102 -158 -154 -4 97 -1 -102 -171 -70 80 247 -10 -230 103 -59 548 402
6831 402 1 -285 -101 -74 245 -93 -138 18 88 323 289 -41 -231 58 -23 231 -117 -62 -264 -68 421 251
6853 251 -204 -366 83 -50 160 120 -236 -77 262 466 330 -159 -240 -48 -249 254 -101 -200 -83 -193 -114
6874 -114 271 44 -324 224 -87 269 305 27 -143 -4 112 79 72 165 -289 322 293 75 49 -302 -10 413
6896 413 453 -247 5 65 60 198 140 -45 -66 35 -197 394 -160 -179 -49 373 132 -54 -224 -209 128 155 260
6919 260 -227 -120 -322 419 253 30 -47 -126 54 276 322 63 -320 5 -27 170 58 -103 154 -226 192
6940 192 381 -42 -7 6 -104 359 304 8 -191 64 382 105 258 -59 -85 125 54 -92 -123 -251 -258 31 -60
6963 -60 -43 -414 -93 -32 266 414 41 -28 -41 82 82 -7 -389 134 250 -95 -8 -134 -50 -363 34 46 298 240
6987 240 -349 -213 79 217 -262 159 7 109 463 -64 -139 -212 -34 10 -46 -46 -95 -143 -210 275 292 -445 -88
7010 -88 12 169 -4 155 74 -49 -85 189 -310 -292 -304 207 174 140 -36 -285 89 89 283 113 -274 -94 299
7033 299 109 1 -122 -171 -214 -34 316 44 23 -365 -104 182 124 364 -343 -135 409 215 -387 268 -262
7054 -262 -171 159 11 -211 137 73 5 125 203 -85 34 -129 210 37 -111 -181 -184 196 200 172 107 9 -91 29
7078 29 15 34 -3 21 -265 326 -27 96 -342 -35 -93 121 172 -344 -97 -80 40 413 -14 -563 114 -269 159
7101 159 307 80 -38 321 249 -113 -94 -263 -7 77 508 45 -120 -64 138 35 187 -28 -130 -228 212 324
7123 324 -63 -132 30 -122 153 -141 -25 -292 183 416 284 24 -114 132 -211 153 -100 -176 -456 46 35
7144 35 267 51 -9 -132 -239 -280 36 129 -96 -275 340 209 240 95 -94 86 -59 66 -6 -204 78 151
7166 151 -14 205 -57 -32 115 135 5 177 -79 -60 34 206 204 -13 -225 -35 359 137 -200 -204 -571 -12 154
7189 154 392 -94 28 -197 210 66 153 -101 -288 -69 120 220 -313 -514 -146 27 -116 -11 -51 133 71
7210 71 13 -365 -86 -193 -377 -33 331 -257 -219 53 -20 305 315 -4 128 -252 -72 55 152 -25 -186 33
7232 33 527 142 94 0 219 304 262 151 -213 -276 26 -40 472 1 -59 -260 52 273 12 -52 -11 253 366
7255 366 458 -52 -24 -107 162 123 88 -108 -69 81 523 5 243 -32 -100 147 240 -15 -91 -205 38 25 309
7278 309 23 -247 47 -101 198 274 71 -205 -64 109 207 -111 41 -128 -34 82 136 -128 -167 117 75 -86
7300 -86 70 -62 -33 173 -13 189 220 -216 106 392 138 318 -26 -260 143 28 -173 74 -177 16 0
7321 0 -26 -24 -1 -55 -206 10 259 83 -146 -464 48 373 40 192 -255 -194 109 -104 -150 89 61 361 279 -57
7345 -57 -95 30 -115 116 402 -196 -263 -361 103 162 10 183 -363 -1 223 177 -55 -272 124 -272 70 -54
7367 -54 -402 -286 -85 -1 352 153 -151 -372 159 91 32 243 110 -97 -34 122 2 160 -47 -83 211 62
7389 62 -155 26 198 -72 138 404 -8 -104 -278 3 85 68 -132 -87 83 97 20 -17 -211 -112 51 -5 82 -70
7413 -70 -5 200 19 339 -39 -101 -9 72 30 -30 -95 105 -144 159 424 -37 -275 22 69 257 96 117 -105
7436 -105 109 232 188 -358 71 197 346 277 -139 -102 -113 1 402 52 -184 -81 87 155 -200 -38 -132 -2
7458 -2 230 175 -114 155 -117 -212 143 -199 -250 215 -88 114 234 -31 -62 174 39 154 -131 28 -284 -171
7480 -171 204 307 -132 105 -154 -176 -17 15 -280 13 -191 -230 225 35 240 118 11 15 386 207 -77 -221
7502 -221 -75 56 166 -50 -186 -66 -127 165 17 22 2 -98 452 69 -133 -237 -223 -39 98 78 -431 -174
7524 -174 217 -170 51 -96 -253 35 231 242 -73 -279 -90 -170 -221 -134 76 -187 134 292 33 2 -171 72
7546 72 -63 170 441 27 -161 24 -220 407 65 221 -305 -268 152 248 -24 -185 -384 0 177 123 139 -10
7568 -10 15 186 239 -100 -135 -197 -158 -56 70 151 287 97 172 223 -8 -312 136 146 75 271 321 -91 -182 112
7592 112 23 -106 -209 -206 17 13 18 132 66 -259 211 187 170 -352 180 110 26 322 -90 97 -194 128 167 93 -286
7617 -286 -125 4 -77 114 -28 -86 -249 224 408 -40 -94 -187 -118 141 285 -106 -381 115 34 176 270 36
7639 36 10 -38 -145 307 -220 -182 25 150 107 33 -347 55 -131 319 249 -327 -176 354 -27 265 2 137
7661 137 83 -117 106 -56 24 -472 298 271 263 -67 57 12 90 -75 -27 -183 -28 -43 99 174 -33 12 -24 -51
7685 -51 -48 378 363 88 -256 151 133 29 125 -205 -81 -15 199 -7 -312 73 -233 -103 79 242 107 -131
7707 -131 -133 54 217 258 82 68 263 -109 -116 -130 -16 291 -58 -12 51 12 40 122 134 -334 -272 -223 0 -80 210
7732 210 -325 -227 68 71 214 -81 -212 -165 55 225 -133 -167 41 -566 101 96 222 -84 6 67 0 339 -312
7755 -312 118 202 -47 252 38 48 -53 -93 182 -70 -65 -180 84 233 131 -62 -185 281 -100 199 68 -63
7777 -63 57 30 139 194 34 -31 139 100 65 -5 -264 136 -76 43 21 -124 -19 -135 272 616 84 58 -281
7800 -281 -84 126 -141 -149 -343 5 154 150 190 153 70 -170 146 188 -9 -136 -440 166 -131 -34 11 -20 -316 122
7824 122 30 -65 -62 -104 -72 244 20 -52 49 -33 151 321 -137 -228 -202 -211 73 178 128 -36 -61 33 -57 -180 169
7849 169 -138 -41 214 -250 -100 -39 40 56 -68 341 -140 -264 -376 153 -77 74 -108 -98 272 -127 -153 -27
7871 -27 -112 207 165 131 93 -93 -52 2 14 -148 154 -271 -17 65 -9 5 -20 -274 -17 152 187 -281 -332 132 -155
7896 -155 -17 144 -41 -170 -59 -28 123 92 -230 -35 179 137 47 304 194 -261 -64 -38 80 -268 -350 113
7918 113 59 128 -71 -273 -99 20 -77 59 -114 -78 -157 -110 221 -15 -90 -42 203 -20 -26 -318 -185 46 232
7941 232 304 254 71 -156 126 -15 -142 -232 112 10 163 -98 28 -57 -68 235 -327 -10 59 -16 -14 113 279
7964 279 17 -266 -45 126 -49 54 -135 -10 126 -23 -2 133 -237 7 26 316 109 -123 -173 86 288
7985 288 255 -39 83 5 108 335 -89 -84 -8 230 172 -16 -191 183 -63 -27 237 11 -160 -246 38 -41 -50 -203
8009 -203 137 -2 262 158 69 -82 -113 -202 145 -28 -91 147 7 221 -346 293 -174 72 143 190 138 55 -166
8032 -166 -8 237 -51 -146 342 86 63 187 -175 -134 -107 -57 105 20 -92 -186 -492 -7 83 20 -94 -61 -426
8055 -426 119 262 498 92 182 -152 -7 76 125 -301 -29 -101 156 -198 37 -134 185 406 -73 91 -171
8076 -171 148 157 -99 88 -224 95 -67 -123 -104 -69 54 -192 -526 -67 -136 -63 -26 -272 210 223 -1 -164 -368
8099 -368 165 247 -74 4 7 36 261 267 50 -54 -120 -221 17 24 115 -139 -231 61 -137 191 27 -65 -38 345 -15
8124 -15 6 214 95 -194 190 47 124 -163 -229 36 319 128 -185 -160 203 320 -113 -69 -95 38 393 -104
8146 -104 -21 29 295 207 215 113 -229 -160 6 322 -187 -196 119 -174 266 76 42 186 -260 204 -183 -2 69
8169 69 -117 241 587 79 129 -210 85 -73 95 293 187 -85 105 -147 -162 24 -126 -472 26 151 188
8190 188 -72
8191g2
$$ Imaginary data points
##PAGE= N=2
##DATA TABLE= (X++(I..I)), XYDATA
0 0 0 0 0 0 0 0 0 0 0 -2 8 -8 8 -8 10 -16 16 -21 24 -30 32 -40 46 -50 58 -68 79 -90 100 -114 128 -144 161
33 161 -180 202 -226 250 -278 308 -342 379 -419 464 -514 570 -632 701 -781 873 -980 1106
51 1106 -1258 1442 -1675 1981 -2396 3007 -3983 5802 -10414 50915 52010 -46283 -47008 -21615 29109
66 29109 56758 17775 -55800 -48940 11320 51498 34194 -15428 -54640 -29207 31581 57615
78 57615 11978 -44847 -47788 1965 45205 42302 -10885 -55429 -32232 31027 51217 14510 -34222
91 -34222 -46869 -7403 46446 45238 -14054 -52547 -26750 22545 47755 23373 -33504 -52030
103 -52030 -3718 43977 38015 -6406 -44013 -33862 18011 48404 21011 -29629 -45910 -7793
115 -7793 38936 38164 -2947 -40482 -36574 14420 50429 20739 -28667 -40150 -13267 30642 45300
128 45300 1614 -45060 -32066 14271 40371 24202 -20178 -45057 -15327 33899 40502 156
140 156 -37586 -32688 7582 41199 28707 -20293 -43557 -13749 27822 37262 6515 -33117 -36278
153 -36278 5707 40717 25328 -17691 -38026 -16913 23056 40265 9629 -35236 -35308 5697 35066
166 35066 26282 -10155 -39495 -21699 25157 38505 6396 -28279 -32225 -708 34692 28568 -12149
179 -12149 -37201 -18975 19854 36150 11146 -25790 -33848 -2630 33086 29249 -9808 -34369
191 -34369 -19868 15310 35139 14280 -26158 -33685 -1376 30312 27409 -5596 -33324 -23327 15242
204 15242 35843 13846 -23487 -32101 -4517 27040 28933 -2863 -32754 -23231 14098 33041 13255
217 13255 -19743 -30718 -7953 26010 30746 -2916 -32200 -21485 11130 29904 17437 -16049
229 -16049 -33732 -9191 27136 26808 -2083 -25617 -23903 6558 33162 18184 -18634 -30204 -7972
242 -7972 21484 28356 2651 -27954 -25657 7825 30588 16922 -14364 -28674 -11983 19844 29854
255 29854 2987 -27304 -23713 5745 27641 19108 -11493 -31018 -12992 20675 28391 3500 -23051
268 -23051 -24534 2071 27922 21062 -11156 -29035 -12446 17273 27665 6793 -22788 -25823 2205
281 2205 26786 20474 -9085 -28315 -14969 16072 28151 7651 -21087 -25709 -139 25755 20500
294 20500 -7437 -26675 -15812 14044 28253 8635 -20896 -25051 -1621 23823 22588 -5240
306 -5240 -27485 -16533 12895 26923 9994 -17699 -25880 -3595 23327 22302 -4578 -25408 -16686
319 -16686 10577 26417 12155 -16989 -26341 -3958 22008 22041 -2048 -23930 -19462 9161 26926
332 26926 11910 -16056 -24411 -5948 19366 23777 -402 -25051 -18606 8986 24506 13131 -12517
345 -12517 -25854 -8444 20283 24081 -1321 -22492 -18647 4959 24520 16006 -13057 -25705 -7546
358 -7546 17832 22060 2660 -20902 -21425 4693 25223 14963 -11923 -23961 -9810 15505 24126
371 24126 4308 -21591 -21183 4010 23026 15394 -8756 -23852 -11573 14811 23979 4238 -19975
384 -19975 -20466 1850 21901 17584 -7621 -24315 -12127 14174 23331 5774 -17987 -20837 -514
397 -514 21315 18345 -6401 -23721 -12388 12454 22295 7598 -16145 -22654 -1473 21871 17762
410 17762 -5798 -21491 -13863 9465 23498 9387 -16852 -21722 -1553 18963 17812 -2240 -21605
423 -21605 -15921 9628 23211 8711 -14441 -20685 -4522 17618 20435 -2038 -21929 -15041 8659
436 8659 21404 10799 -12237 -22170 -5336 18044 19505 -1338 -19444 -15831 5496 21761 12395
449 12395 -12385 -21643 -5878 15794 19594 903 -19306 -17358 5454 21302 11897 -10321 -21097
462 -21097 -7496 15078 20228 1610 -18586 -17093 3864 20300 13435 -8795 -21152 -8323 14252
475 14252 20029 2965 -17252 -17422 2605 19837 14139 -7959 -20327 -9280 12377 20161 4232
488 4232 -16518 -17771 898 18836 14510 -6916 -20131 -9904 11164 19666 5620 -15565 -18474
501 -18474 241 18383 14793 -5413 -19120 -11404 10024 20294 5988 -14848 -17629 -1151 16619
514 16619 16208 -3554 -20423 -11764 9786 18919 6776 -12227 -18817 -2646 17020 16243 -3939
527 -3939 -18079 -11665 7460 18754 8860 -12311 -19064 -2791 16291 15357 -1745 -17435 -13916
540 -13916 6459 19634 9010 -11686 -17748 -4329 13930 17196 -299 -17864 -13866 6336 18076
553 18076 9527 -9461 -18573 -5805 14085 17226 -135 -16647 -13923 4480 17870 10857 -8698
566 -8698 -18580 -6361 12991 17049 1536 -15591 -14462 3307 17150 11409 -7972 -18314 -6969
579 -6969 12277 17258 2737 -14780 -15047 2537 17491 12003 -7076 -17313 -7779 10737 16935
592 16935 3637 -14366 -15507 1649 16280 12378 -5621 -17352 -9355 10303 17557 4194 -13406
605 -13406 -15592 -180 15733 13242 -5275 -17381 -9301 9130 16524 5268 -12270 -16002 -765
618 -765 15415 13680 -3891 -16598 -10528 7562 17290 6675 -12138 -16064 -1377 14110 13637 -2082
632 -2082 -16366 -11374 7536 16924 6451 -10554 -15539 -3487 13939 14980 -1949 -16030 -10923
645 -10923 5826 15746 8855 -9509 -17191 -3790 13471 14209 -936 -14528 -12229 4626 16922
658 16922 8509 -9214 -16382 -4406 11930 15167 449 -14552 -12699 4042 16195 9304 -8077
671 -8077 -15344 -5491 10556 15118 1407 -14337 -12765 3739 15344 9651 -6448 -15817 -6920 10644
685 10644 15437 2464 -13356 -13198 1720 13967 10862 -5497 -16091 -6672 9875 14653 2861
698 2861 -12249 -13753 791 14836 11433 -5897 -15684 -6908 8544 14770 4398 -11921 -14555
711 -14555 473 14179 10509 -4301 -14090 -8928 7402 15989 4499 -11674 -13342 -876 12699
724 12699 12449 -3001 -15115 -9608 7422 14580 4981 -9793 -14228 -2217 12618 12388 -2656 -14015
738 -14015 -9355 6102 14609 6139 -9448 -14481 -2594 12177 12279 -1289 -13692 -9916 5194
751 5194 14635 6719 -8776 -13923 -3240 11133 12609 -393 -13470 -10171 4476 13979 7766 -7575
765 -7575 -14260 -4302 10775 12923 200 -12607 -10923 3152 13965 7957 -6891 -13569 -4621 9938
779 9938 12955 939 -12537 -10970 2764 13500 8953 -6220 -13401 -5291 9208 13059 1807
792 1807 -11040 -11540 1741 12795 9147 -5380 -13326 -5898 8459 13451 2672 -11760 -11767 1482
806 1482 12060 9538 -3941 -13791 -7158 8156 13196 2837 -9960 -11446 -421 12125 10441
819 10441 -4458 -13371 -6093 6927 12056 4178 -9358 -12831 132 12406 10173 -3357 -12098
832 -12098 -8011 5550 13288 4881 -9446 -12242 -766 11018 10212 -1933 -12520 -8786 5869
845 5869 13221 4744 -8670 -11597 -2355 10185 11536 -1175 -12577 -8140 5483 11899 5833 -7215
859 -7215 -12791 -3036 10802 11146 -1214 -11856 -9135 3876 12358 6935 -7264 -12798 -3075 9515
873 9515 11024 -147 -11218 -9478 2953 12335 6839 -6498 -12241 -3486 8657 11159 1447 -11564
887 -11564 -9998 3255 12287 6638 -5425 -11940 -4953 8399 12378 1333 -10659 -9786 1856 11232
901 11232 8271 -4919 -12533 -5068 8242 11170 1777 -9624 -10559 661 11439 8795 -4699 -11812
915 -11812 -5213 6540 11401 3149 -9343 -11079 761 11016 8286 -3530 -11215 -6689 6524
928 6524 12389 3124 -9373 -10264 10 9818 9448 -2660 -11777 -6825 6429 11207 3562 -7505
942 -7505 -10787 -1533 10276 9656 -2584 -11496 -6808 5092 11239 5009 -7675 -11280 -1769 10041
956 10041 9568 -1699 -10500 -7916 4217 11492 5467 -7243 -11129 -1624 9280 9728 -95 -10414
970 -10414 -8703 3917 11810 5374 -6718 -10716 -3114 7948 10523 32 -10841 -8311 3678
983 3678 10311 6101 -4895 -11100 -3954 8564 10493 -210 -9644 -8057 1558 10176 7361 -5199
997 -5199 -11450 -3577 7659 9171 1304 -8603 -9902 1347 11080 7063 -5399 -10011 -4291 6037
1011 6037 10518 2377 -9313 -9736 1630 10149 6875 -3430 -10216 -6105 6516 10981 1867 -8662
1025 -8662 -8636 323 9280 8266 -2910 -11012 -5336 5913 10056 2342 -7217 -9546 -705 9691 7961
1040 7961 -3038 -10165 -5568 5119 10049 3776 -7476 -10359 -538 9340 8097 -2140 -9531 -6361
1054 -6361 4239 10566 4344 -7534 -9619 -1027 8298 8372 -774 -9604 -7217 4178 10089 4056 -6435
1069 -6435 -9280 -2189 7784 9100 -643 -9658 -7172 3707 9587 5113 -5110 -10042 -2937 8180
1083 8180 8747 -585 -8794 -6984 2237 10122 5790 -5739 -10244 -2516 7023 8516 1131 -8304 -8219
1098 -8219 2071 9691 5126 -4564 -9046 -3540 6055 9496 1002 -8806 -7687 1814 9022 5982 -3925
1113 -3925 -9721 -4412 6683 9252 865 -7497 -7897 875 8946 7096 -3905 -9359 -3925 5742 8683
1128 8683 1941 -7378 -8587 473 9154 6742 -3236 -8953 -4725 4998 9424 2805 -7540 -8362 550
1143 550 8140 6563 -2272 -8987 -5571 4868 9506 3049 -7116 -8082 -313 7770 7312 -1426 -9360
1158 -9360 -5855 4691 9137 3061 -5756 -8481 -1825 7822 7801 -1493 -8490 -5442 3310 8740 4448
1173 4448 -5684 -8969 -1376 7772 7159 -1140 -7967 -6208 2676 9064 4471 -5775 -8423 -1715 6325
1188 6325 7660 363 -8245 -6926 3014 9001 4129 -4525 -8302 -2857 6165 8349 278 -8074 -6421
1203 -6421 2240 7977 5102 -4037 -9033 -2798 6302 7883 542 -7201 -6707 1085 7992 5579 -3927
1218 -3927 -8617 -3209 5061 8037 1423 -6700 -7517 979 8434 5648 -2968 -8328 -3922 5058 8253
1233 8253 1866 -6658 -7527 634 7458 6060 -2413 -8209 -4555 4596 8140 2220 -6507 -7174 -295
1248 -295 7074 6554 -2062 -8439 -4404 4486 7658 2385 -5420 -7806 -885 7309 6446 -1955 -7652 -4921
1264 -4921 3365 8148 3170 -5323 -8079 -692 6923 6557 -778 -7583 -5434 3028 8575 3460 -4991
1279 -4991 -7181 -1196 6269 6935 -543 -7752 -5463 3031 7659 3471 -4087 -7759 -1989 6523 7162
1294 7162 -573 -6638 -5090 2364 7553 4512 -4212 -7858 -1832 5751 6735 390 -6556 -6212 1946
1309 1946 7458 4559 -3919 -7342 -2386 4895 7400 592 -6542 -6513 1666 7266 4641 -3086 -7206
1324 -7206 -3215 4739 7875 797 -6319 -6053 722 6626 5233 -2456 -7844 -2960 4666 7169 1436
1339 1436 -5789 -6378 385 6787 5380 -2753 -7343 -3540 4217 6852 1644 -5694 -6946 -106 6582
1354 6582 5368 -2155 -6894 -3790 3563 7207 2499 -5355 -6992 -90 6366 5266 -1332 -7127 -4253
1369 -4253 3245 7284 2454 -4777 -6213 -1005 5660 6193 -1234 -6997 -4264 3032 6733 3147 -4318
1384 -4318 -6743 -1427 6061 5707 -704 -6554 -4751 2249 6986 3338 -4162 -6840 -1544 5199 6020
1399 6020 -161 -6568 -5304 2548 6996 3697 -3862 -6753 -2121 4949 6052 233 -6205 -5228 1829
1414 1829 6438 3853 -3374 -6672 -2259 4677 6107 253 -5627 -5244 1141 6440 4154 -3045 -6664
1429 -6664 -2636 4270 6346 798 -5225 -5383 850 6308 4436 -2630 -6411 -3068 4282 6531 1138
1444 1138 -5216 -5776 784 6234 4545 -2049 -6382 -3298 3740 6418 1580 -5197 -5519 31 5576
1459 5576 4897 -1479 -6476 -3548 3886 6102 1669 -4417 -5713 -372 5685 5017 -1416 -5995 -3470
1474 -3470 2643 6387 2643 -4327 -6090 -444 5519 5058 -1334 -5721 -3841 2837 6397 2464 -4533
1489 -4533 -6225 -760 4859 5415 -492 -6134 -4153 2408 6143 2859 -3825 -6003 -1270 4899 5427
1504 5427 -309 -5986 -4306 1750 5908 2999 -3498 -6065 -1554 4502 5519 105 -5535 -4604 1625
1519 1625 5834 3563 -3209 -5917 -2142 4255 5736 470 -4881 -5127 1399 5850 3624 -2452 -5598
1534 -5598 -2138 4194 5401 1012 -5006 -5118 766 5369 3762 -2141 -5857 -2757 3668 5589 837
1549 837 -5017 -4669 457 5200 4257 -2046 -5847 -2634 3324 5626 1327 -4526 -5203 -90 5262 3945
1565 3945 -1601 -5494 -3095 2970 5820 1872 -4192 -5123 -93 4937 4481 -1250 -5594 -3236 2854
1580 2854 5473 1741 -3798 -5285 -587 4898 4732 -916 -5339 -3341 2380 5382 2164 -3205 -5034
1595 -5034 -548 4783 4652 -550 -4829 -3541 1818 5564 2581 -3390 -5133 -1047 4107 4975 -364
1610 -364 -5183 -3879 1600 5573 2538 -3001 -5276 -1579 3812 4723 132 -4788 -4177 1467 5123 3176
1626 3176 -2277 -5073 -1759 3811 5078 448 -4745 -4240 1224 5111 3263 -2583 -5340 -1890 3854
1641 3854 4563 395 -3890 -3975 425 4866 3474 -2043 -4761 -2081 3017 5113 904 -4358 -4484 473
1657 473 4913 3550 -1604 -5406 -2279 2719 4841 1090 -4185 -4384 227 4670 3565 -1247 -5176
1672 -5176 -2568 3025 4765 1226 -3417 -4422 -401 4619 3905 -1094 -4775 -2696 2427 4676 1828
1687 1828 -3473 -4862 -72 4419 3939 -820 -4818 -3112 2232 4928 1995 -3236 -4801 -820 3979
1702 3979 4236 -866 -4590 -3311 2140 4891 2141 -2989 -4469 -1157 3822 4393 -220 -4693 -3558
1717 -3558 1573 4622 2265 -3017 -4847 -1034 3465 4219 -76 -4607 -3761 1043 4607 2721 -2327
1732 -2327 -4763 -1466 3540 4321 57 -3928 -3671 1196 4512 2542 -2256 -4433 -1800 3084 4729
1747 4729 480 -3838 -3601 685 4519 2893 -1789 -4774 -1994 3145 4586 539 -3568 -3943 265
1762 265 4507 3579 -1817 -4578 -1855 2841 4462 1160 -3506 -4313 368 4483 3107 -1397 -4381 -2355
1778 -2355 2201 4792 954 -3548 -4021 27 4103 3305 -889 -4338 -2471 2515 4233 1343 -2826
1793 -2826 -4241 -504 3819 3881 -743 -4648 -2775 2157 4389 1697 -3000 -4175 -542 3725 3692 -776
1809 -776 -4040 -2672 1676 4479 2142 -2733 -4263 -667 3830 3779 -495 -3969 -3028 1321 4416 2391
1825 2391 -2443 -3974 -748 3265 3529 89 -4268 -3365 1343 3994 2423 -2185 -4027 -1505 2800
1840 2800 3948 76 -3597 -3137 869 3883 2360 -1734 -4516 -1464 2794 3744 402 -3478 -3402 234
1856 234 4048 2413 -1795 -4134 -1496 2690 4020 770 -3870 -3535 682 3986 2621 -1131 -4085
1871 -4085 -2176 2607 4421 866 -3395 -3333 172 3811 2843 -1186 -3942 -2074 2547 3990 1189 -2835
1887 -2835 -3777 24 3965 3036 -1236 -4287 -2217 2104 3773 1116 -2833 -3920 -187 3385 2961 -559
1903 -559 -3863 -2203 1652 4004 1567 -2817 -3917 -278 3041 3227 -217 -4018 -2603 1798 3867
1918 3867 1284 -2542 -3495 -593 3405 3279 -476 -3758 -2389 1553 3594 1970 -1804 -3816 -929
1933 -929 3089 3356 -624 -3578 -2598 792 3949 2065 -2183 -3873 -873 2793 3348 -108 -3066 -3092
1949 -3092 871 3917 2026 -1909 -3854 -1418 2320 3615 318 -3374 -3046 1096 3736 2190 -1491
1964 -1491 -3755 -1740 2695 3404 403 -3064 -2994 377 3358 2688 -1434 -3544 -1395 2315 3450 477
1980 477 -2797 -3203 495 3751 2501 -1081 -3572 -1728 2084 3731 1028 -2770 -3128 264 3383 2471
1996 2471 -1027 -3394 -2195 1757 3575 796 -2679 -3466 -378 3013 2538 -836 -3481 -1947 1887
2011 1887 3435 1212 -2471 -3074 -224 2943 3049 -407 -3668 -1939 1392 3488 1233 -1932 -3388
2026 -3388 -590 3142 2646 -367 -3304 -2212 1091 3672 1482 -2651 -3337 -183 2684 2853 -67 -3223
2042 -3223 -2472 1122 3500 1515 -2045 -3125 -729 2879 3268 -263 -3241 -2215 961 3346 1958
2057 1958 -1545 -3457 -862 2684 3116 150 -2902 -2717 585 3299 1971 -1595 -3183 -1073 2159
2072 2159 3125 308 -2757 -2612 493 3027 2435 -1296 -3329 -1439 1915 3337 693 -2737 -2740 486
2088 486 2952 2112 -1162 -3199 -1606 2012 3096 645 -2656 -2778 540 2898 2431 -901 -3419 -1784
2104 -1784 1762 3117 639 -2154 -3014 -246 2848 2447 -1031 -3340 -1785 1399 2789 1085 -2442
2119 -2442 -3144 -261 2888 2400 -629 -2722 -2172 1077 3392 1071 -2217 -2741 -4 2645 2518 -248
2135 -248 -2954 -2034 1257 3260 1021 -1671 -2858 -664 2263 2830 -526 -2839 -1993 988 2729 1831
2151 1831 -1657 -3062 -690 2467 2574 90 -2815 -2194 527 3076 1571 -1733 -3019 -946 2104
2166 2104 2614 59 -2778 -2400 1038 3114 1626 -1108 -2906 -1044 1626 2650 452 -2688 -2224 716
2182 716 2597 1832 -1127 -2983 -1403 2306 2711 550 -2418 -2289 519 2823 2074 -1103 -2923 -1096
2198 -1096 1708 2530 881 -2044 -2492 280 2604 1985 -1171 -2684 -1372 1513 2743 464 -2290 -2599
2214 -2599 1 2508 1974 -639 -2929 -1750 1323 2940 775 -2051 -2212 -85 2475 1996 -546 -2509
2230 -2509 -1386 1376 2549 986 -1940 -2582 -265 2438 2421 -432 -2508 -1609 1027 2814 1314 -1681
2246 -1681 -2581 -439 2459 2515 -127 -2514 -1945 866 2736 1163 -1770 -2593 -921 2052 2552 173
2262 173 -2577 -2009 934 2387 1262 -1344 -2568 -821 2051 2502 -354 -2348 -1806 336 2370 1547
2278 1547 -1237 -2925 -757 1852 2375 -55 -2317 -2353 254 2754 1279 -1183 -2543 -730 1920 2665
2294 2665 438 -2214 -2094 457 2547 1453 -1240 -2502 -978 1266 2311 309 -2201 -2114 499 2432
2310 2432 1519 -936 -2330 -1175 1553 2367 443 -1763 -2102 106 2277 1785 -792 -2527 -1379 1444
2326 1444 2621 630 -1521 -2120 -281 2253 1899 -958 -2310 -1155 1479 2331 817 -1943 -2311 35
2342 35 2130 1884 -364 -2449 -1561 1225 2383 1244 -1508 -2196 -166 2019 2326 -500 -2261 -1462 1036
2359 1036 2573 920 -1334 -2320 -367 1785 2359 -308 -2330 -1519 701 2131 1267 -1305 -2362 -522
2375 -522 1581 2094 -133 -2260 -1966 658 2498 1290 -1105 -2790 -771 1529 2136 174 -1898 -2169
2391 -2169 699 2127 1271 -1019 -2344 -948 1698 2064 127 -1796 -1804 513 2089 1355 -868 -2095
2407 -2095 -587 1576 1908 218 -1847 -1767 192 2281 1434 -1174 -2187 -877 1244 2022 601 -1765
2423 -1765 -2235 76 2143 1685 -726 -1930 -890 1261 2373 411 -1481 -1782 45 2011 1718 -582
2439 -582 -2278 -1213 1223 2135 807 -1490 -1801 -232 1778 1546 -521 -1876 -1178 1012 2224 911
2455 911 -1757 -2067 -184 1568 1830 -449 -2084 -1390 1092 2186 748 -1506 -2325 -343 2017 1928 -99
2472 -99 -1613 -1592 777 2025 929 -1516 -1741 -432 1363 2021 164 -1836 -1491 711 1883 1340 -1070
2489 -1070 -2041 -802 1971 2160 180 -1959 -1472 514 1997 1233 -984 -1775 -843 1408 1863 303 -2005
2506 -2005 -1840 148 1947 1200 -1039 -2122 -671 1168 1815 51 -1660 -1787 397 1693 1562 -679
2522 -679 -2309 -1174 1209 1889 510 -1685 -1303 53 1451 1333 -514 -2096 -872 1099 1937 592
2538 592 -1543 -1465 114 1775 1470 -582 -1763 -1086 1091 1913 439 -1420 -1777 -207 1517 1365 -401
2555 -401 -1709 -1298 880 1837 751 -1228 -1530 -242 1695 1610 -471 -1618 -1416 664 1610 920 -1160
2572 -1160 -2156 -278 1538 1673 -241 -1514 -1133 809 2032 821 -1447 -1845 -235 1519 1869 -143
2588 -143 -1665 -1372 814 1633 669 -1193 -1789 -313 1372 1489 108 -1831 -1505 424 1956 875 -1201
2605 -1201 -1539 -524 1352 1953 248 -1686 -1284 115 1888 1085 -754 -1610 -692 1233 1670 -115 -1710
2622 -1710 -1205 361 1940 1078 -1329 -1703 -795 1146 1585 -99 -1458 -1343 -41 1426 1133 -541 -1825
2639 -1825 -708 1197 1581 420 -1443 -1326 161 1428 1236 -924 -1704 -928 1127 1768 427 -1573
2655 -1573 -1411 -23 1648 1082 -248 -1776 -757 1055 1741 383 -1265 -1515 -116 1267 1454 -664
2671 -664 -1767 -1023 933 1983 544 -969 -1772 75 1518 1333 -578 -1593 -963 841 1914 701
2687 701 -804 -1472 -154 1188 1169 -614 -1390 -1150 561 1817 873 -1028 -1645 -241 1394 1402 -393 -1619
2705 -1619 -939 370 1405 773 -1099 -1489 -372 1170 1737 -128 -1566 -1262 304 1505 764 -801
2721 -801 -1192 -267 1108 1415 -33 -1432 -1562 394 1230 657 -516 -1861 -459 1074 1400 204 -1085
2738 -1085 -1112 231 1379 1133 -767 -1593 -841 1329 1275 74 -1274 -943 492 1553 789 -710 -1402
2755 -1402 -597 795 1487 595 -1485 -1155 -62 1195 897 -446 -1389 -460 1092 1386 441 -1242 -1584
2772 -1584 52 1608 1035 -711 -1550 -795 973 1697 150 -887 -1412 242 1063 1303 -283 -1309 -878
2789 -878 993 1475 722 -1145 -1444 -502 1130 1314 -430 -1259 -1166 411 1243 571 -995 -1420 -227 1120
2807 1120 928 -74 -1097 -1026 605 1391 273 -808 -1614 45 1180 1138 -73 -1280 -1136 259 1406
2824 1406 698 -515 -1722 -406 979 1491 64 -1326 -1433 245 1478 761 -876 -1071 -545 1180
2840 1180 1302 -23 -1420 -1150 386 1575 991 -537 -1483 -315 810 1238 206 -1250 -1069 -108 1424
2857 1424 1027 -675 -1585 -355 1008 1260 373 -988 -1118 301 1352 957 -706 -1317 -578 571 1357
2874 1357 51 -1199 -1161 -221 1179 1073 -506 -1250 -592 709 1842 340 -596 -1118 -198 1032 962 -358
2892 -358 -1284 -855 652 1556 402 -1035 -1402 -198 1241 1255 -426 -1322 -910 382 1469 446 -919
2909 -919 -1239 -170 1003 1105 -91 -1358 -898 660 1329 728 -1022 -1114 -65 1107 1248 -40 -1189
2926 -1189 -751 174 1268 624 -1146 -1201 -297 1019 1139 -268 -1092 -727 288 1405 362 -625 -1565 -309
2944 -309 960 1027 -25 -1426 -838 564 1199 566 -496 -1010 -251 1099 1107 108 -1017 -810 215 1320
2962 1320 691 -498 -886 -515 801 1115 -11 -1174 -699 23 1153 678 -583 -1305 -530 905 1117
2979 1117 181 -872 -967 248 1029 867 -486 -1336 -544 624 1326 241 -1091 -1126 154 960 824 -401
2997 -401 -1391 -468 709 1054 381 -646 -1229 -5 1216 999 -294 -1062 -713 696 1220 362 -934 -1045
3015 -1045 105 1032 892 -255 -880 -1221 613 931 345 -617 -877 27 940 1198 -389 -1062 -757 649
3033 649 1120 473 -673 -778 -60 885 777 -109 -927 -830 452 1269 538 -862 -840 -204 973 734 204
3052 204 -1151 -752 265 1235 767 -639 -1255 -302 897 1045 33 -1031 -1061 512 932 685 -208 -1081
3070 -1081 21 788 698 203 -960 -911 387 728 433 -761 -962 -215 906 1078 312 -823 -755 262
3088 262 1210 549 -514 -929 -122 739 988 78 -816 -921 2 995 704 -540 -811 -473 375 1292 227
3107 227 -780 -759 27 862 368 -575 -948 -369 458 863 45 -850 -816 128 798 916 -471 -998 -524 604
3127 604 1408 376 -800 -704 -184 830 705 -282 -1121 -501 484 1030 393 -838 -905 -108 1165 812 -67
3146 -67 -1062 -513 678 855 342 -558 -657 -98 690 894 -428 -1123 -505 448 1198 351 -536 -962 -162 873
3166 873 633 -175 -848 -441 198 1506 638 -698 -989 -55 881 817 153 -861 -991 250 1140 571 -693
3185 -693 -781 -319 563 1070 9 -903 -577 396 831 725 -204 -848 -197 832 749 -124 -1038 -564 171 694
3205 694 334 -320 -921 -374 744 675 327 -988 -679 303 950 609 -441 -1181 -283 704 707 -107 -799 -940
3225 -940 9 841 739 -321 -1068 -107 485 971 20 -893 -825 -378 1043 786 -4 -853 -70 839 956 386
3245 386 -688 -861 183 854 900 -270 -1037 -653 509 884 17 -794 -865 31 825 737 -348 -1144 -360
3264 -360 533 755 420 -639 -721 -74 1090 539 -264 -842 -776 730 746 432 -539 -670 -26 595 1099 -20
3284 -20 -957 -459 456 602 794 -710 -522 -71 998 800 82 -940 -639 54 1346 534 -439 -851 89
3303 89 682 718 230 -834 -617 171 1297 444 -455 -687 -232 344 756 -134 -632 -666 269 818 449 -157
3323 -157 -1241 -368 651 1027 66 -558 -765 48 702 492 -477 -774 -522 787 1095 -201 -757 -667 15
3342 15 717 658 -847 -597 -321 264 876 463 -737 -811 -18 795 636 -89 -807 -469 708 861 167 -659
3362 -659 -600 227 709 399 -377 -689 -396 336 989 168 -568 -389 133 913 1080 -385 -1131 -473 510 514 139
3383 139 -331 -718 -56 863 492 -97 -510 -510 302 899 342 -485 -967 -20 727 738 -162 -596 -484 633 1065
3404 1065 230 -535 -697 -195 651 660 -99 -670 -414 278 695 291 -670 -863 -98 590 631 -69 -743 -516 105
3425 105 1030 107 -553 -634 -235 385 896 134 -928 -561 500 666 490 -583 -728 -426 629 632 101 -801
3445 -801 -551 322 851 507 -299 -626 -405 616 480 -21 -763 -303 95 585 578 -266 -776 -260 279 467
3465 467 311 -680 -715 100 783 511 -346 -513 -461 399 757 -242 -316 -350 -173 456 417 -287 -1138 -426 462 620
3487 620 12 -564 -868 -14 495 597 -142 -612 -669 343 678 -74 -284 -594 -35 621 642 -32 -871 -419
3507 -419 517 1027 285 -401 -507 48 514 449 -209 -720 -601 502 790 469 -297 -702 -127 521 599 -63
3527 -63 -616 -617 215 795 341 -303 -490 -187 833 743 -104 -637 -48 229 575 -33 -221 -836 -118 485 385
3548 385 21 -569 -385 333 630 433 -470 -626 -161 392 684 -15 -534 -178 87 751 209 -211 -585 93
3568 93 663 747 -120 -456 -657 209 432 392 -430 -1020 -360 759 580 -26 -600 -610 49 692 443 -304 -864
3589 -864 -205 359 634 85 -608 -691 260 854 240 -365 -848 -216 388 682 415 -521 -714 41 645 564 -397
3610 -397 -762 -172 353 542 1 -768 -641 -10 436 41 -279 -896 -381 449 519 279 -575 -781 78 679
3630 679 766 -211 -686 -345 224 637 120 -573 -435 -145 557 650 -84 -778 -256 254 750 59 -333 -378 -260
3651 -260 604 652 -248 -529 -552 124 570 164 -356 -856 -94 338 387 -65 -586 -367 85 575 160 -547 -799
3672 -799 -25 364 452 58 -596 -444 121 475 271 -373 -823 -144 521 413 -219 -284 -316 248 511 371 -259
3693 -259 -606 -429 285 505 -131 -546 -611 202 352 310 -409 -700 -241 367 656 168 -755 -554 185 715 128
3714 128 14 -453 -160 352 790 16 -443 -499 -310 462 392 -413 -414 -11 764 474 -88 -715 -539 163 852
3735 852 777 -208 -686 -377 321 608 119 -559 -636 105 513 231 -228 -451 -119 326 545 360 -438 -776 -68
3756 -68 414 922 -144 -1021 -34 264 150 230 -300 -467 -89 502 743 -274 -443 -339 33 604 161 -443
3776 -443 -617 -257 546 441 -265 -715 -244 273 813 332 -189 -912 -197 65 451 250 -756 -216 166 488
3796 488 556 -356 -630 -304 602 911 297 -577 -417 386 588 189 -460 -261 -69 460 698 254 -541 -315
3816 -315 362 463 227 -202 -878 -283 716 1018 162 -474 -485 193 500 474 -319 -936 -300 348 711 132 -401
3837 -401 -211 -184 470 151 -247 -668 -208 329 626 328 -395 -583 -227 463 227 113 -692 -309 688 680 120
3858 120 -100 -590 148 628 506 -47 -609 -167 318 514 305 -413 -680 449 537 697 -149 -587 -177 459
3878 459 835 247 -372 -202 -56 212 209 -206 -533 -410 236 530 37 -360 -943 -64 593 596 -161 -876 -112
3899 -112 -50 483 435 -375 -780 100 267 199 -224 -634 -474 292 477 262 -354 -293 -311 455 242 -26 -683 9
3921 9 265 175 397 -336 -838 -200 236 766 49 -875 -244 380 526 155 -456 -464 -289 380 439 8 -248 -357
3943 -357 295 257 502 -27 -352 -271 535 656 59 -695 -125 288 409 315 -141 -706 -183 412 429 174 -529
3964 -529 -245 39 753 475 -209 -603 -187 274 650 158 -492 -394 234 569 476 -207 -513 -296 234 439 95
3985 95 -691 -491 -64 85 368 250 -691 -64 300 379 262 -467 -721 97 597 166 -297 -454 -250 386 380
4006 380 220 -405 -260 249 606 178 89 -408 -411 154 413 239 -519 -662 18 43 -94 -102 -324 -575 -195 866
4028 866 101 -303 -686 -160 339 459 78 -702 -276 8 197 348 -308 -730 56 141 309 -113 -467 -465 179
4049 179 686 441 -328 -579 -180 497 439 77 -380 -492 455 559 342 -211 -421 -251 310 316 -76 -428 -552
4070 -552 60 378 432 -211 -457 -53 579 417 203 -330 -231 283 482 703 -224 -439 -171 91 835 212 -374
4091 -374 -504 -75 791 475 -211 -461 -315 406 377 190 -263 -447 180 441 520 -26 -433 -328 139 367 135
4112 135 -195 -345 136 134 331 -11 -695 -325 -100 360 248 -232 -401 -92 428 312 -151 -700 -161 222 242
4133 242 233 -447 -255 339 461 704 -351 -399 -99 303 545 -34 -258 -333 -7 374 528 -96 -513 -233 141
4154 141 307 197 -231 -533 -278 208 180 99 -665 -405 -20 491 343 -128 -538 -20 235 430 -53 -581 175
4175 175 -359 613 108 -515 -611 25 546 301 -19 -553 -290 203 404 222 223 -699 -120 391 468 83 -322
4196 -322 -382 198 577 186 -306 -678 -93 517 340 172 -383 -302 149 213 152 -115 -479 -32 158 636 47
4217 47 -617 -154 115 586 363 -127 -500 32 133 258 42 -436 -327 -15 409 438 235 -312 -549 294 708
4238 708 351 -419 -515 91 385 242 -125 -531 -319 171 300 199 -372 -560 -53 396 263 45 -488 -263
4258 -263 483 418 -118 85 -495 -29 161 629 -245 -478 -315 378 795 -197 -281 -277 127 11 181 -65 -278
4279 -278 -163 397 716 -37 -421 -335 -154 596 447 -14 -356 -343 108 319 97 -272 -469 -45 483 216 238
4300 238 -536 -435 205 424 387 -127 -317 -249 184 322 99 -535 -282 84 584 461 -400 -472 44 479 489
4321 489 69 -320 -542 -14 415 268 -94 -534 148 574 291 45 -426 -534 297 295 173 130 -386 -81 320
4342 320 200 192 -413 -523 121 624 531 -129 -369 -319 611 643 142 -424 -442 -49 536 158 -155 -698 -445 502
4364 502 496 93 -234 -395 98 563 343 -72 -605 -189 292 169 299 -402 -252 -328 422 149 -102 -234 -393
4385 -393 394 586 238 -316 -531 -48 297 373 -151 -492 -394 112 813 -69 -318 -495 -78 380 167 -130 -531
4406 -531 -539 72 439 125 -139 -198 -340 404 200 103 -312 96 358 319 204 -186 -366 70 345 309 -141 -668
4428 -668 -158 54 518 315 -393 -585 -326 273 446 40 -272 -474 86 445 188 70 -373 -135 136 377
4448 377 194 -387 -204 171 320 402 -48 -549 75 369 451 -314 -400 -280 155 473 328 -129 -406 -86 230
4469 230 276 -66 -233 -308 196 373 92 -684 -144 71 333 360 40 -287 -288 70 286 420 -39 -149 -117 387
4491 387 241 323 -455 -391 -94 124 72 -394 -238 25 463 333 259 -562 -578 63 298 544 75 -288 -225 121
4513 121 396 59 -374 -446 -28 378 423 -3 -340 -161 332 480 421 -328 -521 -78 530 155 -217 -332 -212
4534 -212 256 505 139 236 -260 286 211 191 -101 -122 -404 195 424 178 19 -325 -158 711 269 -38 -477
4555 -477 -520 235 227 366 -446 -297 -18 48 310 -46 -338 -147 -144 323 297 -243 -767 -127 374 292 -200 -260 -491
4578 -491 -88 519 604 -385 -285 -45 481 343 -133 -463 -369 205 398 358 -61 -338 -205 224 218 237 -117 -608
4600 -608 -87 667 225 -146 -411 -240 133 524 247 -324 -354 -142 582 629 -174 -473 -149 271 289 254 -279
4621 -279 -421 -156 310 337 -117 -687 -179 386 476 67 -260 -151 -119 70 472 -144 -150 34 254 130 440 -622
4643 -622 -282 3 266 206 133 -207 -141 472 130 386 -111 -341 -569 496 655 -22 -584 -94 -143 182 267
4664 267 -622 -403 -117 72 229 117 -392 -443 103 118 282 -125 -550 -180 291 326 -129 -289 -310 43 132 402
4686 402 69 -425 -432 306 53 247 -483 -298 20 414 -84 -358 -587 -279 268 255 -169 -485 -122 -43 217
4707 217 348 -278 -257 -85 9 226 -68 -537 -452 118 167 276 -498 -124 54 209 424 -41 -588 -459 114
4728 114 152 386 -309 -256 -484 334 157 -126 -121 -282 -224 195 229 -77 -328 -51 57 378 277 -28 -323 -27
4750 -27 358 178 -14 -274 -412 135 216 -124 -468 -206 -35 297 293 87 -184 -235 161 511 67 -38 -291 117
4772 117 550 176 265 -273 -383 183 558 71 -256 -368 118 317 387 79 -286 -309 -244 506 524 -329 -353 -194
4794 -194 160 330 91 -369 -255 162 183 197 -161 -193 12 333 142 -30 -294 -46 -148 411 446 -607 -479
4815 -479 -37 75 328 42 -307 -276 -112 123 172 -140 -254 -273 -3 169 203 -311 -36 -100 262 404 -149 -243
4837 -243 -188 165 353 52 -477 -360 -10 158 354 -194 -225 -170 508 160 15 -78 -420 -134 79 218 121 -249
4859 -249 -222 167 151 173 -520 -252 -135 105 255 -119 -225 -157 218 188 188 -265 -553 -56 70 903 -36 -310
4881 -310 -242 242 401 -73 -39 -132 -101 -139 454 -125 -334 -171 113 280 80 -417 -345 -146 147 555 -60 -56 -122
4904 -122 334 76 412 -62 -749 88 223 323 233 -482 -312 -149 385 295 -162 -358 -23 245 443 -96 -408
4925 -408 -17 22 400 369 -57 -228 74 188 235 -180 -284 -380 142 479 463 -59 -345 -304 154 329 -120 -275
4947 -275 -16 214 358 203 -178 -470 -74 -49 483 491 -121 -443 -31 411 498 -40 -231 -239 391 419 267 39
4969 39 -58 138 543 399 -288 -328 -350 49 275 422 106 -479 -154 492 395 218 -213 -176 -80 303 -111 -179 -295
4992 -295 -239 283 357 -72 -284 -466 -163 707 194 -430 -162 -63 -30 494 99 29 -190 316 545 261 79 -356
5014 -356 22 -22 88 322 -428 -530 -20 560 119 -164 -569 110 331 96 63 -250 -248 116 523 202 -73
5035 -73 -462 -182 248 315 377 -79 -247 -11 458 252 -284 -288 -392 345 -52 101 -376 -250 -68 471 64 -207
5057 -207 -309 -191 332 145 -241 -144 -245 -152 436 90 63 -194 -180 105 249 190 -87 -318 172 197 -34 -72
5079 -72 -30 -329 429 177 52 -400 -90 -127 340 189 -91 -465 -361 193 31 33 -28 -180 -283 -38 299 -333
5101 -333 -594 -288 46 356 -113 -543 -250 164 7 354 39 -430 -30 295 82 -304 -136 -200 -261 177 319
5122 319 334 -555 -374 -66 443 387 -226 -265 -71 2 443 -59 -436 -410 163 255 256 138 -305 -42 233 232 -157
5145 -157 -249 -634 85 28 176 -62 -174 -130 397 372 210 -604 -245 -126 330 123 -118 -486 -205 367 407 -90
5167 -90 -110 9 -16 621 -50 -95 -454 -62 256 170 55 -56 -372 67 201 360 -47 -178 -561 103 355 89
5189 89 -201 -441 -31 295 306 -101 -28 58 298 339 334 -412 -248 -33 262 283 -219 -504 -192 80 280 -96 -335
5212 -335 -115 -302 83 452 -152 -552 -211 -6 45 85 59 -215 -357 244 212 -67 -27 -193 83 214 96 -215
5234 -215 -239 223 -93 275 -223 -389 34 180 133 442 -78 -139 -140 388 121 27 -402 9 151 107 186 -117 -347
5257 -347 -161 398 185 173 -215 -463 217 218 -134 -330 -222 -98 188 344 -72 -439 -272 2 316 439 -321
5278 -321 -296 -442 -164 454 -173 -359 -381 112 488 140 -74 -350 -206 203 332 -27 -225 -407 133 510 42
5299 42 -224 -303 -404 129 281 37 -394 -574 -109 133 395 -275 -369 -45 262 303 -198 -158 -619 131 191 394
5321 394 113 -101 -158 106 394 174 42 -391 -89 341 135 -313 -31 -206 301 14 11 -70 -315 282 252 125
5343 125 -258 -471 -397 163 360 92 -72 -192 75 353 190 -93 -447 -328 218 317 31 -75 -445 137 354
5364 354 539 73 -424 -247 317 407 58 -158 4 -161 252 75 -129 -534 -415 110 417 20 -8 -371 -315
5385 -315 202 9 -230 -480 -284 516 382 110 302 -291 -86 160 120 211 -109 -310 -47 111 82 33 -83
5406 -83 56 49 52 153 -449 -91 43 53 321 83 -290 -41 180 471 -3 -141 69 97 70 -79 -107 -72 -193
5429 -193 368 231 23 -539 -72 -126 259 83 -101 -265 -50 158 407 74 -335 -180 -242 104 71 90 -147
5450 -147 166 -128 260 239 -186 -301 -83 246 178 -16 -288 -335 155 292 -31 -395 -242 107 8 170 -139
5471 -139 -614 -300 347 405 24 -293 -301 -187 105 174 47 -395 -402 144 138 21 -207 -220 114 -91 305 8 -427
5494 -427 -407 244 274 95 -17 -141 107 -14 92 -170 -536 -345 11 124 148 -397 -1 -314 185 131 177 -102
5516 -102 -94 459 241 57 -67 -306 187 326 74 82 -337 28 -67 292 343 231 -265 -136 188 73 69 -358 -280
5539 -280 -28 381 121 -8 -785 -55 23 55 -7 -264 -410 -346 -15 173 67 -383 -222 170 136 40 -156 -441
5561 -441 -52 257 252 -40 -362 -129 390 253 70 -54 -249 -39 430 331 107 -82 -328 406 306 -181 -93
5582 -93 -368 -35 220 259 104 -81 -192 134 237 -58 -71 68 -10 516 230 68 -224 -62 -162 237 -55
5603 -55 -109 -245 -163 359 384 57 -19 -621 66 108 6 72 153 -88 95 255 19 -134 -449 -36 -100 313 -309
5626 -309 -88 -98 -3 31 261 -154 -405 -363 73 88 -267 7 -39 332 152 308 -245 -105 -77 233 232 138 -76
5649 -76 -166 37 18 118 -158 -294 86 96 -37 -247 -218 -63 -66 195 226 -47 -92 -129 625 171 212 -184 -25 -103
5673 -103 123 -61 -243 -266 0 67 148 -110 -317 -186 99 163 284 -85 -698 -67 591 437 -186 -186 -304 -19
5695 -19 355 155 114 -332 0 383 -28 -220 -249 98 260 137 261 -45 -204 144 198 560 43 -108 -211
5716 -211 198 422 26 -269 -247 -271 -77 -37 -281 -424 -369 318 351 103 -207 -438 190 158 -112 88 -456 -369
5738 -369 289 566 134 -98 -583 163 19 514 247 -709 -184 -20 80 311 45 -198 -273 46 510 -133
5758 -133 -312 -278 -137 244 129 -171 -376 -142 -25 282 231 -156 -448 -4 301 154 -157 -41 -364 313 224
5779 224 474 140 -324 -127 178 417 -42 -289 -219 166 177 26 -29 -141 -184 310 151 -101 -236 -271 -119 385
5801 385 21 -299 -341 -7 244 96 36 -511 -141 46 198 381 -66 -230 -106 173 456 -205 -31 -14 86
5822 86 50 46 -307 -658 -28 185 219 51 -132 -127 137 83 195 -341 -491 -168 364 544 -28 -348 157 362 339
5845 339 464 -116 -393 -34 53 120 102 -207 -290 147 269 197 -336 -151 -397 -141 273 19 -474 -346 108 263
5867 263 388 -26 -211 47 39 -56 172 -128 -473 -239 94 202 -169 -166 -128 159 254 265 -79 -214 142 242 415
5890 415 -142 -162 -190 438 286 353 -254 -198 63 94 28 -183 -292 -48 90 455 45 -168 -414 -252 397 244
5912 244 134 -218 -138 -54 194 466 -179 -164 230 351 181 -1 -74 63 121 231 231 -248 -155 -121 77 241 29
5935 29 -83 -432 -198 105 -10 72 44 -130 222 114 109 -230 -143 58 441 -71 -186 -146 -67 346 331 170 -240
5958 -240 -305 115 103 252 320 -183 3 202 363 99 -86 -546 -112 176 84 -112 -191 0 253 339 34 -253
5980 -253 -338 150 324 353 -334 -339 39 191 283 -131 -211 -147 111 168 168 169 -433 -216 181 405 -37 -152 -23 98
6004 98 179 106 -142 -276 -85 486 156 185 -7 -98 -18 134 256 197 -59 -67 463 237 118 -134 -163 -92 253 221
6028 221 -140 -97 -41 96 240 -3 -77 -264 125 104 270 118 -327 -248 14 229 161 -61 -210 -30 47 80 267
6051 267 -585 -407 244 -23 89 -51 -191 -179 172 166 -3 -195 -452 189 240 302 -419 -44 -74 149 131 -209
6073 -209 -263 -328 -178 298 342 -100 -187 -24 251 361 256 45 -122 176 76 264 -201 -142 -209 -171 326 44
6095 44 -110 -197 33 161 -128 -82 -220 -188 347 202 -117 -183 -361 -121 330 129 -30 -323 -216 150 16 80
6117 80 -227 -105 -52 302 6 -151 -272 -181 77 232 -69 132 -177 -135 540 359 57 -332 -136 19 117 -121
6139 -121 58 88 -19 -20 -17 128 -402 -250 66 369 104 48 54 -63 121 122 -251 -58 -300 -112 334 414 -362 -648
6163 -648 -115 290 367 287 -136 -251 181 -121 179 -5 103 -126 155 390 -184 -587 -444 60 173 192 -143
6184 -143 -241 -52 120 151 33 -468 -333 89 234 152 -272 -585 -188 -76 334 70 -204 -314 -142 213 103
6205 103 84 -340 -573 247 216 12 16 -332 -168 422 -42 70 -185 153 -169 188 114 -280 -315 9 110 285
6227 285 -276 -255 -357 133 315 43 -287 -317 21 252 223 -366 -247 -193 147 44 56 79 -239 -518 119 54
6249 54 134 -332 -534 -178 33 245 -211 -161 355 153 72 -200 -67 -67 83 357 -11 134 -226 -190 162 200 262
6272 262 -234 53 4 63 -89 -214 -455 -129 89 158 110 -364 50 -209 189 151 -50 -269 -313 5 373 81
6294 81 -36 -103 43 129 18 181 -397 -131 234 248 -101 -128 -69 93 191 -137 315 -287 -350 -4 492 98 -83
6317 -83 -269 276 165 107 135 -362 -105 -108 197 -257 -4 -233 -30 18 178 -129 -240 -187 86 346 414 57 -535
6340 -535 -82 284 212 -32 -13 -309 296 516 39 -487 -278 32 271 412 -135 -187 45 90 185 434 146 -30
6362 -30 -98 416 355 -82 -63 6 -83 306 276 5 -245 -94 190 268 -155 -47 -181 148 311 213 -327 -306 -19
6385 -19 179 302 -169 57 -36 -181 3 273 69 -165 -324 308 375 211 -34 -50 181 353 261 -318 23 -364
6407 -364 -6 136 36 -178 -205 41 301 481 -239 -60 18 21 168 275 -254 -348 181 85 189 140 89 295 21
6430 21 19 32 15 -208 209 258 116 210 -223 -284 261 98 237 -227 -132 -207 305 164 -95 -112 90 213 152 230
6454 230 -3 -95 -45 257 258 203 367 -231 56 71 -330 -190 -282 -14 8 -42 21 -63 -70 202 217 31 -105 38 -1
6479 -1 358 -133 -61 -106 -43 92 1 -49 -37 -44 -135 123 435 25 -144 -173 171 201 99 -168 -95 -46 187 -129 34
6504 34 -185 155 18 -30 85 -89 -351 -192 40 114 123 155 175 28 10 346 -179 -110 -264 142 -33 35 -346
6527 -346 -317 24 77 303 118 -134 -110 -74 -178 369 -457 -84 -68 198 -54 53 -17 -319 -48 161 48 114
6549 114 13 -355 317 541 48 -166 -398 109 142 127 26 -230 54 342 174 -128 -264 -26 66 445 -111
6570 -111 -279 -313 -186 127 321 -152 249 -338 -83 133 -162 -131 12 -160 146 237 -212 8 -317 -297 255
6591 255 280 114 -290 187 144 -23 -22 -129 -89 108 -206 148 -303 -224 -64 250 34 259 -165 -222 139 41 233
6614 233 -109 -119 144 266 -141 140 -219 -271 192 -149 199 46 -203 -235 8 318 163 -350 -256 231 -150
6635 -150 53 -58 -63 88 -13 65 -31 -150 -73 208 245 447 -7 -375 -38 -57 236 361 -133 -15 -51 16 273
6658 273 12 -350 -189 -134 343 -162 -77 -286 -44 335 -50 86 -62 -61 64 178 48 -314 69 44 505 493
6680 493 -143 31 -248 -24 71 -44 -49 -120 -172 189 318 287 79 -33 143 396 171 -353 -327 -140 98 -77
6702 -77 -25 -4 -247 67 170 -146 -25 -202 -48 217 106 122 -245 -287 -13 341 153 -70 -271 -362 183 209
6724 209 -44 -249 -162 10 309 424 76 -293 -190 321 179 -241 -272 -50 -155 339 295 -5 -576 -219 -63
6745 -63 262 -22 -192 -181 36 359 203 61 1 -228 -23 352 -131 -37 -16 0 405 445 32 -250 -131 -166 162
6768 162 123 -228 -31 -76 49 -113 -99 -504 97 223 401 -14 -173 -252 -194 462 359 272 -437 -34 124 23
6790 23 -11 -358 -148 -36 331 -103 2 -169 -321 73 82 249 -151 169 127 236 195 -52 -68 -220 -79 370
6812 370 118 -252 -359 -261 229 185 76 -60 171 317 -38 -122 50 -286 36 188 235 95 -7 -119 -189 -26
6834 -26 123 -196 18 14 17 464 -36 -174 -59 79 89 173 -291 -377 -142 57 264 48 -41 -172 -137 -29 -62 -20
6858 -20 -28 -134 -44 -63 330 -115 184 206 64 275 -61 -39 -59 238 412 31 -38 -4 31 -265 408 -51 -243 -82
6882 -82 -141 416 46 -223 -92 150 -37 362 -35 -296 -142 347 395 -193 24 -122 -7 13 -76 -29 -112 20
6904 20 -90 404 159 232 -356 123 209 270 -117 122 -164 -150 277 -20 -321 -40 -471 -29 5 105 -312 -244
6926 -244 307 -45 -118 -33 112 -165 -36 -16 427 -4 -179 72 133 473 -120 -205 -66 -99 358 202 -149 -266
6948 -266 -71 331 3 224 -211 -32 237 315 127 -195 -2 -306 149 68 56 -209 36 233 48 91 -319
6969 -319 -415 40 292 274 -219 -327 -115 197 602 208 138 -156 -35 185 327 -19 -153 -260 -151 282 488
6990 488 4 -156 -5 -126 125 141 -224 -57 265 348 202 -184 -147 -20 86 94 37 32 -208 -111 -157 -94 -218 -274
7014 -274 -113 3 228 5 -202 -521 -29 -74 140 -255 -230 -150 186 -49 33 -9 -19 -192 117 132 79 -107 -59
7037 -59 4 285 54 -93 -241 401 194 251 112 -238 -106 21 347 62 106 115 -202 318 -27 10 -363 -1
7059 -1 -123 130 251 -285 -73 7 115 -13 -268 71 149 -19 170 162 -240 -311 55 -58 200 -22 164 -8
7081 -8 5 -141 -46 -312 -71 -187 35 140 280 163 54 37 583 150 -57 -286 -11 -34 315 91 -402 68
7103 68 -111 -40 43 -203 -193 258 118 -31 -303 -283 -296 103 130 -66 -23 -367 133 -52 337 -306 -281 506 126
7126 126 310 -109 -90 122 -121 166 227 -268 -386 -150 17 277 178 -204 -135 11 353 296 73 -11 -151 -146 114
7149 114 -126 -311 -278 61 11 450 168 -23 -435 267 298 260 73 -405 56 -36 271 123 -59 -526 207 286
7171 286 -15 57 -336 -157 -122 97 167 18 15 24 -99 196 59 -137 67 194 132 82 -213 -257 221 89 56 -459
7195 -459 -57 6 75 -3 -136 102 -85 -141 -13 404 -363 -193 -69 108 67 43 -7 27 -98 135 68 48 -119
7218 -119 -55 60 388 406 -198 -281 -195 24 133 76 -434 -269 -186 45 214 207 -322 -35 182 303 56 202 -92
7241 -92 -16 405 -115 -302 -240 143 73 237 -9 -6 -227 -47 145 91 -358 217 -207 25 434 149 8 -349
7263 -349 -318 115 -26 114 -206 150 102 290 122 -367 -66 -60 157 122 97 -100 -62 165 -6 -16 -227 -84 -22
7286 -22 143 253 -13 -353 40 -102 264 -91 -262 -20 297 334 125 -67 -282 -123 -65 28 160 -4 27 61
7308 61 204 247 -16 5 -111 160 44 143 -64 -222 249 -58 195 -114 -213 -329 185 248 369 269 -379 -118
7330 -118 219 -105 53 -78 -267 133 105 47 306 100 239 287 100 17 -309 -31 -66 16 -33 -165 -217 154 116
7353 116 40 6 -31 405 142 288 -127 383 -402 -134 176 -62 -217 -167 -11 -241 135 175 -45 -110 -77 178
7375 178 220 97 -173 -1 294 -121 -155 66 -59 35 -107 303 141 -81 -191 -79 317 15 -49 -121 -458 84
7397 84 51 29 97 -267 -24 174 45 -330 -178 201 16 268 51 -317 -142 -118 135 275 -14 -54 227 -81
7419 -81 112 28 203 -209 -11 -62 25 115 -493 190 159 273 -1 -159 -121 -272 158 41 283 -279 107 56 92
7442 92 152 -158 -154 -313 230 371 62 -30 -119 -33 334 -108 -78 -221 244 159 96 29 -195 -34 152 -62 172 -278
7466 -278 -93 -277 -241 179 41 -94 -266 -110 -355 146 27 -219 -152 -38 -20 41 -203 -119 37 164 -69 -202
7488 -202 97 340 8 -13 -102 22 -370 137 188 107 42 -168 -39 161 -100 65 14 -426 -9 289 180 -215
7510 -215 -188 -64 -78 46 167 -8 -254 97 96 293 -376 293 -42 306 194 -73 -169 216 352 -392 -46 -75
7532 -75 37 -173 -262 222 295 -263 -57 267 103 53 -71 -436 76 34 260 -213 52 35 -239 370 -203 -50
7554 -50 -421 54 111 70 111 24 221 -144 186 155 25 61 199 -184 245 78 -127 -16 -48 -4 -79 -71 -22 45 -63
7579 -63 -45 43 -54 -203 -230 275 202 184 -228 -86 -33 36 -51 -188 -281 216 -169 65 250 -102 -196 -102 140 -214
7603 -214 46 -352 -337 -60 -108 305 -160 -169 -42 236 275 -208 -188 -77 34 48 -33 -241 -262 -16 276 -104 133
7626 133 -434 162 96 -39 94 -37 -250 11 117 214 119 -666 -223 109 -14 179 -40 -195 -219 188 -83
7647 -83 -106 4 -251 -127 135 -96 -49 -145 -238 -37 168 124 72 -166 22 343 217 -124 -292 -61 70 244
7669 244 111 -79 -351 218 121 73 -238 -227 100 164 2 66 85 -129 154 -214 137 -214 -74 70 -142 -83
7691 -83 -227 65 83 176 -64 46 -19 -239 -153 -2 416 -164 52 72 -54 320 31 -128 -271 -200 -185 -48 55
7714 55 -89 -204 -59 168 141 -43 -8 42 343 179 141 -141 202 24 -77 -202 -331 -228 -66 -59 -78 447 -25
7737 -25 -185 -192 116 49 -149 -145 -117 128 39 -90 232 97 -135 158 218 -74 318 -91 -141 41 171 -206 -210 -94
7761 -94 -186 29 -91 -122 49 42 212 -52 -118 32 -259 199 287 -144 313 -208 -176 2 -255 -60 -23 -198 111
7784 111 108 146 -54 -143 2 9 398 104 -286 -149 -31 213 -34 228 -147 -229 189 -50 -6 87 -282 126 226
7807 226 10 -237 -217 81 33 -12 -413 -212 93 399 -162 -27 -206 210 162 37 -115 0 -37 -160 -118 254
7829 254 324 -128 76 223 213 64 -214 -271 111 55 171 318 27 -121 170 -43 205 141 -329 -225 219 113
7851 113 158 -132 -143 -145 -127 293 -22 -61 -383 231 99 -13 -106 -422 77 367 224 -75 -135 -130 -135 266 73 -118
7875 -118 -189 -74 456 91 251 20 -202 -195 -78 -27 -168 241 -24 -35 200 -55 -236 -110 59 398 -124 -313
7897 -313 6 -40 73 70 -55 -320 -30 397 -154 -101 -67 114 106 -253 91 -164 -2 -159 -12 -252 -99 -351
7919 -351 -214 -188 0 78 -34 -22 -131 73 134 333 139 158 -94 250 354 -12 73 -28 -109 -89 -138 -117 -433
7942 -433 252 -283 -100 -80 162 -126 114 141 293 73 2 -371 -65 217 170 -248 53 -237 -202 -121 -90 -289
7964 -289 -63 5 169 12 -136 95 -133 249 131 166 -159 163 172 63 77 -51 -70 30 97 -69 -90 -52 -70
7987 -70 36 150 159 -378 -215 21 96 572 9 27 11 3 390 54 -168 141 -199 -201 71 115 45 -155 -60 -109 15
8012 15 -123 -229 161 -352 149 132 -170 67 151 271 -63 -120 -345 175 18 104 -46 -115 -281 40 236 148
8034 148 -14 -81 142 164 -199 161 -60 60 277 13 152 24 -5 0 42 -5 60 -120 -297 -6 167 160 -315
8057 -315 -271 91 113 -38 -104 -118 -109 247 245 103 -29 -187 -291 59 140 -207 151 -168 -125 200 -78 -476 112
8080 112 -168 225 177 -25 -163 183 -108 -74 -96 77 104 -167 37 80 40 -149 -36 20 62 50 -30 -46 94 170
8104 170 144 -19 37 -47 7 -62 236 1 55 -129 19 12 179 -30 54 13 6 107 41 -18 85 56 269 87 -16
8129 -16 -30 74 173 -139 -75 -36 -123 -51 33 -122 299 -199 -271 240 234 -34 -13 95 96 -55 -103 102 -255 -102 66
8154 66 -106 50 10 -304 327 -72 -74 -119 -180 2 256 -7 202 7 135 1 67 2 -123 183 -128 120 -103
8177 -103 55 61 -62 -146 -117 204 -49 306 -156 269 314 100 22 22
8191B2
##END NTUPLES=NMR FID
##END=
