##TITLE=1H_DE-46_EA_W
 D2O
 8 sc, 
 8.4.2024
##JCAMPDX= 6.0         $$ Bruker NMR JCAMP-DX V2.0
##DATA TYPE= NMR FID
##DATA CLASS= NTUPLES
##ORIGIN= UXNMR, Bruker Analytische Messtechnik GmbH
##OWNER= root
$$ XWIN-NMR		Version 3.5
$$ Mon Apr  8 16:26:52 2024 Russian Standard Time (UT+4h)  she@DPX200
##.OBSERVE FREQUENCY= 200.1309
##.OBSERVE NUCLEUS= ^1H
##.DELAY= (6, 6)
##.ACQUISITION MODE= SIMULTANEOUS
##.ACQUISITION SCHEME= undefined
##.AVERAGES= 8
##.DIGITISER RES= 18
##SPECTROMETER/DATA SYSTEM= spect
##.PULSE SEQUENCE= zg30
##.SOLVENT NAME= CDCl3
##.SHIFT REFERENCE= (INTERNAL, CDCl3, 0, 15.7039)
##AUDIT TRAIL= $$ (NUMBER, WHEN, WHO, WHERE, WHAT)
$$ ##TITLE= Audit trail, XWIN-NMR		Version 3.5
$$ ##JCAMPDX= 5.01
$$ ##ORIGIN= Bruker BioSpin GmbH
$$ ##OWNER= she
$$ F:/spectra/data/she/nmr/H-F/1/audita.txt
$$ ##AUDIT TRAIL=  $$ (NUMBER, WHEN, WHO, WHERE, WHAT)
(   1,<2024-04-08 16:25:55.56 +0400>,<she>,<DPX200>,
      <created by zg, POWCHK disabled, PULCHK disabled
       configuration hash MD5:
       00 E9 B6 7A A2 85 ED C7 34 08 36 98 17 FE 4E 26
       data hash MD5: 16K
       9D 4B 8F C1 72 FC BD AB DF 57 46 C5 64 41 A5 08>)
$$ ##END=
$$ 
$$ hash MD5
$$ 39 FD A1 3C CB B6 D8 54 96 7F 47 99 25 32 9E 08
##$RELAX= 
##$RELAX= 
##$RELAX= 
##$RELAX= 
##$RELAX= 
##$RELAX= 
$$ Bruker specific parameters
$$ --------------------------
##$DU= <F:/spectra>
##$EXPNO= 1
##$NAME= <H-F>
##$PROCNO= 1
##$TYPE= <nmr>
##$USER= <she>
##$AMP= (0..31)
100 100 100 100 100 100 100 100 100 100 100 100 100 100 100 100 100 100 
100 100 100 100 100 100 100 100 100 100 100 100 100 100 
##$AQSEQ= 0
##$AQ_mod= 1
##$AUNM= <au_zg>
##$AUTOPOS= <>
##$BF1= 200.13
##$BF2= 200.13
##$BF3= 200.13
##$BF4= 200.13
##$BF5= 200.13
##$BF6= 200.13
##$BF7= 200.13
##$BF8= 200.13
##$BYTORDA= 1
##$CFDGTYP= 0
##$CFRGTYP= 5
##$CHEMSTR= <none>
##$CNST= (0..31)
1 1 145 1 1 1 1 1 1 1 1 1 1 1 1 1 1 1 1 1 1 1 1 1 1 1 1 1 1 1 1 1 
##$CPDPRG= <>
##$CPDPRG1= <>
##$CPDPRG2= <>
##$CPDPRG3= <>
##$CPDPRG4= <mlev>
##$CPDPRG5= <mlev>
##$CPDPRG6= <mlev>
##$CPDPRG7= <mlev>
##$CPDPRG8= <mlev>
##$CPDPRGB= <>
##$CPDPRGT= <>
##$D= (0..31)
0 1.2 0 0 0 0 0 0 0 0.06 0 0.03 0 0 0 0 0.0002 0 0 0 0 0 0 0 0 0 0 0 0 
0 0 0 
##$DATE= 1712579155
##$DBL= (0..7)
120 120 120 120 120 120 120 120 
##$DBP= (0..7)
150 150 150 150 150 150 150 150 
##$DBP07= 0
##$DBPNAM0= <>
##$DBPNAM1= <>
##$DBPNAM2= <>
##$DBPNAM3= <>
##$DBPNAM4= <>
##$DBPNAM5= <>
##$DBPNAM6= <>
##$DBPNAM7= <>
##$DBPOAL= (0..7)
0.5 0.5 0.5 0.5 0.5 0.5 0.5 0.5 
##$DBPOFFS= (0..7)
0 0 0 0 0 0 0 0 
##$DE= 6
##$DECBNUC= <off>
##$DECIM= 32
##$DECNUC= <off>
##$DECSTAT= 4
##$DIGMOD= 1
##$DIGTYP= 9
##$DL= (0..7)
0 120 120 120 120 120 120 120 
##$DP= (0..7)
150 150 150 150 150 150 150 150 
##$DP07= 0
##$DPNAME0= <>
##$DPNAME1= <>
##$DPNAME2= <>
##$DPNAME3= <>
##$DPNAME4= <>
##$DPNAME5= <>
##$DPNAME6= <>
##$DPNAME7= <>
##$DPOAL= (0..7)
0.5 0.5 0.5 0.5 0.5 0.5 0.5 0.5 
##$DPOFFS= (0..7)
0 0 0 0 0 0 0 0 
##$DQDMODE= 0
##$DR= 18
##$DS= 0
##$DSLIST= <SSSSSSSSSSSSSSS>
$$ [...]
##$SUBNAM2= <"">
##$SUBNAM3= <"">
##$SUBNAM4= <"">
##$SUBNAM5= <"">
##$SUBNAM6= <"">
##$SUBNAM7= <"">
##$SUBNAM8= <"">
##$SUBNAM9= <"">
##$SW= 18.0517689322627
##$SWIBOX= (0..15)
0 0 2 0 0 0 0 0 0 0 0 0 0 0 0 0 
##$SW_h= 3612.71676300578
##$TD= 16384
##$TD0= 1
##$TE= 0
##$TE2= 300
##$TE3= 300
##$TEG= 300
##$TL= (0..7)
0 120 120 120 120 120 120 120 
##$TP= (0..7)
150 150 150 150 150 150 150 150 
##$TP07= 0
##$TPNAME0= <>
##$TPNAME1= <>
##$TPNAME2= <>
##$TPNAME3= <>
##$TPNAME4= <>
##$TPNAME5= <>
##$TPNAME6= <>
##$TPNAME7= <>
##$TPOAL= (0..7)
0.5 0.5 0.5 0.5 0.5 0.5 0.5 0.5 
##$TPOFFS= (0..7)
0 0 0 0 0 0 0 0 
##$TUNHIN= 0
##$TUNHOUT= 0
##$TUNXOUT= 0
##$USERA1= <user>
##$USERA2= <user>
##$USERA3= <user>
##$USERA4= <user>
##$USERA5= <user>
##$V9= 5
##$VALIST= <valist>
##$VCLIST= <CCCCCCCCCCCCCCC>
##$VD= 0
##$VDLIST= <DDDDDDDDDDDDDDD>
##$VPLIST= <PPPPPPPPPPPPPPP>
##$VTLIST= <TTTTTTTTTTTTTTT>
##$WBST= 1024
##$WBSW= 4
##$XGAIN= (0..3)
0 0 0 0 
##$XL= 0
##$YL= 0
##$YMAX_a= 83712
##$YMIN_a= -77398
##$ZGOPTNS= <>
##$ZL1= 120
##$ZL2= 120
##$ZL3= 120
##$ZL4= 120
##$ABSF1= 10
##$ABSF2= 0
##$ABSG= 5
##$ABSL= 3
##$ALPHA= 0
##$AQORDER= 0
##$ASSFAC= 0
##$ASSFACI= 0
##$ASSFACX= 0
##$ASSWID= 0
##$AUNMP= <proc_1d>
##$AZFE= 0.1
##$AZFW= 0.1
##$BCFW= 1
##$BC_mod= 2
##$BYTORDP= 1
##$COROFFS= 0
##$CY= 11.3945322036743
##$DATMOD= 1
##$DC= 2
##$DFILT= <>
##$DTYPP= 0
##$F1P= 15.7292609196834
##$F2P= 12.9074282941183
##$FCOR= 0.5
##$FTSIZE= 0
##$FT_mod= 4
##$GAMMA= 1
##$GB= 0.15
##$INTBC= 1
##$INTSCL= 1
##$ISEN= 128
##$LB= 0.24
##$LEV0= 0
##$LPBIN= 0
##$MAXI= 10000
##$MC2= 0
##$MEAN= 0
##$ME_mod= 0
##$MI= 1.114404
##$NCOEF= 0
##$NC_proc= 0
##$NLEV= 6
##$NOISF1= 3.799351
##$NOISF2= 2.8
##$NSP= 1
##$NTH_PI= 0
##$NZP= 0
##$OFFSET= 15.70392
##$PC= 1
##$PHC0= -25308.84
##$PHC1= 16.38731
##$PH_mod= 1
##$PKNL= yes
##$PPARMOD= 0
##$PSCAL= 0
##$PSIGN= 0
##$REVERSE= no
##$SF= 200.130013532006
##$SI= 16384
##$SIGF1= 3
##$SIGF2= 2
##$SINO= 400
##$SIOLD= 16384
##$SREGLST= <1H.CDCl3>
##$SSB= 0
##$STSI= 0
##$STSR= 0
##$SW_p= 3612.71676300578
##$SYMM= 0
##$S_DEV= 0
##$TDeff= 0
##$TDoff= 0
##$TI= <>
##$TILT= no
##$TM1= 0
##$TM2= 0
##$TOPLEV= 0
##$USERP1= <user>
##$USERP2= <user>
##$USERP3= <user>
##$USERP4= <user>
##$USERP5= <user>
##$WDW= 1
##$XDIM= 8192
##$YMAX_p= 0
##$YMIN_p= 0
$$ End of Bruker specific parameters
$$ ---------------------------------
##NTUPLES= NMR FID
##VAR_NAME=  TIME,          FID/REAL,        FID/IMAG
##SYMBOL=    X,             R,               I
##VAR_TYPE=  INDEPENDENT,   DEPENDENT,       DEPENDENT
##VAR_FORM=  AFFN,          ASDF,            ASDF
##VAR_DIM=   8192,          8192,            8192
##UNITS=     SECONDS,       ARBITRARY UNITS, ARBITRARY UNITS
##FACTOR=    0.0002768,     1,               1
##FIRST=     0,             0,               0
##LAST=      2.2672688,     0,               0
##MIN=       0,             -77398,          0
##MAX=       2.2672688,     83712,           0
$$ Real data points
##PAGE= N=1
##DATA TABLE= (X++(R..R)), XYDATA
$$ [...]
1908A225J56m23l07j268r01NK08P69O31Q03Q60k66p28o84j040p29O0K23J278Q64
$$ 1225 1381 958 651 -617 -1518 -1513 -1305 -536 95 898 1758 1492 764 80 -960 -1689 -1629 -1406 -128 736
1928G36N02k8J46j158q46o81m5J10L95J321J019L92m89o82p36r95o60L39O22P56
$$ 736 1238 1210 1356 198 -648 -1329 -1374 -1264 -869 452 1471 1863 1374 692 -44 -1039 -1699 -1360 -738 18
1948A8O26O92J92m46j488m76k04j92M73R64J026L94j01k68n75j334p43J61P7O58
$$ 18 644 1336 1528 1082 -406 -882 -1086 -1278 -805 159 1185 1579 1478 1210 635 -699 -1442 -1281 -1204 -546
1968e46O52J111N34n09q03q41o33n14k7O02J163Q42L34J76m93j079q43k77l14
$$ -546 106 1217 1751 1242 439 -402 -1035 -1549 -1576 -974 189 1031 1365 1541 1048 -31 -874 -1151 -1465
1987a465M60L30J091R53j54m18m84p67q05j54M13R09N77P66K73k86p56q41p11
$$ -1465 -1005 -675 416 1369 1215 797 313 -454 -1259 -1413 -1000 -91 486 1252 1525 1239 483 -358 -1069
2006a069k58L0N15J179M49M24l37j30q25j036m45J22P12L13P76R64K87o45m92
$$ -1069 -1327 -1297 -782 397 846 1270 933 803 -22 -1058 -1503 -1381 -669 -356 420 1384 1671 1026 534
2025E34p95q10m54n0J150P88O39J80J14o68q35q77k18J74M17Q67Q49K05K4m29
$$ 534 -261 -1071 -1525 -1575 -425 363 1002 1182 1296 628 -207 -1084 -1302 -1128 -711 156 1005 1210 1234 805
2045H05m05j180n85N5M66P32M04J070j29k03j180k14m79n30N41M83Q61O89j29
$$ 805 400 -780 -1365 -1310 -844 -112 292 1362 1233 1030 -150 -364 -843 -1373 -832 -349 512 1201 1072
2064A072J03m33p50o21o79J37M54N97R67M13m19kp21l66q45O0L33N15P05K64O14
$$ 1072 1175 742 -8 -629 -1308 -1171 -717 -120 847 1260 841 839 118 -248 -1093 -1033 -700 -185 520 784 1398
2085A398j20j169n39j35m92j5M91P55P48L4k18k65n33j037j5q7P30L69O67O10
$$ 1398 1278 109 -430 -565 -1057 -1072 -581 174 922 956 738 473 -60 -1097 -1112 -1199 -469 -100 567 1177
2105A177J4m00o59n64p09p7L04N78O34N39L13j85l23r91n50k67J70L50N86J053
$$ 1177 1191 791 132 -432 -1141 -1218 -914 -336 298 837 1150 965 642 -349 -899 -1166 -996 -646 -60 993
2125I93J46j83m73n05n73q09L58N64M02O16K69L91m00p49m53j63k35j15J064K37
$$ 993 1139 956 483 -22 -595 -1404 -1046 -482 -80 536 805 1196 796 47 -406 -569 -804 -919 145 382
2145C82L80K14j30o10m86n70k96J28L99Q07L47Q32P6q98q76j2o50j17N24O59M18
$$ 382 762 976 846 236 -250 -820 -1116 -988 -589 218 565 1397 1473 575 -301 -313 -963 -1080 -556 103 521
2166E21L99r8n9l73q38l71j53K48M61M88O43J7k25k67n26n83l75k9Q57N38L44
$$ 521 920 822 763 390 -448 -819 -972 -724 -263 225 868 885 660 393 -133 -716 -1091 -1120 -263 275 619
2187F19M78k16m84o14l59m02K56K2O84O30J47r3K27o34q05m93K1N02J55M81J120
$$ 619 1097 881 397 -217 -576 -978 -722 -700 -16 614 761 668 895 261 -544 -1037 -1016 -514 -359 122 1242
2208A242m1o08m52n73k57m28JM19P07O22J12N8j61o47n49k08L8k0M90O46M02j6
$$ 1242 1201 593 141 -432 -689 -1117 -1116 -697 10 632 744 802 641 -6 -555 -763 -725 -745 -255 391 793 777
2230G77l35q1o99m19m06O82L83L65J49M89J45p94k48n83k41j20O68K84P44L7M3
$$ 777 442 361 -338 -757 -1163 -481 -98 267 416 905 1050 256 8 -575 -816 -936 -268 16 760 797 840
2251H40m37o58k50n79J62M10O40OQ95M5m15m13k63m27l91J40K59N65M84J18J7
$$ 840 403 -255 -505 -1084 -922 -512 128 134 1029 1074 659 246 -17 -444 -835 -695 -436 129 613 731 748
2272G48n23n16l53j45J35K78O77K48M10n77J47l81m10m86j91N44L64L84J85J17
$$ 748 225 -291 -644 -789 -654 -376 301 549 959 382 529 148 -262 -748 -939 -395 -31 353 538 655
2292F55k12n99l64j11j67L0O41P41Q7J9J45k69q08l87k95L22l7O37N93L97k64
$$ 655 443 -156 -520 -631 -798 -768 -127 614 701 720 865 596 -212 -599 -894 -572 -609 28 621 1018 754
2313G54m59m06m34j07m19N07O94L52J48K8j56k30n72k28j72K41J51M74P45l01
$$ 754 295 -111 -545 -652 -1071 -564 130 482 630 658 502 272 -300 -528 -700 -459 -308 166 911 610
2333F10n3l49l07l58k13k17O51M05L43M38j4m36n65j99k10k86J82M24P32LM5o8
$$ 610 557 208 -99 -457 -670 -887 -236 169 512 950 936 500 -65 -264 -474 -760 -578 -154 578 581 626 558
2355E58k42n43n34Q3J53Q5O01M91K69m9n40l05l18k90k17M11N09K14L23k52K57
$$ 558 316 -227 -761 -678 -525 -440 161 652 921 872 332 27 -291 -581 -798 -387 122 336 659 407 664
2376F64p84l25J8m7k65M29O97R3L81k50k63o09k65m17K09O90m4M94J92m6k40n76
$$ 664 -120 -445 -427 -474 -739 -310 387 480 861 611 348 -261 -526 -943 -734 -44 -88 406 598 552 312 -264
2398b64j5k16n8o4Q96J30rL56k33l80l67l62M9K24K1K04Q61j39n31j05j65l65
$$ -264 -279 -495 -553 -617 279 409 400 756 523 143 -224 -586 -537 -313 -292 -88 773 634 103 -2 -167 -532
2420e32r0K03K19M48L40K5R6m35l76k78p9m4LL86L07L01O6j73m44k35k37J3R0
$$ -532 -622 -419 -200 248 588 613 709 274 -102 -380 -459 -503 -500 -114 193 494 560 387 -57 -292 -529 -516 -426
2443d26K58N31K07K90m01l61k82k99j55q3L25L85N18RJ50l50k05n31k70J93J10
$$ -426 -168 363 570 860 459 98 -184 -483 -638 -721 -396 -11 507 516 666 316 111 -420 -690 -497 -387
2464c87N18L63K26J87n05k68k95k36j52j59M57M55K32P8R4o30k78m06K95k18L01
$$ -387 131 494 720 907 402 134 -161 -397 -549 -708 -251 204 436 514 608 -22 -300 -706 -411 -629 -328
2485c28N03K85K76p1j63l46m20l07j36N33K56L56M3n6L4l07l19j63k00O1N60K12
$$ -328 175 460 736 665 502 156 -264 -571 -707 -174 82 438 481 425 459 152 -167 -330 -530 -469 91 303
2507C03J45J66R8k64n11k17m42L52O5R4P37j15k38O5k87l5n80Q2M44Q2L67J3J46
$$ 303 448 614 712 448 -63 -280 -722 -370 -305 -211 526 411 173 238 -49 -84 -664 -582 -138 -56 311 324 470
2530D70j62j75n01j99O8KK73K06N97R7k51k40l80P1n17L88J83j13N26K69j10K7
$$ 470 308 133 -368 -567 -499 -497 -224 -18 579 676 425 185 -195 -124 -641 -253 -70 -183 343 612 502 529
2552E29l74j88n34j8j27P80k4M02O4o2l00m36J7j37J0K25O10J04r4k3l98n9j38
$$ 529 155 -33 -567 -585 -712 68 44 446 510 448 148 -288 -271 -408 -398 -173 437 541 447 424 26 -33 -171
2575a71k79L32l27N96m5M21J25n45pn9p10K14j6N48L45J68k25k4j38l96n79m0
$$ -171 -450 -118 -445 151 106 527 652 107 100 41 -669 -455 -471 77 422 590 365 341 203 -193 -772 -812
2597h12M86j50P04k4J01J02j06l0o42j4l9R6M60J1K21K15j92k04p52l8K32k2K88
$$ -812 -326 -476 228 204 305 407 301 271 -371 -385 -424 -328 132 143 364 579 387 183 -569 -607 -375 -397 -109
2620a09K91O86k52m02k51K24o44q2K70R3K66K33K07J0o0p58L98m38k91q3N57M69
$$ -109 182 868 616 214 -37 187 -457 -539 -269 -176 90 323 530 540 480 -278 120 -318 -609 -692 -135 334
2642C34R4N5j7k46m65k87Q6J97K92R8j43N43k52n5k51m11k63L17K07K48K53Q6
$$ 334 428 483 466 220 -245 -532 -446 -249 43 141 -2 541 289 234 -17 -428 -691 -374 -167 81 334 420
2664D20l4l0l89j78l83J68O8M89L31p0j10p8m22p2k20L1J81N2L79LM04M4o06n7
$$ 420 386 356 -33 -211 -594 -426 -358 131 462 392 282 204 -218 -290 -510 -479 -298 -246 133 136 540 584 -22 -79
2688g9k5k42k0J30M21J10K2K6j53q2m24K0j18M55J11J18J94j90J95l00j26%m42
$$ -79 -104 -346 -366 -236 185 295 317 343 190 108 -316 -296 -414 41 152 270 464 274 469 169 43 43 -399
2711c99J36K88J89R3K07k39k47l28r0N1j85K73J03O84j71p8N5l43j19k92O3Q2
$$ -399 -263 25 214 307 514 275 28 -300 -390 -339 -524 -251 -148 536 365 287 342 -1 -120 -412 -349 -267
2733b67M97r0K6L13j00k83l38p9p6J71N7L45P4R1n4N3n26j89J86j35oM07K50J92
$$ -267 230 140 166 479 379 96 -242 -321 -397 -226 -169 176 250 341 287 340 -186 -375 -189 -324 -330 77 327 519
2757E19l99j52l54L06j44l18K83L10K56j32J92k06q6n09L59k49R5L83K12J13l05
$$ 519 120 -32 -386 -80 -224 -542 -259 51 307 175 367 161 75 -434 -75 -324 -229 154 366 479 174
2778A74R2l97J20m26J10l8p6N69j09L33J63P3m56l35LJ4L6J78L45j52J64k08k13
$$ 174 266 -131 -11 -437 -327 -365 -441 128 19 352 515 588 132 -203 -200 -186 -150 28 373 221 385 177 -36
2801c6k40j20j2lK63L58MJ59j20k85j03k21l8K00K34J70J0O7j20L40m44j42j89
$$ -36 -276 -396 -408 -411 -148 210 214 373 253 -32 -135 -356 -394 -194 40 210 220 287 167 507 63 -79 -268
2824b68j1k1J33M32J62%Qn73J41n07K17p0R8L45J47M44m52j78M7k60R2m21N94
$$ -268 -279 -300 -167 265 427 427 435 -138 3 -504 -287 -357 -259 86 233 677 225 47 94 -166 -74 -495 99
2847I9J06J2J65K0j17m84j6k45K60J66j56L62Q9k1l95J85j82k87QJ15L40J21k2
$$ 99 205 217 382 402 285 -199 -215 -460 -200 -34 -190 172 261 240 -155 30 -152 -439 -431 -316 24 145 123
2870A23J22J4j73q2k27j39LK02K16J42J15l8k77J72n89J20l82N48J42J19K60J10
$$ 123 245 259 86 4 -223 -362 -359 -157 59 201 316 278 1 173 -416 -296 -678 -130 12 131 391 501
2892E01k98r5k22j1m58L44K6R7J42J74R1m46j00j21j02L80J63n9M11j13M2k84
$$ 501 203 108 -114 -125 -583 -239 -213 -116 26 200 291 -155 -255 -376 -478 -98 65 6 417 304 346 62
2914F2M0m57K78j13Q9n4K98PK58l98n8Kj99p4N2K68j14N34k50J01k81l8Mk41m3
$$ 62 102 -355 -77 -190 -101 -155 143 150 408 10 -48 -46 -245 -319 -267 1 -113 421 171 272 -9 -47 -43 -284 -327
2939c27L67m0J30k17L22K23m89O1j23k24j45N94p2J17J96j07k31rk99J25j37l7
$$ -327 40 0 130 -87 235 458 -31 30 -93 -317 -462 132 60 177 373 266 35 26 -273 -148 -285 -322
2961c22KM44J87l55J59l3j35k02n8K08K37m7L9p1K41n31K4n9n6K17r1J87N3k9
$$ -322 -320 124 311 -44 115 82 -53 -255 -313 -105 132 85 124 53 294 -237 -213 -272 -328 -111 -202 -15 38 9
2985IJ62o5l24l6M6j86J86O28k26j5L9p9k87k1r6Q7N5K7M14k51J51q9M3l15j0
$$ 9 171 106 -218 -254 -208 -394 -208 420 194 179 218 139 -148 -169 -265 -178 -123 -96 318 67 218 129 172 -143 -153
3010a53k64M53k59L04J52j70K11q0q2m03L1N7M4L71o0k22L36m75J33j04j7k9K64
$$ -153 -417 36 -223 81 233 63 274 194 112 -291 -260 -203 -159 212 152 -70 266 -209 -76 -180 -197 -226 38
3033C8J36j6j02P0N1k04O1j55o3p2J46J95J23J24j94m77J14OK2j99M33q3J18o2
$$ 38 174 158 56 126 177 -27 34 -121 -184 -256 -110 85 208 332 138 -339 -225 -219 -197 -396 37 -46 72 10
3057A0M81k20k70l74q9M30j60J25J70K1j54K7O9l48O1lJ14M21m57K08J30J09k62
$$ 10 491 271 1 -373 -462 -32 -192 -67 103 124 -30 -3 66 -282 -221 -224 -110 311 -146 62 192 301 39
3080C9o8j10j88J60l7K78J54l53K13j29j56l4o5K13P8j4J12J35J57p9k84o1nl12
$$ 39 -29 -139 -327 -167 -204 74 228 -125 88 -41 -197 -231 -296 -83 -5 -19 93 228 385 306 22 -39 -44 -356
3104c56N4K74M3j67M05J29l66k90J56j12K13K66k01J02j76J69o9N4k63P2n8J4
$$ -356 -302 -28 15 -152 253 382 16 -274 -118 -230 -17 249 48 150 -26 143 74 128 -135 -63 -121 -107
3126a07r1M29j5P3j31k62%k65L72j51K0K25J25o8p5K95l49j27J28j12k40N25k27
$$ -107 -198 231 216 289 158 -104 -104 -369 3 -148 -128 97 222 154 79 374 25 -102 26 -86 -326 199 -28
3149b8J78J7j51J38k43P9k63M48j42J32n6O8n1j5m44R4J42J71j82Q2P8J97j70
$$ -28 150 167 16 154 -89 -10 -273 175 33 165 109 177 126 111 -333 -239 -97 74 -108 -26 52 249 79
3172G9j71L9J25k44nK19N1j39L48j2j31j85j23K19l77L29m96N02J48j8q4n3j1
$$ 79 -92 -53 72 -172 -177 42 93 -46 302 290 159 -26 -149 70 -307 22 -474 28 176 158 74 21 10
3195A0j05r2K54k47L08j09K15n0j65J09j5m54J14nL37o0J0J84j95p6k1Rj3j57
$$ 10 -95 -187 67 -180 128 19 234 184 19 128 113 -341 -227 -232 105 45 55 239 44 -32 -53 -44 -57 -214
3219b14J54L49j93K76j45m2r9j19r6K96l15L09j60m4J24J32l86m0K7m0N9K93j79
$$ -214 -60 289 96 372 227 185 86 -33 -129 167 -148 161 1 -43 81 213 -173 -213 -186 -226 -167 126 -53
3242e3J43K39k15j2j54p3n2q4J36K71K6j28J00j40m0J49l8R3j18J88K5k98J20
$$ -53 90 329 114 102 -52 -125 -177 -261 -125 146 172 44 144 4 -36 113 75 168 50 238 263 -35 85
3265H5j12L9p5j8J3L2J84j3j33Q2m8J06r2p7K0k74M80j55K04j64q9J06l38J68
$$ 85 -27 12 -63 -81 -68 -36 148 135 2 84 36 142 50 -27 -7 -281 199 44 248 84 -5 101 -237 -69
3289f9j71J77m0N8K11k62K53J86m38P3R6r1M1k12J81J15N7m84K28p3q3K37k52
$$ -69 -240 -63 -103 -45 166 -96 157 343 -95 -22 74 -17 24 -188 -7 108 165 -319 -91 -164 -247 -10 -262
3312b62J12L24o8Kj06J1j06Q1k2p3J53O4j76J09PJ44j01n49K15J78q6j45M37l6
$$ -262 -150 174 106 108 2 13 -93 -12 -34 -107 46 110 -66 43 50 194 93 -456 -241 -63 -149 -294 143 107
3336A07j3o3J25J2l9n7k95K97J79j63j01o5P8k61L42p8q4k69M28p8P2nL30k51
$$ 107 94 31 156 168 129 72 -223 74 253 90 -11 -76 2 -259 83 5 -79 -348 80 2 74 69 399 148
3360A48m6k49j45M09p1O7j2K46l12j12K0j01O7l7N0N64l85O1K6j07j35j84K20
$$ 148 102 -147 -292 117 46 113 101 347 35 -77 -57 -158 -91 -128 -78 486 101 162 188 81 -54 -238 -18
3383a8o9m4K42j70P2M5J65o0l93O7n2L7JJ51J66q5L5j13j41P8p6m7K31l9J49Q3
$$ -18 -87 -131 111 -59 13 58 223 163 -230 -163 -215 -178 -177 -26 140 55 90 -23 -164 -86 -162 -209 22 -17 132 215
3409B15l14k99Q08l22j06J50r9p7J77O9M0nl94j96R0K07k4J61K3l72K25J18P1
$$ 215 -99 -398 410 88 -18 132 33 -44 133 202 242 237 -157 -353 -263 -56 -80 81 104 -268 -43 75 146
3432A46k65j08lJ03J86%P4j83J22J96l20M8qj96L88j5j66n6kj19J88j07J08o5
$$ 146 -119 -227 -230 -127 59 59 133 -50 72 268 -52 -4 -12 -208 180 165 -1 -57 -59 -178 10 -97 11 -54
3456e4J86J4M5m08J42K43q5K41n98M99k86L43k41j73L74j55k21J20r2L4j65K06
$$ -54 132 146 191 -217 -75 168 83 324 -274 225 -61 282 41 -132 242 87 -134 -14 -106 -72 -237 -31
3478c1J61j20R3j64k4K36m19J61J32J4K9r5L5Nk53J12r3L08o4j0j47K76j31j52
$$ -31 130 10 103 -61 -85 151 -268 -107 25 39 68 -27 8 13 -240 -128 -221 87 23 13 -134 142 11 -141
3502a41L09j77m6O2Lj50J63k22K98r0J32j18j92J10K9k17M49j34n2rK37j43P0
$$ -141 168 -9 -55 7 10 -140 23 -199 99 9 141 23 -169 -59 -30 -247 202 68 16 7 244 101 171
3525A71k53O7j99P9K17n9L29l17j21L89k56J1k48MK9M5J93K47l5m48K16K2o9j50
$$ 171 -82 -15 -214 -135 82 23 352 35 -86 303 47 58 -190 -186 -157 -112 81 328 293 -155 61 83 14 -136
3549a36p8J38J57J00l23K34k53mK49kj20K31R0q4k31l6K45pj10k46O0K88j6J8
$$ -136 -214 -76 81 181 -142 92 -161 -165 84 82 -38 193 283 199 -32 -68 177 170 60 -186 -126 162 146 164
3573A64L4r6o2J20l3M2l83M72k96L70j89l2J12J3P3l18j29J04j41K63J09M0n31
$$ 164 198 102 40 160 127 169 -214 258 -38 332 143 111 223 236 309 -9 -138 -34 -175 88 197 237 -294
3596b94K89K31k64k07L0K53j00lL00m38R7mP7J43k78J73j88J50j76K84O5k29R
$$ -294 -5 226 -38 -245 -215 38 -62 -65 235 -203 -106 -110 -33 110 -168 5 -183 -33 -209 75 140 -89 -80
3619h0J66j76K45J4k00K33j66K7r8J74j95j06N6J2Q6O8l11K81j70M3L33l84M38
$$ -80 86 -90 155 169 -31 202 36 63 -35 139 -56 -162 -106 -94 -8 60 -251 30 -140 -97 236 -148 290
3642B90k49j63J87j94K5l9J57j53L53l45Q0Or5k1K12j90j27L54n2j32Or3M32k06
$$ 290 41 -122 65 -129 -104 -143 14 -139 214 -131 -51 -45 -140 -161 51 -139 -266 88 36 -96 -90 -183 249 43
3666D3k77J5K30K76j26k17J65L0n6k32M4J64j19j81n2K61K45l60K83l10J62M39
$$ 43 -234 -219 11 287 161 -56 109 139 83 -149 -105 59 -60 -241 -293 -32 213 -147 136 -174 -12 427
3688D27n32L98j20k07q6j79M57q5k0n1J68J7k65R2j30J57R1K53l99J3O6m5J27
$$ 427 -105 293 173 -34 -120 -299 158 73 53 2 170 187 -78 14 -116 41 132 385 -14 -1 65 20 147
3711A47M9k70l2k04K66N8R3m60N72p0K31o13J59j8J75Mp8j63L23o1J51l05K31
$$ 147 196 -74 -106 -310 -44 14 107 -353 219 149 380 -233 -74 -92 83 87 9 -154 169 108 259 -46 185
3734A85l28M04l7l26q7K69J29m08K93qq3l28J55N4L34k03l6j36J73j00J57J00
$$ 185 -143 261 224 -102 -189 80 209 -199 94 86 3 -325 -170 -116 218 15 -21 -157 16 -84 73 173
3756A73q1o3O6k39K51J47k93Q8j17J05r9j9J05j69JJ82J9r8k4J95O8j01O3j23
$$ 173 92 29 95 -144 107 254 -39 49 -68 37 -62 -81 24 -145 -144 38 57 -41 -65 130 198 97 160 37
3780C7L2j15J68l9j18k95L63j61o9N82k16r7P5n7J1j20O4k02o9N4L23K0m16L08
$$ 37 69 -46 122 83 -35 -330 33 -128 -197 385 169 72 147 90 101 -19 45 -157 -226 -172 151 171 -245 63
3804F3L7k45K45j63K37n9j89J82j06j42J74r3J49p5j19J16J48lk29J20j72P9O1
$$ 63 100 -145 100 -63 174 115 -74 108 2 -140 34 -59 90 15 -104 12 160 157 -72 48 -124 -45 16
3827A6J83p2r2nQ9j69K98j90N4J14J43n30P0J50m7j0p6K18J7k76J37K23l10j2
$$ 16 199 127 35 30 119 -50 248 58 112 226 369 -161 -91 59 12 2 -74 144 161 -115 22 245 -65 -77
3851g7N2J7j18j9J21K59l94J93j1Qj48r5L46l52K07j13J4L19p48M16j6O7q9K04
$$ -77 -25 -8 -126 -145 -24 235 -159 34 23 31 -117 -212 134 -218 -11 -124 -110 209 -539 -123 -139 -72 -161 43
3875D3L9j77K6R2Q9k12Q7J57K85n31J27J34p8l04L62R1q7L9l94jK78j37O9P8q8
$$ 43 82 -95 -69 23 112 -100 -13 144 429 -102 25 159 81 -223 139 230 143 182 -212 -213 65 -72 -3 75 -13
3900a3r8N6j0m0K18N6j96l6J36Q6k86K95m32k9L19K2J51j69L5K36l56R9r4l6K64
$$ -13 -111 -55 -65 -105 113 169 -27 -63 73 159 -127 168 -264 -293 26 48 199 30 65 301 -55 44 -50 -86 178
3925A78m57R5L13J77m49K46k0k69Q9j5R0k26N1L10k93J48J94j49J53k57R1J27
$$ 178 -279 -184 129 306 -143 103 83 -186 -97 -112 -22 -248 -197 113 -180 -32 162 13 166 -91 0 127
3947A27r3J24l27M05k5n16M29r5Q4k9l29J91J6o2K33j56j27L7L9J80o1L7j66O9
$$ 127 34 158 -169 236 211 -305 124 29 113 84 -245 -54 -38 -100 133 -23 -150 -113 -74 106 45 82 -84 -15
3971a5J08j0o1j6K20l50J83q2j49L11J27k32J63j39p6m2P2K5j14q7R1L1O6J10
$$ -15 93 83 22 6 226 -124 59 -23 -172 139 266 34 197 58 -18 -60 12 37 -77 -164 -73 -42 24 134
3995A34p7KN1k28m7j16L69J38n4k14O8k05K51L6j00Q5%o6j93J58J35j36K18k52
$$ 134 57 59 110 -118 -165 -281 88 226 172 -42 26 -179 72 108 8 93 93 27 -166 -8 127 -9 209 -43
4019d3L8J0qK81p22N49J63q6l96O5K9K9J60P6j09m3M2K3J84l76J5j78J23K87j11
$$ -43 -5 5 -3 278 -444 105 268 182 -214 -149 -120 -91 69 145 36 -7 35 58 242 -134 -119 -297 -174 113 2
4044Bj8K3J80J06j10l5j35R3l64J17K62k55q6L31R1k14j82K51q3K14J1j46L0j66
$$ 2 -16 7 187 293 183 148 13 106 -258 -141 121 -134 -220 111 202 -12 -194 57 -26 188 199 53 83 -83
4068h3o4K2M45m22j47K88j30r4L37p9j60K8k16M54k66q8J55M1m5J86k4o27N71
$$ -83 -147 -125 320 -102 -249 39 -91 -185 152 73 -87 -59 -275 179 -87 -175 -20 21 -24 162 138 -489 82
4091H2k10K57j85J05lk32J30Q3J13m6j82Q0O2l7J06j97K92k99M4R4k26K11r4k04
$$ 82 -128 129 -56 49 46 -186 -56 27 140 94 -88 -8 54 17 123 -74 218 -81 -37 57 -169 42 -52 -256
4115b56L32m2l3o9K09l61J05K90k51N8q8K08o3j10M5J65m2j09k35L65k44R0L3
$$ -256 76 34 1 -68 141 -220 -115 175 -76 -18 -106 102 39 -71 -26 139 97 -12 -247 118 -126 -36 -3
4138cj6j33J28q8JL7k1OR3M1n9P0m6o2k1J77j83n4J92j26O7l9Q9m8Q9k1j66M2
$$ -3 -19 -152 -24 -112 -111 -74 -95 -89 4 45 -14 56 10 -52 -73 104 -79 -133 59 -67 0 -39 50 2 91 70 -96 -54
4166e4K32j42j07j22K73J98l71L18l34N8K52Ml17J28k19K79m4Nj84L18j49k61
$$ -54 178 36 -71 -193 80 278 -93 225 -109 -51 201 205 -112 16 -203 76 32 37 -147 171 22 -239
4188b39M10j89O2p1J54r9j18Q7k12K67j83K44j46M3p8p5K51n0oO0j29j14K51j64
$$ -239 171 -18 44 -27 127 28 -90 -3 -215 52 -131 113 -33 10 -68 -143 108 58 52 112 -17 -131 120 -44
4212d4K9K2j56K08OJ19j6Ll3j11p2l0L0R1m7k3O6m6N4K0Q2k70J36k86N24q7l74
$$ -44 -15 7 -149 59 65 184 168 171 138 27 -45 -75 -45 46 -1 -24 42 -4 50 70 152 -118 18 -268 256 169 -205
4239b05K13K08k68J44M9k3j5j47L3l7l6j27M20L8O3k27j63P6j5M7O1q1K06j45
$$ -205 8 216 -52 92 141 118 103 -44 -11 -48 -84 -211 209 247 310 83 -80 -4 -19 28 89 8 214 69
4263F9J07k40K93j33P1O6j90k07J27J98j09j6j61Q4J28l74L36j29K28m4J28k18
$$ 69 176 -64 229 96 167 233 43 -164 -37 161 52 36 -125 -41 87 -287 49 -80 148 104 232 14
4285A4N5k11n2L51k07M4kL53k61j35%m7j49M56k79kJ81j18Kk2N6Q0k43K9n0K02
$$ 14 69 -142 -194 157 -50 -6 -8 345 84 -51 -51 -98 -247 209 -70 -72 109 -9 -7 -29 27 107 -136 -107 -157 45
4311D5J02J63m82Q4K11j89J01L7n3j00J25J20j66O0J4m6j7j65J23o3K44j38r5
$$ 45 147 310 -172 -88 123 -66 35 72 19 -81 44 164 -2 58 72 26 9 -156 -33 -96 148 10 -85
4334h5L34j45r9j91J66m6K97o20M20J71J7O8k57pO3k46J88j89J95k26J42j15L55
$$ -85 249 104 5 -186 -20 -66 231 -389 31 202 219 287 30 23 86 -160 28 -161 34 -192 -50 -165 190
4357A90j62m8M9k5r2P3J66Q4n9l28R9J57k24J21kj54n5J41J84l56J45K6jK03l18
$$ 190 28 -20 29 4 -88 -15 151 235 176 -152 -53 104 -120 1 -1 -155 -210 -69 115 -241 -96 -70 -71 132 -186
4382a86R4o3P1L10O8m20Q0J54j93J5j34K48L81j5k12q3j23m1O9j71R0K46j67N8
$$ -186 -92 -155 -84 226 294 -126 -46 108 -85 -70 -204 44 425 410 198 115 -8 -49 20 -151 -61 185 18 76
4406G6k84L83j65j45J57l1j31J8N7M00m70J97nN3Q7m82R2Q5K0K10j5k39N3J68
$$ 76 -208 175 10 -135 22 -9 -140 -122 -65 335 -135 62 57 110 197 -285 -193 -108 -88 122 107 -132 -79 89
4430H9J63l94J10J09o9n3L65m34J96P9j97o0J23L6j21j5J72j67J65j8p1j94K13
$$ 89 252 -142 -32 77 8 -45 320 -114 82 161 -36 -96 27 63 -58 -73 99 -68 97 79 8 -186 27
4453B7M6m10J76J99p5M2N1K5l30K32jk0P5j23Q4J54Q8l27J37j38L36j51j15q9
$$ 27 73 -337 -161 38 -37 5 56 81 -249 -17 -18 -38 37 -86 -2 152 240 -87 50 -88 248 97 -18 -107
4477a07RK93j8m41N17k80L0m8k77K09J08J42j22L9o0m00K63J08j8JL10k14J85
$$ -107 -98 195 177 -264 253 -27 3 -45 -322 -113 -5 137 15 54 -6 -406 -143 -35 -53 -52 258 44 229
4500B29j41%j39o0L0m6P4j3j7j36K01J14k54N3J15J01k61J08j9J31j90R6J57l11
$$ 229 88 88 -51 -111 -81 -127 -53 -66 -83 -219 -18 96 -158 -105 10 111 -150 -42 -61 70 -120 -24 133 -178
4524a78J64M3J16j62K74l99K21P1j43j87L04k33L5n5P4P9j68L29J09j37M3m65
$$ -178 -14 29 145 -17 257 -142 79 150 7 -180 124 -109 -74 -129 -55 24 -144 185 294 157 200 -265
4546b65J34R8q0K66K44n55Q3K25m24K98l86L22K3QJ1l3J40k06O3l8m7K39m73K87
$$ -265 -131 -33 -113 153 397 -158 -75 150 -274 24 -362 -40 -17 -9 2 -31 109 -97 -34 -72 -119 120 -353 -66
4570f6L32k02l1on7j34J68J71j74J04k31K82k36j4M01k94j40J08K20k33J45k37
$$ -66 266 64 33 27 -30 -164 4 175 1 105 -126 156 -80 -94 307 13 -127 -19 201 -32 113 -124
4592a24J14M62m30j49Lj03J52J32l17J86K64l27J89j82L61m9j05Qj09J36l39R6
$$ -124 -10 452 22 -127 -124 -227 -75 57 -260 -74 190 -137 52 -130 231 182 77 85 -24 112 -227 -131
4614a31M32k08l23J21J13j33J23L9p9N3R0O2O3j57J24l29N6K41j48K64O3k1m80
$$ -131 301 93 -230 -109 4 -129 -6 33 -46 7 97 159 222 65 189 -140 -84 157 9 273 336 315 -165
4637a65m0K4L8K7O6n3m6J79J44j81r4R3J64j99J32q0J80j35rKm7J70o71N86M9
$$ -165 -205 -181 -143 -116 -50 -103 -149 30 174 -7 -101 -8 156 -43 89 9 189 54 45 47 0 170 -501 85 134
4662A34l21N28k78O4k17L7m7J54p0K18m55m2N55p8j99j08P1j93K80O3p5j07K05
$$ 134 -187 341 63 127 -90 -53 -100 54 -16 202 -253 -295 260 182 -17 -125 -54 -247 33 96 21 -86 119
4685A19N0L1kj52l16L74l83L77j68J3j81L54j59K13j95Q9J9Qj42j0K66m57L35
$$ 119 169 200 198 46 -270 104 -279 98 -70 -57 -238 116 -43 170 -25 64 83 91 -51 -61 205 -252 83
4708H3O4k54J12l22K47K65k09j18K48Nk9k10j76L69m4j25J68O7o5p5j53M94k54
$$ 83 147 -107 5 -317 -70 195 -14 -132 116 121 92 -118 -294 75 31 -94 74 141 76 1 -152 342 88
4731H8k16j43L52q6J20k37L04l44J74Q7P8l79K18J09J01k5k05R9n3P2k29J62k66
$$ 88 -128 -271 81 -5 115 -122 182 -162 12 99 177 -202 16 125 226 201 -4 95 42 114 -115 47 -219
4754b19K61m6l0K36p6o8p0k45M27m47J59O9J7K27l23K81j62q9m5J9O9M5r6L62
$$ -219 42 -4 -34 202 126 58 -12 -257 170 -277 -118 -49 -32 195 -128 153 -9 -98 -143 -124 -55 -10 -106 256
4778B56m46K45OJ0j19k10J66L9r5K70Q3O3m38r0M64j58k93L05k6l18M06j10rM7
$$ 256 -190 55 61 71 -48 -258 -92 -53 -148 122 205 268 -170 -260 204 46 -247 58 32 -286 120 10 1 48
4802D8K6J87k46J29l15J39j24K38J78k39n7J9L9j2K6j11j9j0J84k1K27j44j50
$$ 48 74 261 15 144 -171 -32 -156 82 260 21 -36 -17 22 10 36 -75 -94 -104 80 59 286 142 -8
4825hj13L10j25k30J51Q9m4l9j50o6K14R3j3j5K22j71N9k90K23L0k1j29r9O2J80
$$ -8 -121 189 64 -166 -15 74 30 -9 -159 -225 -11 82 69 54 276 105 164 -126 97 127 106 -23 -122 -60 120
4850A20j30j16L13j91R3l00J28j88J60M5Po8L55j25n16N58k68J08q3j34J77K37
$$ 120 -10 -126 187 -4 89 -211 -83 -271 -111 -66 -59 -127 228 103 -413 145 -123 -15 -98 -232 -55 182
4872A82k01q6j08K86k11K69k39J95k0L7j0K4n6k24J66j04K16n4j21J89J86k03
$$ 182 -19 -105 -213 73 -138 131 -108 87 67 104 94 118 62 -162 4 -100 116 62 -59 130 316 113
4894A13q5j44P6J82j97J25j03k05K00R1K16r2m4k51M7j30J0j5K27r8r3L05K7j35
$$ 113 28 -116 -40 142 -55 70 -33 -238 -38 53 269 177 133 -118 -71 -201 -191 -206 21 -77 -170 135 162 27
4918B7k10J48P4j97J66j18K95j33l0K23R0j82j17j35J41N2n7j35K03m7j63J33
$$ 27 -183 -35 39 -158 8 -110 185 52 22 245 335 153 36 -99 42 94 37 -98 105 58 -105 28
4940B8plP7K20l74J99k86J55n0l0K12j21K29n11L57J52j96J2j6J2r9k86L92Q3
$$ 28 21 18 95 315 -59 140 -146 9 -41 -71 141 20 249 -262 95 247 51 63 47 59 -40 -326 66 149
4964A49M3L7k68L26n12J9J78Q1R6l13L04K07k97j17J80o4j21L0m0J22J27k55K27
$$ 149 192 229 -39 287 -225 -206 -28 53 149 -164 140 347 50 -67 113 49 -72 -42 -82 40 167 -88 139
4987A39l6j65q9l1O3J01PJ60j58p3J09K06n69J42K73j13K73k04M4J77k94Q9J9
$$ 139 103 -62 -151 -182 -119 -18 -11 149 -9 -82 27 233 -336 -194 79 -34 239 35 79 256 -38 51 70
5010G0J2k23J57p7r1K94k24O8j64J71J27l31K76p1K5r3j46J26J61l18P9J17j86
$$ 70 82 -141 16 -61 -152 142 -82 -14 -178 -7 120 -211 65 -6 19 -74 -220 -94 67 -251 -172 -55 -241
5033b41K76J04k66O8J75p1N3n4M7O9j91Q6j90O6J95j3j59k07K01N2k60J53K5m0
$$ -241 35 139 -127 -59 116 45 98 44 91 160 -31 55 -135 -69 126 113 -46 -253 -52 0 -260 -107 -82 -122
5057a22J96J57l25J76j46j06J96j00m9J02K0L01m12Rq9m4J79J31j4l35L06J2j80
$$ -122 74 231 -94 82 -64 -170 26 -74 -123 -21 -1 300 -112 -103 -192 -236 -57 74 60 -275 31 43 -137
5080a37R0j00O0n7J18J00oP7%k37R3k61K63J31k88J64l55K82j18L22j57L2O6j93
$$ -137 -47 -147 -87 -144 -26 74 68 145 145 -92 1 -260 3 134 -154 10 -345 -63 -181 141 -16 16 82 -111
5104a11L6J08PJ44n9j22n1J20o3K2P5l07K02L9K78n21J39L31l66J18j67Q3k4l2
$$ -111 -75 33 40 184 125 3 -48 72 9 31 106 -201 1 40 318 -203 -64 267 -99 19 -148 -65 -89 -121
5128a21m8L75l52P8J69J70m01J32j41r5L71k15pK57k84K09L1q6P5l48L25o4J50
$$ -121 -169 206 -146 -68 101 271 -130 2 -139 -234 137 -78 -85 172 -112 97 128 42 117 -231 94 30 180
5151A80j73j36K1j85P6K48k24L11j33m2l8L38l27j42K17M2p7K2O4m7k37M06p9
$$ 180 7 -129 -108 -293 -217 31 -193 118 -15 -57 -95 243 -84 -226 -9 33 -44 -22 42 -5 -242 164 85
5174H5q6k87L92k47k03L46R9j7k62L16q2K5k55N6K82k05j59K14J08q0M8M1l21
$$ 85 -1 -288 104 -143 -346 0 99 82 -180 136 54 79 -176 -120 162 -43 -202 12 120 40 88 129 -192
5197a92K07o5pN5J44J89k58r4L8j0m0NJ43j89K13j3O2l26J74j56P6J8J71l58M00
$$ -192 15 -50 -57 -2 142 331 73 -21 17 7 -33 -28 115 -74 139 126 188 -138 36 -120 -44 -26 145 -213 187
5222A87r4M5j01j2j64p1M39j95K6k15J68j69Q9J43q6J79q6p1pj20L03q1j10j24
$$ 187 93 138 37 25 -139 -210 229 34 60 -155 13 -156 -67 76 -10 169 83 12 5 -115 188 107 -3 -127
5246a27J03m16N49j45n8R1MJ39k87N18l17k8n3k07%J78J32j98R5J13j68j50J32
$$ -127 -24 -440 109 -36 -94 -3 1 140 -147 371 54 26 -27 -234 -234 -56 76 -122 -27 86 -82 -232 -100
5269a00N8Q5k27K04J78j17L1N3k75K76j28O4K22l36j99K14K39k87P7NL01j75k94
$$ -100 -42 43 -184 20 198 81 112 165 -110 166 38 102 324 -12 -211 3 242 -45 32 37 338 163 -131
5292a31K99k43J30L7j26P5l1r6P3rj87M88l86K43n5l9J72l39K74o0j41J09k05
$$ -131 168 -75 55 92 -34 41 10 -86 -13 -22 -209 279 -107 136 81 42 214 -125 149 89 -52 57 -148
5315a48j73J29r7M82k36L7p5J77j37K5L86n20M02l58k8K37q8M5l25J33OL54ol10
$$ -148 -321 -192 -289 193 -43 -6 -81 96 -41 -16 370 -150 252 -106 -134 103 15 60 -265 -132 -126 228 222 -88
5339h8M7M22j52j75K8pj86k84K93K45JO1j29l26N8M3Q4q0L49k22JJ55j69oj65
$$ -88 -41 381 229 54 82 75 -111 -395 -102 143 144 205 76 -250 -192 -149 -65 -145 204 -18 -17 138 -31 -37 -202
5364b02n6L19j8O7O0j01k7K1k39K26N3l00M01j12P8j21n9R9M2l0j57j43L65j92
$$ -202 -258 61 43 110 170 69 42 63 -176 50 103 -197 204 92 170 49 -10 89 131 101 -56 -199 166 -26
5388b6P5J0Q9k47j3L78n36K73N7k53J73q4j24K56P4k15l6O7l10M14r7K4o7J53
$$ -26 49 59 148 -99 -112 266 -270 3 60 -193 -20 -104 -228 28 102 -113 -149 -82 -392 22 -75 -51 -118 35
5412C5j76K14J09l67Q3J85k14m9J9k1J06J70k52J6J99J01n9J0jk63K43M1j43k2
$$ 35 -141 73 182 -185 -102 83 -131 -180 -161 -182 -76 94 -158 -142 57 158 99 109 108 -155 88 129 -14 -36
5436c6K3K84j96j62M4O2K52k08j5k49J03j47L91l29L44O7L9j66QLk78N8N6Mj31
$$ -36 -13 271 75 -87 -43 19 271 63 48 -201 -98 -245 146 -183 161 228 267 101 109 112 -166 -108 -52 -48 -179
5461a79K48K9P1k43J90O8k83K45m0P9j24J96k76k9J43l86M62m03N3J24n9J90j07
$$ -179 69 98 169 -74 116 184 -99 146 106 185 61 257 -19 -48 95 -291 171 -232 -179 -55 -114 76 -31
5484c1K08J8m01k8J26J77j70r2L02l69N15m79L34j16J7j86J42O6P5k6n5j58K94
$$ -31 177 195 -206 -234 -108 69 -101 -193 109 -260 255 -224 110 -6 11 -175 -33 33 108 82 27 -131 163
5507A63r0j6l21J52lR8J21j31j5K96j99k01j03L76k8k03K83Kl22J54n3K4P2n5
$$ 163 73 57 -264 -112 -115 -17 104 -27 -42 254 55 -146 -249 127 99 -104 179 181 -141 13 -40 -16 56 1
5531AN2m16N43l19J55L56l76L8j77k38L07J40o5q7K83r1k3l03M39j54j44Q0P2
$$ 1 53 -363 180 -139 16 372 -4 34 -143 -381 -74 66 1 -86 197 106 83 -220 219 65 -79 1 73
5554G3l4K52m60J62j02J13n1j30J72n4j48L95M4k79K10j77J58j33j3Np9J7n0j91
$$ 73 39 291 -169 -7 -109 4 -47 -177 -5 -59 -207 188 232 -47 163 -14 144 11 -2 3 -76 -59 -109 -300
5578c00K19q4Q1J74R9j70r1j04M42j53k24L46l55L3K5j13K38k55L82k41J81j23
$$ -300 -81 -165 -84 90 189 19 -72 -176 266 113 -111 235 -120 -87 -62 -175 63 -192 190 -51 130 7
5600GL43k78o1n1j45K30m4M16l81j59O3N0J09j17j02J8L08j21m8K76l59L1mN0
$$ 7 350 72 11 -40 -185 45 1 417 36 -123 -60 -10 99 -18 -120 -102 206 85 37 313 -46 -15 -19 31
5624C1k16J32N6n8q0L59k75Q9j04K26l36j08j6L91q8Rn2p9L6r2J58qkR9J40j61
$$ 31 -185 -53 3 -55 -135 224 -51 38 -66 160 -176 -284 -300 91 3 12 -40 -119 -83 -175 -17 -25 -27 72 212 51
5650E1n9O5j32k5k51J99J42J4k32L00J25j53kQ9j59J92k47K48k01J37o2N3j25
$$ 51 -8 57 -75 -100 -351 -152 -10 4 -228 72 197 44 42 131 -28 164 -83 165 -36 101 39 92 -33
5673c3K0Q5k78J64J81m90K20K92k66J09j16K17k03K5P3J92j29k88R8K14l20L04
$$ -33 -13 72 -206 -42 139 -351 -131 161 -105 4 -112 105 -98 -73 0 192 63 -225 -127 87 -233 71
5695G1j31k83L20K5j19J22o8M5M6P4k27L32l41N7j57N93l49m7j4R9j51q2J03K50
$$ 71 -60 -343 -23 2 -117 5 -63 -18 28 102 -125 207 -134 -77 -234 359 10 -37 -51 48 -103 -185 -82 168
5719A68k79J24O7l20L28p4K1l27L24k07K95K49l50m8J14k5k3j66K11j6j43J86
$$ 168 -111 13 80 -240 88 14 35 -292 32 -175 120 369 19 -29 85 60 37 -129 82 66 -77 109
5741A09j9j15K1j36O0J68P0R2q2k85L55L0l90K41l22K98J9o6r9j23N7L50ml09
$$ 109 90 -25 -4 -140 -80 88 158 250 168 -117 238 268 -122 119 -203 95 114 48 -51 -174 -117 233 229 -80
5765h0j4L6r8M8R1J61m4J44j97p6P3n2j43n4L86k29K94j00m45M24L2j00l6l7K96
$$ -80 -94 -58 -156 -108 -17 144 100 244 47 -29 44 -8 -151 -205 181 -48 246 146 -299 125 157 57 21 -16 280
5790B80k34Q8j88J18j77L41n04L58j63J51K1p0j88J12m1j3M62m81q0L35j63p0
$$ 280 46 134 -54 64 -113 228 -276 82 -81 70 91 21 -167 -55 -96 -109 353 -128 -208 127 -36 -106
5812a06L30k45MJ73n3l45K54j2o0O4J18k8p2k68J63J2kj18J82k24k6K97k4r4Q0
$$ -106 224 -21 -17 156 103 -242 12 0 -60 4 122 94 22 -246 -83 -71 -73 -191 -9 -233 -259 38 14 -80 0
5837@j31L70j87l71M47l32J90J1K16j52J01k05m5j80K28RP8lj82j02L24k50J84
$$ 0 -131 239 52 -319 128 -204 -14 -3 213 61 162 -43 -88 -268 -40 -31 47 44 -138 -240 84 -166 18
5860A8j72L11j31j26K52M1l45K17P1K2j84J73k82O8J11K09q6k02K28k98L41p4
$$ 18 -154 157 26 -100 152 193 -152 65 136 158 -26 147 -135 -67 44 253 167 -35 193 -105 236 162
5882A62j07p3K07n11J03Q9J73l09J41j31K99j97j4K60%n6J16p7J30Qm63M98l95
$$ 162 55 -18 189 -322 -219 -130 43 -266 -125 -256 43 -154 -168 92 92 36 152 75 205 213 -250 248 -147
5905a47J79j84L68j97r6j7L3J02k12K05j88K74l10L1L23j51J16k00l1K12n1K57
$$ -147 32 -152 216 19 -77 -94 -61 41 -171 34 -154 120 -190 -159 164 13 129 -71 -102 110 59 316
5927C16k49J06k27J8lk0M7k30K70k9l15M01l7P5j84L03m0l34K47k0k7m12L95n6
$$ 316 67 173 -54 -36 -39 -59 -12 -242 28 -1 -316 85 48 123 -61 242 202 -132 115 95 68 -344 51 -5
5951ek41L48m39N44k87j32K93k25K51k5j67J89J63l91J39k77n7J38K73J20J61
$$ -5 -246 102 -337 207 -80 -212 81 -144 107 82 -85 104 267 -124 15 -262 -319 -181 92 212 373
5972C73m73K13j16R7j48n2n8K53J50j95k26L03j02j41q5K82m3K5J60q5O2j88J35
$$ 373 -100 113 -3 94 -54 -106 -164 89 239 44 -182 121 19 -122 -207 75 32 57 217 132 194 6 141
5995A41n8j10K6J24j24N9q4o3j5J37l73N49m43J49R4J73j20j41J34j14j93O7L87
$$ 141 83 -27 -1 123 -1 58 -26 -89 -104 33 -340 209 -234 -85 9 182 62 -79 55 -59 -252 -185 202
6018B02L8l8j35r8RK89k39K8j72K5J9l1j6K17m8j11L4K04l48j55L96k57J27J64
$$ 202 240 202 67 -31 -22 267 28 56 -116 -91 -72 -103 -119 98 50 -61 -27 177 -171 -326 70 -187 -60 104
6042A04J16j11k70L15n1j85Rjm5j07K79J63j58m8mj7L6l6N8J52k80K32j74j04
$$ 104 220 109 -161 154 103 -82 -73 -74 -119 -226 53 216 58 10 6 -11 25 -11 47 199 -81 151 -23 -127
6066a27J23K20j28l47L57k47J20n5K5K22k55j70J63K03j84m5K71j99n9P8JJ33
$$ -127 -4 216 88 -259 98 -149 -29 -84 -59 163 -92 -262 -99 104 -80 -125 146 -53 -112 -34 -33 100
6088A00j34M0J65j47j05j24J54l7N2j00R4k07J46M9J77j08K71l78L86l05j03L0
$$ 100 -34 6 171 24 -81 -205 -51 -88 -36 -136 -42 -249 -103 -54 123 15 286 -92 294 -11 -114 -84
6110h4r0M85k03j00l6J3Q9J12l04K8M8j34K28J7n6R4Q4k63LQm0J89r7j04J60j27
$$ -84 -174 311 108 8 -28 -15 74 186 -118 -90 -42 -176 52 69 13 107 191 -72 -69 -61 -101 88 -9 -113 47 -80
6136h0o1J86J9Q8m2n07L91K3P7QJ8r6j66N8J15J62k48J14K40l28K5N7k42L23l09
$$ -80 -141 45 64 152 110 -397 -6 17 94 102 120 24 -142 -84 31 193 -55 59 299 -29 -4 53 -189 134 -175
6161a75J03J0P6p5j66J64o6N5J97m90M30l63N16j98K06l6r0R3l37J34l2pj39K83
$$ -175 -72 -62 14 -61 -227 -63 -129 -74 123 -367 63 -300 216 18 224 188 98 191 -146 -12 -44 -51 -190 93
6185I3j7J04k39J54j37j31M11l18mM8j41K79pj29l1L68r6k75P6j01N7Q4m4J98
$$ 93 76 180 -59 95 -42 -173 238 -80 -84 -36 -177 102 95 -34 -65 303 207 -68 8 -93 -36 48 4 202
6209B02k86K49j45j66J67j36M6N3L0k2L9J12k22K97k91j76M21j01m4n2j70M0K9
$$ 202 -84 165 20 -146 21 -115 -69 -16 14 -8 31 143 -79 218 -73 -249 172 71 27 -25 -195 -155 -126
6232a26Q3j0R5n3M0J63l85P2L84m16J72O9j1n5Q2l2J88k94M8K09m43J95N3p2j78
$$ -126 -43 -53 42 -11 29 192 -193 -121 263 -153 19 88 77 22 104 72 260 -34 14 223 -220 -25 28 -44 -222
6257b22K86j30K47o8l09J70j39J74j92r4L44l7no4P1J36k60m6k8K87j55j01M0
$$ -222 64 -66 181 113 -196 -26 -165 9 -183 -277 67 30 25 -39 32 168 -92 -138 -166 121 -34 -135 -95
6280i5K84L2k39J10l78L91n3j0j21M3j25M06k4k29K4k64M34m76L20k8j01M6P5
$$ -95 189 221 -18 92 -286 105 52 42 -79 -36 -161 245 221 -8 16 -248 186 -290 30 2 -99 -53 22
6303B2q4J6J01J02j83N9j42L29k65LJ2R4j41P0J2o2L09q0k2j26N7P0K2l01J02
$$ 22 -62 -46 55 157 -26 33 -109 220 -45 -42 -30 64 -77 -7 5 -57 252 172 150 24 81 151 173 -128 -26
6328b6j42K88j44M0j96K34lj81J16p6J74k05o8K09l7QN2J9k36K81m03L06j52J52
$$ -26 -168 120 -24 16 -180 54 51 -130 -14 -90 84 -121 -189 20 -17 -9 43 62 -174 107 -296 10 -142 10
6352A0l3l2J08l23K51L0l23J71P5N2j9K29o6j29NJ39k53L20k45J47j65j53K78
$$ 10 -23 -55 53 -270 -19 11 -312 -141 -66 -14 -33 196 130 1 6 145 -108 212 -33 114 -51 -204 74
6375G4p0n3M4M3L2l17O33l86k9J47l09L40J09k05p1K1k50J86P7M5m7m9j51M06
$$ 74 4 -49 -5 38 70 -247 386 0 -29 118 -191 149 258 53 -18 3 -247 -61 16 61 14 -35 -186 220
6399B20l69J45R5k46J24K2n0O2j61K30KJ1K5p9l26K68L14m04Q7J30K1l51k28N91
$$ 220 -149 -4 91 -155 -31 -9 -59 3 -158 72 74 85 110 31 -295 -27 287 -117 -30 100 121 -230 -458 133
6423A33K5j01P2r0n5N5k9l2J91n7p0k5m3N5J42k38J15j63J25j61L11j17K79l39
$$ 133 158 57 129 39 -16 39 10 -22 169 112 42 17 -26 29 171 -67 48 -115 10 -151 160 43 322 -17
6447a7j59K56m1Po8l02N90j08J83k93J26l28J79M4k81K41q1j81K4L2M25k83j60
$$ -17 -176 80 39 46 -22 -324 266 158 341 48 174 -154 25 69 -212 29 -52 -233 -209 -177 248 -35 -195
6470a95K44j76m1M8K25k12K67j75j1J74j48p1J47j77L57r2L1r8l14J75l9Q6K1
$$ -195 49 -127 -168 -120 105 -107 160 -15 -26 148 0 -71 76 -101 256 164 195 97 -217 -42 -81 5 26
6493B6k11J88J84m79N43k45Q9j06o2j87J45J70l4k55J40K45j99j37J03J97k64
$$ 26 -185 3 187 -292 251 6 95 -11 -73 -260 -115 55 21 -234 -94 151 -48 -185 -82 115 -149
6514a49L77l50J49J18k39p2M38k42j47P0q7J36k18L84k63J11K9M1l06L94r5j40
$$ -149 228 -122 27 145 -94 -166 272 30 -117 -47 -134 2 -216 168 -95 16 45 86 -220 174 79 -61
6536f1j48J72J15J92k33J24j45k33J01L7Q9q3K6J13R4k86q3J96J27q8j57K07k38
$$ -61 -209 -37 78 270 37 161 16 -217 -116 -79 10 -73 -47 66 160 -126 -209 -13 114 26 -131 76 -162
6559a62K59p6N3j88N3k0J14j09K15k29P1Q6j34J46L9o6k33k22M33O2J76l16K33
$$ -162 97 21 74 -114 -61 -81 33 -76 139 -90 -19 67 -67 79 118 52 -181 -403 30 92 268 -48 185
6582A85k09j53O4M2j9K07pm6j26K22O0k02j31O3j00J74nj56j58L44N8r5o2R1J04
$$ 185 -24 -177 -113 -71 -90 117 110 64 -62 160 220 18 -113 -50 -150 24 19 -137 -295 49 107 12 -50 41 145
6607A45q2k2j69K96k90K68j61lo5J18j10l7J89r2O8K2k25L35j71j17J3O1l7j24
$$ 145 63 41 -128 168 -122 146 -15 -18 -83 35 -75 -112 77 -15 53 75 -150 185 14 -103 -90 -29 -66 -190
6631a90L10M8l60K29j62n4K57k15J70K11j94L45m74M9K10l05J40j64L01p3N3k67
$$ -190 120 168 -192 37 -125 -179 78 -137 33 244 50 395 -79 -30 180 -125 15 -149 152 79 132 -135
6653a35n1K78m2l43N30l99P2k8K27m4k39k6K12J30j4o2k65K50j6O4k86K21k9j40
$$ -135 -186 92 50 -293 237 -162 -90 -118 109 65 -174 -200 12 142 128 66 -199 51 35 99 -187 34 5 -135
6677a35M33k05j71j09K14J46l65M74J8l43J28N9j7m8p6l44L51Q0J12j68k70k2
$$ -135 298 93 -78 -187 27 173 -192 282 300 -43 85 144 127 79 3 -341 10 90 202 34 -236 -258
6699b58K96r0J30j63K12K16l43J03k7L5l72J92m9J8J23L6j6K27j02k43N6L6M5
$$ -258 38 -52 78 -85 127 343 0 103 76 111 -261 -69 -118 -100 23 59 43 270 168 -75 -19 17 62
6722F2l33L35r1K17j53k11J45j62K42J61j31m07M18J4O9j09J61j85R9k22R4k95
$$ 62 -271 64 -27 190 37 -174 -29 -191 51 212 81 -326 92 106 175 66 227 42 141 -81 13 -282
6744b82L11o2J10j03K40l78J25k07N05m43K27L1j59K88l35J6l6pK95l03K51j13
$$ -282 29 -33 77 -26 214 -164 -39 -246 259 -184 43 74 -85 203 -132 -116 -152 -159 136 -167 84 -29
6766b9K9q7O0K04k60J51k28J40M4J24k18l5J04k69J02L23j45j56J17o4L22r6n0
$$ -29 0 -87 -27 177 -83 68 -160 -20 24 148 -70 -105 -1 -270 -168 155 10 -146 -29 -93 229 133 83
6789H3oo2j2Q5J06j51k4Q2P4j42k74K69J48j15O5K23l90m7K59l01K75k06Q4M8
$$ 83 77 15 3 88 194 43 19 101 175 33 -241 28 176 61 126 349 -41 -88 171 -130 145 -61 23 71
6813G1J10l40j25M70k2j98M0j29L76m15m9L37ooj10K52l62M2O2K27j33k7j09J65
$$ 71 181 -159 -284 186 164 -34 6 -123 253 -162 -211 126 120 114 4 256 -106 -64 -2 225 92 65 -44 121
6837A21j14k17K84k04J60j31O8j44L05k61K26P3l56L83l17J53L5j11N6q8N1J4
$$ 121 7 -210 74 -130 30 -101 -33 -177 128 -133 93 166 -190 193 -124 29 64 -47 9 -79 -28 -14
6859a4j62J99K04k98J37j61N1N8J59J04l0m88L15J9K2n3q4n6P6j15K91k75K36
$$ -14 -176 23 227 -71 66 -95 -44 14 173 277 247 -241 74 93 115 62 -22 -78 -2 -117 174 -101 135
6882A35j1k1J3q6p2J0L11j94m0j37Q6m61O05l32mL61p5j33K58l1j4k54j39K2K59
$$ 135 124 103 116 30 -42 -32 279 85 45 -92 -6 -467 138 -194 -198 163 88 -45 213 182 168 -86 -225 -203 56
6907E6j30J07p0R5n0M9k36K91j46rmm5K64%k44j55J24J10J04L9l09J1J68m7k63
$$ 56 -74 33 -37 58 8 57 -179 112 -34 -43 -47 -92 172 172 -72 -227 -103 7 111 150 -159 -148 20 -27 -290
6932b90K48K55m27K31q0K4j04J50J3j1Q5K20l00j12j31L07K0j27K24k54J35j03
$$ -290 -42 213 -214 17 -63 -39 -143 7 20 9 94 314 14 -98 -229 78 98 -29 195 -59 76 -27
6954b7R9P3q7MR0j05j32P9J3J73j49O2l7r4L6n6oJ7l6K21M9k02K7R2k18j3K0p0
$$ -27 72 145 58 62 152 47 -85 -6 7 180 31 93 56 -38 -2 -58 -64 -47 -83 138 187 -15 12 104 -114 -127 -107 -177
6982a77J78K84k68l76M66Pj88K11k67J17Qj12K26l15J48J39j87N3P7j05J37M4
$$ -177 1 285 17 -359 107 114 -74 137 -130 -13 -5 -117 109 -206 -58 81 -106 -53 24 -81 56 100
7004A00N4k18j01L00j39q3J82j25M1p6oJ66j46J13J43l47J57l13R2J71K8J05q8
$$ 100 154 -64 -165 135 -4 -87 95 -30 11 -65 -71 95 -51 62 205 -142 15 -298 -206 -35 -7 98 10
7027A0K66j89j04l1J39k4j49J03j85K78J22k13M1J53l24L9j35N5k06L24K27l06
$$ 10 276 87 -17 -48 91 67 -82 21 -164 114 236 23 64 217 -107 -68 -203 -148 -354 -30 197 -109
7049a09l1J98j17K50k98j57M3J50O6M1j70L44l10p0L53j7j15j66m0J56j35N1J18
$$ -109 -140 58 -59 191 -107 -264 -221 -71 -5 36 -134 210 -100 -170 183 166 51 -115 -155 1 -134 -83 35
7072C5K3P7K17k31p8o2K19l00p9L9J54J85p4j29k2j7p8N4M6j37R6K57j94J5J60
$$ 35 58 135 352 121 43 -19 200 -100 -179 -140 14 199 125 -4 -26 -43 -121 -67 -21 -158 -62 195 1 16 176
7097A76k50j2j09K16j30K47o6j65K05J7O4n4l58K15j66J95m61L50QK62k33J21
$$ 176 -74 -86 -195 21 -109 138 72 -93 112 129 193 139 -219 -4 -170 25 -436 -86 -78 184 -49 72
7119G2q2n2J03N9j06m9J09j79L72k84O4k1n4l8J73l68L59o0o8M6mk1l7k0P4K96
$$ 72 -10 -62 41 100 -6 -55 54 -125 247 -37 27 6 -48 -86 87 -281 78 18 -50 -4 -8 -29 -66 -86 -12 284
7145B84k05r0j38J51n4j36R4J90j79K67j95J80k34qk6j7K35l4P1l80J32J84k50
$$ 284 79 -11 -149 2 -52 -188 -94 96 -83 184 -11 169 -65 -73 -99 -116 119 85 156 -224 -92 92 -158
7168a58K6o2K09k3J51n8j21K11O0j64k55J30J16K46j76l10J74j89L43m09J97K80
$$ -158 -132 -194 15 -8 143 85 -36 175 235 71 -184 -54 62 308 132 -178 -4 -193 150 -259 -62 218
7190B18LM5j17r5K2k15OK6M36l70P9k58nJ77J78m6r0q0K52l4l18K34o1j02J12
$$ 218 221 266 149 54 76 -139 -133 -107 329 -41 38 -220 -225 -48 130 84 -6 -86 166 132 -186 48 -13 -115 -3
7215ckJ12j52J80j00o1K60l67K73K37J1n05J31J9k0j38M72l33K37j31Pl6j11l0
$$ -3 -5 107 -45 135 35 -26 234 -133 140 377 388 -117 14 33 13 -125 347 14 251 120 127 91 -20 -50
7239e0j38J32J12M1j74J74lk18j83K21k4kj10J73K90k57K0qK0j31J65P6j74J00
$$ -50 -188 -56 56 97 -77 97 94 -124 -307 -86 -110 -112 -222 -49 241 -16 4 -4 16 -115 50 126 -48 52
7263E2j37M56k97J90l23MK40n40M47q6R7m9l7m5O9j11K47k85L24l30M06l76N8
$$ 52 -85 371 74 264 -59 -55 185 -355 92 6 103 54 17 -28 41 -70 177 -108 216 -114 292 -84 -26
7286b6N3j29P3K40j85K4o0J14k38O7M8L25j69k27qL50l24K57j79j91K91j89K06
$$ -26 27 -102 -29 211 26 50 -10 104 -134 -67 -19 306 137 -90 -98 252 -72 185 6 -185 106 -83 123
7309A23m12J56L32j01j34M3K69l03N4o5k3J04J34k24k0J82l73M83j99r5R2m0p1
$$ 123 -289 -133 199 98 -36 7 276 -27 27 -38 -61 43 177 -47 -67 115 -258 225 26 -69 23 -17 -88
7332h8J72k78j3J89lJ13k59J90K97l11j40K52o1j33J58k06m8J29j33K21K54j1
$$ -88 84 -194 -207 -18 -21 92 -167 23 320 9 -131 121 60 -73 85 -121 -169 -40 -173 48 302 291
7354B91p0J0o1j64k1L13k54l36J60J87q0R6M0O3M8m34J35J9J23K16m20J55J6j12
$$ 291 221 231 170 6 -15 298 44 -292 -132 55 -25 71 111 174 222 -212 -77 -58 65 281 -139 16 32 -80
7378h0j63L75K6j20J38k38o1N5O2K43j6l27J17r5J59o8m7N3LL6L4r3m9p4K88j95
$$ -80 -243 132 158 38 176 -62 -123 -68 -6 237 221 -106 11 -84 75 7 -40 13 16 52 86 -7 -56 -130 158 -37
7404c7J61q7L4k14J61j22K90p8K0j59N8J87k88R0J47%l73K49m8OK24l10L00j78
$$ -37 124 37 71 -143 18 -104 186 108 128 -31 27 214 -74 16 163 163 -210 39 -9 -3 221 -89 211 33
7428C3j85J10k16J67j25N7J19j09M0J07k0Q3J02j25J19j59L4K3k18L78j38l13
$$ 33 -152 -42 -258 -91 -216 -159 -40 -149 -109 -2 -22 61 163 38 157 -2 32 55 -163 215 77 -236
7450b36K12J10L2k21r4J04j56M08k15K92k28P4j30J26k04K41o9k11L44k99M44
$$ -236 -24 86 118 -103 -197 -93 -249 159 -56 236 8 82 -48 78 -126 115 46 -165 179 -120 324
7471C24l19o6J01r1j4K13k94R0l6p5K66l44N9J63J7j06R4L50l74J23j00j44M32
$$ 324 5 -61 40 -51 -65 148 -146 -56 -92 -167 99 -245 -186 -23 -6 -112 -18 332 -42 81 -19 -163 269
7494B69j39j35j9N7q8L9R3N3q6r9O7j29L08J1o9j5j5k40L64j65j46K39K0j73j4
$$ 269 130 -5 -24 33 -55 -16 77 130 44 -55 12 -117 191 202 133 118 103 -137 227 62 -84 155 175 2 -12
7519a2j32m6J49j97m6M16m36J3L60PJ14qj66J0p0K38k17J66j63n7j8J07j00R7
$$ -12 -144 -190 -41 -238 -284 132 -304 -291 69 76 190 182 16 26 -44 194 -23 143 -20 -77 -95 12 -88 9
7543IP0J21k25n2NN1r2OP0m3J52j96J15M5r3K14n6j72J50j66O6p5k7L45j31l31
$$ 9 79 200 -25 -77 -72 -21 -113 -107 -37 -80 72 -124 -9 36 -57 157 101 -71 79 -87 -21 -96 -123 222 91 -240
7569b40J03J09Q0n8J82M5k72j29j4J38K29l81J60mK33N7k09J92l34J08L1l54K24
$$ -240 -137 -28 52 -6 176 221 -51 -180 -194 -56 173 -208 -48 -52 181 238 29 221 -113 -5 26 -328 -104
7592a04J39N4j1J0j24M4j99J98o0l3J30j70J09K24j31L0K7J5P1r5j99J48j7M8
$$ -104 35 89 78 88 -36 8 -191 7 -53 -86 44 -126 -17 207 76 106 133 148 219 124 -75 73 56 104
7616A04j51J75L8Ok92M1n3R9O0L3k61K78j83J80OQ4j93J15j73J01l0k2L83l87
$$ 104 -47 128 166 172 -120 -79 -132 -33 27 60 -201 77 -106 74 80 164 -29 86 -87 14 -16 -38 345 -42
7640d2n9J36j78L45j16n9O0Q6m19J86O6j23K33j93P1n0K74o6k23L39m78J03R8
$$ -42 -101 35 -143 202 86 27 87 173 -246 -60 6 -117 116 -77 -6 -56 218 152 -71 268 -210 -107 -9
7663ik5J19l56L08k4J13NJ4j68o6q5L14l04n4J22m4n7L03q3n6o8J61J2J43j5j01
$$ -9 -34 85 -271 37 13 126 131 145 -23 -89 -174 140 -164 -218 -96 -140 -197 106 23 -33 -101 60 72 215 200 99
7689I9l3l0J67m55R5K86m5J69l31N3J68l07K38M3M3m66K10J72r4N4j93K90r3j86
$$ 99 66 36 203 -252 -157 129 84 253 -78 -25 143 -164 74 117 160 -306 -96 76 -18 36 -157 133 40 -146
7713a46K8J65Jj70j8r6K22J89k14j03OL5p4L00j26L67k46Jl3jj11k29M2L91k50
$$ -146 -118 47 48 -122 -140 -236 -14 175 -39 -142 -136 -101 -175 125 -1 366 120 121 88 87 -24 -253 -211 180 -70
7738g0j49r0L29K95k42N8k07j08K34k63P0M6r4P4J66Q0%k20m9K51Lo5j62j3k5
$$ -70 -219 -309 20 315 73 131 -76 -184 50 -213 -143 -97 -191 -117 49 129 129 -91 -140 111 114 49 -113 -126 -151
7763a51J46j47J55O0mO7O6j43Pj65Q1P0J52k68J72l33K88j27j23N42n30K6q2J00
$$ -151 -5 -152 3 63 59 126 192 49 56 -109 -28 42 194 -74 98 -235 53 -74 -197 345 -185 -159 -241 -141
7787a41K49r9j81J16J70o6O0k4m9k00J68KO9k06J1j05L25j50J40j93j5L63n0j4
$$ -141 108 9 -172 -56 114 48 108 84 35 -165 3 5 74 -132 -121 -226 99 -51 89 -104 -119 244 194 180
7811A80o9j07JQ9j40K2qJ41q0j35O8j00K30l1J74l18J88p8k45K60k34K93o3l30
$$ 180 111 4 5 94 -46 -24 -32 109 29 -106 -38 -138 92 61 235 -83 105 27 -218 42 -192 101 38 -292
7835b92M04n1R4J28m52L18j84k46J52n6N7K12o5J4j48J57k3q7k7K87o1Nl13n6
$$ -292 112 61 155 283 -169 149 -35 -281 -129 -185 -128 84 19 33 -115 42 19 -68 -95 192 131 136 -177 -233
7859b33K27Q2o6Qj79K43O6MJ27n15j3K43q8j6M3j08J32j51O7K59j57k72J57K26
$$ -233 -6 76 10 18 -161 82 148 152 279 -236 -249 -6 -94 -110 -67 -175 -43 -194 -127 132 -25 -297 -140 86
7883H6R9j71l6J12R6J4k61j7J39m6K2k32L63j14n9K51k32J49j94L1K05m26J97
$$ 86 185 14 -22 90 186 200 -61 -78 61 15 37 -195 168 54 -5 246 14 163 -31 0 205 -221 -24
7906b4J29k32J79q2j18J40N5L5J55M2m66J77j12K04l58K70n2j48J04M23l70r4
$$ -24 105 -127 52 -30 -148 -8 47 82 237 279 -187 -10 -122 82 -276 -6 -58 -206 -102 321 -49 -143
7928a43r5J74qJ22j29j49K05Jq7P5J62k60L09m16p1K59J28N9l09K81J48k46q3
$$ -143 -238 -64 -72 50 -79 -228 -23 -22 -109 -34 128 -132 177 -239 -310 -51 77 136 -173 108 256 10 -73
7951g3J86M5m9J5K2m27M93k39K5n7j91L30k1k07K40j48J43q6j69L88j91j01k02
$$ -73 113 158 109 124 146 -281 212 -27 -2 -59 -250 80 59 -148 92 -56 87 1 -168 220 29 -72 -274
7974b74K97K58l87P4jJ48k13P8K07k65n7J06J00J13l17j02K91j06Lk0J01K52l04
$$ -274 23 281 -106 -32 -33 115 -98 -20 187 -78 -135 -29 71 184 -133 -235 56 -50 -47 -67 34 286 -18
7997a8K00n02L36o6J52m5q3K12m74K3J08J43p1J64L2o4R2l20M66o36K63J34Q4
$$ -18 182 -320 16 -50 102 57 -26 186 -288 -265 -157 -14 -85 79 111 47 139 -181 285 -351 -88 46 130
8020A30j39j84m3L03pk49K39p6M3J90j53p9J57j75M7m4j2j48J43K29j60J22M1
$$ 130 -9 -193 -236 67 60 -189 50 -26 17 207 54 -25 132 -43 4 -40 -52 -200 -57 172 12 134 175
8043A75j98R3l7l89N29j07j36P7j41J16J82k52OJ22J01j2l5K5j87n4jq2J92O5
$$ 175 -23 70 33 -356 173 66 -70 7 -134 -18 164 -88 -82 40 141 129 94 119 -68 -122 -123 -205 -13 52
8067E2j01J73J47l69O0P8Rr2K12j41m2l19J15J71rN8k21J94m6J59k9J32k23J25
$$ 52 -49 124 271 -98 -38 40 49 -43 169 28 -14 -333 -218 -47 -56 2 -219 -25 -71 88 59 191 -32 93
8091I3k49J55MJ43k20O8QJ04q6o3J17J9j15N8L8m0k80J32k82J27L51k52J98j86
$$ 93 -156 -1 3 146 -74 -6 2 106 20 -43 74 93 -22 36 74 34 -246 -114 -396 -269 82 -170 28 -158
8115a58K28r2k47L13Q4l50M60j67l22N9M43j06J0J47l72r7P1K44r8r8j80J99o
$$ -158 70 -22 -269 44 128 -222 238 71 -251 -192 251 145 155 302 -70 -167 -96 148 50 -48 -228 -29 -35
8138c5m6J61j28L3J85K7k37P0k12K36J11k58K9m0m5M11k29k66J56L10k65J31m6
$$ -35 -81 80 -48 -15 170 197 -40 30 -182 54 165 -93 -64 -104 -149 262 33 -233 -77 233 -32 99 53
8161E3J28j13m0R6k47K46k05j26J93J39j53J7k43N28l41k6q1K74k06m2L85k43
$$ 53 181 68 28 124 -123 123 -82 -208 -15 124 -29 -12 -255 273 -68 -94 -175 99 -107 -149 236 -7
8183gQ6q3K3k47J54J86J04j93
$$ -7 79 -4 19 -228 -74 112 216 23
8191B3
$$ Imaginary data points
##PAGE= N=2
##DATA TABLE= (X++(I..I)), XYDATA
0@%%%%%%%%%%%%%%%qJ6j6J6j6K3l1L2m0M8n3O1p2Q4r3J06j22J38j58J82k04K28
$$ 0 0 0 0 0 0 0 0 0 0 0 0 0 0 0 0 -8 8 -8 8 -8 15 -16 16 -24 24 -29 32 -40 44 -49 57 -65 73 -85 97 -107 121
37A21k58K90l22L58l98M41m90N43o00O63p30Q04q86R76j074J182j305J443j597
$$ 121 -137 153 -169 189 -209 232 -258 285 -315 348 -382 422 -464 512 -562 620 -685 758 -839
56h39J770j969K198k465K787l179L664m289N129o326Q178j1458J9041p3644j5996
$$ -839 931 -1038 1160 -1305 1482 -1697 1967 -2322 2807 -3519 4659 -6799 12242 -61402 -77398
71g7398Q8050n879N556L2291L3893l8574n0729j7295J4556o658k903K7197M2038
$$ -77398 10652 4773 10329 42620 76513 37939 -12790 -30085 -15529 -22187 -25090 2107 44145
84D4145M315j7912j3079j3306l7728k8078J0115K6413Q942J2899L3753K3261k2192
$$ 44145 48460 30548 17469 4163 -33565 -61643 -51528 -25115 -16173 -3274 30479 53740 31548
97C1548l3430n766K344j6109o680K8157L4014O218r677o946j3544l0672k8658
$$ 31548 -1882 -7648 -5304 -21413 -28093 64 34078 40296 30619 23673 10129 -20543 -49201
110d9201n064J0473J2327K2283L5871K0390q958j1582l599j9846l3897q551K4611
$$ -49201 -54265 -43792 -31465 -9182 26689 47079 38121 26539 22940 3094 -30803 -39354 -14743
123a4743K1378K379P498J9561J178l1794l1488p530P56o762N870L0767K8459P041
$$ -14743 6635 9014 16512 36073 37251 5457 -26031 -33561 -32805 -39567 -33697 -2930 25529 32570
137C2570l564j889j2130k3507j3797O159J0426N031J2810J8230n78k3216k0188
$$ 32570 29006 27117 14987 -8520 -22317 -16158 -5732 -701 12109 30339 29761 6545 -13643
150a3643q175j1350j2190R397L0263K5805R299L730L346j1604k7258k0732j763
$$ -13643 -21818 -33168 -45358 -35961 -5698 20107 29406 33136 36482 24878 -2380 -23112 -24875
163b4875M275N997J6462K2153Q068r499j2061j3697k1400j7884K385J7967J7213
$$ -24875 -20600 -14603 1859 24012 32080 22581 10520 -3177 -24577 -42461 -40076 -22109 -4896
176d896J3423J7428J3570o770k0979j4804o473p755l647J1758J9163R002l093
$$ -4896 8527 25955 39525 32755 11776 -3028 -9501 -17256 -20903 -9145 10018 19020 15927
189A5927m260p306j7711j7769j645J1299J0891J2220J9820J4432n272j5011j1824
$$ 15927 11667 4361 -13350 -31119 -32764 -21465 -10574 1646 21466 35898 30626 15615 3791
202C791j0620j4033n708J1665J8826J0596L782L830m013j9521k1692p989J623
$$ 3791 -6829 -20862 -26570 -14905 3921 14517 18299 22129 18116 -1405 -23097 -31086 -29463
215b9463L354J1208K3035K1031M005o261o489j1723j9346j3854L767J1397P468
$$ -29463 -26109 -14901 8134 29165 33170 26909 20420 8697 -10649 -24503 -20736 -9339 -1871
228a871P894J1154K554j2589j5507q582m553l361O469J8497J7589O375J93j790
$$ -1871 6023 17177 19731 7142 -8365 -16947 -21500 -24861 -18392 105 17694 24069 24262 22472
242B2472j0586j8546j2709R84N659N542J1262J4437L996j0362j3357r799j0909
$$ 22472 11886 -6660 -19369 -18385 -12726 -7184 4078 18515 22511 12149 -1208 -11007 -21916
255b1916r140L846J7676J7316J0976Q780N591q162j9951j6074o202l326n4J0221
$$ -21916 -31056 -27210 -9534 7782 18758 27538 33129 24967 5016 -11058 -17260 -20586 -20640 -10419
269a0419J8073J0066k037n527n579j2222j4542l229R358J1627R581J1885J0193
$$ -10419 7654 17720 15683 10156 4577 -7645 -22187 -25416 -16058 -4431 5150 17035 27228
282B7228j894j3702j2730p521p433l796P559J4850R263J613r38m558j2933j5036
$$ 27228 25334 11632 -1098 -8619 -16052 -19848 -12289 2561 11824 13437 12499 7941 -4992 -20028
296b0028m555N092P559J0606J6859J3707Q8j0093j0602j1058j4832r320N479J3300
$$ -20028 -24583 -19491 -11932 -1326 15533 29240 29328 19235 8633 -2425 -17257 -26577 -21098 -7798
310g798R762P183Q028K053j0881j6280q474j660o79M382J5020J6673O456k722
$$ -7798 1964 9147 17175 19228 8347 -7933 -16407 -18067 -18746 -14364 656 17329 23785 21063
324B1063m075p526j4906j2356j244O751O321P164R308N298o394j1585p331n245
$$ 21063 16988 9462 -5444 -17800 -19044 -12293 -5972 1192 10500 15798 9404 -2181 -9512 -14757
338a4757l909L300J3428J4254P389K540j56q471j6320j3513l791J377L661J0121
$$ -14757 -18666 -15366 -1938 12316 19705 22245 22089 13618 -2702 -16215 -20006 -18629 -14968 -4847
352d847J4953Q811l263p263o964j0260j1692k277R834J3001Q591Q866Q329k678
$$ -4847 10106 18917 15654 8391 1427 -8833 -20525 -22802 -12968 33 8624 17490 25819 23141
366B3141j3843j3601p190n318l926N690J4735J0393J407k001j266q002j2593n708
$$ 23141 9298 -4303 -11493 -16811 -20737 -15047 -312 10081 11488 9487 8221 219 -12374 -18082
380a8082N663Q901O552Q673R498J098j0195j2395q306o912n227L929J2299J0951
$$ -18082 -12419 -3518 3034 11707 21205 22303 12108 -287 -8593 -15505 -20732 -16803 -4504 6447
394F447N777K694j397r166j3189p918J80K910O216J2943J4156M193n123p087q235
$$ 6447 12224 14918 13521 4355 -8834 -16752 -16572 -13662 -7446 5497 19653 23846 18723 11636 3401
409C401j2658j1596p38Q129Q400P593Q293N163m218j0612p211l749l490R62J0842
$$ 3401 -9257 -20853 -21591 -13462 -5062 2531 10824 15987 11769 1157 -6054 -9803 -13293 -12331 -1489
424a489J2435M938o41r12n021j3656j2296j587O173L858N441J0659Q710k602j0258
$$ -1489 10946 15884 15243 14331 9310 -4346 -16642 -18229 -12056 -8198 -2757 7902 16612 14010 3752
439C752p624m415n833k151Q091J3609Q905K916K423l369j2645j4058o386q80J90
$$ 3752 -3872 -8287 -14120 -16271 -8180 5429 14334 17250 19673 16304 3659 -10399 -16785 -17665 -17475
454a7475N463J3578J1931J659m148l574n926j0600p281L833R438O863N061O832
$$ -17475 -12012 1566 13497 15156 11008 7434 1508 -9092 -16373 -12540 -3102 3761 8822 15654
468A5654J904p409j1766p518m178k891K350R467J0940L857Q7r67n140j0996p293
$$ 15654 17558 10149 -1617 -9135 -13313 -16204 -13854 -4387 6553 10410 10497 9530 4390 -6606 -13899
483a3899K315N738M552P429J0130L862o695j0678p372p317p402m84R497J1507
$$ -13899 -11584 -5846 -1294 6135 16265 20127 13432 2754 -4618 -11935 -19337 -19821 -10324 1183
497A183O749M649K771l150j0528r937l295j3J956O925J1339P512j191m986n166
$$ 1183 7932 12581 15352 12202 1674 -8263 -11558 -11571 -9615 -2690 8649 16161 14970 9984 4818
512D818q329j0226m368M900O964N960O753O462l93p408p377l798l079j287N881
$$ 4818 -3511 -13737 -18105 -13205 -6241 -281 6472 12934 12541 5133 -2244 -6042 -9121 -10408 -4527
527d527R669O920Q77j336l288q856j1136m990K306L854N542R363R237K211o040
$$ -4527 5142 12062 12939 11603 8315 -541 -11677 -16667 -14361 -10507 -4965 4398 13635 15846 9806
542I806o495n713o980m934L092R295P384M481M014R27p278j1391p883j883p94
$$ 9806 3311 -2402 -9382 -14316 -11224 -1929 5455 9936 13950 14877 7599 -3792 -11675 -13558 -14352
557a4352J868Q349J1236N094j172k416m032p082p239q19N208N251M652N974K692
$$ -14352 -12484 -4135 7101 12195 11023 8607 4575 -2507 -9746 -10565 -5357 -106 4546 10520 13212
572A3212m525q361o552m685l808Q78Q524J0147M717J315P91k957r472r282j935
$$ 13212 8687 326 -6226 -10911 -14719 -13841 -5317 4830 9547 10862 11653 8696 -776 -10058 -11993
587a1993L246L669N109Q338O773j564p175o705o538p680k947N180Q847O635N325
$$ -11993 -8747 -5078 31 8369 15142 13578 6403 -302 -6840 -14520 -17467 -12287 -3440 3195 8520
602H520N443N8p868r030l873j057j271K390R224P688L58l140l333m925q026n662
$$ 8520 13963 14021 6153 -2877 -6750 -7807 -9078 -6688 2536 10224 10582 7442 4109 -816 -8842 -14504
618a4504K386O296N167N384O182K396n368p167n165l299k526K008P890P983K667
$$ -14504 -12118 -5822 -655 4729 10911 13307 7939 772 -4393 -7692 -10218 -8210 -320 7663 10330
633A0330Rj276n643r852p211o57L495L503P346R210N308j873n488n011n906o364
$$ 10330 10339 9063 3420 -6432 -13643 -14300 -10805 -7302 44 9254 14562 12689 7201 2190 -3716 -10080
649a0080j595N106O763M492L456K448k296p818p615k607r98P86N714Q299O029
$$ -10080 -11675 -6569 194 4686 8142 10590 8294 476 -7139 -9746 -10744 -9958 -4244 4055 10084
664A0084L59j835k967n785o971l075L346M499M050M628M547j395p080o611m004
$$ 10084 10443 8608 5641 -144 -7115 -10190 -6844 -2345 1705 6333 10880 9485 2405 -4206 -8210
679h210l406j024M233R090P380K828P99j069n952q831n308l57K003L333O728O671
$$ -8210 -11616 -12640 -8407 683 8063 10891 11690 10621 4669 -4162 -9470 -9827 -7824 -4491 2237 8908
695H908J786l433m583m639o151m185J175O431N384M857M623J699m214o908n025
$$ 8908 10694 7261 2678 -1961 -8112 -12297 -11122 -4691 693 5550 10173 11872 7658 750 -4275
710d275k339j637J463N372O581K920j077k235m068o704m751KM262M629M967O945
$$ -4275 -6614 -8251 -6788 -1416 5165 8085 7008 4773 705 -5999 -10750 -10748 -6486 -1857 3110 10055
726A0055K903l109o417m924m026m569n31N417P541L901J383J569k702p173p525
$$ 10055 12958 9849 3432 -1492 -5518 -10087 -10618 -5201 2340 6241 7624 9193 6491 -682 -8207
741h207k279J252K255M424P466N662P12l226l831m861n632l222K074N022L546
$$ -8207 -10486 -9234 -6979 -2555 4911 10573 11285 8059 4228 -633 -6265 -9487 -7413 -2391 1155
756A155L394L012m87n053n691l412j168K08L404O939N457J871o33k545n019o649
$$ 1155 4549 7561 7074 2021 -3670 -7082 -8250 -8042 -4638 2301 7758 9629 8996 6451 1432 -5217
772e217l812O01K873L740N286N018Q12m381m632m028m363l030K196O748N993L730
$$ -5217 -9029 -8428 -5555 -1815 3471 8489 9301 4920 288 -3740 -8103 -11133 -8937 -2189 3804 7534
788G534K302J121m050p835n457j594k9J221M565O863L489j814k749k966m520m971
$$ 7534 9836 10957 6907 -928 -6385 -7979 -8008 -6787 -2222 4641 8130 6316 3567 601 -3919 -8890
804h890r4M362M901L654L820K177k309n582n517k656j789M45M330O153L822K51
$$ -8890 -8984 -4622 279 3933 7753 9930 7621 2039 -3478 -6134 -7923 -7478 -3148 3005 6827 7078
820G078r57k857o014n446j084K483L200M390N827M297q18m971m111l773m967k520
$$ 7078 6121 3264 -2750 -8196 -9280 -6797 -3597 793 6620 10917 10099 5128 1017 -2756 -7723 -10243
836a0243L134N888L635K399K319p8m515o423k635o4N63K166N953N452R14k226
$$ -10243 -7109 -1221 2414 4813 7132 7054 2539 -3884 -6519 -6583 -6020 -3854 2099 7551 8465 6239
852F239k339l325m680m401J112M135K852K602L800J232l046n622l276j383j250
$$ 6239 3900 575 -4105 -8506 -7394 -3259 -407 2195 5995 7227 4181 -1441 -4717 -6100 -7350
867g350J564N172O476K497J21j748k892o114n606r86J978K655L851N458L257j431
$$ -7350 -5786 -614 5862 8359 8480 6732 3840 -2274 -7880 -8866 -6888 -4233 -382 5076 8333 6902
883F902l970k997l988l724o51M638M787L466K258J968j444o105n004k543m26M53
$$ 6902 2932 -65 -4053 -7777 -8428 -3790 997 4463 6721 8689 7245 1140 -3864 -6407 -6833 -6380
899f380K599N656M193k78j889j958l401m629j413K869L910L173L335L009r20m774
$$ -6380 -3781 1875 6068 5790 3901 1943 -1458 -6087 -7500 -4631 -721 2452 5787 8796 7876 3102
915C102n119k855k477j263K577O079M785J545n08o43l548n898l388N17K724K914
$$ 3102 -2017 -4872 -7349 -8612 -6035 44 4829 6374 5866 5223 1675 -4223 -7611 -7094 -4370 -1456
931a456M193M590J637k450m022l719l830k594P5L882M318K405K111J264k399n056
$$ -1456 2737 7327 8964 6514 2492 -1227 -5057 -7651 -7576 -3694 624 3029 5140 6404 4005 -1051
947a051l437m60L39Q83L884M858K560j429k168l139l846m231l57K515L333L356
$$ -1051 -4488 -4948 -4609 -3726 158 5016 7576 6147 3979 840 -3006 -7237 -7594 -5079 -1746 1610
963A610L600J885j979l961l322k242k536N46M181N432K598N09M59j662n043n652
$$ 1610 5210 7095 5116 1155 -2167 -4409 -6945 -6399 -2218 3214 5812 6321 6780 5118 75 -5577
979e577k030J001J840K325M745M088M28k905k253k509l817j626K061L722L126
$$ -5577 -7607 -6606 -4766 -2441 2304 6392 6820 3915 1662 -847 -4664 -6290 -4229 -507 2619
994B619J973J590l16l804m994k274n17O0J279M593M637Q42j130j882k179l820
$$ 2619 4592 6182 5866 2062 -2932 -5206 -5723 -5663 -4384 209 4846 5688 4558 2676 497 -3323
1010c323k890M30L181L345K955K848R71k916m310l304k643k125J017M392M548
$$ -3323 -6213 -5783 -2602 743 3698 6546 7517 4601 291 -3013 -5656 -7781 -6764 -2372 2176
1025B176K414J047M10k278m662l722o29J158J357K789L937K848j397k723k745
$$ 2176 4590 5637 6047 3769 -893 -4615 -5244 -4086 -2729 60 3997 6845 5448 2725 -20
1040b0k808l253m79K494L676K573J933J445p19l953l622j638M6K34L068L714L292
$$ -20 -2828 -6081 -6560 -4066 -390 2183 4116 5561 4842 889 -2733 -4371 -4325 -4091 -1023 2691 5983
1057E983Q3j939k116l455m062k180J696K982L011L337K933J99k741l586k411k133
$$ 5983 6066 4127 2011 -1444 -5506 -7686 -5990 -3008 3 3340 6273 6472 3731 145 -2266 -4399
1073d399j287J552M339L078J499L31l72l237m475k539l78R52J814L627L789J338
$$ -4399 -5686 -4134 205 3283 4782 5113 4741 1504 -2971 -5510 -5888 -4936 -3122 505 4294 5632
1089E632j494j749k057k818k325M36L275K459J679J787L88k260m032l117j176
$$ 5632 4138 2389 332 -2486 -4811 -4375 -1100 1359 3038 4825 5213 2953 -1079 -4196 -5372
1104e372j1Q14L601M257J966j1r37k094l739l063r88K066K207K852K730J678j158
$$ -5372 -5383 -4569 -968 3289 5255 5244 4307 2213 -1526 -4589 -5577 -3511 -1304 1548 4278 5956 4798
1121D798l281k981k096k325l05K576M057K720J252Q88q54l199l706j482J20N66
$$ 4798 1517 -1464 -3560 -5885 -6190 -3614 443 3163 4415 5303 4449 1250 -2456 -3938 -3818 -3252
1137c252K380K979K618O6k041k075k698k504j307J399L177K362K364J978m8k963
$$ -3252 -872 2107 4725 4791 2750 675 -2023 -4527 -5834 -4435 -1258 1104 3468 5446 5398 2435
1153B435l516k089q34n03J635L375L461Q88o42j149k825l807k372N48J887J820
$$ 2435 -1081 -3170 -4004 -4507 -2872 503 3964 4852 4210 3061 236 -3571 -5943 -5395 -3508 -1688
1169a688L326K942J417j633k492k449j964k123P5K988K757J915P24L40k282l053
$$ -1688 1638 4580 5997 4364 1872 -577 -2541 -4664 -4589 -1601 1156 3071 3795 4135 1853 -1200
1185a200k590m28r6J578K619L193J902l86j830j674k669k807l16K419K189J449
$$ -1200 -3790 -4218 -4314 -2736 -117 3076 4978 4592 2762 1088 -1581 -4388 -4704 -2285 -96 1353
1201A353K084J641j600l155l133j394r70M18K746L634K590O07M1j115l154l985
$$ 1353 3437 5078 3478 323 -2810 -4204 -5174 -4756 -2010 1624 4214 4821 4862 3747 593 -3392
1217c392j109N86J378J499K697K503K06k204k312j763k083j193J417L348K462
$$ -3392 -4501 -3915 -2537 -1038 1659 4162 4368 2164 -148 -1911 -3994 -5187 -3770 -422 2040
1232B040J370J253l26k460l152j928n41M23J552K361K832L74j062j477k052k523
$$ 2040 3410 4663 4337 1877 -1275 -3203 -3744 -3321 -1769 592 3424 3798 2736 1259 -793 -3316
1248c316j849O46K627K467K291K071N12j945l034k234j422j158K77K687L062J803
$$ -3316 -5165 -4519 -1892 575 2866 4937 5449 3504 470 -1764 -3186 -4344 -4067 -1380 1682 3485
1264C485K63n68j794k881k410l16J003J231K197K932J671q12j889j728j907k021
$$ 3485 3748 3180 1386 -1495 -3905 -4221 -3218 -1987 210 3142 4813 4001 2112 384 -1523 -3544
1280c544o80J726K580J493J323K59n54k652k951p11O0Q27J793L267K158J0j007
$$ -3544 -4224 -2498 82 1575 2898 3157 2603 -49 -3000 -3711 -3651 -2824 -1031 2236 4394 4404 3397
1297C397j505k366l092j279J230J973J694J983K159k09k241k410j539j180r69
$$ 3397 1892 -474 -3566 -4845 -3615 -1642 52 2035 4194 3985 1744 -666 -2205 -3385 -4354
1312d354J528K817K665J208K07k98k045l430j642r7O90J116J990K441P73j342
$$ -4354 -2826 -9 2656 3864 4071 3773 1728 -1702 -3344 -3441 -2751 -1635 355 2796 3569 2227
1328B227j471j554j835j202P87K045K230J564Q88P11j951k997k397k96o5N04J891
$$ 2227 756 -798 -2633 -3835 -3048 -1003 1227 2791 3679 4390 2439 -558 -2955 -3251 -3316 -2812 -921
1345i21L110J266m71r51j147k552k188l87J582K314J735K066J479j304k281j790
$$ -921 2189 3455 2984 2033 886 -1666 -3854 -4241 -2659 -345 1390 3456 4935 3631 1350 -440
1361d40j738j336p99J820K931J520L21N25l27k124k845p94P58Q57J205K416J777
$$ -440 -2178 -3514 -4313 -2493 438 1958 2279 2804 2477 353 -2492 -3286 -2528 -1671 -466 1950 3727
1378C727J70j796j540j322k479r01J081K263J771R09J179L1j668k912j255j98
$$ 3727 3897 2101 561 -761 -3240 -4141 -3060 -797 974 1883 3062 3093 1425 -1487 -2742 -2940
1394b940K60O23K945K741K19n83j088j549k619k316J70J666J489J796J789J338
$$ -2940 -2680 -2057 888 3629 3848 3265 2177 628 -1991 -4307 -4137 -2471 -982 814 2603 3941
1410C941j345k218j325j336q03J67J879K619J178K85J75r35k844k272n47N29P08
$$ 3941 2596 378 -947 -2283 -3086 -2919 -1040 1579 2757 3042 3217 2282 -562 -2834 -3381 -2852 -2144
1427b144J503K220J738p72j378r00j711j600j49J756K190J519P83N22o47k565
$$ -2144 -641 1579 3317 2545 1167 267 -1444 -3044 -3193 -1437 753 2272 3055 3577 2930 365
1443C65k264j352K45j63J161K530K209K87j86q84j846k445j147Q54J261J337J730
$$ 365 -1899 -3251 -3006 -3169 -2008 522 2731 3018 2832 1948 102 -2343 -3490 -2636 -1375 -38 1692
1460A692J459N20j520k375j090j441p09L74K231K162O43K67L6j077k448j203N9
$$ 1692 3151 3671 2151 -224 -1314 -2755 -3464 -3090 -859 1303 1946 2213 2249 1172 -1276 -2479 -2420
1477b420Q55Q07J620J802O92r96j301j588j955j286J78J954J494J553J077P80
$$ -2420 -1565 -758 862 2664 3356 2360 1059 -529 -2484 -3770 -3592 -1638 -144 1409 2486 3266
1493C266j052k067j705q06j10J81J666K684R15J45p39r95k239j842o45R81P42
$$ 3266 2214 147 -1558 -2364 -2474 -2293 -627 2057 2972 3117 2378 1383 -856 -2698 -3343 -2362 -1620
1510a620J355K228Q93k61j309j362j074j338j66J181K085J282K81L74o31j798
$$ -1620 -265 1963 2856 2595 1286 -76 -1150 -2488 -2654 -1473 612 1894 2175 2549 1918 120
1526A20k145j062n6R49J202J902J722M80j161p76j462j942r49Q66J553J647J006
$$ 120 -2025 -3087 -3143 -2194 -992 910 2632 3112 1951 1175 -287 -2229 -3178 -2312 -759 888 1894
1543A894R73m6j522j906j230j054l17O80J990K133Q39J98m00j190j905j379N3
$$ 1894 2867 2821 1299 -607 -1837 -2891 -3208 -2528 -538 1595 2434 2632 2232 1042 -863 -2242 -2189
1560b189O87R53J292J475O19q04j741j088j225q23O6J816J818O56R50K32j062
$$ -2189 -1502 -549 743 2218 2837 2033 292 -796 -2021 -2844 -2778 -962 856 1512 2462 2694 1632
1577A632j889j316m98j74P04J825J244J313m71j014j045j823j624j65J176J631
$$ 1632 -257 -1573 -2071 -2245 -1541 284 1528 2841 2370 1356 311 -1512 -3136 -3301 -2125 -494
1593d94Q48J708Q18j4j920j195j025r81l64J283J572J495J99K11p73j526j905
$$ -494 354 2062 2880 2866 946 -249 -1274 -2255 -2619 -1336 236 1731 1930 2141 1368 -158 -2063
1610b063o54L60O86J267J494J396L64j145j159j131j207o91N85J785J207O63M27
$$ -2063 -2717 -2357 -1671 -404 1090 2486 2850 1705 546 -585 -1792 -2483 -1898 -113 1094 1757 2184
1627B184j69j340k017j174o0K63Q09J586K063P75n48o50j234j553j530M10J218
$$ 2184 2015 675 -1342 -2516 -2576 -2313 -1504 82 2145 2920 2372 1722 488 -1065 -2595 -2185 -967
1644i67P72J090J292J71q33j518r20j122n24L10J374J999Q51M3Qp20j522j418
$$ -967 -195 895 2187 2358 1525 7 -913 -2035 -2559 -2249 -875 1124 1975 2018 2026 1306 -216 -1634
1662a634k62L01Q95Q40J437P32m56j233r46r56j100m22J250J773J221P23K73k0
$$ -1634 -1896 -1595 -700 140 1577 2309 1853 620 -326 -1282 -2382 -2804 -1554 219 1440 2163 2436 2416
1680B416j882j281p11l56j59J033J336J668l0o85m50j012j525j053N50J030R93
$$ 2416 534 -747 -1458 -1814 -1973 -940 396 2064 2034 1349 899 -113 -1638 -2691 -2141 -1111 -118
1697a18J062J463J73q17j634q82p17o01M12J388J092P07O0q0r30j717j015k6P85
$$ -118 944 2407 2580 1763 129 -753 -1470 -2071 -1659 -271 821 1528 1588 1508 578 -1139 -2154 -2180 -1395
1716a395O45J393J196P89q04r22q99j179r31K00R99J040J199M96N46r88j533j318
$$ -1395 -750 643 1839 2628 1824 902 3 -1176 -2107 -1907 -908 132 1331 1827 2373 1385 -148 -1466
1734a466m51l70L02J348J755J388m78n5r64j283j306o24N75Q53R30J110O74l46
$$ -1466 -1917 -2287 -1985 -637 1118 2506 2028 1973 1009 -274 -1580 -2204 -1629 -776 154 1264 1938 1592
1752A592r96j283m81n84l05J063J083J594Q0L38p66q00j686m37R1J02Q90J240
$$ 1592 596 -687 -1168 -1752 -2057 -994 89 1683 1763 2101 1335 535 -1151 -1588 -1497 -1395 -505 735
1770G35J155j56o23q73p22j287n36J70J660J167Q76N18L67j301j157j274m28j81
$$ 735 1890 1734 1111 238 -484 -1771 -2307 -2137 -477 690 1566 2084 2451 1150 -7 -1281 -1709 -1890
1788a890O13J140J050J216o95l28p57j131j378J35J012P34P81J058M90j67j687
$$ -1890 -1277 -137 913 2129 1434 1106 349 -782 -2160 -2025 -1013 -279 502 1560 2050 1883 196
1805A96l86j039n36m2R70J416M29O38P1q57j070j165n16K70O77R48J316P72pq68
$$ 196 -190 -1229 -1765 -1807 -837 579 1008 1646 1717 860 -210 -1375 -1891 -1621 -944 4 1320 2092 2085 1217
1825A217o37j228q77p69R27J058R06P60O48l30q40j520n09m31L1Q98J029J396
$$ 1217 580 -648 -1525 -2294 -1367 -309 597 1357 2005 1675 835 -685 -1194 -1625 -1594 -696 333 1729
1843A729P6j77l68j020j366o98K92P53N12R29P99J67p18q09q38n49k14m6J438
$$ 1729 1805 1628 1260 240 -1126 -1824 -1532 -779 -267 662 1461 1628 910 101 -737 -1286 -1500 -1546 -108
1862a08Q01Q69J73Q3q69j411j034j82K97L06Q83J408M68l01p01n30j057q47J0
$$ -108 693 1562 1735 1818 949 -462 -1496 -1678 -1381 -1075 -192 1216 1684 1383 682 152 -905 -1752 -1742
1881a742P43J005M64J103M01l36j328j048o26j11j16R45J109Q66J58k57o11p23
$$ -1742 -999 6 470 1573 1974 1638 310 -738 -1364 -1475 -1591 -646 463 1329 1487 1230 619 -104
1899a04j359j46L71N78Q19Q16J090l95j014q06l45j024k19M15J201R70K95M33
$$ -104 -1463 -1609 -1238 -660 159 975 2065 1670 656 -150 -495 -1519 -1738 -1323 -122 848 1143 1576
1917A576m68n89j370m66N2r3J024N79J317M53r07l52o22j101j017M82M79Q50Q04
$$ 1576 1108 519 -851 -1317 -1265 -1358 -334 245 1562 2015 1108 756 134 -967 -1984 -1502 -1023 -173 631
1936F31O53K67p56o85p54o47N7J67J074R89M70q8j93p31j054r05j76P97K33R34
$$ 631 1284 1551 795 110 -644 -1291 -1234 -1067 7 996 1466 1378 1185 454 -600 -1505 -1681 -884 -651 283
1956B83P28L69l67p13l55o07p01q5R53Q95O29J60J32j75j155p00r57L02R3O68
$$ 283 1011 1380 1013 300 -55 -662 -1363 -1448 -495 400 1029 1189 1321 1146 -9 -709 -1666 -1364 -1271 -603
1976f03J338O68j66j84n13p50r31l35M03M82N44Q48N44j67q03q45l62l07l45N49
$$ -603 735 1403 1237 1053 540 -210 -1141 -1476 -1073 -591 -47 801 1345 1178 375 -470 -832 -1139 -1484 -935
1996i35R45P73K14j67k8m69j423j29K10K99M97O74J167k33m60p03p13o03p24N66
$$ -935 10 783 997 830 802 333 -1090 -1219 -1009 -710 -213 461 1628 1395 935 232 -481 -1084 -1808 -1242
2016a242O27J015M76K72Q6m97j046m95k50pK91P39J254J80q7m84o01p32o15l66
$$ -1242 -615 400 876 1148 1234 737 -309 -804 -1054 -1061 -770 -31 1223 1403 1316 832 231 -501 -1116 -1482
2036a482N61N13P74Q14Q0j09q03o89l99l24P8N51J132L71L15j95n78o51j306O
$$ -1482 -921 -408 366 1180 1260 1151 348 -341 -740 -1064 -986 -435 697 1068 1383 1188 610 -41 -1347 -1341
2056a341L28K75N32J103N71l23k98n26p48k91p45O32N42Q11L36M16j33o95p54
$$ -1341 -1013 -738 -206 897 1468 1145 847 321 -427 -718 -1463 -831 -289 522 858 1274 1141 446 -308
2075c08q62J19p6K87R01J081k53K08l83o97r07n51N80N31L52P24M10p8m11r07
$$ -308 -1170 -1051 -1127 -840 61 1142 889 1097 714 17 -890 -1441 -861 -330 22 746 1156 1078 667 -240
2095b40j16n25n32K67Q36J034M13r3k24j8j200o99K86L5K61O96Q20J37j67m25
$$ -240 -356 -881 -1413 -1146 -310 724 1137 1044 820 802 -398 -1097 -811 -776 -515 181 1001 1138 971 546
2115E46m90q64p34K97N69O00M13O52L93n55n53n71m17J5l87P67O80N23r4j44k43
$$ 546 56 -808 -1542 -1245 -676 -76 337 989 1382 827 274 -297 -714 -699 -1086 -319 361 884 790 646 403
2136D03l61j162k73P97K30N59N23O53k79p39p66m1n11j76N42O19N39K42M16j62
$$ 403 42 -1120 -1393 -596 -366 193 716 1369 1090 351 -415 -456 -967 -1143 -601 18 557 799 1215 1053
2156A053j003p10l75K08p5Q30K81R84J40o26o8m64q14m01L5L68Q14M00N03k04
$$ 1053 50 -660 -1035 -827 -902 -72 209 1193 1333 707 639 175 -639 -1040 -1005 -637 177 577 1080 876
2176H76m83l53p09n3om2P36O63K86j36o8k67q64k70k26K35M27L50M71P41o96m47
$$ 876 393 40 -669 -722 -728 -770 -34 629 915 779 711 444 -420 -690 -916 -681 -254 96 567 1308 612 165
2198A65m88j28m98j66M65O96Q00J77n4k44p52n76n08M21r9L51Q31N15q1k15m82
$$ 165 -323 -451 -949 -1115 -650 46 846 1023 969 725 -27 -603 -1111 -690 -789 -438 393 908 827 612 130
2219A30l78n60l60L74K90N76M65N98j78o18o29m72M5j94L70O47N92K02j37j10
$$ 130 -248 -808 -1168 -794 -504 72 537 1135 957 339 -290 -762 -717 -911 -541 106 698 900 763 653
2239F53l60r74k56L15R1M57L88O85Lj77n26l45p99k70j05J029M32N19J1K02k29
$$ 653 293 -681 -937 -622 -531 -74 314 999 1002 825 299 -46 -845 -1115 -1220 -191 241 760 771 973 744
2260G44q92l85k62J20L0N71P32L02N3n44o20k49o13k6P00L95o6N44M38k21o56
$$ 744 -148 -533 -795 -675 -645 -74 658 960 1013 469 -151 -400 -1013 -1039 -339 56 -10 534 972 751 95
2281I5l43n29n2L16l4R78K79j7M3l26n19m44l71J90K86P06K69N20m99R2p12k46
$$ 95 -248 -777 -829 -513 -547 431 710 693 736 410 -109 -553 -924 -734 -448 258 527 1047 548 640 -72 -318
2303c18m93r4k8J103pK99M36l4l87p50m59P7M3j80J014K84K72j54m43n7m48o92
$$ -318 -811 -905 -933 170 163 462 898 864 477 -273 -732 -655 -612 -792 222 506 778 624 181 124 -324 -1016
2325a016K53L78J81P67L23j83k69l67n10j96n6j0M44Q29L48j86p2l35o75l88r4
$$ -1016 -763 -385 -204 563 886 703 434 67 -443 -639 -695 -705 -261 568 916 730 658 323 -352 -740 -834
2346h34Q2R5J004M36K21k39l75l46o22k81k26N21M62L28N58J57l73m42m38m18
$$ -834 -752 -657 347 783 1004 765 390 44 -578 -859 -1085 -564 -102 226 784 941 568 126 -312 -730
2366g30J10k0N95L61L43N0l09K0l47o47m28L36K37N22M37J71K8l64l91l55k94
$$ -730 -620 -640 -45 316 659 709 400 420 73 -574 -1002 -666 -429 93 530 701 729 365 -26 -381 -675
2387f75K31M1K23R75j93j32J32n09l87o71L35O2M61K71J40M54j98j49o26q0l77
$$ -675 -444 -403 -180 795 602 470 602 93 -294 -965 -630 -568 -107 164 304 758 560 411 -215 -295 -672
2408f72RL12M32M77L17j59m17l05m84o7J64p2M37L21K50j22j81K24o00k88j37
$$ -672 -663 -351 81 558 875 716 299 -6 -490 -557 -393 -465 -28 293 543 421 240 464 -136 -424 -561
2429e61L18L09J31J69L19J94p01m76k12p1o0M09L46M12M7p4j08m42l34l06K5J94
$$ -561 -243 66 197 366 685 879 178 -298 -510 -581 -641 -232 114 526 573 499 391 -51 -385 -691 -666 -472
2451d72L33J96P30K17n72j39n06k69j46K73k52N91M58L62j71l45n37N7m10J49
$$ -472 -139 57 787 1004 432 293 -213 -482 -628 -355 -607 -16 442 804 633 288 -249 -192 -602 -453
2471d53K92K57M75m2j20l56p6l23l92K1L50K92J43M68Nl78k56k06N1l39p8K67
$$ -453 -161 96 571 529 409 53 -23 -346 -738 -717 -367 -75 68 536 541 163 -93 -299 -248 -587 -665 -398
2493c98L73M74K17p3k92m97k44j86r6J84N00M45M83l84k08j82k59l85r1K13N2
$$ -398 -25 449 666 593 301 -196 -440 -626 -722 -538 -38 407 890 506 298 116 -143 -528 -619 -406 -354
2514c54P25J91Q2k5o87k42l71L53k49J49R36Q9j28m1m6n48j98j98R4L87J18NM56
$$ -354 371 562 644 619 -68 -310 -681 -328 -577 -428 508 597 469 428 382 -166 -364 -562 -468 -81 37 42 498
2537D98R8lq14J01l30k01R6O37K18N4L4K38l84p44K16P9J0k29N12M53Q0k79j8
$$ 498 596 593 -221 -120 -450 -651 -555 82 300 354 388 626 242 -502 -286 -207 -197 -426 86 539 619 340 322
2560C22n87j80jj53K96L17J70L82J33m09m15k08p1k53K66J47O65N70n65j01j73
$$ 322 -265 -445 -446 -599 -303 14 184 566 699 290 -125 -333 -404 -657 -391 -244 421 991 426 325 152
2581A52k02n26l3K15K04M05L62K8n1j04o58l8l25l8M64K37K11p8J18O0l54l30
$$ 152 -50 -576 -609 -394 -190 215 577 605 554 450 -208 -246 -571 -609 -145 92 303 225 343 403 49 -281
2603b81m40M20p5L21L90N3J37k06l58j77m6m08L06L64R1J34J16L3m11l61K71m92
$$ -281 -721 -301 -376 -55 335 388 525 319 -39 -216 -262 -670 -364 0 91 225 341 374 -37 -398 -127 -619
2625f19Q9J75L60K28L63k47k5j01l66j99N5r5K75L44K09L33n49N4m01l29k7K04
$$ -619 -530 -355 5 233 596 349 324 223 -143 -342 -287 -382 -107 237 446 779 230 284 -117 -446 -473 -269
2647b69J89J66J34J63k15K50l91l98K0q8J93m4M64M81q1k89l46m63m8r7L27K58
$$ -269 -80 86 220 383 168 418 27 -371 -351 -439 -246 -290 174 655 574 285 -61 -524 -572 -669 -342 -84
2669h4L00K41j73L56m07l19o8l14r1K96M23L56k90k9K72n43j53j73J32j1L42J89
$$ -84 216 457 284 640 233 -86 -154 -468 -559 -263 160 516 226 197 469 -74 -227 -400 -268 -279 63 252
2691B52J78J58m73k56J16m75O3J09J35N11kj57O7j71j58j00j81O1J83L39J00J59
$$ 252 430 588 115 -141 -25 -500 -437 -328 -193 318 316 159 226 55 -103 -203 -384 -323 -140 199 299 458
2713D58J51n66J1k12l15J87L68k14J50M40j21k22M2n28K35k66o6M75K79mP8J48
$$ 458 609 43 54 -158 -473 -286 82 -132 18 458 337 115 157 -371 -136 -402 -468 7 286 282 360 508
2735E08l32k23k52l08L26J24J68j27N28k75k12j2k78n3J92K8L5K86K84K38j90
$$ 508 176 -47 -299 -607 -281 -157 11 -116 412 137 -75 -87 -365 -418 -226 -198 -163 123 407 645 455
2756D55l59k00n18J88J92k05K73N31p4j21p7k39k37J11n0M72J1J14O5J72o7o41
$$ 455 96 -104 -622 -434 -242 -447 -174 357 283 162 85 -154 -391 -280 -330 142 153 267 332 504 437 -204
2778b04J31j28j18k62O40K52k53K91k31J54m12l37J36J19N3R4N38q6p7l40N9k47
$$ -204 -73 -201 -319 -581 59 311 58 349 118 272 -140 -477 -341 -222 -169 -75 463 377 300 -40 19 -228
2800b28r5K67k18L44M2L26J55k59m40k34J56j79M3K68J93J13L03l42K20l38n57
$$ -228 -323 -56 -274 70 112 438 593 334 -106 -340 -184 -363 -320 -52 141 254 557 215 435 97 -460
2821d60n7M13K34K49NP9n8l62m08l7L85k45J85J14L72k36o4p8J66m69J4J12Q2
$$ -460 -517 -104 130 379 384 463 405 43 -365 -402 -17 -262 -77 37 409 173 109 31 197 -272 -258 -146 -64
2844f4n5J62M00j28j05j73k36j25J3L12lK32J23m1K20l58k93l15K87n8j52K74
$$ -64 -119 43 443 315 210 37 -199 -324 -311 1 -2 230 353 312 532 174 -119 -434 -147 -205 -357 -83
2866h3M41p8J61l85p4ko0k62L08n4n5N01N0k49m0j91l12j29K32K71J24j10J08
$$ -83 358 280 441 56 -18 -20 -80 -342 -34 -88 -143 358 408 159 119 -72 -384 -513 -281 -10 114 4 112
2889A12p1p1j0j32L6J35j35L81P6K08pk81M7l26k67K42j48J89K39o8P9K3l10j33
$$ 112 41 -30 -40 -172 -136 -1 -136 245 321 529 522 241 288 -38 -305 -63 -211 -22 217 149 228 251 -59 -192
2913a92l1k67K52K20K33LJ29p8l8k91j96jRN65n14K65k4J58L5k67lj53K4j45L86
$$ -192 -223 -490 -238 -18 215 218 347 269 231 -60 -256 -257 -248 317 -197 68 44 202 237 -30 -33 -186 -162 -307 79
2938G9M23j70j64P0p4k49l7k41O1j31O54k73J97k7J81m77o4k09o8M44J08J27j42
$$ 79 502 332 168 238 164 -85 -122 -363 -302 -433 221 -52 145 118 299 -178 -242 -451 -519 -75 33 160 18
2961A8K50j84j59K1j79j70J94J46K11K73k96J38j30q5j87J04j60J0K53J56K04
$$ 18 268 84 -75 -54 -233 -403 -209 -63 148 421 125 263 133 48 -139 -35 -195 -185 68 224 428
2982D28k24l8k38J07m77P9J82J82L6J02J10j50k52j06K56k5o4J6J86L31l91q6
$$ 428 204 166 -72 35 -442 -363 -181 1 37 139 249 99 -153 -259 -3 -28 -92 -76 110 441 50 -36
3004c6K94m6l44k24K36j08J79M92j48J45j67l48j2k61J38N1J36J85K30o7r5k49
$$ -36 258 212 -132 -356 -120 -228 -49 443 295 440 273 -75 -87 -348 -210 -159 -23 162 392 325 230 -19
3026a9q0l06N8L05j12J31J10L11p6j80k35j12k6j08J03K15R9K57o9Pm01Nm7J43
$$ -19 -99 -405 -347 -42 -154 -23 87 398 322 142 -93 -205 -231 -339 -236 -21 78 335 266 273 -128 -123 -170 -27
3050b7j22K33J0K41l4j85j8l10k24K11L25K60k96Q0Q5k1j75k51L69l18l2J7L70
$$ -27 -149 84 94 335 301 116 98 -212 -436 -225 100 360 64 144 229 208 33 -218 151 -167 -199 -182 188
3073A88o3l7Q5J5k90R1L0k72J21K63J4k0M1j3j76l5k46J29J0L69J16k41L37j59
$$ 188 125 88 173 188 -102 -11 19 -253 -132 131 145 125 166 153 -23 -58 -304 -175 -165 204 320 79 416 257
3097B57m82M72o42K96j8J58p7K79k25J72j79J65j20k54j91N47j67J54j8J26l03
$$ 257 -225 247 -395 -99 -117 41 -36 243 18 190 11 176 56 -198 -389 158 -9 145 127 253 -50
3118e0J15j32j06oJ93J3j79M67j61l82K01J15l49j30L61O4k68L78RK52n91J50
$$ -50 65 -67 -173 -179 14 27 -152 315 154 -228 -27 88 -261 -391 -30 34 -234 144 153 405 -186 -36
3140c6j06J1K90j03oJ26k65L05j43k95j99R8K37j97K15K10K13j11k00j37R1j83
$$ -36 -142 -131 159 56 50 176 -89 216 73 -222 -421 -323 -86 -283 -68 142 355 244 44 -93 -2 -185
3162a85K22j86J66J73q0n9P1mk86kn3o5J21pM28j17j0j5j96J26q3J74j42k34L77
$$ -185 37 -149 17 190 110 51 122 118 -168 -170 -223 -288 -167 -174 254 137 127 112 -84 42 -41 133 -9 -243 134
3187A34J45Rk43K35j86k84K44r4R5J27o6m4M46j85n83J63J62l39O8J75P1Q9j90
$$ 134 279 288 45 280 94 -190 54 -40 55 182 116 72 518 333 -250 -87 75 -264 -196 -21 50 139 -51
3210e1M1q2O0J12m12N8L42m3l02O18J16l63P3k13J4n7L1j31L52L6k16j9J09m30
$$ -51 -10 -92 -32 80 -332 -274 68 25 -277 341 457 94 167 -46 -32 -89 -58 -189 163 199 -17 -36 73 -357
3234c57K72K60l82K88L2Q9K09j71k5k67%j93Q9J52o7k22N23m1j67j81j3R9k28
$$ -357 -85 175 -207 81 113 202 411 240 215 -52 -52 -245 -156 -4 -71 -293 230 189 22 -159 -172 -73 -301
3257c01M48j62J15P4q4L5J56k15j1o1l3qL35k70J61k09J24p6o5M1k97L02M18l91
$$ -301 147 -15 100 174 90 125 281 66 55 -6 -39 -47 288 18 179 -30 94 18 -47 -6 -303 -1 417 26
3281B6o4J45n2j65L1K84k54n7j1M51k57j05K59m54K82r6j17M9K03j5k4J77l32
$$ 26 -38 107 55 -110 -79 205 -49 -106 -117 334 77 -28 231 -223 59 -37 -154 -105 98 83 59 236 -96
3304i6K7n8l5J8p4J01K43k34K47l06K81J7l53J13j41L54j30J13n3q2R8R6j17k01
$$ -96 -69 -127 -162 -144 -218 -117 126 -108 139 -167 114 131 -222 -109 -250 104 -26 87 34 -48 50 146 29 -172
3328a72M1k16M90N4J0l44J50j64p7r4L65o5l7L5J08J06j14Q3j22M7k27J71j8M69
$$ -172 -131 -347 143 197 207 -137 13 -151 -228 -322 43 -22 -59 -24 84 190 76 159 37 84 -143 28 10 479
3352D79p32K09R0r7j33L57l02L34l09j4L16p3m6Op4j10O2q2l0M5n6L52j71L8J41
$$ 479 -253 -44 46 -51 -184 173 -129 205 -104 -118 198 125 79 85 11 -99 -37 -119 -149 -104 -160 192 21 59 200
3377B00j20R5k27j22K61j6K6k40M40O8l45k81J27J04J00j59K54k65J66K18k67
$$ 200 80 175 -52 -174 87 71 97 -143 297 365 20 -261 -134 -30 70 -89 165 -100 66 284 17
3398A7M17n10O8M9L3j53L72j59p9o2J63j2k21j46J45m0L1J06J35j53k0j24J71
$$ 17 434 -76 -8 41 74 -79 293 134 55 -7 156 144 -77 -223 -78 -118 -87 19 154 1 -19 -143 28
3421B8N7r7k61L16K18j54n6Q4l48J30l36J86R8N00j75n3k33K33L6j41m8j14K07
$$ 28 85 -12 -273 43 261 107 51 135 -213 -83 -419 -233 -135 365 190 137 -96 137 173 32 -16 -130 77
3444G7j73P4M64l18l62J12M8k14J61Q2K3Lj64K18R8k74J25k9J27k54L81L0k66
$$ 77 -96 -22 442 124 -238 -126 -78 -292 -131 -49 -26 -23 -187 31 129 -145 -20 -49 78 -176 205 235 -31
3467c1N0j74K03k06j43j38L53J13J36l21L26l6L9j54L65m88j82L85k22mK53j70
$$ -31 19 -155 48 -158 -301 -439 -86 27 163 -158 168 132 171 17 382 -106 -288 97 -125 -129 124 -46
3489d6J58k66p6L01P2k74J8J2P2Q7K0j16j14K55k21J55J92Jk40N2M0j61O5k34
$$ -46 112 -154 -230 71 143 -131 -113 -101 -29 58 78 -38 -152 103 -118 37 229 230 -10 42 82 -79 -14 -248
3513b48O7J24J74k7J81k34j18l5K33k48R1k22L06L67m41J2N9M8j68J01J16l30
$$ -248 -181 -57 117 90 271 37 -81 -116 117 -131 -40 -262 44 411 -30 -18 41 89 -79 22 138 -192
3535a92J91k25K17j94R6J09J19l92J36K05J68l17q2K11O7M0o1R5l99N7k9K39M2
$$ -192 -1 -226 -9 -203 -107 2 121 -271 -135 70 238 -79 -161 50 117 157 96 191 -208 -151 -180 59 101
3558A01j22L5L0R5j27J6J96j15n8j07O4j90Q4O3K25r6J5j42N9J46j90k32K96J21
$$ 101 -21 14 44 139 12 28 224 109 51 -56 8 -182 -98 -35 190 94 109 -33 26 172 -18 -250 46 167
3582A67j88K1j9K58l26j36M77k27j85K66J87r9p3j17j46J23k4K09m33L5K77j01
$$ 167 -21 0 -19 239 -87 -223 254 27 -158 108 295 196 123 6 -140 -17 -41 168 -265 -230 47 -54
3604e4K3K45m26K17j84J59K61j59k26J55n6l7j68J27Pj21l1L29K46l73pR2r4j82
$$ -54 -31 214 -212 5 -179 -20 241 82 -144 11 -45 -82 -250 -123 -116 -237 -268 61 307 -66 -73 19 -75 -257
3628b57J89J82O9k35rPR8n7l3j5J98k65K56q1J7O4q8J54r4j48M3J24j22K11k32
$$ -257 -68 114 183 -52 -61 -54 44 -13 -46 -61 137 -128 128 47 64 128 40 194 100 -48 -5 119 -3 208 -24
3653b4J36j09j18P1j84K37J04k67m1R7O5L22l83kq4L65l44R0L57l18jj9P3n7l00
$$ -24 112 3 -115 -44 -228 9 113 -154 -195 -98 -33 289 -94 -96 -180 185 -159 -69 288 -30 -31 -50 23 -34 -334
3678c34M29o0J2j08l4J04r1J98J49k30j6K0l40L13J16k2j26K9N0m1p2m3k08M96
$$ -334 95 35 47 -61 -95 9 -82 116 265 35 19 39 -301 12 128 106 -20 9 59 18 -54 -97 -305 191
3702A91k62j29M05l11l5L10k81K03j73K21j24N0j22J80k11L03j10k03J15j77M49
$$ 191 -71 -200 205 -106 -141 169 -112 91 -82 139 15 65 -57 123 -88 215 105 -98 17 -160 289
3723B89j67M0k39j07L00r9K11j11k20J47o5Q6J26k98J04O0O2l60J82M4k9O2J11
$$ 289 122 162 -77 -184 116 17 228 117 -103 44 -21 65 191 -107 -3 57 119 -241 -59 -15 -44 18 129
3746A29l98J59L3K85k94j4K00j29J04k81L54k62K3J49J96l55l7K48j9k78K98p8
$$ 129 -269 -110 -77 208 -86 -100 100 -29 75 -206 148 -114 -91 58 254 -101 -138 110 91 -187 111 33
3768C3J35k64K09j49m8M60l68q8k8j2j87K95l4p7k01L25j59q8K41J44j16Q5Lo3
$$ 33 168 -96 113 -36 -84 376 8 -80 -108 -120 -307 -12 -46 -123 -324 1 -158 -246 -5 139 23 108 111 48
3792D8J86m37J61j00q4K15R8j41n7K28o7K45l39J7M2k42J45m6L22r2j02N6j24
$$ 48 234 -203 -42 -142 -226 -11 87 -54 -111 117 50 295 -44 -27 15 -227 -82 -128 194 102 0 56 -68
3815f8k05N1O9J05m1J86m6n5p4j79M07k76L32j31j88M21o6l67O5j6K17j64j30
$$ -68 -273 -222 -153 -48 -89 97 51 -4 -78 -257 150 -126 206 75 -113 308 242 -125 -60 -76 141 -23 -153
3838a53J8Q9P9R6n9j44J2J25M1j83J64l20K06N3m6L41k94k50K08q4J21o6p0N2
$$ -153 -135 -46 33 129 70 -74 -62 63 104 -79 85 -235 -29 24 -22 319 25 -225 -17 -101 20 -46 -116 -64
3862f4O3n9j2k63L44l9J1OJ60o4r2k60M27k38O6J27j42K07J55k66M9j53k8k57
$$ -64 -1 -60 -72 -335 9 -30 -19 -13 147 83 -9 -269 158 -80 -14 113 -29 178 333 67 116 -37 -65 -322
3886c22K87M9J37k28N6P0J57j47O1j71o4L02j51P5k31J28K2j56J06J41k05n3K31
$$ -322 -35 14 151 -77 -21 49 206 59 120 -51 -115 187 36 111 -120 8 30 -126 -20 121 -84 -137 94
3909I4l05NJ03J69j1l2Q8Kj00j13J08J34j42J54k91k5L16p5o4j34K68k44m3Q8
$$ 94 -211 -206 -103 66 55 23 111 113 13 -100 8 142 0 154 -137 -162 154 79 15 -119 149 -95 -138 -50
3933e0J06Lj37M7M2J18r6J09O1k7o7j80o8rK67k01K32r3l3rk5Q1J07p7j15o7J51
$$ -50 56 59 -78 -31 11 129 33 142 203 176 109 -71 -139 -148 119 -82 150 57 24 15 -10 71 178 101 -14 -81 70
3960G0QL8Mj81J94l52L52j89j27L76l5k27J07J35j56K3j36J29Q3K16l20r4L4L2
$$ 70 78 116 120 -61 133 -219 133 -56 -183 193 158 -69 38 173 17 40 -96 33 116 332 12 -82 -48 -16
3984a6p1k4P7j1J74oJ17k49QJ2L5M8M7j64N3K9r3q7J34k42J68J24j13M1K50j27
$$ -16 -87 -111 -34 -45 129 123 240 -9 -1 11 46 94 141 -23 30 59 -34 -121 13 -229 -61 63 -50 -9 241 114
4010A14k44J44k25K59j87J10N2j57M2J0k7p4J63j35O7J69k03j01L12j66R0J8J91
$$ 114 -130 14 -211 48 -139 -29 23 -134 -92 -82 -109 -183 -20 -155 -88 81 -122 -223 89 -77 13 31 222
4033B22l3k26K60j55K3j53lmL2J55R4j92Ro8p2J41j68K52j07J38j71J38j28j81
$$ 222 189 -37 223 68 91 -62 -65 -69 -37 118 212 20 29 -39 -111 30 -138 114 7 145 -26 112 -16 -197
4057a97K20J7J24j16Jl50J72j2R5K78j14R1l59N4Q6n0J20J82j0k79J95j04j8q0
$$ -197 23 40 164 48 49 -301 -129 -141 -46 232 118 209 -150 -96 -10 -60 60 242 232 -47 148 44 26 -54
4081e4J30no3j41K13j12k20R3J88m5K1l3J25Lj28L3j98r6K21K61j04J34k69m7
$$ -54 76 71 8 -133 80 -32 -252 -159 29 -16 5 -28 97 100 -28 5 -193 -289 -68 193 89 223 -46 -93
4105i3R9P3j27J08LK3j18O0K80l11j05J76J85k61K3L4Q8j38j2J57l5k08R3J25
$$ -93 6 79 -48 60 63 86 -32 28 308 -3 -108 68 253 -8 15 49 137 -1 -13 144 109 -99 -6 119
4129A19j0j44n6J63l94N20n21L59J00k32N8jK29k87n6J81K3R5j91M8J06l69L49
$$ 119 109 -35 -91 72 -322 198 -323 36 136 -96 -38 -39 190 -97 -153 28 51 146 -45 3 109 -260 89
4152H9J59k78K02%N4m4q0p4J39j41n29M27J55J49k93j43L4K24lJ27m4R7j70J8
$$ 89 248 -30 172 172 226 182 102 28 167 26 -503 -76 79 228 -65 -208 -174 50 47 174 130 227 57 75
4176G5j2k37j1K56L4l33K15j07J60q2KQ7k59J81k5l6Lp9J46M6R2p0Ol2k4P4J0
$$ 75 63 -174 -185 71 105 -228 -13 -120 40 -42 -40 47 -212 -31 -56 -92 -89 -168 -22 24 116 46 52 20 -4 70 80
4203H0k58O6L72l04J02pk4j18K75k35J62j57LJ6p4N3j3K40m95M66Mj40j88J9L
$$ 80 -178 -112 260 -44 58 51 27 -91 184 -51 111 -46 -43 -27 -101 -48 -61 179 -316 150 154 14 -174 -155 -152
4228a52J09o9J18k50N23l00l71N45P8l54J84J14k3j20Q6k87R5k05K14J78q8j25
$$ -152 -43 -112 6 -244 279 -21 -392 153 231 -123 61 175 152 32 118 -169 -74 -279 -65 113 25 -100
4250a00R3O3j38J07k58LK62j1n8K46j25nk23j48N07m82L75k52k7J30J71j92p5
$$ -100 -7 56 -82 25 -233 -230 32 21 -37 209 84 79 -144 -292 215 -267 108 -144 -171 -41 130 -62 -137
4273a37O5J45j22K32m47N54l18K46l40J0M4J4J91j25PL3l7N2M2O3k57M8J1q8N2
$$ -137 -72 73 -49 183 -264 290 -28 218 -122 -112 -68 -54 137 12 19 52 15 67 109 172 -85 -37 -26 -114 -62
4298f2J31q8n1J62j17j5Q1o8l05K76j76L04n8J06j73J75M5j25qp8m3N7K22K32
$$ -62 69 -19 -70 92 -25 -40 41 -27 -332 -56 -232 72 14 120 -53 122 167 42 34 -44 -87 -30 192 424
4322D24l31N7k26P5P3L6J34k06j0n1L0%Lj78K50l2j18o6J86J60o4K7k0k02o8O9
$$ 424 93 150 -76 -1 72 108 242 36 26 -25 5 5 8 -170 80 48 -70 -136 50 210 146 173 153 -49 -117 -48
4348d8Q3j59J38M5j34K25k36K85n11J63J43r3kj38M19j34K2j30N5O6K6P5l22L92
$$ -48 35 -124 14 59 -75 150 -86 199 -312 -149 -6 -99 -101 -239 180 46 68 -62 -7 59 85 160 -162 230
4372B30j11j92J53J2k39J44j44J25J5K71o2k93K42j21l1pL5j40J02J53N0k37J36
$$ 230 119 -73 80 92 -147 -3 -147 -22 -7 264 202 -91 151 30 -1 -8 27 -113 -11 142 192 -45 91
4395I1k24N2k0qJ33k39M96l14o2K42j45R6k11k53K66j33M73k69k67N65j43q4N4
$$ 91 -133 -81 -101 -109 24 -215 281 -33 -95 147 2 98 -113 -366 -100 -233 240 -29 -296 269 126 42 96
4418I6j33K4p6k6K01J80r4J6k88O8M5R7K31k16j57J39j99j4L6o5J07l0J03j3J1
$$ 96 -37 -13 -89 -115 86 266 172 188 -100 -32 13 110 341 125 -32 107 -92 -106 -70 -135 -28 -58 45 32 43
4443D3J75k24J18m0j87R2J61k56k07N06o2j25m8J42r9J79l57q9K32J19j20K43
$$ 43 218 -6 112 72 -115 -23 138 -118 -325 181 119 -6 -54 88 -11 168 -189 -278 -46 73 -47 196
4465A96j83M0m2K22l69J81j41O7K38p9K23m36K16j66j11K20l9pJ82m01L06j29
$$ 196 13 53 11 233 -136 45 -96 -29 209 130 353 -83 133 -33 -144 76 37 30 212 -189 117 -12
4487a2K2N6l2n6j95K77j03n9J61M7J9K9k63P8j7m1J9J08n2Q9p6K65l19J49j07
$$ -12 10 66 34 -22 -217 60 -43 -102 59 106 125 154 -109 -31 -48 -89 -70 38 -14 75 -1 264 -55 94 -13
4512a3Q9N0o9l30L72k1r9M6j60J54O1j4j53j56M83l91k09J85J74J1K6j34nj1L9
$$ -13 76 126 57 -273 99 78 -21 25 -135 19 80 66 -87 -243 240 -151 -360 -175 -1 10 36 -98 -103 -114 -75
4537g5J21m9J6QK3k05M1K28m2%J14k60Q9P6j84J22j20O0j03K68j99J00j33K81
$$ -75 46 -3 13 21 44 -161 -120 108 66 66 180 -80 9 85 -99 23 -97 -37 -140 128 -71 29 -104 177
4561A77j9m1Nj79K16k54p7L34j09O5l82N4K42k88O4J77K4J84k72K25n1j1L4k43
$$ 177 158 117 122 -57 159 -95 -172 162 53 118 -264 -210 32 -256 -192 -15 9 193 -79 146 95 84 118 -125
4585a25K8J35p3J4J92j24J39J24l10j72J63m4O0L86o01L40q3k06J17kO0j59R6
$$ -125 -97 38 -35 -21 171 47 186 310 0 -172 -9 -53 7 393 -208 132 49 -157 -40 -42 18 -141 -45
4608d5M46m14k2l1J88o1k2K5j29L71k25r0J74k83K09K0J04m24M29k18L5o2j11
$$ -45 401 -13 -35 -66 122 61 39 64 -65 306 81 -9 165 -118 91 111 215 -209 220 2 37 -25 -136
4631a36r8M2J40j52R6L6J5j33L1K31q8p1M6J92k17j0n7Q6K02l02K54k10L0j3j97
$$ -136 -234 -192 -52 -204 -108 -72 -57 -190 -159 72 -16 -87 -41 151 -66 -76 -133 -47 155 -147 107 -103 -73 -86 -283
4656b83K63j88J42qj34M21p1r9Q0j00o2K6j20j64K51R0m4J95Q8j77r2o3m6K4n4
$$ -283 -20 -208 -66 -74 -208 213 142 43 123 23 -39 -13 -133 -297 -46 44 0 195 283 106 14 -49 -95 -71 -125
4681a25J97j34J47l4J8k43J16o2K6N3n7J41J81P0n33J36LJ30j83N28k38j5j22
$$ -125 72 -62 85 51 69 -174 -58 -120 -94 -41 -98 43 224 294 -239 -103 -100 30 -153 375 137 122 0
4704@J33p5n1n0L6L3n4N3J54k7j97N5o6K22m07J94L2o9k27M85rl85K62K05m17
$$ 0 133 58 7 -43 -7 26 -28 25 179 152 -45 10 -56 166 -241 -47 -15 -84 -311 174 165 -220 42 247 -170
4729a70P7k7J4J60qJ31j05j08K38k04k7j32j16L60j14j01p6L09Q0j82j15L5K39
$$ -170 -93 -120 -106 54 46 177 72 -36 202 -2 -29 -161 -277 83 -31 -132 -208 101 181 -1 -116 -81 158
4752A58j61m2P1n8o4J75M9k08J93j65K7m2j8L26l45M79l32l2q4J63K2j32K08M1
$$ 158 -3 -45 26 -32 -96 79 128 -80 113 -52 -25 -67 -85 241 -104 375 43 11 -73 90 112 -20 188 229
4776B29j83l0N7j77J20p0L8K33r2m5j82J79j63n4J83K9j84J62K8j0n9J32j79R2
$$ 229 46 16 73 -104 16 -54 -16 217 125 80 -102 77 -86 -140 43 72 -112 50 78 68 9 141 -38 54
4800E4n3O0j65J32K9rk51K13J50o7J90j29j0j10L0J00M7j43K0n0j31m0K28J92
$$ 54 1 61 -104 28 57 48 -203 10 160 93 283 154 144 34 64 164 211 68 88 38 -93 -133 95 287
4824B87m04K34j66L36j84P5J57j83k06k12K79k96M45l33j00M85j91K8m7P9n3m
$$ 287 -117 117 -49 287 103 178 335 152 -54 -266 13 -283 162 -171 -271 214 23 51 4 83 30 26
4846B6l8p9J01kJ2o7Q3J51k86k9R9M5K11J8k93j86M58k59JN9p2L46k23K18p4k94
$$ 26 -12 -91 10 8 20 -47 36 187 -99 -128 -29 16 227 245 -48 -234 224 -35 -34 25 -47 299 76 294 220 -74
4872g4R9o7n8J35J90j96P3J40l03J55j27L3j13K18M9j76K28k72j39K14K14k51
$$ -74 25 -42 -100 35 225 29 102 242 -61 94 -33 0 -113 105 154 -22 206 -66 -205 9 223 -28
4894b8Mk9Q0P7k41J12J35m6k03L90k05j96J42l62M36Q4N1l7j7j48O6j24r5K34
$$ -28 -24 -53 27 104 -137 -25 110 64 -139 251 46 -150 -8 -370 66 150 201 164 147 -1 65 -59 -154 80
4918H0jl3K9j64J33M5j25L25m18k68L87j03N19l52K85k71J97k24k46j3K14L10
$$ 80 79 46 75 -89 44 89 -36 289 -129 -397 -10 -113 406 54 339 68 265 41 -205 -218 -4 306
4940C06n04J64J69J27l17N5K08m28J66M2p1P9J26l11L48M7k68L5r9J69j54L86
$$ 306 -198 -34 135 262 -55 0 208 -220 -54 -12 -83 -4 122 -189 159 206 -62 -27 -126 43 -111 275
4962B75l73k37M79n5N5J3l62K12k02K88j11j32J04r7MO8K1K34j17J00j91P9j94
$$ 275 -98 -335 144 89 144 157 -205 7 -195 93 -18 -150 -46 -143 -139 -71 -50 184 67 167 -24 55 -139
4985a39L34j53j27l2M1p5J9J58P9R5j42j62m6J57k28M67k23J3P8m60L94q1J90
$$ -139 195 42 -85 -117 -76 -151 -132 26 105 200 58 -104 -150 7 -221 246 23 36 114 -346 48 -33 157
5008A57j45J4N7j80K96k57j43J64J13l47J86K1m34M75J84O9l33J81k67J84j4k12
$$ 157 12 26 83 -97 199 -58 -201 -37 76 -271 -85 -64 -498 -23 161 230 -103 78 -189 -5 -19 -231
5030b31L04j40k4L38r0j09j03J48k93J19L0l5R6N1L7j01rJ85k03q7K22k51J05
$$ -231 73 -67 -91 247 157 48 -55 93 -200 -81 -51 -86 10 61 98 -3 -12 173 -30 -117 105 -146 -41
5053d1J11P2k75J46K66n35J81k5K9J51Klj97L65M6k77j21K96l41K62j82P5K94
$$ -41 70 142 -133 13 279 -256 -75 -100 -71 80 82 79 -118 247 293 16 -105 191 -150 112 -70 5 299
5076B99l76j39M22n7k36K47k16J08j07qk71L87M3j11j08J0J34J27k74J59r9J57
$$ 299 -77 -216 206 149 -87 160 -56 52 -55 -63 -334 53 96 -15 -123 -113 21 148 -126 33 -66 91
5098I1k69J86k7O6p3m8kJ92j30p2J9m5Q1p2K7M1n2Q9R4k92L16p0r5m07M97j00
$$ 91 -178 8 -19 47 -26 -74 -76 116 -14 -86 -67 -112 -31 -103 -76 -35 -87 2 96 -196 120 50 -45 -452 45 -55
5124e5J37j06K14M4j61q9k16N7K20k96L88nl55L18k07K69Nl50Q9p0J72qMj58K26
$$ -55 82 -24 190 234 73 -16 -232 -175 45 -251 137 132 -223 95 -112 157 162 -188 -99 -169 3 -5 -1 -159 67
5149F7j03Q6j72J17J3K3j27K06k5P0j09J69k66o9k9Q3K07j35l4K21p4n9k08K57
$$ 67 -36 50 -122 -5 8 31 -96 110 85 155 46 215 -51 -120 -149 -66 141 6 -28 193 119 60 -148 109
5173A09r0l82J52M1L92k18J48l59M19m71Q8N3J6j15J61Oqm6O0K8N6k37KM68m74
$$ 109 19 -363 -211 -170 222 4 152 -207 212 -259 -171 -118 -102 -217 -56 -50 -58 -104 -44 -16 40 -197 -195 273 -201
5198b01N4O5j82j03N44j88k4k4J22P9L8k1J3J03l37R9J3j65O5K38k24J2N0J71
$$ -201 -147 -82 -264 -367 177 -11 -35 -59 63 142 180 159 172 275 -62 37 50 -115 -50 188 -36 -24 26 197
5222A97m22K11K06m63M27j36k89L87j46J29m0l3j28J42k27J5J31j67M4N6q8M16
$$ 197 -225 -14 192 -271 156 20 -269 118 -28 101 61 28 -100 42 -185 -170 -39 -206 -162 -106 -194 222
5244B22k70Q9j34R3l18L51O7J2j06k21J75j52J83J04j06k43K18L9J23j44J89J8
$$ 222 -48 41 -93 0 -318 33 100 112 6 -215 -40 -192 -9 95 -11 -254 -36 3 126 -18 171 189
5266A89l24L7j12J35K37l66K04P0o2O8P1j41l20K92k82L77j86j76L33l9M6j46
$$ 189 -135 -98 -210 -75 162 -204 0 70 8 76 147 6 -314 -22 -304 73 -113 -289 44 5 51 -95
5288i5P2l1J8P5l03K92K86l20j00O9j30l6J60L15k09K0j63K73Q9j3j58k9k3j38
$$ -95 -23 -54 -36 39 -264 28 314 -6 -106 -37 -167 -203 -43 272 63 83 -80 193 282 269 111 82 59 -79
5312g9k08M13l03L63j34K19k63k86J58j79K15L2K26k06k40J80m7P3NK29j17j27
$$ -79 -287 126 -177 186 52 271 8 -278 -120 -299 -84 -52 174 -32 -272 -92 -139 -66 -61 168 51 -76
5334g6K33k28M99n19K5N1j62J44K96n8Q8l86K94j54j00qk16J85l3J34J89l33P7
$$ -76 157 -71 428 -91 -66 -15 -177 -33 263 205 293 -93 201 47 -53 -61 -277 -92 -125 9 198 -135 -58
5357e8L18j52J53k15j35l22O71l46J16j09qJ45j47k7K55l26L41k52J46p4P4P0
$$ -58 260 108 261 46 -89 -411 260 -86 30 -79 -87 58 -89 -116 139 -187 154 -98 48 -26 48 118
5379A18l7n9O3j26j68K19J29k61J35l4q2L10j15m28L40k59R9K34k15L71j51p9
$$ 118 81 22 85 -41 -209 10 139 -122 13 -21 -103 207 92 -336 4 -255 -156 78 -137 234 83 4
5401DJ6j37k17N73j30j84M2J78N0k67j04J21J24m6p4K15r3Q7Kk07m0K52k8R3r9
$$ 4 20 -117 -334 239 109 -75 -33 145 195 -72 -176 -55 69 23 -51 164 71 158 160 -47 -87 165 137 230 131
5426A31j30l6J08j80K60j47j05K11m30K28K2m9L24l5r9j39J61kK31m46o6M5J82
$$ 131 1 -35 73 -107 153 6 -99 112 -318 -90 -68 -117 207 172 73 -66 95 93 324 -122 -188 -143 39
5449C9o5J38J19k16j27K22j40j16J45j9M2J53j4k00L84m38P1m90O46k12M8k1J38
$$ 39 -26 112 231 15 -112 110 -30 -146 -1 -20 22 175 161 -39 345 -93 -22 -512 134 -78 -30 -51 87
5472H7j01Km1K31o5k26J33j6j02J31J77k20k64K40J84l01J95K03m13jQ3J09m3
$$ 87 -14 -12 -53 178 113 -113 20 4 -98 33 210 -10 -274 -34 150 -151 44 247 -166 -167 -84 25 -18
5495a8j15j9J01R5OJ37l09M7J14j73jj37L46K15l19J65j35L4j19P4q7Q8K0L2l28
$$ -18 -133 -152 -51 44 50 187 -122 -75 39 -134 -135 -272 74 289 -30 135 0 34 -85 -11 -98 -10 10 42 -286
5520b86M01j52K1R8k11J11J00n3k93K58k08L19p6J16l24L83l58P3j6j1j09L20
$$ -286 115 -37 -16 82 -129 -18 82 29 -264 -6 -214 105 29 145 -179 204 -154 -81 -97 -108 -217 103
5542A03J0j15M0j6j29q4J85P3j37L7M37k06j39j11j64K44K6J37j60J86N9m55K34
$$ 103 113 -2 38 22 -107 -191 -6 67 -70 -33 404 198 59 -52 -216 28 54 191 31 217 276 -179 55
5565E5r5qL35l08K9j10K0L23j82r9J80j16O3o7l1k09PJ79j94N3K09j46J39p2K27
$$ 55 -40 -48 287 -21 8 -102 -82 241 59 -40 140 24 87 20 -11 -220 -213 -34 -228 -175 34 -112 27 -45 182
5590A82k95J12o2N1J66j37N6K60j42m52K52J11R9L9l69K82r7j04K42j76l2l58
$$ 182 -113 -1 -63 -12 154 17 73 333 191 -261 -9 102 201 240 -129 153 56 -48 194 18 -14 -372
5612c72M84j58JR9K1q5j5J02j48k1K44k70J29K09k06m6k2o4L2K2N8K72m79L42
$$ -372 112 -46 -45 54 75 -10 -25 77 -71 -92 152 -118 11 220 14 -32 -54 -118 -86 -64 -6 266 -213 129
$$ [...]
8191a07
##END NTUPLES=NMR FID
##END=
