##TITLE=1H_DE-46H_DEK
 D2O
 64 sc, 
 10.10.2024
##JCAMPDX= 6.0         $$ Bruker NMR JCAMP-DX V2.0
##DATA TYPE= NMR FID
##DATA CLASS= NTUPLES
##ORIGIN= UXNMR, Bruker Analytische Messtechnik GmbH
##OWNER= root
$$ XWIN-NMR		Version 3.5
$$ Thu Oct 10 14:43:42 2024 Russian Standard Time (UT+4h)  she@DPX200
##.OBSERVE FREQUENCY= 200.1318
##.OBSERVE NUCLEUS= ^1H
##.DELAY= (6, 6)
##.ACQUISITION MODE= SIMULTANEOUS
##.ACQUISITION SCHEME= undefined
##.AVERAGES= 64
##.DIGITISER RES= 18
##SPECTROMETER/DATA SYSTEM= spect
##.PULSE SEQUENCE= zg30
##.SOLVENT NAME= D2O
##.SHIFT REFERENCE= (INTERNAL, D2O, 0, 15.7039)
##AUDIT TRAIL= $$ (NUMBER, WHEN, WHO, WHERE, WHAT)
$$ ##TITLE= Audit trail, XWIN-NMR		Version 3.5
$$ ##JCAMPDX= 5.01
$$ ##ORIGIN= Bruker BioSpin GmbH
$$ ##OWNER= she
$$ F:/spectra/data/she/nmr/H-F/1/audita.txt
$$ ##AUDIT TRAIL=  $$ (NUMBER, WHEN, WHO, WHERE, WHAT)
(   1,<2024-10-10 14:37:26.48 +0400>,<she>,<DPX200>,
      <continue with go, POWCHK disabled, PULCHK disabled
       configuration hash MD5:
       00 E9 B6 7A A2 85 ED C7 34 08 36 98 17 FE 4E 26
       data hash MD5: 16K
       70 DB 7B E6 BF BC 3B FE CA FA 72 75 04 C7 F7 39>)
$$ ##END=
$$ 
$$ hash MD5
$$ DC CC F2 26 8C 91 21 1C 2E FC 58 A5 A0 46 4A C7
##$RELAX= 
##$RELAX= 
##$RELAX= 
##$RELAX= 
##$RELAX= 
##$RELAX= 
$$ Bruker specific parameters
$$ --------------------------
##$DU= <F:/spectra>
##$EXPNO= 1
##$NAME= <H-F>
##$PROCNO= 1
##$TYPE= <nmr>
##$USER= <she>
##$AMP= (0..31)
100 100 100 100 100 100 100 100 100 100 100 100 100 100 100 100 100 100 
100 100 100 100 100 100 100 100 100 100 100 100 100 100 
##$AQSEQ= 0
##$AQ_mod= 1
##$AUNM= <au_zg>
##$AUTOPOS= <>
##$BF1= 200.13
##$BF2= 200.13
##$BF3= 200.13
##$BF4= 200.13
##$BF5= 200.13
##$BF6= 200.13
##$BF7= 200.13
##$BF8= 200.13
##$BYTORDA= 1
##$CFDGTYP= 0
##$CFRGTYP= 5
##$CHEMSTR= <none>
##$CNST= (0..31)
1 1 145 1 1 1 1 1 1 1 1 1 1 1 1 1 1 1 1 1 1 1 1 1 1 1 1 1 1 1 1 1 
##$CPDPRG= <>
##$CPDPRG1= <>
##$CPDPRG2= <>
##$CPDPRG3= <>
##$CPDPRG4= <mlev>
##$CPDPRG5= <mlev>
##$CPDPRG6= <mlev>
##$CPDPRG7= <mlev>
##$CPDPRG8= <mlev>
##$CPDPRGB= <>
##$CPDPRGT= <>
##$D= (0..31)
0 1.2 0 0 0 0 0 0 0 0.06 0 0.03 0 0 0 0 0.0002 0 0 0 0 0 0 0 0 0 0 0 0 
0 0 0 
##$DATE= 1728556443
##$DBL= (0..7)
120 120 120 120 120 120 120 120 
##$DBP= (0..7)
150 150 150 150 150 150 150 150 
##$DBP07= 0
##$DBPNAM0= <>
##$DBPNAM1= <>
##$DBPNAM2= <>
##$DBPNAM3= <>
##$DBPNAM4= <>
##$DBPNAM5= <>
##$DBPNAM6= <>
##$DBPNAM7= <>
##$DBPOAL= (0..7)
0.5 0.5 0.5 0.5 0.5 0.5 0.5 0.5 
##$DBPOFFS= (0..7)
0 0 0 0 0 0 0 0 
##$DE= 6
##$DECBNUC= <off>
##$DECIM= 24
##$DECNUC= <off>
##$DECSTAT= 4
##$DIGMOD= 1
##$DIGTYP= 9
##$DL= (0..7)
0 120 120 120 120 120 120 120 
##$DP= (0..7)
150 150 150 150 150 150 150 150 
##$DP07= 0
##$DPNAME0= <>
##$DPNAME1= <>
##$DPNAME2= <>
##$DPNAME3= <>
##$DPNAME4= <>
##$DPNAME5= <>
##$DPNAME6= <>
##$DPNAME7= <>
##$DPOAL= (0..7)
0.5 0.5 0.5 0.5 0.5 0.5 0.5 0.5 
##$DPOFFS= (0..7)
0 0 0 0 0 0 0 0 
##$DQDMODE= 0
##$DR= 18
##$DS= 0
##$DSLIST= <SSSSSSSSSSSSSSS>
$$ [...]
##$SUBNAM2= <"">
##$SUBNAM3= <"">
##$SUBNAM4= <"">
##$SUBNAM5= <"">
##$SUBNAM6= <"">
##$SUBNAM7= <"">
##$SUBNAM8= <"">
##$SUBNAM9= <"">
##$SW= 24.0689170037331
##$SWIBOX= (0..15)
0 0 2 0 0 0 0 0 0 0 0 0 0 0 0 0 
##$SW_h= 4816.95568400771
##$TD= 16384
##$TD0= 1
##$TE= 0
##$TE2= 300
##$TE3= 300
##$TEG= 300
##$TL= (0..7)
0 120 120 120 120 120 120 120 
##$TP= (0..7)
150 150 150 150 150 150 150 150 
##$TP07= 0
##$TPNAME0= <>
##$TPNAME1= <>
##$TPNAME2= <>
##$TPNAME3= <>
##$TPNAME4= <>
##$TPNAME5= <>
##$TPNAME6= <>
##$TPNAME7= <>
##$TPOAL= (0..7)
0.5 0.5 0.5 0.5 0.5 0.5 0.5 0.5 
##$TPOFFS= (0..7)
0 0 0 0 0 0 0 0 
##$TUNHIN= 0
##$TUNHOUT= 0
##$TUNXOUT= 0
##$USERA1= <user>
##$USERA2= <user>
##$USERA3= <user>
##$USERA4= <user>
##$USERA5= <user>
##$V9= 5
##$VALIST= <valist>
##$VCLIST= <CCCCCCCCCCCCCCC>
##$VD= 0
##$VDLIST= <DDDDDDDDDDDDDDD>
##$VPLIST= <PPPPPPPPPPPPPPP>
##$VTLIST= <TTTTTTTTTTTTTTT>
##$WBST= 1024
##$WBSW= 4
##$XGAIN= (0..3)
0 0 0 0 
##$XL= 0
##$YL= 0
##$YMAX_a= 1589411
##$YMIN_a= -1380752
##$ZGOPTNS= <>
##$ZL1= 120
##$ZL2= 120
##$ZL3= 120
##$ZL4= 120
##$ABSF1= 10
##$ABSF2= 0
##$ABSG= 5
##$ABSL= 3
##$ALPHA= 0
##$AQORDER= 0
##$ASSFAC= 0
##$ASSFACI= 0
##$ASSFACX= 0
##$ASSWID= 0
##$AUNMP= <proc_1d>
##$AZFE= 0.1
##$AZFW= 0.1
##$BCFW= 1
##$BC_mod= 2
##$BYTORDP= 1
##$COROFFS= 0
##$CY= 11.3945322036743
##$DATMOD= 1
##$DC= 2
##$DFILT= <>
##$DTYPP= 0
##$F1P= 15.6554695791079
##$F2P= 12.8336369535428
##$FCOR= 0.5
##$FTSIZE= 0
##$FT_mod= 4
##$GAMMA= 1
##$GB= 0.15
##$INTBC= 1
##$INTSCL= 1
##$ISEN= 128
##$LB= 0.24
##$LEV0= 0
##$LPBIN= 0
##$MAXI= 10000
##$MC2= 0
##$MEAN= 0
##$ME_mod= 0
##$MI= 1.114404
##$NCOEF= 0
##$NC_proc= 0
##$NLEV= 6
##$NOISF1= 3.799351
##$NOISF2= 2.8
##$NSP= 1
##$NTH_PI= 0
##$NZP= 0
##$OFFSET= 15.70392
##$PC= 1
##$PHC0= -26345.51
##$PHC1= 12.98743
##$PH_mod= 1
##$PKNL= yes
##$PPARMOD= 0
##$PSCAL= 0
##$PSIGN= 0
##$REVERSE= no
##$SF= 200.130013532006
##$SI= 16384
##$SIGF1= 3
##$SIGF2= 2
##$SINO= 400
##$SIOLD= 16384
##$SREGLST= <1H.CDCl3>
##$SSB= 0
##$STSI= 0
##$STSR= 0
##$SW_p= 3612.71676300578
##$SYMM= 0
##$S_DEV= 0
##$TDeff= 0
##$TDoff= 0
##$TI= <>
##$TILT= no
##$TM1= 0
##$TM2= 0
##$TOPLEV= 0
##$USERP1= <user>
##$USERP2= <user>
##$USERP3= <user>
##$USERP4= <user>
##$USERP5= <user>
##$WDW= 1
##$XDIM= 8192
##$YMAX_p= 0
##$YMIN_p= 0
$$ End of Bruker specific parameters
$$ ---------------------------------
##NTUPLES= NMR FID
##VAR_NAME=  TIME,          FID/REAL,        FID/IMAG
##SYMBOL=    X,             R,               I
##VAR_TYPE=  INDEPENDENT,   DEPENDENT,       DEPENDENT
##VAR_FORM=  AFFN,          ASDF,            ASDF
##VAR_DIM=   8192,          8192,            8192
##UNITS=     SECONDS,       ARBITRARY UNITS, ARBITRARY UNITS
##FACTOR=    0.0002076,     1,               1
##FIRST=     0,             0,               0
##LAST=      1.7004516,     0,               0
##MIN=       0,             -1380752,        0
##MAX=       1.7004516,     1589411,         0
$$ Real data points
##PAGE= N=1
##DATA TABLE= (X++(R..R)), XYDATA
0@%%%%%%%%k2O5j07J28j28J92k56K56l20L84m48N54o39P25q34R91j158J321j526
$$ 0 0 0 0 0 0 0 0 0 -22 43 -64 64 -64 128 -128 128 -192 192 -256 298 -341 384 -450 541 -617 704 -822
27h22J741j959K225k522K833l186L577l983M447m961N512o131O810p542Q350r247
$$ -822 919 -1040 1185 -1337 1496 -1690 1887 -2096 2351 -2610 2902 -3229 3581 -3961 4389 -4858
43d858J0227j1327J2566j3936J5486j7267J9297k1658K4467k7829L1969l7240
$$ -4858 5369 -5958 6608 -7328 8158 -9109 10188 -11470 12997 -14832 17137 -20103
55b0103M4149n3688O7867r1359J39486m13740J059007P86537j223454r95414l65604
$$ -20103 24046 -29642 38225 -53134 86352 -327388 731619 1518156 294702 -700712 -1066316
66a066316P85743J270624K94094j299149j168519J69270J248211Q89348l78810
$$ -1066316 -280573 990051 1284145 -15004 -1183523 -1014253 233958 1123306 744496
75G44496j258390o93650N91249J314582N43156q49782j264264k19510J003487
$$ 744496 -513894 -1207544 -616295 698287 1241443 391661 -872603 -1092113 -88626
84h8626J150060m0839j214566r42117L62404J122674P44684m31206j274062o33827
$$ -88626 1061434 1020595 -193971 -1136088 -773684 348990 1093674 662468 -611594 -1245421
94a245421Q63212J236823J72043r05637r88668r1548J025645J039313k46271j219257
$$ -1245421 -382209 854614 1026657 121020 -867648 -959196 66449 1105762 859491 -359766
104c59766p15996N00026J091316N15741o39991j119196l27649Q47479J048516
$$ -359766 -1075762 -575736 515580 1031321 391330 -727866 -1055515 -208036 840480
113H40480P0685r34093q71395J35963R97498P86559l50630j116605n81938N67711
$$ 840480 911165 -22928 -894323 -758360 239138 1025697 675067 -441538 -1023476 -455765
123d55765J032702L91889p28862j063452r3935R47619Q21091j08654q63587p71599
$$ -455765 576937 968826 239964 -823488 -917423 30196 851287 742633 -120954 -892553
133h92553K28709J048040N92456n41190r79690l58785O18910R35778K10250p67033
$$ -892553 -663844 384196 976652 435462 -544228 -903013 -284103 651675 861925 94892
143I4892q83599L982R05336P54987k65637r19350n37167L74949R00423M50119
$$ 94892 -788707 -784725 120611 875598 609961 -309389 -846556 -471607 428816 878935
153H78935n52276r29545k27036P01751Q32054M5307q04803p33603J71842Q46297
$$ 878935 326659 -602886 -829922 -128171 703883 749190 -55613 -789216 -617374 228923
163B28923N74300l05653q68347m71178M98335Q87609K39425o38714p69573p5299
$$ 228923 803223 497570 -370777 -841955 -343620 543989 783414 144700 -624873 -700172
173g00172O93991P08227p3068p82998o06417K61494Q26904M45288m26200p94957
$$ -700172 -6181 702046 628978 -154020 -760437 -498943 327961 773249 347049 -447908
183d47908k92943N19301P69294J52473o57666p07842N3013P33916N88925k04013
$$ -447908 -740851 -221550 547744 700217 42551 -665291 -612278 121638 710563 506550
193E06550p60445m51534L49038P43417L16335m68745p43842j76066N89718O75083
$$ 506550 -253895 -705429 -356391 387026 703361 234616 -509226 -685292 -95574 579509
203E79509P695o53363n82059J52665P14209M66218k93077p11407l41547M12326
$$ 579509 587204 -66159 -648218 -495553 218656 684874 391797 -319610 -661157 -248831
213b48831O93820J85360n18287o43575o3684N99144N88380j00970o56473m58237
$$ -248831 444989 630349 112062 -531513 -595197 3947 592327 491357 -165116 -623353
223f23353K37529O66212L65022l54430o76513k22164M69339O17393Q1070n47142
$$ -623353 -385824 280388 645410 290980 -385533 -607697 -138358 479035 560105 12963
233A2963n65941N5078O02474M68836j81519o27147l68586L15310O37702K38575
$$ 12963 -552978 -497900 104574 573410 391891 -235256 -603842 -288532 349170 587745
243E87745m09181n93394j16886M87337N45364j5362n60117m78201J34657N98155
$$ 587745 178564 -414830 -531716 -44379 500985 485623 -74494 -552695 -418038 180117
253A80117L77394k68830n93920k44098L64163N74551J49817m47200n38603j8875
$$ 180117 557511 288681 -305239 -549337 -185174 389377 539194 91994 -446609 -465484
263d65484N08883M56266j04700n49114l85329K13402N73030K82178l23412n52181
$$ -465484 43399 499665 394965 -154149 -539478 -326076 246954 529132 205720 -346461
273c46461j56104M08031N15038M8670m70790m60720P0036N11584L74304j77828
$$ -346461 -502565 -94534 420504 469174 -1616 -462336 -392300 119284 493588 315760
283C15760n33437k92426K77283N32469J84304l64399m97723p1865M32801M53440
$$ 315760 -217677 -510103 -232820 299649 483953 119554 -378169 -450034 -17233 436207
293D36207l4706m80423l82373J41912N03856K93410k44656n04936j99298L23938
$$ 436207 401501 -78922 -461295 -319383 184473 477883 233227 -271709 -471007 -147069
303a47069M81594R9679l92709m40600J0805M44667L82706j05957m76213l08752
$$ -147069 334525 434204 41495 -399105 -388300 56367 439073 333116 -143097 -451849
313d51849K07607M83094K09195k93511m67798j16993L63802M30410J4747m08175
$$ -451849 -244242 238852 448047 154536 -313262 -430255 -66453 363957 378704 -29471
323b9471l71071P8100M42039L08808j71973m58886k26577K57313M47599J36193
$$ -29471 -400542 -322442 119597 428405 256432 -202454 -429031 -171718 275881 412074
333D12074l26967m22816m0539L85506L72162o0024m14729l05847J42781M29667
$$ 412074 85107 -337709 -378248 7258 379420 319396 -95333 -401180 -258399 171268
343A71268K37331k23360m29784j50917K95122M05208O2710l49350l70026K7252
$$ 171268 408599 185239 -244545 -395462 -100340 304868 367578 18228 -351798 -324546
353c24546L90520L13888j18030m10863k38744J95784M10605J64748k66845l96128
$$ -324546 65974 379862 261832 -149031 -387775 -191991 218614 383362 116517 -279611
363b79611p6840L22342L55675m680l58347l13787Q6300L90399K48942j70095l91797
$$ -279611 -356451 -34109 321566 316886 -41461 -355248 -268948 121451 370393 200298 -191499
374a91499j75521K36408L83186R8411k97850l54160j2915L38717L05131o4882
$$ -191499 -367020 -130612 252574 350985 53135 -301025 -313940 24777 329908 265026
384B65026l61452k53425J40452L76593J85362k09697l67118j13701K65858L46674
$$ 265026 -96426 -349851 -209399 167194 352556 142859 -224259 -337960 -72102 274572
394B74572L6340l15013l08318M4337L43617K55101j17312l54938j94794J85352
$$ 274572 310912 -4101 -312419 -268082 75535 330636 213324 -141614 -336408 -151056
404a51056L53450J24056k41886l32795n5198K85568L05089k0350l22552k58529
$$ -151056 202394 326450 84564 -248231 -303429 -17861 287228 266878 -55674 -314203
414c14203R5755L37635K01500j56873l41135j38846K19280L27081O5617k65594
$$ -314203 -218448 119187 320687 163814 -177321 -316167 -96887 230194 295811 30217
424C0217k95596J719K97024K58709p1186l18739k07081J36163L24372J49516j94178
$$ 30217 -265379 -263660 33364 292073 220887 -97852 -304933 -168770 155602 305118 110940
435A10940l18394q2949K43011K94456J4555k78366k57344N1380L01367K12234
$$ 110940 -207454 -290403 -47392 247064 261619 -16747 -274091 -222711 78656 290890
445B90890j16202l11833j53826J69852L02917R8391k15867k91052l3250K61096
$$ 290890 174688 -137145 -290971 -121119 181798 280189 64322 -226730 -259980 1116
455A116K57170l5801k80888k13924R0332K96648J66559j52711k95936j04215J98794
$$ 1116 258286 222485 -58403 -272327 -181995 114653 281212 128501 -167435 -271650 -72856
466g2856K77232M8570k35227k55007J3436K65461K16705p4207k79590j72080J27717
$$ -72856 204376 252946 17719 -237288 -223852 41609 258314 184107 -95483 -267563 -139846
477a39846K85636J19461j81203k72225n9447K18134K49491K575k46024k20229
$$ -139846 145790 265251 84048 -188177 -247624 -29490 220001 222576 -23448 -243677
487b43677N6794K66296J74481j11706k68568j26126J55929K65355P5147k01773
$$ -243677 -186883 79413 253894 142188 -126380 -252506 -96577 168778 243925 42152
497D2152k47291j4960K30358K17982l8447k52507j79644R4393K59031J32708j40628
$$ 42152 -205139 -220099 10259 228241 189794 -62713 -242357 -147964 111067 243775 103147
508A03147k53654q5221J79623K42661L1069k15493k15858K4885K33739J82781
$$ 103147 -150507 -235728 -56105 186556 217625 2132 -213726 -188841 44898 227679
518B27679p0972k49891j42168J26022K46592R0352j63837k34250m3532J97450
$$ 227679 156707 -93184 -235352 -109330 137262 227614 63777 -170473 -214005 -16555
528a6555K13912q212k21111j83174N7994K34450J46585j04392k37530j02769J45932
$$ -16555 197357 189145 -31966 -215140 -157146 77304 223889 119497 -118033 -220802 -74870
539g4870K31118N3757j81401k12603m770K07696J84730m5230k23158j46995Q9961
$$ -74870 156248 210005 28604 -183999 -188769 18927 203657 158427 -64731 -211726 -121765
550a21765K23964J10734j27990k25270o4877J67879K08112J5500j90380j84904
$$ -121765 102199 212933 84943 -140327 -205204 -37325 170787 186287 -4093 -188997
560a88997K7011K12052J54152p7790k19625j11707J17244K12079P3073j48355
$$ -188997 -161986 50066 204218 126428 -93197 -204904 -87660 124419 197492 49137
570D9137k02332l0875J78375J84893j7695j98336j53789N8984K06869J20945j01333
$$ 49137 -153195 -184070 -5695 179198 161503 -36833 -190622 -131638 75231 196176 94843
581I4843k08478p9632J35878J99196M0734j64970j84483P326J87030J53087m8325
$$ 94843 -113635 -193267 -57389 141807 182541 17571 -166912 -159586 27444 180531 132206
592A32206j94546j24794Q4205K01448R0044j24740j95580m4837J51296J77454
$$ 132206 -62340 -187134 -102929 98519 188563 63823 -131757 -176594 -25298 152156
602A52156P508j70350j60867L4682J91473J26642p7900j89530r2913J06672J87394
$$ 152156 159664 -10686 -171553 -136871 54602 181244 103344 -86186 -179099 -72427 114967
613A14967N7370j38589j75198j6815J59253J59741k1026j80419j31538O4955J84791
$$ 114967 172337 33748 -141450 -158265 988 160729 139703 -40716 -172254 -107299 77492
624G7492R4913r4820j81717o5056J25996J73617K5856j51977j55247J5194J64751
$$ 77492 172405 77585 -104132 -169188 -43192 130425 156281 4304 -150943 -135749 29002
635B9002J32370m8731j74500j05178Q4600J78635O8139j15918j68274l3877J37775
$$ 29002 161372 112641 -61859 -167037 -82437 96198 164337 48419 -119855 -153732 -15957
646a5957J55995m027j57742j30469L7961J64920J07927o9788j72924p5645J06778
$$ -15957 140038 136011 -21731 -152200 -114239 50681 158608 88820 -84104 -159749 -52971
657e2971J62276M0310j25655j53526q322J48529J35332k9672j61014j08910O3101
$$ -52971 109305 149615 23960 -129566 -137888 10641 145973 116301 -44713 -153623 -90522
668i0522J63411Q0135r1365j60716m8897J19574J48020J3787j34135j34223J6109
$$ -90522 72889 153024 61659 -99057 -147954 -28380 119640 133427 -708 -134931 -118822
679a18822J51427J13964n2797j57485q4447Q0490J55796N6816j08679j47193k2093
$$ -118822 32605 146569 93772 -63713 -148160 -67670 88126 144942 36263 -110930 -133023
690a33023J27862J32134j0043j41496j13486M1183J48290R0486p0339j50686o1949
$$ -133023 -5161 126973 116930 -24566 -138052 -96869 51421 141907 71568 -79118 -141067
701a41067R7152J45658L0714j18053j34556L215J34201J12493l2742j40085r1426
$$ -141067 -43915 101743 132457 14404 -120152 -116937 17264 129757 97015 -43070 -134496
712a34496N8035J45778O7074q7160j41877l7098J08362J31128Q779j26206j14764
$$ -134496 -76461 69317 136391 49231 -92646 -129744 -21382 109746 118525 -7681 -122445
723a22445K2646J33673R7356n0858j41073p1590P8489J37572M3095r8449j30431
$$ -122445 -99799 33874 131230 80372 -60701 -132291 -53802 83770 126865 28416 -102015
734a02015j4849J15876J17059j5128j27027r8730M3339J34069P3317o6779j33351
$$ -102015 -116864 -988 116071 100943 -26084 -124814 -81475 52594 125911 59132 -74219
745g4219m9820Q8720J30011K0968j08109j15132M157J21462R9951l4964j26867
$$ -74219 -124039 -35319 94692 115660 7551 -107581 -103424 18038 117989 83025 -43842
756d3842p7206N7444J28751N5669q0646j26683k9148J02325J16246n58j14415
$$ -43842 -121048 -63604 65147 120816 40170 -86513 -115661 -13336 102910 102352 -12063
767a2063r9322K6012J20222Q2244m9798j25927n9521P4307J21552L3761r0392
$$ -12063 -111385 -85373 34849 117093 67295 -58632 -118153 -43846 77706 111467 21075
778B1075j14916q183J06751R9641j6717j14427q5539M1946J21282O3146o5634
$$ 21075 -93841 -102024 4727 104368 87651 -26776 -112315 -70369 50913 114059 48425
789D8425j18526l9197Q3052J12917J5817r9725j02056R908J10537Q6182l4778
$$ 48425 -70101 -109298 -26246 86671 102488 2763 -99293 -89385 21152 107334 72556
800G2556j15505o6491N6423J14955M6773p7236j11799k0877R3364J00508l340
$$ 72556 -42949 -109440 -53017 61938 108711 31475 -80324 -101201 -7837 92671 89331
811H9331j02799q8965K7628J12108O7607n0126j09246m9107O6780J09112K7479
$$ 89331 -13468 -102433 -74805 37303 104910 54784 -54462 -103569 -36789 72323 99802
822I9802q5585j00966m030R7496Q8626j8493j05331p3007M2146J08459N3216o1702
$$ 99802 14217 -86749 -90779 6717 95343 76850 -28481 -101488 -59342 49117 102333 40631
834D0631j06214l1069P7286R8864R749r0624q8434J2273R9458P4172l4050j04044
$$ 40631 -65583 -96652 -19366 79498 89247 -1377 -89811 -77538 21920 96092 62042 -42002
846d2002n6473N5092J03067L5183o9541r7955j5115Q3143Q8719m936r4892p6505
$$ -42002 -98475 -43383 59684 94867 25326 -72629 -87744 -4601 84118 79182 -15710 -92215
858i2215K7494R9450N9507m7523j00015l9881O4886R6353J9346p7674q8250K18
$$ -92215 -64721 34729 94236 46713 -53302 -93183 -28297 68056 87402 9728 -78522 -78304
870g8304Q8061P7878k1426r6797o0743M1843R4034M5626n7674r3934k5485P3689
$$ -78304 9757 87635 66209 -30588 -91331 -49488 44546 90172 32498 -61436 -86921 -13232
882a3232Q7595M023q2798p7257J4435Q9865O4991l4581r4016m7713N1762R2361
$$ -13232 74363 78386 -4412 -81669 -67234 22631 87622 53041 -40975 -88688 -36926 55435
894E5435K9362o6318q6838q796P7128P7463j0456q3780o4762K5988R0285N1374
$$ 55435 84797 18479 -68359 -77155 -27 77436 66980 -16800 -81562 -55574 34711 86085
906H6085m6704r0019l3310O0450Q5287J5562p2227p7710L609Q1609O7149k3071
$$ 86085 39381 -50638 -83948 -23498 61789 77351 5124 -72586 -68977 12632 79781 56710
918E6710q4993n2348L7068Q7293L6583n4153q3921j9347O7368P6220L174p6456
$$ 56710 -28283 -80631 -43563 43730 80313 26160 -57761 -77108 -9740 66480 69654 -6802
930f802o8199J6814Q2607N4939l2795q4228m0506M8807Q1946K4373o3539p6286
$$ -6802 -75001 -58187 24420 79359 46564 -37664 -78170 -29363 52583 76956 13417 -62869
942f2869o675P1293O8001j0839p8161n6234K8180Q0258M3969m2725q0180k8161
$$ -62869 -69544 1749 69750 58911 -19250 -75484 -47304 32954 76923 34198 -45982 -74143
954g4143N6052P7718Q936o7734o8250P019P4313N6559k1415p6891m6517L8270
$$ -74143 -18091 59627 68563 829 -67421 -60402 13911 70470 49055 -27836 -74353 -36083
966c6083P8398L0407n0195p4603j6324O2734O8813k791o9959n8883J6889P4499
$$ -36083 42315 72722 22527 -52076 -68400 -5666 63147 60356 -9603 -68486 -51597 22902
978B2902M8522l3037p6309l3313M7553P2420J8066n5931o8259l994O5649O0895
$$ 22902 71424 38387 -37922 -71235 -23682 48738 66804 10873 -57386 -61380 4269 65164
990F5164j2685p1691m9785K7232P3564L6730m0135p2932k1839N3407O7357O563
$$ 65164 52479 -19212 -68997 -41765 31799 68529 28394 -44538 -66377 -12970 54387 60950
1002F0950o1031o0837Q215O8578M9472k4260o9193l8836L5807P0158K6152m7422
$$ 60950 -81 -60918 -52703 15875 65347 41087 -28106 -66942 -31135 39023 65175 17753
1014A7753o7835j0939N7822O0728m256o3718n2121J7340O8978M0924l2323o7901
$$ 17753 -50082 -61021 -3199 57529 53273 -10445 -62566 -45226 23752 64676 32353 -35548
1026c5548k7563M2949O5391J4915n2141o1635q10O0898N2545j3067o4248m5368
$$ -35548 -63111 -20162 45229 60144 8003 -53632 -54442 6456 59001 45934 -18314 -63682
1038f3682K9297O5733L0859m0018o3850j7630M9628N9899M548n6964n4410R398
$$ -63682 -34385 31348 62207 22189 -41661 -59291 -9663 50236 54784 -2180 -56590 -47192
1050d7192O2202M4876k3231o3537l3875L4404O3675K1302m5076n9718p426N2463
$$ -47192 15010 59886 36655 -26882 -60757 -26353 37322 58624 13548 -46170 -53596 -1133
1062a133N4636n752n9305m5334J8393O2198L3856k9147o1645k4854M0728O1122
$$ -1133 53503 47751 -11554 -56888 -38495 23703 57559 28412 -33233 -58087 -17359 43763
1074D3763J0954m9879n3134N36N5472M7315j5455n9235l7426K6445O0508K5610
$$ 43763 54717 4838 -48296 -47760 7712 55027 39572 -19663 -57089 -30644 29864 55474
1086E5474l7211n7459j5201M6765N4846J385n2494m7613J1584N5983L9321k2220
$$ 55474 18263 -39196 -54397 -7632 47214 48599 -3895 -51508 -39924 16059 55380 33160
1098C3160n9699k9485L4396N7158J6453m2175n4286m844M9941M8843o813n4447
$$ 33160 -26539 -56024 -21628 35530 51983 9808 -44478 -49322 619 49462 42649 -11798
1110a1798m0422J9472N6014L1492k9579n6517k0737L9639N2031P914m5606m8838
$$ -11798 -52220 -32748 23266 54758 25179 -31338 -52075 -12436 39595 47509 1903 -46935
1122d6935K354N2689M2902j5718n3988l2584K5454N4886K3727l5917n4325j0232
$$ -46935 -44581 8108 51010 35292 -18696 -51280 -25826 29060 52787 16870 -37455 -47687
1134d7687M2814M7480m59m8621m1908J0677N2644L5117k2632n2445k5435L1729
$$ -47687 -4873 42607 42148 -6473 -48381 -37704 14940 50057 27425 -25020 -50455 -18726
1146a8726N3454J3793l9385m9209l639M6557M1479p150m9364l6684J8205N2666
$$ -18726 34728 48521 9136 -40073 -43712 2845 44324 37174 -12190 -48874 -30669 21997
1158B1997K6768k7815n1716j6649L5842M9304O988m4156m3721N366M6849L6213
$$ 21997 48765 20950 -30766 -47415 -11573 37731 44719 563 -43158 -37792 9057 45270
1170D5270j4845n0422k7785K3931N1192J9345l3470m6978j0175M1811M2852q74
$$ 45270 30425 -19997 -47782 -23851 27341 46686 13216 -33762 -43937 -2126 40726 39852
1182C9852m5413l7767J0194M9618K9345k1868m8534k1788L0141M8244J1645l6973
$$ 39852 -5561 -43328 -33134 16484 45829 23961 -24573 -46361 -16220 32024 43669 6696
1194F696m3806j176M1495L9228q790m6831l1532J8498M7262K3464k6784m6737
$$ 6696 -37110 -38286 3209 42437 33647 -13184 -44716 -26218 21044 44508 17724 -29013
1206b9013j4363L3931M5368L310l9863l8674N407M3824L1984j3927m6663k4667
$$ -29013 -43376 -9445 35923 39233 -630 -39304 -33897 9927 41911 27984 -18679 -43346
1218d3346K3733M5579J6718l0955m4744p557L9722L8450k206m2416l4122J1895
$$ -43346 -19613 25966 42684 11729 -33015 -40572 -850 37600 35394 -7022 -41144 -29249
1230b9249M4939K6780k0483m5782j7154K8314M2295R138l4612l9838L72L9808
$$ -29249 15690 42470 21987 -23795 -40949 -12635 29660 38798 4186 -35652 -35280 4528
1242D528L4653r063m1984k8857J8610M2311K0782k5307m3047j1619L2226L9114
$$ 4528 39181 30118 -11866 -40723 -22113 20198 40980 15673 -27374 -38993 -6767 32347
1254C2347K800l6812l5340N563M1306K9815j5490m1093k2679K2086M1674J4040
$$ 32347 35147 -1665 -37005 -31442 9864 39679 24189 -16904 -39583 -17497 24177 38217
1266C8217l0139l8248m739L4894L4426k744l9187l0423J2862M0707K3385j9703
$$ 38217 8078 -30170 -34909 -15 34411 31667 -7520 -37943 -25081 15626 39011 19308
1278A9308m0815j5837K6354L9246P598l2272l6066J050L7221L0182q896l9412
$$ 19308 -21507 -37344 -10990 28256 35854 3582 -32484 -31434 5787 35969 27073 -12339
1290a2339k6115J8013M0561J7932k5967l7734j0167L0689L6101J772l5615l1059
$$ -12339 -38454 -20441 20120 38052 12085 -25649 -35816 -5127 30974 32746 -2869 -33928
1302c3928P144L6005K6515j3103l9782j9638K2880L8030J1144k7947l5571m536
$$ -33928 -26784 9221 35736 22633 -17149 -36787 -13907 24123 35267 7320 -28251 -32787
1314c2787L2354L2620m135l6549k6744J2547L7753K0232j8978l8487j3441K7262
$$ -32787 -433 32187 28052 -8497 -35241 -22694 15059 35291 16313 -22174 -35615 -8353
1326h353L5369N891l1109l2821J792L4864K7588j0477l6340k1108J7525L6260
$$ -8353 27016 32907 1798 -31023 -29231 5633 33221 22744 -13596 -34704 -17179 19081
1338A9081J4982k3424l4558q075K8618L2653k53l2225k8715P248L5981K2534j5695
$$ 19081 34063 10639 -23919 -31994 -3376 29277 29024 -3201 -31916 -24668 11313 33847 18152
1351A8152l5376j6860K1787L4903Q739k5320l3510k959L2581K8295n788l2061
$$ 18152 -17224 -34084 -12297 22606 31345 6025 -27485 -30444 2137 30432 24644 -7417
1363g417k5044J2174L6007J6988j9005l4640j1294K4578L3223L812k8194l0361
$$ -7417 -32461 -20287 15720 32708 13703 -20937 -32231 -7653 25570 29382 1188 -29173
1375b9173M424L1406K4548j0470l2882j9515J5582L5085J2075k1745l2208o306
$$ -29173 -24749 6657 31205 20735 -12147 -31662 -16080 19005 31080 9335 -22873 -29179
1387b9179K6995K9440m19l0312k6547Q360L2249K0948j5373l2175j4791K0892
$$ -29179 -2184 27256 26837 -3475 -30022 -21662 10587 31535 16162 -16013 -30804 -9912
1399i912L2187O246k3956l0212j872K9914K6056n821l1747k1108J4184L1537J4447
$$ -9912 22275 28521 4565 -25647 -27519 2395 28451 22630 -9117 -30225 -16041 15496 29943
1412B9943j8604l1252q552K2876K9575K427k8335k5520N121K9368K1802j0296
$$ 29943 11339 -19913 -28465 -5589 23986 26413 -1922 -27442 -22321 7047 28849 18553
1424A8553l1323j6876J6945L0752J0199k0725k9562m437K5477K6559k438k8479
$$ 18553 -12770 -29646 -12701 18051 28250 7525 -22037 -26474 -997 25562 23124 -5355
1436e355k1611Q019K9910J8132j5058k9626j2686J9793K9436N454k4551k6136
$$ -5355 -26966 -18947 10963 29095 14037 -15589 -28275 -8482 20954 26408 1857 -24279
1448b4279o62K8235K4212p919k8197j8411J2300K8772J3895j7617k9603o969K2392
$$ -24279 -24941 3294 27506 19587 -8610 -27021 -14721 14051 27946 10329 -19274 -26243 -3851
1461c851K6208K079k5355k4646M774K8501J8184r680k8990j4446J5403K8488R534
$$ -3851 22357 24436 -919 -25565 -20791 7710 25894 16214 -12776 -27222 -11819 16669 26203
1474B6203k0073k7312k811K3777K4170l279k6472k0372R303K7439J5043j3396
$$ 26203 6130 -21182 -23993 -216 23954 20675 -5797 -26169 -16866 10573 25616 12220
1486A2220k7994r780J8778K6034N147k2836k4063J519K4964K0019p201k5660j6978
$$ 12220 -15774 -25554 -6776 19258 24405 1569 -22494 -20975 3989 24008 16807 -8853 -25831
1499b5831J2706K7300J0771j6411k6478n844K0655K4071J043k3983k0362M908
$$ -25831 -13125 14175 24946 8535 -17943 -23787 -3132 20939 21982 -2001 -22363 -17455
1511a7455K4444J7731j0680k6676j2378J5329K6217P194j9834k2712l220K2028
$$ -17455 6989 24720 14040 -12636 -25014 -9685 16532 23726 3892 -18820 -22040 -12
1523a2K2082l128k4558j7414Q759K4662J3455j3557k4980q150J7531K3555L180
$$ -12 22070 18942 -5616 -23030 -14271 10391 23846 10289 -14691 -22841 -5310 18245 21425
1536B1425k0904k1260J515K3618J8033o984k3490j5153J3107K3599Q966j6153
$$ 21425 521 -20739 -19224 4394 22427 15443 -8047 -23200 -10093 13506 22472 6319
1548F319k2503n351J9708K1514j96k2206j8525N206K3596J4478r126k4193j0915
$$ 6319 -16184 -21535 -1827 19687 19491 -2715 -21240 -16034 7562 22040 12914 -11279 -22194
1561b2194J4658K2959N270j7319k0994k349K0912J9620m072k2393j4972P626K2955
$$ -22194 -7536 15423 20693 3374 -17620 -19969 943 20563 16491 -5902 -20874 -13248 9707
1574I707J1775j2614k1937q759J6991K2143J750j8583k0431M057K0015J5370o041
$$ 9707 21482 8868 -13069 -21828 -4837 17306 19056 473 -19958 -15901 4114 19484 13443
1587A3443k1723j2453J0230K3227Q428j6313k0219l710J7528J9213q32j9817j6960
$$ 13443 -8280 -20733 -10503 12724 21152 4839 -15380 -19090 -1562 17651 16819 -2998 -19958
1600a9958N721K0979J2999r507k1490q054J2629K1029M283j6767j8127o34J8567
$$ -19958 -14237 6742 19741 10234 -11256 -19310 -6681 14348 18631 1864 -16263 -16897 1670
1613A670J6080k627k0977j3279Q782K0431Q671j0561k1022m747J3880J9188J504
$$ 1670 17750 15123 -5854 -19133 -10351 10080 18751 8190 -12832 -17579 -3699 15489 16993
1626A6993j7855j6546K632J9794J2876n619k0189j0426J0556J8427P602j2918
$$ 16993 -862 -17408 -14776 5018 17894 12275 -7914 -18340 -7784 10643 18245 5327
1638E327j9314k857J5319J8070j134j9398j4163N572J8580J1715q189k0080p337
$$ 5327 -13987 -16844 -1525 16545 15411 -3987 -18150 -12578 6002 17717 9528 -10552 -17889
1651a7889J3471J7415L489j4516j6943j568J8637J4287m392j7714j2021Q145J7022
$$ -17889 -4418 12997 16486 1970 -14973 -16541 2096 16383 11991 -5723 -17744 -9599 7423
1664G423R481j0865j7268n120J3516J6376K134j6362j5472K884J7166J1951n839
$$ 7423 16904 6039 -11229 -16349 -2833 13543 15677 -685 -16157 -13273 3893 15844 10005
1677A0005j8254r245J0181J6904P307j2819j6660k323J5020J4697j212j7193j1940
$$ 10005 -8249 -17494 -7313 9591 16898 4079 -12581 -14904 116 14813 13601 -3592 -15532
1690a5532M924J7259R674j0553j5087o589J1897J5710K988j4378j4281J078J6473
$$ -15532 -10608 6651 16325 5772 -9315 -15904 -4007 11703 14691 313 -13968 -12890 3583
1703C583J1355m212j6242j0206P499J6390P406j0854j5490l940J1741J5907L39
$$ 3583 14938 10726 -5516 -15722 -8223 8167 15573 4719 -10771 -14711 -2970 12937 13276
1716A3276j4422j3199L303J6305R588p029j5078p090Q190J5904M438j1059j5409
$$ 13276 -1146 -14345 -11042 5263 14851 7822 -7256 -14346 -6156 9748 14186 3127 -12282
1729a2282o38J3320J2559j693j3804j1291M984J5319P845p802j5381m739J0510
$$ -12282 -12920 400 12959 11266 -2538 -13829 -8845 6474 14319 6517 -8864 -13603 -3093
1742c093J4137K403j3451j2451J198J4071J0899m814j4004q398O339J5047N821
$$ -3093 11044 13447 -4 -12455 -11257 2814 13713 8899 -5105 -13503 -7164 7883 13704
1755A3704r684j4455j740J1907J2333j923j1806j0792L071J4579Q051o210j4816
$$ 13704 4020 -10435 -12175 -268 12065 10142 -1664 -12456 -9385 5194 13245 7035 -7781
1768g781o106Q766J4241L366j0546j2888p03J2613J0320k127j2813r169M697J3742
$$ -7781 -13887 -5121 9120 12486 1940 -10948 -11651 962 11282 9155 -3658 -12827 -8130 5612
1782E612Q039q390j3898l138R796J2057J906j1782j1811J809J2298J0000m211
$$ 5612 13651 5261 -8637 -11775 -1979 10078 11984 202 -11609 -9800 2498 12498 8287
1795H287j3412p065P402J2294M484r112j2107k155J0709J1808j127j1833r856
$$ 8287 -5125 -12190 -4788 7506 11990 2878 -9229 -11384 -675 11133 10006 -1827 -11683
1808a1683L101J3182Q000p122j1987n117Q288J1491L352r801j2537Q49J1662R547
$$ -11683 -8582 4600 12600 5478 -6509 -11626 -3338 8153 11505 1704 -10833 -9984 1678 11225
1822A1225k635j2160p734L684J2753P278q349j1673l125R269J0708N65j1116r168
$$ 11225 8590 -3570 -11304 -7620 5133 12411 4062 -7611 -10736 -1467 9241 9806 -1310 -10478
1836a0478K557J0795Q069m239j2528o051O992J2416L247p983j1216j844R618J0552
$$ -10478 -7921 2874 10943 6704 -5824 -11875 -4883 7533 10780 2797 -8419 -10263 -645 9907
1850I907l40j1700r056L510J2069O706o114j0632o026Q469J1406K528r247j0475
$$ 9907 9567 -2133 -11189 -7679 4390 11096 4982 -5650 -11676 -3207 8199 10727 1480 -8995
1864h995N60R790R979l998j0768p642M974J2439M197p052j0593k581Q010J0861
$$ -8995 -8435 1355 11334 7336 -3432 -11074 -6100 6339 10536 3484 -7109 -9690 -1680 9181
1878I181m43r942q312J455J0585P573m543j0249n932O118J0877M165q382j0763
$$ 9181 8738 -1204 -9516 -8061 2524 10097 5554 -4695 -10627 -4509 6368 10533 2151 -8612
1892h612j614R892R494j432j0212o986L766R179O074n574r379m230O354J0513
$$ -8612 -10226 -334 9160 7728 -2484 -9470 -5704 3475 9549 3975 -5404 -9634 -3280 7233
1906G233J711p557j0219P19R239Q809l293j0220n941M209J0157M634n982j0021
$$ 7233 8944 1387 -8832 -8113 1126 9935 6642 -3578 -9519 -5310 4847 9481 3499 -6522
1920f522k285P724Q731P15q138q542K137R058O233l050r415o495M687J0343M144
$$ -6522 -8807 -1083 7648 8363 225 -8317 -6180 2878 9111 6061 -3354 -9849 -5162 5181 9325
1935I325p307q186k578Q211Q832r92r437p491K961R421O467m774r769l944O331
$$ 9325 2018 -6168 -8746 -535 8297 7305 -2132 -9623 -6662 2759 9226 4452 -5317 -9261 -2930
1950b930J0123O71p870p536O35R065O065j594r659o467M144R452L567m638r012
$$ -2930 7193 7864 -6 -7542 -6907 2158 8223 6629 -3030 -9497 -5353 4099 7666 3028 -5984
1965e984j396O764P601Q38q116p949K438R094M729k599q881m576N084Q385K769
$$ -5984 -7380 -616 6985 7823 -293 -8242 -5804 3290 8019 5420 -3461 -8037 -2953 5432 8201
1980H201o679q303q96P432P916j226q027o521L021Q514M881m430q437m248O222
$$ 8201 1522 -6781 -7677 -245 7671 6445 -1582 -8103 -5082 3432 8313 3883 -4554 -8802 -2580
1995b580Q119J762o618q158J198P321O717k390q070m530L028Q074M369n693p848
$$ -2580 5539 7301 683 -7475 -6277 1044 7761 5371 -2699 -7229 -4201 3873 8242 2549 -5299
2010e299j838P090O276R6o275o818J443Q447M595l087p810m152L867Q381K775
$$ -5299 -7137 -47 6229 6325 50 -6768 -5325 3122 7717 4630 -3180 -7332 -3465 4916 7691
2025G691n848p915q77N948P273m51p893n282K793Q287L889m038p816l369N741
$$ 7691 1843 -6072 -6949 -1001 6272 5821 -2072 -7354 -4561 3726 7615 3577 -4239 -7608 -1867
2040a867Q756L33p136o865J290P209N253k776p134m119K332Q444M148o025p075
$$ -1867 6889 7222 86 -6779 -5489 1720 6973 4197 -2937 -7056 -4724 3720 7868 1843 -5232
2055e232k636O263P284j56o682n255J593O977M777l194p225l908N310O625J603
$$ -5232 -7868 -1605 5679 5523 -1159 -6414 -4821 2156 6933 3739 -3486 -7394 -2084 4541 6144
2070F144n088p498M33O249O053j660o295n335L239O911L208k828q008k337M907
$$ 6144 1056 -6442 -6009 240 6293 4633 -1662 -6997 -3758 3153 6361 3533 -4475 -6812 -1905
2085a905O549J182m917p768J278O956N350j870p408m137L942O689K752m457o864
$$ -1905 4644 5826 909 -6859 -5581 1375 6725 4855 -2553 -6690 -2748 3941 6693 2236 -4628
2100d628k466O630O824j328n967m994Q96N838O153l595p368k827L858P794J717
$$ -4628 -7094 -464 6360 5032 -935 -5929 -5033 805 6958 3363 -4005 -6832 -2974 4820 6537
2115F537m368p141O54M911O043k406n319n195K821O099L734l322o819k952N461
$$ 6537 2169 -4972 -4318 593 6636 4230 -1089 -6284 -3463 2636 6370 3048 -3771 -6723 -1262
2130a262O349O52n208n911O94O142M906k799n752l435L590N717K627m988n827
$$ -1262 5087 5739 531 -5380 -4686 1456 6362 3563 -2189 -5624 -2034 3683 6310 1322 -4505
2145d505m72N230M937n89n327n462K746N446L727l109o261j932L935O480L86m883
$$ -4505 -4977 253 5190 4601 -726 -6188 -3442 2004 5731 2622 -3639 -5571 -1636 4844 5230 347
2161C47n142l50N333N090j38p585l186K090P016J844l283n066k026L897N830L43
$$ 347 -4795 -5145 188 5278 5140 -2445 -5631 -3541 3475 5319 2036 -3030 -5056 -1159 4671 5014
2177E014o345l915Q55O219L644j749o130l346L869N874M52l740m777j192O635
$$ 5014 -1331 -5246 -4391 1828 5472 3723 -2407 -5753 -1884 3990 4442 702 -4075 -5267 1368
2192A368M191k641l848m029J026O390K710j971n415k488L914M949M55l944n375
$$ 1368 5559 2918 -930 -4959 -3933 2457 5167 3196 -2219 -4707 -793 4156 4611 667 -4708
2207d708k47N349L983n39n904m063K915N763K424k835o193p90L256O057k52m329
$$ -4708 -4955 394 4377 3838 -2066 -6129 -3214 2549 4973 2138 -4055 -4845 -1589 4468 4216 -113
2223a13m751O80N279M308k583n569l401M687M208K332m575m737j185N663M330
$$ -113 -4864 -4184 1095 5403 2820 -2749 -6150 -1463 2745 5077 502 -4235 -5420 243 4573
2238D573j027m981l245J787M765L068k488n812j608L857N399nm043l698j012N605
$$ 4573 3546 -1435 -4680 -2893 1872 4940 2452 -3360 -4968 -1111 4288 4283 240 -3458 -4470 1135
2254A135L139j629m958k398K247M861K104k837n235r32L700M866M81m873m116
$$ 1135 4274 2645 -2313 -4711 -2464 2397 4501 1664 -3571 -4503 -803 4063 4544 -329 -4445
2269d445J384M909K742j621n487j852K077M991K212l963m486p00M141M241m53
$$ -4445 -3061 1848 4590 2969 -2518 -4370 -2293 2698 4910 947 -3539 -4239 -98 4143 3690
2284C690m274m059J310N162K367k334m783j799K596N624J051m542l783M62M181
$$ 3690 -584 -4643 -3333 1829 4196 1862 -2921 -4720 -2124 3500 4551 9 -3774 -3312 869
2299H69L870k055m061k900J264N974J685k655n509l01K582M880L04m889l818J207
$$ 869 4739 2684 -1377 -4277 -3013 2961 4646 1991 -3518 -3819 -1237 3643 3947 -942 -4760 -3553
2315c553N342K010j476n303j030J603N021J132l482l781p47M684M030j640n404
$$ -3553 1789 3799 2323 -2980 -4010 -2407 2614 3746 264 -3517 -4264 420 4450 2810 -2594
2330b594q77J387L469K510j692l788k982L365M154J683m277m029n5L896M240r38
$$ -2594 -3471 -2084 1385 3895 2203 -1585 -4567 -1202 2952 4635 358 -3671 -3726 170 4410 3472
2346C472n468k116J179N315J497k520n223k03L629M611o88m086l296R62N667Q59
$$ 3472 -1996 -4112 -2933 2382 3879 1359 -3864 -4067 -438 4173 3485 -601 -3897 -2935 2732 3591
2362C591o67m535k818J964N010J422l822l091q84M384L092j929k744l621K004
$$ 3591 2924 -1611 -4429 -2465 2545 3967 145 -2946 -3830 554 3646 1717 -1027 -4648 -2644
2377b644L770K716k405l378j758K312M107J480m031l863Q36L006L188j13m667
$$ -2644 1126 3842 1437 -1941 -3699 -1387 2720 4200 169 -3694 -2858 148 3336 3223 -1444
2392a444j999J171M997J370k636m277p01L194L367Q83m113k676N86M160J047K2
$$ -1444 -3443 -2272 2725 4095 1459 -2818 -3519 -325 3042 3925 -188 -2864 -2278 1882 2929 2951
2408B951n332j082K211L854K66k195m363J12L775M261j862l234l328J944L564
$$ 2951 -2381 -3463 -1252 2602 2868 673 -3690 -3578 197 4458 2596 -638 -3966 -2022 1542
2423A542J028r64m706r54K953L532Q05l713k430n18M354K892j623l208k482J971
$$ 1542 2570 1606 -3100 -4054 -1101 2431 3236 -477 -2907 -3425 929 3821 2198 -1010 -3492 -1521
2439a521L295K045l156l130p42K885L386m95k986k537j39M001L863l209l363j203
$$ -1521 1774 3819 663 -2467 -3209 -324 3062 2567 -419 -2956 -3095 906 4769 1560 -1803 -3006
2455c006J904L103P77j188m338m14M057K162m52l478k964R66M742J458k372l085
$$ -3006 -1102 2001 2778 1590 -2748 -3162 895 3057 2605 -873 -3837 -2871 1871 3329 957 -2128
2471b128j328K221L867J350m242l000M20L152K622k37m531j416J339L368J515
$$ -2128 -3456 -1235 2632 3982 -260 -3260 -2840 312 2934 2697 -1834 -3250 -1911 1457 2972
2486B972k478l420p98L872K599R6l448k941J369L359J219j302l101j175K040L885
$$ 2972 494 -2926 -3724 148 2747 2843 -605 -3546 -2177 1182 2401 1099 -2002 -3177 -1137 2748
2502B748O86k535l748j69K768K699l5l741j152k51M384R77j530l083j645K452
$$ 2748 3434 899 -2849 -3018 -250 2449 2414 -1327 -2479 -2730 1654 2631 1101 -1982 -3627 -1175
2518a175M079n47k335k545OL089K379j83m173j244J355K822K116k038l923j472
$$ -1175 2904 2357 22 -2523 -2517 572 2951 2768 -1405 -2649 -1294 1528 3644 1606 -2317 -3789
2534c789L492L066P38l754k895Q09L758J610q44l834j801L068J762J951k425k431
$$ -3789 -297 2769 3507 -247 -3142 -2333 1425 3035 2191 -1643 -3444 -376 1386 3337 912 -1519
2550a519j492L832J324J14l133j864J298J824K800j576l417j552K519M317r01
$$ -1519 -3011 821 2145 2259 -874 -2738 -1440 384 3184 1608 -1809 -3361 -842 3475 2574
2565B574k056k548n09L107K938k424j840k368J884L223P50j565l364r34L419K041
$$ 2574 518 -2030 -2539 568 3506 1082 -758 -3126 -1242 1981 2731 1166 -2198 -3132 287 2328
2581B328Qk729k783J375K753J665j587j906j575R48L307P85k856k000l72J807
$$ 2328 2336 -393 -3176 -1801 952 2617 1030 -876 -2451 -1503 1804 2589 -267 -2267 -2639 -832
2597h32L353j018j580l018J232L396J350j234k572j614J870L088J406l281l128
$$ -832 2521 1503 -77 -3095 -1863 1533 2883 1649 -923 -2537 -667 2421 3827 546 -2582
2612b582R79K385J668j301k471o84J313K726J480k645k512j074K481L352o77k584
$$ -2582 -1603 782 2450 1149 -1322 -2006 -693 2033 3513 868 -1644 -2718 -237 3115 2438 -146
2628a46k207J13M281M80j134k531q77R08L330R56k239m694J284K132L205j646
$$ -146 -2353 -2240 2041 2521 1387 -1144 -2021 -1113 2217 3173 934 -3760 -2476 -344 2861 1215
2644A215k221k038J806K832R41j567k926p54K372K894n94k186k442L77K136K859
$$ 1215 -1006 -3044 -1238 1594 2535 968 -1958 -2712 -340 2554 1960 -226 -2668 -2291 -155 2704
2660B704p15l173j050R76K400J427k062l338K72K176J882J369k263l115jL516
$$ 2704 1989 -1184 -2234 -1258 1142 2569 507 -2831 -2559 -383 1499 2868 605 -2510 -2511 1005
2676A005J913j510j335j739J32K888N08j237k342K10J447K131J30k533k139J771
$$ 1005 2918 1408 73 -1666 -1534 1354 1862 625 -1717 -1507 -60 2071 2201 -332 -2471 -700
2692g00J554O56p7l223m50K036J843Q63k525j621K00J582K483m19k425k442J042
$$ -700 854 1510 1433 -1790 -2240 -204 1639 2502 -23 -1644 -1444 138 2621 2202 -223 -2665 -1623
2709a623K449K088j844k337j244J627L407j03k738k343R46K759J778j768k402
$$ -1623 826 2914 1070 -1267 -2511 -884 2523 2420 -318 -2661 -1715 1044 2822 1054 -1348
2724a348j236J710J535K046k212k107p0J631J706N08k412k314J530K505M15r44
$$ -1348 -2584 -874 661 2707 495 -1612 -1682 -51 1655 2163 -249 -2563 -1033 1472 1887 943
2740I43k378j633K434K389N55k423j737p98K515K468j035q28l004Q55K772J445
$$ 943 -1435 -3068 -634 1755 2310 -113 -1850 -2648 -133 2335 1300 472 -2532 -1677 1095 2540
2756B540j665k531m54J819J701P59l071r36K57J648J301M57k372k118J391L346
$$ 2540 875 -1656 -2110 -291 1410 2169 -902 -1838 -1581 67 1368 1825 -547 -2665 -1274 2072
2772B072Q3k147j282j040J441K153L70k025j538J96K181J653o27l719N80N14J861
$$ 2072 2155 8 -1274 -2314 -873 1280 1650 -375 -1913 -1717 464 2117 1490 -2229 -1649 -1135 726
2789G26J006j615k303k22K553R11J290k773k411J473J813O59O23l474m41K094
$$ 726 1732 117 -2186 -2408 145 1056 2346 -427 -2838 -1365 448 1107 1730 -1744 -2185 -91
2805i1R20J046j854k241J196J255K214j211k149j141J736J486J457j831k675M77
$$ -91 829 1875 21 -2220 -1024 231 2445 1234 -915 -2056 -320 1166 2623 792 -1883 -1406
2821a406K152J118q62j080k028O78R36K314r16k468k30J567K408O01k713k384
$$ -1406 746 1864 1002 -78 -2106 -1428 -492 1822 906 -1562 -1792 -225 2183 2784 71 -2313
2837b313M74J946K240l5k963j369P74K017J532l064n31m04M74K474M05k397j487
$$ -2313 -1839 107 2347 2312 -651 -2020 -1246 771 2303 -761 -1292 -1696 -1222 1252 1657 -740 -2227
2854b227J58K298O88J57k208j698K695J736N9j298j869n73J446K271q5j869k140
$$ -2227 -2069 229 917 1074 -1134 -2832 -137 1599 1658 360 -1509 -2082 -636 1635 1550 -319 -2459
2871b459M03K270J755j582j645m33M82L088J9j151k363q04K144K259o15j222k590
$$ -2459 -2056 214 1969 387 -1258 -1691 -1209 1879 1898 747 -1616 -2420 -276 1983 1368 146 -2444
2888b444Q11J311J359k74j693n05J583J493L76j359k843J000J371J064J77p82
$$ -2444 -1633 -322 1037 763 -930 -1435 148 1641 2017 658 -2185 -1185 186 1250 1427 645
2904F45k787J153K156P03k99j858j463J625J891n80j419j239l03K007J206r30
$$ 645 -2142 -989 1167 1870 1571 -287 -1750 -125 1766 1186 -233 -1472 -1775 232 1438 508
2920E08j856l79J129J636O07j295k038Q42J809N42k12k167n04R76R97P14k88j973
$$ 508 -1348 -1727 -598 1038 1645 350 -1688 -846 963 1505 1293 -874 -1378 -402 595 1309 1021 -952
2938i52j047J807J269N6r61j470J16P60J686J91j485j406O65K013nj028r44q84
$$ -952 -1999 -192 1077 1133 172 -1298 -1182 -422 1264 1455 -30 -1436 -771 1242 1237 209 -735 -1619
2956a619Q71K062k40m87j924n90J706J569k59j824o72K005O32M03p28k499k56
$$ -1619 -748 1314 1074 587 -1337 -1927 -221 1348 1089 -735 -1407 598 1230 1633 905 -1594 -1850
2973a850K206K80O91k445m68L40J222J185o32j723p74O56K054l81r32j304J474
$$ -1850 356 636 1327 -1118 -1586 -1246 -24 1161 529 -1194 -1968 -1312 742 361 -571 -1875 -401
2990d01M41J017L25j953j969J015K396N54j100j734L47J48J649K85j064j172m35
$$ -401 40 1057 1382 -571 -2540 -1525 871 1425 325 -1409 -1062 -914 735 1020 -44 -1216 -1651
3007a651K098L7O11j371j116K16K469k21q29k029R69J55J164J229j650j675M89
$$ -1651 447 484 1095 -276 -1392 -1176 1293 1072 243 -1786 -817 -662 502 1731 81 -1594 -1105
3024a105J610o2L50j292j116J720R79O46j885o61o38J644Q92k17o50k147J042
$$ -1105 505 443 793 -499 -1615 105 1084 1730 -155 -816 -1454 190 1082 865 215 -1932 -890
3041h90J790P1r25j873L47J104L91J023j288j212R7J548L73N91j576q51P5K338
$$ -890 900 971 46 -1827 -1480 -376 15 1038 -250 -1462 -1365 183 556 1147 -429 -1280 -1205 1133
3059A133L36j121j451O28J222L71j73j448j193P69O34K325j206j185j437J098
$$ 1133 1469 348 -1103 -475 747 1118 945 -503 -1696 -927 -293 2032 826 -359 -1796 -698
3075f98J358M02j220k039J601O68J422j100q26j051P60J492K22j65k062k70J968
$$ -698 660 1062 -158 -2197 -596 72 1494 394 -432 -1483 -723 769 991 826 -1236 -1506 462
3092D62J029j095p80m97o64K682P27k454o14Q13N0R95K96j28k113L08N37J865
$$ 462 1491 396 -384 -881 -1545 1137 1864 -590 -1204 -391 -341 654 950 822 -1291 -983 -446 1419
3110A419r03o35j058l58J871J185q78j497q51J026K188K54k074M02m89r7K055
$$ 1419 516 -119 -1177 -1535 336 1521 643 -854 -1705 -679 1509 1763 -311 91 -398 -495 1560
3127A560j95k068m67M84K414j300M73j584j36k08K095J589k920q98nK071J27L2
$$ 1560 1365 -703 -1170 -686 1728 428 901 -683 -819 -1027 1068 2657 -263 -1161 -1166 905 1032 1064
3145A064j391j020J53J301J700r16j558l35J471K97o2r24j420l8K269Q39j158
$$ 1064 -327 -1347 -1194 107 1807 891 -667 -1002 469 766 704 -220 -1640 -1678 591 1430 272
3162B72r60p29J174J151J051j314k892J426K01J691K27j500k89j73J358L26k31
$$ 272 -688 -1417 -243 908 1959 645 -2247 -821 -620 1071 1298 -202 -491 -664 694 1020 789
3179G89j684n98R37J351J351k365m84L60P78J530j648j225J60P0J580N23j051
$$ 789 -895 -1493 -556 795 2146 -219 -703 -343 435 1965 317 -908 -748 -678 902 1425 374
3196C74q92n37J035j7O58n66j803O03M73J669q92j196K03Q57K74L89j14j819K79
$$ 374 -518 -1055 -20 -37 621 55 -1748 -1145 -672 997 105 -1091 -888 -31 243 632 518 -1301 -1022
3215a022R19J225J02j778n26J11J125P29r20n85j474J791K54J167k003J61Q1J836
$$ -1022 -103 1122 1224 -554 -1080 -969 156 885 -35 -620 -2094 -303 -49 1118 -885 -724 -643 1193
3233A193L91j230l35j863J248J215O69n95j751o09J769J058l97o06j76p92K67
$$ 1193 1584 354 19 -1844 -596 619 1288 693 -1058 -1667 102 1160 763 157 -19 -811 -544
3250e44J144O52j834o19R33J083k44m16j434j24J138R13O80k169p74J297M91P54
$$ -544 600 1252 -582 -1201 -268 815 571 155 -1279 -1403 -265 648 1328 -841 -1615 -318 173 927
3268I27J71j431j124K87J366R35j734Q52o52Q06N25q55j93j020L41J523L92o43
$$ 927 1098 -333 -1457 -1170 196 1131 -603 249 -403 403 928 73 -120 -1140 -799 724 1116 473
3286D73j487O34P42M99L08p31j796J077O61J36L56j696k34N66J358M82j839q63
$$ 473 -1014 -380 362 861 1169 438 -1358 -281 380 516 872 -824 -1058 -492 866 1348 -491 -1354
3304a354m5J789L78k16N8k040N77Q78N30o89n24o6L42M98K47m35j164N08Q40M73
$$ -1354 -1399 390 768 552 610 -1430 -853 25 555 -134 -658 -724 -382 116 363 -72 -1236 -728 112 585
3324E85R4o69j215J032P84n2m19k58j32m40J798O7j315j404M54J439J55j6o90
$$ 585 679 10 -1205 -173 611 559 140 -118 -250 -690 1108 1175 -140 -1544 -1090 349 504 488 -202
3343b02m64L94R71K22n89r66k04P3J911l84j303r97N54O62J603p63p82j438K6
$$ -202 -666 -272 699 921 332 -634 -838 -765 1146 762 -541 -1538 -984 -322 1281 518 -264 -1702 -1676
3362a676K397Q4j080p11L25L08J016J43o33j750J243K132K79k279K89j142N83
$$ -1676 721 805 -275 -986 -661 -353 663 806 173 -1577 -334 1798 2077 -202 87 -1055 -472
3379d72R70m2n73r85P06O40O4N3k220J441K09N77P81o04j109j23K11J726m18j151
$$ -472 498 456 -117 -1102 -396 244 308 361 -1859 -418 -209 368 1149 545 -564 -687 -476 1250 832 -319
3399c19O0%P33M80m74r87r90J100P10R84j734j54P18k49N58J13j088m41L19M78
$$ -319 -259 -259 474 954 480 -507 -1497 -397 313 1297 -437 -591 127 -122 436 549 -539 -980 -661 -183
3419a83J152k88j662m1J196R29n3l44k028J33Q03J487p12o30L31k2N06K00j45
$$ -183 969 681 -981 -1022 174 1103 1050 706 -1322 -1189 -386 1101 389 -241 90 68 574 774 629
3438F29q32m51O77j24J219j57j637n10J807LJ3j414q45J777q1J024j038q13k4
$$ 629 -203 -654 23 -101 1118 961 -676 -1186 621 624 637 -777 -1622 155 74 1098 60 -753 -777
3457g77J319P6R29j621n23o3J394O3N26k281mJ75J622p58k9n75n36J936p2J72
$$ -777 542 618 1547 -74 -597 -660 734 797 1323 -958 -962 -787 835 77 48 -527 -1063 873 801 973
3477I73k292N60J78P27N3J32p87m17J094O39K12j129j206J95J390Q26j044q56
$$ 973 -1319 -759 -581 146 199 331 -456 -873 221 860 1072 -57 -1263 -1068 322 1148 104 -752
3495g52j202J596O20j43m71p01q7J554O71J40j808o60J670o87R09j88j141m87
$$ -752 -1954 -358 262 119 -352 -1053 -1140 414 1085 1225 -583 -1243 427 -260 649 461 -680 -1167
3513a167N75J480J1m18o73m33R27J97o3P5r27J80Q87M08r04r19K89M70R94m89
$$ -1167 -592 888 899 481 -192 -625 302 499 436 511 -416 -236 651 1059 155 -764 -475 -5 989 500
3533E00q89m53l08J593L91l88j285p0L57Q49J090j542j141K20L93J521Jj518j62
$$ 500 -389 -842 -1150 443 834 446 -839 -909 -552 297 1387 -155 -1296 -1076 -683 838 839 -679 -841
3552h41R89Q54m74n4j827N42K20J680j59o08j079k52J280M10m98q69N0J279K44
$$ -841 148 1002 528 474 -1353 -811 -591 1089 930 322 -757 -1009 271 681 183 -686 -636 643 887
3571H87P3j754J5l28J355N93m01r37j629J777J215O47j932j074R60M25J050M83
$$ 887 960 -794 -779 -1107 248 841 440 -497 -2126 -349 866 1513 -419 -1493 -533 -108 942 1425
3589A425j386j238J239n14J958j199r59M43J69P27K84j567n50J253m18O09Q20
$$ 1425 39 -1199 40 -474 1484 285 -674 -231 -62 665 949 -618 -1168 85 -333 276 1096
3606A096k169N96L56N93O1n54q23J92J98P63R02j970M66m52R49J099q12q69K3
$$ 1096 -1073 -477 -121 472 533 -21 -844 -652 -454 309 1211 -759 -293 -745 204 1303 491 -378 -355
3625c55L53O53j66j74j126L8Q50N91j253J106r79m73J75J456K49j815P97j03J470
$$ -355 -2 651 485 311 -815 -777 73 664 -589 517 -462 -935 -760 696 945 -870 -73 -176 1294
3644A294n99j241m18K68k7J684j86o64p72q77J123J138n23R3p71N29J09M91Q1
$$ 1294 695 -546 -964 -696 -723 961 775 111 -661 -1538 -415 723 200 293 -478 51 160 651 732
3663G32j80j094N73M49J484j988q13R1J649K07r18n54j55J91P62J20n74k05R5
$$ 732 552 -542 31 480 1964 -24 -837 -746 903 1110 192 -362 -517 -326 436 556 -18 -223 -128
3682a28m21J364n94j24q61P79J40O08l17k76r73J033O54K49j290o04O6J098R28
$$ -128 -549 815 221 97 -764 15 155 763 446 170 -803 230 884 1133 -157 -761 -695 403 1331
3701A331o95n71n34j73J041N49o75j636J399N65L86m07n20j257J350p4J059j235
$$ 1331 636 65 -469 -642 399 948 273 -1363 36 601 987 580 60 -1197 153 79 1138 -97
3719i7m95k67O98O46M89j013p13P3P46M18j07j127J88M97P05M32r61p62K16O20
$$ -97 -592 -859 -161 485 974 -39 -752 -679 67 485 378 -749 -561 -64 641 1073 112 -650 -434 186
3739A86J15L52o14p33O84j75J719q75r32J10l07Q59M00o68n56k57M68J160p71
$$ 186 301 653 39 -694 -10 -185 1534 659 -273 -163 -470 389 789 121 -435 -692 -224 936 165
3758A65j03j280J248N22R57m82j165o48Q35N22j51q46o23N17l0O50p00L5J15P2
$$ 165 62 -1218 30 552 1509 1027 -138 -786 49 571 420 -426 -1049 -532 -562 88 -612 -577 -462 -390
3778c90J626o07p30n58M77K11R83j384J73m19L4Q02J59l67m76J39q4L45O5k65
$$ -390 1236 629 -101 -659 -182 29 1012 -372 -199 -618 -584 218 377 10 -466 -327 -411 -66 -1 -266
3798b66q54Q77L28N02M37q35N22q30K28N9r27P3M98Q7R18n90k42r72J201P63q03
$$ -266 -1120 -243 85 587 1024 189 711 -119 109 168 -759 -686 -188 -101 817 227 -15 -987 214 977 174
3819A74J30l38j000K82J063q09P76M6p24J684l18m84j194k87O38Q39j76K7j194
$$ 174 304 -34 -1034 -752 311 -498 278 324 -400 1284 966 482 -712 -999 -361 478 302 329 -865
3838h65J27J74P15M52m85o63j063J951n0q8q02o08O94L10p2Q14m28o1j66R18K88
$$ -865 -738 -564 151 603 118 -545 -1608 343 293 205 -597 -1205 -511 -201 -273 541 113 52 -114 804 1092
3859A092j479O5p6R85K28k44j244k41J304M2O89o44j382O81n18J588n51k20j531
$$ 1092 -387 -322 -398 587 815 571 -673 -914 390 432 1121 477 -905 -224 -742 846 295 75 -1456
3878a456J078O67l70O48p17n77k90K041N53j438p36L92O74L48m28j37j232R75
$$ -1456 -378 289 -81 567 -150 -727 -1017 1024 1577 139 -597 -205 469 817 389 252 -980 -5
3896ep4j88L23j181o9J331M58o44J75jj274J968J18k16n22j181J567p5k64l8m48
$$ -5 -79 -267 56 -1125 -1194 137 595 -49 126 125 -1149 819 937 721 199 -982 585 510 246 208 -240
3917b40M39O42m84J19p78j299J487M70P52k884K31Q29O41J27M83p25l38k19J154
$$ -240 199 841 357 476 -302 -1601 -114 356 1108 -1776 -1545 -716 -75 52 535 -190 -528 -747 407
3936D07l24M89K56j000OL75J024j609M16o02Q69K09j11j189j1P83K4k33P99r99
$$ 407 83 572 828 -172 -166 209 1233 -376 40 -562 307 516 405 -784 -795 -12 12 -221 578 -421
3956d21j44J113j05j055j87m61R20O5P53j42n65p96P77P31Q6n98j072J076K68
$$ -421 -565 548 443 -612 -799 -1260 -340 -275 478 336 -229 -1025 -248 483 569 -29 -1101 -25 243
3975B43J243o79j284o88L01O34R97j092J12j005J773N81n48m57J29r76Q63R29
$$ 243 1486 807 -477 -1165 -864 -230 767 -325 -213 -1218 555 1136 588 131 260 -716 147 1076
3993A076p95n14m07R96J49N25j41j041p7L15R06q8q62m52j082J657NJ35L18r15
$$ 1076 281 -233 -640 356 505 1030 889 -152 -229 86 992 904 42 -410 -1492 165 170 305 623 -292
4013b92J75p2O26q12l4J68L14R03j608J167j120j32J265o35Q93j588k9M50M13
$$ -292 -117 -189 437 -375 -409 -241 73 976 -632 535 -585 -717 548 -87 806 -782 -811 -361 52
4032E2P84p98j20p49Q79M75o95P48j284N62M98J26j266O15m56N31m69J305p65
$$ 52 836 38 -82 -831 48 523 -172 576 -708 -146 352 478 -788 -173 -629 -98 -567 738 -27
4051b7q73J7J007Q77j112j45l59M20J199M86j032J43n68kJ038k17q57j56o87J383
$$ -27 -900 -883 124 1001 -111 -256 -615 -195 1004 1490 458 601 33 31 1069 852 -5 -161 -848 535
4071E35q83N06k93p78n79K416J2n80r96L18J371n7o56m65j449J444O96M20r16
$$ 535 -348 158 -135 -913 -1492 924 936 356 -640 -322 1049 992 336 -129 -1578 -134 562 982 66
4090F6n41k75N37P20j59r94M15k27N69L07o33L08l11K47R75q65M31j300J178j29
$$ 66 -475 -750 -213 507 348 -646 -231 -458 111 418 -215 93 -218 29 1004 139 570 -730 448 319
4110C19N94p9m13j143N65J254n71q00l69k91N69O83M61k59r45J5K33P21l35o35
$$ 319 913 834 421 -722 -157 1097 526 -274 -643 -934 -365 318 779 520 -425 -410 -177 544 209 -426
4130d26N2p3M83J346j463L34J41l21P18J00j004o18K24O27J051j060P4m04O04
$$ -426 -374 -447 36 1382 -81 253 394 73 791 891 -113 -731 -507 120 1171 111 185 -219 385
4149C85l27K43j17m17m55O70J181o36k11k44j091J147N87K34j427L6P01N05K8
$$ 385 58 301 184 -233 -688 -18 1163 527 316 72 -1019 128 715 949 -478 -442 259 764 792
4168G92j160LM85m2J590j360l56j102R01O32P12j119k58q1J097n24m02N63o20
$$ 792 -368 -365 120 78 1668 308 -48 -1150 -249 383 1095 -24 -282 -363 734 210 -192 371 -249
4187b49kJ41Q33p97R1j272N2P80J247m94r93n11J336M85N16j739k91p81J506O94
$$ -249 -251 -110 723 -74 17 -1255 -1203 -423 824 330 -663 -1174 162 647 1163 -576 -867 -1648 -142 552
4207E52L29j199j65J638j83m35r53k92M88J110o99j83n60J21L76R5O55m91r13
$$ 552 881 -318 -483 1155 972 537 -416 -708 -220 890 191 8 -552 -431 -55 40 695 204 -709
4226g09O00k49L55L02k01j220O60m5J109j015K64N16k22j23O28J83j327l55J06
$$ -709 -109 -358 -3 299 98 -1122 -462 -507 602 -413 -149 367 145 22 650 833 -494 -849 -743
4245g43J888r64p34k46O86R14n69o63l08l46J084P20J24m92q57m65J136J066j101
$$ -743 1145 181 -553 -799 -113 801 232 -431 -739 -1085 -1 719 843 351 -506 -971 165 1231 130
4264A30r23M50Q20m49P06q93O96r86J102p46j78P30j105j28J094J051m25m66n57
$$ 130 -793 -343 477 28 734 -159 537 -449 653 -93 -271 459 -646 -774 320 1371 946 480 -77
4283g7j79P10Lk47J70qo68J285j017m9o75M55O03O62l6k017J069L98j2K02r60
$$ -77 -256 454 457 210 380 372 -296 989 -28 -77 -752 -297 306 968 932 -1085 -16 382 370 572 -388
4304c88m48J75N04p9K16J66l63l92Q36O51j743l63J617j56L81q81N77j27o88M98
$$ -388 -836 -661 -157 -236 -20 146 -217 -609 227 878 -865 -1228 389 233 614 -267 310 183 -505 -7
4324gJ151j229j45rN80m07Q00n59j49o90J944o10q51N6n16P84N32n70K64m78q27
$$ -7 1144 -85 -230 -239 341 -66 734 175 26 -664 1280 670 -181 -125 -641 143 675 105 369 -109 -936
4345i36J757q56o17R50j289N65L35Q65J2p32r11m5J608j73j11k14o93J9P07N65
$$ -936 821 -35 -652 298 -991 -426 -91 774 786 54 -857 -902 706 533 422 208 -485 -466 241 806
4365H06j002K77n4rm14R51n74n90J001K30j71m01p16L6O15O04p56K40q74N76j0
$$ 806 -196 81 27 18 -396 555 -19 -609 392 622 451 50 -666 -630 -15 589 -167 73 -801 -225 -235
4386b35L92p5r38M62O36M34q7J79j534P92n59J559n40q19r0p6N17K05o75n94j20
$$ -235 157 82 -856 -394 242 676 589 768 -766 26 -533 1026 486 -333 -423 -499 18 223 -452 -1046 -1166
4407a166J428m55J113r60l29M31M44K02m42m3J65j42N6M5k97K29k80Q94k20Q9
$$ -1166 262 -193 920 -40 -369 62 506 708 266 223 388 246 302 347 50 279 -1 893 673 762
4427G62q44l34N21k71M21l24P38j461Q08L26l37J01n73L22L55N39j023K41j005
$$ 762 -82 -416 105 -166 255 -69 669 -792 16 342 5 106 -467 -145 210 749 -274 -33 -1038
4446a038O01k26Q55k51j109P73O81L71l9n99M60k93J30p76j17N00m29Q45q6m74
$$ -1038 -437 -663 192 -59 -1168 -395 286 657 618 19 479 186 316 -460 -577 -77 -506 339 253 -221
4466b21Q54o79j143J193K33O16j564N20k85J470j262K73n91j71N79N87j161L05
$$ -221 633 -46 -1189 4 237 853 -711 -191 -476 994 -268 5 -586 -757 -178 409 -752 -447
4484d47O77K49n63q31J382j133O02J40J28k4k46j55K27O96L98j47k160k2J165
$$ -447 230 479 -84 -915 467 -666 -64 76 204 180 -66 -221 6 702 1100 953 -1207 -1229 -64
4503f4J274j355o70L04k66J798j49p12J8k83o39R80L54p11j34r3L04l02J148j122
$$ -64 1210 -145 -815 -511 -777 1021 872 160 178 -105 -744 236 590 -121 -255 -348 -44 -346 802 -320
4523c20N65r33P48L0L07K19j252P28Q35l99o63N92o62L72L64L74n61j020P86n02
$$ -320 245 -688 60 90 397 616 -636 92 927 528 -135 457 -205 167 531 905 344 -676 110 -392
4543c92P63k56k46O6M72K00p9k33j531J080r4O50k11J69o12J41K19J03M20j110
$$ -392 371 115 -131 -65 407 607 528 295 -1236 -156 -250 400 189 358 -254 -113 106 209 629 -481
4563d81J379j195J158K27n64j397O47J34J02m94k25O82q71J401q67p1j94L57o2
$$ -481 898 -297 861 1088 524 -873 -226 -92 10 -484 -709 -27 -898 503 -364 -435 -629 -272 -334
4582c34K95R5O78j005J01N07Q31q15l77o89P18m71J134m05r55m07J905j172J030
$$ -334 -39 56 734 -271 -170 337 1168 353 -24 -713 5 -466 668 263 -692 -1099 806 -366 664
4601F64p91J95l69Q09l50k08j03n37O12Q1j36l1j391K022j159N07n91J138j343
$$ 664 -127 68 -301 508 158 -50 -153 -690 -78 3 -133 -164 -1555 467 -692 -185 -776 362 -981
4620i81k27K359j067M70l98k13R6M96K19m40m19l23K13Q38r8m50l78R18p96R15
$$ -981 -1208 1151 84 554 156 -57 39 535 754 314 -105 -428 -215 623 525 75 -303 615 -181 734
4640G34j116L79j81N10M5l56l56k64R4R45k46J62k75K83m90J0n8K86q72k61J317
$$ 734 -382 -3 -184 326 371 15 -341 -605 -511 434 188 350 75 358 -132 -122 -180 106 -766 -1027 290
4661B90J43j47r9q03P50m82J81L11k02kM50o11r7n6L01M5q50N52R79q20J044j711
$$ 290 433 286 187 -616 134 -348 -167 144 -58 -60 390 -221 -318 -374 -73 -28 -878 -326 653 -167 877 -834
4683h34L46N52p75L14Q7R3J015j450K0J039j064M53N46j60n82K21k53J284j145
$$ -834 -488 64 -711 -397 -310 -217 798 -652 -632 407 -657 -204 342 182 -400 -179 -432 852 -293
4702b93M07q53j5N31M64k07l25L72mm55O09j78jj53M52l08n09R80j698J184j41
$$ -293 114 -739 -754 -223 241 34 -291 81 77 -378 231 53 52 -101 351 43 -466 514 -1184 0 -141
4723a41k5M41k39l0m42O68j38n76N22J46m05J202n05n88L52L99j344q66J641j72
$$ -141 -166 275 36 6 -436 232 94 -482 40 186 -219 983 478 -110 242 641 -703 -1569 72 -100
4743a00m36M36Q2N79o28J17m21j19N50k83q5r57J009K89M74K6q59j86M92P19q41
$$ -100 -536 -100 -18 561 -67 50 -371 -490 60 -223 -308 -1265 -256 33 507 533 -326 -512 -20 699 -142
4764a42o33m34J449J39K28j19j372J58n8R12P73q27n61M43j01L61O8k85pK45n80
$$ -142 -775 -1209 240 379 607 488 -884 -726 -784 128 901 74 -487 -44 -145 216 284 -1 -8 237 -343
4785c43J209j267k7n25k4J262O18m97m59m10Q21p31J023q75K29P9R39j72j235
$$ -343 866 -401 -428 -953 -977 285 903 406 -53 -463 358 -373 650 -225 4 83 1022 850 -385
4804c85M59m87J24L25J69L32q01o77Q44k37N2O41l48N12J2j08m83l7o38J013k33
$$ -385 74 -413 -289 36 205 537 -264 -941 -97 -334 -282 359 11 523 535 427 -56 -93 -731 282 49
4825D9P0J82p26K57R90p35R64j311M62n05K81Q07j651Q17K96l37k40P07L65j672
$$ 49 119 301 -425 -168 822 87 1051 -260 202 -303 -22 785 -866 -49 247 -90 -330 377 742 -930
4845i30M75J90K0J045n53n86K61k36J108j398m29J37O82Q73m10o71O89m37J77
$$ -930 -455 -265 -245 800 247 -339 -78 -314 794 -604 -1033 -896 -214 659 249 -422 267 -170 7
4864GP8L07J35l11r36L30K47L29m50J89m55J5O54J70o60R28p89L97Q55m88j238
$$ 7 85 392 527 216 -720 -390 -143 186 -264 -75 -530 -515 139 309 -351 577 -212 185 1040 552 -686
4885f86o0O54O54j108n24M01P60k56N71l87p74Q23n82N1P79j180K79O66O03p96
$$ -686 -746 -92 562 -546 -1070 -669 91 -165 406 19 -755 68 -514 -463 316 -864 -585 81 684 -112
4905a12O91m10O33q53N12r28J66J344j082M19l61L68j233J164o14P77p04J88k81
$$ -112 579 169 802 -51 461 -467 -301 1043 -39 380 19 387 -846 318 -296 481 -223 -35 -316
4924c16J430q38M46J0q50k71R34j06M35o69m51M87j80K28n54n67J069M47k10K66
$$ -316 1114 276 722 732 -118 -389 545 439 874 205 -246 241 61 289 -265 -832 237 684 474 740
4944G40p62l35L77N86n40M03j82r47J19J241j48m14n44J72N90r61K248k349lK33
$$ 740 -22 -357 20 606 66 469 287 -660 -541 700 552 138 -406 -234 356 -605 1643 -706 -709 -476
4964d76N60N17k75l29q85J426j184J338q81p6r34J632p41M12l4k20N31o00o2N81
$$ -476 84 601 326 -3 -888 538 -646 692 -189 -265 -1199 433 -308 104 70 -150 381 -219 -281 300
4984C00p35L77K21j91l64R19p89j8lQ56r4k43j031K73J370p83M34j038J051n68
$$ 300 -435 -58 163 -28 -392 527 -262 -280 -283 573 479 236 -795 -522 848 65 499 -539 512 -56
5004e6J10R99j352J84J56r2K10L27k56n95M3J61O66m04M42j227L99K4J006k72
$$ -56 54 1053 -299 -115 41 -51 159 486 230 -365 -322 -161 505 101 543 -684 -285 -261 745 473
5024D73q31K35J73L60K57j475N69K2N76K72k60l01q36L18l23J157k54M97j07N1
$$ 473 -358 -123 50 410 667 -808 -239 -217 359 631 371 70 -766 -448 -771 386 132 629 522 573
5044E73j204L56j78K0J399r11l79Q4J68N4m59P98P12r50m70J055j14l85l44J2
$$ 573 -631 -275 -453 -433 966 55 -324 -240 -72 -18 -477 321 1033 83 -387 668 554 169 -175 -163
5064a63P11p2O6J36j036O5l09O58J83j096J059p08K18L40n2N81j212M79O69n2
$$ -163 548 476 542 678 -358 -293 -602 56 239 -857 202 -506 -288 52 0 581 -631 -152 517 465
5084D65J05j070R46j079Q29k80R00n59q0J8rj51n4M94q57J652k29j40j221N55
$$ 465 570 -500 446 -633 196 -84 816 257 177 195 186 35 -19 475 -382 1270 1041 901 -320 235
5104B35N08q86M52o29l91P4K64J6J670j255K84m25j33J067p10m66m02M34k85Q32
$$ 235 743 -143 309 -320 -711 -637 -373 -357 1313 58 342 -83 -216 851 141 -325 -727 -293 -578 254
5124B54K90j346O08R3L71m80k19K09L02M45K56r34j55k92L24K97K96o29o89J530
$$ 254 544 -802 -194 -101 270 -210 -429 -220 82 527 783 -151 -306 -598 -274 23 319 -310 -999 531
5144E31n40J036pq09p23l45K78K25l51r6L94K34O87m51n3l43L45J65l28n60K16
$$ 531 -9 1027 1020 211 -512 -857 -579 -354 -705 -801 -407 -173 514 63 10 -333 12 177 -151 -711 -495
5165d95N81o53P30K49k74j7j40k95N2O79j8Q8o49N13K68j704J199p81N34JK99
$$ -495 86 -567 163 412 138 121 -19 -314 -262 417 399 487 -162 351 619 -1085 114 -667 -133 -132 167
5186A67L68r98J3L88O46P7j143L08M25Q1j89P28q19l00Q05q94R95L6p10q94R09
$$ 167 535 -463 -450 -62 584 661 -482 -174 251 332 143 871 52 -248 557 -337 658 694 -16 -910 -1
5207aK54O7r76N67J5o28J283J01j201N46K97n3l09j43L56K34o33J87m10O2J4K08
$$ -1 253 320 -656 -89 -74 -702 581 682 -519 27 324 271 -38 -181 175 409 -224 -37 -447 -385 -371 -163
5229a63L9p7J118k13p53K78k08K25Q6M6j367J461M37n18o97j76Q12q49Q85o58
$$ -163 -124 -201 917 704 -49 229 21 246 332 378 -989 472 909 391 -306 -482 330 -519 366 -292
5249b92M90r91J109m67J295j597N66K37J06J69j005R21j476O27JK7Q53r48l26
$$ -292 198 -793 316 -151 1144 -453 113 350 456 625 -380 541 -935 -308 -307 -280 573 -375 -701
5268g01R76K69o82K23p55N47j26J641j748N0Q8K23j72N59o75K7n1M60q39N61N0
$$ -701 275 544 -138 85 -670 -123 -249 1392 -356 -306 -218 5 -167 392 -283 -256 -307 153 -686 -125 -75
5289g5l06R49j138O51p8j055J340l36O31j302p0R67q67M29M3N6j22J059m22J35
$$ -75 -381 568 -570 81 3 -1052 288 -48 583 -719 -789 178 -689 -260 -217 -161 -283 776 354 489
5309D89k65l97N03p85N53K23k9m60j61N49n22L61j86r5m6R99K79j605N53l67M5
$$ 489 224 -173 330 -455 98 321 292 -168 -329 220 -302 59 -127 -222 -268 731 1010 -595 -42 -409 -364
5330c64O81n0K1k70L47K97o26K35r07M00K16J24n75O36o88N19k67J74m64M47J25
$$ -364 317 267 288 18 365 662 36 271 -636 -236 -20 104 -471 165 -523 -4 -271 -97 -561 -114 11
5351A1n90J203L9K57p30l54L3Q22l85l00m49ON91j29M7L36J53j400J022k52m25
$$ 11 -579 624 663 920 190 -164 -131 691 306 6 -443 -437 154 25 72 408 561 -839 183 -69 -494
5372d94Q16n50M09o08M45p16M42J11N74K30r01L16Q8o62m35r0P99m42k07K04Q02
$$ -494 322 -228 181 -427 18 -698 -256 -145 429 659 -242 74 162 -500 -935 -1025 -226 -668 -875 -671 131
5393A31K32n41J95P19j161J120j0q43l58J77M3N87J28j159k97N86O02j91K96j508
$$ 131 363 -178 17 736 -425 695 685 -158 -516 -339 -296 291 419 -740 -1037 -451 151 -40 256 -1252
5413a252J621n68J16Q37r27J39o59P76M1L86o01J9L30M51L83k157O78Q34M27j01
$$ -1252 369 -199 -83 754 -173 -34 -693 83 124 510 -91 -72 258 709 1092 -1065 -387 447 874 773
5433G73p34k56N4O88n86mm55k17J77j30M97K15J71k46l7L72N9m2m42k48K3Q95
$$ 773 39 -217 -163 525 -61 -65 -520 -737 -560 -690 -193 22 193 -53 -90 282 341 299 -143 -391 -368 527
5455E27K16o43p66L35p08J117O83j203l2K73l08M10O1k36J15n49J506q34R12j021
$$ 527 743 100 -666 -331 -1039 78 761 -442 -474 -201 -509 -99 -38 -274 -159 -708 798 -36 876 -145
5475a45Q76n19j82l58j90J19M12QL42k58m1j588J697n48N17n62m66J331n54n04
$$ -145 731 212 30 -328 -518 -399 13 21 363 105 64 -1524 173 -375 142 -420 -886 445 -109 -613
5495f13O14O59j434Q79L75m78j60o87J07M02J17l95K92J1k50k41J386p16q0j50
$$ -613 1 660 -774 105 480 2 -158 -845 -738 -336 -219 -614 -322 -311 -561 -802 584 -132 -212 -362
5515c62N93j78k39l42l43K5Q74O27p7r91j085J642j27j56O20j404K108j406K66
$$ -362 231 53 -186 -528 -871 -846 28 655 578 -413 -1498 144 17 -139 481 -923 1185 -221 45
5534D5q10K36J121m35n88Q09l81L13L6j1L94l98J45L32j497M35O31l8l88J50J06
$$ 45 -765 -529 592 157 -431 378 -3 310 346 335 729 331 476 808 -689 -254 377 339 -49 101 207
5555B07O35o23Mm43q3L31K08K6l01j28L9R74l86n31m76M77N78k62J12Ro41Q25
$$ 207 842 219 223 -220 -303 28 236 262 -39 -167 -128 846 460 -71 -547 -70 508 246 358 367 -274 551
5577E51l65n16J211p77j19j04m24J179o21k03m50L08N86M99m99l11k70M04L46
$$ 551 186 -330 881 104 -15 -119 -543 636 15 -188 -638 -330 256 755 256 -55 -325 79 425
5596D25o22k02N41l23R85o50M45p31m50Q49N4n81M39n64l36P80J056r19n0o79
$$ 425 -197 -399 142 -181 804 154 599 -132 -582 267 321 -260 179 -385 -721 59 1115 196 146 -533
5616e33m21R81n9k12j2N39P2m30j64K46l48M41O13r62M23N03j025M45N51N4o27
$$ -533 -954 27 -32 -244 -256 283 355 -75 -239 7 -341 100 713 -249 174 677 -348 97 648 702 75
5637G5K44k82Q76o41N26o69k25L84j047R26j71n2k69m93Q74l45J28L03m28L73
$$ 75 319 37 913 272 798 129 -96 288 -759 167 -4 -56 -325 -818 56 -289 -161 142 -286 87
5657H7l51K69K78K1k51J49l88kk4L82R2O06r82K39n75N50M11m89n10R71j85j83
$$ 87 -264 5 283 304 53 202 -186 -188 -212 170 262 868 -114 125 -450 100 511 22 -488 483 298 115
5679A15N71L33k70m47l90P41n62k3k01r70J121J67n9o58K94k0J011m43N59p58
$$ 115 686 1019 749 302 -88 653 91 68 -133 -1103 18 185 126 -532 -238 -258 753 310 869 111
5699A11j60m09P58k8n37o4p17J156j53P57j160P68J1j69n06M27o8l91J2P87K54
$$ 111 -49 -458 300 272 -265 -329 -1046 110 -43 714 -446 322 333 164 -342 85 17 -374 -362 425 679
5720F79o39P6m11m69M69O01j84j17l15R01l66Q94j800k38R27J45J45L30j332R5
$$ 679 40 116 -295 -764 -295 306 122 5 -310 591 225 1119 -681 -919 8 153 298 628 -704 -609
5740f09N2o2Q48p30l47M23J066p83O96r4j424P76Q11J88j439j26J07O97p99L00
$$ -609 -557 -619 229 -501 -848 -425 641 -142 554 460 -964 -188 623 811 -628 -754 -647 50 -749 -449
5760d49n54N81J090p94P69m32j49j032Q02J040j062P99n46q7L0r7L48J42k06l51
$$ -449 -1003 -422 668 -126 643 211 62 -970 -168 872 -190 609 63 -24 6 -91 257 399 193 -158
5780a58l77L95j75m87J180n02J38j18n13M54n12J126p77j68m35N57R14l26L51
$$ -158 -535 -140 -315 -802 378 -124 14 -104 -617 -163 -675 451 -326 -494 -929 -372 542 216 567
5799E67j006M5O43n20l89R72J43j176P97O9j32J77O47n41r8k5J10j219J224J7
$$ 567 -439 -394 249 -271 -660 312 455 -721 76 145 13 190 837 296 198 173 283 -936 288 305
5819C05M20j97j88l94N56K02l72j376O46J72J021j319P20L95j234O7J83J4K76
$$ 305 725 528 340 -54 502 704 332 -1044 -398 -226 795 -524 196 591 -643 -576 -393 -379 -103
5838a03k80K72J56p95Q22k25n28K78J056j8j061R83n17K68q2l56J38m73O86m60
$$ -103 -383 -111 45 -750 72 -153 -681 -403 653 635 -426 557 40 308 226 -130 8 -465 221 -239
5858b39P13q22N02p92P98j99j31N8R6j33N0J42l55J43P42m61o01O74L47K61j540
$$ -239 474 -348 154 -638 160 -39 -170 -112 -16 -149 -99 43 -312 -169 573 112 -489 185 532 793 -747
5879g47K59P17K34j22L25j187J155q30Q73j122j58P85o62Q19J34p59l06N97m45
$$ -747 -488 229 463 341 666 -521 634 -196 677 -445 -603 182 -480 339 473 -286 -592 5 -440
5898d40J3M75Q8o21n69Q11q47J403j251O01L76J69K55p49l99M44l19L22Q5M2o03
$$ -440 -427 48 136 -485 -1054 -243 -1090 313 -938 -337 39 208 463 -286 -685 -241 -560 -238 -153 -111 -714
5919g14P38M25L18q82l87N02N14J87q95M74j101N96j48l48Q48L62j000M04K44
$$ -714 24 449 767 -115 -502 0 514 701 -194 280 -821 -225 -373 -721 127 489 -511 -107 137
5938A37L38pr73K63J170j622R11k29r1J37O95M55j053o16k00N84j72l16M73m04
$$ 137 475 468 -505 -242 928 -694 217 -12 -103 34 729 1184 131 -485 -685 -101 -273 -589 -116 -520
5958e20k07O29n63J204m74l74K17j78M28o91k79M71N16Q4n71N59J22k91QJ42k83
$$ -520 -727 -98 -661 543 69 -305 -88 -266 162 -529 -808 -337 179 263 -308 251 373 82 90 232 -51
5979e1j6k83l95P00O82j402P59L90o56J254m41J74j009K17P33k34M50j731Q51
$$ -51 -67 -350 -745 -45 637 -765 -6 384 -272 982 541 715 -294 -77 656 422 872 -859 -8
5998hp3O31m74Q0n9J079q54n88M82J38n88K69L62q1J97r7j354J60J750j461N20
$$ -8 -81 550 76 156 97 1176 322 -266 216 354 -234 35 397 316 513 416 -938 -778 972 -489 31
6019C1M13l33J03m8L82j69l34M1R2o69O96L49K36R2n58k58j86M50j169J295n94
$$ 31 444 111 214 166 548 379 45 86 178 -491 205 554 790 882 324 66 -120 330 -839 456 -138
6040a38j03M92j30j04P1j18P6l93P95o63j50M95L19n17m01J80N51r90J448o43
$$ -138 -241 251 121 17 88 -30 46 -347 448 -215 -365 130 449 -68 -469 -289 262 -728 720 77
6060G7K98L88o75l57j32p68J420l45M93j205P34O0k4J024j022k23k00l27J380
$$ 77 375 763 88 -269 -401 -1169 251 -94 399 -806 -72 -12 -36 988 -34 -257 -457 -784 596
6079E96k0j100J28O63j2J89J54j238O85m04K58J207j360l4J82J49K47r13J041
$$ 596 576 -524 -396 267 255 444 598 -640 45 -359 -101 1106 -254 -288 -106 43 290 -623 418
6098D18j104J081m46J87r58O51J48p5R21l31r80N69l74P82k04o1L61q86J001j536
$$ 418 -686 395 -51 136 -822 -171 -23 -98 823 492 -488 81 -293 489 285 224 585 -301 700 -836
6118h36Q32k31N15j91J88l76R60r00r3j80K92j60J5J247o55o87K50K44p09l73
$$ -836 -4 -235 280 89 277 -99 861 -39 -132 -312 -20 -180 -165 1082 427 -260 -10 234 -475 -848
6138h48J91J328k93l53j58o03M02J138o29k06n85M73P22Q0o47K44p0j1m43N84
$$ -848 -657 671 378 25 -133 -736 -334 804 175 -31 -616 -143 579 659 12 256 186 175 -268 316
6158C16o06N63L26o13k42L95j03k84J06L34n77M84j174K33J763j076K80M7j34
$$ 316 -290 273 599 -14 -256 139 36 -248 -142 192 -385 99 -1075 -842 921 -155 125 172 38
6177C8N49n01O33n32l7L22q86M71J44L57m98p0k40O07N07j400K49k17R38R3j43
$$ 38 587 86 719 187 150 472 -414 57 201 558 60 -10 -250 357 864 -536 -287 -504 434 527 384
6198C84L02l37K89j013l65N82l46Q07J12m74j06L45r51J4J69K10J0Q79q38O21
$$ 384 686 349 638 -375 -740 -158 -504 303 415 -59 -165 180 -771 -757 -588 -378 -368 511 -327 294
6218B94j91m03K02j39K74K57J94j181M43J17k68N63M48o02n52K23q62J620j090
$$ 294 103 -300 -98 -237 37 294 488 -693 -250 -133 -401 162 610 8 -544 -321 -1183 437 -653
6237f53n60Q54k82L11R2J310j099l64K68n71J397m26j035m8P48N23m24r4J77P99
$$ -653 -1213 -359 -641 -330 -238 1072 -27 -391 -123 -694 703 277 -758 -806 -58 465 41 -53 124 923
6257I23p77r87N12m65L80J4R84j02j244N22j61J474o93r07q02J937r54J45J31
$$ 923 146 -841 -329 -794 -414 -400 584 482 -762 -240 -401 1073 380 -527 -1329 608 -346 -201 -70
6276g0O18j025J344p64q56J179j03j93r40M07M86R01l40q38K78L05j115J446q86
$$ -70 548 -477 867 103 -753 426 323 130 -810 -403 83 984 644 -194 84 389 -726 720 -166
6295a66O25p61n35L60P45l42L34L7P88j121K0p17J066K16p53j87K38K19r31M56
$$ -166 459 -302 -837 -477 268 -74 260 297 1085 -36 -16 -733 333 549 -204 -391 -153 66 -865 -409
6315d09L48M81m52M09n61N11q41J057n73O89r17L33m01K75m11M52l65k82R88n94
$$ -409 -61 420 -32 377 -184 327 -514 543 -30 659 -258 75 -326 -51 -462 -10 -375 -657 331 -263
6335b63l95J204p23n61M18m06J361j421N90R4K97l93O22no13o51R50R43r17L16
$$ -263 -658 546 -177 -738 -320 -726 635 -786 -196 -102 195 -198 424 419 -194 -845 105 1048 131 447
6355D47p3j47J1j056R89m01J109q44o07J329l83k85L82j116K75Q77n60m55J030
$$ 447 374 227 238 -818 171 -230 879 35 -572 757 374 89 471 -645 -370 507 -53 -508 522
6374E22r98R90J32q47l15j06O23K25Q02m80n83l34J199j491r8l01L32J100m76
$$ 522 -476 514 646 -201 -516 -622 1 226 1028 548 -35 -369 830 -661 -759 -1060 -728 372 -104
6393a04Q97mj060M83J9J42j15p12Q59n2M05k07l81j231J385n03O80n6j616J178
$$ -104 793 789 -271 212 231 373 258 -454 405 353 758 551 170 -1061 324 -179 501 445 -1171 7
6413Gj10o95J321j026R29l03q53J137j38k2j51r6O79q87O98J62j467N30N06k71
$$ 7 -103 -798 523 -503 426 123 -730 407 269 247 96 0 679 -208 490 652 -815 -285 221 -50
6433e0O27k16K53l81m62j1O1Q85r48J63J029j155K95L37p28J114n98Q88j039n64
$$ -50 577 361 614 233 -229 -240 -179 706 -242 -79 950 -205 90 427 -301 813 215 1103 64 -500
6453e00M25M30M52j403L99N74o52K60J66l32l67K88J097j048O04m29k57l06L7
$$ -500 -75 355 807 -596 -197 377 -275 -15 151 -181 -548 -260 837 -211 393 -36 -293 -599 -562
6472e62N26r14R14L19l27O36m94j070J233n12J171k50L30j265Q84m48k44o69O87
$$ -562 -36 -950 -36 283 -44 592 98 -972 261 -251 920 670 1000 -265 619 171 -73 -742 -55
6491e5J74R8q1n69J177q17N23j06k35n11J84N98P3j012R48j04l24p7j36N46o50
$$ -55 119 217 136 -433 744 -73 450 344 109 -402 -218 380 453 -559 389 285 -39 -116 -252 294 -356
6512c56L05P23n31L19n50o73O49P86o62L03J01J93l39j057J362m54M66l65j70
$$ -356 -51 672 141 460 -90 -763 -114 672 10 313 414 607 268 -789 573 119 585 220 50
6531E0J61K88K19j311J98L52m79J152j682J393Q0j277J829j465M96J03j16J17
$$ 50 211 499 718 -593 -395 -43 -522 630 -1052 341 421 -856 973 -492 4 107 -9 108
6549A08K85j003J453r54j93Q79m3o71o22J245m18K65l66P45j619J018l61N3K95
$$ 108 393 -610 843 -111 -304 575 532 -139 -761 484 66 331 -35 710 -909 109 -252 -199 96
6568I6J24N3j61k1K7k55N76j139L44J061k25l32j151Q70L05j13j60j01N45M89
$$ 96 220 273 112 91 118 -137 439 -700 -356 705 480 148 -1003 -133 172 59 -101 -202 343 832
6588H32j77n94p04J76n4r9O2N43l07j09Q39p02L29k70o97m91J315L4L05k36p81
$$ 832 655 61 -643 -467 -521 -620 -558 -15 -322 -431 408 -294 35 -235 -932 -1423 -108 -74 231 -5 -786
6609g86J320j234M59k21R88l1L21p22J83N93j577J066m05L12k80j98P81j329m34
$$ -786 534 -700 -241 -462 526 495 816 94 277 870 -707 359 -46 266 -14 -212 569 -760 -1194
6628a194J659k49n46L76m87N77l11p6O54j09m02M34n12J073j400K67J1n68N63
$$ -1194 465 216 -330 46 -441 136 -175 -251 403 294 -108 326 -186 887 -513 -246 -235 -803 -240
6647b40J28N40p7n73O59j6j43j171J404o44J52j46j78o3Q35p8m58kl15J001l19
$$ -240 -112 428 351 -222 437 421 278 -893 511 -133 19 -127 -305 -368 467 389 -69 -71 -386 615 296
6668B96j15m91m80M72l42J74L66L14M32n89r7K89j15L51j007j3Q15r88N93L47
$$ 296 181 -310 -790 -318 -660 -486 -120 194 626 37 -60 229 114 465 -542 -555 260 -728 -135 212
6688B12L63L10k50n96L95n62m1q5K30q4Jo1m65M36J51M89l0j50j14J33r8k56l16
$$ 212 575 885 635 39 434 -128 -169 -254 -24 -108 -107 -168 -633 -197 -46 443 413 263 149 282 184 -72 -388
6711c88m68J059Q73q16K54l61L41o07R36q40rk4K33K73n87j73Q79j035N91J042
$$ -388 -856 203 1076 260 514 153 494 -113 823 -17 -26 -50 183 456 -131 -304 575 -460 131 1173
6731A173j450K0O43n12L8l06L10J132m32J82k69n09j50n18Q68p76J298p28q41
$$ 1173 -277 -257 386 -126 -88 -394 -84 1048 616 798 529 20 -130 -648 220 -556 742 14 -827
6750h27Q24N06r0n20n5k2l48N83L8j65L88o32O26n13k49M45J34j12M76P67l56
$$ -827 -3 503 413 -107 -162 -184 -532 51 89 -76 312 -320 306 -207 -456 -11 123 11 487 1254 898
6771H98j114O6j31J39p55J357p43l40N88R27m39K62j151O81j014J017J15k05J79
$$ 898 -216 -150 -281 -142 -897 460 -283 -623 -35 892 453 715 -436 245 -769 248 363 158 337
6790C37l59J079k516K096q64j27N50p90J214j50j357M45l67M53l98J143n54M5
$$ 337 -22 1057 -1459 637 -227 -354 196 -594 620 470 -887 -442 -809 -356 -754 389 -165 -120
6808a20P32j021J78j08Q80m60O55n97M97p20r3J13j28j40Q00J94j190O43K19q22
$$ -120 612 -409 -231 -339 541 81 736 139 636 -84 -177 -64 -192 -332 468 662 -528 115 334 -488
6828d88L96P36J31k78m30R72j320n0Q05q89J88O26o76O98J69l77p99R05p2k89
$$ -488 -92 644 775 497 67 1039 -281 -331 474 -415 -227 399 -277 421 590 213 -586 319 247 -42
6848d2j1O1O19k67m31N05k52L94o55J271j272j45M36k50o10O43O84k37K87j029
$$ -42 -53 8 627 360 -71 434 182 576 -79 1192 -80 -225 211 -39 -649 -6 678 441 728 -301
6868c01L1O29j024L23P82q24Q43l73m72j70R1M14L71n0j51R7p83J109j54k96j10
$$ -301 -270 359 -665 -342 440 -384 459 86 -386 -556 -465 -51 320 270 119 216 -567 542 388 92 -18
6889a8M0J53o30M44j66n09P03O0j17R30p35l71k12P98K2m97P79k91L2r97j09R06
$$ -18 22 175 -455 -11 -177 -686 17 77 -40 890 155 -216 -428 370 392 -105 674 383 415 -582 -691 215
6911B15K55l63j103R03j21q0n39N83O24m53j53P80m75k78N48R0n29k80L02l49
$$ 215 470 107 -996 -93 -214 -294 -833 -250 374 -79 -232 548 73 -205 343 433 -96 -376 -74 -423
6931d23J034n60n33J537j850J709j156P72r73R32p40L90J50j049P31k78J070j058
$$ -423 611 51 -482 1055 -795 914 -242 530 -443 489 -251 139 289 -760 -29 -307 763 -295
6949b95K62k61J47r2J8P5k12L61o4J68q64P25L87n45n84J36M09K0m34M13K6J147
$$ -295 -33 -294 -147 -239 -221 -146 -358 3 -61 107 -757 -32 355 -190 -774 -638 -229 -209 -643 -230 -204 943
6971I43j056N51o06k89J195o61R60n63k17o86P00L04q99m22Q54J35K8N13j310
$$ 943 -113 438 -168 -457 738 77 1037 474 257 -429 271 575 -324 -746 108 243 271 784 -526
6990e26M57k74R13p81J317j625N39N5p55Q64K97k84k50P9p53J257R2j190N07j84
$$ -526 -69 -343 570 -211 1106 -519 20 75 -680 184 481 197 -53 26 -727 530 622 -568 -61 -245
7010b45M54J077j325o25J688j727L81Q51m71M42r79O44J82j09q25M95M50n89J175
$$ -245 209 1286 -39 -664 1024 -703 -322 529 58 500 -479 165 347 238 -587 -92 358 -231 944
7029I44j065L32o08O64m90j2K09P40r09M77k72on11j86Q99J81l68L0N35j380J702
$$ 944 -121 211 -397 267 -223 -235 -26 714 -195 282 10 4 -507 -693 206 387 19 49 584 -796 906
7050I06j109O06p0K98j46k23p2p32Q59K45o41J173j253N4j186L57J380m49L3k6
$$ 906 -203 403 333 631 485 262 190 -542 317 562 -79 1094 -159 -105 -1291 -934 446 -3 30 4
7070Dm86P51P7k26j41K89j85j08R3O35j239j22P25m36L55k15k54M15J115p06n97
$$ 4 -482 269 346 120 -21 268 83 -25 68 703 -536 -658 67 -369 -14 -229 -483 -68 1047 341 -256
7091b56M06O8j78O46n0K66j481n4R26q86N2J231M1o48j11J77P94k06r69M44M20
$$ -256 150 218 40 686 636 902 -579 -633 293 -593 -541 690 731 83 -28 149 943 737 -232 212 632
7112F32j211M30l3k12K78N15n0l38J54K81j327R85N75q77p85J545p06J22N6J07
$$ 632 -579 -149 -182 -394 -116 399 349 11 165 446 -881 104 679 -198 -983 562 -144 -22 34 141
7132A41k08n37R4N04k09q1R11rj17o89M63n16M70n0L59j252R43J3m78J46N44m25
$$ 141 -67 -604 -510 -6 -215 -296 615 606 489 -200 263 -253 217 167 526 -726 217 230 -248 -102 442 17
7154A7m89N14k02R58p02O2n83l8M51j41J97p56J255k88p90O95n78Q02K52q14L9
$$ 17 -472 42 -160 798 96 158 -425 -463 -12 -153 44 -712 543 255 -535 160 -418 384 636 -178 -139
7175a39n12M69J22k89O59q84N07L56M58j226p4J80J01l83J417p94p96R98q41J05
$$ -139 -651 -182 -60 -349 310 -574 -67 289 747 -479 -553 -373 -272 -655 762 -32 -828 170 -671 -566
7195e66L86p6m65R27k54O66p30L55k61L12n42m93M14K94m63j16P00J83J18r59
$$ -566 -180 -256 -721 206 -48 618 -112 243 -18 294 -248 -741 -327 -33 -496 -612 88 271 389 -570
7215e70R49N59q29R07o26m03l03K74k48O83j06r06R63n78jN9n15O76j103O46Q14
$$ -570 379 938 109 1016 390 -13 -316 -42 -290 393 287 -619 344 -234 -235 -176 -691 -15 -1118 -472 342
7236C42M95j459K20O98K1j13J90m92j6J647j496N19j149Q20n26L01n66m0o5P03
$$ 342 837 -622 -402 296 317 204 394 -98 -114 1533 37 556 -593 227 -299 2 -564 -604 -669 34
7256C4k14N21P64n49j210J22m6Q01p57P17K00o06Pr3M59l28J68k98M16M47o48
$$ 34 -180 341 1105 556 -654 -532 -578 223 -534 183 383 -223 -216 -309 150 -178 -10 -308 108 555 -93
7277i3R69j232J071q46MR57j77m22p11q3l68J014k54J90k96N74n38j2N81L11l98
$$ -93 876 -356 715 -131 -127 830 653 231 -480 -563 -931 83 -171 19 -277 297 -241 -253 328 639 241
7298B41M43j078L05j00J15N39o64Q26q38m67K4k49O48L08L62n06K41P80m27K65
$$ 241 684 -394 -89 -189 -74 465 -199 627 -211 -678 -654 -903 -255 53 415 -91 150 930 503 768
7318G68o69m44M21n6O45j20j213K17n40N30J089m63L61j62K08n85J06j62R82j104
$$ 768 99 -345 76 20 665 545 -668 -451 -991 -461 628 165 526 364 572 -13 93 -69 913 -191
7338a91M73p03N44j81N40l17m77M31K36J0p90M57P1o54M80J210r13r23J136k57
$$ -191 282 -421 123 -58 482 165 -312 119 355 365 -425 32 103 -551 -71 1139 226 -697 439 182
7358A82l24O39q59Q52l57O53r47O86k28j028K0J88N02m80M70K23M33l42J88k58
$$ 182 -142 497 -362 490 133 786 -161 525 297 -731 -711 -523 -21 -501 -31 192 625 283 471 213
7378B13l33K76l6j6q1K22o40P88m73K2L36l63p94J474r9M42q88K42j91n64O21
$$ 213 -120 156 120 104 23 245 -395 393 -80 -58 278 -85 -879 595 496 938 50 292 101 -463 158
7399A58n00J129j431R70n95Q91j046J137l44L05l37m67J80k09l36k21P91j34k51
$$ 158 -342 787 -644 326 -269 622 -424 713 369 674 337 -130 50 -159 -495 -716 75 -59 -310
7418c10L06M57m76k81P11L02q92p95Q18J15k03l19P54l97o06R86M28r53M14J96
$$ -310 -4 453 -23 -304 407 709 -183 -978 -160 -45 -248 -567 187 -210 -816 170 598 -355 59 255
7438B55p23P66o73LK49J00j20K37k64K47m01P98j201R95j091O43k55L63L08m48
$$ 255 -468 298 -375 -372 -123 -23 -143 94 -170 77 -324 474 -727 268 -823 -180 -435 -72 236 -212
7458b12L12m76M48nO65n28m43R92k077J651m81j2K49j40k35M10m00L86N1k87k05
$$ -212 100 -376 72 67 732 204 -239 753 -1324 327 -154 -166 83 -57 -292 118 -282 104 155 -132 -337
7479c37m3M97M13M75j379J095q22n52P44P26j417L45r5k11J41J367r34r14K2P25
$$ -337 -380 117 530 1005 -374 721 -101 -653 91 817 -600 -255 -350 -561 -420 947 13 -901 -879 -154
7499a54L70n35k42O28l28K35K36j59r20Q25L57J77j7p69K92O02l15r9n58j03L23
$$ -154 216 -319 -561 67 -261 -26 210 51 -869 -44 313 490 473 -296 -4 598 283 184 -374 -477 -154
7520a54m8K41K12J68O87r14J9j9J41n67k69L76L53K43J40r71Q11j338J14Q64L13
$$ -154 -202 39 251 419 1106 192 211 192 333 -234 -503 -127 226 469 609 -362 449 -889 -775 89 402
7541D02k59Jr2p13P90N64O9j369J600l43m03k37L71m92N75r15P4l88J196m43m0
$$ 402 143 144 52 -661 129 693 762 -607 993 650 247 10 381 -111 464 -451 -377 -765 431 -12 -52
7562e2L63k18p84K92K51O05m36M52o51l11J524q92K54p38R32m22k05J099j181
$$ -52 311 93 -691 -399 -148 457 21 473 -178 -489 1035 143 397 -341 591 169 -36 1063 -118
7581a18N91l42m22J025n06l97M15k77J14Q2n85L97N82j01o52N73K71j401R12j30
$$ -118 473 131 -291 734 228 -169 246 -31 83 165 -420 -23 559 458 -194 379 650 -751 161 31
7601C1l94Q64J32j130m93P40M52q63Q99O68J00n97r39N81l19N23j7K21N79q32
$$ 31 -363 501 633 -497 -990 -250 202 -661 238 906 1006 409 -530 51 -268 255 238 459 1038 206
7621B06j249J103M00m93j68j60L63r2o67P02R55k32p29P6J068j126N28l07r7n0
$$ 206 -1043 60 460 -33 -201 -361 2 -90 -757 -55 900 668 -61 15 1083 -43 485 178 81 31
7641C1l41k98J30Q83j51n67P8r3L99m7K52L24M8r71N52q67M94P41o46L00l97r17
$$ 31 -310 -608 -478 405 254 -313 -235 -328 71 24 276 600 648 -323 229 -638 -144 597 -49 251 -146 -1063
7663a063J116P45j540P18M36o34r7K21L79J49r70M67n65J208j045m77K64J517
$$ -1063 53 798 -742 -24 412 -222 -319 -98 281 430 -540 -73 -638 570 -475 -952 -688 829
7681H29l19j104P89r86R38n07%l8O10O6L8n48J80L13n9l1k82j188K415j165j68
$$ 829 510 -594 195 -791 147 -360 -360 -398 212 278 316 -232 -52 261 202 171 -111 -1299 1116 -49 -217
7702b17L37m16R9j51N13N55l33k95K01O15J64o85K06j1q68K66k36J47L41J088
$$ -217 120 -296 -197 -348 165 720 387 92 293 908 1072 387 593 582 -286 -20 -256 -109 232 1320
7722A320j403L06K61n74J71o3n72L07j92L30j90J07O8R96l53k26L82j314M84L34
$$ 1320 -83 223 484 -90 81 18 -554 -247 -439 -109 -299 -192 -124 872 519 293 675 -639 -155 179
7742A79K30k15M67j198J208p33L59n86N19j015J555p6r13n1L45O53j145J026k30
$$ 179 409 194 661 -537 671 -62 297 -289 230 -785 770 694 -219 -270 75 728 -417 609 379
7761C79j40m59k10p85J739n61j24J78J70K54n69j07O85O43q91N1p46l04Q90K09
$$ 379 239 -220 -430 -1215 524 -37 -161 17 187 441 -128 -235 450 1093 202 253 -493 -797 93 302
7781C02p09jL4J44j46O09L08j242J532j02m26j820J413p39R68n84J42J265q89
$$ 302 -407 -408 -374 -230 -376 233 541 -701 831 729 303 -1517 -104 -843 125 -459 -317 948 59
7800E9n83Q38j59k66M54j219J171J61n42M9j05l48J17O71r96J548j432j6N18L13
$$ 59 -524 314 155 -111 343 -876 295 456 -86 -37 -142 -490 -373 298 -698 850 -582 -598 -80 233
7820B33r46N85p34Q10k14J138o36j98m5o89M01k91N02M4K5j76n3M46L38j016j41
$$ 233 -713 -128 -862 -52 -266 872 236 38 -7 -696 -295 -586 -84 -40 -15 -191 -244 202 540 -476 -617
7841f17k2J42L60j20L99K34j497J854o56J007j420J38N53P7n61J50N85j036O55
$$ -617 -639 -497 -137 -257 142 376 -1121 733 77 1084 -336 -198 355 432 -129 21 606 -430 225
7860B25J13j076O38J52M29l44P7M55J17q25O76p50Q3M27l07k73K56q1n57K28N43
$$ 225 338 -738 -100 52 481 137 214 669 786 -39 637 -113 -30 397 90 -183 73 -8 -565 -337 206
7881B06k02j177J027L33o79K68j21n86Q69K39L11j137N6R93k44j18J73l05L24
$$ 206 4 -1173 -146 187 -492 -224 -345 -931 -62 177 488 -649 -593 400 156 38 211 -94 230
7900B30r0p61K98P11m36l06J290o54q65R47o07M72p8j015J246m56P73l77k8o75
$$ 230 140 -621 -323 388 -48 -354 936 282 -583 364 -243 229 151 -864 382 -74 699 322 294 -381
7920c81J39K72j08p71N94l61J58m98J411j46j58N69j063K59p1n93P62m76L96N4
$$ -381 -242 30 -78 -849 -255 -616 -458 -956 455 309 151 720 -343 -84 -155 -748 14 -462 -66 -12
7940a2j85J318r84p02k13Q97l81N8j05J53O70n53k51p25J367J89p58o15M14J78
$$ -12 -197 1121 137 -565 -778 119 -262 -204 -309 -156 514 -39 -290 -1015 352 541 -217 -832 -418 -240
7960b40rP06M00m0l19o49M70k71J34o92M99k78q0n84J362m93K66J09j25n89M11
$$ -240 -249 457 857 817 498 -151 319 48 182 -510 -11 -289 -369 -953 409 -84 182 291 166 -423 -12
7981a2o8k80K96j071J250K45k42l71J472p76p76P21K60o34K49N21o83L73j175
$$ -12 -80 -360 -64 -1135 115 360 118 -253 1219 443 -333 388 648 14 263 784 101 474 -701
8000g01Q47M97p98J56N08l59q4L53j311O03J107p24P9j1M16j572Q13J38p11j5
$$ -701 146 643 -155 1 509 150 66 419 -892 -289 818 94 173 162 578 -994 -181 -43 -754 -769
8020g69k06O16O77o3K40l92j70Q08p39k73n84N01M45p67O16L00l72K04k88m69
$$ -769 -975 -359 318 255 495 103 -67 741 2 -271 -855 -354 91 -676 -60 240 -132 72 -216 -685
8040f85O58k68L55k37R4R7p11L82J128j345L29k34Q41p45m4J80l56J175j107M35
$$ -685 -27 -295 60 -177 -83 14 -697 -315 813 -532 -203 -437 404 -341 -385 -205 -561 614 -493 -58
8060e8m51R36J99o29j273J208L43l18l28M0k89K49J7N52n1L38K20r75N36K8K9
$$ -58 -509 427 626 -3 -1276 -68 275 -43 -371 -331 -620 -371 -354 198 147 485 705 -270 266 294 323
8081C23n37L27Q1j048J50K37K05l61Q43j241J403j50o93J026j219N66J48Q97j185
$$ 323 -214 113 194 -854 -704 -467 -262 -623 220 -1021 382 232 -461 565 -654 -88 60 957 -228
8100b28N60m56k96J275m18o06Q02K77j619K40M91P75n13k15k12J10m3K46K89r94
$$ -228 332 -124 -420 855 437 -169 633 910 -709 -469 22 797 284 69 -143 -33 -76 170 459 -535
8120e35N31L41k22p88M58P54p89m94O41m80K22K42P2l99l32M04L23J92j65k0l43
$$ -535 -4 337 115 -673 -215 539 -250 -744 -103 -583 -361 -119 -47 -446 -778 -374 -51 141 -24 -44 -387
8141c87J271r00l57k12L14J8M62j8k51j91k62O68r69Q97p11l8J315j448M53P03
$$ -387 884 -16 -373 -585 -271 -253 209 191 -60 -251 -513 155 -814 83 -628 -666 649 -799 -346 357
8161C57j390R35K03j06n97Q27l29k42L50n80J216n00m65J25m70K07P17k77J47
$$ 357 -1033 -98 105 -1 -598 229 -100 -342 8 -572 644 144 -321 -196 -666 -459 258 -19 128
8180A28l59L00J75N91o25l41R10l03qo41k80
$$ 128 -231 69 244 835 210 -131 779 476 468 -173 -453
8191d53
$$ Imaginary data points
##PAGE= N=2
##DATA TABLE= (X++(I..I)), XYDATA
0@%%%%%%%o4J28j28J28j28J92k56L20l84M48n76O99q27R60j088J266j459J662
$$ 0 0 0 0 0 0 0 0 -64 64 -64 64 -64 128 -128 192 -192 256 -320 379 -448 512 -576 690 -769 893
25H93j918K189k481K821l199L593m041M544n077N671o333P039p818Q686r624J0659
$$ 893 -1025 1164 -1317 1504 -1695 1898 -2143 2401 -2676 2995 -3338 3701 -4117 4569 -5055 5604
41E604j1814J3073j4471J6047j7791J9744k1986K4549k7508L1003l5167M0229
$$ 5604 -6210 6863 -7608 8439 -9352 10392 -11594 12955 -14553 16450 -18717 21512
53B1512m6586N4814o5924Q1902j06930J51983k58353R46430Q10563j893937q04600
$$ 21512 -25074 29740 -36184 45718 -61212 90771 -167582 778848 1589411 -304526 -1109126
64a109126L04162J081224Q40100k40072j493479p63561P73982J375932L93404
$$ -1109126 -804964 276260 1116360 876288 -617191 -1380752 -606770 769162 1162566
73A162566q62141j217766j47390J021462J135391m3153j194734j025205L55399
$$ 1162566 300425 -917341 -1064731 -43269 1092122 1048969 -145765 -1170970 -815571
82h15571J242574P64564n86724j308629n15381Q79716J150483K24310q69018j113236
$$ -815571 427003 1191567 604843 -703786 -1219167 -339451 811032 1035342 166324 -946912
92i46912j08721J188560J036887l68927j190015o52518M49360J122503O20045
$$ -946912 -1055633 132927 1169814 800887 -389128 -1041646 -592286 530217 1150262
101A150262p11777j255131k68866R43321J008737J5996r60499r07324J79418J100144
$$ 1150262 438485 -816646 -1085512 -142191 866546 882542 -77957 -985281 -805863 294281
111B94281P70211m23353j101138n31460N92115J035363L54506p55962j061110
$$ 294281 1064492 641139 -459999 -991459 -399344 636019 990525 234563 -826547
120h26547j32436R35053R00019r3614r71108q02462L51852J117642N17019n84424
$$ -826547 -958983 -23930 876089 782475 -188633 -991095 -639243 478399 995418 410994
130D10994r44057l74521O07006J010264J98355q81970q73582R6616Q88113P27296
$$ 410994 -533063 -907584 -300578 709686 908041 26071 -847511 -750895 137218 864514
140H64514k26250r48048o06075M29216R90225M19976o44974r32468j58080P19285
$$ 864514 638264 -309784 -915859 -486643 503582 923558 278584 -653884 -811964 -92679
150i2679Q03255M3419q10901p67929J81451R05213N88194l60882r09316m36448
$$ -92679 710576 753995 -56906 -824835 -643384 261829 850023 489141 -420175 -856623
160h56623N40527Q81333K25598o40168q03718r2333P59681P54160j41181q43440
$$ -856623 -316096 565237 790835 150667 -653051 -745384 14297 768457 627276 -216164
170b16164n64420L08653Q16209M38494m27559q29637k97553N76895P97081J03532
$$ -216164 -780584 -471931 344278 782772 355213 -474424 -771977 -195082 601999 705531
180G05531o95740o92203P2233P32583N91957k01555p91092m76781L94387Q01495
$$ 705531 9791 -682412 -610179 122404 714361 512806 -278286 -755067 -360680 440815
190D40815L00633n20590p53211j43037O13526O64662j9353o73213n90919J63496
$$ 440815 741448 220858 -532353 -675390 -61864 602798 583445 -89768 -680687 -517191
200e17191P44574M74917l18171p36313l27230M46700P19430J75511n62062o58155
$$ -517191 227383 702300 384129 -352184 -679414 -232714 486716 662227 100165 -557990
210e57990l1033O21866N76662j25464o75498m61077K55031O93330L65248l85459
$$ -557990 -589023 32843 609505 484041 -191457 -652534 -397503 295827 661075 275616
220B75616o90286j99440M96509O24629P1319n69184n82279P0779O34898M65852
$$ 275616 -414670 -614110 -117601 507028 578347 9163 -573116 -502337 132561 598413
230E98413k14848o46818l61026L35594O51187K33988m33898o08217j03146N23772
$$ 598413 383565 -263253 -624279 -288685 362502 596490 162592 -445625 -548771 -24999
240b4999N59527m1736n82708m65211J58883N98076L68696k81259o16429k57140
$$ -24999 534528 492792 -89916 -555127 -396244 201832 570528 289269 -327160 -584300
250e84300L87940N99902J38118m78095n37155J2746N33275M55742j19404n70549
$$ -584300 -196360 403542 541660 63565 -473590 -460844 72431 528173 408769 -161780
260a61780l86932K34953N80163K64683l40555n60539j54404M26156N34833M1034
$$ -161780 -548712 -313759 266404 531087 190532 -370007 -524411 -98255 436578 477612
270D77612m96410m63643R2371N32854L74300k00569n49517k84648K97457N38990
$$ 477612 -18798 -482441 -390070 142784 517084 316515 -233002 -517650 -220193 318797
280C18797J70488l83483n03931o3852M51855M59579m9311m97547l78929J62305
$$ 318797 489285 105802 -398129 -461981 -10126 449453 400142 -97405 -476334 -314029
290c14029N17207K92278k60385n19504j95298L45202M91287Q2825m14163m44954
$$ -314029 203178 495456 235071 -284433 -479731 -134529 356758 439583 25420 -419534
300d19534K4982M61616L79639j22421m85338k99829K25211M91373K07198l06502
$$ -419534 -394552 67064 446703 324282 -161056 -460885 -235674 255699 462897 156395
310A56395m78346j14342L77586M38757J843m30054l76028R7168M62904L06889
$$ 156395 -321951 -436293 -58707 380050 381893 -48161 -424189 -327021 135883 442772
320D42772j92700m67331k14506K69945M52654J27825l42341m27589l0876L97283
$$ 442772 250072 -217259 -431765 -161820 290834 418659 76318 -351271 -382147 15136
330A5136L75212o6147m29337l11730J56868M50821K30087k46017m37379j37728
$$ 15136 390348 324201 -105136 -416866 -259998 190823 420910 174893 -262486 -400214
340d00214L09845M09394N3279l63274l71300L9105M03316L08265j28191m20006
$$ -400214 -90369 319025 372304 9030 -362270 -323165 80151 388416 260225 -159781
350a59781k40463K08234M23683J60048k82690m01955o8039L36940L62450j6910
$$ -159781 -400244 -192010 231673 391721 109031 -292924 -360963 -24023 338427 321517
360C21517l77458l11420J03877L99496K41408j82137l97723j72728K48877L90079
$$ 321517 -55941 -367361 -263484 136012 377420 195283 -202440 -375168 -126291 263788
370B63788R0781l09236l56243m390L48505L10575p5085l79102k51800J58024L83485
$$ 263788 354569 45333 -310910 -315300 33205 343780 268695 -110407 -362207 -204183 179302
381A79302J78036k22782l71386j05329K80335L49531K4461l24221l07494N1422
$$ 179302 357338 134556 -236830 -342159 -61824 287707 312168 -12053 -319547 -268125
391b68125L51224K56965j26343l67930j92823J99010L63301J17347k55589l38793
$$ -268125 83099 340064 213721 -154209 -347032 -148022 215279 332626 77037 -261756
401b61756m3410L00261L04593l3729l31819k55028J04703L43907K00142j69606
$$ -261756 -305166 -4905 299688 265959 -65860 -320888 -216185 127722 327864 158258
411A58258l49103j32228K32668L31022O0654k76264l01774R270L11956K59735
$$ 158258 -190845 -323073 -90405 240617 301271 25007 -276767 -267497 44459 304194
421C04194q5881l29194k01928J48220L30351J43735k04818l21602p5172K52327
$$ 304194 218313 -110881 -312809 -164589 165762 309497 104679 -216923 -292095 -39768
431c9768K96945O582k87516k60880O0509L12680K09923j26571l16880j52312J81543
$$ -39768 257177 263759 -23757 -284637 -224128 88552 298475 171904 -144976 -297288 -115745
442a15745L11405Q9821k31531k91221k3000K68902K54210l8681k89008k17360
$$ -115745 195660 285481 53950 -237271 -260271 8631 262841 224160 -64848 -282208
452b82208J02517L05677J61523j63666k99414j01150K06377K84256M3221k49687
$$ -282208 -179691 125986 287509 123843 -175571 -276721 -70344 213912 257133 7446
462G446k56157K6411K74236K12420q2227k85707j68932J38252K89247J12983j88519
$$ 7446 -248711 -222300 51936 264356 182129 -103578 -272510 -134258 154989 267972 79453
473G9453k76528n4263K26001K54775m131k59558k18386O7951K73183J71590j19322
$$ 79453 -197075 -251338 -25337 229438 225307 -34251 -252637 -184686 88497 260087 140765
484A40765k76310j22855J67416K70020O6248k09901k46776q163K34942K18795
$$ 140765 -135545 -258400 -90984 179036 245284 35383 -211393 -219556 15386 234181
494B34181m3653k60046j79421J02940K65263J29204j48852k60595p9234J91651
$$ 234181 190528 -69518 -248939 -145999 119264 248468 99616 -160979 -240213 -48562
504d8562K45967J9872k21546k15454L0838K40348J83176q2592k53639j37350J32797
$$ -48562 197405 217277 -4269 -219723 -188885 51463 234639 152047 -101592 -238942 -106145
515a06145K50369Q8598j69804k40859l9519K07801K16865j9451k27956j82013
$$ -106145 144224 232822 63018 -177841 -217360 -9559 207306 187855 -40101 -222114
525b22114O6985K41137J42498j14187k41469r7348J55549K31758M8641j88036
$$ -222114 -155129 86008 228506 114319 -127150 -224498 -68949 162809 211450 23414
535B3414k12636K60K13966J84821n1796k28994j48042R8356K31881J07429j40115
$$ 23414 -189222 -188962 25004 209825 158029 -70965 -219007 -120651 111230 218659 78544
546G8544k27482n6954J74180K05108J3770j95271j87725L3529K19944J51524q5696
$$ 78544 -148938 -205892 -31712 173396 187166 -8105 -195830 -162301 57643 209167 123471
557A23471k21439j10600J20613K20433P1246j60825k08827j8506J86965J81784
$$ 123471 -97968 -208568 -87955 132478 203724 42899 -165928 -184434 2531 184315
567A84315k4343k01757j53822O6109K12981J18159j08221k13742p6421J42988
$$ 184315 159972 -41785 -195607 -129498 83483 201642 93421 -120321 -196742 -53754
577e3754K00927L5477j71003j84449J2651J90340J55999n2333k01781j25340R4673
$$ -53754 147173 182650 11647 -172802 -160151 30189 186188 133855 -67926 -193266 -98593
588i8593K05775Q2976j31924j93947m2300J54803J81246L272j80434j57937M3855
$$ -98593 107182 190158 58234 -135713 -178013 -23210 158036 161308 -19126 -177063 -133208
599a33208J93249J23237q0407j92852r3789J13914J94264N2178j49337j75484
$$ -133208 60041 183278 102871 -89981 -183770 -69856 124408 176586 27249 -148235
609a48235r207J64733J56571k7976j82059j28566O7985J86368R8684j00370j89542
$$ -148235 -157442 7291 163862 135886 -46173 -174739 -106754 79614 178298 77928 -111614
620a11614o1052J36135J75148J8045j56960j54037J7272J69827J32584n3472j82019
$$ -111614 -172666 -36531 138617 156662 -298 -154335 -137063 32764 165348 111876 -70143
631g0143j00976R2283J78881O5437j18800j69897l1772J42959J57896q939j62747
$$ -70143 -171119 -78836 100045 165482 46682 -123215 -154987 -12028 145868 136929 -25818
642b5818j32395M5444J70047J04741p7206j73692p1829J08326J65776L8300j30952
$$ -25818 -158213 -112769 57278 162019 84813 -88879 -160708 -52382 113394 151694 20742
653B0742j55518m001J54588J34127l6277j61278j08394O5826J66299Q1797j00166
$$ 20742 -134776 -138777 15811 149938 113661 -47617 -156011 -90185 76114 157911 57745
664E7745j63253m3973J23956J51393R379j41208j34808K5108J54399J10427n7395
$$ 57745 -105508 -149481 -25525 125868 135247 -5961 -140769 -115661 38738 149165 91770
675I1770j59003q1825Q3583J57672N4489j11972j51319j7949J31933J35514j3938
$$ 91770 -67233 -149058 -65475 92197 146686 34714 -116605 -134554 -2621 132893 118955
686A18955j47199j13073M6288J53067Q7615p5444j53628n8838J01061J46687K8940
$$ 118955 -28244 -141317 -95029 58038 145653 70209 -83419 -142257 -41196 105491 134431
697A34431j23158j35228O459J37195J15124l6761j46126r1843O7291J48227O2029
$$ 134431 11273 -123955 -117496 19699 134823 98062 -48064 -139907 -72616 75611 137640
708A37640r3239j40016l3152J09910J32270N339j28884j17280K8346J37753R4292
$$ 137640 44401 -95615 -128767 -18857 113413 118752 -10132 -127412 -99066 38687 132979
719A32979n4898j43030o9174Q2592J38793M0983j01639j32942j1658J22680J16205
$$ 132979 78081 -64949 -134123 -51531 87262 128245 26606 -106336 -117994 4686 120891
730A20891k0579j31684r5078M5804J36978P1505p1165j35273m7044R4505J29974
$$ 120891 100312 -31372 -126450 -80646 56332 127837 56672 -78601 -125645 -31140 98834
741I8834J7127j11819j15021P915J24748R9915l8257j31626p6617O3640J31516
$$ 98834 115961 4142 -110879 -102964 21784 121699 83442 -48184 -124801 -61161 70355
752G0355N2632q8213j24585k4027J02513J14779j302j15537j01455K8842J26056
$$ 70355 122987 34774 -89811 -113838 -11325 103454 102152 -13385 -114840 -85998 40058
763D0058Q1096n6378j27955n6058P7763J22862L1455r5211j15938m162J10114
$$ 40058 121154 64776 -63179 -119237 -41474 81388 112843 17632 -98306 -102468 7646
774G646R9763k1375j16771q3393M5448J24316N9931o9152j20482l7850Q8256J14363
$$ 7646 107409 86034 -30737 -114130 -68682 55634 115565 46413 -74069 -111919 -23663 90700
786I0700J2107j03778j01120J4483J11902Q3839l6968j17162o6107O1372J18451
$$ 90700 102807 -971 -102091 -87608 24294 108133 71165 -45997 -112104 -50732 67719
797F7719M2163q1883j11573j7477R5554J00923o954j05056q7517L0657J12439
$$ 67719 109882 27999 -83574 -101051 -5497 95426 88472 -16584 -104101 -73444 38995
808C8995O8325n2547j13499m7098P1762J11723K2607q9546r9461r0R8603Q8467
$$ 38995 107320 54773 -58726 -105824 -34062 77661 100268 10722 -88739 -88829 9774 98241
820I8241k3518j06834p0867M4976J10204N1177o5723j06934k9173Q1599J00801
$$ 98241 74723 -32111 -102978 -58002 52202 103379 37656 -69278 -98451 -16852 83949
831H3949N280r3931q9083J7418J02081P2762l8326j05751n4077N7664J04224L4509
$$ 83949 89229 -4702 -93785 -76367 25714 98476 60150 -45601 -99678 -42014 62210 96719
843I6719p3892r9760j2447Q8584Q9935j2693r5656p4161L0236J00846N8604n0726
$$ 96719 22827 -76933 -89380 -796 89139 76446 -19210 -93371 -63135 37711 96315 45589
855D5589j02166l8698O8845R7482J7233q0642q9839L965R1815P7186k6262r6084
$$ 45589 -56577 -95275 -26430 71052 88285 7643 -82196 -78231 13584 90770 64508 -31576
867c1576o1403M4127R7357M3333o0592r6777k2465P6585Q7274K081q4052p8423
$$ -31576 -92979 -48852 48505 91838 31246 -65531 -87996 -11411 75863 77944 -6108 -84531
879h4531J7309R4706O2275l8705r3094m7069N4377R2196K8495o8847q9148p721
$$ -84531 -67222 27484 89759 51054 -42040 -89109 -34732 57464 85959 17112 -72036 -79757
891g9757Q0991P9173j2027q8693o5177L2251R1655M6969m7072r1191l0681O2043
$$ -79757 1234 80407 68380 -20313 -85490 -53239 38416 85385 38313 -52878 -83559 -21516
903b1516Q5219J4317p5223p8869Q243Q2958O5560k4753q6218n4272M3711Q8993
$$ -21516 63703 78020 2797 -76072 -67829 15129 80689 55936 -30282 -84554 -40843 48150
915D8150L4551n7488q4494j8191O9166P8267r17p9165o7448J9810Q4130N4583
$$ 48150 82701 25213 -59281 -77472 -8306 69961 69044 -10121 -77569 -57759 26371 80954
927H0954l7744q4262l9249N1113Q4129K1203o3436p7294n082P3638O8151j2928
$$ 80954 43210 -41052 -80301 -29188 54941 76144 12708 -64586 -69668 3970 72121 59193
939E9193q0484n6880L1871Q2316M1681m5599q0712k4990N7856P7209P014o8444
$$ 59193 -21291 -78171 -46300 36016 77697 32098 -48614 -73604 -15748 61461 68475 31
951C1o8167P402P6099N8765k6047q0767m3220M1659P8506K9076n2299p5724j3622
$$ 31 -68136 -60734 15365 74130 48083 -32684 -75904 -34245 44261 73337 21038 -54686 -68308
$$ [...]
8191f6
##END NTUPLES=NMR FID
##END=
