##TITLE=1H_DE-46H_D2O
 D2O
 8 sc, 
 6.8.2024
##JCAMPDX= 6.0         $$ Bruker NMR JCAMP-DX V2.0
##DATA TYPE= NMR FID
##DATA CLASS= NTUPLES
##ORIGIN= UXNMR, Bruker Analytische Messtechnik GmbH
##OWNER= root
$$ XWIN-NMR		Version 3.5
$$ Tue Aug  6 16:30:44 2024 Russian Standard Time (UT+4h)  she@DPX200
##.OBSERVE FREQUENCY= 200.1313
##.OBSERVE NUCLEUS= ^1H
##.DELAY= (6, 6)
##.ACQUISITION MODE= SIMULTANEOUS
##.ACQUISITION SCHEME= undefined
##.AVERAGES= 8
##.DIGITISER RES= 18
##SPECTROMETER/DATA SYSTEM= spect
##.PULSE SEQUENCE= zg30
##.SOLVENT NAME= Acetone
##.SHIFT REFERENCE= (INTERNAL, Acetone, 0, 15.7039)
##AUDIT TRAIL= $$ (NUMBER, WHEN, WHO, WHERE, WHAT)
$$ ##TITLE= Audit trail, XWIN-NMR		Version 3.5
$$ ##JCAMPDX= 5.01
$$ ##ORIGIN= Bruker BioSpin GmbH
$$ ##OWNER= she
$$ F:/spectra/data/she/nmr/H-F/1/audita.txt
$$ ##AUDIT TRAIL=  $$ (NUMBER, WHEN, WHO, WHERE, WHAT)
(   1,<2024-08-06 16:29:52.31 +0400>,<she>,<DPX200>,
      <created by zg, POWCHK disabled, PULCHK disabled
       configuration hash MD5:
       00 E9 B6 7A A2 85 ED C7 34 08 36 98 17 FE 4E 26
       data hash MD5: 16K
       EF 9E 4C 4C 07 49 70 1D 16 BD 6B 68 0A 9C 7C BC>)
$$ ##END=
$$ 
$$ hash MD5
$$ 03 2A AA 60 77 97 AD AA 12 2B 14 06 ED 13 60 6B
##$RELAX= 
##$RELAX= 
##$RELAX= 
##$RELAX= 
##$RELAX= 
##$RELAX= 
$$ Bruker specific parameters
$$ --------------------------
##$DU= <F:/spectra>
##$EXPNO= 1
##$NAME= <H-F>
##$PROCNO= 1
##$TYPE= <nmr>
##$USER= <she>
##$AMP= (0..31)
100 100 100 100 100 100 100 100 100 100 100 100 100 100 100 100 100 100 
100 100 100 100 100 100 100 100 100 100 100 100 100 100 
##$AQSEQ= 0
##$AQ_mod= 1
##$AUNM= <au_zg>
##$AUTOPOS= <>
##$BF1= 200.13
##$BF2= 200.13
##$BF3= 200.13
##$BF4= 200.13
##$BF5= 200.13
##$BF6= 200.13
##$BF7= 200.13
##$BF8= 200.13
##$BYTORDA= 1
##$CFDGTYP= 0
##$CFRGTYP= 5
##$CHEMSTR= <none>
##$CNST= (0..31)
1 1 145 1 1 1 1 1 1 1 1 1 1 1 1 1 1 1 1 1 1 1 1 1 1 1 1 1 1 1 1 1 
##$CPDPRG= <>
##$CPDPRG1= <>
##$CPDPRG2= <>
##$CPDPRG3= <>
##$CPDPRG4= <mlev>
##$CPDPRG5= <mlev>
##$CPDPRG6= <mlev>
##$CPDPRG7= <mlev>
##$CPDPRG8= <mlev>
##$CPDPRGB= <>
##$CPDPRGT= <>
##$D= (0..31)
0 1.2 0 0 0 0 0 0 0 0.06 0 0.03 0 0 0 0 0.0002 0 0 0 0 0 0 0 0 0 0 0 0 
0 0 0 
##$DATE= 1722947391
##$DBL= (0..7)
120 120 120 120 120 120 120 120 
##$DBP= (0..7)
150 150 150 150 150 150 150 150 
##$DBP07= 0
##$DBPNAM0= <>
##$DBPNAM1= <>
##$DBPNAM2= <>
##$DBPNAM3= <>
##$DBPNAM4= <>
##$DBPNAM5= <>
##$DBPNAM6= <>
##$DBPNAM7= <>
##$DBPOAL= (0..7)
0.5 0.5 0.5 0.5 0.5 0.5 0.5 0.5 
##$DBPOFFS= (0..7)
0 0 0 0 0 0 0 0 
##$DE= 6
##$DECBNUC= <off>
##$DECIM= 24
##$DECNUC= <off>
##$DECSTAT= 4
##$DIGMOD= 1
##$DIGTYP= 9
##$DL= (0..7)
0 120 120 120 120 120 120 120 
##$DP= (0..7)
150 150 150 150 150 150 150 150 
##$DP07= 0
##$DPNAME0= <>
##$DPNAME1= <>
##$DPNAME2= <>
##$DPNAME3= <>
##$DPNAME4= <>
##$DPNAME5= <>
##$DPNAME6= <>
##$DPNAME7= <>
##$DPOAL= (0..7)
0.5 0.5 0.5 0.5 0.5 0.5 0.5 0.5 
##$DPOFFS= (0..7)
0 0 0 0 0 0 0 0 
##$DQDMODE= 0
##$DR= 18
##$DS= 0
##$DSLIST= <SSSSSSSSSSSSSSS>
$$ [...]
##$SUBNAM2= <"">
##$SUBNAM3= <"">
##$SUBNAM4= <"">
##$SUBNAM5= <"">
##$SUBNAM6= <"">
##$SUBNAM7= <"">
##$SUBNAM8= <"">
##$SUBNAM9= <"">
##$SW= 24.0689771365484
##$SWIBOX= (0..15)
0 0 2 0 0 0 0 0 0 0 0 0 0 0 0 0 
##$SW_h= 4816.95568400771
##$TD= 16384
##$TD0= 1
##$TE= 0
##$TE2= 300
##$TE3= 300
##$TEG= 300
##$TL= (0..7)
0 120 120 120 120 120 120 120 
##$TP= (0..7)
150 150 150 150 150 150 150 150 
##$TP07= 0
##$TPNAME0= <>
##$TPNAME1= <>
##$TPNAME2= <>
##$TPNAME3= <>
##$TPNAME4= <>
##$TPNAME5= <>
##$TPNAME6= <>
##$TPNAME7= <>
##$TPOAL= (0..7)
0.5 0.5 0.5 0.5 0.5 0.5 0.5 0.5 
##$TPOFFS= (0..7)
0 0 0 0 0 0 0 0 
##$TUNHIN= 0
##$TUNHOUT= 0
##$TUNXOUT= 0
##$USERA1= <user>
##$USERA2= <user>
##$USERA3= <user>
##$USERA4= <user>
##$USERA5= <user>
##$V9= 5
##$VALIST= <valist>
##$VCLIST= <CCCCCCCCCCCCCCC>
##$VD= 0
##$VDLIST= <DDDDDDDDDDDDDDD>
##$VPLIST= <PPPPPPPPPPPPPPP>
##$VTLIST= <TTTTTTTTTTTTTTT>
##$WBST= 1024
##$WBSW= 4
##$XGAIN= (0..3)
0 0 0 0 
##$XL= 0
##$YL= 0
##$YMAX_a= 164835
##$YMIN_a= -159432
##$ZGOPTNS= <>
##$ZL1= 120
##$ZL2= 120
##$ZL3= 120
##$ZL4= 120
##$ABSF1= 10
##$ABSF2= 0
##$ABSG= 5
##$ABSL= 3
##$ALPHA= 0
##$AQORDER= 0
##$ASSFAC= 0
##$ASSFACI= 0
##$ASSFACX= 0
##$ASSWID= 0
##$AUNMP= <proc_1d>
##$AZFE= 0.1
##$AZFW= 0.1
##$BCFW= 1
##$BC_mod= 2
##$BYTORDP= 1
##$COROFFS= 0
##$CY= 11.3945322036743
##$DATMOD= 1
##$DC= 2
##$DFILT= <>
##$DTYPP= 0
##$F1P= 15.6554695791079
##$F2P= 12.8336369535428
##$FCOR= 0.5
##$FTSIZE= 0
##$FT_mod= 4
##$GAMMA= 1
##$GB= 0.15
##$INTBC= 1
##$INTSCL= 1
##$ISEN= 128
##$LB= 0.24
##$LEV0= 0
##$LPBIN= 0
##$MAXI= 10000
##$MC2= 0
##$MEAN= 0
##$ME_mod= 0
##$MI= 1.114404
##$NCOEF= 0
##$NC_proc= 0
##$NLEV= 6
##$NOISF1= 3.799351
##$NOISF2= 2.8
##$NSP= 1
##$NTH_PI= 0
##$NZP= 0
##$OFFSET= 15.70392
##$PC= 1
##$PHC0= -25625.91
##$PHC1= -8.012508
##$PH_mod= 1
##$PKNL= yes
##$PPARMOD= 0
##$PSCAL= 0
##$PSIGN= 0
##$REVERSE= no
##$SF= 200.130013532006
##$SI= 16384
##$SIGF1= 3
##$SIGF2= 2
##$SINO= 400
##$SIOLD= 16384
##$SREGLST= <1H.CDCl3>
##$SSB= 0
##$STSI= 0
##$STSR= 0
##$SW_p= 3612.71676300578
##$SYMM= 0
##$S_DEV= 0
##$TDeff= 0
##$TDoff= 0
##$TI= <>
##$TILT= no
##$TM1= 0
##$TM2= 0
##$TOPLEV= 0
##$USERP1= <user>
##$USERP2= <user>
##$USERP3= <user>
##$USERP4= <user>
##$USERP5= <user>
##$WDW= 1
##$XDIM= 8192
##$YMAX_p= 0
##$YMIN_p= 0
$$ End of Bruker specific parameters
$$ ---------------------------------
##NTUPLES= NMR FID
##VAR_NAME=  TIME,          FID/REAL,        FID/IMAG
##SYMBOL=    X,             R,               I
##VAR_TYPE=  INDEPENDENT,   DEPENDENT,       DEPENDENT
##VAR_FORM=  AFFN,          ASDF,            ASDF
##VAR_DIM=   8192,          8192,            8192
##UNITS=     SECONDS,       ARBITRARY UNITS, ARBITRARY UNITS
##FACTOR=    0.0002076,     1,               1
##FIRST=     0,             0,               0
##LAST=      1.7004516,     0,               0
##MIN=       0,             -159432,         0
##MAX=       1.7004516,     164835,          0
$$ Real data points
##PAGE= N=1
##DATA TABLE= (X++(R..R)), XYDATA
$$ [...]
1875d44M84j58K03k8n65M93kL14J12q32M6K42K20N7k71l10N74K49R2o33k58J08
1897c07L50O12m70k11r3O0O76k85m88k22N01L55k68n24q7K20N80R5n56m32J47
1918c47M55M63o20r8k65N45k22K55m36l2L15O8k55K2L14j81L30M15r37r4J38K88
1940A21Ol34M9j64M68J41o1l23k18K28L48J12n54o7l3Q16l52j98n55J28O67K56
1962D81l23l13J6J32L15J1l97k00M59j18O5k72j44O3M69J69p89J96R5R6K09k99
1984g9M0j02n5M33j77m73J69K95j01K52n07k63N44M80j78m05P7l81P19j11k70
2005i3k12J11L56k4nm97p1O08J30j12j15m51M32P0J26j84l68K5L59J33l92j57
2027c31J96K79L43n48k52K14L02R5k91j24r3L05J87m45J81l20M70l3J88l56m61
$$ y = [-444, 40, -118, 85, 57, -508, -15, -17, 297, 409, -423, -377, -135, 85, 142, -129, -439, 135, 384, 476, -157, -415, -307, 43, 655, 185, -26, -119, -59, 617, 332, -156, -378, 123, 478, 210, -314, -401, -181, 399, 494, -62, -494, -347, 108, 571, -49, -147, -412, 133, -89, 166, -270, -302, 13, 81, -174, -152, 162, -19, 311, 726, -211, -305, -167, 121, 127, -207, -158, -322, 146, 287, 226, -97, -315, -87, 261, 373, -181, -248, -281, 535, 183, -15, -570, -442, 225, 481, 158, -155, -139, -7, 308, 319, -78, -278, 181, 63, 128, -144, -288, -225, 244, 413, -376, -180, -85, 11, 220, -79, -39, -141, -196, 237, 60, -413, -244, 51, -50, 202, -305, -568, -24, 456, 278, -127, -50, -431, 288, 177, -93, -305, -194, 162, 138, 133, -364, -435, 173, 303, 191, 76, -375, 57, 127, 253, 69, -299, -274, 85, 218, -174, -331, -135, 144, 487, -61, -313, -99, 203, 298, 7, -117, -210, 95, 282, -163, 18, -302, 168, 135, 323, -33, -494]
2048d94M01M88k3o25J75k20L48L01k42k65p1l8M88o6k94k4r0O13o0m30n2K20M53
2071D93j28n90l1K26M13k29m23J28J7K1J28l07L9p1K51M70l40o5l88Q6M06J6m21
2094b99J93k37N10k7o4k05p1K30L53l44j82m7K16K43j15j32l67K55K12j46j2k45
2116b81K83K75k84p1l5J6M3R0L1l52R3K22K75j55k98q9L20J6R1q4k09J16J48j53
2140HN1k22J20K02n5pk86j5J20n6J37k7l05M56J09Q3l25j32J08K13j90k10P4l3
2164a82L37J07j21l95J66l8M63k32l09R7j64N71j92l73N3M04J78k78j33k43J87
2185i7K29q6j44j80J80N81ol93m0p5K19K02l16j27j67R1K85l75L93n55K45M19
2207B83p2k81N1J36q9J68j89K34k6Q8l62R1k33P5J45q6K79m47L7l9M23J30k48
$$ y = [-494, -93, 395, 372, -253, -78, -298, 50, 351, 109, -156, -227, -265, 223, 157, -137, -161, -251, 362, 302, -128, -180, 40, 493, 365, -225, -256, -30, 383, 154, -269, -141, -124, -103, 25, -282, -243, -314, -63, 407, 67, 2, -386, -300, 106, 122, -299, -106, -343, 167, 140, 76, -129, -200, 30, 383, 39, -143, -190, 26, 269, 154, 22, -345, -90, 122, -24, -36, -281, 2, 277, -7, -78, -113, -97, -54, 36, 67, -285, -192, 30, 305, 150, -148, -237, 83, 99, 190, 106, -103, 13, 161, 8, 59, -163, -43, 159, 104, 97, -189, -204, -84, -140, -3, -30, -335, 121, 230, 313, -12, -144, -36, 177, -13, -223, -149, -182, 155, 262, 141, -254, -88, -126, 337, 105, -204, -107, -271, 300, 108, -265, -212, 192, 370, 92, -41, -284, -97, 132, 46, -98, -278, -98, 483, 477, 84, 44, -31, 188, 390, 74, -53, -220, -129, 156, -219, 174, -381, -136, 283, 211, -70, -19, 117, 28, 196, 7, 241, 215, 303, -59, 32, -201, -126, 19, -67, 212, -235, -198, -237, 186, 316, 68]
2230F8J90n34M66j16M5n7k10K65k32K89l05q1K46J55q3j64qj62L99R5j22m66R3
2253b29K91r5p0j59L21l6K72l21j13J05p8K07J05l76P9k46K78K50j90K3nK11J94
2276D18m48Nn6m1K69p5l71N4N41l17J14J21l09r1K60N1k15n7J13J74j61k22L9
2299b04J92N3J52k04O2k54N7J97J45l67l46O15k72L51l47P1J52Q3K41m35j86K82
2321C8m3j18J00k12K12M31l17K0k52J46k9L02j58r4j16O0K23l04oK19j53J52q3
2344A8Q3l64L28K6k10K92k67m11L58M98j1m38K73J63k01j34J78j76j16J36P8j46
2366d3JK87j1j90m3J38J47mn61L42k43J14j4J35J0L8k92J10L53m13L47j77j30
2389i9j69n9r1K85J38JL23n19L24j35m93P62j85N7k15k62K42P8j37K87l7o6p4
$$ y = [68, 258, -276, 190, 74, 119, 62, -148, 117, -115, 174, -131, -212, 34, 189, 106, -58, -66, -228, 171, 266, 144, -322, -229, 62, -33, -103, -262, 59, 23, 295, -26, -139, -34, -112, 95, 200, -176, -97, -343, -65, 185, -5, 18, 13, 224, 418, -30, -25, -81, -122, 147, 72, -299, -245, 296, -21, 93, 214, -95, -186, 74, 125, -90, -147, -34, 140, -21, -243, -204, -12, 41, 193, -11, 51, -203, -146, 51, 196, -171, -517, 98, -174, 177, -170, -99, 53, 136, 377, -58, -244, 38, -5, -123, -23, -235, -23, 408, 91, 111, -141, 5, -24, 278, 120, 26, -90, -30, 193, -111, -117, 102, -51, 101, 18, 101, -263, 65, 91, -119, 173, -94, -505, -147, 351, 340, -98, 175, 338, 137, 3, 181, 5, -111, 25, 103, -43, -42, 245, 234, 44, 1, 139, 286, 282, -279, 63, -180, -66, -80, 55, 65, 103, -189, -79, 274, -139, 208, 31, -99, -268, -327, -418, -133, 5, 6, 329, -190, 134, -1, -494, 268, 83, 140, -75, -337, -95, -17, -154, 133, 96, 30, -44]
2412d4J12k47J14J54m7q1K03j16J24j95K66l72J77J29n9j90j07J77k06K00j1J7
2434bl8n3J9N7m2j52k50O37l27P9r6RJ85L8J04K9k26O3j82J09nN5j39N5N78n97
2460i2q2J15oK27j33k61J64j37j20K50k06M2K20J38J96l05J48l00K97k18K67k61
2482e7k90M18r4j7r7Q8P5j10QK29k83J2j71K87J65k57R2K56j62L8k18j33L46j02
2506B3j48K23j19J84j42N1r6k39K32P0O8j79n5R9m1L86l53j21Q9K26l52K26j31
2529i9K9K1M2j65j38K51J09o9j8J97jl2N9o6k93J08L9P3j99K07l40M85n1j29k94
2554b74J91L53m16L68k36j07O4j63J99J44l87N6K49j22n4M37j56m41l5M64l51
2575b17J89k35p5K48L60l10J01n9r8J39j05j40L7m5J22K64k6k07M6o4j3J39q5
$$ y = [-44, 68, -179, -65, 89, 42, -39, 164, 48, 172, -23, 243, -129, 48, 177, 118, -72, -179, -2, -208, -8, -19, -2, -40, -93, -74, -17, -59, -211, -461, 176, -151, -72, -168, -159, 26, 64, 168, 197, -29, 34, -148, -39, -44, 11, -128, -73, 505, -92, -174, -59, -65, 162, 29, -232, -68, -205, -325, -75, -281, -239, -19, 119, 315, 10, 158, -142, 155, -63, 204, -57, -347, 71, -23, -40, -137, -49, 26, -84, -76, 153, -130, -118, -289, -2, 163, -94, -2, 254, 92, 130, -88, -221, 125, 23, -125, 98, -21, 163, 21, 72, -24, -263, -31, 39, 107, -72, -127, -28, -69, 317, -36, -157, -68, 158, -194, 32, -99, -70, -49, -7, -172, -310, -59, 50, -19, -37, 160, 159, 127, 186, 120, -173, -65, -26, 47, -152, 55, -285, 200, 149, 20, -274, -83, 270, -146, 222, -14, -121, -57, -220, -21, 123, -264, -208, 41, -81, -135, 302, 146, -295, -330, 134, -217, -28, -263, -338, -90, 270, -40, 61, 2, -96, 43, -62, -202, -165, -210, -88, 176, 150, -57, -11, -75, -88, 51, -34]
2598c4N2j15p4R1R8l3q4J57P0n47M44o2P8K13P4m21Q5K98k46j51M87l68K28l49
2622a09O6Q3j32J08j21J96k8j66K01n2l8k00L30P7q9j67j4n1J36K73m46R8O0J91
2646B06m20M29l52K38p2J76J09k40q5l66N44k15k17O4O2k3o5J24j93K61K16r7
2668H4j5r0j00r3L29k24q4J05J16l4%J98m17P4O8n3J61j01r5O1J42j11J26m0k57
2693b50J97J02m7l05L78j34o1o9O3J47J79k65K37l45K34N5j08J39k22J53l86L47
2715C9J57l96j8J67R3j14P5J21k33QM08m66L13k47J10Q2j20k78O04k46n6k1j69
2738a87J03j63M32j3k46j90K64L87n69j44J22J38L38k34M6k04J09k76M60k14l8
2759g9J76q8J66l01m3L05j87k51M93k45J94k86K26J95m34K23m02J90N03m93M16
$$ y = [-34, 18, -97, -171, -80, 18, -15, -99, 58, 128, -419, 25, -37, 41, 254, 328, -93, -8, 290, 44, -107, 380, 12, 240, -109, -43, 40, -92, 16, -105, 91, 63, -103, 98, 46, 8, -192, 138, 215, 126, -41, -55, -106, 30, 303, -143, -45, 15, 206, -214, 215, -137, 101, 29, 205, 314, 74, -11, -377, 167, -48, -265, -201, -139, -162, -227, -103, -296, -35, 181, 84, 69, -21, -121, -214, 115, -109, -193, -88, 28, -6, -6, 192, -225, -151, -83, -136, 25, -76, -171, -110, 32, -79, 47, 7, -250, -53, 49, 2, -303, 75, -59, -120, -189, -126, 21, 200, -65, 172, -173, 61, 116, 8, 147, -75, 78, -308, 39, 196, -200, -218, -51, 42, -72, 3, 124, -109, -101, 307, -159, 154, -93, 17, 99, -21, -299, 305, 59, 3, -18, -187, -84, -247, 185, 172, -74, -264, 0, 387, -182, -326, -204, -66, 272, 38, 84, -120, -11, -287, 173, -41, -79, 97, 9, 175, -126, -169, 136, -51, -302, 191, -54, 140, -146, 80, 275, -159, 64, -338, -148, 355, -138, 278]
2780B78O9l76Rk3K96j22l82L6K80j94M4J11m1O1O8l9m11K36L70k64J34j63j29
2803a52O09l44j34J18j08j25L00j85j94J26j13K08k3k31K48k12K19R3j17P9J74
2824B36k19L18k29j7j62K30j67K17m27L08m53M34o7l62K91J12k16K34N4j9r9l2
2846c5N2k1L3l8J72l41J15P2Qo8J19Ok30K06k29K18j34NK96o5J74k93j80J36k24
2871b46K84m7j91L16k08L28n30K81k78R0J14K50pl2j62K37l67K5J94j55P2k16
2893b48M14l00J17K1j66J01K3N2m5k19Q3M40k88K33j66L2j81M18j23j56K02J42
2915C86o18L27J19k22L57m82L3j49L42k06O5L4J8P1k14O1K98Qk69J17%j0l0l43
2939c07M65k99M49n51K37M76n64L05J57j68m5K11l4l80k54J20K64k34j33J26J63
$$ y = [278, 347, -29, -20, -43, 253, 131, -251, -215, 65, -129, -85, 26, -15, 46, 114, 75, -336, -100, 270, 6, 140, -23, -152, 457, 113, -21, 97, -11, -136, 164, -21, -215, -89, -202, 6, -17, -248, 0, -212, 7, 100, -17, 62, 236, 17, 335, 106, 89, -73, 157, -10, 207, -220, 88, -365, 69, 2, -360, -69, 43, -173, 61, 115, 96, -3, -35, 17, -4, 29, -9, 163, -178, -63, 9, 17, -51, 68, 74, -156, 50, -179, 39, -95, -90, 206, 141, 315, 22, -158, -22, -246, 38, -9, -200, 116, -92, 236, -294, -13, -291, -201, -87, 163, 156, 124, -38, 199, -168, -143, 51, -104, -32, -248, 166, -134, -17, 4, -162, -61, -38, 14, -31, -250, -167, 273, -15, 218, 52, 84, -97, 321, 198, 42, 244, 386, -232, 95, 214, -8, 349, -133, -100, -249, 93, -113, -48, -14, 4, 75, -139, -78, 220, 228, -41, 76, 76, 66, 36, -307, 158, -141, 308, -243, -6, 470, -94, 211, 368, 200, 155, 366, 332, -48, -302, -182, 82, -152, -285, -159, 4]
2960Dm2n8q2Q6L81l77l9L64j31j55J04M0L2j19j62J00M3l6qJ21l12L84K1j74j42
2985a57J48O44o93mJOP4L61l15l19J84l5J51jl4M0j31J33j38L48j32K68k98l05
3009b04M9M08r3P4m7m06M45j89Pj41J36J57L9j9m86O1J09Q8J60l8Q8p5n3j37j16
3034a83M25k75K20k04Q3k9J66l30M3J06M9P5j58j3J37j69p2J7L79m38M65l68k4
3057i8J26K0oj78L6K06j64J70k05K4m2j70L09P0N6O5k41j00N13l74R9k41K23j49
3081e1K0J22Q6m24J01o0M27j57k94K33j53j31N9K39j40J59j12K27j72j36L92o6
3103A69r8l3m55L06k01K08P4k55M69k86K19l53O96m11l33L33L5ok88L22j17L6
3125C1m96L74K75N9l23J05p8k93M28k23J91k14J93M4k91j10L94j38m9K96L4j19
$$ y = [4, -38, -96, -178, -92, 289, -88, -127, 237, 106, -49, 55, 95, 127, 8, -154, -54, -11, -47, -55, 66, -246, 138, 159, -15, -157, -9, 635, -58, -62, -61, -55, 19, 380, 65, -254, -70, -105, 46, 45, 11, 51, -80, 53, -85, 263, 131, 399, 101, -204, -155, 253, 160, 234, 187, -219, 226, 37, 44, -97, 39, 196, 235, 216, -270, -209, -100, -12, 148, 110, 198, 123, 70, -67, -183, 242, -33, 187, -17, 66, 37, 203, -127, -84, 22, 71, 146, -12, -25, 112, -57, -129, -112, 267, -171, 294, -74, -98, 28, 48, 42, -136, -100, 106, -58, 112, -93, -69, -111, -281, 28, 98, 154, 219, -22, -122, 391, 17, 116, -125, 98, -51, -31, 91, 177, -247, -146, -206, 221, 64, -230, 3, -150, -281, -222, 17, -123, 36, -76, 151, -21, -157, 235, 169, 71, 38, -417, -111, -312, -104, -30, -285, 184, -102, 117, -236, 460, 49, -284, 49, 84, 78, -210, 112, -5, 31, -465, -91, 184, 243, -80, 25, -53, -346, 82, -141, 50, -164, 29, 73, -218, -328, 66, -72, -121, 175, 209, 90]
3147I0nJ45q6k11l7J37k39J43K1o5M4J75j2M4m19L29m8J06k98J4K1J38J40M1m9
3172A19m92N65m20K97k26M10k95k19M06k37L8r2P8J46Q2K6N8n23J97K0Q3k59L48
3195A10j91K04j32l4Q2J40j37n3o3l6O9j7J94l49QL09J80k72k6L3l2M6L92n50
3219a25K55nj44J08j62L9Lj99J96j86K64%l89N41m83L73k55Q3J98j36P7l29L60
3242H4k07L23l16KN1r8N31m21Q0m3j00M3m7j3J66o6mn8K81j61j39R5K07k12K56
3267B34k35m1J81r5J81n13M27j65m1J22P3j37m3J47r6O7q9K52k61r7PK43J10m58
3291b27J86Q4j36L4n5J05k60J56r5L21j45O3j3k38L86j80M75l82J99k55L5j02
3313d4J96nj52K14k27K4j04m2K74J10j82L0o04N97o2k59K23K0j75M80l51Q0n1
$$ y = [90, 85, 230, 144, -67, -104, 33, -206, -63, -42, -107, -63, 112, 100, 144, -275, 54, 6, 112, -186, -172, -151, -13, 127, 168, 119, -373, 192, -228, 69, -157, 253, -42, -261, 145, -92, -54, -146, -68, 78, 160, 186, 244, -279, -82, -62, 21, -238, 110, -81, 123, -9, -43, 39, 179, 42, -11, -74, -110, -41, -58, 136, -213, -205, 104, 284, 12, -14, 19, -13, 33, 425, -125, 130, 125, -19, 89, -73, -34, -31, -230, -34, -220, 44, 44, -345, 196, -287, 86, -169, -86, 112, -24, 53, -276, 84, -123, 200, -116, -114, -63, -161, 370, -51, 29, -14, -114, -71, -118, -131, 35, -31, -35, -93, 188, 27, -112, -17, 190, -22, 234, -1, -42, 139, 44, 225, -288, 139, -26, -67, 55, 128, -9, -52, 95, -1, 66, -23, 229, -32, -129, -122, 121, 231, -227, -41, 43, -93, -59, -114, -9, -269, -113, -208, 113, -32, 31, 18, -220, 166, -14, 461, 79, 278, 23, 58, -44, 152, 147, -5, 209, -18, 6, -98, -140, 134, 244, 62, 92, -512, 85, 23, -236, -13, 7, -168, 312, -39, 41, -10]
3336a0J6L57m95k18K67L4J73N8J1k48Q1k47J86K28l88j60P55m85J45k72K10j53
3358a55M94k69k53O5K28K41q4k03l5J05j62J74M2k67K72q8nk6j65O5k34M60j73
3381B7k23M25J9k79K00j91J13j57N9K4J31j71N0Q2J83m19J56J1l40J79j74N95
3403C00l58J42N8l44P0J23l05L04k61M09r8Qk29J42q4M13j58n0L1j41K7jJ40O1
3427A99Qn47L06Jj58J78j12J11K11l06J58q0J33j37L31l90j75L05J11K22n62P1
3449a22QJ36l0o6K8k40L86j76j55L86k53J31J60j51j51R5m05O02k63K32k15J86
3471A23J8k81J95j72J48j44j6QL25k84J83k12L20n9m95L25j43L81l86J47L20l24
3493b3k2J77k26L92n01J19Q8lR7k52K51J57m90J58K32k01Q7k0l26J28MM48p4q3
$$ y = [-10, 6, 363, -132, -350, -83, -49, 124, 182, 193, -55, 26, -221, -35, 193, -195, -355, 400, -85, 60, -212, -2, -155, 339, 70, -183, -118, 110, 351, 267, 64, 29, 134, -28, 146, 188, -79, 193, 105, 100, 74, -91, -26, -260, 200, 27, -196, 229, 248, -31, 169, -22, 91, -66, -7, 17, 148, -23, 27, 109, 292, -127, 29, 40, -300, -121, -295, 300, -58, 84, 142, -202, -132, -9, -314, -10, -271, 138, 40, 48, -181, -39, -123, 290, 132, 82, 113, -28, -1, -2, 138, 199, 207, -340, -34, -33, -191, -13, -125, -14, 197, -109, 49, -31, 102, -35, 296, -94, -269, 36, 147, 369, -193, -122, -114, 22, -8, -74, -46, -286, 100, -76, -231, 155, -98, 33, 193, 42, -109, -14, -419, 183, -80, 152, -63, 123, 141, -140, 55, -117, 31, -113, -129, -121, 204, -80, 103, -109, 211, 152, -343, -18, -161, 220, -166, -19, 301, -23, -45, 132, -94, 298, -203, -84, 4, 1, 98, -154, 97, 254, -236, -78, 154, -47, 40, 20, -306, -178, -174, 274, 200, 117]
3517A17j04j88K92K0r6l4R4J3k47mJ81J15k30Oj00K13K40l07j00K35l12J00K90
3540A94l25L34k37p3j03R3n3J57J34q7O1j71jN3J37j05o2J6O6k45K21J0j0Q8j1
3565H1j57o0k6K5r2L04mk66J3K70n5j27J91K9l35L18q7L2K10l04Pj52K79q5N1
3590F0q0k7Q4J91j10p0k28OJ93J57p0k30J29R2m31N96k67q9J94r7k79N00J9j16
3614A27O5k38P2mJ93r5k84K93k44K01p4J4j89L38O6m65L07j15O4M7J20j19j93
3637a13K6J64j24J59j76j13M01j33r3J63m4k49j06K84n7rk0J63j15%mJ47J4j80
3661a5j1k68P4K70M4l62L33N2k61K1NJ01j08L32j37l47O8J61O9j3j75n6j3L84
3685A48k77K74n3k16q8n7L52j17j35N8j6J7K39K9L1k08k48J43K29J08m23K13J9
$$ y = [117, 13, -175, 117, 137, 41, 7, 101, 114, -133, -137, 44, 159, -71, -65, -165, 48, 288, -19, -119, 116, -196, -96, 194, -131, 203, -34, -107, -210, -117, -170, -13, 121, 34, 95, -76, -77, -24, 113, 8, -54, -38, 28, -217, 4, 14, 4, 92, 81, -76, -136, -162, -137, -229, 75, 71, -195, -182, 88, 33, -94, 97, 126, -209, 109, 22, 54, 264, -40, -33, -185, 94, 9, 60, -20, -47, 37, 228, 118, 48, -180, -174, 19, 176, 106, -124, 5, 97, -334, 262, -5, -94, 100, 3, -276, 224, 243, 127, 192, -46, 26, 22, 215, 120, -164, 129, -115, 86, 12, 26, -163, 175, 241, -224, 83, -32, 32, 79, 199, 80, -113, -87, 77, -47, 112, -64, -177, 224, 91, -2, 161, 117, -132, -238, 46, -11, -20, -40, 123, 8, 8, 4, 151, 165, -15, -26, -294, -220, 50, 94, -268, 65, 117, -144, -123, -118, -17, -125, 207, 70, -277, -209, -48, 21, 8, -167, -223, -236, 148, -129, 145, 92, -124, -212, -269, 83, -34, -169, -111, -127, -110, 129, 158, 189, -19, -267, -124, 105, 213, -210, 3, 22]
3708B2j22j63L45n16M09j40q8K99p3m8j12J80M0O4k52J5p8M66k18k32K04k31L7
3731a92K02R8j01L55j42j87q1L32l14lp7K40j02K5j33K24m77L79l0%l4J80k63
3754a01J54PJ10K4k08K32k11p2K12O7k53j3K86k98r0K97k34L8R4L2j71k00K93
3777eR1R5K62m59O0k57J95l8k99L8P1L68k16J29k15K06n7M0j88J14J60R4n88J60
3801b39K69J07J14l91L51m8k46L82m40K36J39n91M52k03K28n3k05L11l23M79m70
3822a41J06K55l57L2K23k12J11j47J23k73J83M43o07L83j40k98M45k31N5M10k62
3843A01j46j4K17m7m8r2k7KK65j29k01o1K25j03Q5K6q7n3M4J42k27o1MM71k89
3868cJ36r1k62K9L46K08k62j11J3M6j28n8L33n7r6k06P7p8J91n0L40k22n2j47
$$ y = [22, -100, -263, 82, -434, -25, -165, -253, 46, -27, -75, -187, -7, 33, 97, -155, -140, -218, 248, 30, -202, 2, -229, -192, 10, 108, 7, 362, 220, 33, -48, 284, -30, -33, -110, 130, 28, 53, -80, 144, -333, 46, 16, 16, -18, 162, -101, 53, 60, 170, 194, -14, 218, 7, -65, 147, 214, -39, -52, 234, -64, -154, 143, -91, -53, 41, 73, -98, -298, -5, 86, 181, 443, -16, 44, -213, -18, -56, -355, -317, -246, 122, -94, 35, -180, 26, -31, 9, -179, -65, 95, 189, -399, -239, 30, 137, 251, -140, 211, 163, -83, 299, -141, 95, 234, -357, 95, -108, 120, 67, -138, 173, -150, 329, -141, -35, 220, -137, -105, 118, -94, 17, -130, -7, -280, -97, 346, -261, 122, -18, -316, 129, -102, -47, 363, 101, -45, -59, 158, 111, 63, -29, -56, -54, 211, 82, -119, -180, 45, -58, 27, 53, -34, -87, -43, 99, -128, -189, -185, 286, -3, 133, 42, -220, -191, 155, 363, 101, -10, 3, 49, -79, -137, 196, 139, 43, -163, -86, -164, 27, -23, 317, 95, 43, -104]
3892a04J55p5K66q8l6q4K45o4o4k92K9n4J55k00J78J61o7n0K10o51N06K47n05
3915a82N35l84j87L77M8k73R0m3J36m25K80J00k1R1j62k04Q4J72J50j0Jk48J11
3938C6PQ9k25J7M5o9L2QJ38M7L6k72m09N08o1M2M8R6k01M3N4r0L47k04j76R2m5
3965f7Q7j26k61O60k56q0J3j3RR6J9J25m03K58J35n8q7j0j65J67k1k64K08K39
3989B05L6r0O4o2k29Q2N6k32L27l9l60L01j08J36m6L4Q0r9J95k50j25N0J96r8
4013B4k17M49k23o9j00J77p2j03oR1r6l3M55k83k05M5J37j84M90n66N9K42r7M3
4037d2J29Qk59L1J20j80M96l10NJ41J01j05l90M27k43Q0j47j14K97k20J37j36
4059a74OJ5J63J29P3l24j58L68k42N82m67P3J28O1k06j40J56J3j78K12j31L7n4
$$ y = [-104, 51, -24, 242, 154, 118, 34, 279, 215, 151, -141, -112, -166, -11, -211, -33, 128, 61, 11, 221, -430, 76, 323, -182, 353, -31, -218, 159, 207, -66, 24, -19, 117, -308, -28, 72, 51, 142, -20, -224, -140, 32, 182, 172, 173, -75, 36, 43, 132, -93, -76, -31, -100, -68, -60, 78, 125, 161, -111, -520, -12, -73, -31, 17, 113, -88, -45, 9, -81, 266, 62, -114, -22, -67, 20, -106, -367, 293, 37, -43, -30, -43, -34, 62, 81, 206, -197, 61, 196, 138, 51, 41, -124, 43, 22, -242, -34, 205, 241, 151, 215, 153, -76, 6, 62, -170, 157, 118, -242, 59, -49, 87, 41, 75, 155, 56, 251, 1, -124, -74, 122, 24, -193, 256, 33, -36, -136, 41, -31, -134, -140, -49, -145, -178, 277, -6, -211, -166, -29, -213, 277, -289, -230, 12, -85, -42, 87, 95, -164, -133, -13, -193, 303, -7, -2, 139, 240, 135, -255, 172, -71, 9, -138, -252, 45, -175, -38, -174, -168, -153, 10, 139, 212, -112, -270, 98, -144, 438, -29, 44, 172, 233, 27, -113, 43, 56, -122, 90, -41, -4, -58]
4082e8L7K46l39J58M5k4L3r0K54l53L35m38J34L9J48k51KJ24L0k29j99M01L7m06
4106c64K65J84j74J51n5l47R3J13L98j39J50k62l2k31N10k17K6M5j6N0k08o1Q1
4129d0P5l6k49L13J20k14J53j04k25N48k13M0M7k63K97k07j21j55K88J01m42J29
4151a58m9L51j85j77M87n23L62l61P3J39O6k66L27l12L90l41J11J62j12M8j63
4172a31J7K08j04kl29M20j45J29q0j56J0K26j55J52q4R4Kj94l5Q4O8K13j99NM8
4197F2k92j25L65N8j08j51K42l55L95k8m5k8L6m2j47L35m94J27L0L51k62J66L8
4220A28l72n7L70n4l1k41K16k02K72j87L9j43L11j0l2J39J5j09j96K05l3k17K5
4243a64K88J17k39j45K71j12k9j26o0K34j20k52K88Q1J58L5k28q5N8J45r3K29
$$ y = [-58, -21, 225, -114, 44, 89, 65, 98, 8, 262, -91, 244, -194, -60, -21, 127, -124, -122, 2, 32, -197, -396, 5, 42, -364, -99, 85, -89, 62, 7, -340, -247, -134, 264, 125, 275, 13, -19, -250, 260, 43, 69, 114, 98, 148, -60, -121, -40, 35, -1, -250, 63, 183, -31, 122, 18, -207, 341, 128, 168, 215, -48, 249, 42, -79, -234, 54, 155, -287, -158, -207, 144, -41, -218, 269, -254, 108, -253, -180, -41, 25, -241, 86, -226, 164, -177, -66, 96, -16, 32, -131, -114, 94, -10, -12, -341, 79, -66, 63, -17, -173, -163, 63, -92, 60, -24, 70, 72, -122, -157, -73, -5, 208, 9, 14, 62, -230, -355, 10, 68, -40, -191, 51, -304, 91, 63, 18, -10, 26, -16, -163, 172, -322, -195, -165, 186, -76, 90, 128, -244, -301, 69, 15, -16, -257, -41, -243, 29, -158, -119, -262, 49, 39, 7, 146, 161, 52, -144, 61, 28, -189, -164, 124, 241, 2, -143, 128, 16, -13, -139, -199, 35, -85, -337, -49, 32, 190, 225, -3, -88, -30, 115, 22, 251]
4265B51m39M62j77K08l16k7Pj18j08L85j54k10N05r2m6j84q6J00j58K64rj77K72
4288A53j88j56M15O0m82K56l87J51K8j8J34M2q2Nk2J18j9J72j30m0k17J25K70
4311A88m19J79K2o3L3J53o3j13L2PJ54j69k7K7K3L28m66J29K49j71pm34M12K9
4335C3k32K63J45j10J1k78N2J01L2J9j43K85J37o01M36q4p3N89o50p0K9N49m47
4358gJ93j47j2j96L81l21l8q4K60M0j14J77l56M50m14J78k9L6M3j13n9K9K25K25
4382C47n65J49J16k51K15n2J41K4j65l24M61J39o3m5k98J00J79J9mj82J66k6j33
4405e2j14J19o9K5K59l31K59l07L10j69o7R1j85L36M7o0l5Ll14K87j79N3L00j87
4429B0k77N02j36j20J41j68L9M0P3j40K52j37K30l10p4J5j07L0J85k22j47M17
$$ y = [251, -188, 274, 97, 305, -11, -38, -31, -149, -257, 128, -26, -236, 269, 177, 131, -53, -139, -39, -197, 67, 58, -119, 153, -35, -191, 224, 284, -198, 58, -329, -178, -150, -168, -34, 8, -74, -69, -91, 27, 8, 180, 50, 10, -207, -82, 188, -231, -52, -30, -93, -60, 93, 30, -83, -51, -44, 110, -59, -86, -59, -36, 292, -174, -45, 204, 33, 26, -408, 4, 33, -199, 64, 209, 99, 110, -168, -116, -15, 17, 36, -107, 178, 315, -286, 150, 66, -7, 582, -68, -138, -109, 440, -7, 186, 39, 27, -169, 212, -109, -147, -231, 29, 69, -45, 132, -224, 226, -188, -10, -39, -3, 40, -73, -132, -103, 122, 347, -218, -69, 47, -204, 11, -41, 100, 124, -41, -365, 96, 235, 172, 127, -171, -71, 108, 127, 123, -59, 107, 81, -52, -166, -47, -116, -91, 168, -163, 96, -211, 99, -70, -137, -46, -231, 105, 152, 92, 57, 60, -254, 33, -146, -93, 207, 20, -257, 245, 109, -11, 130, -38, 1, 41, 114, -26, 226, 89, 319, 9, -65, -50, -157, -127, 58, -164, -311, 106]
4451A06l82K42J99J18o12N91m45J62K12p3j27J94m07J31J40J47k96J91l82J73
4471a18J32K00l65j14O8Kj01L46k00R5J18Nl11K53q6J25J1k53L42m61M81K2l57
4494a66L11j37j96M10l94j30O56n31N1Jm5K0J21L11m17L41p7l33j04N08j46j1
4516D3k10pL2K38J34k26k66K78M26l06j43j55K85n03L36m9j13K9N08l24j19r5
4538b07K27J50j24j99K88k48k18l1N34m19L75j2j2k38P6K5J4Q3r6L3J94R0k64
4561B1L5K4J72k93J07j60O0p8M4k22M14J76j58K4j04j20J05q2j73J30rj5J79K
4585G9q9J25o6Q0k19j4J90J22m30M5K03O4l5l85J99L29q8M4k38o0J98J19k83j22
4609b32K79l51M87l60M68k56k48K16j66K38JJ89j0k91Q5m5P2k40Q6K26j60j8L9
$$ y = [106, -276, -34, 165, 283, -329, 262, -183, -21, 191, 118, -9, 185, -222, -91, 49, 196, -100, 91, -291, -118, 14, 214, -151, -265, -197, -195, -296, 50, -150, -55, 63, 68, -243, 10, -76, 49, 60, -193, 149, -312, 169, 191, -166, 145, 8, -188, 222, -172, -302, 354, -177, -126, -125, -170, -150, -29, 282, -135, 206, 129, -204, -308, 200, 54, 43, -167, -174, -142, 96, 230, 4, -262, 16, 442, 136, -7, -162, 123, -380, -44, -93, -206, -177, 331, 7, -112, -207, 20, 170, 46, -153, 135, -113, -331, -362, 172, -247, 128, 116, 104, -134, -58, -33, -19, 64, -32, 1, 195, 285, 21, 56, 80, 252, -41, 66, -94, -34, -112, -68, -290, 124, 300, 142, 166, 62, -58, 47, -35, -208, -78, -87, -102, 77, 79, -10, 115, 49, 129, -90, -104, 86, 208, -222, -177, 26, 90, 55, -330, -131, 198, 110, 154, -84, -144, 54, 173, -110, -232, 47, -304, 183, -177, 291, 35, -213, 3, -163, 75, 76, 265, 255, -36, 49, 4, 76, -164, -78, 148, -12, -30, 9]
4632IR1L8kj66r2j81M35k03L08j98J16k97J98m1K55j79k39K39k35J44K3Pm07L35
4656d2k0k54M89r1%m9Q1j19o9N5k88j37M28L95o60J79M44m32M7L51j81k17J59
4679F9j88J8j11R0P2l0K39k26L81l97k33M43j55J50j03oj36p4K79Qj0k27J24J98
4703A75m0P1k98K06J5k01r9J02J77k06J96j08J66j18j59J97O3r8j42Q7j07J13
4725hq9J46m9P6J99l40Q4J53j17j35R8m22M58kk33lQ5J3N3J07q1l57L90j3k3k60
4751b70M23l4k11J5J42K26n42R4K0L47k33N3n4J52m9j16k44K61R5j31K95m49K67
4774E7P9j03R5k10J13j8j44J16q0p2J58K20k59K13p1m4l6k78l9K52KQ2o6K82l34
4799h5l7J77N6J9j52j70QL34m1J17k36n3j4k7K2J56j94q1L49j00j09N1MJ78l25
$$ y = [9, 100, 138, 136, -30, -122, -303, 132, -71, 237, 39, 155, -142, 56, 15, 270, 91, -148, 91, -144, 0, 23, 30, -377, -42, -62, -316, 173, 82, 82, 33, 114, -5, -74, -19, -307, -444, -16, 379, -281, -102, 342, -90, -43, 308, 127, -90, 69, -119, -101, -212, -122, -50, -80, 159, -67, 314, -83, -316, 127, -28, 122, 19, 13, -123, -197, 82, 90, 80, -147, -23, 175, 135, 206, -92, 114, 129, -72, -171, -69, 108, -98, 98, -10, 156, 38, -121, 76, 139, 41, -101, -14, -121, -8, -97, 49, 0, 76, 275, -65, 19, 172, 55, -80, 18, -404, 54, 52, -181, -184, -99, -86, -33, 74, -7, -364, 26, 13, -10, -270, 153, 119, -92, -77, 65, 291, -251, -157, -137, 210, -23, 30, -24, 128, 79, -37, -281, -20, 75, -56, 239, -210, 57, 136, 33, 128, -82, 31, 13, -131, -15, -95, -167, -9, 211, -48, 165, 94, 50, 14, -264, -303, -51, -49, 33, -33, 249, -85, -122, 55, 111, 130, -22, -192, -184, 150, 109, 226, -10, -63, -77, -104, -82, 74, -120, -201, 148, 48, -61, -10, -6, 172, -153]
4824a53J24o0J52J91m26N81k94l36j5J09j62J03P6J64m2l35K23K5R9N7J02j68
4846A5rjk72R6O0K36j28j22K55l7n5l1j04Q8k72J32J97K6p8J39j30l35M27j72
4870g5N1k07O6K30k2r8jO2m9L23l75L7J38m2l4j16K95r5r9l7L8k09n9N21k21m40
4896d18M10N7mj50K1M39n31K88M5p8k35r5Q9J07J28j5rnP8J13j45j11J7QJ40J03
4922B47r4l3r5P9j94J68N2k76l6j10N21j71N8k23L88j92J57j54j20N4k10K67j74
4945i1k10L20J88m64R5R2K24q2j04K5J70j43J05k09R8O1l75L33K08l63O4P9o4
4968d3N0m1K8J44J08q1j89j27R3k34K92j50J75K16m90M73k34J35J46j72j14L2
4990A7K5Jj3l8j19M2K71k77L49r5l13K35k2k2J47m23K04J92j73j64K68J96k46
$$ y = [-153, -29, -89, 63, 254, -172, 409, 115, -221, -236, -127, -289, -186, -110, 54, 12, -323, -100, -75, 24, 81, 183, 15, 6, 5, -267, -171, -111, 125, -3, -125, 130, 93, 38, 7, -97, -9, -281, -149, 48, 74, -4, 135, 5, -330, 97, -75, -24, -231, -165, 65, 43, -55, -56, 6, -43, 280, -95, -58, 80, 38, 4, -112, 183, 88, -11, -48, -10, -219, -278, 243, 22, -418, -8, 49, 45, -105, -84, 355, -176, 112, 157, 79, -156, -251, -162, -55, 73, 58, 49, 44, 122, 235, 90, -21, -4, 4, 144, 247, 153, 120, 25, 104, -90, 78, 130, -146, -182, -292, 229, 58, 116, -107, 281, 89, 246, 92, -28, 26, -184, 83, -91, -301, 19, 207, -257, -162, -70, 154, 72, -32, -7, 163, 20, 125, -84, 14, 75, -300, 33, 241, -122, -58, 21, -43, 7, -34, -6, 138, 246, 165, -24, -151, -58, -292, 0, -150, 25, 241, -249, 224, -10, 125, 271, 99, -15, 17, 42, 43, 30, -8, -127, -85, 186, -91, 258, 163, -150, 85, 63, 41, 188, -235, -31, 161, -12, -176, 92, 288, 42]
5013D2O0j82J63j12O5j68L58j01k25J66k0j80K71kq5j77J59J26j61K71n34K61
5035ej75K93J46k78j82j9R0K33K7l32L71r7L2m7o4N4J49J17m51J72j19Q7L23o06
5059b81L05O8k75j06M24j24j21J35j35M29J9j57q7k42J51Lj05j05J97J80j90j25
5081a42L57m29M63k77j60K10j18J46N8j79j08K50r6J41k40j52J89K0q3J71J5j72
5103a36J18k49J41J70J1R2k43K50m31N50m46L42j00K8m76K48n5J79p4N3J65l2
5125A05j13j96J87k92K21P1J52j10QMk1j12m5O1K28j8l3l45j13L66m5J47q5P9
5149A01K4k06R1j05P5K3M7J15k32M0j9J81K9j99J7j14M26m03L7J44Q1K1l7j58
5173b1Q3j33L19n8j65k52J82K31r7j89L01j52r7P0j15q1J33J50k32J61N0K0m6
$$ y = [42, 102, -80, 83, -29, 36, -132, 226, 125, -100, 66, 46, -134, 137, 135, 50, -127, 32, 158, -3, 268, -266, -5, -180, 113, 259, -19, -201, -220, -130, 103, 130, -202, 169, 72, 104, 57, -7, 47, 196, 313, -138, 34, -85, 2, 325, -281, 24, 92, -183, -289, 135, 11, -110, 25, -110, 319, 338, 181, 94, -148, 3, 6, -99, -204, -7, 173, -17, -142, 215, -214, 249, -28, -188, 22, -96, 50, 108, -71, -179, 71, -25, 116, -124, -276, -87, -67, -150, 21, 36, -136, -18, -267, -126, 44, 55, 147, -96, 154, -277, 273, -173, 169, 69, 97, -379, -131, -186, -7, -81, -28, 137, 105, -8, -204, -17, -309, -88, -17, 135, 25, 33, 37, 16, -96, -141, -80, 148, 130, 97, -248, -361, 5, -40, 107, 22, 101, 125, -81, 10, -95, -20, 3, 50, 165, -67, -27, -46, 135, 164, -35, -18, -132, 294, -109, -72, 72, 153, 174, 137, -21, 62, -71, 248, 190, 25, -227, -45, 186, 89, -100, 201, 49, -48, 22, -93, -174, -41, 109, -123, 38, 88, 108, 62]
5196F2J58Lr5J52p7j38l09J09J25K56l0l90L46k92P8k10L21N9j04j76J95q8K36
5219A91j17Qj58J72M5l28l2J88K65nj00j5j35j21K08r9l08K83J38j82k52L87j19
5242h6J9q2q5J28j88N51k09k20M5K2L2K09j46j79K38j6j17k7J01l7J25J3k31J97
5266E7j82J79Q2j35J87l4J69kj85o3k56K28K9M3l8k53K67m22P8J74j44M76Q2m69
5290a32J86j15kL18m03K76l26J62K77p7k33Q4j52Q0L05n23L09R8j03m9j43K23
5312F0l4j34J47j11J13k29M10O6n9l51L5K2j26K52J07j60P9k69K74J22j51K22
5334B85n90N17k45J47j65K06k40O4J70l73K64j01J70J37k13k36J59K06n0k02k4
5355a14L36j82k44L18r4j08K72k89N2j58J66J8J59k35K79l82K56q1j17R9j11M01
$$ y = [62, 220, 223, 128, 280, 203, 65, -244, -135, -10, 246, 216, -174, 172, -120, -42, -252, 69, 128, 24, -152, 43, -45, 191, 74, 82, -76, 96, 141, -187, -219, -31, 234, 229, 129, 114, -21, -142, 66, -33, -341, -58, 80, -102, -354, 33, -86, -67, -149, -234, -106, -294, 257, 48, -172, -127, -105, -73, 136, -10, -189, 49, 33, -84, -111, -10, -47, 78, 91, -140, 57, -125, 54, 136, 1, 188, 154, 323, 321, 136, 73, -183, 45, 74, 117, 79, -174, 93, -329, -251, -77, -221, 255, 337, -132, 54, -61, -63, 255, -148, 128, -198, -36, 241, 164, -69, 15, -137, -57, 248, -275, 34, 132, 29, -20, -163, 60, 26, -108, 39, -72, 41, -188, 222, 288, 229, -122, -87, -65, -191, 61, 168, 8, 87, -182, 92, 214, 63, 285, -305, 212, -33, 114, -51, 155, -85, -21, 149, -224, 40, -61, 109, 246, 33, -203, -44, 162, 112, -90, -114, 222, 40, -204, 114, 20, -88, 184, -105, -53, -211, -45, -27, 132, -103, 176, -206, 50, -31, -148, -49, -160, 241]
5377B41l34P9m8L5J7k96L70J86n19M15l06O8K9J64jk61J28J22n7j36K38l83N5
5400a94M4L19k93P5J68m63M66j91J60j31J3J06L23n34K73l77M49l31K96l0k02
5421e4j26K07k01J6J43M8j71Q2k1r4K77J8J01m63M49k83j82J02J70j7nj22K52
5444A26l02m8J59M4K43k76M02l15J96j07m16J29K66J76l53J61K1O8m00M02m44
5465b68N32j03k10J97k53J89M4j55R0j9l17N73j03k95M6j63K28r9L9J69j63K14
5487A73m10L13p1l06K09K97l23p9j65L23j46k2L10j05l5k5J56J39j13O6l77N02
5509C11m39J95K9L38n26r4J40L68j42m98K53QP7n5J53j42N4J82j70PLj23J08K76
5533C13l89j31R1J89J0J68k93J4L94m32P6m8k4K57j67k43K40K10P9j92j72J22
$$ y = [241, -93, -14, -62, -27, -10, -306, 64, 250, -269, 146, -160, -92, -63, 101, 100, -161, -33, 89, 32, -104, 134, -249, -194, -150, 169, -124, -49, 119, -344, 122, -69, 91, -40, -27, 79, 402, -132, 141, -236, 213, -118, 178, 148, -54, -180, 27, -174, -158, -15, 33, -138, -56, -77, -171, 106, 124, 225, -238, 211, -72, -254, -152, 18, 1, -4, -126, 126, -176, -224, -65, -21, 222, -54, 348, 33, 229, 122, -294, -165, 101, 277, -76, 85, 106, 174, -226, 176, -268, 264, 161, -49, 148, -105, 84, 128, -27, 63, 44, -273, 300, 197, -98, -52, -215, 13, -86, -47, 122, -41, 173, -237, 76, 5, -301, -92, 205, -118, -197, -362, -39, -185, -207, 103, -2, -37, -62, 94, 233, 120, 186, -191, 311, -128, 67, 96, 434, -92, -186, -46, 322, 180, -318, -65, -57, 20, -35, 118, -24, 30, 212, 42, 49, 52, -71, 37, 313, -76, -207, -116, 73, 83, 251, -42, -28, 366, -66, 10, -38, -62, 195, 28, -215, 25, 235, 314, 122, -50, 72]
5555G2J91j91k5P2K8Rl84K41l1k5O1J13o3K21k59J3j76k0K27j51J92j51l1j66
5579b33K40N0Rk14L26k46N9K12j52j67m2N5n2L85m22M08l02q8J92m2j14R1k77
5602c24J72J11L1j00K76m98R8K52j11L2O0Lk94M27J2k11K02j31n0J9M8J21o1j51
5626f7RJ84l46K64J80M6n56K56O6P1j10j46K53K8l67L03q2j74Q0L9J27l29L72
5649A01n36N34l36J03J01QJ66k81J90J7k15L66J4p0m91L64q1N9o3K0j16J33ok04
5673b23K14Q0J44k61K70k56L85m91o3r9N5J19K93l87M13j94n2J5J32l72Q8m5K62
5696B7Q9j53j15OJ09r8J95J85J8k01m8j49K24R9k46K4O7lK05j13L9J9k45q9K13
5721E9J16k1P3K0n1k27K20k02n0M55o14K1J62j20J17J93p5j06n9q7J5J51J27k10
$$ y = [72, 263, 72, 47, 119, 147, 156, -228, 13, -18, -43, 18, 131, 68, 289, 30, 43, -133, -153, 74, -77, 115, -36, -67, -233, 7, 57, 66, -148, 178, -68, -9, 203, 51, -116, -158, -103, -155, 230, -192, 216, -86, -174, 18, -24, -138, -47, -324, -152, -41, -10, -110, 166, -332, -234, 18, -93, -61, -1, 2, -292, 135, 147, -64, 138, 7, -43, -24, 24, 145, 84, -67, -58, 126, -220, 44, 224, 270, -286, -30, 36, 107, -3, -149, 104, 132, -235, 68, -14, -188, -108, -69, 58, -271, 101, -435, 99, -237, -134, -33, -25, 141, -140, 50, 67, -148, 218, 232, 162, -329, 35, -46, 13, -50, -30, -146, -13, -19, -223, -9, 71, 215, -46, 224, -32, 353, -138, -201, -300, -245, -126, 167, -220, 193, -1, -53, -38, 94, -278, -190, -235, 27, 116, -37, -152, -146, -37, -135, 60, 245, 263, 62, 14, -135, 89, 188, -58, -34, 33, 30, 235, 122, 161, 180, -65, -154, 59, 175, 154, 227, 247, 196, -31, 189, -13, -63, 392, -222, -201, -39, -159, -42, 151, 76, -30, -89, -176, -161, -10, 117, -93]
5745i3L16k45R6R4j60j14K75l82j51L0M38j97J5N8J26k04O2R5o7J8l04L11l54
5768c37J68j82M74l13O49l07k4j05j8J97k50N2J24q8J9r8r2r6J60M23j91l91R4
5791a32J94K1j29l2J63j44O2q7rJ86r6j55J78K50l93K30j15j43k12L17k58N17
5813B13k32Q7J34J6j1l59J52J22j4m17L03j43j93J42J88k1M1R5k3k60N3J34Q4
5836I1o9l75J36J37J45L4k37K2K61k74J22r4J0R5L2J19r9M0k22K82j97K38j62
5859C5L3j6q2j44m7J85p5k3n8L92k27j6J34P4j60p6L66m52N7m3K19l47N03l99
5883a67K46j06o2K09j84J01r2K20j78J35J00J36k05l68J24K13j77P0j81K90p0
5904E4j82L28j87O0m0J52j92J04k62m4K23R6R7j67k3P1n0r3N2j72J05R3k2M27
$$ y = [-93, 223, -22, 74, 168, 8, -106, 169, -213, -364, -334, 104, -93, -78, -20, 106, -98, -36, 59, -8, 10, -294, 17, -337, -169, -351, 123, -190, 459, 152, 128, 23, 5, 202, -48, 4, 128, 40, 59, -39, -131, -227, -67, 356, 165, -226, -132, 62, 83, -46, -78, 85, -59, 3, -84, -93, 93, -3, -158, 20, 270, -123, 107, -8, -151, -363, -46, -304, 213, -19, 68, 202, 218, 207, -152, 0, 122, 108, -309, -6, -149, -342, -200, -12, -33, 8, 103, 80, -180, -127, 7, 91, 22, -353, -217, -80, 65, 99, -138, -116, 145, -129, -7, -101, -91, 4, 36, 155, 56, 96, -126, 156, -41, 197, 35, 68, 52, -30, -174, -221, -36, -111, -134, -192, 200, -27, -43, 91, 165, 5, -71, 295, -157, -100, -143, 76, -271, 232, -167, 79, -27, -89, 120, -64, 37, -55, 165, -13, 122, 222, 358, 153, -215, -91, 122, -55, 15, -166, 124, 54, -128, 200, 13, 73, 33, 185, -7, 97, -165, -209, 14, 110, 207, 40, 17, 88, 38, -55, -3, -175, -70, 23, 1, 428]
5928D28j71j38l56j1L99l95L53k22M7J94k57O9O6Kj95K44J20m00K32k17M13M3
5950B48k40q4J62j16K7J05l59L16j87J89Jj58N39l79m8j43K49k58K33N6j69n9
5972g5J49j57L09k62K59M3k52j36j52K23j7L53k29J10l66L87j90m14J27K79o5
5993g6k2Q8K28j96Q0q5k45J91N4p6J94J43kl77K1m0L81k57M4j2R3J49j33j43r1
6018h9p2j38K96P6n9j88j8J66K4L4P3l34L6J33K13m1N7J7l54J22j22M20n13k00
6042d61M95J2j14j45J25j85M46l30J96j2j00J65j19l10L70k01J29J36p8l9J07
6063H7N3j58K00k92J87K5m55L74J0m71N83j52K9j8J10j0k17K34k93K05k42OK4
6086a81K9J10J52n1m19J54L06j10%j1j54K88l09J76P1J34l61k8J81N4j05j09l7
$$ y = [428, 257, 119, -237, -248, 151, -244, 109, -113, -66, 128, -129, -60, 6, 8, -187, 57, 177, -223, 9, -208, 205, 248, 8, -76, 86, -30, -3, 102, -257, 59, -128, 61, 62, -96, 443, 64, 16, -127, 122, -136, 97, 153, -16, -75, 74, -83, 226, -36, 223, 266, 14, -122, -274, -51, -68, 285, 56, 166, -200, 187, -3, -417, -290, -11, -76, -98, -10, 218, 22, 102, 17, -228, -37, 17, -59, 135, 278, 276, -101, -80, -120, 261, 4, 48, 36, 129, 278, 145, 2, -89, -161, -299, -3, 73, 14, -174, -192, -26, -2, 32, 105, -229, -193, -60, 153, 112, 169, 186, -168, -46, -168, 252, -261, -461, 34, 46, -68, -213, -88, -273, 173, -157, 39, 27, -73, 92, -27, -337, 33, -168, -39, 97, 19, -20, 87, 140, -18, 182, -110, 77, 102, -353, 21, 31, -440, 143, -9, 20, 2, 112, 102, -115, 119, -174, 31, -211, -205, -181, -152, -42, 110, 59, -360, -206, 100, -10, -10, -21, -175, 113, -196, -20, 51, 185, -176, -204, -23, 31, -74, -183, -220]
6109b20L69J66k47k13J81n5k4J28K09j60l43M20j65q4K11l61k4J93j82K80M4m05
6131b82M67J72m02l51M70R5j89n7K38j58j07J80j39J97q4l03K46j44j56P5J82
6152e0o9q7K33K65k54L03l18l23M27j48O9J77j60n2k15K87j09J41l6k61J04k98
6174c74K24J5L19o9o2M2j10k2K15k34K98m27P3O2J07j55r8L91n3m9K40n9l04K90
6198B60l44K09j84k58J65Q9p0J29r7R0J52k5o7J14k10P3R2j11m5Q8l44K00j49
6221b43L94k65J36r5K38jl25K96J33j62J0JNK4j08k23K78k55J42J30N5k73J80
6244G2Q0m32K73j70K99k46K00k76K67l22N03o01L29J6K28l29M13l75J10o6J9p6
6266h4q1k9K24j45K53j81J08K77l52P5R6k42Pq6L7j3j23O3m6M16k4k44o7R0K81
$$ y = [-220, 149, 315, 68, -145, 36, -19, -43, 85, 294, 134, -209, 211, 46, -38, 173, -188, -212, -19, -201, 79, 123, -282, 185, 357, -45, -396, 74, 169, -20, -77, 161, 3, -104, 76, -63, 134, 50, -253, -7, -151, -307, -232, -50, -119, -206, 27, 292, 38, 341, 23, -300, 127, -21, 48, 225, 65, 13, -202, 85, -24, 117, 81, -180, -76, -374, -150, -135, 184, 115, 53, 95, -15, -37, 178, -56, 242, -185, -112, -50, 57, -98, -196, 195, 142, 93, 333, 274, -30, 260, -84, 125, -59, -317, -152, -63, -133, -4, -101, -11, 141, 116, 49, 163, -47, 26, 118, 7, -38, 50, -294, -94, -243, 151, -114, 22, -73, 165, 164, -161, 135, 268, 106, 116, 117, 122, 146, 38, -185, 93, -162, -20, 110, 165, -108, 72, 152, -280, -7, -177, 122, -124, 76, -200, 67, -255, 248, -353, -24, -8, 220, -109, 304, -71, 39, -27, -8, -84, -165, -194, 30, -115, 138, -43, 65, 342, -10, 65, 161, -81, -74, -160, -123, -136, -259, -196, -242, 174, 150, -94, -161, -71, 210]
6291B10mk94J3NKK63k44M0j65R9J67J12l72Q6P4j4j75K43J30j25L57p49M33j66
6315g4J76m6j28j42J50k4p2L81l38n1R0J9O0o3J38j17M99m29J31l24J00K25m15
6338b54j70N31K4l26J71L63k68k81N5M4K71j92J6J10m31N94l43K59j08o6N8k8
6360B9j10q7O8N1J96j26J07o2o0Q7K79m08R3J15k83l0L16k83J70k01mJ61j45q9
6384b16M07m61J80j4L47l22J53m20L12J90k91k1L6M52o93L77j04j84L26m5j73
6405a64K86N8K03m43o2L02J0L8P8m45o9K66J52op6q2j96J42M72q38J76k9K08J21
6429A02k28K91k11L2m0r5j70Q6Q1J50mk44L67m11j1L66k63J97M9K36m00J89J18
6452A87k91M4o3j05N56k87K6m50K19K17j38K07O1l11J93o0j64m8M16k92q0l9K41
$$ y = [210, 206, -88, -75, -70, -68, 195, -49, -9, -174, -75, 92, 204, -168, -82, -8, -22, -197, 46, 176, 51, 408, -341, 92, -74, 102, 56, -72, -214, -64, -88, -160, 221, -117, -168, -78, -59, 1, -62, 76, -41, 458, 29, 160, -164, -64, 161, -254, -424, 107, 131, -195, -24, 339, 71, -210, -155, -111, 160, -32, -16, 94, -337, 257, -86, 173, 65, -1, 57, 29, -81, -168, -100, -49, 147, 21, 128, 66, 6, 93, 372, -36, 57, 172, -111, -141, 175, -108, 62, -139, -143, 18, -127, -216, 191, -270, -90, -104, 243, -79, 74, -346, -34, 156, -135, -156, -120, 332, -361, 16, -88, -272, 54, 9, -164, 122, 180, 383, -60, -122, 180, 190, 228, 306, -139, -208, 58, 210, 204, 128, 46, -150, -8, 464, -374, -198, -227, -19, 102, -126, 165, -46, -14, -54, -149, -319, -233, -152, -2, -6, -250, 117, -294, -305, 61, -202, -5, 44, 280, -120, 69, 187, -104, -60, -123, -228, 328, 41, 67, -383, -164, 53, -85, 122, 183, -128, 65, 5, -159, -207, 209, -83, -163, -202, 39]
6475C9P3j53L1j39L55l29n1K18k79J32J63J9j81M5q0L06K7l61J23L4j20k97N48
6498A23j37N2q2K02k31Q2JJ36j84L59j43k2j20l7l5j6n5K74p8k24K65k13J31k49
6522b01N8L15l44L61l9k27J18N4k6M39p39L28J26k58m5Q5k56J88j2j1Q7k58L73
6545A16J24l95L9J08k49P5M06k86L67m82K75k2k63K27K6j4j14K40l06k0L42k97
6567a03NN1J89j55J8Q4Q4l82N06m5k77m2j49N37l48j17J46K0K80n28K51k6K12
6590B11j82nK14k48J19p9m0k08K79J16k96K54l1j23P8j77M59m41K55r8k45L30
6612A42l80o5M26J06k3j96J84k51l6k23N77l75j71L19m11N54k98j35J49K56M5
6633A94mmJ39k72k30M48j47Q5j51j30j55M36o2j98M7j92K20k56K41j92K89k8j48
$$ y = [39, 112, -41, -10, -149, 206, -123, -174, 44, -235, -103, 60, 79, -102, -57, -137, 169, 196, -165, -42, -8, -128, -425, 123, -14, 38, -44, 158, -73, 9, 10, 146, -38, 321, 178, 156, 36, -1, -36, -52, -107, 167, 89, -135, 130, -83, 48, -201, -143, 172, -172, 189, 150, -77, 41, 95, 69, 508, -231, 97, 223, -35, -80, 5, -251, -63, -75, -86, 1, -257, 116, 240, -155, -116, -8, -257, -182, 224, -62, 305, -177, 98, 76, -187, 40, 66, 52, -62, 178, -128, -148, 194, -103, -98, -47, 142, -13, 5, 89, 173, -209, 297, 252, -25, -67, -216, 321, -27, -144, 2, 22, 302, -226, 25, -1, 211, 29, 24, 238, -10, 109, 30, -10, -218, 61, 177, -119, 135, 104, -19, 59, -118, 341, -100, 155, 57, -188, 142, -238, -303, 123, 229, 206, 10, 194, -57, -93, -316, 261, -114, -285, 34, -377, 177, -121, -256, -107, 149, 194, 190, 186, 325, 53, -177, 271, 124, 209, 58, -72, -227, 209, 147, -51, -4, -196, 24, -232, 9, -183, 106, 78, -70]
6656g0j33L19j51k11J96J54j95k05M73k99L19k56j41Q7J14J62J49m60L23j60R3
6677A08j78j82K12j8L74k61l13L72K08k36j84o9K89l38M34l94j7Q9j37M08k44
6698g7O4j17P6K57l17K99k27N1j49o3J86j54J47j75K21ml9K01K07l41j00J55j58
6721e7q7k9m5K11J41j21j51M8M2q6j03M46l65L85n76L67J27j98L20l17J78J27
6743B57l19l5O4j60L66j74j72J18oQ4j40J10o0n6K03o5J43m46L39j77j87K24O2
6766b7m2j80J5K7M16J2j01k47J15j57o7J94K69l17K54m52L96m1j10K32k89K8o6
6789a38K5K65k30j00M85n30M01n8L9j48Q9k7r9N5m6K51l37K23j58j79J78j15J47
6812gj52mmJ58k72L60k67K52j04j3O6l73L64N5o1J16q5J57n0k62L70l02j36L15
$$ y = [-70, -203, 116, -35, -246, -50, 104, -91, -296, 177, -122, 197, -59, -200, -113, 1, 163, 312, -148, 175, 15, 108, -70, -252, -40, -58, 316, 55, -258, 114, 322, 86, -98, -167, 122, -216, 218, -176, -193, -104, -241, 167, -77, -13, -130, -54, 203, -114, 185, -42, 9, -140, -203, -17, -171, -24, -199, 22, 18, -21, 180, 387, 46, -54, 101, -57, -144, -173, -218, -7, 134, 13, -138, -90, -48, -134, -237, 209, -156, 229, -347, 20, 147, -51, 269, -48, 130, 257, -62, -97, -33, -193, 173, -1, -173, -55, -61, 23, -117, -7, -67, -123, 80, 15, 158, -288, 51, -126, -313, -89, -27, -69, -249, -234, -207, 209, 221, 120, -127, -12, -169, -236, -42, 227, -90, 164, -288, 108, 67, -43, 189, -100, -72, -138, -113, 152, -78, -178, 307, -223, 178, 120, 159, 11, 100, 73, -26, 29, -17, 234, -103, 120, -38, -217, -39, -154, -7, -159, -163, -167, -9, -281, 79, -188, 64, -40, -53, 13, -360, 4, 59, -2, 114, 29, 186, 136, -126, 244, -58, -194, 121]
6836A21K47o8j45n0r7P0l8l69M43m05J05K00l06N06j64K8r5J16q4j21J43k50N2
6859a61K86r3J48l81M89k74Nj19j96L41J19k81M70m58j84M76k9l56J62k03J69
6880g0J48Q4j00k28J45j86L59k07nL79l10m06M38k4j13R0K3J18j48J18J55m37
6902a77J03j80J27o5K80K10n76M73l46O6K7J45k00j2K83l41J68Q0L13o59N62j51
6924A30l72J06m0J08K62j89j18J40j90K76L6j23k75L03L12r7m10J41Q4m9q9n6
6946a10K9L5j16J43P3K44j80k56K04J28j96o0M8j23J18P9j47Q2j82L25j84L14
6968B68l18k3j8K8K44j21j41m43N27J41j83J51J53j13k14M8j51Q9J24j14r8L23
6990A59k99M8L8j75J46l37J05j69P02l28J38O2j80J85n05N94j63M1K11m64J36
$$ y = [121, 368, 300, 155, 105, 8, 78, 40, -329, 114, -291, -186, 14, -292, 214, 50, 78, -17, 99, 15, -106, 37, -213, -161, 125, 32, 180, -201, 288, 14, 19, -100, -296, 45, 164, -117, 353, -105, -289, 187, 158, -198, -36, -239, -70, 78, 162, 62, -166, -21, -207, 152, -55, -60, 319, 9, -397, 41, 17, -96, -6, 17, 135, -13, 105, 260, -177, -74, -254, -127, -192, 88, 298, -278, 195, -151, -85, -58, 87, -113, -125, 158, -183, -15, 65, 378, -281, 281, 130, -242, -136, -176, -68, 194, 5, -113, 27, -163, 113, 149, 26, -249, 54, 366, 269, -141, 0, 84, 35, -54, -110, -81, -46, -162, -19, 54, 298, 118, -138, 66, 194, -2, -62, -14, -137, -19, 60, -87, -5, -187, 138, -46, 268, -50, -73, -91, -63, 181, 60, -81, -524, 3, 144, -39, 112, 265, 152, -62, -14, -165, -76, 48, -66, -164, 159, -140, -92, -54, -229, -83, -420, -315, -484, 218, -110, 28, 90, -90, 95, -410, 184, 21, 62, 273, -191, -55]
7011e5Q9J96j25o1k04O4k3L64n33L22J20o7j49mp8K31k64L1K51l8J37j01P1l56
7035a82J40J93l95L66K77k38j7jj98OL2l73L47j74M67p8l09L97j26k32J0J55p7
7058a0O7j4q4J44k13N3K91j96N7q0k65L52R3p2J34m38K53l47L92j46N7n19N36
7081D5p9j1J70j47L7o0p8K9q4K46l8o5j03Q5kK38j04q9m3J20j67L10j68J93j8
7106B17k08j6j52K77KO9j32J21j7j57J75j64r8J14j15K43P9n98J08K34J83q3j78
7129i6K77k41o4j64L35j59J16J39Q7j97J52k03o3J75n8k85L9Q7J44m45M72l36
7151b88K54j86K29J21k89J6K79p1J90l39J57m5k16J71L81m21QK77Jj80O6N0p0
7174I5J12k74m5k9O5k27M47j42O7ol39K50qJ48j87K49Q8m7j79J4j29K48r5L7j6
$$ y = [-55, 34, 230, 105, 44, -160, -96, -119, 245, -288, 34, 154, 87, -62, -66, -144, 87, -177, -146, 105, 67, 204, 103, 174, -182, -42, 151, -244, 122, 399, 161, 144, 143, -55, -49, -17, -390, -43, -217, 250, 172, -137, 260, 134, -98, -88, 67, -10, 57, 43, -41, 103, -110, -57, 234, 38, 95, 15, -250, 102, 195, 123, 257, -181, 72, -275, 117, -29, 28, -491, 45, -34, -45, 125, -22, 15, -45, -123, -94, -178, 68, 30, -35, -138, -53, -55, 183, 79, -10, -53, 67, -100, 210, 42, 235, 217, 9, -7, -159, 118, 120, 189, 57, 178, 161, 4, 179, 15, -83, 31, -84, 159, 238, -360, -252, -18, 165, 82, -96, 181, -60, -124, -288, 47, -112, 4, 143, 230, 33, 185, -18, -81, 94, 36, -249, -210, -123, 21, -424, 48, -288, -34, -220, 9, 130, -159, -143, 136, 65, 255, -84, 73, 28, -188, -17, 364, -57, -49, 228, 229, 49, 115, 165, 95, 207, -67, -112, -141, -76, -303, 144, 2, 69, 63, -276, -26, -34, 114, -73, 176, 264, 217, 38, 52, -77, 171, 76, 113, 97]
7199I7k32K30k23K60k80P3J53k50J07L01j44j92O5K57k47j02K62o0k48M0k90N13
7221I0l60J86Q5K29J4l03K72l46L5M8M7K13j81n1q8l6j35M30l05j6L11m25L87
7244A01J10l94L51k90pj07J26J67O3j3l65L28k74O2M0P1J34o0m6P6N4Qk21K20
7268A34q2j33J00k36M91k50L35m97L33k44l9j1L14l69K18O6J27j69j95J47j4%
7290B6j44m7M54j58nn5m90K57M7R5o7M21n53K82r3K87j49n2L21k24l17J87j9m7
7314d3JQ9k80M6N5J49j63j62L85j78J55P9l94J92J76l24K28K07j24l07L47Q5j64
7337E5q0J02J55m28L2K92l18J07K13j03j2L31n99K82K38n93M51l41N75j25m05
7358a71j7K84J21j54k65M83k83J13JR7r4l16K01j1K15j52N7p6k03p3J25n9J61
$$ y = [97, -135, 95, -128, 132, -148, -75, 78, -172, -65, 236, 92, -100, -35, 222, -25, -127, 135, 75, -173, -133, -423, 90, -270, -84, 1, 230, 244, -59, 213, -133, -98, -50, -3, 210, 29, -22, -110, -146, -281, 149, -156, -172, 139, -286, 101, 211, -183, 168, -122, -129, -236, -110, 57, 120, 107, -258, 70, -204, -142, -102, -31, 103, 43, -3, 73, 127, 135, -86, 134, 52, -81, 19, -217, 274, 24, 359, -138, 195, -49, -88, -99, 215, -154, 64, 130, 257, 88, -107, 40, 26, 26, -118, -165, 289, 131, 126, 71, -419, -162, -115, -20, -87, 334, -219, 63, -30, 257, 108, 56, 377, 153, -164, 23, 4, -43, -42, 47, -233, -187, -132, 17, -146, -308, 77, -101, 54, 133, -261, -69, 107, -217, 11, 218, 94, -213, 134, 219, 55, -25, 77, 232, -196, -164, 128, -190, -83, 130, 27, 15, 346, -253, 29, 267, -326, 125, -216, 359, 234, -171, -188, 96, 217, 63, -202, 281, -2, 111, 112, 209, 115, -201, 0, -11, 204, 52, 109, 33, -170, -243, -118, -177, -16]
7381a6O0K46l75J27j39Q7n0j36K0Q1J84N0k48k02K98O9q5J62l72O08k75j18k2
7404d6Jj46J15Q3j80N2O4j84L65J65j04k36Ok2lJ08j41J91p4p3K24O9r2m25K38
7429d5K2k97L31J19l0m90O99l96O2J01j65J4j6l8K13Pk67L7N4L4J62j90L6r6J79
7454D0n5J13k38N6L93l74L11k27k1j36Q9J7P8j37Q9j48J6J33J70P5K2j08n6j1
7478I1k28J25O1R6J85o62K94l3k7J04r7l5M03k03k29L0K38j49P8k91J76L7k8J13
7502D9lJ78l94P8M26m22N4j36J95J78O7k85L0k95L14N3j24l31M84k13L40l0j62
7525E1o8j68K53k67J19L74l56k23K66j11J91J80J7j88k70R2M00P5k58pj49J20
7547G3k22K37j27J66J24l30Q5j23L63l49L00o6j05M3j49q5n3K32n4L5n4J18j39
$$ y = [-16, 44, 290, -85, 42, -97, -10, -60, -196, -176, -95, 89, 139, -109, -311, -13, 56, -29, 133, -239, 369, 94, -24, -46, -45, -191, -76, 7, -173, -121, -57, -241, 124, 289, 185, -51, -45, -67, -70, 38, -103, 88, 14, -59, 165, 234, 142, -283, -45, -23, -320, 11, 130, 100, -390, 309, -87, -25, 76, -89, -75, -91, -129, 84, 91, -176, -139, -85, -51, 111, -79, -43, -139, 40, -15, 98, -140, -84, 309, -65, 246, 19, -2, -138, -49, -32, 46, -91, -2, -150, -134, -1, 169, 244, 266, 158, 102, 91, -137, -12, 49, 145, 330, -332, -38, -71, -98, 6, -91, -126, 277, 74, -155, -125, 113, -36, 42, -249, -73, -36, -64, 49, 46, 224, -170, -92, 334, -88, -34, -170, 25, 203, 270, -15, 15, -280, 34, 87, -37, -368, 116, -97, 243, 213, 51, -17, -185, 68, -199, -80, 294, -62, -285, -19, -130, 61, 241, 258, 70, -200, -108, 292, 367, 109, 102, -47, 73, -149, 88, -39, 127, 251, -79, 6, -117, 246, -103, 197, 131, 26, 69, -80, -165, -218, 14, -40, -5, -59, 59, -80]
7570h0Q3P7j31m5K3K84l48K73j75k18J34O8J3k02J50K3J40n32M00j8K10l30K21
7593B0J52k09J69k51J83k2m1P6l92M65K5k38j33N22n59K03K6j60O8L2j11N7R3
7616b5R7k12J0J68k66M6L41l18J35K6J78n6j77m3j40J99J65J95o02N67m96P5K20
7639H7j13j0M19n18k53L37p5j7O6K33j64J66q9R7K3k31j07J12P3P7k13K93j83
7662A0R3l6L3k79j27N04l71R1J95j6qk61J02J36j10r6J56j90L57k73L05k93J04
7685B6M6Q3L8j61n09M17K8K16n05L24R3K7j91J59k78L00j22k38J60J26J54j57
7707C6j54K85j09j15O3M8J67m33K31P9j64Q4j14L7J49p0J33o3k32M47k71M5j41
7730f2L10q2n2k41j3L4L5K29m18M86k24p4J67j79K40j89qn4J73m9l20L73j14r9
$$ y = [-80, 3, 80, -51, -96, -73, 211, -137, 136, -39, -257, -123, -55, -42, -244, -94, -71, 69, -463, -63, -81, 129, -201, 20, 172, -37, 132, -119, 64, 42, 1, 77, -315, 150, 175, -63, -196, 326, -233, -30, -4, -164, -96, -64, -175, -118, -25, 72, -140, -130, 38, -228, -182, 159, -159, -24, 2, 180, 124, -53, -96, -236, -37, 128, 323, -279, 288, -208, -133, 87, -26, -36, 383, -135, -388, -51, -126, -143, -77, 156, -8, 158, 69, 166, 189, -42, -149, -37, 36, 113, -100, 193, 10, 103, 67, 100, -179, -306, 198, -173, -82, 113, 97, 89, -172, -70, 66, -44, -140, 16, -174, 183, -90, 215, -78, 26, 72, 155, 193, 32, -477, -60, -32, 184, -321, 3, 96, 123, -68, 91, -187, 113, -9, -247, -87, 39, 193, 36, -118, 167, 58, -57, 6, 54, 221, -212, 19, 98, -66, 18, -96, -59, 90, 20, 153, 90, -142, 305, 34, 79, -62, 248, 166, 114, -127, -140, -106, -71, 158, -260, 226, 2, -72, 95, -84, 156, -33, -41, -95, 78, 29, -291, 82, -32, -131]
7754a31R0J26j24K39l9j82KL29m03L23m05J51Q0kj26j87LN46j80o5M8M0j38j94
7778a99K89j18p7Q1R2j74J36MJ4n3K45k63j78L70k11P0oL73n86J5M35n17K29J81
7802A52J7j89j43J48N1O7m6j58L03n08L32lj58J60l8Lo5J9J21o2O1pp7K68n19
7827b71J40Qk30oL01j59J50J78j20j12L30l41K09K8j05NL0k85N29n25K33Lp7J11
7851B4mk39N50k51L6N6j99J22J5k56J60L7J95j35j92l0K29j53L8L5j68K02k26
7874a54J71K47j66Q2l5l59K75oJ6p8lk17K28K84j77k75K36k07Q5J87j14K4J56
7897B00j90K6O2Q2n7Lk50Q1K35k77J22k0Q1j73J16P6k87K9R8K45j22K5j61L2n6
7922h0l93L19L10q9J69k21J65l7j49j30K86j36m3J40p4j78K79j04l58K02N42k43
$$ y = [-131, -41, 85, -39, 200, 161, -21, -19, 310, -93, 230, -175, -24, 56, 54, -72, -259, -256, 290, 110, 45, 93, 133, -5, -199, 90, -28, -105, -24, 68, -106, 30, 34, 48, -5, 240, -23, -201, 169, -42, 28, 22, 395, -191, -176, 259, -258, -29, 152, 169, -20, -163, -15, 36, 103, 57, -101, 202, -306, 26, 23, -135, 25, -13, -10, -75, -56, 65, 3, 64, 57, -20, 248, -271, -131, -123, -353, -359, -58, -217, -67, 111, -9, -121, 209, -132, 77, 105, 0, 5, 35, -250, 279, -246, -13, -10, -87, 24, 20, -219, 331, 80, 116, 172, -27, 95, 110, -146, 14, 51, 246, 111, -81, -111, 118, -35, 3, 38, -130, 72, -154, 17, 264, 98, 180, 145, -214, 61, 55, 71, -7, -10, -227, 1, 285, 108, -167, 69, -138, -53, 134, 20, 44, 200, 10, 36, 98, 180, 123, 126, -124, -43, 192, -85, 37, 17, 98, -75, 41, 117, -170, -141, -43, 202, 80, 105, -56, -24, -80, -473, -154, 156, 67, 236, 15, 180, 143, -6, -136, 150, 14, -29, 111, 37, -141, 138, 34, -324, -122, 420, 177]
7944A77l00K75k40M1L93l20m32K82j35K12J3j13K53j57O1q8K1J57k58K97k55L32
7966B16k34K18r3j1m8j67J67l2j32p6m6K18j3Q4k39K37P3j77j61M29l70J07J8
7989c2j05j7p8L82k9k19L28l06J67pj27L17j25q9j75K3Ok37N30j96K19rm7l1j03
8014D0k6j85J0l03N93j59J79N9k28pK11j46p9J19r6J82k52Q7q4K54l11l6j31L02
8038gj38j65P59l97r8MP6k73P6J69Q3j32k64J66J24RJ24p0M4q7J8J27n04J59K11
8063A4K40k39j82j11L70j41m1K2j18L66j36k55J59K26q6q0o7k78L45J45j24k02
8085a73K50rk64J42J9J25j76J50M9n0j07r3J3K21k90L76j95n1J31j95J92K04j79
8108I0o2k32K13Ql00J28P0K78k43m1R9j73K30K54k16k16K16K43m01r9m2K05M81
$$ y = [177, -123, 152, -88, -47, 346, 26, -406, -124, -259, -47, -34, -147, 106, -51, 10, -78, -57, 100, -158, 139, -116, 216, -18, 200, 107, 96, 48, -119, 48, 16, -116, -192, -238, -20, -33, 51, -188, 49, 122, -55, -216, 213, -157, -50, -32, -137, -154, -232, 150, 121, -98, 230, -76, 91, 84, -43, 274, 149, 60, -115, -92, -86, -323, 207, 11, 230, 221, 174, 143, 40, 14, -171, -161, -464, 129, -30, 149, 208, -20, -27, 184, 38, -41, 78, -18, 164, -88, -1, -85, 169, -142, -178, -309, -7, -145, -310, 449, 52, -46, -42, 34, -239, -163, 6, 89, -43, -307, -141, -17, -8, 116, 46, 90, 3, 21, 148, -356, -197, 14, 254, 15, -167, -278, 92, -49, -90, -68, -186, 180, 44, -211, -52, 174, 88, 8, -59, -337, 8, 153, 29, -173, 77, 68, -196, -54, -35, 90, -86, 64, 113, 63, -44, -137, -124, 97, -193, 183, -12, -63, 68, -127, 65, 269, 90, 28, -204, 9, 17, -283, -155, -85, 193, -50, -91, 8, -165, 65, 319, 103, -113, 103, 346, -55, -154, -196, 9, 490]
8131D90l41k35K35l7j62K9J34j2j29o9K51k4k12K75k28j07K40j72j61K40r8J48
8153E5j70J83l61O45l07j58K23J09j45J01l83R5k9QO5l7j4o7J72j55M86l80j09
8176a73Q8K60l39j04L22%j26J17K14r7q3j43P6j37R1
$$ y = [490, 149, -86, 149, 112, -50, -21, 113, 101, -28, -97, 154, 130, -82, 193, -35, -142, 98, -74, -235, 5, -93, 55, -115, 68, -293, 352, 45, -113, 110, 219, 74, 175, -208, -113, -142, -134, -69, -106, -120, -187, -15, -170, 316, -64, -173, -85, 175, -164, -268, 54, 54, -72, 45, 259, 162, 79, -64, 12, -125, -34]
8191c4
$$ Imaginary data points
##PAGE= N=2
##DATA TABLE= (X++(I..I)), XYDATA
0@%%%%%%%qJ6j6K4l2L2m0N6o4P2q8J04j23J47j71J96k30K69l05L46l94M46n06
30b69N74o46P23q09R04j008J122j247J383j535J701j880K082k308K556k834L147
47A656l500L905m378M930n585O387p387Q675j0408J2879j6715K3524l9200J40613
61A15396K8268k83196J9797J10836R0000K6693r3264j73962O6323K00198K9042
72A36131j45536r0667J3608J10829R8007n5681j58954k9014J22686J12033k5020
83H8422j33126q8235R5142J46891p852j29332q1412L6138J34248P4099j19427
94A5556j46254N3178J41060L6145o7082j00361l8722J06257J18441n3041j34736
105f9559k7298Q3952R1688O755j02127r0960N3116J24696K6352r3428r5897J6987
$$ y = [0, 0, 0, 0, 0, 0, 0, 0, -8, 8, -8, 16, -16, 16, -24, 32, -32, 40, -48, 56, -67, 80, -91, 105, -125, 144, -161, 185, -209, 237, -269, 305, -341, 382, -427, 477, -531, 591, -656, 727, -808, 893, -987, 1095, -1213, 1343, -1491, 1656, -1844, 2061, -2317, 2613, -2972, 3415, -3972, 4703, -5705, 7174, -9541, 13983, -25217, 115396, 143664, -139532, -119735, -8899, 81101, 107794, 14530, -159432, -93109, 107089, 136131, -9405, -100072, -86464, 24365, 122372, 66691, -92263, -121277, 1409, 113442, 88422, -44704, -132939, -37797, 109094, 101242, -28090, -109502, -73364, 60884, 134983, 15556, -130698, -77520, 63540, 99685, 32603, -67758, -106480, -223, 118218, 65177, -69559, -96857, -12905, 78783, 85538, -16589, -107549, -54433, 70263, 96615, 3187, -92710, -75723]
117g5723J18073O6322q0412j10699K212R3012P7906k7408j21232n0338J06919
128a368R8285m1221r0813l9999L3561R5336M0939r7834r5488M8623J01733K4136
140G5890n6561p8691j7186Q6034Q4520m5996j11083j9560Q4555P2682j7538q6505
152b9439n4397N4165R5073Q546q6548o7809L4681R3094L0160p0649p4076J2337
164e4862P5514N2583l5798q9326k3160P9179O8740k8698p8354l4662M7458P7768
176E6382Q924p8176o1902L7302Q3870K0850o3839o5809J2949P4567M4087m3589
188B5616p6746j0772O9092N8669k7198p5816k6031N3586O2629k175o5539m9360
200f4045L2705P5137J6663o2280n6287J7568O6600L4880m1611o8152m598O4947
$$ y = [-75723, 42350, 108672, 28260, -82439, -80227, 12785, 90691, 63283, -57949, -108287, -1368, 96917, 55696, -35117, -75116, -41555, 53781, 94720, -3114, -98602, -49979, 51754, 75890, 19329, -59362, -76548, 9486, 94006, 48010, -63073, -82633, 1922, 74604, 57066, -29439, -83836, -29671, 65402, 73948, -12600, -80409, -45728, 47366, 77526, 6877, -67199, -54862, 20652, 73235, 37437, -51889, -75049, 4130, 72870, 44172, -34182, -68844, -21386, 56382, 65306, -12870, -74772, -37470, 46400, 67250, 3411, -62398, -49449, 25118, 69205, 25616, -51130, -61902, 7190, 65859, 38661, -37155, -63186, -9600, 53029, 50854, -14685, -64045, -31340, 43797, 60460, -1820, -58107, -40539, 26061, 60941, 19330, -48822, -53420, 11527]
212A1527M8351k9137o7067j9619N0180N6871p062o3051l8705L6349O3680Q762
224E1079n6095m8389J9227O2305K5830m2342n7034J252N7786M0648k9050o0982
236c5765j4221M8732M9195j1572n7645l0755L6680N6187L243n2461m0712K1725
248b7369N5863J9393m1498m9641N810N3626L3010l0380n4085p721M5950M1471
260D4429j5100n2242k2913L5771M8548r60m8719l3877K3230N0915J2983m0139
272A926m2779R771M9194K5567l0296m6815m195M3914L5135j7961m7820j6418L5001
285e776M1729l850m4978k8452K5024M5536P126l8745l5186J1911M4409K0547k9839
298I456m2047L34M1194K9155j9740m2447j1671L3651L6609p727m2096k1767K5703
$$ y = [11527, 59878, 30741, -36326, -55945, -5765, 51106, 44044, -19007, -57712, -21363, 42317, 51079, -5016, -53405, -34178, 28127, 53957, 11615, -45419, -44167, 13619, 54267, 25217, -35765, -49986, -1254, 47941, 36369, -21276, -52031, -15351, 40836, 44079, -8382, -49094, -27369, 28494, 47887, 6389, -43252, -37442, 16184, 49194, 18814, -35271, -42992, 2958, 44429, 29329, -22913, -45826, -10055, 38493, 37533, -11186, -45063, -21833, 29082, 42065, 1926, -40853, -31082, 18112, 43679, 13383, -33432, -37627, 6287, 41422, 23461, -24359, -40777, -5776, 35953, 32103, -12875, -41327, -16303, 29233, 36359, -2386, -37572, -25661, 18748, 39295, 9456, -32591, -32257, 8937, 38092, 18352, -24095, -35766, -2115, 34494, 26767, -15329, -37096, -11393]
311a1393L9378L740l6090l0604J4455M0681J5021l0377l6013M578L7556K3325
323C4257j9577l9091p848L3418L1749j1341l7927j6498K4709L5247R71l5009k6638
336c3578J7427L7479Q948k9084l0233N964L5281K0122k2010l5080k311L1614K5054
349B9593j1777l4451j3622K5272L1899l080l3439k0253J7565L2610P133k7887
361d37k7642Q747L3288J5193k2672l0064j4L0130K1412j3552l2618r127K5693
374a663K7170n933l0792j5950J8416K9284L274k6806k3219J0304L0635J1407k2795
387C332k5949K788K7148J8793j4344l0066o254K5686K3391q921k7828j2358J8349
400f233K6665J078k7221j9140J3347K6944P124k1230k2785L723K7235J5132j7114
$$ y = [-11393, 27985, 31725, -4365, -34969, -20514, 20167, 35188, 4811, -31202, -26624, 10932, 34257, 14680, -24411, -32259, 1159, 32908, 21567, -16360, -32858, -8149, 27098, 28069, -6940, -33578, -16151, 21328, 30276, 1192, -29041, -23077, 12204, 32326, 10316, -24764, -27075, 4539, 29593, 17816, -16635, -30257, -4985, 26914, 23834, -9605, -29858, -12293, 20317, 27450, -437, -28079, -19332, 13956, 29149, 6477, -23587, -23601, 6529, 27941, 14389, -18229, -27356, -1663, 25507, 19574, -11218, -27168, -8752, 20532, 23806, -3000, -26219, -15915, 14720, 26127, 3332, -22617, -19829, 7319, 26112, 11768, -18298, -24552, 1134, 24525, 15604, -12224, -24582, -6233, 20432, 21510, -5711, -24851, -11504, 15440, 22564, 1334, -21451, -17728, 9507, 24639, 7525]
413G525k5873j811K2764J9617q255k6500j0793J9821K3955k988k4503j5283J2523
426i801K5255O275k2795k0577P381K5290J0258j6325k2389p68K2894J6984j1066
439A0616k4502n796J8781J9611l819k2447j3575J4353K2987J887k0921j7187P846
452a2166K3172R243j7387k0877K075K2361J3727j2062k2185m073J9147J7656o065
465A2566k2183r321J4540J9937J90j9699j4788R628K1056N870j6456j8506L654
478a3512K0778J1217j2550j9876j774J7994J5175p118k0516p949J5615J8402k432
491A3454j9147j1586J0226J9401L901j7235j5641O137J9039P903j2490j7440p02
504a4180J7609J3444q632j8975n110J4925J5526k914j8157j0005J1524J7476J569
$$ y = [7525, -18348, -20159, 2605, 22222, 13967, -12533, -23326, -3505, 20450, 17462, -7041, -22324, -9801, 15454, 21729, -1066, -21643, -14262, 11028, 21286, 4961, -17428, -18196, 4698, 21682, 10616, -13886, -19682, -901, 18710, 14891, -7556, -21131, -6778, 16209, 18096, -2825, -20012, -12166, 11006, 20249, 2862, -18015, -15940, 6421, 20148, 8086, -14099, -18172, 975, 18631, 12566, -9617, -18938, -4398, 15539, 15729, -3970, -18758, -9130, 11926, 17796, 1340, -17166, -13512, 7266, 18483, 5933, -13943, -15717, 2277, 17452, 10334, -10182, -18131, -2516, 15886, 13454, -5693, -17279, -7053, 12348, 16249, -986, -16627, -10490, 8549, 16452, 3962, -13478, -14180, 3429, 16873, 8241, -10734, -15844, -919, 14607, 11693, -6464, -16469, -4945, 12531, 14100]
517A4100j6272j3795O886J8556N971j3671j5842K519J6363J0436q951j7130l586
530a4416J5252J3919n473j6908p146J1460J5253N15j5892j1803P847J7165M109
543A3882j3623j3350L171J5768Q371r258j5960j572J4855J1791o417j6223n142
556a3707J1994J3680j373j5064r484Q523J5465K732j3635j2058M792J4690O508
569A3063r924j4108k95J4422J0268p149j4875l740J2047J2163l030j3836p974
582a2968Q474J4487J462j3586j0604N944J3988M359r811j2691J218J3657Q929
595A2858p853j3692k300J1959J0528m281j2843o238Q755J3238k10j2919q789O227
609e560J3267L438j0539j1098K241J2862P231q194j2876q91J1949R062m752j2451
$$ y = [14100, -2172, -15967, -9081, 9475, 15446, 1775, -14067, -11548, 4815, 15251, 6300, -10830, -14416, 836, 14755, 9282, -7626, -14772, -3312, 11941, 12456, -3436, -15239, -7392, 9773, 13882, 259, -13091, -9920, 5848, 14219, 4961, -10999, -12571, 2284, 14075, 7658, -8565, -13707, -1713, 11967, 10594, -4470, -13954, -5431, 10034, 12766, -869, -12927, -8135, 6555, 13063, 3139, -10969, -11264, 3158, 13426, 6277, -8598, -12338, -291, 11872, 8842, -4994, -12968, -4494, 9993, 11455, -2131, -12735, -6791, 7197, 11556, 1745, -10946, -9728, 3929, 12858, 5005, -8687, -10987, 972, 11500, 7219, -5624, -11862, -3107, 10131, 9921, -2998, -11787, -5560, 7707, 11145, 606, -10492, -8251, 4611, 11842, 3648, -9228, -10119, 1830, 10892, 6140, -6311]
623f311m472R243J1286q06j2924p052P289J1343K076j0105r949L465J2220N672
637A0975q711j1221L88J1185P924n825j1327k934R191R872k221j1573o007P291
651b993J1165R63j0602q285M227J1172M429r071j0179J617J1194O049n712j0779
665f805k166R699Q663l523j0976m559P741J0006l89r997p204M937J0129L212q466
680C02q840K009J0406N606o811j0102m91R148P460l653j0265l719P528R312j345
695F545r845n661N256R940J962q819p920L114R844L758o187q959o4Q992O556m563
711C949r357k412P158Q262j929r214m703N925Q451Q54q224o751L591R072L555
726H227p310q225J268Q723N224m420r104j816Q104O944k898q517l489N483Q456
$$ y = [-6311, -10783, -1540, 9746, 8940, -3984, -11036, -3747, 7596, 9672, -433, -10382, -6917, 5303, 10975, 2264, -8957, -8569, 2616, 10540, 4715, -6612, -9546, -355, 9517, 7296, -4277, -10284, -2993, 8172, 9135, -1467, -9752, -5525, 5647, 10076, 1005, -9174, -7557, 3637, 9686, 3974, -6805, -8971, 728, 9391, 5868, -5108, -9667, -1926, 8080, 7691, -2306, -9510, -4573, 5556, 8768, 302, -8538, -6529, 3877, 9483, 2672, -7430, -7921, 1227, 8687, 5034, -5231, -8950, -1422, 7890, 6545, -3300, -8961, -3705, 6235, 8197, -622, -8542, -5428, 4416, 8174, 1987, -6972, -7036, 1956, 8512, 3949, -5408, -7820, -662, 7600, 5671, -3543, -8246, -2321, 6130, 6984, -1240, -7991, -4400, 4672, 8227, 917, -7308, -6040, 2683, 7907, 3487, -5617, -7433, 671, 7615, 4717, -3800, -7289, -1806, 6650]
741F650o45p952n966M519Q523J674o694o922J538Q324M442n339q011n62P475N722
757F776k901p992l107O332P465j383p371m493L752Q337P34o712o245K030Q554
772C776L029n211p277NP296N229l400p889k033O626N861j227p745l742M742O982
788E022Q15o868n279K755O995K814n647o398Q05P070M033l259p326j419N986N796
804E895k058o989l238N344O173k89o523m293L139O896J914o098n753J647O949
819B716L452m267o539m54O010M961k547p161j598N036N611o31o622l972L764O444
835D203J319n857n098K060O138L038m712n932L75O127L967l255o132j555N182
850a32N387j482n987l382L809O082L01n711l792K248N862J805m381n341N72O220
$$ y = [6650, 6005, -1947, -7913, -3394, 5129, 6803, 109, -6813, -5275, 3049, 7491, 2152, -5859, -6421, 1054, 6776, 3875, -4117, -7224, -892, 6573, 5190, -2181, -6674, -2922, 5415, 6149, -563, -6808, -4778, 3776, 6805, 1594, -5683, -5678, 1618, 6847, 3447, -4442, -6475, 151, 6012, 4785, -2960, -6702, -1960, 5022, 5837, -1031, -6310, -3555, 3440, 6254, 607, -5791, -4986, 2084, 6117, 2858, -4468, -5887, 99, 5895, 3837, -3152, -6390, -1046, 5127, 4838, -1685, -5978, -2839, 4057, 5971, -127, -5880, -4233, 2716, 6168, 1901, -4638, -5092, 918, 5879, 3332, -3829, -5427, -391, 5220, 4589, -2033, -6005, -2241, 4203, 5522, -335, -5433, -3373, 2765, 5803, 1091, -4841, -4466, 1661, 5628, 2373, -3759, -5314, -132, 5255, 3773, -2214, -5596, -1787, 4295, 4596, -1115, -4907, -2659, 3203, 5008, 627, -4714, -4142, 2078]
866B078L420l480n522j132M958M727j924n768k498M295N234n00n258l434K601
881b203N501J435m740m387Q71N808K741l855m899n30N047M016j968n882j960M596
897d09M752p99m941l447L178M787J236m656m343J775N253K521l722n156M57M568
913A054L526k213n702r12L905M450p84n394k853L449N108P4m596l492J805N531
929B956J420l871m524O64M803K990k767m772r45M296M069j677m939j881L563M065
945C450K6m712k869K278M477J190l614m377J090M836K105k789m009n69M134L139
961C786j421m803j265L476L494m74m157k864K800M263P45l798l260R91M426J730
977C669l261l620O8M217K648j924m257j242L416L800j244l863k094K838M030j98
$$ y = [2078, 5498, 2018, -3504, -4636, 322, 5049, 3125, -2643, -5141, -846, 4388, 3888, -1370, -4804, -2203, 3298, 4733, -7, -4394, -3523, 2285, 5026, 1171, -3728, -4258, 789, 4805, 2837, -3045, -5005, -409, 4343, 3544, -1397, -4844, -1666, 3121, 4357, -299, -4642, -2867, 2386, 4907, 1185, -3971, -3514, 1054, 4580, 2367, -3335, -4247, -342, 4108, 3324, -2070, -4923, -1474, 3634, 3708, -888, -4380, -2575, 2956, 4376, 505, -4019, -3355, 1448, 4438, 1671, -3101, -4046, 250, 4319, 2642, -2297, -4178, -615, 3450, 3476, -1236, -4105, -1827, 2650, 3840, 226, -4151, -3061, 1775, 3880, 1091, -2918, -3487, 647, 3786, 2365, -2438, -3703, -227, 3267, 2793, -1364, -4228, -1428, 2835, 3580, -218, -3478, -2487, 1939, 3669, 408, -3212, -3144, 1073, 3721, 1797, -2460, -3702, -286, 3514, 2270, -1593, -3687, -849, 3181, 2983]
993B983l514l198J878M351R02k860l681M82M005K173k252m208j33L548K952j183
1009B245m032j699K732L723k05l878k352J883L842J239l445l151O26L904J907
1024C339k318l608k2L282K663j579l639j188K811L039m98l459k389K406L413M72
1040B725l011k938J318L574J665k677l403N54L184K214j814l665n04K505L052
1055B779q92l158j962K323L506q0l136k179R68L547J532l094k794K91L311K040
1071C002k061l183k68K778K462r58l451j216K574K704nl145k103J558L341O88
1087B717k776k608Q94L207J076j568l402q8L065K189j251l152j036K863K256k73
1103B113l520j480J740L085J61k262k318P25L120J371k583k283N1K900K067j560
$$ y = [2983, -531, -3729, -1851, 2500, 3402, 542, -3139, -2657, 1348, 3521, 1269, -2939, -3072, 476, 3428, 2245, -1787, -3486, -754, 2969, 2764, -1114, -3466, -1583, 2259, 3498, 53, -3098, -2472, 1432, 3339, 1021, -2587, -2609, 673, 3336, 1757, -1882, -3070, -259, 2780, 2282, -1177, -3566, -1160, 2253, 2725, -286, -3224, -1906, 1668, 3333, 656, -2747, -2193, 991, 3205, 1391, -2274, -2778, -273, 2779, 1887, -1271, -3233, -910, 2596, 2516, -620, -2799, -1831, 1716, 3248, 154, -2640, -2349, 962, 3002, 941, -2242, -2510, 268, 2730, 1772, -1679, -2895, -321, 2383, 2378, -767, -2870, -1312, 2029, 2717, -59, -2667, -1773, 1434, 2510, 942, -2460, -2548, 517, 2706, 1455, -1697, -2733, 130, 2386, 2113, -1407, -2887, -1147, 1938, 2099, -163, -2481, -1756, 1364, 2735, 152, -2131, -2080, 820, 2887, 1327]
1119A327l124j142K836K581n00l204j557K019K893n1k602k106J533K539P38j835
1135C45k481O25K534J482j499k994j7K389J737o75k835j113J967K364R9k421j840
1152b333J229K500J029k581k212O90K803J048j319k976L92K137J808j103l036
1167a924l86K233K269k92k718j510J411K816K91k308k380J326K544J138k369j945
1183a804kK221J820j453k183q19K340K215j001k411j088J512K495r1k190j818
1199b257J162K377R78k315j924L57K492J265j312k431m27K065J755n86j981j554
1215b336K135J860m6k254j506J322J953R25j957k038M48K232J482j333k532l32
1231a977K399J363o66k391n82J560K091l55k174j159P86K392M97j954j648O60
$$ y = [1327, -1797, -2939, -103, 2478, 1978, -1226, -2783, -764, 2129, 2078, -524, -2630, -1097, 1442, 2180, 345, -2136, -1511, 1023, 2505, 1006, -1988, -2005, 384, 2121, 1446, -1389, -2502, -535, 1829, 1928, -493, -2333, -1104, 1396, 2425, -156, -2368, -1678, 1125, 2173, 854, -2122, -1730, 407, 2215, 1112, -1924, -2310, -77, 2192, 1900, -818, -2328, -917, 1899, 2190, -118, -2498, -1172, 1372, 2510, 141, -1804, -1806, 415, 2235, 782, -1401, -2220, 120, 2335, 1334, -1077, -2165, -653, 1842, 1751, -439, -2257, -1095, 1282, 2260, -55, -1979, -1622, 870, 2135, 823, -1608, -2035, 30, 1785, 1199, -782, -2336, -201, 1659, 1613, -641, -2147, -825, 1128, 2053, 96, -1942, -1494, 738, 2220, 887, -1645, -1977, 422, 1785, 1119, -1272, -1854, -294, 1797, 1442, -732, -1891, -1105, 1287, 1784, -170, -1818, -1158]
1247a158K088J068j544k301O99J716J306j019k250l46J666J621l96j913r00J022
1263f41J979K23j897j368R42J361J382j882j809K80K078J169j123j915l46J414
1279a53K040r20j746p69J236J860l36j645j144J018J918K06j597j465L91J713
1295F07R76j048j888m0J416J365m38j912n57J279J772l47j705j020Q73J712L39
1312A384j463j446M38J744J043j424j674J5J987J064o49k122n44J713J442m66
1328A042j839j006J228J808J30j648j325O01J615Q52j389j352j1J795R97o44j828
1345i74m37J252J410l35j527j107J506J194J26j338j305O14J947N63j603j581
1361a595L87J898N46n50j847k99J814J109l03j946m84J263J135l57j269q94P14
$$ y = [-1158, 930, 1998, 454, -1847, -1148, 568, 1874, 855, -1395, -1741, -75, 1546, 1150, -763, -1663, -641, 1338, 1561, -336, -1704, -762, 599, 1981, 99, -1710, -1430, 648, 1817, 694, -1221, -1567, -153, 1887, 967, -779, -1548, -312, 1548, 1212, -433, -1577, -559, 1359, 1565, -32, -1497, -1106, 607, 1583, 535, -1353, -1393, 23, 1388, 950, -962, -1519, -240, 1532, 1185, -520, -1540, -667, 1045, 1384, -79, -1525, -1087, 657, 1700, 276, -1398, -1383, 604, 1668, 1019, -1103, -1647, 66, 1508, 1042, -797, -1803, -575, 1233, 1363, -285, -1610, -1009, 606, 1458, 69, -1283, -1294, 501, 1498, 854, -974, -1411, -159, 1251, 916, -611, -1718, -212, 982, 1108, -230, -1535, -921, 1026, 1589, -14, -1595, -1208, 690, 1236, 686, -1161, -1460, 354, 1463, 1160, -786, -1270, -7, 1128, 771, -498, -1392, -678]
1378f78J751K62j025j673M11J452P69j105j003l91J897N51q57j410l17J280J142
1395A056k51j392p79Q24J592L05j677r60O42J067P81j125j216J85J266J005o97
1412F26j608m34J388J326p09q13q00O72J397J16j464q06P38J481j68p75j134Q7
1430h80J228N39k93j190n04R61J209m58j042n14R77R55j24j434n63O31J429J81
1448A108j124p93J21J290M81r06j076m2J325Q31o39j267n01J123J159k13j157
1465b80o54N01J351J57j221r93K78J466O96j036r47j09J165P59o41j146k80Q68
1483f6J057k70r66j067J262R35J21j131o52L05R71P24q41j279L5J198O46o50j156
1502h24J96P86O42k09r81m61R02P39J22j077n19PJ252P0p50q29P5J279M98o11
$$ y = [-678, 1073, 1335, 310, -1363, -952, 500, 1269, 164, -839, -1230, 667, 1218, 361, -1049, -1366, -86, 1056, 805, -587, -1366, -542, 1050, 1355, -322, -1282, -640, 427, 1208, 83, -1133, -948, 318, 1323, 626, -982, -1416, -28, 1298, 589, -224, -1024, -352, 1045, 1161, -303, -1109, -371, 1110, 942, 167, -967, -880, 348, 887, 594, -596, -1100, -139, 1070, 612, -430, -944, 33, 988, 864, -570, -1133, -502, 927, 1108, -16, -809, -688, 602, 1083, 177, -899, -941, 384, 1215, 576, -691, -1192, -69, 1090, 877, -280, -934, -433, 918, 1075, -146, -1139, -861, 605, 1301, 265, -682, -791, 374, 1133, 492, -654, -934, -66, 991, 721, -245, -1312, -50, 885, 1006, -125, -777, -472, 499, 1223, 382, -897, -862, 336, 982, 332, -824, -628, 158, 800, 591, -390, -851, 51, 790, 912, -165, -684, -677, 575, 645, -105, -934, -859, 420, 918, 307]
1522C07j091J5J021N82k01j142l49J022O08J34j023p75M43J198J87j246m20K32
1540d98P14Q84n78j288LJ039O64m86j050p00J284R27m30r63J6J15P43L32p18r76
1560i66M54J056L93j170n92O5J069O67n70j130j19Q33J157n75r76n00Q58R13m21
1579D46k76r20O41M07Q74j155r28K51R97M58n99j087N3Q05O40J62r18n18P10N25
1599E68L9j000n81Q09O18J82n27r54P79M25M21m42p80l80J254J87k97r60k56J078
1619A83P00l68m48o06K74P47R7q57o11K04J140K45n09p90K8Q76M78n79o93j85
1639f74Q68M02k00n68m26N27O46j1q08l49M02P14k43k97n96K84O58J71k86r01
1659f87p0Q39O70l03p15l92P71N28J5p58m70N79N14K56p33q37K99P99L21n45n32
$$ y = [307, -784, -769, 252, 834, 633, -509, -858, 164, 772, 906, -117, -892, -449, 749, 936, -310, -730, -498, 216, 1100, 522, -766, -763, 276, 940, 454, -596, -1296, -12, 915, 485, -478, -462, -347, 396, 728, 10, -966, -512, 544, 937, -233, -825, -760, 309, 976, 406, -724, -843, -10, 1147, 572, -404, -904, -46, 867, 446, 170, -750, -109, 298, 1172, 17, -911, -660, 337, 795, 196, -891, -838, -33, 607, 769, -149, -667, 43, 568, 607, -393, -974, -165, 453, 635, 108, -846, -67, 358, 779, 337, -443, -823, 431, 618, 321, -639, -895, 183, 883, 515, 67, -539, -265, 482, 579, -278, -889, -685, 455, 700, 191, -599, -571, 305, 783, 204, -489, -674, 194, 596, 396, -172, -598, -71, 575, 564, -244, -593, -191, 523, 280, -17, -613, -329, 329, 500, 214, -687, -757, 82, 752, 449, -266, -658, 113, 641, 656, -102, -572, 7, 521, 777, 44, -793, -494, 305, 626, 81, -451]
1680d51j06O37N84k35n57l42O04M66k61p42l76O55P16L7q07m90N63N52J29l14
1700B62j050J61O55M70j17o54k84O24M72j11o76l06O93L70k55m71k97K14P05M43
1720H48p90l69p9M48M04k98l73m25P17K05p9o27l54O71L31M19o08l68K5O72r6
1741B74m52m82N06K43K94Q2r81L89K31K37j26o21j20N43M67k1p81j42L28N23R0
1762D81k59r66L25N07L86j18q31J12M82M17m13q23L28L29M67q1n33n49M83N28
1782B72J55m52m52K36N35J50o24l18J93N94k11Rm58j16O84J74m94k01nJ59N56
1803C86r2m16l4m5N25L2j69o05J85N94J44m52l51K9O23m0J48p95m0K76J13K18
1825B34j00m27j81P78R5p99R4o5N19K40r7r51J44O27K26J18o10k73K81N26q5l23
$$ y = [-451, -557, 80, 664, 429, -128, -470, 134, 600, 339, -403, -779, -124, 592, 629, -178, -668, -105, 447, 576, 262, -788, -627, 28, 498, 381, -273, -557, 67, 539, 428, -248, -554, 139, 509, 254, -217, -514, -300, 405, 848, 58, -311, -390, 58, 462, 164, -209, -634, 83, 288, 209, -418, -772, -101, 230, 649, 41, -327, -302, 370, 274, -178, -660, -154, 89, 383, 465, -516, -127, 104, 341, 215, -406, -526, 17, 484, 463, -318, -460, -132, 391, 481, 222, -744, -419, 88, 474, 356, -475, -363, 119, 536, 123, -700, -372, -43, 424, 343, -190, -739, -256, 272, 427, -25, -477, -241, 294, 444, -180, -498, -305, 289, 78, 87, -371, -487, 197, 371, -123, -324, -329, -170, 386, 294, -122, -156, -201, 324, 356, 187, -418, -233, 361, 505, 53, -298, -269, 354, 314, 462, -333, -373, -97, 16, 234, 134, -293, -474, 304, 399, -400, -306, -371, 148, 388, 291, -660, -516, 111, 337, 455, -155, -428, -147, 379, 294, -29]
1847b9l19j57J034K0p34k09j97Q40L03o44j19J86M41k15j76n31K59L17N57k93
1867C34l95n07O41L63m62j77k25L29K87L56n67l75P2N21J93l55m05q4L82N54l11
1888A69j35k45L5Q17k38n72j96M58J25K11m91l06R7L65J70k64r5j72N68%L5p22
1910c86l57O16N93l06j68N2k93N86m8o48PJ83M19Kj68m98M84o1K61j62m59j43
1932d94N89J26j3j87n16M76L13R8l61m34M60N9L27j18o62K11J68L78m16j91j36
1953c23N75N9l25l41J76j05P36p7p04j0l2L91K24q2m44k6J82N06o6p54P9M90K20
1976C49j98m59l23O23L74k4k90k90L77K17j59k7m77J36O11o2j04m91j52L95kJ84
1998B08m63j13L8M64l23L44k15J90Q9j63k64Nn8K41L65k08m78r1L74N77o60k63
$$ y = [-29, -348, -505, 529, 549, -185, -394, -591, 249, 552, -92, -211, -25, 416, 201, 25, -506, -247, 70, 627, 334, -61, -568, 73, 436, -26, -203, -428, -99, 188, 544, -23, -398, -326, 195, 388, 33, -372, -456, -74, 480, 169, 34, -211, -176, 641, 403, -169, -365, 93, 218, 429, -62, -368, -271, 94, 264, 0, -95, -267, 301, 301, 336, -386, -743, -127, 466, 160, -8, 44, -249, 337, 289, -359, -352, -169, 250, 252, 84, -414, 70, 9, 270, 108, -351, -494, 95, 221, 208, 21, -495, -19, 294, 392, 31, -403, 57, 116, 443, 325, -337, -126, 42, 420, 4, -187, -323, 252, 311, -14, -355, -179, -284, 452, 375, -329, -339, -371, 20, 244, 162, -282, -308, -126, 380, 314, -440, -361, 129, 349, 151, -308, -631, -8, 366, 342, 52, -238, 139, 356, 197, 170, -307, -171, 440, 378, 274, -217, -369, 26, 24, 208, -255, -368, -330, 134, -189, 155, -60, 130, 219, 56, -208, -203, -261, -20, 345, 137, -341, -432, -58, 519, -141, -404]
2020d04J89K50K36k39k81J0JO69r7l89j89L27N24O8o00l72K83J90R8m92J29j47
2042b36M20k91N76n28q5oO68m63j39k43M72K8jk15m4j49N8M75k78k14K01K30j17
2065A19N9j36k52J73N86j37o45k46J76N34K19l6o78K70L57k48j29l03K95o4L99
2086C13l81k54P6K12L63j60m29J02Rq6L31j07n12L22J77L16j77k67k5K15J98j70
2108F6k67M9L52k32J28k06Q3j35N91k46k4k05l3M2K97k41m70L91J31j21J80l63
2130b33J42J54j15J86j9l65K91J84l1l40J41J6K07jo03O5J47K36k14P7k58O1K47
2153b5K16j97j72Q5p0M56j81j07p9J62KK10n06P0q9J36K50j28j35k01K54K96l25
2176g8O7m6l9L48O3j82m03J88K59j2k61j51PR03n37p1j16k99O11k04j92p4K23
$$ y = [-404, -215, 35, 271, 32, -249, -239, -238, 431, 334, -55, -244, 83, 607, 675, 75, -297, -14, 176, 274, -218, -89, -236, 184, -107, 469, -59, -144, -150, 518, 55, -84, -327, 145, 173, 172, -43, -87, -236, -178, 297, 19, -195, 6, 236, 119, 178, 42, -210, -37, 549, 412, -233, -479, -303, 231, 450, 414, -264, 6, 363, 115, -14, -317, -22, -86, 313, -68, -322, -246, -34, 329, 169, -260, -158, -149, -235, 96, -11, -523, -201, -24, 292, 115, -152, -177, 38, 236, 66, -201, -152, 200, -32, 96, -110, -27, -162, 429, 183, 159, -46, -79, -37, 260, 19, -451, -60, 71, -50, 130, -233, -91, 63, -52, 134, 115, -250, 41, 225, 194, -146, -5, 11, 218, 217, -386, -321, -174, 62, -152, -75, -333, -272, -25, 191, -6, -178, -93, -163, 293, 112, 5, -74, 88, 90, 300, -206, -136, -225, -89, 161, 33, -102, -303, -49, 247, -78, -11, -57, -96, 252, 315, 133, -270, -82, 177, 165, -96, -247, -240, 663, 126, 55, -61, -360, 251, 47, -145, -219, 4]
2199Dj89K03K28l06k21K20j24L65k3l80K57K25m39K06k12J71K70k52k76P7L59
2220A63j56r5J25j45J58j25J86k22J84j48Q2K43k52Nj13Q3J40j06K45n85j79K26
2242b86M98j25j66k25K09N97m95qj59K61k32M96m22j22K7K69l26j22K20P3K34
2263A96j93K7K9j0O5J20q4j49o8l7J54J65k30n1j49N00j18l05O0O6l54N61k32
2286c7l2L0k75L86J4m63J98L30M71m65l55p9J21K95j20l57P6K29P4j56K83m72
2308c04L44K26L8m33Q9l34j18O21j44j24K24j07k04L38o6l43P2M35l04K52k91
2329a33k17O01M0l42J55k43J75r1J39K1j04R8k01J54N1n10L75J36K12q8l70j2
2351a54R3K22jk33j60L22j04k9p2m73N55P5J61O9l45J56K9J9O0n19K7M75lk12
$$ y = [4, -185, 18, 246, -60, -281, -61, -185, 180, 157, -223, 34, 259, -180, 26, -186, -15, 255, 3, -273, -196, 163, 7, -88, 37, -108, 50, -75, 111, -111, 73, -75, 7, 250, -2, 3, -110, -27, 113, 7, 252, -333, -512, -286, 212, 87, -79, -304, -95, 502, 7, -1, -160, 101, -131, 365, -57, -179, -152, 117, -209, -331, -111, -38, 196, 3, 30, 59, 49, 114, 234, 150, 1, -67, -104, 50, 215, -15, -66, -215, 285, 167, -138, -78, -12, -366, 195, -37, -69, -39, -314, 72, 86, -377, -179, 151, 622, 157, -198, -277, -156, 139, 19, -338, -262, -33, 41, -115, 168, -304, 40, 266, 304, -129, -40, -374, -492, 129, -15, -139, 85, -22, -226, 112, 46, -297, -225, 210, -94, 158, -133, -350, 251, 291, -51, 104, -139, 36, -55, 84, 105, 1, 99, -102, 52, 103, -407, -32, 104, 316, 228, -142, -154, -61, 161, 160, -73, -233, 89, -15, -44, -116, -589, -34, 41, 202, 271, -74, 82, 111, 130, 190, -329, -302, 173, 170, -42]
2375d2k14N9K49Lm9k66J6L53P6m1m31L47J49p3O3j91N3k40L19k04L47l61j77M37
2399A82J25o6l5m33J35M43Q2o53K0K14Q1j06j28J13n2J05j14j3l91N92M29m14
2421A16q7l15L34L9R0j32k03j29L49K17j69J04l18J48k09K52k78n3K39k16K11
2442a0k01M04k55r1O28m11l45K43P9j59K07n7j63J02K46j31J83l14Q5j71m1L83
2464B11k13o7p6J96l75Q1K23k3J22P5j97m09M64L2m5p7L0j30m8J66j32k79L78
2487i3M0q5J74j54J00N4J36j69n3p4Q6K37k31J17k61Q6q2L26l8l00K42K0N0k91
2511a63J83k06K77r6J76k48P8P9Po9J77j79J23n7p7r2R0o6K29j08N5l33K0L41
2535A41j88O3j2j09k03Q6L22k25J67P2k12R3J01j96K28J23q1J95m13l9j31L80
$$ y = [-42, -256, -197, 52, 55, 6, -260, -244, 109, 185, 144, -287, 60, 209, 136, 199, 8, 61, -179, 140, -64, 283, -78, -255, 182, 307, 241, 206, -227, -92, 351, 433, -220, -200, 14, 95, -11, -139, -26, -78, 27, -87, -100, -491, 101, 530, 116, 29, -286, 48, 87, 177, 45, -158, -287, 62, 279, 110, 214, -104, 44, -165, 87, -191, -244, -5, -221, -10, -211, 193, -62, -153, 475, 64, -281, -38, 41, -118, 89, 32, -131, -29, 217, 86, 269, -45, 40, -131, -172, 211, -2, -69, -145, 51, -324, -243, -20, -43, 79, 154, -43, -452, 12, 44, -1, -78, -48, -178, -226, -60, -192, -471, -93, -53, -138, 36, -118, -18, 36, 172, 3, -50, -124, -38, 199, -32, 85, -176, -90, -172, 154, 116, -184, 58, 78, 128, -163, 20, -186, 91, -5, 171, -77, 1, 80, 87, 18, 195, 16, 139, 82, 5, -87, 3, -63, 166, 58, 113, -220, -200, 141, -47, 16, 4, -105, -308, -222, 100, -125, 42, 114, -98, -5, 96, -100, 128, 251, 170, 365, -48, -87, -218, 162]
2557A62l58J15n5L3L23m8k81q1L05k19J9J82m4O5j57M2J27k11J39n5r1K89k3k41
2581f3L31j63j90J29J41j00k65K17j00J14k21K24l78J68P8J83n6k25r0J00L09
2602A43j17J32j62J81j18j66J21J0L0j58n3L41m1k49j74K49K0l7p8o1lJ49K7j13
2626a27r3K29J73k53N6L7K1m9J85l90L32j01J70n18N32l04k12L13o1o7j84K88
2648b3J86l3n2K67l75q7L28l09q4L06l56L28j24L06n14K56l6J90j09K7l04M48
2670B36j42Rl78J19L72k27J78k13J67l51L42n1L3m8k9P4J05K1k58L4J10l36K90
2693E7r6R1j30k55J73K38j73K59k06m6m5j08L92m20NK85k53J49l46O13J27n87
2715b76M09Ok51j76N05j98j76j42M99j59Q0o3j39J00j36J82j16L40l48J53O3l63
$$ y = [162, -196, -81, -136, -103, 220, 172, -109, -190, 115, -104, -85, 97, 53, 118, -39, 3, 130, -81, 58, 3, -88, 201, 178, -63, 268, 105, -85, 44, 185, 85, -180, 37, -63, 51, -170, 54, -324, -156, -78, 105, 49, -176, -266, -166, 143, 26, 158, -4, 177, 59, -107, 14, 24, 54, -104, -157, 184, 143, -106, -280, -31, -11, -48, -126, -187, -190, -41, -14, -127, -220, 9, 182, -71, -15, 22, 43, -6, 179, -211, 121, 20, 190, -328, 204, -100, -312, 1, -60, -127, -311, -23, 163, 130, 78, 345, -30, -117, 211, -98, -182, 124, -232, 96, -28, 278, -236, 20, -16, 174, 65, 92, -212, 236, 94, 103, -275, -156, 216, -11, 167, -46, 121, -230, 112, 61, 94, 46, 17, 91, 196, 217, -41, -7, 103, -233, 57, -39, 52, -78, -333, -160, 78, -95, 164, -42, -88, -133, -241, 151, -269, -264, 21, -232, -83, -429, 184, 311, -276, 133, 139, -112, -288, 217, 19, -157, -299, 200, 41, 121, 58, -81, 19, -117, 65, -51, 289, -59, 94, 157, -206]
2737b06K0J98J2K67j44ql53L91j06J40k03K08k49Q8j09l20M82j76j29K45kj35
2759h9M8J69k26J11J84l6o8j46%p3K0J79R2k43K08J07l30J85l72K18N5j48M65
2782C10l29L5N7p0Qj19K39j77J61J92q2q3n00Q28m35M5J42m08O1R0N0N0r2l26
2806c53J01J30m0J44M67l17k07L47k80j29J00k37K43L67q3m86K31j35M4j54J45
2827a02n5J81jj10j63J46N0J05j26O3K01l74J38J8L2j38J90k44J31J6J97P1k67
2850d1K5k6l7m2M98l73kn1j90J47K32l26N51m01J42P0l12K08j01K1N3J63q2j72
2874d6R2j62p7N56n02M2ln1J55j42M47l20Q0k33O8L50j13R3r2l27K89J82k27O4
2898A23k07Q8jJ00j17j16L2OJ48l3r6n8j61L20J38n7l14R7k65M34n7L8p7l4J43
$$ y = [-206, -186, 12, 24, 291, 147, 139, -214, 177, 71, 211, 8, 216, -33, 55, -54, -374, 108, -68, -197, 48, 46, -89, -41, 128, -98, 13, 197, 161, 93, -53, -53, -126, -106, 73, 165, -78, 130, 237, -93, 92, -280, -62, -7, -155, 310, -19, 16, 73, 3, 11, -108, 131, -46, 115, 307, 225, 142, -358, 470, 35, 80, 222, -186, -125, -35, 15, 65, -27, -353, -252, -122, -162, -18, 449, 132, -75, 272, -8, -137, -37, -274, -31, 336, 253, -233, -2, -137, -93, -247, -102, -157, 24, 23, -87, -250, -104, -54, 51, -75, -12, 189, -185, -47, -29, 3, -135, 55, -189, -58, -42, 155, 226, -41, -16, -42, -79, -121, 377, 4, 2, -49, -239, -92, 140, -186, 365, -36, 106, 176, -136, 72, -29, -8, 45, 208, 126, -46, 46, -116, -193, 363, -139, -97, -100, -151, 4, -138, 309, -11, 69, -164, -96, 254, 141, 234, 142, -185, 104, 286, 59, 123, -84, 4, 3, 103, -14, -130, -98, -92, 56, 23, -73, -131, -292, 28, 166, 109, -205, -108, -373, 61, 4, 42, -35, -69, 74]
2923G4j74j06L51j42k0J40o9o3o0K06j44j72J39k65J82R8l5J45j12P0Q9j45p6
2946h9J53j77J71j60Q7K27R4j46k03O8j2O0j61K19j53P4J05K31q49L27K7K31j22
2969Bp6Q5P3M6j88K39j31J71j78L8K25l93J84J97m48j1J71L2K32p2k66L69l64
2992f3j34Q1K17o0j16J76k96K52J81l00O2J13j16j2K38j0o8l79L28n5r8q7K80
3015A34j25M7r8K32k49K9P5o6j74q9K19J34n1J99m22j8M57k17l33J67K4J33J17
3038A25q2n0j75L70k50J45q7jJ05j85M12n14J40j70L12Mj28j47p3L82K42j65l99
3061a89m0K69j82K2O2k15J64j6J68J29n4j11j41J97l12k03L36RL61j55p9k35K13
3084bK4j9o6o1j9L09k2j66O4j37O4J97j59l14K13n4M99k91J53k2N0j77K6k10J6
$$ y = [74, -100, -206, 145, 3, -17, 123, 54, -9, -69, 137, -7, -179, -40, -305, -123, -25, -60, 85, -27, 43, 132, -13, -89, 64, -113, 58, -102, -15, 212, 306, 160, -43, 25, 13, 73, -88, 131, -22, 52, 157, 388, -461, -134, -107, 124, 2, -74, 11, 84, 130, -58, 181, 50, 221, 43, 81, 306, -87, 97, 294, -154, -165, 6, 38, 270, 198, -68, 301, -63, -197, -116, 101, 41, -75, 101, -195, 57, 238, -62, 0, 113, -3, -15, 223, 213, 145, -234, 94, 39, -59, -146, 134, 9, 56, -42, 190, -59, -30, 45, -21, -195, -284, -65, 69, 18, 217, -205, -223, 234, 17, -316, -149, -125, 8, 125, 43, -7, -182, 188, -62, 83, -4, -5, 100, -85, 327, -187, -47, -217, 95, 99, -29, -176, -249, 133, 375, 210, -189, -229, 40, -142, -120, -58, -273, -109, -125, 43, 172, 118, 7, -134, 63, -249, -452, -116, -107, 254, 99, 20, -215, -2, 22, 3, -63, -124, -143, 166, 144, -22, 42, -95, -31, 166, 7, -307, -94, -148, 351, 60, 213, 191, 241, 64, 90, -120, -104]
3109a04J42j79L03o0R4l95M68l66k5k52N09j09J75j48m82L27K65j9m17M49k99
3130a23p6M31j82K33l35J84K24m99n1L43j42l56M37P8N4k73J69P9R8k52QkJ49
3153A96j73K0j21L71k58k22K56k14M19l11J30r8J01mj36J69k33K59M2j97J41m75
3175c38J65M51p2n65J36J53J34l88L63M9J54l81J08K9j33NrJ53j0l56L76j71K04
3198E7k45L33l77K67J75m93L55j1q3K18q3j48J91L3m15K07jK32o5Rj5j58J0n7
3222f4J70l7j3Nn9j22o3J95j32L5R7o7j13K3R5K51J39l67J21m1l20M05j69Q3m
3247D8m77K13J6J39M7J34l21Q2L12j74O3j58j05K21k53k9K39K20j69k52N2J77
3269B5KJ43n1J71r7m5l49K36j82nQ9J15j01L56j61k01M9P6j55j73O1m0L85l97
$$ y = [-104, 38, -141, 162, 102, 196, -199, 269, -97, -122, -374, 135, 26, 201, 53, -429, -102, 163, 144, -273, 176, -123, -199, 232, 50, 283, -52, 132, 356, -143, -194, 149, 7, -349, 88, 166, 220, -53, 116, 195, 293, 41, 49, 47, 196, 23, 43, -78, 293, 35, -187, 69, -145, 274, -37, 93, -5, 96, 92, -44, 125, -108, 151, 193, -4, 137, -338, -173, 278, 206, -359, -223, -70, 64, -324, 39, 88, 242, -139, -31, -2, -135, -130, -139, 14, 4, -352, 24, -147, 57, -188, 145, -232, 35, 210, -283, 72, 61, -22, 196, 113, -35, 156, 189, -226, -19, -20, 212, 147, 156, 141, -17, -7, -64, 106, 69, 56, 61, 2, -120, -183, 12, -120, -85, 12, -55, -168, -145, -50, 201, 340, -27, 94, 53, -267, 138, -31, 52, 48, -429, -216, -200, -61, -14, 120, -201, -119, 193, 19, 82, -76, -181, 40, -213, -242, -3, 217, 48, -204, -152, 25, 27, 170, 119, 290, 193, 148, -201, 35, -147, -152, -63, 52, -49, 307, 146, -55, -6, 70, -85, -258, -197, -237, 148, -249]
3293b49J50K02j87K21k07K62l95M81j81RN5k03J20k69K69j50l8J72j43K34J95
3314C48l12M5j96k4P1M8n2L63k19J33j94J59m03L1M35l91R2K60k27n2L04k55m4
3337h0L0J57j74K42r5K6J8M45m50j08J17j53j6L30j36l20J41L44l71J83k4J49
3359B55m63L00J09k59p5L66k30J90k07l32J28L15k95M79k82k12J85j4j03K05r
3380E1L6P7M4J25l55j85m7O6kJ89n6L41l49j09J6K38qJ46k40R6K87l87j29l28
3404d83N23k52O86n92L68m8j00j81j93J01M54k89m67N75k01J26j5K38k47o0P7
3425B0m7J52j55j77L02k31K19k38J89R0j80J59r9q5J02J9J38n7k2j38j91j05K39
3448i6J43j05KK45K35j83k45O7pm0O0j13J57l13K90k73K55m6J74k93K37l54Q2
$$ y = [-249, -99, 103, -84, 137, -70, 192, -203, 278, 97, 106, 161, -42, 78, -191, 78, -72, -110, 62, -81, 153, 348, 36, 81, -115, -139, -68, -20, -72, 291, 72, 205, 11, 170, -233, -202, 233, -158, -66, 194, -33, -85, 219, -36, -80, -50, 107, -67, 175, 80, 106, 124, 569, 119, 11, 128, -25, -41, 289, 153, -167, -26, 318, -53, 130, 106, 255, -208, 92, 201, -58, -133, 233, 3, 193, -14, -346, -218, 97, -198, 281, -1, -213, -28, -42, -145, 60, 51, 87, 164, 208, 333, -22, -207, -254, -188, -190, -1, -57, 284, -65, -174, -158, 80, 72, 218, -22, 74, 361, -26, -155, -483, 40, -212, 474, -118, 250, 202, 102, -79, -272, -171, 283, -6, -473, 102, -99, 27, 12, 250, 3, -57, 20, -27, 125, -30, -207, 95, -136, 83, -155, 34, 124, -56, 103, 4, -81, 21, 40, 178, 121, 99, -39, -230, -335, -96, 47, -58, -56, 189, 424, 241, -4, 63, 56, 16, 76, -37, 120, -193, 97, -176, 79, 33, 207, -86, 151, -203, -121]
3471a21k0P3l2j8L78m00L12k0j09j36K95l7j92R9K72o42J65J03q3R2Q1L7p5R7
3495A19Oj65K14q1k16J54J61j94n8j21M02k31J99j20q6Mo5L6k15M31k86J0K53
3518A51n0K6k9j49J40j07J70l53J13M8P2j19J07J17J3k59j99J18J33K56j29k30
3540a60K92l92K89L7j20K13q5n6k34K03O5n8R0p3K5L3nJ67Q3k72l23J48J69j05
3564f9K68k36k1k5j36P3j16K91k28k4J11q3K48M9j51K23j22J79j39l58K80p5l88
3587d49L12L37l24j73R4L43j20j90N19k56J07m05J57L42j17j83J50j88J63j33
3607a4O5J38j36M4k22K25J31k35m1j73K94P0j14J3j49LJ93l7M9Ol25M25m28Q0
3631a38L15n80M52k15J43J96j76l2p5j81L09N4Q5J4j73Mj49O5J10J11j32J8L9
$$ y = [-121, -141, -68, -100, -118, 260, -140, 172, 152, 43, -93, 202, 165, -27, 72, 344, -298, -133, -30, -113, -21, 60, 97, 22, 119, 125, -40, 174, 93, -123, 31, 192, -2, -60, -181, 221, -10, 189, 69, -17, -13, -78, -42, -257, 174, -112, -102, 151, 101, 127, 98, -51, 89, -18, 152, -201, -88, -40, 32, -87, 20, 137, 150, -109, -308, -190, -57, 199, 70, -160, 132, -260, 29, 66, -54, 159, 74, 18, -216, -13, 52, -6, 84, 11, 36, 69, 64, 231, 314, 42, -281, -133, 36, -69, 199, -37, -58, -83, -219, -146, -262, 29, -199, -223, -112, -195, 53, 102, -49, 174, 52, 231, 92, -266, 14, -61, -449, -137, 200, -124, -297, -203, 140, 20, -170, 349, 93, 200, -205, -48, 294, 177, -6, 144, -44, 119, -14, 51, 189, 53, 97, -125, 100, 231, -4, -45, -218, 76, 146, 32, 45, -104, -101, 92, 55, 104, 110, -215, 210, -218, -138, 177, -403, 49, -166, -23, 173, -3, -35, -110, -291, 18, 72, 157, 171, -2, 2, -147, -82, 28, 139, 7, 25, 64]
3654F4J3j6M0k44K65K37o02MJ47J93k75J2M33j66J50l55J67k67L86m34K13pK41
3677A99j69M2l86N29P9m71K3O1O5j36K20L2k60k7K26o3J88J7j08J49l42j56O7
3700b21K74q2J9j44j27K34r7L0j08M01j00k63J21R9J4L6k17J6K64j77P9J92l06
3723f3K27k20L49l40J56m05L60j49KJ21j62O8k43N71j48j27J58k81M3j03K20l22
3745b88J08K24J06l7k61J0L80l2j40j19P1j77o4J61K75m84N4M8L98m44J4L71j95
3768b1J59p3Pj85n6K15K45m77J7L14j94L1K33m07L08l81L04O3o3J51l98L22k57
3791a43%K34k37J32j76J39lJ38J0q0J85m18L23l93K16j3K0J96j94N7P8O5k63o3
3815a90Q1n4qK11k6r2k07K39J43k28jK82k89QN08m93j12L7M21k98P1k87L46j47
$$ y = [64, 77, 61, 101, -143, 122, 359, -243, -239, -92, 101, -174, -162, 271, 105, 255, -100, 67, -200, 186, -248, -35, -42, 199, 30, 72, -314, 215, 294, -177, -154, -93, -28, -164, 56, 88, -172, -199, 27, -36, 152, 169, 61, 210, -132, -288, -221, 53, -29, -10, -154, -281, -47, -144, -114, -222, 179, 79, -184, -63, 36, 50, 86, -131, -115, 149, -28, 51, 243, -63, 164, -56, 293, -47, 109, -296, 64, -85, -83, 38, -124, -56, -299, 272, 124, -3, 155, -126, -83, -186, 34, -288, -180, 44, 150, 113, -148, -138, 242, 210, 70, -49, 22, -155, -219, -58, 217, -267, -213, -165, 233, -211, -197, 174, -21, 138, 65, 72, -113, -169, 46, 291, -186, -169, 145, -49, -18, 215, -192, 116, -265, 39, 102, 39, 190, -208, 114, -143, -143, 91, -146, -14, -190, -51, -54, 84, 94, 14, 199, -219, 104, -289, -73, -86, -66, 130, -64, -7, 71, 136, -127, -190, -109, -163, -171, 40, 14, -78, -285, -46, 97, -131, -132, 150, -139, -131, 377, -116, -228, -191, 230, -68, 3, -284, 62, -85]
3839h5K27L07k78l92M96j32l51J97M6j40J73O0j58J01N4l4j24k51K20J39l55K50
3861c0j92J13J66m4O1j63k22M02r6R3K7j14j89J81L81l78k66J88J26J44k86k2
3883a20N9J66k4r4K42l63K05O9j01j79K43l9j88K89l45J97r2J69j12J58l60J49
3905g1K56K15m88r6N01m84J03J36M3j95q5n3J20K1J06j56K08j27j19J78l28J46
3927a69r8K01J20R7j64L70m30j37K45j06N42l49R1l03J85k15j28K67J63k99k46
3948c63O45m18Q4m4L05l14q6M30rn04J12K05m64L43q0K85j78k4P4K1j09J6J5J71
3972A13J04n55J93J17j62K50k65K37j03j51K85p5k4j64J15q5R5R4J42j18K25k28
3994D0J01j17q2J4j80N4J35P0k24Q2J14k50K77J00o0K6K5j12K42m34K31l9n44
$$ y = [-85, 142, 449, 171, -221, 275, 143, -208, -11, 35, -105, 68, 128, -30, 71, 125, 91, -33, -284, -64, 75, -280, -30, -222, -109, 57, 13, 74, -89, -311, 91, -5, 88, 115, 1, -188, -7, 374, -4, -270, -82, 44, 188, -98, -120, -61, 105, 81, -13, 229, -134, 71, 140, 39, -140, 103, 64, -124, 165, -180, 17, -75, 94, -18, 140, -220, -71, 185, 400, -88, -184, 317, -167, -64, 72, 115, -80, -165, -218, -98, -77, 29, -127, 81, -46, -165, 13, -315, -169, -267, -66, 54, 151, -13, 357, -73, -210, 35, -71, 471, 122, 213, -90, 95, -120, -248, 19, 182, -117, -363, 282, -136, -52, -96, 209, -105, -191, 239, 230, -274, -162, 43, -421, -78, -158, 127, -51, -75, -1, 20, -89, -73, -58, 113, 217, -338, -145, -28, -190, 60, -205, 32, -71, -222, 63, -12, -36, -200, -85, -170, -75, 19, 161, 43, 268, 40, 141, 24, -58, -44, -224, -170, -35, 35, -189, -107, 7, -243, 34, 134, 74, 100, 125, 13, 255, -179, 52, 13, -531]
4017e31N71j35j12j44M01k58L79j31j8p2J15K58m25k2R3J22j57J67K91j27k46
4038A9N2k08K20O8o0j44P2RQ7j80o2J90n6kpj32O5J01J50l32q8J29L45l40J11
4063GK1j5j73j27L31J79k23m7M4K81l11L40l85k21J55j06R0J65j97L29j79P5K31
4086B64o02M45J13o6l07p0M62l00j12K81j11j14K9K45l9j94K9J76l12n3L49k60
4108a47K60o3l89M08P2k46K18j11j70M01j80k66m7L4N50n01K80M3j32k37LJ56
4130f4p9L45j32QR4o24O77l89L9L7k7J8k15K12Q9K17j14l00L16l14M98l70n1K11
4154H2K9Q1j35j76J39n1K53r6j71M46o88P27l81j17j26J10lK21N6J5m41L83o1
4177I6J57k25m5K63k80K18k34J6J37j67K42m09J28J40j68j2P5K49n9l16K46N1
$$ y = [-531, 40, -95, -207, -351, 50, -208, 171, 40, 22, -50, 65, 323, -102, -124, -31, 91, -66, 101, 392, 265, 19, 71, -137, 83, 151, 91, -53, 19, 28, 115, -65, -127, 63, 7, 5, -2, -134, -69, 32, 182, -150, -238, -109, 236, -104, 7, 28, 13, -160, -287, 44, 223, 0, -47, -3, 278, -33, 307, -78, -299, -144, -250, -160, 5, -192, 137, -42, 33, 264, -338, 107, 220, 154, -153, -223, 239, -61, -173, 108, -3, -117, -88, 157, 118, -76, -47, 129, -183, -236, 113, -147, 113, 50, -339, 69, 141, -105, 113, 2, -168, 233, 53, -213, -260, -226, 324, -177, 103, 146, 14, -223, -220, -64, -143, 202, 70, 78, 172, -452, 225, -164, -125, -88, -115, -97, -312, -100, -11, 206, 92, -208, 108, -206, 292, -78, -129, 82, 111, 192, 57, -119, 20, -31, 222, 126, -45, 401, -287, 440, 59, -58, -184, -74, -77, 144, 200, 215, -226, 157, 96, 253, 28, -17, 246, -34, 184, -50, -34, 103, -64, 178, -231, -103, 37, -131, -143, -68, 181, 122, -194, 52, 103]
4199A03m29P20j75n05J38J79M75m13J30l32l2K64Qj35k98K53Q4J43l31L51j43
4220E5J93l53J42j55J89lj85M56k89k88M23m17J33k19L67j84J37Q3j87K05o6J08
4242A45n1K2j31J60p8j4n1O1l9k04p4L17k52K05l56K88J22k32J14n2K23L9k0m8
4266I4k27J33j07O7J86j61j97K05k8k5j42M95m8q5m40L33J07j86L29m79n7J70
4288f3J30l22J83J96n5j83P5m26N09j69K44R0k08K60j35j33J2J43R8j83j21p7
4310a35M65o2m52N9J85j20o4N0N9m0p7J6L93l89L58r9j66Q0j12q8l5k09N97l30
4334a16jJ04j30k2K4J31J35J23m06J44M6j10J11L0K4L2o7k8J41p1j58Q2K62k63
4358A7Q8J9k30J49N7o6J3k6J97k18K31J09m08L00l57PJ47j99J97J90q8k92K39
$$ y = [103, -326, 394, 219, -286, -148, 31, 506, 93, 223, -109, -141, 123, 131, -4, -302, -49, 35, 178, -153, 198, 55, 248, -105, 37, -118, 71, 68, -117, 339, 50, -238, 185, -232, -99, -318, 49, -135, 2, 85, -102, 103, 37, 145, 94, 116, -15, 145, 67, 53, 2, 63, 24, -180, -254, 63, -189, 16, -340, -52, 70, -162, -48, -100, 123, 162, 142, 94, -133, 0, -107, -40, 146, -15, -212, -7, -35, -60, -202, 293, 245, 160, -280, 53, 160, -26, 303, -176, -233, -63, 67, -255, -72, 124, 69, -114, -39, -465, 44, -125, 119, 209, 1, 261, 126, -7, 5, 148, 246, 63, -58, -135, 330, 268, -184, -125, 60, -60, -124, -74, -15, -55, -132, -116, 277, -112, 246, 147, -19, 61, -51, -139, -174, -383, 214, -116, -117, -13, -143, -165, -141, -10, 125, 248, -158, -14, 32, -78, 33, 63, 87, 119, 52, 24, 165, 94, -64, 18, 280, 17, 105, 124, -106, 43, 100, 34, 47, 21, 218, 0, 231, 340, -68, 232, -125, -118, 29, -170, 27, 217, 129, -163, 76]
4381G6qm10L31j02L40J32l95J65m5r7j23K0j32M7L20l45M35k83K9J88J77k18k38
4404a36j55K98L12n83J09M30m45kj98K86M9J85N1k30K53m44L15j37R7j1J35l86
4426b07K28P8j19l9p3p8L08j29Rj65M32k8m88J56J85j19m6K7l73K96L1R8k29O06
4450C61l61k87N83m99R9J5L22j44l36L29j28q0K05k3k04lJ73K20l04j28J19J24
4472E3q4J7n3k06M6K48J87k44j51l6M57j99M7R0j71K22k63kl9p2J67j61m7M5K38
4497H9K72p24L56J0P1j73N1M0M5J07j62j08l5N5L31L8j59k60K17k44K42r4K42
4520B07ml68K71q2k87O4K43M7k74n3J54k5J34K30k21j9J68j93m6M34o28M38k16
4543b6R0K69j44k59L9M1Q6j58j32kJ54k5NQ3j52lK84j34j63K68j69O3J15j07k2
$$ y = [76, 68, -342, -11, -113, 227, 359, -36, 129, 84, -13, -136, -116, -248, -201, 119, -226, 209, -74, -45, 143, 320, 102, -136, -291, 7, 319, -264, -155, 275, -170, -172, -370, -84, -35, 150, 201, -29, 224, -220, 95, -42, 55, 44, 179, -207, 21, 99, -20, -59, -132, -210, 98, -31, -22, -187, 245, 217, -271, -115, 70, -49, -95, -68, -441, -145, -114, -16, -245, 361, 0, -287, 296, -203, -104, -89, 233, 89, -247, 82, -46, -126, 79, 56, -148, -151, 22, 242, -62, -190, -71, 53, -31, -14, -67, -273, -227, 21, 208, -36, -187, -223, 234, 35, 82, 172, 1, 223, -40, -42, -81, -153, 14, -147, -194, -149, 89, 361, -363, -7, 3, 74, -99, -48, -8, 37, 144, -18, -126, -161, -106, 225, 263, 104, -156, 61, -183, 59, -35, 207, 203, -165, 106, 24, -263, -199, 44, 91, -183, -236, -82, -107, 27, 257, 36, 17, 185, -8, -54, 380, -248, 190, -26, 64, 333, 189, -70, -31, 10, 96, -62, -194, -196, -42, -67, -62, 21, -131, -134, 150, 16, -147, 121, -48, 15, 130, 23, 1]
4568AL80l74J06J51j98j90J09J54q8k66N30k70k08K1j13J53L8L53j95j47o9J49
4590B7L87n00L93j73j92K27J07l12J29K00l82k8M06m55J20m4J15L1j66K54P9k47
4612b4L55l57N5kN7K6Ql8l15J14j32M79q9l61K76J36j49n2l4J15j43K70l25K27
4636I7k20J01J4k58K73k21j3K08J75n2l1j88P0K09j04n4K03j47M2l15M46l45o1
4659a71K47k42K83j50j67K9J91P0j38J36l76K85qn8J6ok4K61m18J06L30k41N6
4682A1o3K17j76q1p8L35p5O7j77o5K57k81n0L32j65j97L30k29n7O7K91m55K20
4705b2J94P8j65j78l0%M09k71Q3M9J1q4Ok37q6M16k05j07M0K23J18k20k4p1j0
4730h3L12j17o1j19K76k30j05J81J49l75j08K38O3j43J01O1j80J08R5k91L14j20
$$ y = [1, 381, 7, 113, 264, 66, -124, -15, 139, 51, -215, 315, 45, -163, -142, -255, -102, -64, 289, 94, -53, -122, 27, 414, -86, 307, 134, -58, 169, 276, -36, 93, 293, -89, -117, 289, -166, -46, -90, 25, 56, -110, 144, 223, -24, 331, -26, 29, 27, 84, 110, 118, 80, -235, -121, -253, 226, 137, -224, 52, 188, 39, -13, -47, 68, -75, 195, -130, 97, -123, -22, -8, -266, 7, -214, -227, -19, 156, 104, 73, -115, -45, 164, 60, 6, 209, 62, 104, -211, 235, -110, -171, 76, -166, 117, -33, -200, -171, 20, 90, -48, 88, -288, -3, -11, -69, -53, -59, -83, 178, -240, -134, 196, -45, 11, -52, 165, -11, -92, -170, 165, 90, 157, -20, -85, 172, -109, -159, 173, 8, -189, 141, -88, -145, -78, 213, -242, -22, 172, 250, 85, -93, -123, -123, 286, 15, 98, 147, 158, 74, 80, -157, -243, 173, -32, -139, -99, 124, 242, 22, -2, -73, -83, 229, 112, 51, -68, 208, -22, -127, 54, 203, -172, -280, -42, 21, -122, -21, 40, -140, -32, 63, -228, 86, -34]
4752c4J92m0j6K10k20J77l65N7j35Q0k1kK03J67l03k43M99m06L21P0k78MJ5Q2
4776A4q7j73L12o4q2L35m46J79K2j7J0rk10M56l16o4L86N6k60J64j20k89K47J01
4800A45J60M2n23M6M99j35k94L84l43j17q9L83n1%O5j16j24K49R5l57J53j03M8
4823A7l86L17J08OQ8O0r6k64K08k84L00J9p2K89r5l03J30l2k21K57p2o1J99l22
4847b10K92r1J70l7M6m54K79l9J47n1k18K85k88l18K86L51q4j99L5n9Q7K43k46
4870g3j02J23K49j79J00o0k22K38J42l39K60j78l23J96J92P3k85J13J77n46N79
4891A35k09J55L01j95k68L18j61j24N0J64k14L31j25k77J22l0K05l99L34j91K49
4912A71m24L93j35p6j27O9JRJ14j2L70n09K50o5j19J65j51l9L2j68J96J79k01
$$ y = [-34, 158, 118, 102, 312, 92, 269, -96, -39, -174, -94, -115, -117, 86, 253, -50, -293, 206, -200, 121, 191, -87, -83, -68, 14, -73, -246, 66, 2, -80, 255, -191, -12, 10, -7, 3, -6, -216, 240, -76, -140, 246, 302, 42, 206, 86, -203, 44, 145, 305, 347, -176, -130, 369, 234, -60, 324, -19, -136, -225, 158, 107, 107, 172, 56, -68, 181, 276, -81, 72, -31, 17, -369, -52, 56, 62, 150, 210, 114, -150, 58, -226, 74, 93, 21, 310, 215, -88, 42, 10, -211, 46, -26, -87, 112, -210, 82, -9, 161, 124, 170, -284, -5, -44, 103, 52, -166, 119, -169, -487, -201, 150, 66, -133, -98, -157, -70, 173, -73, -175, -52, 197, 18, 118, 58, -164, 74, 216, -123, 137, -41, -364, -168, 24, 97, -188, -75, 102, -444, 135, -74, 81, 382, 187, -81, 237, 76, -48, 2, 166, -48, 283, 158, -119, 3, -27, 178, -221, 113, -78, 171, -253, 140, 5, -71, -198, -129, -128, -119, -5, -17, 353, -156, 94, 29, -90, 75, -76, -115, -83, -251, -55, 124, -77]
4935g7J07j4R2k01O8J46l36O6O20o15L29On3j14j28j03K15j31K14j1l3K10m38
4958a81J30r4J80j94L0P4M6j77Q7L10m79K92m9L95l83K78j08k64L51l94J40j44
4980a54K56j07k68J27K34k53K95p2N8QK13j43m2l02j45J80j79J94K5n5J81q6j3
5003d8n3L37m45J29L04n64M98l6J53j14j07M8l0K89l92K43l09R8P5N6k14L7j15
5026a60J05o3J33j7j48J16j15j15N2J21mM37m03O0J18j36j4l36M20J87k49k6K
5049c5J99k87N1K20j85Q4J10N4r1N1k34j33L70l45K24k5o8J43l82K2l0J90L2J75
5073A10L3k86L3J42r8l4NJ19O3k27L02K7l03J79j81R1J21pJ32j09Rn7p8o4K18
5098A40j4j84k10M20J79l58P2k08k05K89N4k26Q4J2j74L97J4K09l44K74l55q4
$$ y = [-77, 30, 16, 108, -93, -25, 121, -215, -149, 471, -144, 185, 191, 138, 24, -104, -207, 8, -123, 91, 80, 47, 257, -181, -51, -145, 35, -159, -129, -55, -9, -186, -99, 211, -268, 24, -25, 370, -13, 265, 157, -107, 244, -150, -10, -154, 102, -5, -273, -146, 88, -165, 130, 58, 116, 124, 337, 194, 152, -150, -295, -115, -294, -100, -75, -130, 51, -35, -48, -101, 236, -209, -80, 224, -340, 158, 122, 275, 161, 54, 102, 72, 361, -31, 212, -97, 1, 76, 132, -82, -45, -160, -55, -118, 15, -2, -150, -34, -149, -264, -212, -91, -95, 342, -61, -1, 117, -19, -33, -369, 51, 238, -11, -37, -35, 164, -123, -72, 148, -37, 47, 157, 211, 120, 171, -63, -196, 174, -171, 53, 28, -40, 103, -279, -257, -287, -97, -65, 110, 143, -143, -110, 32, -66, -100, -95, 24, 87, -140, 162, 189, -114, 65, -116, -25, 96, 89, 221, 112, 121, 64, -14, -78, 140, 126, -58, -268, 152, 331, -27, 45, -163, -368, -79, -25, -251, -167, -155, -329, 68, 82, 291, -53, 221, -134, -218]
5120b18L36j60j03J82j49J46N2J11k81J16j12K5j24K45J91l68K18j30M2K71k40
5141E0j89L41L39n57R3m33M23k16j88K13L16q2k42L30k53m8L29j63j34O8k41L04
5163F0j84N7L17l17k11K06j07r2K84J06j82J02q1p0k7J56n5P1o0l0K90r1m14M45
5187A73J76l97j02J48j45J60J61L7K3m5j30J10j62j62K01R5l81L10j21R0J52j47
5209D4J35j22j70J40l8j79O0L85j36n32M56k92K48K55j58L8j44O5j19lQm7MN1
5233e1J79M7k65K95J65m46J14l18K68M16l14L17k50j09J30J82k86o1L1k93J17
5254a32J78J81l74J71P0L0r8m68M84J39l25j17L52k6p9n3r1J39R5l20J56J63R7
5277A72k67K26L6k00p3K32l49O6J2J25L0K08l20Q7J08j63m2j3K2j28L62l2O7j01
$$ y = [-218, 118, -42, -145, 37, -112, 34, 86, 197, -84, 32, -80, -55, -179, 66, 257, -111, 107, -23, 19, 290, 50, -139, 202, 541, -16, 77, -356, 67, -149, -337, -124, 192, 110, -132, 198, -55, -103, 226, 63, -71, -3, -244, 60, -124, -67, 250, -67, -278, -72, -179, -271, 13, 119, -63, 39, -42, -112, -139, 17, -38, 33, -27, -57, 233, 142, -272, 173, 349, -48, -150, -2, -147, 13, 174, 211, 234, 189, 59, 169, 7, -155, 46, 141, -240, 70, -51, 39, 191, 44, 179, 57, -113, 27, -11, -190, -130, 255, 119, -413, 43, -249, -1, 254, 96, 134, -10, 55, -64, -67, -59, -106, -102, -51, 128, 175, -90, 205, 370, -76, 38, -280, -12, 404, 90, 407, 157, 48, 178, 360, 74, 13, 44, -249, -132, 46, 227, -147, 24, 94, 124, 26, -442, 42, 181, -144, -261, 91, 65, -14, -67, -158, -19, 76, -244, -88, 75, 172, -95, 131, 167, -33, -106, 126, -223, -157, -145, -20, 10, 218, -102, -15, 93, -70, -112, -125, -103, -231, 131, 99, 166, 65]
5301F5QJ19l75l1K39j47K66j43k2j81j04M38pj3K03m18L14k56M9k12j02M25j62
5324d7P9j81J62j6k64L90j46j1Oq8K39J4l23J50R4j85l4K31k07k1J60J39j42K22
5348B21j36q4L6k1K24k26l50K16J27J30l59J69j32k0j11N5K70P7q5LK63j89Q9
5371A67j15K8j18j88L84l09M2m7o8q6J96L2L5P3L3j89J70j67m2M5K75n12L08K35
5395A82jk97J69K07q1p9j34k9P5O8k40l2K83Q0pj62Qj41K23oj51O4M8Q2l21J26
5421f6K96l67k19J4L61m0K9J01k5k56M00n05K33l36M1L43L84l41j82L09j33n8
5443a7RJ50J24m58J84K5j12J75R3J88k43l3j72R7J64m38m4M99k2O4O8k88r4J72
5467I1n9L07j11l00M2J22K09l06k4k7kj51n1M40l13M42l89K30j93K23k87K91q5
$$ y = [65, 73, 192, -183, -214, 25, -122, 144, 1, -21, -202, -306, 132, 125, 112, 315, -103, 211, -45, 4, -208, -310, 115, -47, 32, -149, 13, -3, -267, 123, -23, -34, -28, -116, 123, 137, -186, -36, 58, -127, -161, 70, -137, -158, 2, 141, -1, 221, 85, 1, 37, 16, 240, 14, -336, -120, 7, 137, -222, -53, -185, -205, -316, -261, 9, 86, 1, 4, 267, 78, 167, 52, 80, -38, -226, 158, -151, -109, -156, -224, -310, -114, -82, -47, 26, 59, -130, 40, -127, -169, -124, 151, -361, -53, 182, 181, -116, 53, 260, 179, 100, -34, -63, 12, 80, -160, -192, 91, 171, 164, 2, 10, -131, 92, 86, -65, -1, 47, 129, -192, -66, 230, -137, -356, -342, 19, -21, 8, 109, 84, -172, 228, -277, -44, -380, -339, 4, 388, 47, -135, 174, 41, -17, -8, 142, 266, -192, -8, 17, -95, 80, 173, 361, 118, 85, -87, 10, 174, -264, -308, 191, 169, 233, 301, 13, -81, 91, 32, 339, 228, -72, -30, 92, 301, -5, -29, -56, -58, -209, -260, 180, -133, 309, -80, 150, -43, 180, -107, 184, 99]
5490I9j80j90L68m6k51J62O0o5k9o4J05J81k18K67K77n19K83m83L46l89J10J84
5512Hj59L56j10J77p0j07n8k3j67M32l16J4o2J22m63M21k3j48J35k28L64k09K48
5535A34n25N65k65j26K52o1k8M39l77K57r0k14J07J42l03K5K33k14N9j33O0m35
5557d98M60J89k17J60J58k51JJ42m44N49l13J09j66L69l04k47J21J61J67l83M14
5578A77k77M8k37K35j16j64M42j85K05k62m1K64k90L76m51J76J65l8L3k89P7M54
5600C02m49J7J46k9J38j35J38j60K84J17l42l4o0M3k47J84L10j40m24K29n2K85
5622A21r6J33j48q6M3j04r4m8Q9L06j71J65k20O1K05O2k89j20K56K42k75m17K41
5645a44K53l12L75%J69k22k41k83M70q2J43K7j39J26lJ83k90J40l63N15m76J21
$$ y = [99, -81, -271, 97, 51, -200, -38, 22, -43, -72, -136, -31, 150, -68, 199, 476, -43, 240, -243, 103, -286, -176, 8, -151, 205, 95, 272, 202, 95, 37, 14, -153, 279, -37, -23, -85, 37, -426, -5, -28, -176, -41, -269, 95, -114, 134, -391, 174, -91, -217, 35, -26, -54, 385, 8, 265, 175, -39, 68, 210, -93, -68, 165, -49, 10, -123, -63, -498, -38, 151, -66, 94, 252, 1, 2, 144, -300, 249, -64, 45, -121, 248, -56, -303, -182, -21, 146, -237, 177, -100, -52, -289, -54, -170, -334, 108, -77, 128, -134, -175, 89, -201, 175, -276, -100, 65, 27, 60, -229, -152, 302, -147, -130, 16, -13, 125, -10, 128, -32, 252, 369, 27, -7, -67, -24, -271, -87, 223, 83, -341, -112, -164, 121, 25, 158, 10, -76, -33, -137, -231, -279, -190, 116, -55, 110, -110, -49, 156, 218, -71, -191, 65, 307, 32, -385, -144, 109, -203, 172, 172, 341, 119, -122, -405, 65, -17, 126, 153, 14, 140, 137, 320, 30, 170, -193, 322, -154, -33]
$$ [...]
8191G
##END NTUPLES=NMR FID
##END=
