##TITLE=1H_DE-46EA_D2O_b
 D2O
 24 sc, 
 19.7.2024
##JCAMPDX= 6.0         $$ Bruker NMR JCAMP-DX V2.0
##DATA TYPE= NMR FID
##DATA CLASS= NTUPLES
##ORIGIN= UXNMR, Bruker Analytische Messtechnik GmbH
##OWNER= root
$$ XWIN-NMR		Version 3.5
$$ Fri Jul 19 13:49:28 2024 Russian Standard Time (UT+4h)  she@DPX200
##.OBSERVE FREQUENCY= 200.1314
##.OBSERVE NUCLEUS= ^1H
##.DELAY= (6, 6)
##.ACQUISITION MODE= SIMULTANEOUS
##.ACQUISITION SCHEME= undefined
##.AVERAGES= 8
##.DIGITISER RES= 18
##SPECTROMETER/DATA SYSTEM= spect
##.PULSE SEQUENCE= zg30
##.SOLVENT NAME= D2O
##.SHIFT REFERENCE= (INTERNAL, D2O, 0, 15.7039)
##AUDIT TRAIL= $$ (NUMBER, WHEN, WHO, WHERE, WHAT)
$$ ##TITLE= Audit trail, XWIN-NMR		Version 3.5
$$ ##JCAMPDX= 5.01
$$ ##ORIGIN= Bruker BioSpin GmbH
$$ ##OWNER= she
$$ F:/spectra/data/she/nmr/H-F/1/audita.txt
$$ ##AUDIT TRAIL=  $$ (NUMBER, WHEN, WHO, WHERE, WHAT)
(   1,<2024-07-19 13:48:06.87 +0400>,<she>,<DPX200>,
      <created by zg, POWCHK disabled, PULCHK disabled
       configuration hash MD5:
       00 E9 B6 7A A2 85 ED C7 34 08 36 98 17 FE 4E 26
       data hash MD5: 16K
       D2 45 63 4E 05 D2 17 56 00 8F 30 34 A8 4B 23 92>)
$$ ##END=
$$ 
$$ hash MD5
$$ E1 56 CC 29 5E 8B 8A CB 6D C4 04 18 D7 5C 3C 43
##$RELAX= 
##$RELAX= 
##$RELAX= 
##$RELAX= 
##$RELAX= 
##$RELAX= 
$$ Bruker specific parameters
$$ --------------------------
##$DU= <F:/spectra>
##$EXPNO= 1
##$NAME= <H-F>
##$PROCNO= 1
##$TYPE= <nmr>
##$USER= <she>
##$AMP= (0..31)
100 100 100 100 100 100 100 100 100 100 100 100 100 100 100 100 100 100 
100 100 100 100 100 100 100 100 100 100 100 100 100 100 
##$AQSEQ= 0
##$AQ_mod= 1
##$AUNM= <au_zg>
##$AUTOPOS= <>
##$BF1= 200.13
##$BF2= 200.13
##$BF3= 200.13
##$BF4= 200.13
##$BF5= 200.13
##$BF6= 200.13
##$BF7= 200.13
##$BF8= 200.13
##$BYTORDA= 1
##$CFDGTYP= 0
##$CFRGTYP= 5
##$CHEMSTR= <none>
##$CNST= (0..31)
1 1 145 1 1 1 1 1 1 1 1 1 1 1 1 1 1 1 1 1 1 1 1 1 1 1 1 1 1 1 1 1 
##$CPDPRG= <>
##$CPDPRG1= <>
##$CPDPRG2= <>
##$CPDPRG3= <>
##$CPDPRG4= <mlev>
##$CPDPRG5= <mlev>
##$CPDPRG6= <mlev>
##$CPDPRG7= <mlev>
##$CPDPRG8= <mlev>
##$CPDPRGB= <>
##$CPDPRGT= <>
##$D= (0..31)
0 1.2 0 0 0 0 0 0 0 0.06 0 0.03 0 0 0 0 0.0002 0 0 0 0 0 0 0 0 0 0 0 0 
0 0 0 
##$DATE= 1721382486
##$DBL= (0..7)
120 120 120 120 120 120 120 120 
##$DBP= (0..7)
150 150 150 150 150 150 150 150 
##$DBP07= 0
##$DBPNAM0= <>
##$DBPNAM1= <>
##$DBPNAM2= <>
##$DBPNAM3= <>
##$DBPNAM4= <>
##$DBPNAM5= <>
##$DBPNAM6= <>
##$DBPNAM7= <>
##$DBPOAL= (0..7)
0.5 0.5 0.5 0.5 0.5 0.5 0.5 0.5 
##$DBPOFFS= (0..7)
0 0 0 0 0 0 0 0 
##$DE= 6
##$DECBNUC= <off>
##$DECIM= 24
##$DECNUC= <off>
##$DECSTAT= 4
##$DIGMOD= 1
##$DIGTYP= 9
##$DL= (0..7)
0 120 120 120 120 120 120 120 
##$DP= (0..7)
150 150 150 150 150 150 150 150 
##$DP07= 0
##$DPNAME0= <>
##$DPNAME1= <>
##$DPNAME2= <>
##$DPNAME3= <>
##$DPNAME4= <>
##$DPNAME5= <>
##$DPNAME6= <>
##$DPNAME7= <>
##$DPOAL= (0..7)
0.5 0.5 0.5 0.5 0.5 0.5 0.5 0.5 
##$DPOFFS= (0..7)
0 0 0 0 0 0 0 0 
##$DQDMODE= 0
##$DR= 18
##$DS= 0
##$DSLIST= <SSSSSSSSSSSSSSS>
$$ [...]
##$SUBNAM2= <"">
##$SUBNAM3= <"">
##$SUBNAM4= <"">
##$SUBNAM5= <"">
##$SUBNAM6= <"">
##$SUBNAM7= <"">
##$SUBNAM8= <"">
##$SUBNAM9= <"">
##$SW= 24.0689651099613
##$SWIBOX= (0..15)
0 0 2 0 0 0 0 0 0 0 0 0 0 0 0 0 
##$SW_h= 4816.95568400771
##$TD= 16384
##$TD0= 1
##$TE= 0
##$TE2= 300
##$TE3= 300
##$TEG= 300
##$TL= (0..7)
0 120 120 120 120 120 120 120 
##$TP= (0..7)
150 150 150 150 150 150 150 150 
##$TP07= 0
##$TPNAME0= <>
##$TPNAME1= <>
##$TPNAME2= <>
##$TPNAME3= <>
##$TPNAME4= <>
##$TPNAME5= <>
##$TPNAME6= <>
##$TPNAME7= <>
##$TPOAL= (0..7)
0.5 0.5 0.5 0.5 0.5 0.5 0.5 0.5 
##$TPOFFS= (0..7)
0 0 0 0 0 0 0 0 
##$TUNHIN= 0
##$TUNHOUT= 0
##$TUNXOUT= 0
##$USERA1= <user>
##$USERA2= <user>
##$USERA3= <user>
##$USERA4= <user>
##$USERA5= <user>
##$V9= 5
##$VALIST= <valist>
##$VCLIST= <CCCCCCCCCCCCCCC>
##$VD= 0
##$VDLIST= <DDDDDDDDDDDDDDD>
##$VPLIST= <PPPPPPPPPPPPPPP>
##$VTLIST= <TTTTTTTTTTTTTTT>
##$WBST= 1024
##$WBSW= 4
##$XGAIN= (0..3)
0 0 0 0 
##$XL= 0
##$YL= 0
##$YMAX_a= 440704
##$YMIN_a= -383372
##$ZGOPTNS= <>
##$ZL1= 120
##$ZL2= 120
##$ZL3= 120
##$ZL4= 120
##$ABSF1= 10
##$ABSF2= 0
##$ABSG= 5
##$ABSL= 3
##$ALPHA= 0
##$AQORDER= 0
##$ASSFAC= 0
##$ASSFACI= 0
##$ASSFACX= 0
##$ASSWID= 0
##$AUNMP= <proc_1d>
##$AZFE= 0.1
##$AZFW= 0.1
##$BCFW= 1
##$BC_mod= 2
##$BYTORDP= 1
##$COROFFS= 0
##$CY= 11.3945322036743
##$DATMOD= 1
##$DC= 2
##$DFILT= <>
##$DTYPP= 0
##$F1P= 15.6554695791079
##$F2P= 12.8336369535428
##$FCOR= 0.5
##$FTSIZE= 0
##$FT_mod= 4
##$GAMMA= 1
##$GB= 0.15
##$INTBC= 1
##$INTSCL= 1
##$ISEN= 128
##$LB= 0.24
##$LEV0= 0
##$LPBIN= 0
##$MAXI= 10000
##$MC2= 0
##$MEAN= 0
##$ME_mod= 0
##$MI= 1.114404
##$NCOEF= 0
##$NC_proc= 0
##$NLEV= 6
##$NOISF1= 3.799351
##$NOISF2= 2.8
##$NSP= 1
##$NTH_PI= 0
##$NZP= 0
##$OFFSET= 15.70392
##$PC= 1
##$PHC0= -25630.67
##$PHC1= -3.812513
##$PH_mod= 1
##$PKNL= yes
##$PPARMOD= 0
##$PSCAL= 0
##$PSIGN= 0
##$REVERSE= no
##$SF= 200.130013532006
##$SI= 16384
##$SIGF1= 3
##$SIGF2= 2
##$SINO= 400
##$SIOLD= 16384
##$SREGLST= <1H.CDCl3>
##$SSB= 0
##$STSI= 0
##$STSR= 0
##$SW_p= 3612.71676300578
##$SYMM= 0
##$S_DEV= 0
##$TDeff= 0
##$TDoff= 0
##$TI= <>
##$TILT= no
##$TM1= 0
##$TM2= 0
##$TOPLEV= 0
##$USERP1= <user>
##$USERP2= <user>
##$USERP3= <user>
##$USERP4= <user>
##$USERP5= <user>
##$WDW= 1
##$XDIM= 8192
##$YMAX_p= 0
##$YMIN_p= 0
$$ End of Bruker specific parameters
$$ ---------------------------------
##NTUPLES= NMR FID
##VAR_NAME=  TIME,          FID/REAL,        FID/IMAG
##SYMBOL=    X,             R,               I
##VAR_TYPE=  INDEPENDENT,   DEPENDENT,       DEPENDENT
##VAR_FORM=  AFFN,          ASDF,            ASDF
##VAR_DIM=   8192,          8192,            8192
##UNITS=     SECONDS,       ARBITRARY UNITS, ARBITRARY UNITS
##FACTOR=    0.0002076,     1,               1
##FIRST=     0,             0,               0
##LAST=      1.7004516,     0,               0
##MIN=       0,             -383372,         0
##MAX=       1.7004516,     440704,          0
$$ Real data points
##PAGE= N=1
##DATA TABLE= (X++(R..R)), XYDATA
$$ plain form
0 0 0 0 0 0 0 0 0 3 0 8 -8 8 -8 8 -16 16 -24 24 -29 37 -40 48 -56 64 -76 84 -100 110 -125 145 -160 183
32 183 -203 225 -257 282 -317 349 -388 433 -478 530 -587 648 -719 796 -887 985 -1100 1233
50 1233 -1386 1573 -1796 2078 -2439 2925 -3621 4691 -6582 10890 -41558 94253 315513 359473
64 359473 316601 183010 5025 -209687 -360056 -383372 -251176 -40523 169297 305288
74 305288 350385 285806 126938 -92164 -283517 -369793 -317175 -164710 30519 211234 331278
85 331278 341545 227844 28419 -172878 -304876 -333564 -260567 -104520 96002 273284 350452
96 350452 295511 139774 -48416 -211621 -311326 -315935 -208148 -17461 179164 303889 319252
107 319252 233655 78503 -104043 -256806 -324164 -275259 -126475 63035 222299 302270 287155
$$ packed form
0@%%%%%%%LlQj6J6j6J6k4L2m0M8n3O6p7Q8j04J20j40J60j84K10k35K70l05L43
32A83l86M28m82N39n99O66p37Q21r11J008j117J235j367J515j683J872k085K333
50A233k619K959l369L874m517N364o546Q312j1273J7472n2448J35811K21260M3960
64C59473m2872j33591j77985k14712j50369k3316J32196K10653K09820J35991
74C05288M5097o4579j58868k19102j91353q6276N2618J52465J95229J80715J20044
85C31278J0267j13701j99425k01297j31998k8688P2997J56047K00522J77282P7168
96C50452n4941j55737j88190j63205r9705m609J07787J90687J96625J24725J5363
107C19252q5597j55152j82546j52763o7358M8905J48784J89510J59264P9971j5115
$$ plain form
118 287155 182466 12612 -169436 -291693 -305084 -212441 -57460 111501 249650 308806
128 308806 257098 110128 -71430 -218909 -289690 -269130 -164304 -1098 168927 281491
138 281491 289823 192722 35236 -124954 -242608 -287139 -240005 -105414 71906 221019 284389
149 284389 246376 131756 -20976 -168800 -266419 -276288 -186795 -29256 133187 242047 267641
160 267641 208670 81796 -78365 -215746 -275848 -235976 -118261 31966 170002 254587 255134
171 255134 165899 16379 -137314 -238521 -255874 -189757 -63892 82418 206385 263087 224721
182 224721 104843 -47266 -174738 -241266 -232284 -148487 -10309 136858 235077 246879 173859
193 173859 46473 -92313 -201005 -244805 -205720 -93317 52186 176661 235903 215563 127195
$$ packed form
118B87155j04689j69854j82048j22257j3391R2643J54981J68961J38149N9156
128C08806n1708j46970j81558j47479p0781K0560J04826J63206J70025J12564
138B81491Q332r7101j57486j60190j17654m4531M7134J34591J77320J49113O3370
149B84389l8013j14620j52732j47824r7619r869Q9493J57539J62443J08860K5594
160B67641n8971j26874j60161j37381o0102L9872J17715J50227J38036Q4585N47
171B55134q9235j49520j53693j01207j7353O6117J25865J46310J23967N6702l8366
182B24721j19878j52109j27472o6528Q982Q3797J38178J47167R8219J1802p3020
193A73859j27386j38786j08692m3800L9085J12403J45503J24475N9242k0340q8368
$$ plain form
204 127195 -2551 -134932 -224807 -234673 -160952 -33530 99603 196671 228947 186897 80615
215 80615 -57060 -175683 -229755 -202529 -109420 14897 133710 212444 220284 149111 23024
226 23024 -106804 -194569 -215864 -168708 -65945 61654 171349 221391 192181 97005 -26806
237 -26806 -137299 -201741 -200844 -132411 -15420 110025 194867 209312 153741 51359 -65525
248 -65525 -163325 -207306 -178075 -83859 38227 142531 196952 188397 118695 7971 -108851
259 -108851 -187650 -197921 -138463 -34827 76332 162057 196468 165290 74396 -43401 -143584
270 -143584 -190938 -173584 -100563 4138 109549 180382 188463 128230 23767 -84929 -161069
281 -161069 -184413 -149434 -63548 47190 143367 185830 161578 84522 -16871 -112172 -173103
$$ packed form
204A27195j29746j32381q9875r866P3721J27422J33133R7068L2276m2050j06282
215H0615j37675j18623n4072K7226R3109J24317J18813P8734P840p1173j26087
226B3024j29828q7765k1295M7156J02763J27599J09695N0042k9210r5176j23811
237b6806j10493o4442Q97O8433J16991J25445Q4842J4445n5571j02382j16884
248f5525r7800m3981K9231R4216J22086J04304N4421q555o9702j10724j16822
259a08851p8799j0271N9458J03636J11159Q5725L4411l1178r0894j17797j00183
270a43584m7354J7354P3021J04701J05411P0833Q081o0233j04463j08696p6140
281a61069k3344L4979Q5886J10738R6177M2463k4252p7056j01393r5301o0931
$$ plain form
292 -173103 -176946 -117674 -16044 89576 160488 175326 133233 48535 -53751 -140217 -179216
303 -179216 -154208 -73998 28111 116936 165959 162551 104469 8380 -92151 -159048 -168085 -119880
315 -119880 -34807 60768 138188 171165 143673 65409 -34979 -119752 -161675 -150576 -90079 1349
327 1349 95108 156208 161514 110880 24328 -67949 -136385 -160584 -131338 -55183 41431 122603
339 122603 159119 140685 77285 -10185 -96161 -151258 -153925 -100955 -13447 75563 136187 152031
351 152031 119224 45193 -46713 -123531 -155361 -132079 -65134 20560 98555 145329 144636 92209
363 92209 6332 -81281 -137451 -145594 -106849 -33788 51257 121736 150782 125504 55601 -30506
375 -30506 -102993 -140737 -133487 -81906 172 84136 137636 141037 96569 22450 -57581 -119824
$$ packed form
292a73103l843N9272J01630J05620P0912J4838m2093q4698j02286q6466l8999
303a79216K5008Q0210J02109Q8825M9023l408n8082r6089j00531o6897r037M8205
315a19880Q5073R5575P7420L2977k7492p8264j00388q4773m1923J1099O0497R1428
327A349R3759O1100N306n0634q6552r2277o8436k4199K9246P6155R6614Q1172
339A22603L6516j8434o3400q7470q5976n5097k667N2970Q7508Q9010O0624J5844
351A52031l2807p4031r1906p6818l1830K3282O6945Q5694P7995M6774o93n2427
363I2209q5877q7613n6170q143L8745P3061Q5045P0479K9046k5278o9903q6107
375c0506p2487l7744P250N1581Q2078Q3964N3500L401m4468p4119q0031o2243
$$ plain form
387 -119824 -143335 -117108 -47933 37472 107587 138889 124895 69987 -8435 -85472 -134557 -135825
399 -135825 -88722 -12181 65310 120529 135942 107257 39611 -42932 -110259 -137658 -116852 -59049
411 -59049 16479 88270 131536 129225 80395 3966 -72155 -121531 -130891 -97923 -32115 46430
423 46430 110398 134120 109987 48925 -26346 -91769 -128250 -122798 -74359 2336 76943 122075
435 122075 124875 86977 21611 -51712 -110354 -131639 -105113 -41248 34240 95378 124200 113569
447 113569 64863 -7838 -79973 -123216 -121836 -78509 -11648 57219 109155 125395 98514 35510
459 35510 -40026 -99573 -122846 -105542 -54795 14577 80646 121176 118587 72970 3900 -64409
471 -64409 -109491 -119461 -90006 -28878 44085 101700 122389 100403 45941 -22075 -83420 -117977
$$ packed form
387a19824k3511K6227O9175Q5405P0115L1302j3994n4908p8422p7037m9085j268
399a35825M7103P6541P7491N5219J5413k8685o7646q2543o7327k7399K0806N7803
411e9049P5528P1791M3266k311m8830p6429p6121m9376r360L2968O5808P8545
423D6430O3968K3722k4133o1062p5271o5423l6481N452M8439P6695P4607M5132
435A22075K800l7898o5366p3323n8642k1285K6526O3865P5488O1138K8822j0631
447A13569m8706p2701p2135m3243J380M3327O6861O8867N1936J6240k6881o3004
459C5510p5536n9547k3273J7304N0747O9372O6069M0530k589m5617o9070o8309
471f4409m5082r970K9455O1128P2963N7615K0689k1986n4462o8016o1345l4557
$$ plain form
483 -117977 -112891 -66890 2616 69032 110658 114698 82058 21707 -47874 -102460 -120279 -94973
495 -94973 -38674 29458 85938 114472 106270 60665 -7988 -73771 -111957 -110987 -73432 -13417 51581
508 51581 101165 116725 90743 32076 -36005 -90102 -112884 -99425 -52722 13231 75611 111445
520 111445 107741 67273 5469 -56827 -101033 -112052 -84617 -26030 41572 92591 111132 92960
532 92960 45857 -18003 -77629 -111095 -104400 -60844 2120 62016 100584 107202 78385 21277
544 21277 -45110 -95252 -110367 -87517 -36310 24303 78191 107211 100207 56849 -7245 -67077
556 -67077 -102191 -102821 -70184 -14849 47256 94400 108495 83355 30311 -31471 -81359 -104801
568 -104801 -94409 -50977 11192 69977 102898 99341 63528 7988 -50527 -94085 -105999 -79352
$$ packed form
483a17977N086M6001O9506O6416M1626M040l2640o0351o9581n4586j7819K5306
495i4973N6299O8132N6480K8534q202m5605o8653o5783l8186R70L7555O0015O4998
508E1581M9584J5560k5982n8667o8081n4097k2782J3459M6703O5953O2380L5834
520A11445l704m0468o1804o2296m4206j1019K7435N8587O7602N1019J8541j8172
532I2960m7103o3860n9626l3466O695M3556O2964N9896L8568O618k8817n7108
544B1277o6387n0142j5115K2850N1207O0613N3888K9020p004m3358o4094n9832
556f7077l5114o30L2637N5335O2105M7144J4095k5140n3044o1782m9888k3442
568a04801J0392M3432O2169N8785L2921l557l5813n5540n8515m3558j1914K6647
$$ plain form
580 -79352 -24643 37047 84057 102336 87917 44588 -14667 -71107 -102935 -97443 -57489 -232
592 -232 55570 93101 100863 74546 21338 -40329 -86402 -101488 -82871 -36646 20804 72436 100491
605 100491 93788 53540 -4580 -59645 -93485 -96754 -67997 -15846 43638 87782 100133 77681
617 77681 30659 -25321 -73379 -98157 -89518 -48903 10045 63605 94176 92156 61033 10002
629 10002 -45612 -87453 -98619 -74115 -24579 31722 75385 95238 83886 43629 -13409 -65588
641 -65588 -94694 -89834 -55060 -3597 48897 86276 95350 70129 19992 -36353 -78064 -92858
653 -92858 -78379 -37612 16652 67312 94224 87015 49388 -2402 -52421 -85479 -90941 -65341
665 -65341 -15913 39462 80662 92605 72987 31153 -20806 -67255 -91959 -83985 -46112 7675
$$ packed form
580g9352N4709O1690M7010J8279j4419m3329n9255n6440l1828N492L9954N7257
592b32N5802L7531P762k6317n3208o1667m6073j5086J8617M6225N7450N1632K8055
605A00491o703m0248n8120n5065l3840l269K8757N2151N9484M4144J2351k2452
617G7681m7022n5980m8058k4778Q639M0615N8948N3560L0571k020l1123n1031
629A0002n5614m1841j1166K4504M9536N6301M3663J9853j1352m0257n7038n2179
641f5588k9106M860L4774N1463N2494L7379R074k5221n0137n6345m1711j4794
653i2858J4479M0767N4264N0660K6912p209l7627n1790n0019l3058n462K5600
665f5341M9428N5375M1200J1943j9618m1834n1959m6449k4704P974L7873N3787
$$ plain form
677 7675 56559 85518 86510 59485 11915 -41575 -80943 -91111 -69524 -25000 26303 68146 89204
690 89204 79777 42209 -11388 -59755 -86163 -82869 -53855 -6750 43818 80146 88698 65543 19825
703 19825 -30803 -69933 -86621 -74517 -37529 13949 61263 86269 80192 47662 947 -45807
715 -45807 -79116 -86091 -62104 -15853 34784 71975 84297 69791 32319 -16940 -62141 -85342
727 -85342 -78126 -43198 4465 49169 77507 81505 58501 13032 -37480 -73645 -82941 -64676 -26120
740 -26120 20624 61900 82939 75124 40245 -8460 -52691 -77882 -77366 -52437 -9250 38582 73970
753 73970 82161 61444 20555 -25239 -62714 -80541 -71200 -36280 11809 54936 78035 74302 46743
766 46743 4134 -40514 -72707 -80209 -58414 -16230 30202 64362 77740 66236 32171 -14523
$$ packed form
677G675M8884K8959R92k7025m7570n3490l9368j0168K1587M4524N1303M1843K1058
690H9204r427l7568n3597m8367k6408L294K9014M7105N0568L6328Q552k3155m5718
703A9825n0628l9130j6688J2104L6988N1478M7314K5006o077l2530m6715m6754
715d5807l3309o975K3987M6251N0637L7191J2322j4506l7472m9259m5201k3201
727h5342P216L4928M7663M4704K8338L998k3004m5469n0512l6165r296J8265L8556
740b6120M6744M1276K1039p815l4879m8705m4231k5191N16K4929M3187M7832L5388
753G3970Q191k0717m0889m5794l7475j7827R341L4920M8089M3127K3099l733k7559
766D6743m2609m4648l2193p502K1795M2184M6432L4160J3378j1504l4065m6694
$$ plain form
778 -14523 -56427 -77999 -72045 -41684 1335 43311 71532 76380 54825 12995 -32991 -66374
790 -66374 -76202 -61192 -26519 17608 56872 76995 69496 37830 -5756 -46198 -70873 -72908 -50204
803 -50204 -9578 35328 67421 75215 57234 21255 -21114 -57002 -74686 -66505 -34413 9504
815 9504 48818 70863 69572 45315 5978 -36999 -67235 -73626 -54108 -16568 24620 57658 71877
828 71877 62597 31459 -11924 -50887 -70994 -66373 -40553 -1507 38228 66168 71722 50903 12922
841 12922 -28253 -59171 -70047 -58292 -26817 14521 51645 70615 64067 35983 -3128 -40444
853 -40444 -65296 -68373 -48101 -10077 31470 60950 68794 53840 21968 -17504 -52030 -69462
865 -69462 -62108 -32382 6679 43017 64502 64797 43862 7092 -33239 -61535 -67358 -50105 -17047
$$ packed form
778a4523m1904k1572N954L0361M3019M1976K8221M848k1555m1830m5986l3383
790f6374r828J5010L4673M4127L9264K0123p499l1666m3586m0442k4675k035K2704
803e0204M0626M4906L2093P794j7981l5979m2369l5888j7684Q181L2092M3917
815I504L9314K2045j291k4257l9337m2977l0236o391J9518L7540M1188L3038J4219
828G1877r280l1138m3383l8963k0107M621K5820L9046L9735K7940N554k0819l7981
841A2922m1175l0918j0876J1755L1475M1338L7124J8970o548k8084l9111l7316
853d0444k4852l077K0272L8024M1547K9480P844j4954l1872l9472l4526j7432
865f9462P354K9726L9061L6338K1485K95k0935l6770m0331k8296n823J7253L3058
$$ plain form
878 -17047 20524 52298 67556 59146 29522 -10610 -46003 -64271 -61585 -38684 -3233 34600
890 34600 61337 66050 47741 12892 -24659 -53759 -64964 -55131 -26196 12961 47522 64658
902 64658 58821 34634 -785 -36437 -60731 -64016 -44755 -9345 27770 54515 62899 51178 22647
915 22647 -15128 -48661 -64556 -56819 -30217 5122 38379 59031 60968 41874 6991 -30192
927 -30192 -56071 -62020 -47560 -17470 17497 48565 62644 55018 27682 -8604 -40878 -58767
939 -58767 -57953 -37953 -4044 31700 56292 60829 44457 13687 -20863 -48845 -60874 -52073 -24876
952 -24876 11498 42741 59105 54988 33681 1236 -32836 -56228 -59333 -41028 -9532 24053
964 24053 49485 58703 48949 21812 -13579 -44392 -59166 -52726 -29401 2894 34488 55329 57600
$$ packed form
878a7047L7571L1774J5258q410k9624m0132l5393j8268K686K2901L5451L7833
890C4600K6737M713j8309l4849l7551k9100j1205R833K8935L9157L4561J7136
902F4658n837k4187l5419l5652k4294l285J9261L5410L7115K6745Q384j1721k8531
915B2647l7775l3533j5895P737K6602L5339L3257K0652J937j9094l4883l7183
927c0192k5879n949J4460L0090L4967L1068J4079p626k7336l6286l2274j7889
939e8767Q14K0000L3909L5744K4592M537j6372l0770l4550k7982j2029Q801K7197
952b4876L6374L1243J6364m117k1307l2445l4072k3392l105J8305L1496L3585
964B4053K5432R218r754k7137l5391l0813j4774O440K3325L2295L1594K0841K271
$$ plain form
977 57600 39206 6982 -27310 -51003 -57347 -45083 -17915 16049 44803 58245 51185 26428
989 26428 -6857 -36611 -54563 -54446 -35778 -4193 29161 51810 55876 41977 13811 -18248 -45317
1002 -45317 -57067 -49031 -23090 10010 38587 54120 51639 32228 1396 -30696 -52177 -55099
1014 -55099 -38451 -10130 21247 45994 55339 46089 20582 -12540 -40488 -53865 -49419 -28990
1026 -28990 1416 31926 52067 54029 36076 6668 -24101 -46313 -53774 -43208 -17570 14448
1038 14448 42277 54071 47403 24891 -4720 -33115 -51373 -51853 -34448 -4188 26681 47564
1050 47564 52091 39742 14585 -16440 -42766 -53750 -45585 -21934 8455 35051 50495 49122
1062 49122 31513 1849 -28632 -48643 -51501 -36764 -11042 19127 42436 52554 43614 19571
$$ packed form
977E7600j8394l2224l4292k3693o344J2264K7168L3964K8754J3442p060k4757
989B6428l3285k9754j7952J17J8668L1585L3354K2649M066j3899k8166l2059k7069
1002d5317j1750Q036K5941L3100K8577J5533k481j9411l0832l2092k1481k922
1014e5099J6648K8321L1377K4747R345r250k5507l3122k7948j3377M446K0429
1026b8990L0406L0510K0141J962j7953k9408l0769k2212p461J0566K5638L2018
1038A4448K7829J1794o668k2512k9611k8395j8258m80J7405L0260L0869K0883
1050D7564M527j2349k5157l1025k6326j0984Q165K3651L0389K6596J5444j373
1062D9122j7609k9664l0481k0011k858J4737K5722L0169K3309J0118q940k4043
$$ plain form
1074 19571 -11125 -37337 -50143 -46837 -27734 484 29347 48768 49872 34374 7542 -20963
1086 -20963 -42709 -50612 -41373 -17313 13071 38462 50106 44672 24895 -3313 -30168 -48343
1098 -48343 -49097 -31953 -4850 23555 43282 48995 38528 14712 -15034 -39234 -49525 -42629 -21713
1111 -21713 5850 31829 47536 47407 30082 2136 -25759 -44118 -47941 -35517 -11879 16895
1123 16895 39965 49531 41093 18727 -9053 -33356 -46500 -44871 -27906 -398 27520 44841
1135 44841 46507 32943 8672 -18131 -39930 -48553 -39501 -16990 11511 35029 46303 42683 24454
1148 24454 -1848 -28204 -45311 -45864 -30508 -5438 20743 40257 46493 37054 14634 -13563 -36808
1161 -36808 -46277 -40067 -21486 4289 29260 44949 44523 28320 2497 -23496 -40925 -45050 -34500
$$ packed form
1074A9571l0696k6212j2806L306J9103K8218K8863J9421J104j5498k6832k8505
1086b0963k1746p903R239K4060L0384K5391J1644n434j9777k8208k6855j8175
1098d8343p54J7144K7103K8405J9727N713j0467k3816k9746k4200j0291O896K0916
1111b1713K7563K5979J5707j29j7325k7946k7895j8359l823J2424K3638K8774
1123A6895K3070R566q438k2366k7780k4303j3144J629J6965K7508K7918J7321
1135D4841J666j3564k4271k6803k1799q623R052K2511K8501K3518J1274l620j8229
1148B4454k6302k6356j7107n53J5356K5070K6181J9514O236r439k2420k8197k3245
1161c6808r469O210J8581K5775K4971J5689m26j6203k5823k5993j7429m125J0550
$$ plain form
1174 -34500 -11948 15137 37222 46405 38895 18412 -7424 -30639 -44371 -43016 -26665 -663
1186 -663 25334 41523 43916 31948 9334 -16965 -37643 -45456 -37329 -16164 9753 31828 43373
1199 43373 40831 24590 -1099 -26297 -41997 -42973 -29470 -6631 18146 37401 44407 35544 14165
1212 14165 -11968 -33151 -42956 -38582 -21613 2563 27045 42313 42020 27259 3677 -20253 -37755
1225 -37755 -43010 -33778 -12499 13312 34444 42856 36608 19147 -5313 -27784 -41459 -41084 -25656
1238 -25656 -1556 22230 38338 41572 30962 10419 -14810 -35125 -42712 -35364 -16233 7655
1250 7655 28553 40887 39417 23955 -201 -24057 -38756 -40030 -28866 -7594 15904 34910
1262 34910 41821 34405 14446 -10414 -30354 -40564 -37484 -21843 1687 24876 39242 39628 26719
$$ packed form
1174c4500K2552K7085K2085R183p510k0483k5836k3215j3732J355J6351K6002
1186f63K5997J6189K393j1968k2614k6299k0678p813Q127K1165K5917K2075J1545
1199D3373k542j6241k5689k5198j5700r76J3503K2839K4777J9255P006q863k1379
1212A4165k6133k1183r805M374J6969K4176K4482J5268k93j4761k3582k3930j7502
1225c7755n255R232K1279K5811K1132Q412o248j7461k4460k2471j3675L75J5428
1238b5656K4100K3786J6108L234j0610k0543k5229k0315p587P348J9131K3888
1250G655K0898J2334j470j5462k4156k3856j4699j274J1164K1272K3498J9006
1262C4910O911p416j9959k4860j9940j0210L080J5641K3530K3189J4366L86j2909
$$ plain form
1275 26719 4852 -17740 -35003 -40484 -32740 -12209 12052 31256 39890 35198 19082 -3635 -25888
1288 -25888 -39283 -38895 -24448 -2490 19640 34936 39472 30642 10809 -13081 -32457 -40090 -33480
1301 -33480 -16375 5680 26305 38235 37701 23328 894 -21506 -35631 -38166 -28232 -8846 14155
1314 14155 32268 39414 32880 14892 -7749 -27110 -37755 -35951 -21472 755 22676 36060
1326 36060 37262 25932 6648 -15346 -33026 -38975 -31347 -12578 9672 28129 37369 34110 19504
1339 19504 -2097 -23387 -36565 -36635 -24131 -3898 16897 32645 37861 29919 11156 -11244 -29389
1352 -29389 -37187 -32323 -17261 3566 24163 36363 35587 22555 2349 -18628 -32596 -36438 -27571
1365 -27571 -9379 12379 29972 36606 31118 15184 -5296 -24634 -35465 -34582 -20983 -141 20259
$$ packed form
1275B6719k1867k2592j7263n481P744K0531K4261J9204Q634m692j6116k2717k2253
1288b5888j3395L88J4447K1958K2130J5296M536q830j9833k3890j9376p633O610
1301c3480J7105K2055K0625J1930n34j4373k2434k2400j4125k535R934J9386K3001
1314A4155J8113P146o534j7988k2641j9361j0645J804J4479K2227K1921J3384
1326C6060J202j1330j9284k1994j7680n949P628J8769K2250J8457R240l259j4606
1339A9504k1601k1290j3178p0J2504K0233K0795J5748N216p942j8763k2400j8145
1352b9389p798M864J5062K0827K0597J2200p76j3032k0206k0977j3968l842Q867
1365b7571J8192K1758J7593O634n488j5934k0480j9338j0831Q83J3599K0842K0400
$$ plain form
1378 20259 33048 34991 26013 7705 -13451 -30567 -36505 -29739 -12631 7437 25325 34875 32786
1391 32786 19852 -1077 -21156 -33497 -34390 -23326 -5373 14502 30062 35611 28369 10943 -9118
1404 -9118 -26030 -34161 -31075 -17437 2105 22354 33743 33147 21925 3412 -15758 -30048 -34290
1417 -34290 -26908 -9903 10412 27332 34392 29667 15075 -3881 -22176 -32857 -32527 -20397 -1341
1430 -1341 17428 30343 33042 25501 8139 -11780 -27556 -33716 -28030 -13131 5829 22977 32851
1443 32851 31535 18888 96 -18917 -30417 -32105 -23098 -6678 12639 28025 33689 26709 11741
1456 11741 -7402 -23553 -31725 -29824 -17505 1173 19618 30937 31162 21004 4544 -13717 -27555
1469 -27555 -32601 -25880 -10061 8962 24288 31500 28096 15557 -2191 -20156 -30779 -30644 -20012
$$ packed form
1378B0259J2789J943q978j8308k1156j7116n938O766J7108K0068J7888R550k089
1391C2786j2934k0929k0079j2341q93J1064J7953J9875J5560N549p242j7426k0061
1404i118j6912q131L086J3638J9542K0249J1389n96j1222j8513j9170j4290m242
1417c4290P382J7005K0315J6920P060m725j4592j8956j8295j0681L30J2130J9056
1430a341J8769J2915K699p541j7362j9919j5776o160N686J4899J8960J7148R874
1443C2851j316j2647j8792j9013j1500j688R007J6420J9317J5386N664o980j4968
1456A1741j9143j6151q172J901J2319J8678J8445J1319K25j0158j6460j8261j3838
1469b7555n046O721J5819J9023J5326P212l404j2539j7748j7965j0623J35J0632
$$ plain form
1482 -20012 -2397 15090 27556 31347 24404 8625 -10118 -25105 -31159 -26719 -13512 3930 20550
1495 20550 30415 29672 18418 671 -16319 -27963 -30214 -22872 -7258 10774 25502 31050 25485
1508 25485 11370 -5510 -20794 -29814 -28327 -17162 487 17321 28276 28922 20665 5525 -11808
1521 -11808 -25735 -30322 -24248 -10274 7290 21788 29065 26446 15534 -1640 -18339 -28342 -28287
1534 -28287 -18957 -3449 12730 25259 29446 23116 8659 -8734 -22391 -28626 -25555 -13518 2500
1547 2500 18515 28191 27699 17800 1866 -14131 -25503 -28435 -21922 -7428 9724 23204 28356
1560 28356 23997 11815 -4015 -19020 -28065 -26994 -16159 -385 15290 25516 27164 20221 6175
1573 6175 -10725 -23478 -28165 -22796 -10407 5756 19678 26898 25833 14958 -745 -16717 -25309
$$ packed form
1482b0012J7615J7487J2466L791o943j5779j8743j4987o054M440J3207J7442J6620
1495B0550R865p43j1254j7747j6990j1644k251P342J5614J8032J4728N548n565
1508B5485j4115j6880j5284r020J487J1165J7649J6834J0955O46q257j5140j7333
1521a1808j3927m587O074J3974J7564J4498P277k619j0912j7174j6699j0003N5
1534b8287R330J5508J6179J2529M187o330j4457j7393j3657o235L071J2037J6018
1547B500J6015R676m92r899j5934j5997j1372k932O513J4494J7152J3480N152
1560B8356m359j2182j5830j5005r045J071J0835J5774J5675J0226J648o943j4046
1573F175j6900j2753m687N369J2389J6163J3922P220j065j0875j5703j5972q592
$$ plain form
1586 -25309 -26477 -18387 -4401 11570 23913 27935 21973 8250 -7286 -20384 -26453 -24605 -13600
1599 -13600 2201 16854 25912 25780 16818 2980 -12360 -23187 -26810 -20937 -7468 8224 20944
1612 20944 25891 22869 12059 -3150 -17460 -25975 -25022 -15529 -843 13461 23282 25667 19136 6178
1626 6178 -9348 -21629 -25953 -21457 -10093 4377 17635 25541 24356 14435 -623 -14894 -23442
1639 -23442 -24547 -17933 -5009 10305 22074 25758 20511 8757 -6059 -18168 -24866 -22961 -13116
1652 -13116 1503 15744 24032 23794 16042 3401 -10968 -21537 -24890 -19720 -7049 7391 19215
1665 19215 24547 21677 11840 -2352 -15991 -24110 -23440 -15011 -1558 11807 21696 24262 18643 5999
1679 5999 -8328 -19547 -24095 -20590 -10101 3551 16665 23647 22693 13801 51 -13024 -21790
$$ packed form
1586b5309j168Q090J3986J5971J2343M022n962j3723j5536j3098o069J848J1005
1599a3600J5801J4653R058j32q962j3838j5340j0827l623N873J3469J5692J2720
1612B0944M947l022j0810j5209j4310q515R53R493J4686J4304R821K385o531j2958
1626F178j5526j2281m324M496J1364J4470J3258P906j185r921j5058j4271q548
1639b3442j105O614J2924J5314J1769L684n247j1754j4816j2109o698J905R845
1652a3116J4619J4241Q288k38p752j2641j4369j0569l353N170J2671J4440J1824
1665A9215N332k870r837j4192j3639q119O70Q429J3453J3365R889K566n619j2644
1679E999j4327j1219m548L505J0489J3652J3114O982r54q892j3750j3075q766
$$ plain form
1692 -21790 -23639 -17133 -4870 9529 20503 24124 19245 8954 -4871 -16789 -23540 -22329 -12467
1705 -12467 1271 14053 21864 22388 15769 3821 -9782 -20823 -23629 -18630 -7327 6151 17439
1718 17439 22998 21066 11559 -2174 -15008 -22218 -21883 -14481 -2238 10811 20608 23264 17966 6155
1732 6155 -7574 -18182 -22508 -19773 -9957 3094 15550 22256 21150 13342 710 -11742 -20192
1745 -20192 -22452 -16728 -5262 8330 18711 22373 18953 8777 -4205 -15925 -22423 -20822 -11994
1758 -11994 375 12779 20444 21710 15348 4135 -9134 -19163 -22400 -17643 -7362 5293 16281
1771 16281 21934 20052 11207 -1587 -13789 -20723 -20963 -13994 -2661 9840 19668 21737 16852 6376
1785 6376 -6528 -16740 -21459 -18783 -10384 2589 14286 21146 20400 13180 1329 -10915 -19359 -21475
$$ packed form
1692b1790j849O506J2263J4399J0974L621m879j0291j3825j1918o751J211R862
1705a2467J3738J2782P811N24o619j1948j3603j1041k806M999J1303J3478J1288
1718A7439N559j932r507j3733j2834p210L35P402J2243J3049R797K656n298j1811
1732F155j3729j0608m326K735R816J3051J2456O706j106p808j2632j2452q450
1745b0192k260N724J1466J3592J0381L662l420j0176j2982j1720o498J601Q828
1758a1994J2369J2404P665J266o362j1213j3269j0029l237M757J0281J2655J0988
1771A6281N653j882q845j2794j2202o934k40O969J1333J2501R828K069m885j0476
1785F376j2904j0212m719K676Q399J2973J1697O860p46p220j1851j2244q444k116
$$ plain form
1799 -21475 -16102 -5067 7438 16987 21289 18101 9026 -3421 -14690 -21018 -19559 -11991 -451
1812 -451 11511 19337 20859 15488 4052 -8438 -17587 -21070 -17146 -7466 4373 15233 20876 19359
1826 19359 10779 -908 -12332 -19491 -19676 -13996 -3159 9053 18315 20873 16165 6171 -5353 -14973
1840 -14973 -20504 -18812 -9847 1876 12912 19754 19372 13020 2078 -9285 -18256 -20346 -15488 -5253
1854 -5253 6516 15710 20160 17882 9055 -2844 -13429 -19898 -18956 -11883 -907 10217 18084 20221
1868 20221 14941 4363 -7454 -16276 -19740 -16808 -8036 3490 14170 20135 18680 10917 -225
1881 -225 -11081 -18296 -19298 -14147 -3832 8067 17034 19705 15706 6988 -4569 -13978 -19572 -18304
1895 -18304 -10220 1299 11971 18191 18592 12773 2734 -8699 -17331 -19641 -15138 -5488 5209 14676
$$ packed form
1799b1475N373J1035J2505R549M302l188r075j2447j1269o328J459P568J1540
1812d51J1962P826J522n371j1436j2490r149l483L924R680J1839J0860N643j517
1826A9359q580j1687j1424p159j85N680J0837J2212R262K558m708r994j1524r620
1840a4973n531J692Q965J1723J1036O842l82o352j0942j1363q971k090M858J0235
1854e253J1769R194M450k278q827j1899j0585o469R42P073J0976J1124P867K137
1868B0221n280j0578j1817q822l464K932Q772J1526J0680N965j455p763j1142
1881b25j0856p215j002N151J0315J1899Q967K671l999q718j1557r409n594J268
1895a8304Q084J1519J0672O220M01n819j0039j1433q632k310M503R650J0697R467
$$ plain form
1909 14676 19215 17216 9065 -1840 -12507 -18606 -18020 -12013 -1819 9387 17030 19439 14256 4698
1923 4698 -6175 -15016 -18824 -16594 -8143 2836 12983 18502 17287 10626 502 -9725 -16932 -18775
1937 -18775 -13981 -4087 7413 15600 18504 15355 7444 -3359 -13160 -18538 -17412 -9922 380 10469
1951 10469 16964 18126 13191 3394 -7680 -16161 -18635 -14715 -6275 4093 13499 18282 16762 9377
1965 9377 -1359 -11325 -16900 -17500 -12000 -2793 8083 15798 18436 13809 5314 -4946 -13649 -17788
1979 -17788 -15800 -8488 2197 12017 17223 16636 11008 1585 -8987 -16128 -17559 -13314 -4150 5983
1993 5983 13791 17452 15273 7857 -2773 -12433 -17148 -16452 -10128 -160 9217 15853 17440 12561 3399
2008 3399 -6565 -14688 -17335 -14343 -6547 3479 12355 17071 16050 8886 -691 -10195 -16030 -17091 -11984
$$ packed form
1909A4676M539j999q151j0905j0667o099N86O007J0194J1206P643K409n183r558
1923D698j0873q841l808K230Q451J0979J0147N519j215o661j0124j0227p207j843
1937a8775M794R894J1500Q187K904l149p911j0803r801n378J126P490J0302J0089
1951A0469O495J162m935r797j1074q481k474L920Q440J0368R406M783j520p385
1965I377j0736r966n575o00N500R207J0876P715K638m627q495j0260q703m139
1979a7788J988P312J0685R820N206n87n628r423j0572p141j431M245R164J0133
1993E983P808L661k179p416j0630r660m715O96O324R968R377O636J587m879r162
2008C399r964q123k647K992P796J0026Q876M716j021p164r577r504n835j061N107
$$ plain form
2023 -11984 -2927 7431 14769 17106 13517 5436 -3977 -12794 -16782 -15484 -8624 1107 10539 15933
2037 15933 16277 10588 2089 -7782 -14803 -16973 -12929 -4759 5158 12726 16407 15055 7668 -2056 -11024
2052 -11024 -16153 -15843 -9803 -1341 8203 14976 16600 12317 3541 -5856 -13401 -16598 -13902 -7156 2693
2067 2693 11509 16127 14874 9322 519 -8893 -14733 -16254 -11529 -3301 6644 13548 16102 13280 6072
2082 6072 -3273 -11564 -16000 -14793 -8116 544 9573 14706 15459 10627 2435 -7104 -13784 -15957 -12320
2097 -12320 -5070 4093 11652 15856 14376 7849 -1511 -9942 -14764 -14714 -9728 -2046 7408 14053 15773
2112 15773 11729 4267 -4828 -12174 -15368 -13834 -6990 2112 10318 15095 14511 9196 1033 -7479 -14054
2127 -14054 -15513 -11207 -3264 5528 12396 15053 12767 6342 -2319 -10608 -14794 -14110 -8103 -96 8261
$$ packed form
2023a1984R057J0358P338K337l589q081r413q817l988J298O860R731R432N394
2037A5933L44n689q499r871p021k170M044Q170R917P568L681j352p387r724q968
2052a1024n129L10O040Q462R544O773J624m283q776r397p545l197K696O746R849
2067B693Q816M618j253n552q803r412n840j521M725Q228R945O904K554k822p208
2082F072r345q291m436J207O677Q660R029N133P53m832q192r539o680k173L637
2097a2320P250R163P559M204j480o527r360q431m822N0M986P682R454O645J720
2112A5773m044p462r095p346l194J534O844R102Q206M777n84n315q163q512o575
2127a4054j459M306P943Q792O868K657k286o425q661q289m186O84O007Q007Q357
$$ plain form
2142 8261 13545 14929 10782 2778 -6015 -12580 -14986 -12283 -5627 3096 11165 14659 13569 7824 -853
2157 -853 -8996 -13571 -14417 -9968 -2324 6504 13084 14741 11288 4552 -4012 -10844 -14469 -13105 -6997
2172 -6997 1491 9256 13989 13926 9100 1339 -6771 -12798 -14579 -11018 -3689 4739 11089 14320 12329
2187 12329 6109 -2194 -9575 -14109 -13310 -8212 -747 7337 12790 14021 10469 3072 -5523 -11414 -13687
2202 -13687 -12069 -5549 2802 9856 13986 12852 7376 -306 -7890 -12823 -13351 -9561 -2135 5989 11786
2217 11786 13896 10661 4616 -3323 -10288 -13828 -12295 -6774 902 8493 12862 13322 8896 1535 -6366
2232 -6366 -11914 -13545 -10240 -4179 3750 10384 13347 12231 6297 -1616 -8766 -12869 -12540 -8113 -808
2247 -808 6559 11876 13062 9804 3092 -4655 -10884 -13247 -11279 -5569 2135 9006 12957 12314 7512
$$ packed form
2142H261N284J384m147q004q793o565k406K703O656Q723Q069L494j090n745q677
2157h53q143m575q46M449P644Q828O580J657l453o736q564o832l625J364O108
2172f997Q488P765M733o3m826p761q110o027j781L561P329Q428O350L231j991
2187A2329o220q303p381m534P99N098P465Q084N453J231l552p397q595n891k273
2202a3687J618O520Q351P054M130j134n476p682p584m933n28L790P426Q124N797
2217A1786K110l235o045p939o965l540J533N521P676P591M369M60m426p361p901
2232f366n548j631L305O061P929O634K963j116n934p913p150m103L29M427P305
2247h08P367N317J186l258o712p747o229k363J968N710P704O871L951o43m802
$$ plain form
2262 7512 281 -7066 -12297 -12953 -9443 -2233 5176 10965 13095 10638 5049 -2817 -9498 -12982 -11654
2277 -11654 -6379 889 7465 12187 12480 8527 1927 -5382 -11018 -12498 -9673 -4012 3201 9435 12925
2292 12925 11495 5793 -1182 -8061 -12009 -11986 -8121 -1315 5870 11582 12507 9333 2992 -3850 -10195
2307 -10195 -12286 -11081 -5639 1935 8557 11858 11681 6899 491 -6903 -11379 -12080 -8917 -2426 4791
2322 4791 9809 12171 10327 4911 -2190 -8586 -12075 -11312 -6683 192 6991 11580 12008 8191 1968
2337 1968 -5161 -10533 -11721 -9964 -4308 2803 8808 12207 10798 5970 -750 -7139 -11338 -11552 -7969
2352 -7969 -1301 5510 10463 11766 9249 3665 -3433 -9132 -11896 -10558 -5753 1619 7743 11423 11045
2367 11045 7248 1129 -6111 -10827 -11920 -8592 -2508 3981 9747 11468 9683 5148 -1974 -7913 -11313
$$ packed form
2262G512p231p347n231o56L510P210P409N789K130k457n589p866o681l484J328
2277a1654N275P268O576M722K93l953o600p309n636j480K825N661P213O234L490
2292A2925j430n702o975o879l948K3L865O806P185N712R25l174o341o842o345
2307a0195k091J205N442P574O622L301j77m782o408p394m476p01L163O491P217
2322D791N018K362j844n416p101o396l489P63M629O875O799M589M28l817o223
2337A968p129n372j188J757N656P111O005L399j409m828o720o389m199k14L583
2352g969O668O811M953J303k517n584p098n699k764J338M805P372O124L680l78
2367A1045l797o119p240m716j093L328O084O489N766J721j785m535p122n939l400
$$ plain form
2382 -11313 -10599 -6608 -204 6297 10895 11770 8403 1817 -4322 -9656 -11394 -9628 -4595 2671 8631
2397 8631 11450 10235 5970 -499 -6594 -10829 -11093 -7813 -1362 5203 10012 11393 8570 3831 -2878
2412 -2878 -8440 -11087 -10228 -5397 1207 7095 10610 10751 7317 953 -5301 -10082 -10895 -8416 -2695 3650
2428 3650 8521 11324 9745 4620 -1906 -7504 -10309 -10241 -6509 -620 5940 10189 10984 7878 1930 -4044
2444 -4044 -8859 -10983 -9111 -4326 2323 8107 10585 9954 5862 -129 -6310 -9833 -10927 -7677 -1670
2459 -1670 4607 9035 11165 8990 3298 -2729 -8358 -11152 -9801 -5413 768 6545 10302 10599 7273
2474 7273 1248 -5188 -9237 -10580 -8217 -3488 3071 8160 10942 9226 4959 -1263 -7148 -10362 -9918
2489 -9918 -6902 -1043 5617 9613 10455 7462 2533 -3243 -8077 -10518 -9057 -4447 1869 7519 10447
$$ packed form
2382a1313P14L991O404O501M598Q75l367o586o139n334j738J766N033P266N960
2397H631K819j215m265o469o095m235k64L280O451O565M809J381k823m739o709
2412b878n562k647Q59M831O604N888L515J41l434o364o254m781q13K479N721O345
2428C650M871K803j579n125o526n598k805O8L732N889O560M249P95l106n948n974
2444d044m815k124J872M785O649N784K478o31m092n991o181l523j094L250O007
2459a670O277M428K130k175n692o027n629k794J351M388O181N777L757K97l326
2474G273o025o436m049j343K363M729O559N089K782j716m267o222n885l214M44
2489i918L016N859O660L996Q42k993m929n776m834k441J461M610O316N650K928
$$ plain form
2504 10447 9966 6241 480 -5800 -9649 -10390 -7098 -1855 3978 8619 10327 8643 3837 -2223 -7486
2519 -7486 -10163 -9515 -5375 256 6078 9979 10334 6985 1598 -4570 -8934 -9920 -8231 -3376 2664 7538
2535 7538 10491 9019 4577 -825 -6323 -9794 -10097 -6434 -736 5140 9018 10077 7993 2818 -3214
2550 -3214 -8195 -10033 -9020 -4415 1569 6791 9592 9855 6536 472 -4864 -9361 -9941 -7042 -2345
2565 -2345 3469 8089 9899 8631 4034 -1988 -6866 -9849 -9053 -5513 -219 5773 9220 9999 6810
2580 6810 1710 -4058 -8452 -9860 -8166 -3883 2239 7279 10075 8921 4934 -662 -5999 -9464 -9711
2595 -9711 -6669 -1303 4815 8653 9695 7730 2979 -2787 -7645 -9755 -8491 -4603 740 5868 9215
2610 9215 9218 6123 980 -4346 -8626 -9555 -7046 -2638 3156 7689 9855 8549 4135 -1601 -6564 -9452
$$ packed form
2504A0447m81l725n761o280l849p41L292N243N833M641J708j684m806o060n263
2519g486k677O48M140N631N822L901L55l349n387o168m364r86J689M855O040M874
2535G538K953j472m442n402n498l471l03L663N698N876L878J059k084n175o032
2550c214m981j838J013M605N984N222K801K63l319o064n336m497n80K899M697
2565b345N814M620J810j268m597o022m878k983P96L540N294N992L447P79l189
2580F810n100n768m394j408J694M283O122N040K796j154l987n596n337l465k47
2595i711L042N366O118L838J042j965m751n766m858k110J264L888N343N128L347
2610I215Ll095n143n326m280r29K509M408N794M533K166j306m414n736m963k888
$$ plain form
2626 -9452 -9002 -5741 -652 5144 8473 9202 6889 2214 -3411 -7762 -9628 -7927 -3663 2037 6514
2641 6514 9173 8551 5232 107 -5160 -8911 -9374 -6533 -1563 4021 7681 9153 7671 3652 -1978
2656 -1978 -7050 -9607 -8290 -4731 73 5569 8849 8955 5995 1326 -4164 -8150 -9425 -7376 -2827
2671 -2827 2313 7259 9276 8172 4134 -987 -5704 -8224 -8961 -5995 -720 4514 8346 9087 6912
2686 6912 2503 -2590 -7186 -9439 -7767 -3978 1593 6012 8823 8548 5348 213 -4478 -8227 -9086
2701 -9086 -6354 -1457 3073 7362 9148 7953 3346 -2001 -6467 -8610 -8095 -4623 206 5114 8339
2716 8339 8643 6200 1286 -3562 -7558 -8644 -6932 -3092 1875 6648 8745 7680 4251 -432 -5471
2731 -5471 -8162 -8315 -5751 -919 4225 7821 8503 6863 2728 -2544 -6624 -8573 -7737 -3864 1065 5351
$$ packed form
2626i452M50L261N089N796L329P29k313m675n625m351j866J701M264N700M477
2641F514K659o22l319n125n267l751m63K841M970N584L660J472j482m019n630
2656a978n072k557J317L559M804N496L280J06k960m669n490l986j275K049M549
2671b827N140M946K017j104m038n121m717k520p37K966N275N234L832P41k175
2686F912m409n093m596k253J672L789N571M419K811k75l200n135m691l749q59
2701i086K732M897M530M289J786j195m607n347m466k143N15L472M829M908L225
2716H339L04k443m914m848l996j086J712L840M967M773K097j065l429m683n039
2731e471k691j53K564M832N144L596O82j640m135n272m080j949Q36L873M929M286
$$ plain form
2747 5351 8189 8591 5584 517 -4308 -7962 -8544 -6369 -2159 2545 6713 8550 7213 3451 -1658
2762 -1658 -5659 -8348 -8003 -4972 -409 4515 7822 8332 5862 1673 -3125 -6821 -8197 -6712 -3520
2777 -3520 1565 6033 8378 7599 4504 69 -5009 -7772 -8037 -5575 -1150 3661 6898 8361 6736
2792 6736 2871 -2049 -6390 -8374 -7190 -4052 509 5054 7552 7925 5684 1017 -4162 -7067 -7999
2807 -7999 -6424 -2387 2363 6573 8073 7105 3684 -968 -5415 -7515 -7484 -5126 -514 4287 7304 7893
2823 7893 5892 1737 -2811 -6450 -7800 -6699 -3082 1305 5393 7661 7547 4740 227 -4464 -7658
2838 -7658 -7724 -5283 -1514 3110 6727 8059 6330 2875 -1712 -5703 -7683 -7178 -4112 507 4403 7235
2854 7235 7680 5148 1085 -3428 -6716 -7362 -6056 -2503 2051 5925 7768 7389 3681 -908 -4726 -7472
$$ packed form
2747E351K838M02l007n067m825l654n82K175M210M704M168J837j337l762n109
2762a658m001k689L45L031M563M924L307N10k470m189m798l696j376J485L192
2777c520N085M468K345p79l095m435n078k763k65K462M425M811L237J463j625
2792F736l865m920m341j984J184L138M561M545K498L73k241m667n179k905r32
2807g999J575M037M750M210J500r68l421m652m447k100L1K358M612M801L017N89
2823G893k001m155m548l639j350J101L617M387M088K268j14k807m513m691l194
2838g658o6K441L769M624L617J332j729l455m587l991j980N05L066M619L896K832
2854G235M45k532m063m513l288o46J306L553M554L874J843l79l708m589l818k746
$$ plain form
2870 -7472 -7391 -5009 -683 4153 6753 7379 5792 1823 -2416 -6084 -7543 -6410 -3182 994 5112 7475
2886 7475 7391 4257 434 -3869 -6894 -7169 -5420 -1676 2520 6516 7517 6403 3154 -1250 -5120 -7484
2902 -7484 -6967 -4308 -61 3922 7021 7295 4867 1018 -3516 -6285 -7400 -5936 -2945 1717 5450
2917 5450 7344 6643 3768 -224 -4359 -6895 -7171 -4803 -635 3450 6339 7035 5964 2092 -2374 -5737
2933 -5737 -7449 -6215 -3515 808 4358 7191 6799 4668 572 -3733 -6571 -6726 -5285 -1609 2231
2948 2231 5583 7016 6148 3033 -1469 -4779 -7133 -6676 -4341 -45 3681 6627 6873 4919 1320 -2849
2964 -2849 -5807 -7007 -5804 -2501 1675 5286 6827 6288 3598 122 -3732 -6655 -6810 -4670 -668
2979 -668 2910 6004 7051 5679 2260 -1935 -5317 -7001 -6109 -3370 485 4379 6681 6763 4673 533
$$ packed form
2870g472Q1K382M326M836K600O26j587l969m239l668j459J133L228M176M118K363
2886G475q4l134l823m303l025k75J749L744M196L996J001j114l249m404l870k364
2902g484N17K659M247L983L099K74k428l849m534k769j115J464K991M662L733
2917E450J894p01k875l992m135k536k76K368M168M085K889O96j071l872m466l363
2933e737j712J234K700M323L550K833l92k131m096m305k838j55J441L676L840
2948B231L352J433q68l115m502l310k354M57K335M296L726K946K46j954l599m169
2964b849k958j200J203L303M176L611J541n39k690l476l854k923j55K140M002
2979f68L578L094J047j372l419m195l382j684Q92K739L855L894K302Q2k090m140
$$ plain form
2995 533 -3448 -5899 -6610 -5287 -1962 2092 5675 7133 6037 2780 -985 -4535 -6652 -6446 -4340 -297
3011 -297 3418 6187 6548 4671 1449 -2710 -5511 -6794 -5782 -2645 1329 4706 6458 5848 3509 -66
3027 -66 -3849 -6150 -6435 -4420 -1174 2896 5489 6587 5582 2416 -1542 -4846 -6541 -5823 -3235 76
3043 76 4193 6253 5999 4565 477 -3230 -5611 -6208 -5138 -2183 1947 5160 6476 5574 2857 -814
3059 -814 -4349 -6325 -6068 -3918 -302 3412 5722 6492 4802 1686 -1804 -5150 -6498 -5724 -2570 1143
3075 1143 4315 6230 5852 3723 144 -3565 -5833 -6546 -4378 -1340 2389 5394 6313 5307 2420 -1111
3091 -1111 -4492 -5960 -5894 -3452 -3 3802 5856 6248 4529 1052 -2649 -5531 -6142 -5306 -2227 1574
3107 1574 4868 6224 5537 3090 -424 -3874 -6083 -6457 -4261 -458 3067 5486 6566 4692 1845
$$ packed form
2995E33l981k451p11J323L325M054L583J458j096l257l765l550k117K06K106M043
3011b97L715K769L61j877l222m159k801j283J012L137L974L377J752o10k339l575
3027f6l783k301k85K015L246M070K593J098j005l166l958l304j695P18K588L311
3043G6M117K060k54j434m088l707k381n97J070K955M130L213J316r02k717l671
3059h14l535j976K57K150L616L714K310P70j690l116l490l346j348P74L154L713
3075A143L172J915l78k129l579l709k268p13K168L038L729L005R19j006k887l531
3091a111l381j468O6K442L449L805K054L92j719l477l701k882o11Q36L079L801
3107A574L294J356o87k447l514l450k209l74K196L803L525K419J080j874k847
$$ plain form
3122 1845 -2094 -4675 -6300 -5449 -3043 837 4026 6121 5989 3627 331 -2993 -5474 -6099 -4569 -1298
3138 -1298 2144 5277 6142 5591 2326 -1245 -4432 -5957 -5418 -3602 -77 3314 5832 5994 4118 1119
3154 1119 -2526 -5122 -6289 -5094 -1842 1365 4277 5977 5779 3102 -162 -3580 -5814 -5889 -4029 -713
3170 -713 2710 5101 6059 4849 1826 -1806 -4618 -6025 -4930 -2915 610 3608 6083 5789 3562 408
3186 408 -3037 -5413 -6037 -4650 -1756 1977 4926 5848 4917 2352 -956 -4003 -5886 -5597 -3487 -337
3202 -337 3303 5342 5718 4200 1270 -1825 -5082 -5876 -4994 -2132 1374 4351 5725 5545 3101 17
3218 17 -3224 -5559 -5521 -3987 -909 2257 5097 5536 4574 1900 -1579 -4428 -5835 -5209 -3135 390 3777
3235 3777 5446 5661 3962 668 -2652 -4900 -6013 -4610 -2059 1685 4474 5994 5098 2828 -612
$$ packed form
3122A845l939k581j625Q51K406L880L189K095j32k362l296l324k481o25J530L271
3138a298L442L133Q65n51l265l571l187j525N39J816L525L391K518J62j876k999
3154A119l645k596j167J195L252L207K912J700j98k677l264l418k234p5J860L316
3170g13L423K391R58j210l023l632k812j407J095K015L525K998K475k94k227l154
3186D08l445k376o24J387K894L733K949R22r31k565l308l047j883K89K110L150
3202c37L640K039L76j518k930l095l257p94Q82K862L506K977J374j80k444l084
3218A7l241k335L8J534L078L166K840M39r62k674l479k849j407O26K074L525L387
3235C777J669K15j699l294l320k248j113J403K551L744K789J520q96k270l440
$$ plain form
3250 -612 -3508 -5407 -5268 -3656 -562 2986 4987 5699 4558 1395 -1958 -4531 -5772 -4885 -2158 808
3266 808 3575 5625 5129 3260 17 -2909 -5209 -5570 -4124 -1006 2367 4653 5779 4659 1955 -1465
3282 -1465 -3809 -5497 -5417 -3042 102 3378 5390 5291 3956 935 -2351 -4844 -5790 -4637 -1870 1623
3298 1623 4150 5518 5012 2806 -418 -3240 -5118 -5301 -3533 -674 2573 5058 5428 4419 1541 -1630
3314 -1630 -4487 -5716 -4948 -2477 450 3723 5310 5662 3425 112 -2911 -4797 -5154 -4078 -1371 1756
3330 1756 4305 5269 4737 2102 -1095 -3880 -5188 -5268 -3336 63 3237 5376 5345 3810 1052 -2234
3346 -2234 -4759 -5139 -4588 -1965 1234 4072 5343 4726 2956 -222 -3408 -4865 -4989 -3310 -855 2420
3362 2420 4280 5626 4061 1674 -1772 -4228 -5234 -4667 -2568 562 3264 4912 4819 3402 624 -2509
$$ packed form
3250f12k896j899J39J612L094L548K001P12j141l163l353k573j241Q87K727K966
3266H08K767K050m96j869l243k926k300l61J446L118L373K286J126j120k704l420
3282a465k344j688Q0K375L144L276K012r9j335l021l286k493r46J153K767L493
3298A623K527J368n06k206l224k822j878j83J768K859L247K485L70j009k878l171
3314a630k857j229P68K471K927L273J587L52k237l313l023j886l57J076K707L127
3330A756K549R64n32k635l197k785j308q0J932L399L174K139l1j535k758l286
3346b234k525l80N51K623L199K838J271o17j770l178l186j457j24J679K455L275
3362B420J860J346j565k387l446k456j006N67K099L130K702J648r3j417k778l133
$$ plain form
3378 -2509 -4708 -5439 -4268 -1448 1996 4253 5194 4652 2334 -790 -3031 -5170 -4995 -3126 -23 2831
3394 2831 4843 5101 3763 1622 -1564 -4393 -5224 -4144 -2333 897 3476 5002 4994 2945 155 -2786
3410 -2786 -4468 -4915 -3730 -1009 2282 4319 4937 4506 1745 -1245 -3725 -4706 -4465 -2799 85 2987
3426 2987 4806 5016 3401 589 -2279 -4332 -4841 -3806 -1307 1404 3690 4847 4535 2517 -249 -3055
3442 -3055 -4711 -4968 -3245 -448 2313 4326 5062 4045 1248 -1564 -4023 -4872 -4106 -1821 636 3182
3458 3182 4907 4630 2842 -267 -2646 -4558 -4657 -3584 -1212 1812 3945 4798 4218 1604 -970 -3205
3474 -3205 -4670 -4306 -2945 135 2948 4395 4337 2972 822 -1795 -3875 -4641 -3543 -1611 1302 3356
3490 3356 4868 4320 2629 -612 -2947 -4530 -4783 -3203 -454 2370 4323 4619 3391 1471 -1684 -3652
$$ packed form
3378b509k199p31J171K820L444K257R41n42k318l124k241k139J75J869L103K854
3394B831K012K58j338k141l186k829q31J080J811L230K579J526qk049k790k941
3410b786j682m47J185K721L291K037O18m31k761k990k480r81K41J666K884K902
3426B987J819K10j615k812k868k053n09J035K499K711K286J157l12k018k766k806
3442c055j656k57J723K797K761K013P36j017k797k812k459q49P66K285K457K546
3458C182J725k77j788l109k379j912r9J073K372L024K133Q53n80k614k574k235
3474c205j465L64J361L080K813J447n8j365k150k617k080p66J098J932K913K054
3490C356J512n48j691l241k335j583k53J580K749K824J953K96j228j920l155j968
$$ plain form
3506 -3652 -4364 -3895 -1959 372 3022 4638 4384 2964 102 -2222 -4192 -4367 -3276 -1469 1660 3836
3522 3836 4630 3946 1789 -713 -3128 -4493 -4587 -2560 -8 2515 4333 4282 3137 944 -1531 -3843
3538 -3843 -4576 -3671 -1691 1278 3167 4668 3985 2553 -193 -2414 -4386 -4262 -2992 -593 2062 3684
3554 3684 4770 3570 1310 -878 -3230 -4227 -4087 -2221 250 2953 4352 4375 2761 447 -2327 -3996
3570 -3996 -4236 -3272 -1267 1369 3569 4400 3781 1948 -795 -2861 -4336 -4289 -2302 -56 2202 3925
3586 3925 4386 3124 762 -1685 -3597 -4421 -3493 -1790 839 3145 4419 3841 2525 185 -2644 -4153
3602 -4153 -4335 -2759 -1091 1458 3854 4459 3549 1174 -1175 -2829 -4126 -3832 -2444 343 2620 3802
3618 3802 4450 2891 462 -1824 -3595 -4225 -3026 -1072 1277 3273 4293 3781 2244 -247 -2693 -4493
$$ packed form
3506c652p12M69J936K331K650J616k54j420k862k324j970j75J091J807L129K176
3522C836P94o84k157k502k415j365r4K027K552K523J818n1j145k193k475k312
3538c843p33R05J980K969J889J501o83j432k746k221j972J24J270K399K655J622
3554C684J086j200k260k188k352r97J40J866K471K703J399K3j614k314k774j669
3570c996k40R64K005K636K200Q31o19j833k743k066j475M7J987K246K258J723
3586C925M61j262k362k447j912q24R28J703K629K306J274n78j316k340k829j509
3602d153j82J576J668K549K396O05r10k375k349j654j297K94J388K787K277J182
3618C802O48j559k429k286j771o30J199J954K349J996J020n12j537k491k446j800
$$ plain form
3634 -4493 -4319 -2776 -92 2056 3811 4428 3380 1317 -1213 -3567 -4027 -3713 -1595 639 2878 3952
3650 3952 4213 2121 -150 -2382 -3965 -3843 -3055 -860 1655 3628 4244 3653 1264 -886 -3127 -4182
3666 -4182 -3890 -2195 273 2633 3998 4184 3059 603 -1613 -3690 -3803 -3182 -994 1038 3232 3949
3682 3949 3652 2033 -610 -2524 -4020 -4099 -2712 -328 2033 3664 4071 3115 1314 -1608 -3142 -4140
3698 -4140 -3549 -1799 544 2985 3932 3769 2271 -65 -2229 -3303 -4070 -2934 -1221 1722 3294 3973
3714 3973 3213 1752 -645 -2790 -3880 -3795 -1985 136 2138 3459 3785 2632 631 -1464 -3300 -4042
3730 -4042 -3083 -1179 731 2986 4129 3610 2146 -398 -2297 -3733 -4027 -2414 -309 1884 3487 4011
3746 4011 2907 1176 -1046 -2873 -4132 -3335 -1761 357 2710 3636 3802 2528 545 -1988 -3686 -3956
$$ packed form
3634d493J74J543K684K148J755O17j048k063k530k354m60L14K118K234K239J074
3650C952K61k092k271k232j583J22P88K195K515J973O16n91k389k150k241j055
3666d182K92J695K468K360J365J86j125k456k216k077j13O21K188K032K194P17
3682C949k97j619k643j914j496p9J387K384K361J631M07r56j801k922j534r98
3698d140N91J750K343K441R47j63j498k336k164j074p67J136J713K943J572O79
3714C973p60j461k397k145j090Q5J810K121K002J321L26j153k001k095j836p42
3730d042R59J904J910K255J143n19j464k544j899j436k94J613K105K193J603N24
3746D011j104j731k222j827j259P97J574K118K353R26J66j274j983k533j698k70
$$ plain form
3762 -3956 -2872 -1117 1472 3135 3830 3212 1606 -406 -2641 -3884 -3783 -2195 -189 2304 3271 3866
3778 3866 2679 872 -1535 -3231 -3844 -3212 -1414 681 2338 3975 3634 2091 -66 -2161 -3793 -3524
3794 -3524 -2723 -466 1794 3391 3783 3047 1227 -913 -2810 -3837 -3905 -1968 509 2495 3479 3578 2511
3811 2511 207 -1777 -3232 -3807 -2848 -878 1131 2919 3554 3298 1703 -574 -2566 -3782 -3655 -2203
3827 -2203 -184 2029 3568 4055 2950 877 -1513 -3055 -3816 -2972 -1539 800 2591 3563 3431 2270
3843 2270 89 -1998 -3082 -3991 -2760 -609 1400 3569 3690 2905 1256 -625 -2651 -3799 -3444 -1945
3859 -1945 557 1981 3592 3431 2523 375 -1623 -3236 -3599 -2744 -965 1102 2695 3643 3531 1563
3875 1563 -322 -2272 -3491 -3394 -2503 -438 1624 3224 3694 2845 874 -1032 -2549 -3730 -3049 -1408
$$ packed form
3762c956J084J755K589J663O95o18j606k012k235j243J01J588K006K493R67N95
3778C866j187j807k407j696o13O32J798K095J657J637l41j543k157k095j632K69
3794c524Q01K257K260J597L92p36j820k140j897j027o8J937K477J986R84R9j067
3811B511k304j984j455n75R59J970K009J788O35k56j595k277j992j216J27J452
3827b203K019K213J539M87j105k073k390j542p61Q44J433K339J791R72j32j161
3843B270k181k087j084r09J231K151K009K169J21p85j649j881k026j148L55J499
3859a945K502J424J611j61r08k148j998j613l63Q55J779K067J593R48j12j968
3875A563j885j950j219R7Q91K065K062J600M70q49j971j906j517j181O81J641
$$ plain form
3891 -1408 501 2249 3672 3355 2051 -71 -2108 -3047 -3845 -2703 -704 1329 2842 3598 2858 1107
3907 1107 -886 -2622 -3442 -3248 -2022 7 2071 3381 3588 2205 736 -1390 -3260 -3475 -2747 -793
3923 -793 873 2535 3359 3016 1824 -394 -1989 -3337 -2914 -2129 -446 1567 2751 3656 2775 719 -847
3940 -847 -2642 -3332 -2849 -1667 483 2333 3365 3185 2089 316 -1604 -2882 -3306 -2605 -617 1238
3956 1238 2759 3061 2977 1366 -212 -2481 -3316 -3066 -1897 111 1601 3017 3177 2273 479 -1378 -2961
3973 -2961 -3287 -2698 -1202 764 2337 3473 3066 1787 22 -1800 -3139 -3148 -1712 -326 1373 2862
3989 2862 3520 2637 1174 -831 -2566 -3470 -3027 -1762 276 1852 3030 3211 2003 350 -1779 -3155
4005 -3155 -3367 -2394 -1043 1154 2571 3116 2793 1369 -533 -2346 -3012 -2979 -2060 -220 1678 3037 3061
$$ packed form
3891a408J909J748J423l17j304k122k037r39p98J142J999K033J513P56p40j751
3907A107j993j736q20J94J226K029K064J310K07j383j469k126j870k15P28J954
3923g93J666J662Q24l43j192k218j595j348M23P85J683K013J184R05q81k056j566
3940h47j795o90M83J182K150J850J032j80j096j773j920j278m24P01J988J855
3956A238J521L02q4j611j578k269q35K50J169K008J490J416J60r04j794j857j583
3973b961l26N89J496J966J573J136m07j279j765j822j339rJ436J386J699J489
3989B862O58q83j463k005j735r04M43J265K038J576J178J81j208j653k129j376
4005c155k12R73J351K197J417N45l23j424j902j813o66L3R19J840J898J359K4
$$ plain form
4022 3061 2535 652 -1288 -2810 -3085 -2580 -1313 448 2192 3159 2914 1821 -43 -1810 -2703 -2889 -2397
4039 -2397 -711 1235 2761 3176 2386 991 -688 -2475 -3249 -2698 -1545 345 1861 2976 2948 2045 505
4056 505 -1261 -2728 -3131 -2492 -855 695 2325 3238 2982 1275 -260 -2283 -2900 -2868 -1998 -202 1576
4073 1576 2914 2786 2421 648 -1179 -2283 -2918 -2465 -1404 386 2358 3007 2971 1838 33 -1773 -3019
4090 -3019 -3068 -2321 -732 1158 2555 2966 2338 1403 -565 -2396 -2941 -2805 -1771 81 1784 2610 2974
4107 2974 2163 257 -1256 -2741 -3209 -2471 -1072 733 2323 3506 3062 1696 -196 -1840 -2613 -3087
4123 -3087 -1682 -375 1430 2550 2886 2493 968 -856 -2409 -2809 -2517 -1501 208 2059 2816 2958
4139 2958 2004 277 -1325 -2396 -2959 -2361 -763 934 2204 3061 2729 1277 -350 -1897 -2975 -2781
$$ packed form
4022C061n26j883j940j522k75N05J267J761J744R67k45j093j864j767q93j86M92
4039b397J686J946J526M15p90j395j679j787p74N51J153J890J516J115k8r03j540
4056E05j766j467m03O39J637J550J630R13k56j707j535k023o17L2Q70J796J778
4073A576J338j28l65j773j827j104o35M53J061J790J972O49l6j133j805j806j246
4090c019m9P47J589J890J397M11o28r35j968j831n45J36J034J852J703Q26L64
4107B974q11j906j513j485m68P38J399J805J590J183m44j366j892j644p73m74
4123c087J405J307J805J120L36l93j525j824j553m00K92J016J709J851P57J42
4139B958r54j727j602j071n63N98J598J697J270Q57l32j452j627j547j078J94
$$ plain form
4155 -2781 -1845 200 1556 2983 2848 1907 526 -901 -2325 -2777 -2475 -1143 576 2163 2730 2449 1575
4172 1575 -311 -1718 -2952 -2778 -2026 -582 1233 2448 2628 2199 846 -726 -2181 -2679 -2528 -1189
4188 -1189 -19 1899 2517 2531 1854 463 -1260 -2594 -2710 -1718 -463 726 2540 2927 2292 1375 -58
4205 -58 -1814 -3102 -2837 -1843 -233 1567 2694 3023 1920 503 -965 -2261 -2769 -2539 -1159 811 2053
4222 2053 2756 2605 1598 -46 -1736 -2537 -2940 -1837 -411 1135 2711 2550 2376 817 -783 -1919
4238 -1919 -2761 -2233 -1603 473 1609 2433 2889 1858 9 -1630 -2477 -2818 -2283 -685 732 2013 2758
4255 2758 2362 1163 -492 -1930 -2365 -2348 -1686 244 1585 2699 2609 1758 649 -1133 -2474 -2770 -2270
4272 -2270 -1022 435 1541 2827 2684 1429 -13 -1154 -2209 -2692 -1867 -390 999 2137 2709 2392
$$ packed form
4155b781R36K045J356J427j35r41j381j427j424m52L02J332J719J587N67k81q74
4172A575j886j407j234J74P52J444J815J215J80m29j353j572j455m98J51J339
4188a189J170J918O18J4o77j391j723j334j16R92J255J189J814L87o35r17j433
4205e8j756j288K65R94J610J800J127L29j103j417j468j296n08K30J380J970J242
4222B053P03j51j007j644j690q01m03J103J426J546J576j61j74j559j600j136
4238a919q42N28O30K076J136Q24M56j031j849j639q47l41N35J598J417J281P45
4255B758l96j199j655j438m35J7O62J930J341J114r0q51j109j782j341k96N00
4272b270J248J457J106J286j43j255j442j141j055m83Q25J477J389J138N72l17
$$ plain form
4288 2392 1118 -541 -1819 -2753 -2454 -1146 288 1517 2550 2557 1755 481 -950 -1883 -2342 -1931 -826
4305 -826 715 1786 2664 2465 1162 -299 -1562 -2647 -2512 -1812 -527 1164 2257 2457 1991 656 -710
4322 -710 -2201 -2784 -2133 -857 255 1452 2484 2378 1440 193 -1480 -2446 -2300 -1919 -485 1232 2103
4339 2103 2352 2177 1266 -569 -1883 -2479 -2130 -1595 199 1336 2253 2710 1854 564 -1073 -2220 -2602
4356 -2602 -1992 -1038 444 1920 2497 2467 1122 -88 -1491 -2458 -2979 -1488 -208 1473 2123 2521 1611
4373 1611 716 -772 -1709 -2707 -2264 -1056 135 1705 2267 2414 1570 74 -1099 -2493 -2606 -1702 -478
4390 -478 938 2022 2425 2164 1242 -355 -1584 -2485 -2251 -1355 -76 1148 2184 2715 1820 409 -797
4407 -797 -2061 -2545 -1958 -692 408 1923 2352 2165 1190 -169 -1285 -2238 -2450 -1648 -453 870 2096
$$ packed form
4288B392j274j659j278r34K99J308J434J229J033Pq02j274j431r33m59M11J105
4305h26J541J071Q78j99j303j461j263j085J35P00J285J691J093K00m66j335j366
4322g10j491n83O51J276J112J197J032j06r38j247j673r66J46L81J434J717Q71
4339B103K49j75r11j835j314n96L49N35J794J137R17M57q56j290j637j147l82
4356b602O10R54J482J476N77l0j345j210j403r67n21J491J280J681O50L98r10
4373A611q95j488r37r98M43J208J191J570N62J47q44j496j173j394j13R04J224
4390d78J416J084M03k61r22j597j229r01K34Q96J279J224J036N31q95j411j206
4407g97j264m84N87J266J100J515M29j87r75j359j116r53k12Q02J195J323J226
$$ plain form
4424 2096 2441 1934 867 -340 -1766 -2676 -2289 -1416 190 1476 2282 1803 1396 85 -1144 -2169 -2341
4441 -2341 -1720 -729 893 1705 2335 1725 1226 -438 -1409 -2410 -2424 -1337 -272 1247 2088 2524 1683 819
4459 819 -741 -1882 -2447 -2105 -1034 543 1802 2402 2378 1219 188 -1091 -1954 -2277 -1742 -261 948
4476 948 2179 2505 1777 619 -595 -1769 -2096 -2014 -1155 180 1220 2104 2110 1199 227 -1196 -1877 -2286 -1733
4495 -1733 -688 680 1616 2386 1865 1068 -130 -1493 -1996 -2247 -1236 -332 954 2128 2374 1928 894
4512 894 -769 -1613 -1805 -1921 -885 326 1761 2240 2177 1168 111 -1141 -2144 -2101 -1628 -240 827
4529 827 1848 2297 2116 775 -500 -1843 -2226 -2153 -991 -5 1543 2081 2198 1517 520 -745 -1734 -2404
4547 -2404 -1738 -699 470 1706 2113 2207 1525 -78 -1365 -2060 -2338 -1377 -272 1172 1958 2359 1751 758
$$ packed form
4424B096L45n07j067j207j426r10L87Q73J606J286Q06m79m07j311j229j025j72
4441b341O21R91J622Q12O30o10m99j664r71j001j4J087J065J519Q41M36q41q64
4459H19j560j141n65L42J071J577J259O00k4j159j031j279q63l23N35J481J209
4476I48J231L26p28j158j214j174l27Q2Q59J335J040Q84Or11r72j423o81m09N53
4495a733J045J368R36P70n21p97j198j363n03k51J011R04J286J174K46m46j034
4512H94j663q44j92j16J036J211J435M79o3j009j057j252j003M3M73J388J067
4529H27J021M49j81j341j275j343l83P3J162R86J548N38J17o81r97j265r89o70
4547b404O66J039J169J236M07R4o82j603j287o95k78R61J105J444P86M01o08r93
$$ plain form
4565 758 -704 -1803 -2367 -1920 -931 361 1322 1979 2391 1183 -1 -887 -1960 -2068 -1623 -646 606 1628
4583 1628 2203 1711 774 -478 -1540 -2031 -2102 -1510 -143 926 1969 2146 1409 111 -765 -1796 -2102 -1977
4601 -1977 -922 386 1249 2017 1850 1418 -278 -1423 -1850 -1968 -1681 -439 861 1348 2278 1649 683 -448
4619 -448 -1355 -1889 -1759 -1194 84 1540 1961 1963 1236 33 -1104 -2029 -2055 -1292 -633 845 1782 1980 1875
4638 1875 819 -149 -1204 -1834 -1865 -1180 -85 1058 1788 2019 1374 292 -418 -1854 -1797 -1737 -861 524
4656 524 1531 1948 1949 1109 138 -1074 -1959 -1624 -1275 -393 655 1745 1939 1727 695 -249 -1494 -2255 -2054
4675 -2054 -1069 42 1074 1923 2083 1424 160 -840 -1311 -1778 -1648 -765 453 1501 1855 1717 836 -455
4693 -455 -1061 -2059 -1896 -1024 -529 736 1608 1682 1195 614 -350 -1696 -2199 -1875 -771 150 1738 2012 1710
$$ packed form
4565G58j462j099n64M47R89J292R61O57M12j208j184q86j073j08M45R77J252J022
4583A628N75m92r37j252j062m91p1N92J367J069J043J77p37j298q76j031l06J25
4601a977J055J308Q63P68j67m32j696j145m27j18K87J242J300M87R30o29r66j131
4619d48r07n34J30N65J278J456M21Kp27j203j137r25k6P63O59J478R37J98j05
4638A875j056r68j055o30l1O85J095J143P30K31o45j082p10j436N7O0Q76J385
4656E24J007M17Jq40r71j212q85L35L49Q82J048J090J94k12j032r44j245p61K01
4675b054R85J111J032Q49J60o59j264j000m71m67J30Q83J218J048L54j38q81j291
4693d55o06r98J63Q72M95J265Q72P4m87n81r64j346n03L24J104R21J588K74l02
$$ plain form
4712 1710 1396 -58 -1087 -2117 -2095 -1553 -530 502 1547 2069 1519 442 -156 -1545 -2037 -1830 -1009
4729 -1009 -140 1221 1680 2003 1058 237 -941 -1458 -1985 -1671 -732 460 1114 1722 1846 699 -96 -1110
4747 -1110 -1575 -1745 -1271 -422 602 1394 1958 1111 745 -707 -1395 -1431 -1969 -521 264 1067 1993 1526 1241
4766 1241 53 -1045 -1536 -1723 -1394 -581 753 1549 1701 1461 837 -204 -1272 -1892 -1772 -1154 3 868
4784 868 1494 1855 1107 578 -707 -1609 -1816 -1487 -241 294 1401 1717 1767 1143 -453 -964 -1714 -1700 -1177
4803 -1177 -272 640 1892 1667 1479 504 -356 -1588 -1792 -1264 -979 245 1265 1626 1727 1099 158 -761
4821 -761 -1301 -1719 -1202 -547 485 1247 1616 1469 967 -393 -1150 -1614 -1574 -806 -114 935 1374 1611 1188
4840 1188 540 -412 -1395 -1883 -1292 -789 291 1234 1564 1428 1271 -63 -914 -1737 -1632 -1131 -316 661 1214
$$ packed form
4712A710l14j454j029j030K2N42J023J032J045N22n50j077n98j389m92K07Q21
4729a009Q69J361M59L23r45q21j178n17n27L14R39J192O54O08J24j147p95j014
4747a110m65j70M74Q49J024P92N64q47l66j452o88l6n38J448P85Q03R26m67k85
4766A241j188j098m91j87L29Q13J334P96J52k40o24j041j068o20J20O18J157Q65
4784H68O26L61p48n29j285r02k07L29J246N35J107L16N0o24j596n11p50J4N23
4803a177R05R12J252k25j88r75q60j232k04N28K85J224J020L61J01o28r41r19
4821g61n40m18N17O55J032P62L69j47n02j360p57m64M0P68O92J049M39K37m23
4840A188o48r52r83m88N91N03J080R43L30j36j57j334q51q23J05N01Q15R77N53
$$ plain form
4859 1214 1629 1798 508 -366 -1108 -1661 -1532 -1025 84 929 1720 1233 1357 629 -939 -1405 -1836 -1370 -397
4878 -397 498 1316 1658 1656 1021 -196 -1202 -1641 -1632 -1135 -207 730 1616 1611 1366 533 -601 -1434 -1863 -1258 -671
4899 -671 199 1164 1447 1423 714 -136 -568 -1535 -1600 -1365 -68 818 1356 1739 1184 701 -457 -1068 -1314 -1828
4919 -1828 -1124 95 1123 1804 1681 959 382 -977 -1228 -1608 -1221 -774 330 1102 1525 1564 667 143 -913
4938 -913 -1689 -1587 -1245 3 765 1433 1491 1435 535 -551 -1238 -1483 -1110 -769 172 1219 1325 1364 1017 270
4958 270 -846 -1568 -1514 -1243 -515 467 1491 1436 1246 695 -444 -919 -1500 -1354 -896 -383 1115 1580 1821
4977 1821 1163 198 -609 -1358 -1477 -1278 -724 227 829 1653 1614 871 359 -1023 -1527 -1355 -1007 34 482
4996 482 1355 1548 1098 348 -180 -1104 -1588 -1662 -846 38 690 1546 1321 864 160 -727 -1420 -1469 -1137 -653 315
$$ packed form
4859A214M15J69j290q74p42n53J29N07J109Q45P91m87J24p28j568m66m31M66R73
4878c97Q95Q18L42ko35j217j006m39RM97R28R37Q86nk45q33j134q33m29O05N87
4899f71Q70R65K83k4p09q50m32r67o5K35J297Q86N38L83n55m83j158o11k46n14
4919a828P04J219J028O81j23p22n77j359k51l80L87M47J104P72M23L9q97n24j056
4938i13p76J02L42J248P62O68N8n6r00j086o87k45L73L41R41J047J06L9l47p47
4958B70j116p22N4K71P28R82J024n5j90n51j139m75n81J46M58N13J498M65K41
4977A821o58r65q07p49j19J99N54R51O02Q24l9p43n12j382n04J72L48J041M48
4996D82Q73J93m50p50n28r24m84p4Q16Q84O52Q56k25m57p04q87o93m9L32M84R68
$$ plain form
5017 315 1303 1383 1248 688 -217 -1381 -1613 -1561 -988 -270 823 1358 1602 918 272 -251 -1058 -1475 -1471 -816 460
5038 460 1216 1523 1317 768 222 -864 -1624 -1587 -1012 -35 601 893 1316 1046 406 -428 -1012 -1467 -1395 -689
5058 -689 4 861 1429 1621 723 10 -692 -1343 -1497 -1073 -650 392 1080 1286 1287 574 -222 -1337 -1351 -1244
5078 -1244 -913 -118 516 1288 1358 1417 444 -373 -1147 -1270 -1189 -620 11 519 1659 1589 684 -210 -806 -1488 -1642
5099 -1642 -1042 -301 473 1173 1360 894 725 -454 -887 -1603 -1224 -665 7 755 1018 1383 516 95 -893
5118 -893 -1186 -1210 -1272 -527 207 1196 1267 1216 831 -269 -1027 -1128 -1265 -958 -47 201 1038 1279 1030 419 -605
5139 -605 -1138 -1159 -1004 -692 187 1283 1218 1137 1052 299 -726 -1194 -1336 -820 -277 614 1167 1638 1292 256
5159 256 -314 -868 -1191 -1330 -856 -162 936 1027 1211 930 71 -276 -989 -1376 -1175 -394 429 1034 1176 1132
$$ packed form
5017C15R88Q0j35n60r05j164k32N2N73P18J093N35K44o84o46n23q07m17MO55J276
5038D60P56L07k06n49n46j086p60L7N75R77O36K92M23k70o40q34n84m55P2P06
5058f89O93Q57N68J92q98p13p02o51j54M24M23J042O88K06Jp13p96j115j4J07
5078a244L31P95O34P72P0N9r73q17p74j23Q1N69O31N08J140p0r05q94n96o82j54
5099a642O00P41P74P00J87m66j69j179m33p16L79N59O72P48K63L65q67m21r88
5118h93k93k4o2P45P34R89P1n1l85j100p58j01j37L07R11K48Q37K41k49o11j024
5139f05n33k1J55L12Q79J096o5q1q5p53j025m68j42N16N43Q91N53M71l46j036
5159B56n70n54l23j39M74O94J098R1J84k81q59l47p13l87K01P81Q23O05J42m4
$$ plain form
5179 1132 504 19 -760 -1258 -1236 -1116 -247 441 1140 1349 941 165 -309 -1070 -1139 -987 -255 61 890 1438
5199 1438 1308 981 53 -613 -1029 -1506 -758 -306 486 799 1514 1219 366 -31 -770 -1050 -1297 -728 50 552
5219 552 1022 1136 921 230 -451 -1382 -1543 -1327 -624 125 1003 1091 1009 908 183 -898 -1290 -1362 -964 -193 686
5240 686 847 1009 1380 537 -121 -810 -996 -1145 -582 -46 567 1039 1343 1200 -61 -571 -1130 -1071 -1493 -325
5260 -325 365 969 1265 1019 322 -271 -980 -1335 -1087 -496 -156 1017 958 1306 745 157 -221 -852 -1009 -1074
5280 -1074 -545 -17 557 1138 1004 582 -184 -601 -1183 -1181 -713 -274 565 980 1018 787 286 -195 -965 -1245 -781
5301 -781 -698 -44 500 909 1217 706 366 -648 -991 -1062 -975 -268 -42 749 1351 1107 846 -282 -568 -1172
5321 -1172 -1081 -674 -185 825 1205 1305 777 333 -341 -863 -1399 -1054 -376 221 453 1282 963 654 314 -859
$$ packed form
5179A132o28m85p79m98K2J20Q69O88O99K09m08p76m74p61o9J52P32L16Q29N48
5199A438j30l27r28o66m16m77P48M52P92L13P15k95q53l97p39k80k47N69P78N02
5219E52M70J14k15o91o81r31j61K16P03P49Q78Q8q2j01p25j081l92p2L98P71Q79
5240F86J61J62L71q43o58o89j86j49N63N36O13M72L04j43j261n10n59N9m22J168
5260c25O90O04K96k46o97n93p09l55K48N91L40J173n9L48n61n88l78o31j57o5
5280a074N29N28N74N81j34m22p66m17n82KM68M39Q39M15L8k31n01m81p70k80M64
5301g81Q3O54N44M09L08n11l40j014l43p1Q7P07K26P91O02k44k61j128k86o04
5321a172R1M07M89J010L80J00n28m44o74n22n36L45O78N97K32Q29l19l09l40j173
$$ plain form
5341 -859 -1112 -1420 -1084 -222 383 954 926 808 763 -385 -662 -1150 -863 -335 2 568 974 1153 162 418
5361 418 -467 -862 -954 -797 -498 143 752 1012 1120 514 -224 -654 -861 -1035 -478 69 526 910 1160 677
5381 677 -40 -588 -549 -894 -1023 -725 -72 766 1032 1015 465 306 -630 -943 -1342 -958 -404 561 712 933 948
5402 948 405 25 -1008 -818 -711 -447 -339 369 1100 1296 1014 267 -463 -837 -967 -1057 -280 -23 589 904
5422 904 575 435 92 -612 -997 -1006 -867 -249 670 785 1005 1116 515 -407 -1022 -1059 -902 -862 42 539 1082
5443 1082 960 745 -26 -458 -932 -1189 -745 -262 162 878 1144 675 385 -152 -872 -966 -1021 -663 -198 358
5463 358 936 1019 1057 29 -428 -1013 -1137 -1069 -352 40 493 964 1076 455 80 -390 -1201 -742 -978 -174 284
5484 284 715 1290 913 319 -128 -579 -1235 -877 -400 162 685 992 1033 485 269 -444 -1167 -1139 -945 -256 365
$$ packed form
5341h59k53l08L36Q62O05N71k8j18m5j148k77m88K87N28L37N66M06J79r91K56
5361D18q85l95r2J57K99O41O09K60J08o06p38m30k07j74N57N47M57L84K50m83
5381F77p17n48L9l45j29K98O53Q38K66j7n50j59r36l13l99L84N54R65J51K21J5
5402I48n43l80j033J90J07K64J08P08P31J96k82p47p30l74j30r0P77K57O12L15
5422I04l29j40l43p04l85rJ39O18R19J15K20J11o01r22o15l7J57M0R04M97N43
5443A082j22k15p71m32m74k57M44M83M24P16K66m69k90n37p20r4n5L58M65N56
5463C58N78Q3L8j028m57n85j24O8P17L92M53M71J12o21l75m70q11M59k36Q04M58
5484B84M31N75l77n94m47m51o56L58M77N62N23L07M1n48k16p13p23K8J94O89O21
$$ plain form
5505 365 743 1028 731 596 121 -664 -1112 -1190 -286 375 594 902 950 773 -37 -446 -1039 -929 -954 -709 -189
5526 -189 367 848 821 504 154 -840 -717 -859 -690 -80 484 1056 953 661 370 -59 -836 -1065 -1194 -355
5546 -355 -33 270 938 969 474 118 -247 -1164 -736 -847 -395 180 748 1148 923 399 -121 -570 -766 -802 -655
5567 -655 -175 203 891 1067 658 318 -364 -657 -847 -1129 -388 -297 674 747 934 637 -153 -405 -620 -1075 -968
5588 -968 -221 340 981 835 684 441 -53 -610 -826 -1019 -286 43 421 1114 865 686 383 -563 -1005 -810
5608 -810 -641 -174 114 590 968 1033 337 -96 -561 -696 -976 -749 -222 836 1026 1031 645 316 -159 -757 -1044
5629 -1044 -863 -265 271 689 1115 814 720 489 -284 -849 -792 -681 37 546 1042 849 727 563 -108 -812
5649 -812 -1002 -804 -617 -47 552 936 800 396 123 -505 -857 -913 -801 -499 312 824 924 712 643 -75 -563
$$ packed form
5505C65L78K85k97j35m75p85m48p8R04O61K19L08M8j77q10m09n93J10k5K45N20
5526a89N56M81k7l17l50r94J23j42J69O10N64N72j03k92k91m29p77k29j29Q39
5546c55L22L03O68L1m95l56l65r17M28j11M52N75N68M00k25n24n20m49j96l6J47
5567f55M80L78O88J76m09l40o82k93j90k82P41R1R71P3J87k97p90k52k15m55J07
5588i68P47N61O41j46j51k43m94n57k16j93P33L29L78O93k49j79l03r46m42J95
5608h10J69M67K88M76L78O5o96m33m65j35k80K27N27J058J90Nl86l29m75n98k87
5629a044J81N98N36M18M26l01r4k31p73n65N7J11P18N09M96j93j22j64o71p04
5649h12j90J98J87N70N99L84j36m04k73o28l52n6J12L02Q11N12J00k12o9p18m88
$$ plain form
5670 -563 -648 -1024 -685 -53 267 818 772 649 103 60 -750 -653 -737 -450 194 564 1040 930 386 246 -309 -737
5692 -737 -925 -507 -421 388 610 1078 1056 359 -61 -768 -882 -441 -659 -66 276 700 843 884 426 -506 -882
5713 -882 -791 -558 -651 163 694 858 774 435 -151 -504 -891 -714 -792 -593 377 409 647 967 532 -401 -686 -680
5735 -680 -639 -383 23 653 630 785 634 107 -578 -687 -982 -792 -270 374 610 893 878 241 -115 -581 -569
5756 -569 -929 -278 129 363 580 924 674 313 -288 -528 -688 -593 -186 300 355 783 829 291 -176 -429 -512
5777 -512 -753 -605 -238 481 539 607 629 471 229 -730 -741 -660 -393 -103 627 590 656 514 -13 -298 -469 -757
5799 -757 -709 50 -18 608 685 759 538 -55 -490 -571 -909 -572 -130 209 445 915 652 77 -173 -830 -795 -816
5821 -816 -644 167 75 779 832 339 -101 -144 -462 -730 -588 -233 -45 506 657 916 435 7 -440 -817 -852
$$ packed form
5670e63q5l76L39O32L20N51m6j23n46m3q10R7q4K87O44L70M76j10n44j40n55m28
5692g37j88M18Q6Q09K22M68k2o97m20p07j14M41k18N93L42M24J43M1m58r32l76
5713h82R1K33r3Q14N31J64q4l39n86l53l87J77p8J99R70L2K38L20m35r33k85O
5735f80M1K56M06O30k3J55j51n27o85j09k95J90N22O44K36K83j5o37l56m66J2
5756e69l60O51M07K34K17L44k50l61o01k40j60R5M07M86N5M28M6n38m67k53q3
5777e12k41J48L67P19N8O8K2j58k42r59j1Q1K67K90P30l7O6j42n27k85j71k88
5799g57M8P59o8O26P7P4k21n93m35q1l38L37M42L39K36M70k63n75k50o57L5k1
5821h16J72Q11r2P04N3m93m40m3l18k68J42L55J88N51J51K59m81m28m47l77l5
$$ plain form
5842 -852 -152 -63 526 468 596 525 490 -467 -683 -633 -470 -655 -9 431 588 387 509 105 -566 -654 -708 38
5864 38 -190 436 633 711 765 230 -274 -697 -792 -714 -403 145 510 708 751 643 147 -264 -690 -539 -435 -195
5886 -195 302 524 886 670 285 43 -503 -419 -897 -353 -141 279 788 546 539 228 -358 -662 -457 -758 -332
5907 -332 405 184 467 735 357 -84 -266 -370 -786 -672 -126 126 607 641 462 69 -259 -664 -871 -439
5927 -439 -309 84 233 800 867 569 -156 -27 -540 -886 -467 -355 119 386 528 349 376 116 -792 -634 -761
5948 -761 -401 -325 438 660 512 590 -59 -220 -400 -833 -478 -478 -134 474 911 494 544 -116 -343 -541 -550 -694
5970 -694 59 123 822 885 355 171 -221 -645 -683 -822 -250 69 260 658 699 440 -118 -508 -621 -945 -957 -103
5992 -103 272 383 549 814 157 299 -387 -484 -881 -246 -68 255 450 805 214 212 -318 -449 -499 -670 -107
$$ packed form
5842h52P00Q9N89n8J28p1l5r57k16N0J63j85O46M40J57k01J22m04o71q8n4P46
5864C8k28O26J97P8N4n35n04m23r5P8L11N48L65J98M3j08m96m11m26J51J04K40
5886a95M97K22L62k16l85k42n46Q4m78N44K12M20N09k42pl11n86l04K05l01M26
5907c32P37k21K83K68l78m41j82j04m16J14N46K52M81L4j79l93l28m05k07M32
5927d39J30L93J49N67O7k98p25J29n13l46M19J12M74K67J42j79K7k60r08J58j27
5948g61L60P6P63K22j48P8o49j61j80m33L55%L44O08M37m17N0o60k27j98rj44
5970f94P53O4O99O3n30j84l92m24l8j39N72L19J91L98M1k59n58l90j13l24j2Q54
5992a03L75J11J66K65o57J42o86r7l97O35J78L23J95L55n91kn30j31n0j71N63
$$ plain form
6013 -107 67 298 880 698 252 55 -286 -641 -611 -757 -139 88 368 545 595 123 -102 -621 -769 -641 -248
6034 -248 231 519 564 729 359 174 -100 -353 -343 -700 -475 149 260 593 712 360 -93 -241 -700 -572 -241
6055 -241 -237 694 563 607 704 203 -82 -788 -578 -413 -275 196 270 541 520 609 -16 -309 -436 -754 -610 -490
6077 -490 191 570 586 561 112 12 -424 -498 -827 -465 75 300 543 426 421 276 -205 -525 -762 -708 -9 -38
6099 -38 154 392 354 0 -50 -549 -340 -331 -499 207 218 601 392 477 373 -136 -255 -444 -587 -249 106 342
6121 342 512 417 218 111 -106 -349 -501 -603 -302 166 702 230 344 512 -194 -457 -667 -646 -271 -197 120
6142 120 763 381 401 244 -235 -524 -587 -593 -452 74 290 431 349 245 25 -407 -502 -639 -543 75 -226 295
6164 295 509 420 324 84 -464 -725 -550 -372 -182 358 798 618 471 104 -60 -514 -262 -314 -99 133 313
$$ packed form
6013a07J74K31N82j82m46j97l41l55L0j46O18K27K80J77N0m72k25n19j48J28L93
6034b48M79K88M5J65l70j85k74k53J0l57K25O24J11L33J19l52m53j48m59J28L31
6055b41MR31j31M4R7n01k85p06K10J65J38M71P4K71k1Q9o25k93j27l18J44J20
6077d90O81L79J6k5m49j00m36p4l29L62N40K25K43j17nj45m81l20k37N4O99k9
6099c8J92K38l8l54n0m99K09Rj68P06J1L83k09Q5j04n09j19j89j43L38L55K36
6121C42J70r5j99j07k17k43j52j02L01M68N36m72J14J68p06k63k10K1L75P4L17
6142A20O43l82K0j57m79k89o3oJ41N26K16J41q2j04k20m32r5j37R6O18l01N21
6164B95K14q9r6k40n48k61J75J78J90N40M40j80j47l67j64m54K52n2K15K32J80
$$ plain form
6185 313 966 108 270 82 -609 -411 -640 -411 -47 87 569 480 313 124 -178 -297 -642 -269 -93 -79 290
6206 290 489 297 329 -97 -213 -332 -495 -409 -348 85 541 284 579 177 151 -222 -392 -335 -163 163 149 568
6228 568 613 406 396 -418 -367 -822 -242 -111 164 490 462 432 325 151 -555 -467 -509 -203 -409 523 57 530
6250 530 312 101 -236 -529 -661 -362 56 -121 291 786 356 188 157 -347 -401 -338 -271 -72 353 478 560 862
6272 862 417 -4 -315 -415 -456 -290 -79 79 759 392 665 86 -49 -449 -532 -414 -236 77 201 670 442
6293 442 166 -49 -449 -435 -372 -585 -46 231 274 614 647 346 -427 -220 -627 -720 41 -393 270 736 627 330
6315 330 199 -346 -292 -517 -437 -322 12 232 784 488 139 -10 -287 -671 -357 -333 -265 494 368 559 282
6336 282 43 -54 -252 -344 -388 -218 131 597 531 473 181 -10 -203 -522 -514 -401 -499 -14 473 851 576 225 206
$$ packed form
6185C13O53q58J62j88o91J98k29K29L64J34M82q9j67j89l02j19l45L73J76J4L69
6206B90J99j92L2m26j16j19j63Q6O1M33M56k57K95m02k6l73j70N7J72L26j4M19
6228E68M5k07j0q14N1m55N80J31K75L26k8l0j07j74p06Q8m2L06k06R32m66M73
6250E30k18k11l37k93j32K99M18j77M12M95m30j68l1n04n4O3O7J99M25J25Q2L02
6272H62m45m21l11j00m1J66K11J58O80l67K73n79j35m00q3J18J78L13J24M69k28
6293D42k76k15m00J4O3k13N39K77M3L40L3l01p73K07m07r3P61m34O63M66j09k97
6315C30j31n45N4k25Q0J15L34K20N52k96l49j49k77l84L14K4O8P59j26J91k77
6336B82k39r7j98r2m4J70L49M66o6n8k92j91j93l19QJ13r8M85M87L78k75l51j9
$$ plain form
6359 206 -253 -506 -433 -163 -113 424 477 516 280 25 -90 -331 -538 -191 -273 -38 540 281 469 259 -135 -139
6381 -139 -181 -394 -437 -165 15 584 592 338 523 -22 -442 -362 -184 -327 -9 352 573 398 164 -197 -343 -406
6403 -406 -654 -260 -186 190 -20 579 397 182 -56 -298 -621 -643 -165 -148 88 318 585 279 264 -132 -307
6424 -307 -344 -515 -136 114 391 275 548 100 -2 -300 5 -581 -140 -274 225 75 195 246 32 -56 -397
6445 -397 -177 -287 -421 106 123 406 310 359 177 -2 -372 -329 -535 -230 14 305 412 576 -102 163 -46
6466 -46 46 -564 -35 -305 35 318 291 404 172 -57 -393 -314 -452 -164 -248 171 192 294 255 15 -183 -522
6488 -522 -322 -567 -197 248 286 259 306 332 -20 -158 -584 -650 -346 -130 138 263 136 -5 396 81 -301 -788
6510 -788 -274 -274 167 389 356 278 69 57 -73 -657 -202 -375 -68 244 743 441 289 121 -317 -434 -478 -613
$$ packed form
6359B06m59k53P3K70N0N37N3L9k36k55j15k41k07L47q2K35N78k59J88k10l94m
6381a39m2k13m3K72J80N69Qk54J85n45m20Q0J78j43L18L61K21j75k34l61j46o3
6403d06k48L94P4L76k10N99j82k15k38k42l23k2M78J7K36K30K67l06j5l96j75
6424c07l7j71L79K50K77j16K73m48j02k98L05n86M41j34M99j50J20N1k14q8l41
6445c97K20j10j34N27J7K83r6M9j82j79l70M3k06L05K44K91J07J64o78K65k09
6466d6R2o10N29k70L40K83k7J13k32k29l36P9j38K88q4M19K1J02l9k40j98l39
6488e22K00k45L70M45L8k7M7K6l52j38m26o6L04K16K68J25j27j41M01l15l82m87
6510g88N14%M41K22l3p8k09j2j30n84M55j73L07L12M99l02j52j68m38j17m4j35
$$ plain form
6532 -613 -102 148 228 354 225 190 81 -12 -368 -571 -224 -149 214 230 468 462 170 -206 -55 -345 -583 -448
6554 -448 -90 72 376 209 469 -47 -29 -433 -482 44 -85 -116 397 269 740 436 119 -284 -408 -418 -176
6575 -176 195 95 397 364 414 92 -131 -16 -615 -324 26 -149 155 626 493 43 16 -472 -452 -392 -77 -258
6597 -258 16 290 555 68 85 66 -368 -334 -258 -361 95 292 651 377 279 187 74 -347 -356 -256 -94 -73 189
6620 189 779 290 360 154 132 -309 -527 -493 -283 482 472 255 162 151 -87 -302 -569 -335 -458 -72 231 356
6642 356 448 184 119 34 -384 -250 -399 34 -154 132 298 393 199 -233 -78 -229 -440 -41 -78 338 290 208
6664 208 513 223 -81 -400 -418 -209 -62 52 361 146 261 -9 168 -76 -515 -276 -239 -115 -46 265 386
6685 386 120 211 -167 -298 -364 -572 -157 -160 101 298 395 394 194 -241 -18 -383 -47 -298 47 -71 326 64
$$ packed form
6532f13N11K50Q0J26j29l5j09r3l56k03L47P5L63J6K38ok92l76J51k90k38J35
6554d48L58J62L04j67K60n16J8m04m9N26j29l1N13j28M71l04l17m03j24j0K42
6575a76L71j00L02l3N0l22k23J15n99K91L50j75L04M71j33m50k7m88K0O0L15j81
6597b58K74K74K65m87J7j9m34L4P6j03M56J97L59k74r8r2j13m21rJ00J62K1K62
6620A89N90m89P0k06k2m41k18L4K10P65j0k17r3j1k38k15k67K34j23L86L03J25
6642C56R2k64o5q5m18J34j49M33j88K86J66R5j94m32J55j51k11L99l7M16m8q2
6664B08L05k90l04l19j8K09J47J14L09k15J15k70J77k44m39K39L7J24O9L11J21
6685C86k66R1l78j31o6k08M15lK61J97R7jk00m35K23l65L36k51L45j18L97k62
$$ plain form
6707 64 373 213 -388 -532 -488 -173 -170 435 212 198 363 136 110 -656 -436 -221 -410 -147 -37 244 489 346
6729 346 -10 171 -225 -356 -364 -140 52 29 299 339 -116 -219 122 -218 -184 -144 -396 103 304 593 56 170
6751 170 -212 -252 -358 -258 41 -3 118 269 296 -5 222 -165 -191 -462 -330 -67 103 443 307 423 242
6772 242 -100 -234 -425 -235 155 156 307 326 92 161 -14 -140 -386 -479 -353 -141 423 519 245 428 295 -14
6794 -14 15 -395 -72 -311 162 75 74 446 268 152 -113 -310 -289 -320 -276 -119 237 477 512 -15 246 -372 -404
6817 -404 -377 -66 -68 139 258 382 450 164 97 -269 -429 -615 -289 223 49 181 162 294 2 -512 -417 -302
6839 -302 -264 -231 256 -164 483 443 339 171 -8 -551 -152 -139 -131 103 258 411 288 203 -21 -310 -643 -578 -391
6862 -391 379 -180 306 108 498 -180 24 -293 -191 -337 -342 105 489 469 304 25 56 4 -391 -414 -463 -205
$$ packed form
6707F4L09j60o01j44M4L15LO05k23j4J65k27k6p66K20K15j89K63J10K81K45j43
6729C46l56J81l96j31qK24J92k3K70M0m55j03L41l40L4M0k52M99K01K89n37J14
6751A70l82m0j06J00K99m4J21J51K7l01K27l87k6k71J32K63J70L40j36J16j81
6772B42l42j34j91J90L90JJ51J9k34O9j75j26k46r3J26K12N64R6k74J83j33l09
6794a4K9m10L23k39M73q7jL72j78j16k65j97K1l1M4J57L56K40L5n27K61o18l2
6817d04K7L11kK07J19J24O8k86o7l66j60j86L26N12j74J32j9J32k92n14R5J15
6839c02L8L3M87m20O47m0j04j68j79n43L99J3QK34J55J53j23q5k24k89l33O5J87
6862c91P70n59M86j98L90o78K04l17J02j46nM47L84k0j65k79L1n2l95k3m9K58
$$ plain form
6884 -205 220 118 391 502 159 152 -357 132 -273 -60 -84 227 200 387 397 113 -190 -441 -425 -185 110 -65
6906 -65 90 668 228 -135 45 -86 -33 -288 -193 71 -43 157 127 8 115 171 -322 -229 -404 24 166 79
6928 79 283 178 336 -117 -149 -416 -144 -194 -241 -98 247 383 395 -97 -73 -116 -252 -241 -332 7 99 282 456
6951 456 352 248 -192 -388 -89 -496 -77 -119 249 174 62 332 55 -151 -346 -120 -99 -112 215 263 528 401
6973 401 603 -101 -3 -310 -523 87 -222 2 187 300 375 -61 -288 -290 -259 -188 -159 -251 160 555 214 110 277
6996 277 -139 -55 -260 -176 104 281 219 651 346 -173 -38 -314 -107 -250 -9 224 176 669 162 -2 -301
7017 -301 -213 -283 -421 56 -61 -1 461 355 29 243 94 -357 -430 -484 -180 297 347 106 95 13 159 -89 -180
7040 -180 -26 -525 270 -36 -30 193 257 139 -17 119 -196 -363 -234 -79 41 207 195 542 60 7 -115 -176
$$ packed form
6884b05M25j02K73J11l43pn09M89m05K13k4L11k7J87J0k84l03k51J6K40K95j75
6906f5J55N78m40l63J80j31N3k55R5K64j14K00l0j19J07N6m93R3j75M28J42q7
6928G9K04j05J58m53l2k67K72n0m7J43L45J36J2m92K4m3j36J1r1L39R2J83J74
6951D56j04j04m40j96K99m07M19m2L68p5j12K70k77k06j95K26K1j3L27M8K65j27
6973D01K02p04R8l07k13O10l09K24J85J13P5m36k27kL1P1K9r2M11L95l41j04J67
6996B77m16Q4k05Q4K80J77o2M32l05n19J35k76K07j43K41K33m8M93n07j64k99
7017c01Q8p0j38M77j17O0M62j06l26K14j49m51p3n4L04M77N0k41j1q2J46k48r1
7040a80J54m99P95l06OK23O4j18j56J36l15j67J29J55J20J66j2L47m82n3j22o1
$$ plain form
7062 -176 -244 -189 35 206 402 100 260 182 -159 -49 -338 -187 78 -92 77 192 316 72 95 -281 6
7083 6 -281 -247 60 -47 10 329 58 37 206 -281 -98 -135 -391 632 372 232 334 125 35 -499 -158 -260
7105 -260 -78 -153 -6 75 532 334 53 62 -292 -183 -434 -107 -64 152 270 389 134 -52 -26 20 -221 -365
7127 -365 -1 270 385 246 11 373 -223 29 -316 -109 -191 -48 268 154 433 248 -130 305 -26 -234
7147 -234 -328 -367 7 130 615 300 92 165 -146 -325 -551 -220 165 202 68 98 379 113 -241 -204 75 -317
7169 -317 122 56 167 -110 133 134 164 -49 -310 -160 35 -349 127 -100 290 426 118 47 1 -230 -432 -539
7191 -539 33 342 -133 625 281 -96 -124 -142 -191 -302 -297 -33 46 297 238 141 75 7 6 -270 -64 50 164 333
7215 333 390 -81 -51 -143 21 -45 -362 -447 -100 213 280 228 131 -1 -93 -259 -285 -224 -217 -6 -104 260 617 542 -364
$$ packed form
7062a76o8N5K24J71J96l02J60p8l41J10k89J51K65j70J69J15J24k44K3l76K87
7083Fk87L4L07j07N7L19k71k1J69m87J83l7k56J023k60j40J02k09r0n34L41j02
7105b60J82p5J47Q1M57j98k81Rl54J09k51L27M3K16J18J19k55j86K6M6k41j44
7127c65L64K71J15j39k35L62n96K52l45K07q2J43L16j14K79j85l78M35l31k08
7147b34r4l9L74J23M85l15k08P3l11j79k26L31L85L7j34L0K81k66l54L7K79l92
7169c17M39o6J11k77K43JL0k13k61J50J95l84M76k27L90J36l08p1m6k31k02j07
7191e39N72L09m75P58l44l77k8j8m9j11NK64P9K51n9r7o6o8jk76K06J14J14J69
7215C33N7m71L0r2J64o6l17q5L47L13O7n2r7j32r2j66k6O1PK11r8L64L57p5r06
$$ plain form
7240 -364 -213 52 -189 -333 -29 -43 228 270 200 -38 57 -277 -288 -103 -136 106 -115 114 -6 30 -44 200 -67
7263 -67 -196 -271 93 -136 -103 423 336 250 -97 -65 -155 -378 -112 -224 78 41 93 201 289 -171 -223 -167 -301 -110
7287 -110 116 28 364 350 37 80 4 -170 -385 -394 -335 189 192 571 157 151 107 162 18 -332 45 -93 -63 -119 225
7312 225 342 133 -329 -133 -248 -316 78 177 106 238 395 184 424 -98 -28 -84 -46 -114 -132 43 67 364 344
7335 344 -23 -28 -312 -436 110 -120 -176 200 130 -31 62 65 -200 -81 118 -337 -122 18 163 296 308 94 -8
7358 -8 -146 -196 -423 194 172 327 407 581 240 -188 -5 -239 88 -17 142 171 191 185 -17 221 -224 -163 -528
7381 -528 -152 -76 -40 96 123 131 223 125 -400 -88 -179 -27 37 199 291 31 333 39 157 88 -175 153 -158 65
7405 65 233 322 165 226 -44 -187 -105 -346 41 -68 61 245 223 192 69 -103 -23 -456 -295 -249 16 58 426
$$ packed form
7240c64J51K65k41j44L04j4K71M2p0k38R5l34j1J85l3K42k21K29j20L6p4K44k67
7263f7j29p5L64k29L3N26q7q6l47L2r0k23K66j12L02l7N2J08Q8m60n2N6j34J91
7287a10K26q8L36j4l13M3p6j74k15rN9N24LL79m14om4N5j44l50L77j38L0n6L44
7312B25J17k09m62J96j15o8L94R9p1J32J57k11K40n22P0n6L8o8j8J75K4K97k0
7335C44l67nk84j24N46k30n6L76p0j61R3Lk65J19J99m55K15J40J45J33J2k14j02
7358hj38n0k27O17k2J55Q0J74l41m28J83k34L27j05J59K9K0ok02K38m45O1l65
7381e28L76P6L6J36K7QR2r8n25L12r1J52O4J62R2k60L02k94J18o9k63L28l11K23
7405F5J68Q9j57O1k70j43Q2k41L87j09J29J84k2l1j23j72Q0m33J61M6K65M2L68
$$ plain form
7428 426 -1 -232 95 -184 -500 -195 -194 169 -354 153 208 134 -105 -201 -40 -282 -249 -72 118 150 -59 182
7450 182 -83 44 -22 -261 18 -368 196 119 215 -8 -25 42 86 -254 -90 -235 -118 -37 -118 50 199 195 -6
7473 -6 -22 -23 -22 -180 -296 -26 182 362 413 247 79 76 -210 -250 -315 24 65 -169 491 281 122 -93 -197 58
7497 58 -413 -31 -168 -64 397 250 32 76 9 -204 -51 -321 -321 97 128 284 477 -19 -17 -14 -404 -92 -410
7520 -410 163 120 -191 402 316 -36 -222 44 -269 -163 17 -251 -125 100 273 155 90 57 -88 -82 -354 -250
7542 -250 49 371 69 -31 188 -392 -224 -40 34 -169 -76 11 441 -69 -15 203 -360 -167 -384 -42 -117 -157
7564 -157 496 196 38 332 190 -201 58 -118 74 137 79 296 34 128 -71 -72 -345 -175 -33 -313 106 154
7586 154 157 61 119 -76 185 -158 -405 -88 72 -284 287 314 190 438 104 -189 -269 -254 -80 -297 -234 266 143
$$ packed form
7428D26m27k31L27k79l16L05JL63n23N07N5p4k39r6J61k42L3J77J90L2k09K41
7450A82k65J27o6k39K79l86N64p7R6k23j7O7M4l40J64j45J17Q1q1J68J49mk01
7473fj6jJj58j16K70K08J80N1j66j68lk86m0o5L39M1k34O60k10j59k15j04K55
7497E8m71L82j37J04M61j47k18M4o7k13J53k70%M18L1J56J93m96KLl90L12l18
7520d10N73m3l11N93q6l52j86K66l13J06J80k68J26K25J73j18o5l3j45Ok72J04
7542b50K99L22l02j00K19n80J68J84P4k03R3Q7M30n10N4K18n63J93k17L42p5m0
7564a57O53l00j58K94j42l91K59j76J92O3n8K17k62R4j99jk73J70J42k80M19M8
7586A54Lr6N8j95K61l43k47L17J60l56N71K7j24K48l34k93q0J5J74k17O3N00j23
$$ plain form
7609 143 301 284 -104 -88 -114 -268 216 273 22 369 293 -149 -103 -103 -373 -211 -103 156 -50 320 246 166 39
7632 39 -119 15 -572 -233 -36 168 95 201 421 -49 -92 -39 -218 -155 -382 69 159 316 256 33 97 160 -69
7655 -69 -151 -40 -91 71 166 101 229 147 -150 12 -221 -544 -410 -167 41 154 268 49 163 -178 174 -164
7677 -164 33 -378 -258 115 -97 364 100 -35 74 -7 -372 23 -202 -292 230 -80 -4 249 330 -71 -310
7698 -310 -8 -76 -30 -102 253 -130 282 230 -151 -147 -286 -88 -142 -261 -46 228 -75 99 79 -333 105 -127 -282
7721 -282 -358 235 165 201 54 164 23 -351 -229 70 -232 51 -126 -241 15 49 278 169 -265 -11 -302
7742 -302 -22 -178 -247 -73 138 395 212 -76 -175 -197 -298 52 37 45 12 400 -219 -91 -86 97 -286 -98 54
7765 54 20 206 12 338 178 -182 88 -201 -211 97 -25 82 186 446 170 369 -121 -230 -190 -157 -244 -74
$$ packed form
7609A43J58j7l88J6k6j54M84N7k51L47p6m42M6%k70J62J08K59k06L70p4q0j27
7632C9j58J34n87L39J97K04p3J06K20m70m3N3j79O3k27M51R0J57o0k23O4O3k29
7655f9q2J11n1J62R5o5J28q2k97J62k33l23J34K43K08J13J14k19J14l41L52l38
7677a64J97m11J20L73k12M61k64j35J09q1l65L95k25r0N22l10P6K53Q1m01k39
7698c10L02o8M6p2L55l83M12n2l81Mj39J98n4j19K15K74l03J74k0m12M38k32j55
7721b82p6N93p0L6j47J10j41l74J22K99l02K83j77j15K56L4K29j09m34K54k91
7742c02K80j56o9J74K11K57j83k88r9k2j01L50j5Ql3L88o19J28NJ83l83J88J52
7765E4l4J86j94L26j60l60K70k89j0L08j22J07J04K60k76J99m90j09M0L3q7J70
$$ plain form
7787 -74 -199 -159 94 143 111 31 -210 305 -147 46 -131 349 158 174 199 214 -126 -226 -93 247 87 223 395
7810 395 -27 162 370 -80 -248 -45 -212 -403 21 228 329 318 123 -146 78 -85 -90 115 -206 183 70
7831 70 401 258 7 65 -54 -202 -83 0 -16 110 333 100 66 452 -348 -262 -135 -147 69 -124 244 508
7853 508 8 56 106 -154 51 -499 9 -36 -157 118 144 352 49 247 -295 -156 -92 -68 115 274 286 465
7875 465 300 277 40 -54 -278 -221 -56 -50 45 -21 467 -175 -55 -239 -189 -317 -181 103 67 204 372 33 99
7898 99 63 65 -224 -263 -348 -25 120 111 114 -116 -115 -121 -205 -182 90 -74 141 303 184 266 92 105 96 -81 -66 -24 -137
7925 -137 -179 239 -110 403 -169 -10 0 -268 203 -163 205 60 411 235 -61 216 185 123 -277 -228 27 -129
7947 -129 441 -105 -64 109 160 178 105 -248 141 -223 -213 160 135 -188 29 -207 -124 -13 8 -253 -99 161 333
$$ packed form
7787g4j25M0K53M9l2q0k41N15m52J93j77M80j91J6K5J5l40j00J33L40j60J36J72
7810C95m22J89K08m50j68K03j67j91M24K07J01j1j95k69K24j63nK05l21L89j13
7831G0L31j43k51N8j19j48J19Q3j6J26K23k33l4L86q00Q6J27j2K16j93L68K64
7853E08n00M8N0k60K05n50N08m5j21K75K6K08l03J98n42J39O4K4J83J59J2J79
7875D65j65k3k37r4k24N7J65OR5o6M88o42J20j84N0j28J36K84l6J37J68l39O6
7898I9l6Kk89l9q5L23J45rLk30Joq4K3K72j64K15J62j19Q2j74J3rj77J5M2j13
7925a37m2M18l49N13n72J59J0k68M71l66L68j45L51j76k96K77l1o2m00M9K55j56
7947a29N70n46M1J73N1J8p3l53L89l64J0L73k5l23K17k36Q3J11K1k61J54K60J72
$$ plain form
7970 333 234 60 -92 -101 -443 145 -78 -60 367 -185 287 24 46 95 216 -140 -38 -286 -179 36 47 116 64
7993 64 66 49 -261 -417 -41 -218 -246 -101 286 40 10 20 78 -211 -82 -44 -8 -32 161 -6 -220 -58 -121 -413
8017 -413 -105 -329 -344 -201 169 383 3 -55 133 -64 -159 -278 270 24 448 -254 283 -25 -128 -173 -108 -303
8039 -303 -42 127 -193 10 -47 1 366 383 -174 99 -171 -177 -168 -13 68 114 -111 100 -25 28 -628 -183 -183 -54
8063 -54 188 50 262 145 147 -256 -465 123 164 172 326 9 370 -42 -15 179 -137 -4 180 -167 -44 9 102
8086 102 94 203 -13 3 -674 -150 31 -107 129 14 199 63 165 -60 54 44 -63 41 -144 41 150
8107 150 33 181 -96 24 -40 -43 -108 -237 86 -147 306 -12 384 -44 -19 167 50 -317 107 -347 76 172
8129 172 75 319 6 15 -12 -213 -146 36 -38 90 301 152 40 -20 -145 -87 -180 146 -60 176 -71 -294 -4
$$ packed form
7970C33r9j74j52rl42N88k23J8M27n52M72k63K2M9J21l56J02k48J07K15J1O9n2
7993F4Kj7l10j56L76j77k8J45L87k46l0J0N8k89J29L8L6k4J93j67k14J62o3k92
8017d13L08k24j5J43L70K14l80n8J88j97r5j19N48k46M24p02N37l08j03m5O5j95
8039c03K61J69l20K03n7M8L65J7n57K73k70oRJ55Q1M6k25K11j25N3o56M45%J29
8063e4K42j38K12j17Km03k09N88M1QJ54l17L61m12K7J94l16J33J84l47J23N3R3
8086A02qJ09k16J6o77N24J81j38K36j15J85j36J02k25J14j0j07J04j85J85J09
8107A50j17J48k77J20o4lo5j29L23k33M53l18L96m28K5J86j17l67M24m54M23R6
8129A72r7K44l13Rk7k01O7J82p4J28K11j49j12o0j25N8r3L26k06K36k47k23K90
$$ plain form
8152 -4 80 -192 11 -287 254 -121 -67 386 122 91 124 71 221 -2 -237 9 -370 156 65 54 -383 -219 150
8175 150 -230 -94 -190 9 157 214 198 -24 -112 18 94 -332 -391 -162 314 380
$$ packed form
8152dQ4k72K03k98N41l75N4M53k64l1L3n3J50k23k35K46l79N26r1j1m37J64L69
8175A50l80J36r6J99J48N7j6k22q8J30P6m26n9K29M76O6
8191C80
$$ Imaginary data points
##PAGE= N=2
##DATA TABLE= (X++(I..I)), XYDATA
$$ plain form
0 0 0 0 0 0 0 0 8 -8 8 -16 16 -24 24 -32 40 -48 64 -72 88 -100 116 -138 156 -185 210 -241 275 -309 355
29 355 -398 448 -504 564 -633 706 -786 875 -970 1079 -1194 1323 -1466 1620 -1797 1990
45 1990 -2210 2455 -2733 3058 -3430 3875 -4406 5060 -5890 6972 -8467 10662 -14227 21026
59 21026 -38795 189244 440704 226964 47903 -165676 -283624 -365506 -307167 -146944 100963
70 100963 291507 378180 318936 177150 -19933 -204890 -341582 -357307 -245042 -34667 172867
81 172867 312650 343586 273998 111428 -94776 -276776 -353924 -303865 -153081 35306 210498
92 210498 322295 332326 220145 22441 -180537 -306162 -324043 -243920 -91836 97773 264707
103 264707 339083 284953 131497 -56863 -217585 -308169 -301953 -194308 -14511 173424 297805
$$ packed form
0@%%%%%%Qj6J6k4L2m0M8n6P2q8J12j36J60j88K16k54K94l41L95m51N16n84O64
29C55p53Q46r52J068j197J339j492J661j845K049k273K517k789L086l417L787
45A990m200M665n188N791o488P305q281R466j0950J2862j5439J9129k4889L5253
59B1026n9821K28039K51460k13740j79061k13579j17948q1882N8339J60223K47907
70A00963J90544Q6673n9244j41786j97083j84957j36692j5725J12265K10375K07534
81A72867J39783L0936o9588j62570k06204j82000p7148N0059J50784J88387J75192
92B10498J11797J0031j12181j97704k02978j25625j7881Q0123J52084J89609J66934
103B64707P4376n4130j53456j88360j60722r0584O216J07645J79797J87935J24381
$$ plain form
114 297805 313338 221510 63476 -109529 -249577 -313114 -267286 -121315 65511 219970 295851
125 295851 279703 174878 4418 -173557 -287680 -294311 -200804 -48135 115330 244908 298325
136 298325 248756 107414 -73632 -222168 -286692 -256338 -148178 5518 165662 275136
146 275136 285701 189562 28520 -133060 -243720 -275696 -222406 -94673 70962 215474 280607
157 280607 242844 123834 -29661 -170950 -260663 -266182 -176568 -22825 134521 238017 260418
168 260418 200227 73669 -81992 -213754 -269661 -229590 -111060 40100 172099 247093 243361
179 243361 158130 14736 -137929 -239032 -251197 -178697 -53542 86095 202462 254960 217258
190 217258 100438 -49192 -175702 -239076 -223856 -136106 -2169 136392 229888 241110 167712
$$ packed form
114B97805J5533r1828j58034j73005j40048o3537M5828J45971J86826J54459P5881
125B95851j6148j04825j70460j77975j14123o631R3507J52669J63465J29578N3417
136B98325m9569j41342j81046j48536o4524L0354J08160J53696J60144J09474
146B75136J0565r6139j61042j61580j10660l1976N3290J27733J65635J44512O5133
157B80607l7763j19010j53495j41289q9713n519Q9614J53743J57346J03496K2401
168B60418o0191j26558j55661j31762n5907M0071J18530J51160J31999P4994l732
179B43361q5231j43394j52665j01103j2165P2500J25155J39637J16367N2498l7702
190B17258j16820j49630j26510o3374J5220Q7750J33937J38561R3496J1222p3398
$$ plain form
201 167712 40194 -95393 -197014 -235580 -196346 -87018 55284 176477 233230 209384 118477
212 118477 -8664 -134833 -218022 -227445 -154675 -28229 104105 194769 220600 177179 74232
223 74232 -58771 -174628 -227331 -197793 -102864 20482 134880 206765 210642 139709 18200
234 18200 -108895 -195475 -213287 -161358 -58471 62333 165643 213704 185446 89923 -33812
245 -33812 -140954 -199835 -194749 -126479 -11963 109061 190313 202010 145509 43381 -70922
256 -70922 -163527 -203252 -172638 -79616 40946 143348 193692 179609 108605 1403 -109427
267 -109427 -184463 -193150 -133124 -29368 80103 160833 189932 157115 69113 -45212 -144090
278 -144090 -189402 -167580 -92276 10627 110096 176288 182555 123196 18774 -87571 -160319
$$ packed form
201A67712j27518j35587j01621l8566L9234J09328J42302J21193N6753k3846r0907
212A18477j27141j26169q3189r423P2770J26446J32334R0664K5831m3421j02947
223G4232j33003j15857n2703K9538R4929J23346J14398P1885L877p0933j21509
234A8200j27095q6580j7812N1929J02887J20804J03310M8061k8258r5523j23735
245c3812j07142n8881N086O8270J14516J21024Q1252J1697n6501j02128j14303
256g0922r2605l9725L0614R3022J20562J02402N0344j4083p1004j07202j10830
267a09427p5036q687O0026J03756J09471Q0730K9099l2817q8002j14325r8878
278a44090m5312K1822P5304J02903R9469O6192O267n9359j04422j06345p2748
$$ plain form
289 -160319 -179283 -141661 -56689 50071 142110 182860 158045 79157 -23044 -114809 -169613
300 -169613 -169485 -111573 -12363 91413 160475 171671 126354 41488 -56442 -138712 -175020 -148700
312 -148700 -69306 32231 118788 164274 156390 97914 4501 -92835 -157659 -164922 -114919 -28642
324 -28642 65093 138188 166304 138016 60652 -37956 -120810 -159581 -144959 -82912 6471 95994
336 95994 154391 158640 106740 19405 -71221 -135721 -155900 -124625 -50098 44971 124116 157658
348 157658 136641 71402 -15003 -96523 -148085 -149131 -96123 -9269 78774 137060 148610 113184
360 113184 40142 -48545 -122646 -153357 -128910 -60003 25961 100695 143066 139064 87497 2931
372 2931 -83105 -137719 -143542 -101311 -28224 53941 120230 146819 121119 51755 -34539 -105300
$$ packed form
289a60319j8964L7622Q4972J06760R2039M0750k4815p8888j02201r1765n4804
300a69613J28N7912R9210J03776O9062J1196m5317q4866r7930q2270l6308K6320
312a48700P9394J01537Q6557M5486p884n8476r3413r7336o4824p263N0003Q6277
324b8642R3735P3095K8116k8288p7364r8608q2854l8771J4622O2047Q9383Q9523
336I5994N8397M249n1900q7335r0626o4500k0179L1275P4527R5069P9145L3542
348A57658k1017o5239q6405q1520n1562j046N3008Q6854Q8043N8286J1550l5426
360A13184p3042q8687p4101l0711K4447O8907Q5964P4734M2371m002n1567q4566
372B931q6036n4614n823M2231P3087Q2165O6289K6589k5700o9364q6294p0761
$$ plain form
384 -105300 -140148 -129014 -76169 3966 85149 136461 138749 92365 17265 -61943 -119807 -139624
396 -139624 -112138 -43975 40058 109141 138460 120481 64426 -12403 -86415 -133336 -132505 -84432
408 -84432 -7705 69133 120948 133345 102483 36005 -45187 -110302 -135463 -113246 -53978 21218
420 21218 90045 129602 126355 77522 837 -74702 -121609 -127493 -92109 -26710 49397 111130
432 111130 132963 107239 44971 -30521 -93211 -126142 -118208 -69610 4744 78638 123163 123385
444 123385 82642 16656 -54532 -109782 -128632 -101935 -38220 37635 97499 123467 109311 59935
456 59935 -10886 -80414 -122380 -120270 -75394 -7296 61237 109119 122094 94898 32912 -42028
468 -42028 -100927 -122867 -102331 -50213 18279 82345 119800 115936 70075 768 -66694 -109708
$$ packed form
384a05300l4848J1134N2845Q0135Q1183N1312K288m6384p5100p9208n7864j9817
396a39624K7486O8163Q4033O9083K9319j7979n6055p6829p4012m6921Q31M8073
408h4432P6727P6838N1815J2397l0862o6478q1192o5115k5161K2217N9268P5196
420B1218O8827L9557l247m8833p6685p5539m6907n884L5384O5399P6107O1733
432A11130K1833k5724o2268p5492o2690l2931P934M8598P4354P3894M4525K22
444A23385m0743o5986p1188n5250j8850K6697O3715P5855N9864K5968j4156m9376
456E9935p0821o9528m1966K110M4876O8098O8533M7882J2975k7196o1986p4940
468d2028n8899k1940K0536N2118O8492O4066L7455l864m5861o9307o7462m3014
$$ plain form
480 -109708 -117026 -86055 -25319 45888 102166 121247 97920 42407 -25253 -84329 -116716 -109982
492 -109982 -63845 5532 71602 111213 112368 77538 17360 -49590 -101928 -119020 -93417 -34784
504 -34784 32792 87531 113351 102483 57019 -10279 -75125 -112628 -109833 -70558 -9259 54368
516 54368 101272 114135 87127 28882 -38942 -91261 -112342 -96556 -49552 15528 76844 111499
528 111499 105904 63469 1595 -59016 -100713 -110235 -82296 -23857 43693 93997 110610 89858
540 89858 40803 -21096 -77401 -109732 -103040 -59264 5287 65297 101185 104595 74391 18668
552 18668 -45828 -94665 -109763 -85956 -33404 28243 79774 105775 97092 53732 -9586 -68378
564 -68378 -102609 -100911 -66633 -11515 49234 94517 107296 81612 27412 -34285 -82426 -103416
$$ packed form
480a09708p318L0971O0736P1207N6278J9081k3327n5513o7660n9076l2387O734
492a09982M6137O9377O6070L9611J155l4830o0178o6950n2338j7092K5603N8633
504c4784O7576N4739K5820j0868m5464o7298o4846l7503K795L9275O1299O3627
516E4368M6904J2863k7008n8245o7824n2319k1081J5786M7004O5080O1316L4655
528A11499n595m2435o1874o0611m1697r522K7939N8439O7550N0304J6613k0752
540H9858m9055o1899n6305l2331O692M3776O4551O0010L5888L410l0204n5723
552A8668o4496m8837j5098K3807N2552O1647N1531K6001q683m3360o3318n8792
564f8378l4231J698L4278N5118O0749M5283J2779k5684n4200o1697m8141k0990
$$ plain form
576 -103416 -91434 -48397 13268 71172 103067 97827 60078 3696 -52730 -93160 -103290 -77423
588 -77423 -23020 39171 85821 102141 84746 40739 -17618 -71727 -101803 -95663 -55624 2390
600 2390 57782 93414 98360 71055 18539 -41641 -87000 -100869 -80286 -33713 23140 73162
612 73162 99826 92002 50947 -7362 -61408 -93256 -94401 -65064 -13375 44800 87945 99678
624 99678 75812 27213 -29026 -74488 -96495 -86721 -46555 11356 64881 94112 90774 57894
636 57894 7068 -47231 -86961 -97046 -72236 -22540 34252 76926 94445 80768 40544 -14806
648 -14806 -66797 -94347 -88078 -51909 -983 49975 85797 93306 67964 17910 -38031 -79132
660 -79132 -92726 -75525 -34504 18624 67198 93057 85662 47922 -5364 -54897 -85173 -88413
$$ packed form
576a03416J1982M3037O1665N7904L1895n240l7749n6382n6426m0430j0130K5867
588g7423N4403O2191M6650J6320j7395m4007n8357n4109l0076O140M0039N8014
600B390N5392L5632M946k7305n2516o0180m5359j3869K0583M6573N6853N0022
612G3162K6664p824m1055n8309n4046l1848j145K9337N1689N8175M3145J1733
624I9678k3866m8599n6239m5462k2007R774M0166N7911N3525K9231l338l2880
636E7894n0826n4299l9730j0085K4810M9696N6792M2674J7519j3677m0224n5350
648a4806n1991k7550O269L6169N0926N0958L5822P509k5342n0054n5941m1101
660g9132j3594J7201M1021N3128M8574K5859p395l7740n3286m9533l0276l240
$$ plain form
672 -88413 -62899 -14347 40460 80999 92028 71055 27678 -23322 -67495 -90217 -81966 -44236
684 -44236 9230 58461 86020 84967 56614 9353 -42220 -80358 -90043 -67479 -22175 28520
696 28520 69292 87918 77550 39638 -12821 -60047 -86321 -81904 -50819 -3795 44807 79721
708 79721 87655 63958 18072 -33058 -70993 -84926 -72060 -35122 15425 61935 85764 78831
720 78831 45510 -1479 -47057 -78491 -83759 -60514 -14511 36443 73016 83632 66419 29244
732 29244 -18258 -61569 -84638 -76928 -41755 6822 51210 77764 79565 55302 11288 -37813
744 -37813 -73795 -82765 -62977 -22960 23453 62174 81567 73426 38623 -10305 -54105 -78140
756 -78140 -75575 -49465 -6723 39737 73370 81095 59594 18183 -27742 -63488 -78611 -68517
$$ packed form
672h8413K5514M8552N4807M0539J1029k0973m3377n1000m4173k2722Q251L7730
684d4236N3466M9231K7559j053k8353m7261n1573l8138r685K2564M5304N0695
696B8520M0772J8626j0368l7912n2459m7226k6274M417L1085M7024M8602L4914
708G9721P934k3697m5886n1130l7935j3933J2866L6938N0547M6510K3829o933
720G8831l3321m6989m5578l1434n268K3245M6003N0954L6573J0616j7213l7175
732B9244m7502m3311k3069P710L5173M8577M4388K6554J801k4263m4014m9101
744c7813l5982q970J9788M0017M6413L8721J9393q141l4803m8928m3800k4035
756g8140K565K6110M2742M6460L3633P725k1501m1411m5925l5746j5123J0094
$$ plain form
768 -68517 -34700 12799 55998 78510 72945 43831 1191 -42060 -72293 -78128 -56832 -14585
780 -14585 31568 65604 77038 63725 29441 -15960 -56714 -77644 -70973 -39630 3917 45050
792 45050 71310 74357 52404 11375 -34394 -66494 -75578 -59156 -23983 19354 57099 76130
804 76130 68083 36121 -7811 -47839 -70901 -71107 -47873 -7875 35925 67431 74262 55585 19265
817 19265 -22645 -57590 -73651 -64789 -32908 10909 49976 71019 67627 42499 3733 -37303
829 -37303 -66630 -73032 -53030 -15113 26843 58529 70756 60770 28861 -13576 -51655 -70870
841 -70870 -65228 -38167 401 39229 65582 69821 49725 11467 -30198 -59762 -69303 -56141 -24894
854 -24894 15698 51776 70354 63426 33888 -5303 -41823 -64733 -66718 -45801 -8544 32249
$$ packed form
768f8517L3817M7499M3199K2512n565k9114m2640m3251l0233n835K1296M2247
780a4585M6153L4036J1434j3313l4284m5401m0754k0930O671L1343M3547M1133
792D5050K6260L047k1953m1029m5769l2100r084J6422L5173M3337L7745J9031
804G6130q047l1962m3932m0028k3062k06K3234L9998M3800L1506O831j8677l6320
817A9265m1910l4945j6061Q862L1881M3817L9067K1043l392k5128l8766m1036
829c7303k9327o402K0002L7917M1956L1686J2227r986l1909m2437l8079j9215
841g0870N642K7061L8568L8828K6353M239k0096l8258m1665k9564r541J3162L1247
854b4894M0592L6078J8578o928k9538l9191l6520k2910j985K0917L7257M0793
$$ plain form
866 32249 61176 68294 51881 19521 -18890 -52421 -68402 -60470 -31115 9190 44732 64272
878 64272 63162 41347 5143 -33754 -61852 -67008 -48869 -14506 23320 53319 65857 56983 27972
891 27972 -11676 -46801 -64751 -60300 -36227 -1021 35266 60936 64682 46043 11332 -25847
903 -25847 -54271 -64121 -53394 -23904 14236 47841 64362 57803 32407 -3097 -37184 -59922
915 -59922 -62878 -43424 -8147 29631 55459 62252 49053 20255 -16256 -48637 -63463 -56110 -29087
928 -29087 7136 39680 59008 59495 39807 5916 -30873 -56354 -61620 -45811 -15641 19158 48438
941 48438 61779 53595 26062 -10176 -42064 -58660 -56389 -35901 -2703 32327 56380 59975 43122
$$ packed form
866C2249K8927P118j6413l2360l8411l3531j5981P932K9355M0305L5542J9540
878F4272j110k1815l6204l8897k8098n156J8139L4363L7826K9999J2538q874k9011
891B7972l9648l5125j7950M451K4073L5206L6287K5670L746j8639l4711l7179
903b5847k8424r850J0727K9490L8140L3605J6521o559k5396l5504l4087k2738
915e9922k956J9454L5277L7778K5828O793j3199k8798l6511l2381j4826P353K7023
928b9087L6223L2544J9328M87j9688l3891l6789k5481n266J5809L0170L4799K9280
941D8438J3341q184k7533l6238l1888j6596K271K0488L3198L5030K4053L595j6853
$$ [...]
8191B40
##END NTUPLES=NMR FID
##END=
