##TITLE=1H_DE-46EA_D2O
 D2O
 8 sc, 
 12.7.2024
##JCAMPDX= 6.0         $$ Bruker NMR JCAMP-DX V2.0
##DATA TYPE= NMR FID
##DATA CLASS= NTUPLES
##ORIGIN= UXNMR, Bruker Analytische Messtechnik GmbH
##OWNER= root
$$ XWIN-NMR		Version 3.5
$$ Fri Jul 12 15:42:46 2024 Russian Standard Time (UT+4h)  she@DPX200
##.OBSERVE FREQUENCY= 200.1314
##.OBSERVE NUCLEUS= ^1H
##.DELAY= (6, 6)
##.ACQUISITION MODE= SIMULTANEOUS
##.ACQUISITION SCHEME= undefined
##.AVERAGES= 8
##.DIGITISER RES= 18
##SPECTROMETER/DATA SYSTEM= spect
##.PULSE SEQUENCE= zg30
##.SOLVENT NAME= CDCl3
##.SHIFT REFERENCE= (INTERNAL, CDCl3, 0, 15.7039)
##AUDIT TRAIL= $$ (NUMBER, WHEN, WHO, WHERE, WHAT)
$$ ##TITLE= Audit trail, XWIN-NMR		Version 3.5
$$ ##JCAMPDX= 5.01
$$ ##ORIGIN= Bruker BioSpin GmbH
$$ ##OWNER= she
$$ F:/spectra/data/she/nmr/H-F/1/audita.txt
$$ ##AUDIT TRAIL=  $$ (NUMBER, WHEN, WHO, WHERE, WHAT)
(   1,<2024-07-12 15:40:46.93 +0400>,<she>,<DPX200>,
      <created by zg, POWCHK disabled, PULCHK disabled
       configuration hash MD5:
       00 E9 B6 7A A2 85 ED C7 34 08 36 98 17 FE 4E 26
       data hash MD5: 16K
       D8 01 5C 0D B6 46 3F E9 80 E2 53 4B 95 1C C4 29>)
$$ ##END=
$$ 
$$ hash MD5
$$ 77 9D 29 2A 5A 8D 49 F7 88 DD 49 8F 3D 7A 2B E4
##$RELAX= 
##$RELAX= 
##$RELAX= 
##$RELAX= 
##$RELAX= 
##$RELAX= 
$$ Bruker specific parameters
$$ --------------------------
##$DU= <F:/spectra>
##$EXPNO= 1
##$NAME= <H-F>
##$PROCNO= 1
##$TYPE= <nmr>
##$USER= <she>
##$AMP= (0..31)
100 100 100 100 100 100 100 100 100 100 100 100 100 100 100 100 100 100 
100 100 100 100 100 100 100 100 100 100 100 100 100 100 
##$AQSEQ= 0
##$AQ_mod= 1
##$AUNM= <au_zg>
##$AUTOPOS= <>
##$BF1= 200.13
##$BF2= 200.13
##$BF3= 200.13
##$BF4= 200.13
##$BF5= 200.13
##$BF6= 200.13
##$BF7= 200.13
##$BF8= 200.13
##$BYTORDA= 1
##$CFDGTYP= 0
##$CFRGTYP= 5
##$CHEMSTR= <none>
##$CNST= (0..31)
1 1 145 1 1 1 1 1 1 1 1 1 1 1 1 1 1 1 1 1 1 1 1 1 1 1 1 1 1 1 1 1 
##$CPDPRG= <>
##$CPDPRG1= <>
##$CPDPRG2= <>
##$CPDPRG3= <>
##$CPDPRG4= <mlev>
##$CPDPRG5= <mlev>
##$CPDPRG6= <mlev>
##$CPDPRG7= <mlev>
##$CPDPRG8= <mlev>
##$CPDPRGB= <>
##$CPDPRGT= <>
##$D= (0..31)
0 1.2 0 0 0 0 0 0 0 0.06 0 0.03 0 0 0 0 0.0002 0 0 0 0 0 0 0 0 0 0 0 0 
0 0 0 
##$DATE= 1720784446
##$DBL= (0..7)
120 120 120 120 120 120 120 120 
##$DBP= (0..7)
150 150 150 150 150 150 150 150 
##$DBP07= 0
##$DBPNAM0= <>
##$DBPNAM1= <>
##$DBPNAM2= <>
##$DBPNAM3= <>
##$DBPNAM4= <>
##$DBPNAM5= <>
##$DBPNAM6= <>
##$DBPNAM7= <>
##$DBPOAL= (0..7)
0.5 0.5 0.5 0.5 0.5 0.5 0.5 0.5 
##$DBPOFFS= (0..7)
0 0 0 0 0 0 0 0 
##$DE= 6
##$DECBNUC= <off>
##$DECIM= 24
##$DECNUC= <off>
##$DECSTAT= 4
##$DIGMOD= 1
##$DIGTYP= 9
##$DL= (0..7)
0 120 120 120 120 120 120 120 
##$DP= (0..7)
150 150 150 150 150 150 150 150 
##$DP07= 0
##$DPNAME0= <>
##$DPNAME1= <>
##$DPNAME2= <>
##$DPNAME3= <>
##$DPNAME4= <>
##$DPNAME5= <>
##$DPNAME6= <>
##$DPNAME7= <>
##$DPOAL= (0..7)
0.5 0.5 0.5 0.5 0.5 0.5 0.5 0.5 
##$DPOFFS= (0..7)
0 0 0 0 0 0 0 0 
##$DQDMODE= 0
##$DR= 18
##$DS= 0
##$DSLIST= <SSSSSSSSSSSSSSS>
$$ [...]
##$SUBNAM2= <"">
##$SUBNAM3= <"">
##$SUBNAM4= <"">
##$SUBNAM5= <"">
##$SUBNAM6= <"">
##$SUBNAM7= <"">
##$SUBNAM8= <"">
##$SUBNAM9= <"">
##$SW= 24.0689651099613
##$SWIBOX= (0..15)
0 0 2 0 0 0 0 0 0 0 0 0 0 0 0 0 
##$SW_h= 4816.95568400771
##$TD= 16384
##$TD0= 1
##$TE= 0
##$TE2= 300
##$TE3= 300
##$TEG= 300
##$TL= (0..7)
0 120 120 120 120 120 120 120 
##$TP= (0..7)
150 150 150 150 150 150 150 150 
##$TP07= 0
##$TPNAME0= <>
##$TPNAME1= <>
##$TPNAME2= <>
##$TPNAME3= <>
##$TPNAME4= <>
##$TPNAME5= <>
##$TPNAME6= <>
##$TPNAME7= <>
##$TPOAL= (0..7)
0.5 0.5 0.5 0.5 0.5 0.5 0.5 0.5 
##$TPOFFS= (0..7)
0 0 0 0 0 0 0 0 
##$TUNHIN= 0
##$TUNHOUT= 0
##$TUNXOUT= 0
##$USERA1= <user>
##$USERA2= <user>
##$USERA3= <user>
##$USERA4= <user>
##$USERA5= <user>
##$V9= 5
##$VALIST= <valist>
##$VCLIST= <CCCCCCCCCCCCCCC>
##$VD= 0
##$VDLIST= <DDDDDDDDDDDDDDD>
##$VPLIST= <PPPPPPPPPPPPPPP>
##$VTLIST= <TTTTTTTTTTTTTTT>
##$WBST= 1024
##$WBSW= 4
##$XGAIN= (0..3)
0 0 0 0 
##$XL= 0
##$YL= 0
##$YMAX_a= 313313
##$YMIN_a= -324814
##$ZGOPTNS= <>
##$ZL1= 120
##$ZL2= 120
##$ZL3= 120
##$ZL4= 120
##$ABSF1= 10
##$ABSF2= 0
##$ABSG= 5
##$ABSL= 3
##$ALPHA= 0
##$AQORDER= 0
##$ASSFAC= 0
##$ASSFACI= 0
##$ASSFACX= 0
##$ASSWID= 0
##$AUNMP= <proc_1d>
##$AZFE= 0.1
##$AZFW= 0.1
##$BCFW= 1
##$BC_mod= 2
##$BYTORDP= 1
##$COROFFS= 0
##$CY= 11.3945322036743
##$DATMOD= 1
##$DC= 2
##$DFILT= <>
##$DTYPP= 0
##$F1P= 15.6554695791079
##$F2P= 12.8336369535428
##$FCOR= 0.5
##$FTSIZE= 0
##$FT_mod= 4
##$GAMMA= 1
##$GB= 0.15
##$INTBC= 1
##$INTSCL= 1
##$ISEN= 128
##$LB= 0.24
##$LEV0= 0
##$LPBIN= 0
##$MAXI= 10000
##$MC2= 0
##$MEAN= 0
##$ME_mod= 0
##$MI= 1.114404
##$NCOEF= 0
##$NC_proc= 0
##$NLEV= 6
##$NOISF1= 3.799351
##$NOISF2= 2.8
##$NSP= 1
##$NTH_PI= 0
##$NZP= 0
##$OFFSET= 15.70392
##$PC= 1
##$PHC0= -25668.27
##$PHC1= 40.98748
##$PH_mod= 1
##$PKNL= yes
##$PPARMOD= 0
##$PSCAL= 0
##$PSIGN= 0
##$REVERSE= no
##$SF= 200.130013532006
##$SI= 16384
##$SIGF1= 3
##$SIGF2= 2
##$SINO= 400
##$SIOLD= 16384
##$SREGLST= <1H.CDCl3>
##$SSB= 0
##$STSI= 0
##$STSR= 0
##$SW_p= 3612.71676300578
##$SYMM= 0
##$S_DEV= 0
##$TDeff= 0
##$TDoff= 0
##$TI= <>
##$TILT= no
##$TM1= 0
##$TM2= 0
##$TOPLEV= 0
##$USERP1= <user>
##$USERP2= <user>
##$USERP3= <user>
##$USERP4= <user>
##$USERP5= <user>
##$WDW= 1
##$XDIM= 8192
##$YMAX_p= 0
##$YMIN_p= 0
$$ End of Bruker specific parameters
$$ ---------------------------------
##NTUPLES= NMR FID
##VAR_NAME=  TIME,          FID/REAL,        FID/IMAG
##SYMBOL=    X,             R,               I
##VAR_TYPE=  INDEPENDENT,   DEPENDENT,       DEPENDENT
##VAR_FORM=  AFFN,          ASDF,            ASDF
##VAR_DIM=   8192,          8192,            8192
##UNITS=     SECONDS,       ARBITRARY UNITS, ARBITRARY UNITS
##FACTOR=    0.0002076,     1,               1
##FIRST=     0,             0,               0
##LAST=      1.7004516,     0,               0
##MIN=       0,             -324814,         0
##MAX=       1.7004516,     313313,          0
$$ Real data points
##PAGE= N=1
##DATA TABLE= (X++(R..R)), XYDATA
$$ [...]
$$ plain form
2659 -2120 -6569 -3293 3585 6522 1996 -5243 -5917 210 5839 4923 -1761 -6594 -3673 3076 6525
2674 6525 1681 -4695 -5478 -159 5725 5035 -1824 -6490 -3501 3315 6223 2046 -4749 -5998 -190
2689 -190 5983 5197 -1787 -6358 -3384 3349 6414 2309 -4444 -5721 -184 5742 4634 -1483 -6046
2704 -6046 -3615 2948 6504 1944 -4194 -5727 -36 5464 5028 -1150 -5856 -3733 2816 6033 2111
2719 2111 -4188 -5508 -644 5311 5310 -1004 -6076 -3821 2602 6025 2184 -4108 -5737 -814 5261 4937
2735 4937 -1115 -6005 -3529 2429 5773 2710 -4054 -5862 -739 5070 4835 -803 -5838 -3904 2419
2750 2419 6011 2342 -3904 -5445 -1001 4788 5055 -747 -5916 -3898 2449 5975 2390 -3949 -5650
2765 -5650 -1126 5136 5191 -805 -5789 -3642 2510 5684 2408 -3268 -5419 -1369 4757 5233 -570 -5280
$$ packed form
2659b120m449L276O878K937m526p239o74O127N629r16o684m833K921O749L449
2674F525m844o376p83N319N884o90o859m666K989O816K908m177o795j249N808
2689a90O173p86o984m571K974O733L065m105o753j277N537N926j108o117m563
2704f046K431O563L556m560o138j533N691N500m36o178m706K123O549L217l922
2719B111o299j320M864N955jo314n072K255O423L423l841o292j629M923O075l24
2735D937o052m890K476N958L344l063o764j808N123N809k35n638n035J934O323
2750B419L592l669o246j541M444N789K67n802n169K018O347L526l585o339j701
2765e650M524O262N5n996m984K147O152L174l276n676k151M050O126M76n803m710
$$ plain form
2781 -5280 -4040 2031 5698 2885 -3849 -5509 -1229 4510 4981 -226 -5061 -4256 2231 5505 2800
2796 2800 -3406 -5464 -1291 4323 5217 -380 -5321 -3738 2164 5523 2447 -3369 -5594 -1459 4580
2811 4580 5233 -265 -5348 -3937 1367 5958 3218 -3064 -5912 -1377 4491 5148 -163 -4949 -4332 1634
2827 1634 5471 2772 -2953 -5581 -1291 4168 5096 215 -4746 -4517 1404 5601 3091 -2828 -5399
2842 -5399 -1528 3802 5279 57 -4948 -4179 1375 5628 3079 -2485 -5294 -1698 4193 5031 400
2857 400 -4849 -4206 1437 5226 3327 -2776 -5259 -1809 3860 4944 323 -4419 -4443 1242 5302 3698
2873 3698 -2249 -5259 -2187 3684 4983 657 -4770 -4195 1041 5022 3327 -2530 -5327 -2006 3303
2888 3303 5200 673 -4552 -4650 753 4948 3249 -2303 -5379 -2373 3352 4856 543 -4361 -4375 471
$$ packed form
2781e280J240O071L667k813o734j660M280N739M71n207m835Q05O487L274k705
2796B800o206k058M173N614Q94n597m941J583N902L359l076n816k225M135O039
2811D580O53n498n083J411N304M591k740o282k848M535N868O57n311m786O17N966
2827A634L837k699n725k628M290N459R28m881m961K29N921M197k510n919k571
2842e399L871N330J477n222n005P69N554M253k549n564k809L596N891Q38m631
2857D00n249O43N643L789j899o103k483L450N669J084m621m742k4N685M060j604
2873C698n947l010L072N871J299m326n427N75N236L981j695n857k797L321N309
2888C303J897m527n225r8N403M195j699n552l076L006N725J504m313m904j4M846
$$ plain form
2904 471 4821 3331 -1868 -5219 -2050 3331 4843 746 -4104 -4478 363 4969 3445 -2088 -4761
2919 -4761 -2200 3288 5044 1016 -4400 -4505 589 4703 3578 -1576 -5160 -2244 3018 4968 1009
2934 1009 -4219 -4007 392 4625 3551 -1587 -5179 -2459 2841 4745 771 -4099 -4178 364 4492 3716
2950 3716 -1737 -5006 -2351 3043 4784 1448 -4092 -4295 195 4533 3659 -1396 -4945 -2314 3035
2965 3035 4933 1319 -3900 -4452 46 4352 3620 -1512 -4824 -2853 2576 4901 1571 -3539 -4487 -170
2981 -170 4064 3846 -1085 -5136 -2757 2659 4570 1425 -3327 -4294 -321 4063 3744 -1143 -4774 -2511
2997 -2511 2602 4569 1784 -3330 -4680 13 3999 3856 -1041 -4335 -2819 2208 4702 1584 -3627
3012 -3627 -4170 -94 3785 3759 -784 -4550 -3014 2538 4850 1700 -3096 -4213 -671 3753 3464 -808
$$ packed form
2904D71M350j490n199l351L169N381J512m097m850l74M841M606j524n533k673
2919d761K561N488J756m028n416j05N094M114j125n154l584K916N262J950l959
2934A009n228K12M399M233j074n138l592K720N300J904l974m870p9M542M128p76
2950C716n453l269K655N394J741l336n540k03M490M338q74n055l549K631N349
2965C035J898l614n219n52M498M306p32n132l312J971N429K325l330n110r48M317
2981a70M234k18m931m051K379N416J911l145m752r67L973M384l19m887l631K263
2997b511N113J967k785n114j350M693L986j43m897l294J516N027K494l118n211
3012c627n43M076L879k6m543l766J536N552K312l150m796j117L542M424k89m272
$$ plain form
3028 -808 -4336 -2934 2112 4261 2084 -3097 -4307 -653 3991 4013 -681 -4339 -2739 1796 4252 1962
3044 1962 -3349 -4402 -528 3823 3670 -685 -4603 -3055 1607 4708 1745 -3075 -4379 -633 3890
3059 3890 3680 -528 -4599 -3339 1686 4486 1759 -2799 -4307 -1061 3360 4038 -463 -4224 -2945
3074 -2945 1654 4474 1822 -2570 -4131 -841 3523 3941 -399 -4137 -3025 1407 4312 2196 -2647
3089 -2647 -4112 -1004 3425 3465 -312 -4095 -2775 1713 4376 1755 -2654 -4073 -791 3347 3740 -179
3105 -179 -3897 -2967 1715 3871 2135 -2356 -3803 -1120 3239 3857 -154 -3830 -2937 1250 4375 2021
3121 2021 -2411 -4003 -994 3391 3500 -97 -4209 -3426 1350 4067 2148 -2088 -4453 -755 3199
3136 3199 3585 128 -3604 -3101 1134 4200 2083 -2384 -3996 -1426 2907 3483 141 -3646 -3000 1500
$$ packed form
3028h08l528J402N046K149k177n181j210L654M644K2m694l658J600M535K456k290
3044A962n311j053L874M351j53m355l918J548M662L101k963m820j304L746M523
3059C890k10m208m071J260N025K800k727m558j508L246M421O78m501l761J279
3074b945M599K820k652m392j561L290M364M18m340l738J112M432K905k116m843
3089b647j465L108M429M0l777l783J320M488K663k621m409j419L282M138L93l919
3105a79l718R30M682K156j736m491j447K683M359O18m011l676Q93M187L125k354
3121B021m432j592L009M385J09l597m112P83M776K717j919m236k365L698L954
3136C199L86l457l732N03M235L066k117m467j612K570M333N76l342l787O46M500
$$ plain form
3152 1500 3845 2301 -2255 -3969 -1266 2984 3599 344 -3545 -3195 783 4094 2252 -1879 -3939
3167 -3939 -1555 3139 3605 155 -3462 -3216 1287 3779 2612 -1958 -3998 -1201 2651 3712 197
3182 197 -3389 -3339 855 4326 2399 -1980 -3922 -1526 2696 3873 568 -3491 -3667 750 3866 2224
3198 2224 -1993 -4058 -1458 2785 3896 416 -3511 -3147 621 3784 2641 -1713 -4281 -1454 2368
3213 2368 3722 325 -3198 -3208 419 3762 2473 -1467 -3731 -1700 2568 3793 676 -3205 -3352 632
3229 632 3715 2680 -1738 -3746 -1900 2434 3837 479 -3159 -3172 621 3545 2253 -1188 -3614 -1860
3245 -1860 2371 3479 590 -3097 -3179 166 3233 2523 -1200 -3679 -1651 2083 3398 699 -2802 -3470
3261 -3470 228 3302 2599 -1116 -3756 -1708 2180 3508 849 -3356 -3340 -255 3262 2510 -1016 -3524
$$ packed form
3152A500K345j544m556j714K703M250O15l255l889L50L978L311j842m131k060
3167c939K384M694M66l450l617K46M503K492j167m570k040K797L852J061l515
3182A97l586N0M194L471j927m379j942K396M222J177l305m059j76M417L116j642
3198B224m217k065K600M243J111l480l927L64L768L163j143m354k568K827L822
3213B368J354l397l523j0L627L343j289l940k264K031M268J225l117l881j47L984
3229F32L083j035m418k008J846M334J403l358l638j3L793K924j292l441k426J754
3245a860M231J108k889l687q2L345L067p10l723k479K028L734J315k699l501o68
3261c470L698L074p03l715k640K048L888J328k659m205J6L085L517p52l526k508
$$ plain form
3277 -3524 -1734 2036 3653 842 -2988 -3163 361 3321 2576 -1055 -3709 -1897 2054 3396 953
3292 953 -2687 -3232 -259 3231 2661 -1173 -3483 -2026 1918 3331 1097 -2409 -3283 121 3169 2583
3308 2583 -1106 -3520 -1830 1784 3564 1187 -2773 -3153 -55 3044 2588 -636 -3539 -1800 1876
3323 1876 3604 1403 -2543 -3012 -258 2899 2853 -745 -3726 -2319 1694 3315 831 -2422 -3035 -105
3339 -105 3106 2776 -650 -3373 -1946 1913 3502 1297 -2306 -2905 -229 3071 2717 -696 -3186 -2310
3355 -2310 1296 3479 795 -2492 -3180 -553 2895 2370 -480 -3330 -2128 851 3512 1573 -2349
3370 -2349 -3281 -316 2704 2676 -460 -3132 -2348 1453 3316 1565 -2156 -3030 -345 2816 2339 -557
3386 -557 -3222 -2180 1480 3073 1267 -1902 -3116 -622 2609 2449 -404 -2756 -2115 1526 3086 1474
$$ packed form
3277c524J790L770J617k811l830j75L524K960p45l631k654J812L951J342k443
3292I53l640n45K973L490n70l834k310J457L944J413k234l506q74L404L048n86
3308B583l689k414J690L614J780k377l960l80L098L099m56l224k903J739L676
3323A876J728k201l946m69K754L157m6l598k981J407M013J621k484l253o13K930
3339a05L211l30l426k723J427L859J589k205l603n99K676L300l54l413k490Q76
3355b310L606K183k684l287o88K627L448n25k850k850J202K979K661j939l922
3370b349r32K965L020k8l136k672P84L801J863j751l721q74K685L161m77k896
3386e57k665J042L660J593j806l169j214K494L231j60k853k352O41L641J560j612
$$ plain form
3402 1474 -2190 -2974 -368 2617 2582 -334 -2877 -2156 1064 3241 1798 -2094 -3107 -613 2603 2891
3418 2891 -565 -3414 -2035 1021 3213 1686 -1800 -3020 -1021 2435 2974 -137 -3038 -2253 1061
3433 1061 3258 1436 -1719 -3138 -417 2779 3010 -169 -3061 -2281 918 3261 1941 -1818 -3200
3448 -3200 -771 2241 2885 259 -2510 -2206 745 3019 1527 -1876 -3042 -715 2262 2858 137 -2926
3464 -2926 -2354 723 3014 1798 -1878 -2931 -963 2147 3079 -85 -2696 -2388 765 2938 1611 -1736
3480 -1736 -2871 -715 1991 2690 12 -2549 -2573 667 3163 1702 -1498 -3115 -913 2111 2732 258
3496 258 -2707 -2149 697 2689 1804 -1556 -2748 -1113 2204 2582 485 -2697 -2407 736 3008 1953
3512 1953 -1122 -3091 -952 2238 3063 114 -2501 -2349 394 2723 2087 -1199 -2702 -1294 2011 2667
$$ packed form
3402A474l664p84K606K985l5k916k543P21L220K177j443l892j013K494L216K88
3418B891l456k849J379L056K192j527l486j220J999L456N39l111k901P85L314
3433A061K197j822l155j419K721L196K31l179k892P80L199K343j320l759j382
3448c200K429L012O44k626k769L04K951K274j492l403j166K327K977N96k721l063
3464b926N72L077K291j216l676j053J968L110R32l164k611L08L153K173j327l347
3480a736j135K156K706O99k678k561k4L240K496j461l200j617K202L024O21k474
3496B58k965N58K846J992q85l360j192J635L317L78k097l182K90L143K272j055
3512A953l075j969K139L190Q25k949k615J52K743K329o36l286j503J408L305O56
$$ plain form
3528 2667 225 -2537 -2654 466 2687 1987 -1401 -2832 -1380 1647 2853 272 -2625 -2338 551 2819
3544 2819 1873 -1204 -2659 -912 1785 2769 330 -2392 -2472 380 2871 1926 -894 -2947 -1298 1805
3560 1805 2758 307 -2333 -2394 576 2535 1968 -896 -2852 -1227 1703 2565 862 -2332 -2667 585
3576 585 2305 1574 -1027 -2381 -1439 1624 2605 320 -2021 -2099 348 2472 1922 -917 -2654 -1444 1594
3593 1594 2424 434 -2093 -2650 -270 2336 1943 -687 -2715 -1161 1400 2786 546 -2085 -2322 -262
3609 -262 2294 2048 -828 -2663 -1447 1763 2589 813 -2049 -2481 -37 2595 2109 -1071 -2632 -1211
3625 -1211 1238 2553 991 -2004 -2374 -150 2200 1763 -560 -2434 -1591 1260 2512 754 -1563 -2440
3641 -2440 -274 2300 2476 -656 -2765 -1746 1304 2358 894 -1991 -2420 -234 2245 2177 -843 -2133
$$ packed form
3528B667k442k762j17L120K221p00l388j431J452L027J206k581k897K87K889K268
3544B819r46l077j455J747K697R84k439k722q0K852K491r45k820k053J649L103
3560A805R53k451k640o1K970J959n67k864j956J625K930Q62j703l194l35L252
3576E85J720p31k601j354R42L063R81k285k341p8K447K124n50k839j737J210L038
3593A594Q30j990k527n57K380K606l93k630k028J554K561J386k240k631k37K060
3609b62K556k46k876j835J216L210Q26j776k862m32K444K632m86l180j561J421
3625a211K449J315j562k995l70K224K350m37k323j874Q43K851J252j758k317q77
3641b440K166K574J76l132k109J019L050J054j464k885m29K186K479o8l020j290
$$ plain form
3657 -2133 -1476 1240 2549 1135 -1898 -2637 27 2215 2165 -232 -2715 -1507 1571 2545 1019 -1746
3673 -1746 -2461 -74 2150 1831 -609 -2438 -1879 1187 2155 884 -1558 -1986 -319 1856 2175 -461
3689 -461 -2399 -1798 913 2336 1050 -1672 -2515 -559 1948 1799 -531 -2200 -1372 641 2501 929
3705 929 -1719 -2358 -585 1804 1835 -171 -2230 -1459 770 2383 1100 -1783 -2096 -618 2023 2061 -303
3722 -303 -2195 -1575 637 2049 745 -1307 -2478 -359 1852 1889 -374 -2373 -1521 908 2295 1131
3738 1131 -1156 -2010 -538 1831 1945 -265 -2005 -1580 747 2495 1248 -1549 -2128 -325 1791 2276
3754 2276 -232 -2098 -1548 745 2216 1180 -1195 -2600 -551 1886 1770 -173 -2276 -1617 719 1966
3770 1966 1122 -1301 -2134 -680 1663 1982 21 -2215 -1584 666 2389 1245 -1293 -2066 -765 1725
$$ packed form
3657b133O57K716J309j414l033p39K664K188n0k397k483J208L078R74j526k765
3673a746p15K387K224l19k440j829N59L066R68j271k442m28J667K175L19k636
3689d61j938O01K711J423j286k722q43J956K507j49k330j669Q28K013J860j572
3705I29k648o39J773K389L1k006k059P71K229J613j283k883l13J478K641L8k364
3722c03j892O20K212J412j304k052j171K119K211L7k263j999Q52K429J387j164
3738A131k287q54J472K369J14k210j740M25K327J748j247k797n79J803K116M85
3754B276k508j866N50K293J471j036k375j405K049K437j16j943k103O59K336J247
3770A966q44k423q33J454K343L19j961k236O31K250J723j144k538p73J301K490
$$ plain form
3786 1725 1769 -53 -2099 -1798 715 2186 1107 -1339 -1991 -518 1607 2256 -186 -1996 -1687 591
3802 591 2094 1143 -1006 -2092 -801 1605 2234 300 -1982 -1666 371 1943 1352 -1000 -2292 -942
3818 -942 1681 2078 -220 -2032 -1505 432 1907 1162 -1293 -1829 -858 1124 1960 -192 -1676 -1463 194
3835 194 2159 1342 -1061 -2100 -573 1309 1861 121 -1725 -1562 341 2232 1371 -1046 -2018 -1055 1702
3852 1702 2311 311 -1740 -1690 93 2065 1195 -695 -2067 -612 1325 1855 317 -1774 -1558 357
3868 357 1822 1437 -710 -1948 -742 1238 1877 297 -1575 -1669 315 1981 1418 -984 -2168 -1176 1529
3885 1529 1894 517 -1672 -1724 427 2055 1206 -844 -2022 -891 924 2327 417 -1635 -1979 327
3901 327 1868 1797 -555 -2037 -988 1144 2048 96 -1698 -1776 239 1730 1540 -577 -1768 -1277 1073
$$ packed form
3786A725M4j822k046L01K513J471j079k446o52J473K125O49k442j810L09K278
3802E91J503r51k149j086J291K406O29j934k282L16K037J572n91k352j292J350
3818i42K623L97k298j812N27J937J475p45k455n36R71J982Q36k152j484K13J657
3835A94J965q17k403j039J527J882N52j740j846J63J903J891q61k417r72R63K757
3852A702O09k000k051N0J783J972q70j890j372J455J937N30j538k091K16J915
3868C57J465l85k147j238J206J980O39j580j872r4J984J666n63k402j184R92K705
3885A529L65j377k189n2K151J628q49k050j178J131J815J403j910k052l44K306
3901C27J541p1k352j482J049K132R04j952j794p8K015J491j90k117j191M91K350
$$ plain form
3918 1073 1913 474 -1342 -1695 -19 1744 1506 -597 -2042 -1178 1266 1926 720 -1659 -1679 -126 1747
3935 1747 1169 -382 -2039 -1038 1026 1931 547 -1043 -1728 -250 1666 1302 -570 -1735 -763 863
3951 863 2063 453 -1178 -1684 -96 1673 1622 -758 -1629 -778 1036 2274 371 -1267 -1675 -601 1647
3968 1647 1564 -646 -1648 -1343 677 1774 865 -1276 -1832 -17 1408 1694 -537 -1816 -1404 688 1893
3985 1893 853 -992 -1927 -398 1436 1569 -210 -1659 -1029 851 1964 483 -1167 -1833 -288 1565
4001 1565 1506 -269 -1638 -1020 708 1858 463 -1217 -1563 -454 1707 1702 80 -1537 -1528 499 1583
4018 1583 762 -1147 -1589 -138 1528 1673 -245 -1367 -958 926 1545 761 -1199 -1761 -72 1485 1501
4035 1501 -217 -1526 -1108 556 1698 1029 -1247 -1630 -585 1069 1127 -307 -1825 -1430 717 1863
$$ packed form
3918A073Q40j439j816l53J676J763k38k103j445Q64K444O60j206k379k0J553J873
3935A747n78j551j657J001K064R05j384j590o85J478J916l64j872j165R72J626
3951H63J200j610j631n06J588J769n1k380q71Q51J814J238j903j638m08J074K248
3968A647q3k210j002L05K020J097r09k141n56J815J425K86k231j279M12K092J205
3985A893j040j845r35J529J834J33j779j449O30J880J113j481j650o66J545J853
4001A565n9j775j369O18J728J150j395j680l46J109K161nj622j617RK027J084
4018A583q21j909m42J451J666J45j918j122M09J884O19p84j960n62J689J557J6
4035A501j718j309M18J664J142o69k276l83J045J654N8j434j518L95K147J146
$$ plain form
4051 1863 796 -1135 -1583 -456 1346 1745 -199 -1208 -1149 590 1470 667 -746 -1447 -113 1264 1680
4068 1680 164 -1370 -1120 339 1876 1119 -812 -1719 -337 1397 1408 303 -1376 -1321 273 1519 1063
4085 1063 -995 -1688 -308 1169 1471 -214 -1551 -1244 564 1868 1182 -1160 -1499 -630 1135 1364 -51
4102 -51 -1273 -1425 336 1609 659 -890 -1638 -307 987 1546 154 -1199 -1266 262 1677 938 -723
4119 -723 -1506 -649 1234 1448 -12 -1596 -1262 642 1465 1092 -794 -1463 -438 1570 1283 -115 -1133
4136 -1133 -1060 516 1476 1070 -611 -1492 -243 1022 1497 348 -1490 -1180 375 1565 860 -928 -1198
4153 -1198 -949 1186 1589 106 -1549 -1221 309 1442 948 -554 -1352 -584 1028 1326 264 -1201 -1018
4170 -1018 220 1431 1193 -785 -1412 -745 751 1729 282 -1559 -1144 156 1281 1227 -505 -1368 -669
$$ packed form
4051A863j067j931m48J127J802L99j944j009N9J739Q80q03j413p01J334J377M16
4068A680j516j534K50J459J537p57j931r07J382J734J1j105j679N5J594J246m56
4085A063k058o93J380J477L02j685j337L07J808J304o86k342l39Q69J765K29j415
4102e1j222j52J761J273r50j549p48J331J294N59j392j353o7J528J415p39j661
4119g23p83Q57J883K14j460j584L34J904Q23l73j886o69J025K008k87j398j018
4136a133P3J576R60m06j681q81J249J265M75j149j838L10J555J190p05j788k70
4153a198K49K135M03j483j655L28J530J133m94j502p98P68J612K98j062j465J83
4170a018J238J211k38j978o27O67J496R78j447j841M15J300J125n4j732q63O99
$$ plain form
4187 -669 870 1120 269 -951 -1183 0 1385 803 -753 -1359 -783 866 1246 306 -1312 -1199 -82
4204 -82 1084 1043 -563 -1415 -533 697 1545 314 -1156 -969 -117 1287 1341 -576 -1244 -737 595 1276
4222 1276 335 -1035 -1534 -16 1101 1263 -696 -1226 -713 878 1427 443 -1101 -1051 -74 1349 836 -454
4240 -454 -1182 -913 871 1091 433 -788 -1054 185 1306 1122 -82 -1322 -613 637 1413 183 -910
4257 -910 -1254 -63 1401 1221 -377 -1213 -375 441 1458 248 -1017 -1218 -73 1163 1119 -348 -1303
4274 -1303 -698 738 1325 654 -1164 -1308 -161 1169 1146 -80 -1580 -1047 665 1340 368 -1043 -820
4291 -820 -92 1095 999 -415 -1122 -975 542 1178 369 -1099 -1582 -72 1122 941 -190 -904 -889 370
4309 370 1308 735 -956 -1325 -176 1159 872 -223 -1492 -842 577 1255 595 -1051 -1179 -339 908
$$ packed form
4187f69J539K50q51j220k32J183J385n82j556o06N76J649L80r40j618J13J117
4204h2J166m1j606q52Q82J230Q48j231j470J87Q52J404N4j917o68N07J332O81
4222A276r41j370m99J518J117J62j959n30N13J591N49r84j544N0R77J423n13j290
4240d54p28K69J784K20o58j221k66J239J121j84j204j240P09J250P76j230j093
4257i10l44J191J464j80j598q36Q38Q16J017j210j265k01J145J236m4j467r55
4274a303O05J436N87o71j818j44J147J330k3j226j500N33J712O75r72j411K23
4291h20P28J187r6j414p07J47J517O36q09j468m83J510J194j81j131p14J5J259
4309C70R38n73j691l69J149J335k87j095j269O50J419O78o60j646j28Q40J247
$$ plain form
4326 908 1072 -137 -1040 -607 511 1264 581 -655 -1089 -273 777 1098 -507 -1043 -887 347 1342 614
4344 614 -706 -1196 -473 886 1074 -21 -1142 -786 485 1225 566 -795 -1234 -239 1153 859 -48 -1199
4362 -1199 -625 447 1283 506 -921 -1299 -368 884 1076 -58 -1358 -1005 311 980 633 -856 -1221
4379 -1221 -373 941 1054 -43 -1062 -865 416 1095 859 -519 -1323 -275 786 1144 -6 -1541 -638
4396 -638 130 1347 772 -724 -1377 -435 914 1151 -212 -976 -1067 235 1037 783 -362 -1194 -340 1029
4414 1029 965 202 -1016 -1171 343 1164 807 -881 -1327 -427 789 1039 -229 -1078 -951 -48 1181 876
4432 876 -932 -1024 -532 612 1250 149 -1028 -1002 374 1297 452 -348 -1396 -516 872 1095 -168 -1104
4450 -1104 -815 221 1185 420 -808 -1038 -789 943 1214 158 -858 -1063 333 936 840 -219 -1060 -472
$$ packed form
4326I08J64j209r03M33J118P53o83j236m34Q16J050L21j605n36J56J234R95p28
4344F14j320m90P23J359J88j095j121L56J271P40o59j361m39R95J392k94r07j151
4362a199N74J072Q36p77j427l78R31J252J92j134j300L53J316O69l47j489l65
4379a221Q48J314J13j097j019J97J281O79k36j378q04J048J061L58j150j535R03
4396f38P68J217n75j496o53R42J349K37j363p64r1J302Q02k54j145q32Q54J369
4414A029o4p63j218j55J514Q21l57j688m46R00J216K50j268q49J27R03J229l05
4432H76j808r2M92J144O38j101j177K6J376R23q45q00j048Q80J388K23j263r36
4450a104K89J036R64p65j228k30K49J732K71j056j016k05J396O03r6j059q41N88
$$ plain form
4468 -472 363 1082 380 -956 -1044 248 1070 793 -249 -1132 -507 790 1237 251 -947 -1128 19 1196
4486 1196 722 -463 -1082 -305 775 1062 10 -915 -681 257 1069 690 -357 -939 -479 833 1058 180
4504 180 -817 -721 -30 685 886 -403 -1011 -634 649 1090 70 -783 -1039 228 915 675 -154 -1264 -194
4523 -194 637 804 262 -743 -906 21 1059 1015 -410 -832 -534 645 1153 290 -737 -1003 132 833
4541 833 910 -547 -932 -69 314 824 347 -775 -939 241 654 783 -315 -1105 -556 653 1044 113 -676
4560 -676 -856 63 825 684 -482 -1109 -618 420 938 585 -642 -858 190 880 617 -280 -1153 -461 454
4579 454 940 306 -617 -862 116 418 478 -6 -616 -560 629 797 312 -595 -1149 -368 742 706 -192 -799
4599 -799 -641 462 925 139 -510 -671 -194 944 437 -268 -853 -334 256 832 169 -775 -970 -146 646
$$ packed form
4468d72Q35P19p02j336q8J292Q22k77j042q83O25J297M47r86j198j81J147J177
4486A196m74j185o19P77J080K87j052r25K34R38Q12l79j047n82M60J312K25q78
4504A80r97R6O91P15K01j289o08L77J283M41j020q53k56J267O87k40q29j110J070
4523a94Q31J67n42j005j63R27J038m4j425m22K98J179N08q63j027k66J135P01
4541H33P7j457l85Q63L83N10m77j122j64J180M13J29j098p90N49J209L91r31p89
4560f76j80R19P62j41j166o27M91J038N18l53j227k16J048O90k63q97q73O92R15
4579D54M86o34r23k45R78L02O0m84o10N6J189J68m85r07n54P81J110l6q98o07
4599g99J58J103M63p86o49j61M77J138n07p05n85N19N90N76o63r44j95Q24P92
$$ plain form
4618 646 476 -169 -1022 -470 227 996 96 -812 -1149 -222 617 761 -297 -880 -660 225 788 336 -555 -747
4638 -747 -62 814 658 8 -722 -318 144 883 221 -438 -702 33 641 823 -306 -726 -562 409 678 155
4658 155 -261 -944 28 617 351 -141 -785 -592 672 668 108 -577 -887 -255 378 638 158 -580 -566 79 732
4679 732 358 -805 -841 -316 600 717 17 -965 -628 514 702 354 -691 -801 -434 702 900 -70 -733
4698 -733 -721 681 935 233 -445 -701 -126 875 709 -186 -493 -612 638 801 445 -469 -764 73 596
4717 596 632 -98 -689 -520 95 840 203 -412 -632 -270 729 713 -47 -793 -414 305 599 435 -280 -674 -182
4738 -182 784 537 -14 -901 -426 67 628 347 -480 -827 -138 622 718 -38 -464 -363 303 991 662 -459
4758 -459 -1011 -399 627 649 -95 -478 -293 157 908 577 -226 -810 -113 680 409 263 -307 -421 236 705
$$ packed form
4618F46j70o45q53N52O97P69r00r08l37R27Q39J44j058n83K20Q85N63m52q91j92
4638g47O85Q76j56o50p30M04M62P39o62o59k64P35O08J82j129m20J64R71K69n23
4658A55m16o83R72N89k66m92o44J93J264mn60o85l10O32O33K60m80p38J4O45O53
4679G32l74j163l6N25R16J17p00r82L37J142J88l48j045j10L67J136J98r70o63
4698g33J2J402K54p02o78k56N75J001j66q95l07j19J250J63l56r14k95Q37N23
4717E96L6p30n91J69O15P45o37o15k20L62R99j6p60p46L79P19K94j64p15l94M92
4738a82R66k47n51q87M75M93N61k81q27l47O89P60R6p56m26J01O66O88l29j121
4758d59n52O12J026K2p44l83J85M50P51l31q03n84O97P93k71j46n70j14O57M69
$$ plain form
4778 705 371 -390 -548 -440 402 448 52 -404 -874 154 706 469 -277 -708 -328 733 684 -170 -226 -778
4798 -778 -16 904 276 -480 -758 -52 503 641 323 -627 -664 220 671 346 -291 -339 -304 431 630 201 -395
4819 -395 -784 295 566 203 -464 -653 -14 502 845 -117 -609 -712 273 701 614 -295 -936 -263 737 401
4839 401 -66 -549 -676 34 658 140 -280 -789 -326 506 417 -141 -757 -633 -119 445 606 14 -561 -378
4859 -378 326 726 459 -436 -795 -150 591 480 -266 -818 -478 502 572 57 -491 -416 -3 637 391 -22 -920
4880 -920 -165 448 735 129 -645 -454 -62 771 392 -336 -765 -69 636 522 266 -701 -570 -40 829 620
4900 620 -394 -822 -398 495 667 282 -266 -230 -91 543 766 -43 -678 -423 608 668 74 -608 -364 57
4920 57 572 218 -49 -401 -261 281 619 453 -206 -713 7 645 472 -194 -216 -390 324 652 184 -581 -723
$$ packed form
4778G05l34p61j58J08Q42M6l96m56m70J028N52k37p46m31L80J061m9q54n6n52
4798g78P62R20o28p56k78P06N55J38l18r50l7Q84M51l25o37m8L5P35J99m29n96
4819c95l89J079K71l63o67j89O39N16L43r62m92j03R85M28q7r09o41O73J000l36
4839D01m67m83j27P10O24n18m20n09M63Q32q9n58o16J24N14N64J61n92n75J83
4859c78P04M00k67q95l59O45P41j11p46n52L40R80P0n15n48P5M13O40k46m13q98
4880i20P55O13K87o06p74J91L92Q33l79p28m29O96P05j14k56r67J31N30Q69k09
4900F20j014m28M24Q93J72l85n48L6J39O34K23q09o35K55J031O0n94o82K44M21
4920E7N15l54k67l52J40N42L38j66o59n07P20O38j73o66k2j74P14L28m68p65j42
$$ plain form
4941 -723 277 773 320 -206 -435 -442 265 407 71 -853 -348 -201 504 360 115 -696 -355 508 684 134
4961 134 -512 -592 -82 478 312 -115 -423 -197 268 942 299 -616 -643 -40 179 341 -155 -725 -410 180 189
4982 189 277 -458 -474 -22 492 235 -80 -593 -361 471 489 255 -513 -397 -125 289 495 -231 -575 -134 454
5003 454 679 171 -194 -769 -252 591 339 -218 -620 -410 239 500 359 -357 -476 -229 622 542 -291 -414
5023 -414 -154 510 819 49 -389 -276 104 523 317 55 -675 -555 491 627 161 -219 -583 123 441 523
5043 523 -164 -548 51 111 551 331 -134 -353 -140 288 347 142 -297 -332 294 659 153 -518 -484 -27 270
5064 270 426 68 -750 -680 225 869 -52 -587 -393 -114 724 536 49 -516 -584 299 481 120 -357 -543 -180
5085 -180 550 563 -64 -454 -324 161 562 -198 -543 -620 -249 569 200 67 -439 -611 96 397 217 -540 -453
$$ packed form
4941g23J000M96m53n26k29pP07J42l36r24N05J47P05j44k45q11L41Q63J76n50
4961A34o46q0N10N60j66m27l08K26M65O74o43r15k7O03K19J62m96n70L15N90R
4982A89Q8p35j6M52N14k57l15n13K32Q32J8k34p68J16K72M14K06p26l44M41N88
5003D54K25n08l65n75N17Q43k52n57m02K10O49K61j41p16j19K47Q51q0q33j23
5023d14K60O64L09p70m38J13L80M19k06k62p30J20J046J36m66l80l64P06L18Q2
5043E23o87l84N99O0M40k20m65k19K13M28N9k05m39l5O26L65n06o71L4M57K97
5064B70J56l58q18P0R05O44r21n35J94K79Q38j88m87n65o8Q83J82l61m77j86L63
5085a80P30J3o27l90J30M85M01p60l45p7L71Q18l69j33n06j72P07L01j80p57Q7
$$ plain form
5106 -453 -454 38 544 -319 -527 -471 160 436 588 -95 -304 -155 526 412 -136 -573 -482 236 672 256 -126
5127 -126 -229 -225 282 495 319 -562 -415 72 445 181 -295 -452 -342 362 506 -319 -628 16 199 252 225
5148 225 -116 -379 -359 814 467 131 -537 -453 14 379 301 -297 -463 32 524 481 -376 -290 -164 367 604
5169 604 258 -208 -532 -21 301 244 178 -453 -567 134 368 216 -181 -538 -90 425 380 147 -324 -661 -172
5190 -172 353 25 -32 -529 -310 490 552 104 -853 -173 122 382 12 -355 -321 -163 451 326 30 -417 -466
5211 -466 -23 614 187 -223 -561 -182 182 356 122 -308 -260 378 553 -39 -257 -643 -181 751 748 -42 -479
5232 -479 -547 214 284 299 -289 -671 -303 230 724 5 -686 -575 43 291 3 35 -424 -154 419 604 191
5253 191 -672 -401 -11 489 432 -366 -592 -475 728 271 29 -365 -415 34 585 33 150 -628 69 75 167
$$ packed form
5106d53jM92N06q63k08N6O31K76J52o83k09J49O81j14n48m37R1P18M36m16l82
5127a26j03MN07K13j76q81J47M87L73k64m76j57J10P04J44q25l09O44J83N3k7
5148B25l41k63K0J173l47l36o68Q4M67L65p8n98j66M95M92m3q57Q6J26N31K37
5169F04l46m66l24N11L22n7o6o31j14P01K34j52l97l57M48N15m5k33m71l37M89
5190a72N25l28n7m97K19Q00O2m48r57O80K95K60l70l67L4J58O14j25k96m47m9
5211d66M43O37m27m10l38L79L64J74k34m30M8O38J75n92k18l86M62R32lp90m37
5232d79o8P61P0J5n88l82L68N33M94p19o91J11O18K48k88L2m59K70N73J85m13
5253A91q63K71L90N00n7p98k26J17J203m57k42l94n0M49N51n52J17p78O97OR2
$$ plain form
5274 167 389 -372 -253 99 392 448 -169 -584 -567 302 451 341 -420 -568 34 212 284 -174 -499 -323 152
5295 152 340 -182 -592 -177 -56 443 -27 148 -468 -427 453 354 -11 -604 -631 -169 439 211 -240 -211 -117 303
5317 303 389 148 -291 -180 -288 499 73 -363 -335 -73 51 544 107 -303 -215 -58 341 455 -164 -388 -8
5338 -8 164 362 19 -326 -251 -492 325 21 -402 -298 -225 116 325 320 -287 -422 252 260 167 146 -511 -414 174 384
5362 384 -17 -351 -278 219 413 676 80 -424 -141 359 370 -69 -86 -180 23 293 308 -258 -679 -92 150 350
5384 350 29 -470 -669 58 106 344 -333 -581 -47 312 734 0 -38 -531 102 484 -57 -103 -439 -147 70
5405 70 494 209 -327 -500 -30 439 438 -122 -533 -276 398 260 -32 -172 -594 11 517 389 -167 -220 -218 35
5427 35 260 240 -279 -439 -215 421 390 -9 -433 -465 226 286 154 -338 -460 -180 397 131 20 -689 -295 336
$$ packed form
5274A67K22p61J19L52K93N6o17m15J7Q69J49j10p61j48O02J78P2m58l25J76M75
5295A52J88n22m10M15J21M99m70J75o16M1Q80r9l65n93k7M62O08k28m51K9R4M20
5317C03Q6k41m39J11j08P87m26m36K8K62J24M93m37m10Q8J57L99J14o19k24L80
5338hJ72J98l43l45P5k41Q17l04m23J04P3L41K09no07j35O74Qr3k1o57R7N88K10
5362C84m01l34P3M97J94K63n96n04K83N00J1m39j7r4K03K70J5n66m21N87K42K00
5384C50l21m99j99P27M8K38o77k48N34L59M22p34l8m93O33L82n41m6l36K92K17
5405G0M24k85n36j73M70M69jn60m11K57O74j38k92j40m22O05N06j28n56n3KK53
5427C5K25k0n19j60K24O36l1l99m24l2O91O0j32m92j22K80N77k66j11p09L94O31
$$ plain form
5449 336 515 59 -108 -419 -298 472 156 -106 -441 -136 -3 425 85 -411 -415 -253 297 493 -395 -302 -256
5470 -256 59 347 110 -98 -456 -116 289 337 -213 -303 156 386 670 159 -590 -264 -117 247 194 -165 -205
5491 -205 -226 170 624 17 -201 -243 -65 279 163 137 -515 -223 526 419 53 -549 -501 -101 499 515 -149 -268
5513 -268 -370 -103 254 27 -352 -298 -195 347 276 -66 -207 -181 216 496 257 -277 -54 -199 520 400 -31
5534 -31 -189 -166 41 539 230 43 -604 -19 534 270 -189 -205 -454 380 621 315 -400 -208 35 539 143
5555 143 -47 -402 -236 119 440 422 -234 -269 -113 -182 535 139 -606 -442 134 24 -200 -96 -286 -298 552
5576 552 208 -154 -519 -194 161 660 59 -253 -318 -256 416 196 -95 -89 -726 99 399 88 -82 -108 28 34
5598 34 277 -89 -409 -582 71 384 321 -92 -558 -78 218 126 -229 -530 -8 -158 106 374 43 -518 12
$$ packed form
5449C36J79m56j67l11J21P70l16k62l35L05J33M28l40m96mJ62N50J96q88R3M6
5470b56L15K88k37k08l58L40M05M8n50r0M59K30K84n11p49L26J47L64n3l59m0
5491b05k1L96M54o07k18m2J78L44j16k6o52K92P49j07l66o02M8M00O00J6o64j19
5513b68j02K67L57k27l79N4J03N42p1l42j41K6L97K80k39n34K23j45P19j20m31
5534c1j58K3K07M98l09j87o47N85N53k64m59j6k49Q34K41l06p15J92K43N04l96
5555A43j90l55J66L55L21j8o56l5J56o9P17l96p45J64N76j10k24J04j90j2Q50
5576E52l44l62l65L25L55M99o01l12o5O2O72k20k91Oo37Q25L00l11j70k6J36O
5598C4K43l66l20j73O53L13o3m13m66M80K96r2l55l01N22j50K64K68l31n61N30
$$ plain form
5619 12 -17 202 64 -142 -294 184 333 100 -424 -425 -491 455 203 -11 -198 -96 -127 127 298 62 -540 -272
5641 -272 507 392 -56 -320 -84 -101 568 605 -115 -294 -163 205 333 -5 -313 -451 105 166 375 -379 -384 -121
5663 -121 276 349 -98 -214 -263 265 743 378 -354 -233 -133 -5 508 -92 -569 -396 -3 369 184 -230 -193
5684 -193 -65 752 230 -61 -324 -343 100 294 11 39 -277 -334 279 133 461 -189 -543 148 580 177 -529
5705 -529 -265 29 306 315 177 -238 -329 284 271 410 -156 -341 -72 452 357 -305 -256 -224 295 423 399 -21 -311
5728 -311 -110 153 345 139 -578 -409 -27 454 165 -237 -343 -84 182 282 97 -365 -304 107 397 311 -14
5749 -14 -423 19 276 292 126 -463 -226 105 387 353 -133 -243 57 72 241 34 -413 -382 52 712 458 -367
5771 -367 -159 -93 281 761 438 -229 -417 26 257 177 -189 -480 -390 135 356 66 -227 -68 25 420 53
$$ packed form
5619A2k9K19j38k06j52M78J49k33n24jo6R46k52k14j87J02l1K54J71k36o02K68
5641b72P79j15m48k64K36j7O69L7p20j79J31L68J28l38l08j38N56O1K09p54nK63
5663a21L97P3m47j16m9N28M78l65p32J21J00J28N13o00m77J73L93L72j85m14L7
5684a93J28Q17n22k91k63j9M43J94k83K8l16n7O13j46L28o50l54O91M32m03p06
5705e29K64K94K77Rj38m15r1O13j3J39n66j85K69N24r5o62M9L2N19J28k4m20k90
5728c11K01K63J92k06p17J69L82M81k89m02j06K59K66J00j85m62O1M11K90q6l25
5749a4m09M42K57J6j66n89K37L31K82l4m86j10L00J5J69k07m47L1M34O60k54q25
5771c67K08O6L74M80l23o67j88M43K31q0l66k91R0N25K21k90k93J59R3L95l67
$$ plain form
5792 53 -416 -530 -102 26 277 -316 -238 -514 150 256 111 84 -119 -64 146 78 -109 -242 -243 9 423 688
5814 688 -20 -95 -329 439 158 77 -137 58 -121 342 196 -332 -450 -287 482 275 153 -62 -476 87 319
5835 319 -34 -212 -522 194 283 301 -107 -233 -104 -197 328 241 -328 -275 7 -53 563 -147 24 -97 88 232
5857 232 58 -105 -402 -2 317 232 58 -248 -470 -127 299 359 2 -231 -152 174 281 125 -358 -268 42
5878 42 384 637 23 -454 -175 390 235 117 -235 -137 112 253 -23 -360 -176 -475 260 309 -143 -294 -251
5899 -251 -109 480 52 -202 -195 -382 71 97 200 -192 46 -28 220 282 -157 -562 -102 111 223 378 4 -176
5921 -176 174 425 223 -170 -339 -373 178 525 251 -290 -262 150 264 65 -331 -111 -530 331 210 42 -504
5942 -504 -177 -24 354 51 -18 -225 129 343 706 70 -68 -341 136 311 129 96 -94 -397 -24 285 194
$$ packed form
5792E3m69j14M28J28K51n93P8k76O64J06j45k7k03N5K10o8j87j33jK52M14K65
5814F88p08p5k34P68k81q1k14J95j79M63j46n28j18J63P69k07j22k15m14N63K32
5835C19l53j78l10P16Q9J8m08j26J29r3N25q7n69N3K82o0O16p10J71j21J85J44
5857B32j74j63k97M00L19q5j74l06k22L43M26O0l57k33P9L26J07j56m83R0L10
5878D2L42K53o14m77K79N65j55j18l52R8K49J41k76l37J84k99P35M9m52j51M3
5899b51J42N89m28k54Pj87M53K6J03l92K38p4K48O2m39m05M60K13J12J55l74j80
5921a76L50K51k02l93j69l4N51L47k74n41K8M12J14j99l96K20m19Q61j21j68n46
5942e04L27J53L78l03o9k07L54K14L63o36j38k73M77J75j82l3j90l03L73L09r1
$$ plain form
5963 194 -400 -369 -75 383 468 -82 -109 -216 118 384 49 -95 -141 -11 441 381 95 -587 -110 74 71 -18 -64
5986 -64 -318 -187 386 218 185 -422 -294 82 378 287 -211 -34 70 347 431 -4 -439 -303 33 464 115
6007 115 -386 -578 175 265 418 -294 -325 -134 67 488 320 -37 -478 -104 308 311 -46 -249 -206 69 262 36
6029 36 -125 -191 243 419 343 10 -583 -73 198 134 1 123 -243 -25 242 377 53 -366 -84 161 238 -28
6051 -28 -82 -286 85 373 2 -366 -461 -33 95 699 49 -302 -626 129 55 388 -134 -363 -183 126 130 137 -231
6074 -231 -393 -4 38 429 -111 -236 -294 -36 237 172 -195 -465 188 -61 215 232 -106 -264 357 311 335 -95
6096 -95 -499 -40 222 373 -90 -59 -259 8 347 90 -34 -362 -165 486 199 82 -583 -271 -186 339 3
6117 3 -92 -296 -255 521 42 15 -331 -44 -322 539 298 -249 -461 -121 -167 313 43 -65 -142 271 244 79 -429
$$ packed form
5963A94n94L1K94M58Q5n50k7j07L34K66l35j44m6J30M52o0k86o82M77J84lq9m6
5986f4k54J31N73j68l3o07J28L76K96r1m98J77J04K77Q4m35m35J36L36M31l49
6007A15n01j92P53R0J53p12l1J91K01M21j68l57m41L74M12Ll57k03M3K75J93k26
6029C6j61o6M34J76p6l33n93N10K71o4j33J22l66K18K67J35l24m19K82K45P7k66
6051b8n4k04L71K88l71l68r5M28J28O04o50l51l24P55p4L33n22k29J80L09MPl68
6074b31j62L89M2L91n40j25n8K58K73o5l67k70O53k49K76J7l38j58O21m6K4m30
6096i5m04M59K62J51m63L1k00K67L39k57j24l28J97O51k87j17o65L12Q5N25l36
6117Cr5k04M1P76m79k7l46K87k78Q61k41n47k12L40m6M80k70j08p7M13k7j65n08
$$ plain form
6140 -429 -156 -129 113 301 151 -155 -233 128 191 231 94 -273 -28 40 300 -20 -251 -161 -100 413 34 -136
6162 -136 -350 237 296 338 57 -10 -77 190 102 -58 117 -452 -261 294 401 105 -438 -318 -193 476 129 -142
6184 -142 -323 -326 293 131 -264 -245 -179 58 140 504 -33 -373 -42 294 277 148 94 -30 4 511 384 -102 -305
6207 -305 135 299 635 115 -5 -256 -60 146 -90 -365 -236 -32 255 183 43 108 -538 102 235 252 -233
6228 -233 -528 -288 118 103 151 -295 -117 -182 267 238 -294 -406 -405 229 -177 -13 -64 -27 41 236 -77 270 -359
6251 -359 -73 300 158 90 -145 -220 -65 152 245 -134 -230 -49 174 86 160 -396 -105 -5 505 207 -242 -194
6273 -194 -312 228 92 -144 -117 -187 36 576 141 -53 -56 -121 99 323 193 -265 -160 148 129 251 -317 85
6295 85 -161 1 325 99 -80 -550 -29 246 210 -14 -440 -216 250 101 36 -407 -89 -124 143 112 -166 -149
$$ packed form
6140d29K73K7K42J88j50l06p8L61O3M0j37l67K45O8K60l20k31R0O1N13l79j70
6162a36k14N87N9M2k81o7o7K67q8j60J75n69J91N55J07k96n43J20J25O69l47k71
6184a42j81lO19j62l95J9O6K37Q2L64n37l40L31L36j7j29n4j24L4N07j27m86k03
6207c05M40J64L36n20j20k51J96K06k36k75J29K04K87p2j40O5o46O40J33J7m85
6228b33k95K40M06j5M8m46J78o5M49k9n32j12JO34m06J64n1L7O8J95l13L47o29
6251c59K86L73j42o8k35p5J55K17R3l79r6J81K23q8P4n56K91J00N10k98m49M8
6273a94j18N40j36k36K7p0K23N40m35j94lo5K20K24j30m58J05L08j9J22n68M02
6295H5k46J62L24k26j79m70N21K75l6k24m26K24M66j49o5m43L18l5K67l1k78J7
$$ plain form
6317 -149 -109 121 173 177 -190 -323 72 -31 501 -225 -109 136 74 385 147 -325 -522 -180 361 200 -411 -387
6339 -387 -134 -12 576 -98 -202 -565 281 468 -21 -71 -209 -212 -196 397 173 -113 -367 69 165 50 -48 -247
6361 -247 -71 116 178 173 -17 -102 259 525 341 153 -44 45 141 259 170 354 -502 66 311 205 9 -294
6383 -294 -308 -58 440 26 -212 -287 -209 414 174 42 158 -24 -200 315 287 -257 -192 257 277 368 425 -647
6405 -647 -189 -40 310 16 -174 -427 -9 225 339 217 -245 -176 143 345 -51 -113 86 -248 256 163 64
6426 64 39 -156 374 120 -39 -5 -220 90 102 255 -121 -79 -174 408 173 148 -322 -85 82 163 527 244 4
6449 4 -300 315 314 140 -194 -83 267 167 27 -22 -329 -297 56 -91 26 -136 -503 -145 11 363 -34 -133
6471 -133 -134 -208 101 363 -172 -270 -50 328 522 51 -160 -379 116 426 95 -41 -479 305 268 -124 127 -374
$$ packed form
6317a49M0K30N2Ml67j33L95j03N32p26J16K45o2L11k38m72j97L42N41j61o11K4
6339c87K53J22N88o74j04l63Q46J87m89n0j38lJ6N93k24k86k54M36R6j15r8j99
6361b47J76J87O2nj90q5L61K66j84j88j97Q9R6J18q9J84q56N68K45j06j96l03
6383b94j4K50M98m14k38p5P8O23k40j32J16j82j76N15k8n44O5M49K0R1N7j072
6405f47M58J49L50k94j90k53M18K34J14j22m62O9L19K02l96o2J99l34N04r3r9
6426F4k5j95N30k54j59L4k15L10J2J53l76M2r5N82k35k5m70K37J67Q1L64k83k40
6449Dl04O15jj74l34J11L50j00j40m9l07L2L53j47J17j62l67L58J56L52l97r9
6471a33jp4L09K62n35r8K20L78J94m71k11k19M95L10l31j36m38P84l7l92K51n01
$$ plain form
6493 -374 -118 133 486 317 -370 -290 85 139 338 115 -88 -89 148 220 370 -161 -423 -162 372 85 116 -301
6515 -301 -491 183 381 325 28 -450 98 243 435 83 -245 -131 26 414 146 -290 -147 -124 258 188 60
6536 60 -318 -454 70 352 109 227 -407 -131 -230 -51 68 -471 -504 37 181 -71 10 -315 99 58 402 41
6558 41 -318 -240 -195 259 394 -189 -584 -10 -134 -103 172 -349 -210 24 192 465 -173 -456 183 455 110
6579 110 -7 -222 -344 -171 344 202 -184 -378 0 -24 496 93 -179 -88 186 195 -122 -80 -368 -122 -53 372
6601 372 -49 -148 -403 331 357 236 -366 -587 17 22 82 -1 -87 -21 -264 325 268 -139 -163 -163 24 200 183 -227
6625 -227 -319 -147 360 -32 -31 -131 -55 49 380 5 -259 -41 228 180 236 -7 -95 -65 171 444 -60 -20 -199
6648 -199 53 221 99 -81 -317 -222 -23 81 50 -225 -493 136 76 96 -319 -50 -164 324 25 156 -46
$$ packed form
6493c74K56K51L53j69o87Q0L75N4J99k23k03jK37P2J50n31k62K61N34k87L1m17
6515c01j90O74J98n6k97m78N48J45J92l52l28J14J57L88k68m36J43K3L82p0j28
6536F0l78j36N24K82k43J18o34K76r9J79J19n39l3N41J44k52Q1l25M14m1L44l61
6558D1l59P8M5M54J35n83l95N74j24L1K75n21J39K34J68K73o38k83O39K72l45
6579A10j17k15j22J73N15j42l86j94L78k4N20m03k72R1K74Rl17M2k88K46O9M25
6601C72m21r9k55P34K6j21o02k21O04NO0q3q6O6k43N89n7m07k4%J87J76j7m10
6625b27r2J72N07l92Jj00P6J04L31l75k64K18K69m8N6k43q8L0K36K73n04M0j79
6648a99K52J68j22j80k36R5J99J04l1k75k68O29o0K0m15K69j14M88k99J31k02
$$ plain form
6669 -46 -224 76 150 129 -118 -347 -108 248 259 -99 -195 -462 -1 182 87 -203 -504 -291 183 187 156 -237 -206
6692 -206 -81 338 23 64 -225 -126 161 246 123 -223 -329 -249 531 204 170 -84 -6 243 323 29 -286 -354 32
6715 32 329 -122 84 -162 -181 172 404 43 187 40 -227 460 -116 88 -284 8 40 186 -138 -174 -217 -212
6737 -212 229 119 45 -380 112 53 135 -27 50 -301 -62 270 413 -45 -152 -237 -109 151 -132 -277 -477 -406
6759 -406 129 112 -96 -326 -412 132 577 276 153 -233 152 382 292 11 -270 -329 201 283 215 -231 -285 -125
6781 -125 224 434 192 -121 -48 265 151 408 -173 -313 -236 313 465 85 -88 69 -169 48 -122 -94 -203
6802 -203 193 167 320 32 -236 -187 200 257 198 -201 -322 3 76 224 -110 271 -74 -82 204 270 -348 -284 -38
6825 -38 -356 -136 -107 -177 -275 -149 416 -18 27 -377 274 170 -37 -92 179 -82 -127 42 -8 70 -411 -4 157
$$ packed form
6669d6j78L00P4k1k47k29K39L56J1l58r6k67M61J83r5k90l01K13M74Ml1l93L1
6692b06J25M19l15M1k89R9K87Q5j23l46j06Q0P80l27l4k54P8K49Q0k94l15o8L86
6715C2K97m51K06k46j9L53K32l61J44j47k67O87n76K04l72K92L2J46l24l6m3N
6737b12M41j10p4m25M92n9Q2j62P7l51K39L32J43m58j07q5J28K60k83j45k00P1
6759d06N35j7k08k30q6N44M45l01j23l86L85K30r0k81k81n9N30Q2o8m46n4J60
6781a25L49K10k42l13P3L13j14K57n81j40P7N49J52l80j73J57k38K17j70K8j09
6802b03L96k6J53k88k68M9L87N7n9l99j21L25P3J48l34L81l45qK86O6o18O4K46
6825c8l18K20K9p0r8J26N65m34M5m04O51j04k07n5K71k61m5J69n0P8m81M07J61
$$ plain form
6848 157 323 54 -71 -79 -50 86 5 -71 53 -139 159 330 43 -125 136 53 96 612 -70 -15 2 126 147
6871 147 87 -338 -435 8 111 261 42 -411 -382 232 80 -293 132 -421 33 501 323 -157 -324 91 155
6892 155 162 -197 -379 -45 93 163 19 -24 -489 41 14 378 6 -528 -111 -208 208 70 -286 -38 -166 28
6914 28 224 -219 -312 -30 -265 169 362 80 -66 -169 91 193 -177 -320 -345 156 73 148 277 -2 -391 -67
6936 -67 292 81 -17 -128 132 231 -49 -172 -173 -138 353 422 125 63 7 6 37 114 -168 -176 52 120 309 178 -235
6961 -235 -297 55 184 350 -150 -125 -152 14 216 -34 94 -198 -455 53 98 -387 -241 -50 -82 9 129 -574
6983 -574 -328 190 92 131 -170 184 -58 -20 315 94 -292 -555 7 190 -29 16 -258 -63 22 114 221 -29
7005 -29 -157 123 -32 68 -4 -446 -242 -101 288 56 -64 -17 -62 251 -27 -100 -198 -365 129 129 239 -317 -342
$$ packed form
6848A57J66k69j25qK9J36q1p6J24j92K98J71k87j68K61q3M3N16o82N5J7J24K1
6871A47o0m25r7M43J03J50k19m53K9O14j52l73M25n53M54M68j78m80j67M15O4
6892A55Pl59j82L34J38P0j44m3m65N30k7L64l72n34M17r7M16j38l56K48j28J94
6914B8J96m43r3K82k35M34J93k82j46j03K60J02l70j43k5N01q3P5J29k79l89L24
6936f7L59k11r8j11K60R9k80j23jL5M91O9k97o2n6jL1P7k82qK28O8J89j31m13
6961b35o2L52J29J66n00K5k7J66K02k50J28k92k57N08M5m85J46J91l2R1J20p03
6983e74K46N18r8L9l01L54k42L8L35k21l86k63N62J83k19M5k74J95Q5R2J07k50
7005b9j28K80j55J00p2m42K04J41L89k32j20M7m5L13k78p3r8j67M94%J10n56k5
$$ plain form
7028 -342 -11 222 338 -156 -197 -100 -134 17 284 -88 -64 -88 426 83 45 -302 63 192 -28 160 -137 58
7050 58 -184 226 304 -177 138 -22 216 157 80 -66 -67 -50 67 233 123 -53 -232 247 158 -251 -418 -72 -106
7073 -106 306 17 8 -234 -110 544 476 110 126 34 37 378 387 -105 -436 -267 204 -76 -149 -103 -186 -188 76 273 14
7098 14 -39 -208 181 -210 80 -296 -35 -54 311 184 86 -236 -347 212 171 67 -140 -180 -29 344 102 240
7120 240 -267 13 293 213 109 111 -140 -191 -12 44 -65 -340 -352 -2 141 -81 -8 -389 173 118 -125 12 -120
7143 -120 -212 321 106 -39 -262 -47 113 105 -15 -73 155 -78 165 -8 55 208 -32 192 422 82 -71 -183
7165 -183 -161 1 83 20 7 -286 64 120 207 145 -263 -25 5 355 29 -423 70 59 154 163 -265 60 -336 -140
7189 -140 275 -244 -25 -137 -45 40 137 -206 -98 -80 5 26 233 -63 126 120 137 183 267 -156 14 -58 207 140
$$ packed form
7028c42L31K33J16m94m1R7l4J51K67l72K4k4N14l43l8l47L65J29k20J88k97J95
7050E8k42M10P8m81L15j60K38n9p7j46jJ7J17J66j10j76j79M79q9m09j67L46l4
7073a06M12k89rk42J24O54o8l66J6r2LL41Rm92l31J69M71k80p3M6q3kK64J97k59
7098A4n3j69L89l91K90l76K61j9L65j27r8l22j11N59m1j04k07m0J51L73k42J38
7120B40n07K80K80q0j04Kk51n1J79N6j09k75j2L50J43k22P3l81N62n5k43J37j32
7143a20r2N33k15j45k23K15J60qj20n8K28k33K43j73O3J53k40K24K30l40j53j12
7165a83K2J62Q2o3j3k93L50N6Q7o2m08K38L0L50l26m52M93j1R5Rm28L25l96J96
7189a40M15n19K19j12R2Q5R7l43J08J8Q5K1K07k96J89oJ7M6Q4m23J70p2K65o7
$$ plain form
7213 140 -108 -243 -10 273 -14 220 -114 -230 -133 230 295 126 -160 205 90 41 82 -232 -194 -224 329 317
7235 317 37 -232 -394 109 115 8 -344 -263 -329 304 44 84 -137 29 97 57 -11 -241 -175 -22 29 61 -11 -365
7259 -365 -20 243 277 67 -328 -215 43 239 168 -112 -187 -56 108 159 27 -200 -94 144 524 230 -52
7280 -52 -354 -42 -56 27 92 -513 -197 -255 -82 111 190 42 -170 -19 367 -179 -394 -137 -165 167 474 -178
7302 -178 -52 -178 -97 154 68 -80 -251 195 66 -246 -182 -276 -408 -104 120 68 -364 -33 189 190 -153 -101 -262
7325 -262 -10 367 43 193 -104 -221 133 333 398 182 -238 21 366 193 -72 -37 -261 80 148 331 -227
7346 -227 -49 -389 162 129 161 -9 156 -21 240 319 14 -210 -371 -5 118 -55 -259 -69 81 184 48
7367 48 -152 -106 -39 184 358 18 -176 30 -4 181 265 173 -385 68 132 170 297 -26 -268 109 -180 223 41
$$ packed form
7213A40k48j35K33K83k87K34l34j16R7L63O5j69k86L65j15m9M1l14L8l0N53j2
7235C17k80k69j62N03Oj07l52Q1o6O33k60M0k21J66O8m0o8k30O6J53N1L2p2l54
7259c65L45K63L4k10l95J13K58J96p1k80p5J31J64N1j32k27J06K38L80k94k82
7280e2l02L12j4Q3O5o05L16n8J73J93P9j48k12J51L86n46k15K57k8L32L07o52
7302a78J26j26Q1K51q6j48j71M46j29l12O4r4j32L04K24n2m32L31K22Jl43N2j61
7325b62K52L77l24J50k97j17L54K00O5k16m20K59L45j73k65L5k24L41O8J83n58
7346b27J78l40N51l3L2j70J65j77K61P9l05k24j61L66J23j73k04J90J50J03j36
7367D8k00M6O7K23J74l40j94K06l4J85Q4r2n58M53O4L8J27l23k42L77k89M03j82
$$ plain form
7390 41 -125 20 30 64 -60 -303 153 -61 186 244 76 -326 -19 468 326 33 -321 -48 180 22 186
7411 186 -20 -95 -55 92 76 232 -103 85 -135 -57 307 -23 -345 -75 -152 199 290 -297 -438 -36 208 2
7433 2 119 -619 -28 -126 327 282 -161 -42 -158 71 163 -189 -257 -329 -124 87 -143 -147 -131 -24 -36 232 -60 60
7457 60 -52 -95 114 50 -193 18 33 22 96 -6 -293 -27 -104 329 -79 -170 -252 -170 280 -67 -131 -104 -18 -453
7481 -453 42 -80 -51 -175 119 314 53 -104 -236 -298 121 115 36 -258 -192 -144 328 -39 -165 -239 84 158 425
7504 425 120 131 -309 -109 256 280 -352 -237 229 -286 537 145 197 -312 -17 158 -27 -203 -125 -97 299 130
7526 130 154 -147 -189 -129 223 220 -185 -226 -65 53 -156 229 -180 -209 -105 10 78 -192 -23 -150 -31 379 25
7549 25 -81 -236 325 176 -80 59 -249 -306 85 206 414 -115 -160 63 -109 265 -158 -207 -93 105 129 138
$$ packed form
7390D1j66J45J0L4j24k43M56k14K47N8j68m02L07M87j42k93l54K73K28j58J64
7411A86k06p5M0J47j6J56l35J88k20P8L64l30l22K70p7L51R1n87j41M02K44k06
7433BJ17p38N91r8M53m5m43J19j16K29R2l52o8p2K05K11k30mJ6J07j2K68k92J20
7457F0j12m3K09o4k43K11J5j1P4j02k87K66p7M33m08r1q2Q2M50l47o4K7Q6m35
7481d53M95j22K9j24K94J95k61j57j32o2M19op9k94O6M8M72l67j26p4L23P4K67
7504D25l05J1m40K00L65K4o32J15M66n15Q23l92N2n09K95J75j85j76P8K8L96j69
7526A30K4l01m2O0L52lm05m1J61J18k09L85m09k9J04J15O8k70J69j27J19M10l54
7549B5j06j55N61j49k56J39l08n7L91J21K08n29m5K23j72L74m23m9J14J98K4R
$$ plain form
7571 138 -100 -211 114 -119 32 233 60 -200 33 -77 136 -174 8 -7 33 288 -31 -98 -21 -372 -83
7592 -83 -181 -211 -122 -149 -85 256 177 -1 35 -258 -108 219 38 -343 141 224 290 -76 -304 62 137 125 -130 12
7616 12 -109 -105 -9 14 169 -335 -222 149 -79 108 230 -93 119 146 217 -164 -180 67 109 370 327 -134 -197 -150
7640 -150 197 97 55 95 -74 355 448 115 182 42 -122 50 7 82 24 -166 -92 -106 54 -210 -68 -353 225
7663 225 190 142 -412 31 -16 135 -44 270 11 -159 262 174 87 -458 -152 -81 -5 151 -92 -25 -51 23 20 -121
7687 -121 -118 -70 185 -117 113 -48 -226 -22 -164 147 118 -8 -2 -210 78 -138 250 -170 -2 239 -21 98
7709 98 -164 -491 -59 2 167 15 -122 152 247 81 156 -152 25 24 249 -135 -54 59 138 -6 -318 155 70
7732 70 -14 -33 -157 54 -241 -13 39 -63 422 47 -340 18 6 116 -198 -79 -150 -432 -55 23 106 33 -146
$$ packed form
7571A38k38j11L25k33J51K01j73k60K33j10K13l10J82j5M0K55l19o7P7l51K89
7592h3r8l0Q9k7O4L41p9j78L6k93J50L27j81l81M84Q3O6l66k28L66P5j2k55J42
7616A2j21MR6K3J55n04J13L71k28J87J22l23K12K7P1l81j6K47M2K61m3m61o3M7
7640a50L47j00m2M0j69M29R3l33O7j40j64J72m3P5n8j90P4j4J60k64J42k85N78
7663B25l5m8n54M43m7J51j79L14k59j70M21q8q7n45L06P1P6J56k43O7k6P4lj41
7687a21LM8K55l02K30j61j78K04j42L11k9j26Ok08K88k16L88m20J68K41k60J19
7709I8k62l27M32O1J65j52j37K74R5j66P5l08J77jK25l84Q1J13P9j44l12M73q5
7732G0q4j9j24K11k95K28N2j02M85l75l87L58j2J10l14J19p1k82L77P8Q3p3j79
$$ plain form
7755 -146 173 9 199 213 -180 -281 -20 -169 -16 87 -354 77 -16 110 69 -277 -70 66 342 -319 -68
7776 -68 -56 56 176 -246 -2 -115 -41 -112 59 -149 59 -35 245 275 135 9 -90 -300 315 63 120 -10 -366
7799 -366 -169 200 -1 161 145 0 98 -72 207 -210 -206 -252 298 304 6 -80 114 59 -14 -86 -11 -38 -189 -174 -106
7824 -106 178 34 -388 -274 26 117 21 66 -14 88 227 583 -197 -183 -90 252 -5 -47 -194 -162 177 260 46
7847 46 -28 -119 -145 96 -206 74 19 -192 36 68 152 -149 -343 162 131 -23 -72 67 -200 225 17 -40 135
7870 135 -553 -76 -66 284 146 -131 124 152 141 74 -106 71 148 313 -27 102 -212 69 240 78 -98 -69
7892 -69 -470 -268 457 125 67 -147 -133 196 190 -2 -234 -164 -59 -60 -10 -276 -262 11 280 315 199 -117 36 -134
7916 -134 -194 -20 -5 -140 -54 -210 132 -31 191 53 -265 119 -8 -121 -163 62 -45 32 -20 -59 2 122 97
$$ packed form
7755a46L19j64J90J4l93j01K61j49J53J03m41M31r3J26m1l46K07J36K76o61K51
7776f8J2J12J20m22K44j13P4p1J71k08K08r4K80L0j40j26r9k10O15k52N7j30l56
7799c66J97L69k01J62j6j45R8j70K79m17Mm6N50Ok98q6J94n5p3p2P5k7j51J5O8
7824a06K84j44m22J14L00R1r6M5q0J02J39L56p80J4R3L42k57m2j47L2L39Q3k14
7847D6p4r1k6K41l02K80n5k11K28L2Q4l01j94N05l1j54m9J39k67M25k08n7J75
7870A35o88M77J0L50j38k77K55K8j1o7j80J77P7J65l40J29l14K81J71j62j76K9
7892f9m01K02P25l32n8k14J4L29oj92k32P0J05jN0k66J4K73K69L5j16l16J53j70
7916a34o0J74J5j35Q6j56L42j63K22j38l18L84j27j13m2K25j07P7n2l9O1J20k5
$$ plain form
7939 97 -13 277 -30 39 -33 -58 -56 -308 -426 -240 105 -263 265 -33 134 120 202 197 -74 36 -141 353 35
7962 35 -2 -311 93 143 162 69 -127 -442 -89 -13 192 -25 -353 -224 -292 281 174 -238 134 75 178 140 -197
7985 -197 -151 -275 87 241 175 -314 50 116 -83 34 97 22 73 -144 140 148 -15 136 -62 -37 109 -143 27
8008 27 -309 77 242 187 -50 -36 -68 12 -12 233 42 -221 178 243 -60 -26 -246 -229 123 129 64 -134 -301 86
8032 86 385 71 -86 -29 -145 143 199 214 -116 -22 165 68 180 185 -127 155 388 155 5 -16 257 -76 89
8055 89 40 -137 -113 -333 216 -163 118 -328 -144 -25 105 85 -252 -49 -75 -73 62 28 -317 -65 159 153 -50
8078 -50 22 -72 -73 159 211 119 -119 115 -123 174 -14 61 -257 196 282 109 15 -113 -340 16 -205 51 73 -134
8102 -134 -336 172 40 155 -62 -189 -60 70 131 513 192 47 -66 41 3 -178 -171 74 143 32 -126 -102
$$ packed form
7939I7j10K90l07O9p2k5Kk52j18J86L45l68N28k98J67j4Q2nk71J10j77M94l18
7962C5l7l09M04N0J9r3j96l15L53P6K05k17l28J29o8N73j07m12L72n9J03l8l37
7985a97M6j24L62J54o6m89L64O6j99J17O3p5N1k17K84Qj63J51j98K5J46k52J70
8008B7l36L86J65n5k37J4l2Q0k4K45j91k63L99O5l03L4k20J7L52Oo5j98j67L87
8032H6K99l14j57N7j16K88N6J5l30R4J87r7J12Nl12K82K33k33j50k1K73l33J65
8055H9m9j77K4k20N49l79K81m46J84J19J30k0l37K03k6KJ35l4l45K52K24ok03
8078e0P2r4jK32N2r2k38K34k38K97j88P5l18M53Q6j73r4j28k27L56k21K56K2k07
8102a34k02N08j32J15k17j27J29J30O1L82l21j45j13J07l8j81PK45O9j11j58K4
$$ plain form
8124 -102 -119 160 156 39 112 -129 327 148 280 264 -21 68 93 177 79 39 -106 -2 -104 54 173 -25 83
8147 83 -74 238 -170 47 185 4 62 1 -189 -40 0 -83 -18 -9 -154 411 0 362 53 -62 -296 -5 229
8170 229 136 306 -478 5 -3 -135 112 -61 -207 116 108 89 126 -244 -59 176 -248 -182 -157 -68 140
$$ packed form
8124a02j7K79mj17P3k41M56j79J32j6k85Q9K5Q4r8m0j45J04j02J58J19j98J08
8147H3j57L12m08K17J38j81N8o1j90J49M0q3O5Rj45N65m11L62l09j15k34K91K34
8170B29r3J70p84M83qj32K47j73j46L23qj9L7l70J85K35m24O6K5Q9K08
8191A40
$$ Imaginary data points
##PAGE= N=2
##DATA TABLE= (X++(I..I)), XYDATA
$$ plain form
0 0 0 0 0 0 8 0 8 -8 8 -16 16 -24 24 -38 40 -48 64 -72 82 -104 120 -136 160 -185 209 -241 276 -313 353
29 353 -401 449 -506 570 -634 707 -791 878 -975 1085 -1199 1328 -1473 1631 -1803 2003
45 2003 -2220 2464 -2747 3072 -3444 3890 -4424 5078 -5906 6993 -8478 10657 -14174 20783
59 20783 -37598 172581 247967 -190669 -290781 -114958 193899 283462 68431 -276956 -277942
70 -277942 52000 312266 188900 -121148 -293371 -134494 183645 306228 51550 -262196
80 -262196 -257672 40877 273192 202346 -102975 -297724 -140312 190183 284268 50830 -227074
91 -227074 -246214 10641 268642 212608 -106563 -292859 -127028 167489 263420 69762 -210590
102 -210590 -254287 13636 266519 195138 -95519 -264961 -137509 145044 265870 73680
$$ packed form
0@%%%%QqQj6J6k4L2m0M8o2P8q8J12j36J54j86K24k56K96l45L94m50N17n89O66
29C53p54Q50r55J076j204J341j498J669j853K060k284K527k801L104l434L806
45B003m223M684n211N819o516P334q314R502j0984J2899j5471J9135k4831L4957
59B0783n8381K10179P5386m38636j00112J75823L08857Q9563k15031l45387r86
70b77942L29942K60266j23366l10048j72223J58877L18139J22583k54678l13746
80b62196M524K98549K32315p0846l05321j94749J57412L30495R4085k33438k77904
91b27074j9140K56855K58001n6034l19171j86296J65831K94517R5931j93658k80352
102b10590m3697K67923K52883p1381k90657j69442J27452K82553J20826j92190
$$ plain form
112 73680 -211558 -242228 14211 243551 189352 -71941 -252971 -146834 140131 262047
122 262047 67777 -196879 -227692 -6169 224943 201988 -65857 -256037 -135813 136217
132 136217 241957 77102 -173711 -232305 -17844 223540 194141 -67350 -239133 -133096
142 -133096 115415 236629 91984 -167822 -231630 -12881 215082 181268 -56302 -223966
152 -223966 -142366 103365 236483 90427 -165146 -216873 -13323 196335 181731 -38528
162 -38528 -221859 -147835 104109 226716 80813 -149751 -206010 -28046 187794 187751 -36782
173 -36782 -216175 -137641 96520 211546 85390 -137300 -207058 -34895 184359 181919 -35725
184 -35725 -201445 -132222 82327 206486 94644 -134197 -205388 -31021 173585 170170 -25790
$$ packed form
112G3680k85238l0670K56439K29340n4199k61293j81030J06137K86965J21916
122B62047j94270k64656l0813K21523K31112k2955k67845j90180J20224K72030
132A36217J05740j64855k50813n8594K14461K41384k9399k61491j71783J06037
142a33096K48511J21214j44645k59806o3808K18749K27963l3814k37570j67664
152b23966Q1600K45731J33118j46056k55573n1727K03550K09658j4604k20259
162c8528j83331P4024K51944J22607j45903k30564n6259J77964K15840m3k24533
173c6782j79393P8534K34161J15026j26156k22690o9758J72163K19254k440k17644
184c5725j65720O9223K14549J24159j11842k28841p1191J74367K04606l415j95960
$$ plain form
195 -25790 -190687 -137868 77332 206464 90917 -129825 -192062 -32307 159013 169077 -16346
206 -16346 -188142 -138946 75745 196680 86057 -118034 -184252 -39975 154375 171363 -15834
217 -15834 -183263 -130705 69695 183165 88618 -108629 -185834 -43304 153631 164908 -15346
228 -15346 -169674 -128155 58877 181261 92956 -109226 -182925 -40464 143751 157056 -7373
239 -7373 -161461 -131128 55856 181204 90298 -105665 -173177 -43081 131885 156715 -785
250 -785 -162217 -129751 56940 173363 88064 -93446 -167920 -50335 129413 158060 -3334
261 -3334 -158242 -124350 49990 163914 92518 -87287 -168309 -49189 128686 151319 -1105
272 -1105 -147457 -125066 40239 162418 94880 -87710 -164766 -46077 121335 146618 7084
$$ packed form
195b5790j64897N2819K15200J29132j15547k20742o2237J59755J91320J0064j85423
206a6346j71796M9196K14691J20935j10623k04091o6218J44277J94350J6988j87197
217a5834j67429N2558K00400J13470r4547j97247p7205J42530J96935J1277j80254
228a5346j54328M1519J87032J22384q8305k02182p3699J42461J84215J3305j64429
239g373j54088L0333J86984J25348r0906j95963o7512J30096J74966K4830j57500
250g85j61432L2466J86691J16423q5299j81510p4474J17585J79748K8647j61394
261c334j54908L3892J74340J13924p1396j79805q1022J19120J77875K2633j52424
272a105j46352K2391J65305J22179o7538j82590p7056J18689J67412K5283j39534
$$ plain form
283 7084 -141792 -129005 38954 161801 89707 -84247 -156059 -50971 111554 148934 11267
294 11267 -142692 -125727 39387 153819 89204 -74945 -154428 -56796 110538 148032 8486
305 8486 -138081 -120649 33306 147216 94508 -70017 -154905 -55247 109565 141786 10408
316 10408 -129931 -122577 25659 147093 95629 -70607 -149936 -53026 102414 139792 17748
327 17748 -127620 -125178 25571 144621 90828 -65861 -144009 -57255 96810 141833 19835
338 19835 -126330 -121486 24702 137371 91373 -59013 -144729 -61526 96780 140370 17719
349 17719 -120342 -117104 18157 133758 96599 -57191 -144791 -59498 93035 133476 21602
360 21602 -113274 -120363 14048 135412 96066 -57244 -138630 -58796 85273 131944 27483
$$ packed form
283G084j48876J2787J67959J22847p2094j73954p1812J05088J62525L7380j37667
294A1267j53959J6965J65114J14432o4615j64149p9483R7632J67334L7494j39546
305H486j46567J7432J53955J13910n2708j64525q4888R9658J64812L2221j31378
316A0408j40339P354J48236J21434n1464j66236p9329R6910J55440L7378j22044
327A7748j45368K442J50749J19050n3793j56689p8148Q6754J54065M5023j21998
338A9835j46165M844J46188J12669m5998j50386q5716Q3203J58306M3590j22651
349A7719j38061L238J35261J15601l7159j53790q7600Q5293J52533M0441j11874
360B1602j34876p089J34411J21364l9346j53310q1386P9834J44069M6671j04461
$$ plain form
371 27483 -112937 -121965 15310 131913 91569 -51006 -132687 -63814 81409 134570 27935
382 27935 -112197 -117800 12460 123771 93689 -44282 -134311 -66409 82029 131721 27081
393 27081 -105200 -115004 6410 121388 97006 -43662 -133615 -64718 77051 126486 31352
404 31352 -99135 -117512 2986 122516 95796 -42773 -127577 -65219 69633 125891 35457
415 35457 -99557 -117130 4477 117651 93041 -35794 -123648 -69788 67745 127127 34180
426 34180 -98243 -112549 1093 111322 95918 -31117 -124460 -69945 68444 122776 33794
437 33794 -90491 -111523 -5660 110011 98231 -32260 -122586 -66816 62942 118528 39389
448 39389 -85644 -114652 -6860 110148 94289 -30608 -116123 -68891 56730 118902 42924
$$ packed form
371B7483j40420r028J37275J16603m0344j42575q1681O8873J45223N3161j06635
382B7935j40132n603J30260J11311l0082j37971r0029O7902J48438M9692j04640
393B7081j32281r804J21414J14978k4382j40668q9953O8897J41769M9435r5134
404C1352j30487j8377J20498J19530k6720j38569q4804O2358J34852N6258r0434
415C5457j35014j7573J21607J13174k4610j28835q7854N3860J37533N9382r2947
426C4180j32423j4306J13642J10229j5404j27035r3343N4515J38389N4332q8982
437C3794j24285k1032J05863J15671j1780j30491r0326N5770J29758N5586p9139
448C9389j25033k9008J07792J17008j5859j24897q5515M7232J25621O2172p5978
$$ plain form
459 42924 -86187 -112961 -5150 104687 92323 -24364 -113416 -72867 54505 119391 41483
470 41483 -83494 -108056 -9303 99036 95317 -19925 -114450 -72441 54266 114679 41717
481 41717 -76915 -108257 -14758 98235 96053 -20686 -110462 -69996 48622 111008 46757
492 46757 -73944 -110066 -14795 97311 91976 -18069 -104798 -72858 44048 112289 48515
503 48515 -73594 -106862 -14325 90957 91157 -12454 -104062 -75780 43828 111151 46421 -69648
515 -69648 -102842 -18998 87723 94511 -10913 -104422 -73339 42066 105589 48040 -63919
526 -63919 -103827 -22513 88064 93350 -11646 -99527 -72002 36254 103709 52587 -63287
537 -63287 -105512 -21105 85888 89526 -7763 -94469 -74928 32832 105351 52360 -62829 -101250
$$ packed form
459D2924j29111k6774J07811J09837j2364j16687q9052M0549J27372O4886p7908
470D1483j24977k4562R8753J08339l719j15242r4525M2009J26707O0413p2962
481D1717j18632l1342R3499J12993k182j16739q9776M0466J18618O2386o4251
492D6757j20701l6122R5271J12106n335j10045q6729L1940J16906O8241o3774
503D8515j22109l3268R2537J05282K00j03611r1608K8282J19608O7323o4730j16069
515f9648l3194Q3844J06721O788j05424r3509L1083J15405O3523n7549j11959
526f3919l9908Q1314J10577N286j04996q7881K7525J08256O7455n1122j15874
537f3287m2225Q4407J06993L638r7289q6706J9541J07760P2519n2991j15189l8421
$$ plain form
549 -101250 -21607 79690 89803 -2717 -94718 -76724 33446 102878 50276 -58187 -98157
560 -98157 -26403 76996 92176 -1919 -94507 -73904 31755 98213 52481 -52936 -99101
571 -99101 -28618 77646 90882 -2333 -89513 -73242 25391 96854 55792 -52925 -99561 -27731
583 -27731 74505 87633 1930 -85767 -76490 23473 97681 55056 -52347 -95619 -28949 68422
595 68422 88692 5847 -85754 -76446 23767 94687 54271 -46995 -93550 -33169 66950 90176
607 90176 5550 -84484 -74198 20821 89910 57007 -42962 -95203 -33874 66786 87056 6380
619 6380 -79773 -74514 16059 89924 59396 -42852 -93754 -32892 63687 85121 10392 -76835
631 -76835 -76663 15202 89876 56977 -41344 -89378 -35048 59104 86668 12978 -77512 -76046 15356
$$ packed form
549a01250P9643J01297J0113r2520r2001J7994J10170O9432n2602j08463l9970
560i8157P1754J03399J5180r4095r2588K0603J05659O6458m5732j05417m6165
571i9101P0483J06264J3236r3215q7180J6271R8633P1463m1062j08717m6636P1830
583b7731J02236J3128q5703q7697R277R9963P4208m2625j07403m3272O6670R7371
595F8422K0270q2845r1601R308J00213P0920m0416j01266m6555O0381J00119K3226
607I0176q4626r0034J0286R5019O9089l2903r9969n2241O1329J00660K0270q0676
619F380q6153N259R0573P3865l0528j02248n0902O0862R6579K1434p4729q7227
631g6835J72R1865P4674l2899r8321m8034N4330R4152K7564p3690r0490J466R1402
$$ plain form
644 15356 86235 56459 -36537 -88329 -38937 58459 87755 11920 -75351 -72687 11730 82675
656 82675 59940 -33887 -89795 -38716 57408 83788 13237 -70644 -73912 7881 82817 61214
668 61214 -34192 -87446 -37498 53222 81933 17274 -68560 -76093 7491 82455 58469 -31766
680 -31766 -83181 -39838 49639 83365 19387 -69030 -74532 7314 78209 58634 -27018 -82915
692 -82915 -42879 49806 82975 17931 -65737 -71791 3519 75407 61610 -25834 -83664 -42063
704 -42063 48240 79792 19750 -61380 -73422 207 75900 61610 -26221 -80698 -40541 43519
716 43519 78255 23432 -60964 -74764 1116 74380 58987 -22842 -76956 -44039 40985 80171
728 80171 23901 -61101 -72118 640 69505 59494 -18096 -77164 -46078 41066 78852 22752
$$ packed form
644A5356P0879k9776r2996n1792M9392R7396K9296p5835q7271K664Q4417P0945
656H2675k2735r3827n5908N1079R6124K6380p0551q3881l268Q1793P4936k1603
668F1214r5406n3254M9948R0720K8711o4659q5834p533Q3584P4964k3986r0235
680c1766n1415M3343Q9477L3726o3978q8417n502Q1846P0895j9575q5652n5897
692h2915M0036R2685L3169o5044q3668o054P5310P1888j3797q7444n7830M1601
704d2063R0303L1552o0042q1130j2042P3629P5693j4290q7831n4477M0157Q4060
716D3519L4736n4823q4396j3800P5880P3264j5393q1829n4114L2917Q5024L9186
728H0171n6270q5002j1017P2758O8865j0011p7590n9068L1086Q7144L7786n6100
$$ plain form
740 22752 -56998 -70276 -4231 67123 62015 -17428 -77528 -44124 39573 74891 25252 -53104
752 -53104 -71386 -6296 67732 61262 -17837 -73641 -44190 34872 74407 28304 -52630 -71633
764 -71633 -5522 65962 58933 -14132 -70909 -46828 32391 74939 28247 -52226 -68845 -7034
776 -7034 61505 60361 -11414 -71284 -47332 32939 73183 27585 -48205 -67979 -10127 60656
788 60656 61607 -11092 -70500 -45894 30672 70120 29917 -45305 -69467 -10704 60734 59636 -10510
801 -10510 -66684 -46322 26690 70386 31237 -45346 -68359 -10512 57704 58125 -7303 -65051
813 -65051 -48317 26589 70236 30526 -44042 -65422 -12298 54553 59806 -5023 -65320 -48216
825 -48216 26274 67931 30183 -40674 -65017 -14882 53727 60120 -5773 -64121 -46228 23423
$$ packed form
740B2752p9750j3278O6045P1354n108p9443o0100L3404Q3697L5318m9639p8356
752e3104j8282O5090P4028o470p9099n5804K9451P9062L9535m6103q0934j9003
764g1633O6111P1484p029p3065n6777K4081P9219M2548m6692q0473j6619O1811
776g034O8539j144p1775n9870K3952Q0271M0244m5598p5790j9774N7852P0783
788F0656R51p2699n9408K4606P6566L9448m0203p5222k4162N8763P1438j098p0146
801a0510n6174K0362P3012M3696l9149p6583k3013N7847O8216M21o5428n7748
813f5051J6734P4906M3647l9710p4568k1380N3124O6851N253o4829o0297J7104
825d8216P4490M1657l7748p0857k4343N0135O8609O393o5893n8348J7893O9651
$$ plain form
837 23423 65567 32885 -38699 -66336 -15143 53595 58045 -4457 -60519 -47390 20792 65355
849 65355 33768 -38937 -64976 -14629 50210 57126 -1316 -59188 -49010 19698 65543 33028
861 33028 -36755 -62590 -16713 47769 58530 -90 -59574 -47973 19478 62588 33431 -33201
873 -33201 -62381 -18994 48260 58644 -659 -57289 -46540 16328 60737 35338 -32563 -63243
885 -63243 -19220 47321 56304 748 -54357 -47561 14453 61348 35783 -32173 -61333 -18287
897 -18287 44050 55872 3655 -53850 -48773 14788 60287 34754 -29933 -59291 -20953 42138
909 42138 57273 3859 -54104 -47558 13940 57636 35290 -27202 -59714 -22523 42793 56673
921 56673 3704 -51384 -46831 10861 56476 37558 -26798 -59888 -21756 41291 54553 5584
$$ packed form
837B3423M2144l2682p1584k7637N1193O8738M450o2502n6062J3129O8182M4563
849F5355l1587p2705k6039N0347O4839O916n8442n7872J0178O8708M5845l2515
861C3028o9783k5835M5877O4482J0761n8620n9484J1601O7451M3110k9157o6632
873c3201k9180M3387O7254J0384n9303n6630J0749O2868M4409k5399o7901l0680
885f3243M4023O6541Q983n5556n5105O796O2014M6895k5565o7956k9160M3046
897a8287O2337J1822n2217n7505N077O3561M5499k5533o4687k9358L8338O3091
909D2138J5135n3414n7963O546O1498M3696k2346o2492l2512L7191O5316J3880
921E6673n2969n5088M553N7692M5615j8918o4356l3090L8132O3047J3262m8969
$$ plain form
933 5584 -49014 -47893 9466 57026 36843 -26706 -57656 -21553 38213 54325 8155 -49144
945 -49144 -48306 10058 55503 35834 -24255 -55870 -23969 37082 55501 7909 -48668 -46907 8276
958 8276 53058 37180 -21801 -56979 -24981 37184 54105 7945 -45904 -46630 5744 52386 38565
971 38565 -21749 -56145 -23863 35323 52552 9989 -43992 -47670 4547 52381 37802 -21076
983 -21076 -53903 -25207 32638 52886 11593 -44525 -47745 4962 50584 37335 -18518 -53387
995 -53387 -26482 32438 53376 11229 -42921 -46175 3306 48593 38538 -16865 -53767 -26365
1007 -26365 31482 51407 11755 -40397 -46209 1122 48636 38956 -17326 -52202 -25835 29299
1019 29299 50226 14023 -39412 -47340 1340 48262 37719 -15988 -49950 -27325 26774 50963
$$ packed form
933E584n4598J121N7359M7560k0183o3549l0950L6103N9766J6112m6170n7299
945d9144Q38N8364M5445j9669o0089l1615L1901O1051J8419m7592n6577J761N5183
958H276M4782j5878n8981l5178L1998O2165J6921m6160n3849p26N2374M6642j3821
971C8565o0314l4396L2282N9186J7229m2563n3981l678N2217M7834j4579n8878
983b1076l2827K8696N7845K0248m1293n6118l220N2707M5622j3249n5853l4869
995e3387K6905N8920K0938m2147n4150l254M9481M5287j0055n5403l6902K7402
1007b6365N7847J9925l9652n2152n812M7331M7514r680n6282l4876K6367N5134
1019B9299K0927l6203n3435p928M8680M6922j0543n3707l3962K2625N4099K4189
$$ plain form
1031 50963 14603 -39596 -46373 1337 45866 37498 -12713 -49406 -28660 26929 51038 14014
1043 14014 -37767 -45075 -1241 43792 39213 -12322 -49900 -28287 26328 49143 14941 -35210
1055 -35210 -45335 -3153 44133 39242 -12376 -48343 -27730 23905 47935 16905 -34539 -46036
1067 -46036 -2690 43348 38059 -10525 -46302 -29111 22007 48646 17523 -34424 -44985 -3436
1079 -3436 41111 38425 -8320 -46213 -29727 22383 47735 16952 -32571 -44031 -5095 39933
1091 39933 39239 -8405 -46213 -28967 21213 46101 17885 -30272 -44441 -6233 40200 38447
1103 38447 -8252 -44116 -28860 18940 45672 19663 -30482 -44371 -5380 38581 37416 -6490
1115 -6490 -42727 -30308 18014 45936 18910 -29948 -42761 -6368 36609 37988 -4385 -42505
$$ packed form
1031E0963l6360n4199o777M7710M4529q368n0211l6693K0746N5589K4109l7024
1043A4014n1781p308M3834M5033m579n1535l7578K1613N4615K2815l4202n0151
1055c5210j0125M2182M7286m891n1618l5967K0613N1635K4030l1030n1444j1497
1067d6036M3346M6038n289m8584l5777J7191N1118K6639l1123n1947j0561M1549
1079c436M4547k686m6745l7893J6486N2110K5352l0783m9523j1460L8936M5028
1091C9933o94m7644l7808J7246N0180K4888k8216m8157j4169L8208M6433j753
1103C8447m6699l5864J5256M7800K6732k6009n0145j3889L8991M3961j165m3906
1115f490l6237J2419M8322K7922k7026m8858j2813L6393M2977J379m2373l8120
$$ plain form
1127 -42505 -30126 18112 44493 18574 -27476 -42105 -8376 36023 38473 -4617 -42387 -29291
1139 -29291 17011 42843 19872 -26058 -42652 -9019 35808 37463 -4725 -40048 -29448 14473
1151 14473 42654 21236 -25913 -42091 -8571 34231 36779 -2586 -38898 -30868 14259 42437
1163 42437 20363 -25287 -40453 -9718 32165 37204 -1059 -39059 -30490 13926 41166 20534
1175 20534 -23315 -40434 -10996 31931 37741 -1578 -38304 -29811 12509 39667 21882 -22127
1187 -22127 -40956 -11309 31849 36620 -867 -36481 -30180 10380 40171 22370 -21910 -39834
1199 -39834 -10659 29890 35689 1312 -35979 -31405 10736 40106 21370 -21136 -38649 -12300
1211 -12300 28358 36570 1543 -36192 -30560 10908 38186 21503 -19401 -38560 -13290 28423
$$ packed form
1127d2505J2379M8238K6381k5919m6050j4629L3729M4399K450m3090l7770J3096
1139b9291M6302K5832k2971m5930j6594L3633M4827J655m2188l5323J0600M3921
1151A4473K8181k1418m7149j6178L3520M2802K548l9365l6312Q030M5127K8178
1163D2437k2074m5650j5166L0735M1883N039l8263l8000Q569M4416K7240k0632
1175B0534m3849j7119K9438M2927N810l9319l6726Q493M2320K7158j7785m4009
1187b2127j8829K9647M3158M771l7487l5614O301M0560K9791j7801m4280j7924
1199c9834K9175M0549N799l4377l7291M574M2141K9370j8736m2506j7513K6349
1211a2300M0658Q212l5027l7735N632M1468K7278j6683m0904j9159K5270M1713
$$ plain form
1223 28423 36728 1097 -34520 -29589 8978 36978 22824 -18726 -38726 -13106 28044 35505
1235 35505 2003 -33064 -30270 7464 37527 23231 -18626 -37551 -12621 26226 34950 3875
1247 3875 -32799 -31325 7686 37051 22487 -17654 -36322 -14099 24829 35835 4161 -32494
1259 -32494 -30218 7434 35369 22599 -16021 -36339 -14915 24800 35291 3863 -31342 -29640
1271 -29640 5413 34582 23878 -15226 -36660 -14574 24415 33843 4648 -29657 -30188 4350
1283 4350 34910 23639 -15032 -35395 -14785 22533 33783 6234 -29453 -30693 4838 34229
1295 34229 23113 -13868 -34516 -15592 21351 34416 6488 -29286 -29792 4362 32472 23688
1307 23688 -12526 -34806 -16439 21519 33766 6428 -27804 -29348 2526 31850 24180 -12515
$$ packed form
1223B8423Q305l5631l5617M931L8567K8000j4154m1550k0000K5620M1150P461
1235C5505l3502l5067K794L7734L0063j4296m1857j8925K4930L8847Q724l1075
1247C875l6674J474L9011K9365j4564m0141j8668K2223L8928J1006l1674l6655
1259c2494K276L7652K7935j2770l8620k0318K1424L9715J0491l1428l5205J702
1271b9640L5053K9169j0704l9104k1434K2086L8989R428k9195l4305n31L4538
1283D350L0560j1271l8671k0363K0610L7318J1250k7549l5687j240L5531K9391
1295C4229j1116l6981k0648J8924L6943J3065k7928l5774n06L4154K8110q784
1307B3688l6214k2280J8367L7958J2247k7338l4232j544L1874K9324p670l6695
$$ plain form
1319 -12515 -34603 -15559 20904 32523 7285 -26560 -30273 1966 32452 23985 -12240 -32880
1331 -32880 -16210 19076 32613 8368 -26594 -29515 2295 31076 23414 -10817 -32275 -17168
1343 -17168 18486 32993 8108 -26132 -28804 1188 29490 24021 -9341 -32815 -17413 18789
1355 18789 32170 8317 -24422 -28935 -189 29598 24597 -9596 -32407 -16746 17621 30914
1367 30914 9313 -23548 -29404 -249 29508 24086 -9105 -30625 -17599 16078 31344 10103
1379 10103 -23775 -28934 -176 27893 23584 -7532 -30320 -18366 16045 31691 9794 -22862
1391 -22862 -28218 -1028 27020 24511 -6818 -30474 -17715 15539 30296 10322 -21314 -28556
1403 -28556 -2378 26917 24493 -7023 -29718 -17649 14395 29564 11143 -20967 -28622 -2355
$$ packed form
1319a2515k2088J9044L6463J1619k5238l3845l713L2239L0486q467l6225k0640
1331c2880J6670L5286J3537k4245l4962k921L1810K8781p662l4231k1458J5107
1343a7168L5654J4507k4885l4240k672K9992K8302n469l3362k3474J5402L6202
1355A8789J3381k3853l2739m513K8746K9787n001l4193k2811J5661L4367J3293
1367C0914k1601l2861n856K9155K9757n422l3191k1520J3026L3677J5266k1241
1379A0103l3878n159K8758K8069m309l1116k2788J1954L4411J5646k1897l2656
1391b2862n356K7190K8048k509l1329k3656J2759L3254J4757j9974l1636p242
1403b8556K6178K9295k424l1516k2695J2069L2044J5169j8421l2110p655K6267
$$ plain form
1415 -2355 26351 23905 -6153 -28580 -18123 13202 30108 11328 -21252 -27850 -2327 25078
1427 25078 23719 -4971 -28286 -18677 13494 29607 10801 -19893 -27110 -3587 24402 24617 -4562
1440 -4562 -28262 -18338 13108 28241 11381 -18681 -27455 -4455 24583 24067 -4566 -27598 -18471
1453 -18471 11755 27863 12571 -18618 -27848 -4175 23793 23494 -3787 -26446 -18906 10739 28321
1466 28321 12396 -18299 -26957 -4665 22865 23863 -2216 -26672 -19396 10801 27837 11981 -16949
1479 -16949 -26688 -5599 22108 24309 -2175 -26277 -19018 9945 26948 12793 -16028 -26915
1491 -26915 -6048 22069 24035 -2010 -24959 -18866 8894 26958 13596 -16165 -26802 -5906
1503 -5906 21086 23481 -973 -24198 -19837 8213 27183 13844 -15473 -25929 -6263 20030
$$ packed form
1415b355K8706k446l0058k2427J0457L1325J6906j8780l2580o598K5523K7405
1427B5078j359k8690k3315R609L2171J6113j8806l0694p217K3523K7989K15k9179
1440d562k3700R924L1446J5133j6860l0062q774K3000K9038n16k8633k3032R127
1453a8471L0226J6108j5292l1189r230K3673K7968k99k7281k2659P540K9645J7582
1466B8321j5925l0695q658K2292K7530R98k6079k4456P276L0197J7036j5856k8930
1479a6949r739K1089K7707K201k6484k4102P259K8963J7003j4155k8821j0887
1491b6915K0867K8117J966k6045k2949O093K7760J8064j3362k9761j0637K0896
1503e906K6992K395k4454k3225M361K8050J8970j3339k9317j0456J9666K6293
$$ plain form
1515 20030 23961 -149 -24661 -19859 8324 26166 13557 -14079 -25482 -7437 19767 24120
1527 24120 -20 -23877 -19479 7481 25301 14294 -13530 -25808 -7848 19617 23701 102
1539 102 -22997 -19567 6556 25027 14586 -13578 -25504 -7637 18613 23179 1140 -22158 -20169
1552 -20169 5946 25137 14454 -12718 -24597 -7980 17430 23481 1811 -22820 -19959 6236
1564 6236 24367 14360 -11597 -24534 -8986 17417 23305 1728 -21649 -19496 5001 23505
1576 23505 15147 -11339 -25001 -9037 17095 22862 2239 -20644 -19827 3759 23597 15778 -11271
1589 -11271 -24086 -8620 16255 22539 3047 -20392 -20518 4087 23353 15085 -10243 -23612 -9657
1602 -9657 15335 23047 3887 -20484 -19848 3775 22173 15529 -8890 -23432 -10365 15274 22616
$$ packed form
1515B0030L931k4110k4512M802K8183J7842j2609k7636j1403J8045K7204M353
1527B4120k4140k3857M398K6960J7820j1007k7824j2278J7960K7465M084k3599
1539A02k3099L430K6123J8471j0441k8164j1926J7867K6250M566k2039k3298J989
1552b0169K6115J9191j0683k7172j1879J6617K5410O051k1670k4631K861K6195
1564F236J8131j0007k5957j2937J5548K6403N888k1577k3377K153K4497J8504
1576B3505q358k6486j3662J5964K6132N767k0623k2883Q17K3586J9838p819k7049
1589a1271j2815J5466K4875O284j9492k3439j26K4605J9266q268k5328j3369J3955
1602i657K4992P712j9160k4371O36K3623J8398o644k4419j4542J3067K5639P342
$$ plain form
1615 22616 3303 -19462 -19359 2537 21953 16092 -8701 -23459 -10272 14991 22175 4071 -18478
1628 -18478 -19916 1888 22021 16184 -8814 -22464 -10214 13465 21669 5114 -18379 -20030 1870
1641 1870 21389 15587 -7726 -22104 -11132 12921 22041 5319 -18325 -19791 1103 20066 15865
1654 15865 -6885 -21915 -11594 13088 21968 5356 -17130 -19240 177 20135 16358 -6756
1666 -6756 -21745 -11402 12192 21056 5965 -16200 -19610 -161 20029 16246 -6725 -21190 -11462
1679 -11462 11002 21282 6630 -15983 -19799 -33 19186 15901 -5468 -20539 -12004 10876
1691 10876 20839 6079 -15359 -18563 -497 18243 16174 -5010 -20369 -11950 10608 20645 6362
1704 6362 -14623 -18911 -1708 17950 16565 -4850 -20174 -11653 10087 19833 7111 -14198 -19513
$$ packed form
1615B2616j9313k2765J03K1896J9416n861k4793j4758J3187K5263P184j8104k2549
1628a8478j438K1804K0133n837k4998j3650J2250K3679Q204j6555k3493j651K1900
1641A870J9519n802k3313j4378J0972K4053R120j6722k3644j466K0894J8963m201
1654A5865k2750j5030J0321K4682Q880j6612k2486k110J9417J9958l777k3114
1666f756j4989J0343K3594Q864j5091k2165l410J9449K0190l783k2971j4465R728
1679a1462K2464J0280j4652k2613l816J9766J9219l285k1369j5071Q535K2880
1691A0876R963j4760k1438l204J8066J8740k069k1184j5359Q419K2558J0037j4283
1704F362k0985m288J7203J9658j385k1415j5324Q521K1740R746j2722k1309n315
$$ plain form
1717 -19513 -1581 18055 15985 -4535 -19093 -11856 8880 20333 7530 -14240 -18882 -1332
1729 -1332 17315 15943 -3704 -18871 -12638 8905 19808 7002 -13792 -18074 -1824 16517 16248
1742 16248 -3354 -18947 -12496 8733 19474 7485 -12423 -18326 -2635 16464 16264 -2849 -18423
1755 -18423 -12312 8137 18843 8178 -12200 -18724 -2401 16205 15989 -2465 -17847 -12242 7344
1768 7344 19012 8357 -12291 -18458 -2858 15470 15750 -1809 -17560 -12982 7089 18657 8019
1781 8019 -11610 -17842 -3603 14696 16357 -1623 -17445 -12652 6847 17740 8153 -11077 -17895
1794 -17895 -3952 15020 16065 -1452 -16948 -12758 6258 17638 9071 -10695 -17783 -3860 14269
1807 14269 15444 -923 -15966 -12876 5871 17745 9028 -10857 -17369 -3721 13629 15746 -246
$$ packed form
1717a9513J7932J9636k070k0520j4558P237K0736J1453j2803k1770m642J7550
1729a332J8647j372j9647j5167O233K1543J0903j2806k0794m282J6250J8341k69
1742A6248j9602j5593O451K1229J0741j1989j9908n903J5691J9099k00j9113j5574
1755a8423O111K0449J0706j0665k0378o524J6323J8606k16j8454j5382N605J9586
1768G344J1668j0655k0648o167J5600J8328K80j7559j5751M578K0071J1568j0638
1781H019j9629o232J4239J8299J661j7980j5822M793J9499J0893r587j9230o818
1794a7895J3943J8972J045j7517j5496M190J9016J1380q567j9766p088J3923J8129
1807A4269J175j6367j5043L090J8747J1874q717j9885o512J3648J7350K117j5992
$$ plain form
1820 -246 -16444 -13189 5743 17759 8568 -9743 -16787 -4727 13374 15896 -412 -16032 -12901
1833 -12901 5278 16978 8979 -9320 -17090 -4550 13275 15696 -381 -15605 -12520 4745 17046
1846 17046 9185 -9074 -17176 -4857 12848 15336 532 -15083 -13436 4496 17293 9652 -8916
1859 -8916 -16439 -5135 12316 15419 575 -14971 -13482 4123 16486 9512 -8109 -16218 -5904
1872 -5904 12036 15689 710 -15154 -12800 4059 15957 9756 -7589 -16525 -5721 11901 15397
1885 15397 1007 -14295 -13202 2695 16095 10109 -7585 -16527 -5759 11200 15090 1839 -13901
1898 -13901 -13172 3166 15965 10189 -7326 -15791 -6038 10774 14982 2062 -13963 -13601 2702
1911 2702 15179 10176 -6568 -15526 -6281 10481 15226 2041 -13289 -12831 2300 14542 10236
$$ packed form
1820b46j6198L255J8932J2016r191j8311p044J2060J8101K522j6308j5620L131
1833a2901J8179J1700p999j8299p770J2540J7825K421j6077j5224L085J7265J2301
1846A7046p861j8259q102J2319J7705K488j4804j5615J647J7932J2797p641j8568
1859h916p523J1304J7451L103j4844j5546J489J7605J2363o974j7621q109J0314
1872e904J7940L653j4979j5864K354J6859J1898o201j7345q936J0804J7622L496
1885A5397j4390j5302J093J5897J3400n986j7694q942J0768J6959L890j3251j5740
1898a3901P29J6338J2799n776j7515q465R753J6812M208j2920j6025L62J6303
1911B702J2477n003j6744q958R245J6762M745j3185j5330M58J5131J2242m306
$$ plain form
1924 10236 -6342 -16018 -6583 10279 15014 2134 -12603 -13006 1823 14854 10717 -6283 -15581
1937 -15581 -6653 9511 14583 2892 -12345 -13479 1686 14589 10239 -5903 -14952 -6764 8978
1950 8978 14954 3291 -12691 -13094 1572 14123 10399 -5236 -15045 -7615 9288 14722 3110
1963 3110 -12046 -13056 616 13841 10825 -4720 -14740 -7259 8842 14540 3206 -11158 -13417
1976 -13417 328 13864 10785 -5099 -14220 -7635 8041 14253 3789 -11275 -13296 552 13514
1989 13514 10564 -4062 -14292 -7941 7450 14413 4071 -11102 -12823 19 12873 10900 -3606
2002 -3606 -14556 -8155 7502 14228 4095 -10661 -12774 -521 12612 10945 -3459 -13977 -7708
2015 -7708 7204 14063 4364 -10114 -13017 -701 12539 10933 -3462 -13575 -7976 6439 13807
$$ packed form
1924A0236j6578r676R435J6862M735j2880j4737m03J4829J3031m137j7000r298
1937a5581Q928J6164N072j1691j5237j134J5165J2903m350j6142r049Q188J5742
1950H978N976j1663j5982m03J4666J2551l724j5635r809P430J6903N434j1612
1963C110j5156j010J3672J3225l016j5545j0020P481J6101N698j1334j4364k259
1976a3417J3745J3536l079j5884r121O585J5676O212j0464j5064k021J3848J2962
1989A3514k950j4626j0230O351J5391O963j0342j5173j721J2842J2854j973j4506
2002c606j0950O401J5657O726j0133j4756k113J2253J3133j667j4404j0518O269
2015g708J4912O859r699j4478k903J2316J3240j606j4395j0113N599J4415P368
$$ plain form
2028 13807 5060 -9698 -12954 -395 12155 10489 -3045 -13312 -8426 5958 13778 4734 -9483
2041 -9483 -12466 -1027 11446 10836 -2620 -13232 -8203 6462 13344 4859 -9470 -12702 -1751
2054 -1751 11394 11390 -2409 -12967 -8237 6064 13021 5376 -8811 -12678 -1661 11389 10950 -2197
2068 -2197 -12474 -8350 5346 12999 5857 -8708 -12577 -1835 10770 10891 -1451 -12219 -8507
2081 -8507 5008 13033 5273 -8275 -12437 -2327 10499 11069 -1130 -12278 -8739 5044 12435
2094 12435 5515 -7718 -12250 -2488 10144 11272 -1085 -11786 -8987 4354 12419 5964 -7349
2107 -7349 -12368 -2792 10143 10820 -1084 -11373 -8828 3642 12627 6314 -7445 -11958 -2733 9493
2121 9493 10397 -525 -11525 -8978 3590 12447 5996 -6833 -11973 -2985 9101 11042 -101 -11349
$$ packed form
2028A3807q747j4758l256J2559J2550j666j3534j0267M886J4384P820r044j4217
2041i483k983J1439J2473o10j3456j0612N029J4665O882q485j4329l232J0951
2054a751J3145mj3799j0558M730J4301O957p645j4187l867J1017J3050m39j3147
2068b197j0277M124J3696P653p142j4565l869J0742J2605J21j2342j0768L712
2081h507J3515Q025p760j3548m162J0110J2826N70j2199j1148L539J3783P391
2094A2435o920j3233m532R762J2632J128j2357j0701K799J3341Q065o455j3313
2107g349n019R576J2935O77j1904j0289K545J2470Q985o313j3759m513R225J2226
2121I493R04j0922j1000K547J2568Q857o451j2829n140Q988J2086J941j1143j1248
$$ plain form
2135 -11349 -8935 3600 11576 6158 -6593 -11427 -3280 9018 10858 -426 -10881 -9088 3284
2148 3284 11584 6663 -6398 -12017 -3485 8913 10792 256 -10339 -8766 3055 12024 6695 -6443
2162 -6443 -11641 -3579 8460 10704 543 -10144 -9177 2746 11438 6488 -6014 -11196 -4000 7993
2176 7993 10759 495 -10312 -9039 2839 10928 6582 -5473 -11376 -4123 7932 10755 975 -9952
2190 -9952 -9115 2016 10775 7046 -5492 -11370 -3789 7977 10455 1043 -9344 -8978 2031 10800
2204 10800 7186 -5158 -11197 -4115 7456 10245 1209 -9557 -9252 2128 10639 6908 -4822 -10815
2218 -10815 -4298 7243 10215 1671 -9264 -8912 1340 10353 6988 -4398 -10553 -4627 7117 10354
2232 10354 1612 -9036 -9134 1055 10224 7456 -4280 -10834 -4855 6805 10042 2025 -8591 -9243
$$ packed form
2135a1349K414J2535P976n418j2751m834Q147J2298J840j1284j0455J793J2372
2148C284Q300m921j3061n619Q532J2398J879j0536j0595J573J1821Q969n329j3138
2162f443n198Q062J2039K244j0161j0687R67J1923Q692m950j2502n182P196J1993
2176G993K766j0264j0807J273J1878Q089m346j2055n903P253J2055K823r780j0927
2190i952Q37J1131Q759l729j2538n878P581J1766K478r412j0387L66J1009Q769
2204A0800l614j2344o039P082J1571K789r036j0766L05J1380Q511l731j1730n993
2218a0815O517J1541K972q544j0935L52J0252R013l365j1386o155N926J1744L237
2232A0354q742j0648r8J0189R169k768j1736o554N979J1660L237q017j0616o52
$$ plain form
2246 -9243 1142 10057 7266 -4052 -10395 -4406 6230 10123 2215 -8844 -9295 925 9533 7320
2260 7320 -3688 -10358 -5278 6126 10019 2320 -8169 -8960 551 9503 7273 -3330 -10158 -5193
2274 -5193 6100 10396 2219 -7901 -8731 56 9185 7972 -3286 -10355 -5031 5896 9741 2735
2288 2735 -7474 -9312 -101 9519 7526 -2834 -9759 -5293 5107 9833 3091 -7822 -9238 269
2302 269 8841 7321 -2444 -9831 -5784 5248 9980 2826 -7346 -8918 -149 8458 7793 -2708 -9719
2317 -9719 -5508 4941 9708 2695 -6534 -8784 -504 8781 7679 -2443 -9628 -5492 4497 9582
2331 9582 3380 -6822 -9098 -541 8759 7572 -1976 -9118 -5996 4632 9572 3407 -7006 -8810
2345 -8810 -595 8170 7581 -1607 -9022 -6116 4359 9351 3730 -5992 -8546 -1212 8079 7823 -1526
$$ packed form
2246i243J0385Q915k791j1318o343N989J0636L893p908j1059m51J0220Q608k213
2260G320j1008o670N080J1404L893p699j0489p91R511Q952k230j0603o828M965
2274e193J1293M296q177j0120q30Q787R129j213j1258p069N324J0927L845p006
2288B735j0209j838R211R620j993j0360o925M466J0400M726o742j0913j416R507
2302B69Q572j520r765p387M047J1032M732p154j0172j572Q769Q607o65j0501p011
2317i719M211J0449M767p013r229k250Q280R285j102j0122p185M136R989N085
2331I582o202j0202k276Q557R300j187r548p142L122J0628M940o165j0413j804
2345h810Q215Q765n89r188p415K906J0475M992n621r722k554P334R291k56r349
$$ plain form
2360 -1526 -9052 -6032 4349 8908 3866 -6101 -8730 -1101 7720 7818 -1500 -8817 -5612 3623 9030
2375 9030 4004 -5836 -8965 -1501 7647 7592 -1189 -8476 -6134 3431 8816 4077 -5702 -8577 -1270
2390 -1270 7363 7573 -712 -8655 -6236 3571 8958 3943 -5359 -8622 -2007 7127 7940 -904 -8415
2405 -8415 -5977 3003 8673 4028 -4974 -8633 -2003 7284 8009 -735 -8071 -5943 2839 8659 4490
2420 4490 -5049 -8319 -2041 6887 7473 -191 -7864 -6348 2819 8654 4196 -5167 -8228 -2076 6820
2435 6820 7671 161 -7921 -6227 2808 8275 4017 -4950 -7986 -2465 6208 7871 -87 -7750 -6465
2450 -6465 2441 8076 4501 -4106 -8365 -2649 6031 7436 398 -7168 -6073 2092 8088 4977 -4476
2465 -4476 -8424 -2794 5785 7283 178 -7416 -6520 2021 7939 4767 -3958 -8213 -2812 5719 7568
$$ packed form
2360a526p526L020J0381M559n042r967k629P629Q821R8r318p317L205R235N407
2375I030n026r840l129P464R148n5q781p287K342R565N385m739r779k875P307
2390a270Q633K10q285p943K419R807N387n015r302l263O615R134Q13q844p511
2405h415K438Q980N670m645r002l659O630R287P25q744p336K128Q782N820m169
2420D490r539l270O278Q928N86p664p673J516R167N835m458r363l061O152Q896
2435F820Q51p510q082J694R035N467m258q967l036N521Q673J663p958p663J285
2450f465Q906N635l575q607m259N716Q680J405p038p566J095Q165N996l111r453
2465d476l948N630Q579J498p105p594Q96Q541N918l172q725m255N401Q531J849
$$ plain form
2480 7568 645 -7275 -6562 1876 7719 4758 -3519 -8364 -2692 5605 7693 716 -6939 -5990 1557
2495 1557 7579 4943 -3384 -8045 -2885 5587 7424 908 -6864 -6179 1033 7594 4669 -3624 -8049
2510 -8049 -2869 5069 7690 954 -6730 -6399 1417 7390 5037 -2903 -7636 -3325 5103 7397 905
2525 905 -6641 -6358 1093 6942 4593 -3143 -7776 -3254 4932 7547 1431 -6319 -6286 1212 7106 5115
2541 5115 -2976 -7720 -3288 4896 7321 1427 -5964 -6352 873 7203 5311 -2882 -7270 -3107 4473
2556 4473 7030 1575 -5837 -6618 623 7036 5140 -2398 -7555 -3858 4394 7488 1710 -5725 -6512
2571 -6512 436 6600 5013 -2254 -7314 -3708 4019 7303 1663 -5577 -6395 183 6536 5452 -2301
2586 -2301 -7137 -3486 3839 7153 1846 -5323 -6553 82 6567 5336 -1887 -6861 -3832 4016 6905
$$ packed form
2480G568o923p920P13Q438N843k961q277m845N672Q297K088o977p655R49P547
2495A557O022k636q327m661N160Q472J837o516p772O85P212O561k925q293m425
2510h049N180P938K621o736p684L31P816N973k353p940m733M311Q428K294o492
2525I05p546K83P451N849k349p736m633M522Q186K615o116p750L3P498N894j991
2541E115q091m744M432Q184K425n894p391l88P225O330j892q193m388M163P580
2556D473K557n455p412p81P241O413j896p538n157L697Q252L094n778p435p87
2571f512O948O164j587p267n060L606P727L284n640p240q18O578O353j084p753
2586b301m836L651P325L314n307p169j230O635O485j231p223m974L029P848K889
$$ plain form
2601 6905 1991 -5532 -6718 -41 6162 5306 -2086 -6794 -3973 3657 6882 2278 -5019 -6546 -236
2616 -236 6252 5371 -1432 -6607 -3799 3611 6798 2051 -4730 -6470 -538 6024 5654 -1574 -6912 -3971
2632 -3971 3162 6683 2504 -4704 -6403 -386 5867 5449 -1593 -6783 -4094 2940 6619 2470 -4844
2647 -4844 -6632 -804 5753 4981 -1109 -6125 -4065 3203 6642 2497 -4362 -6064 -718 5662 5469
2662 5469 -1050 -6579 -4033 2794 6347 2724 -4283 -6559 -1066 5452 5572 -908 -6126 -4313 2478
2677 2478 6388 2648 -4196 -6410 -1128 5213 5386 -1186 -5731 -4285 2711 6389 2983 -4029 -6157
2692 -6157 -949 5271 5438 -498 -5915 -4361 2383 6260 2585 -3716 -5861 -1553 5294 5247 -581 -6097
2708 -6097 -4583 1999 6157 3015 -3597 -5933 -1356 4749 5585 -468 -5702 -3966 1948 6101 3331
$$ packed form
2601F905m914p523j186O677O203q56p392m708K821P630L225m604p297j527O310
2616b36O488q81o803n175K808P410L187m747o781j740N932O562l70p228n338K941
2632c971P133L521m179p208j699O017O253m18p042n190K689P034L679m149p314
2647d844j788N828O557p72o090n016K060P268L439m145o859j702N346O380j93
2662E469o519n529K546O827L553l623p007k276N493O518J20o480n218J813O791
2677B478L910l740o844k214N282O341J73o572m545J446O996L678l406p012k128
2692f157N208O220J67n936n417J554O744L877l675o301k145M308O847m7n828n516
2708f097J514O582M158l142o612k336M577O105Q36o053n234J736N914M153k770
$$ plain form
2723 3331 -3672 -6192 -1449 4882 5603 -282 -5751 -4556 1637 5907 2991 -3576 -5735 -1539 4670
2738 4670 5317 -211 -5538 -4644 1850 6511 3198 -3535 -5426 -1692 4607 5609 -104 -5642 -4192
2753 -4192 1367 6120 3095 -2997 -6063 -1607 4419 5306 -109 -5123 -4294 1579 5768 3322 -2782
2768 -2782 -5554 -1147 4085 5329 47 -5197 -4552 1346 5692 3597 -3010 -5743 -1748 4137 5435
2783 5435 374 -5334 -4641 1349 5734 3601 -2971 -5624 -1829 3933 5357 578 -5012 -4596 975
2798 975 5179 3492 -2555 -5549 -2272 3868 5561 548 -4976 -4595 947 5458 3713 -2593 -5789
2813 -5789 -2014 3744 5283 692 -4803 -4650 823 5560 3436 -2053 -5573 -2242 3475 5469 820
2828 820 -4858 -4639 869 5421 3523 -2299 -5089 -2482 3335 5727 650 -4515 -4586 467 5108 3659
$$ packed form
2723C331p003k520M743O331P21n885n469J195O193M270k916o567k159M196O209
2738D670O47n528n327Q94O494M661l313o733j891L734O299J002n713n538J450
2753d192N559M753l025o092l066M456O026Q87n415n014Q29N873M189k446o104
2768b782k772M407N232J244n282n244O45N898M346k095o607k733L995N885J298
2783E435n061n708O93N990M385k133o572k653L795N762J424m779n590M16N571
2798I75M204j687o047k994L277O140J693n013n524L81N542M511j745o306l196
2813e789L775N758J539m591n495J53N473M737k124n489l520L331N717J994m649
2828H20n678K19N508M552j898n822k790K607N817K392n077n165p1N053M641j449
$$ plain form
2844 3659 -1904 -5426 -2449 3786 5359 974 -4313 -4698 654 4993 3731 -1935 -5569 -2482 3573
2859 3573 5358 1087 -4104 -4807 446 5106 3740 -1772 -5114 -2621 3184 5442 1112 -4142 -4780
2874 -4780 535 5034 4086 -1669 -5329 -3127 3023 5301 1102 -4228 -4913 283 4951 3710 -1777
2889 -1777 -5101 -2490 2957 5287 1103 -3638 -4557 -56 5083 3955 -1402 -4918 -2455 2750 5039
2904 5039 1119 -3771 -4771 25 4608 3838 -1459 -4877 -2951 2532 5206 1530 -3669 -4654 -18
2919 -18 4784 3969 -1170 -4943 -2818 2873 4963 1653 -3572 -4411 -451 4408 4251 -1287 -5197 -3118
2935 -3118 2484 5074 1296 -3480 -4803 -473 4379 4029 -1118 -4825 -3070 2156 4987 2014 -3629
2950 -3629 -5002 -507 4098 3734 -944 -4732 -3418 1909 4959 1974 -3532 -4395 -544 4070 4081 -850
$$ packed form
2844C659n563l522K977O235J573m385n287l85N352M339j262n666l634L087O055
2859C573J785m271n191p03N253M660j366n512l342K493N805K258m330n254o38
2874d780N315M499r48n755l660K202O150K278m199n330o85N196M668j241n487
2889a777l324K611N447K330m184m741r19M501N139j128n357l516K463N205K289
2904E039l920m890j000M796M583p70n297l418J926N483K674l676n199r85M636
2919a8M802q15n139l773K125N691K090l310n225q39L960M859j57n538l910K079
2935c118N602K590l778m776j323M330M852l50n147l707J755N226K831k973n643
2950c629j373M495M605l64m678l788J314N327L050k985n506q63L851M614J1m931
$$ plain form
2966 -850 -4990 -3272 2185 4855 1892 -3185 -4585 -598 4112 4076 -677 -4860 -2962 1746 4658 1779
2982 1779 -2980 -4490 -689 4119 4150 -764 -4384 -2869 1902 4810 2236 -3083 -4656 -979 3774
2997 3774 4091 -348 -4501 -3529 2030 4760 2061 -3015 -4736 -1072 3691 4198 -97 -4155 -3137 1748
3013 1748 4904 1933 -2739 -4680 -894 3793 4470 -264 -4277 -3328 1546 4708 2149 -2512 -4610
3028 -4610 -950 3542 3942 -72 -4368 -3518 1606 4818 2510 -2775 -4413 -1185 3468 4021 -16 -4183
3044 -4183 -3349 1433 4655 2255 -2405 -4302 -1342 3593 4124 270 -3767 -3431 1398 4602 2458 -2185
3060 -2185 -4047 -1484 3284 4277 123 -3763 -3473 966 4195 2423 -2317 -4302 -1338 3031 4005 116
3076 116 -4005 -3867 878 4306 2550 -2414 -4406 -1331 3066 4041 290 -3790 -3248 907 4370 2635
$$ packed form
2966h50m140J718N457K670k963n077j400L987M710l6m753m183J898M708K912k879
2982A779m759j510L801M808L1m914l620J515M771K908k574n319j573L677M753
2997C774L17m439m153R72N559K730k699n076j721L664M763N07m295m058J018M885
3013A748L156k971m672j941L786M687O77m734m013R49M874L162k559m661k098
3028d610L660M492M00m014m296Q50N124L212k308n285j638L228M653N53m037m167
3044d183Q34M782L222k400m660j897K960M935N31l854m037L36M829L204k144m643
3060b185j862K563M768R93m154l886K90M439L229j772m740j985K964M369R74l889
3076A16m121J38M745L428j756m964j992L075M397R75l751m080N42M155L463j735
$$ plain form
3092 2635 -1925 -4336 -1433 2911 4086 325 -3932 -3539 1301 4164 2405 -1995 -4587 -1336 3048
3107 3048 3794 317 -3555 -3592 1044 3961 2592 -1843 -4108 -1696 3250 3859 497 -3435 -3378 439
3123 439 3918 2529 -1886 -4103 -1808 2776 3884 436 -3787 -3514 833 3945 2621 -1674 -4103
3138 -4103 -1901 2364 3991 827 -3828 -3571 698 3903 2734 -1540 -3986 -1854 2646 3940 558
3153 558 -3554 -3129 210 4060 3119 -1599 -4289 -2015 2354 4077 884 -3266 -3615 159 3780 2791
3169 2791 -1291 -3977 -2063 2332 3809 611 -3172 -3513 359 3843 2762 -1571 -4083 -2222 2116
3184 2116 3880 807 -3330 -3316 186 3674 2885 -1174 -3712 -2059 2318 3722 927 -3026 -3539 179
3200 179 3670 2718 -1033 -4026 -2169 2266 3621 951 -2971 -3779 -134 3549 2772 -1052 -3950 -2120
$$ packed form
3092B635m560k411K903M344J175l761m257L93M840K863j759m400k592L251M384
3107C048P46l477l872l7M636K917j369m435k265K412M946O09l362l932N7L817
3123D39L479j389m415k217K295M584J108l448m223K73M347L112j324m295k429
3138d103K202M265J627l164m655K57M269L205j169m274k446K132M500J294l382
3153E58m112M25L339L850r41m718k690K274M369J723l193m150l49L774L621r89
3169B791m082k686J914M395J477l198l783l41L872L484j081m333k512J861M338
3184B116J764l073m137J4L502L488p89m059k538J653M377J404k795l953n13L718
3200A79L491r52l751k993J857M435J355k670l922q08L645L683p77l824k898J830
$$ plain form
3216 -2120 1836 4020 1013 -2970 -3403 243 3443 2736 -1007 -3779 -2251 2037 3839 1192 -2978
3231 -2978 -3298 -123 3218 3010 -1103 -3914 -2061 1900 3680 942 -2621 -3502 8 3140 2952 -845
3247 -845 -3702 -2486 1908 3854 1575 -2544 -3332 -36 3329 2994 -748 -3656 -2376 1749 3690 1349
3263 1349 -2809 -3481 -390 3108 2911 -561 -3544 -2306 1721 3624 1460 -2584 -3230 -383 3034 2720
3279 2720 -414 -3830 -2070 1835 3461 1304 -2372 -3565 -379 3177 2874 -668 -3562 -2307 1716
3294 1716 3592 1656 -2257 -3276 -687 2973 2856 -416 -3455 -2268 1137 3627 1592 -2223 -3173
3309 -3173 -504 2755 2663 -241 -3315 -2292 1461 3715 1491 -2134 -3432 -712 3190 2789 -477 -3391
3325 -3391 -2519 1332 3530 1740 -2063 -3131 -951 2822 3079 -209 -3156 -2519 1040 3199 1813 -1873
$$ packed form
3216b120L956K184l007l983m33L646L200p07l743k772J528M288J802k647m170
3231b978l20L175L341k08m113k811J853L961J780k738l563q81L510L132j88l797
3247h45k857J216M394J946k279m119p88L296L365l35l742k908J280M125J941k341
3263A349m158o72L091L498j97l472k983J238M027J903k164m044o46K847L417l14
3279B720l134l416J760L905J626k157l676j193L186L556l03l542k894J255M023
3294A716J876j936l913j019K589L660j17l272l039J187L405K490k035l815r50
3309c173K669L259r2k904l074J023L753K254k224l625j298K720L902m01l266k914
3325c391Q72L851K198j790l803j068K180L773K57l288k947O37L559K159j386l686
$$ plain form
3341 -1873 -3396 -629 2661 3134 -494 -3229 -2306 1123 3448 1838 -1831 -3321 -935 2663 2783 -64
3357 -64 -3326 -2343 989 3150 1735 -1640 -3303 -877 2552 3254 -310 -3118 -2077 933 3362 1791
3373 1791 -1475 -3409 -955 2593 3060 30 -2854 -2334 926 3167 1792 -1824 -3320 -835 2669
3388 2669 2758 -234 -3266 -2518 916 3647 1629 -1716 -3380 -855 2145 3000 198 -2843 -2585 935
3404 935 2944 1810 -1590 -3080 -1162 2505 3028 147 -2863 -2531 867 3172 1957 -1621 -3262 -1174
3420 -1174 2680 3015 246 -3021 -2547 669 2985 2187 -1266 -3115 -1312 2385 2930 289 -2802 -2534
3436 -2534 503 3101 2269 -1509 -2980 -1176 2092 3202 271 -2419 -2437 498 2866 2238 -1325 -3586
3452 -3586 -1174 1858 3122 283 -2556 -2710 355 2956 2161 -1163 -3076 -1262 2056 2743 508 -2450
$$ packed form
3341a873j523K767L290M73l628k735R23L429K325j610l669j490K386L598J20k847
3357f4l262R83L332K161j415l375j663K426L429P02l564k808J041L010K429j571
3373A791l266j934K454L548M67l030k884N20L260K241j375l616j496K485L504
3388B669Q9k992l032P48L434K731k018l345j664K525L000Q55k802l041K58L520
3404I35K009j134l400j490J918L667N23k881l010L32L398K305j215l578j641K088
3420a174L854L35k769l267M74L216K316p98l453j849J803L697N45k641l091K68
3436b534L037K598q32l778j471J804L268J110k931k690j8K935K368o28l563k261
3452c586K412L032J264k839k839j54L065K601p95l324j913J814L318O87k235k958
$$ plain form
3468 -2450 -2506 404 2603 2120 -1109 -2913 -1168 1910 2678 649 -2747 -2560 341 3110 1807 -1124
3484 -1124 -3120 -1017 1826 2953 567 -2520 -2598 186 2827 2198 -1231 -3001 -1526 2065 3035 518
3500 518 -2419 -2487 198 2899 2173 -1111 -2926 -1513 1502 2993 820 -2575 -2466 210 2901 2176
3516 2176 -1372 -2749 -1489 1798 2857 938 -2311 -2806 134 2650 2276 -1025 -2854 -1311 1464
3531 1464 2749 625 -2193 -2660 -30 2436 1918 -850 -3081 -1956 1787 2972 839 -2177 -2558 -95
3547 -95 2402 2039 -666 -2748 -1618 1925 2964 848 -2023 -2662 -94 2618 2259 -632 -2491 -1377
3563 -1377 1463 2766 860 -2081 -2542 -193 2546 2181 -596 -2795 -1760 1611 2715 884 -1882
3578 -1882 -2427 -94 2316 2372 -461 -3011 -1468 1286 2697 714 -1614 -2388 -36 2209 2229 -294
$$ packed form
3468b450n6K910K199m83l229j804J745L078P68k029l396J87K901K769j303k931
3484a124j996K103K843J127k386l087p8K784K641o29l429j770J475L591R70k517
3500E18k937o8K685K701p26l284j815J413L015J491k173l395J09K676K691p25
3516B176l548j377J260L287J059j919l249m95K940K516l74l301j829J543K775
3531A464J285k124k818m67K630K466n18k768k231J125L743J185k133l016l81K463
3547i5K497l63k705k082J130L543J039k116k871o39K568K712l59k891j859J114
3563a377K840J303j906k941m61K349K739l65k777k199J035L371J104j831k766
3578a882n45K333K410N6k833k550J543K754J411j983k328p74K352K245K0k523
$$ plain form
3594 -294 -2883 -1599 1184 2474 1288 -1856 -2479 -51 2434 1845 -622 -2618 -1811 1259 2800 927
3610 927 -2231 -2430 -294 2045 2409 -115 -2408 -1739 1065 2551 901 -1839 -2487 -437 2162 2270
3626 2270 -326 -2416 -1826 804 2510 1120 -1838 -2317 -575 1904 2139 -471 -2263 -1680 832 2200
3642 2200 1310 -1789 -2456 -562 2250 1835 -483 -2265 -1696 796 2600 1260 -1625 -2282 -194 2120
3658 2120 2197 -268 -2155 -1623 886 2532 1236 -1502 -2305 -540 1953 2047 -295 -2605 -1547 1085
3674 1085 2500 1280 -1214 -2488 -864 1967 2303 -347 -2173 -1878 610 2344 1141 -1278 -2480
3689 -2480 -810 1775 2131 36 -2195 -1673 557 2284 1239 -1373 -2430 -622 1717 2276 115 -2299
3705 -2299 -1532 448 2361 1183 -1459 -2582 -790 1691 2308 141 -2299 -2039 522 2434 1296 -1122
$$ packed form
3594b94k589J284K783J290j186l144o23K428K485n89k467j996Q07L070J541j873
3610I27l158j99K136K339L64k524k293O69K804J486j650k740o48K050K599J08
3626B270k596k090N90K630J706j390k958m79J742K479K35k610j792N83K512J368
3642B200q90l099o67J894K812m15k318j782N69K492J804j340k885o57K088K314
3658B120P7k465j887N32K509J646j296k738q03J765K493R4k342k310J058K632
3674A085J415j220k494j274J624K831L36k650j826K95K488J734j203k419j202
3689b480J670K585L56k095k231N22K230J727j045k612j057J808K339N59k161k414
3705b299P67J980J913j178k642j123J792K481O17k167k440K60K561J912j138k418
$$ plain form
3721 -1122 -2435 -810 1817 2220 385 -2086 -1746 421 2415 1918 -1233 -2089 -708 1795 2063 2
3737 2 -2159 -1680 156 2233 1379 -1243 -2165 -1042 1841 2208 -71 -1997 -1837 652 2297 1227 -899
3754 -899 -2419 -1058 1565 2357 477 -1886 -2165 313 2177 1299 -902 -2434 -1076 1428 2090 188
3770 188 -1871 -1678 162 2201 1512 -763 -2305 -768 1563 1976 290 -1863 -1878 434 1988 1429 -468
3787 -468 -2264 -987 1439 2036 348 -2135 -1616 74 1745 1473 -950 -2265 -992 1653 2060 584
3803 584 -1564 -1807 -35 2111 1851 -794 -2058 -874 1401 2287 486 -1750 -1549 210 2004 1661
3819 1661 -695 -2098 -1006 1354 2226 492 -1912 -2037 178 2252 1361 -754 -2130 -1363 1371 2088
3835 2088 611 -1792 -1747 98 1982 1544 -373 -1890 -976 1032 2092 246 -1590 -2126 88 1869
$$ packed form
3721a122j313J625K627M03j835k471L40K167J994m97l151q56J381K503K68k061
3737Bk161M79J836K077q54k622r22J123K883L67k279j926J60K489J645j070k126
3754h99j520J361K623P92j880k363k79K478J864q78k201j532J358K504O62j902
3770A88k059J93J840K039o89k275j542J537K331M13j686k153j5K312J554n59j897
3787d68j796J277K426N97j688k483N19J690J671k72k423j315J273K645M07j476
3803E84k148k43J772K146k60k645j264J184K275Q86j801k236K01J759J794l43
3819A661k356j403J092K360Q72j734k404j25K215K074q91k115j376P67K734P17
3835B088j477k403M5J845J884m38j917j517R14K008J060j846j836n36K214J781
$$ plain form
3851 1869 1624 -986 -2066 -897 928 2138 635 -1265 -1717 -203 1944 1519 -703 -1943 -1197 1247
3867 1247 2025 872 -1301 -1752 -233 1814 1602 -633 -2037 -961 1178 1970 507 -1239 -1855 166
3883 166 1553 1433 -536 -2119 -1218 944 1986 577 -1309 -1896 -588 1595 1783 -558 -2105 -1079
3899 -1079 956 2057 556 -1327 -1728 -594 1642 1567 -350 -1822 -1035 712 2238 564 -1367 -2003
3915 -2003 -230 1364 1572 -243 -1722 -1310 722 2155 404 -1204 -1739 -220 1422 1621 -458 -1824
3931 -1824 -1217 543 2038 539 -1212 -2028 -326 1304 1620 -339 -1740 -1462 775 1673 704 -989
3947 -989 -2116 -353 1783 1615 -514 -1640 -1375 467 1718 1013 -1265 -1675 -260 1622 1386 -7
3963 -7 -1497 -1407 661 1724 945 -899 -1774 -457 1742 1447 -225 -1852 -1373 701 1758 648 -774
$$ packed form
3851A869k45k610j080J169J825J210j503j900m52J514K147m25k222j240P46K444
3867A247P78j153k173m51J519K047k12k235j404J076K139P92j463j746o16K021
3883A66J387j20j969j583R01K162J042j409j886n87J308K183J88k341j547J026
3899a079K035J101j501j883m01J134K236p5j917j472P87J747J526j674j931o36
3915b003J773J594K08j815j479M12K032J433j751j608n35J519J642J99k079j366
3931a824O07J760J495j499j751q16J702J630L16j959j401K78K237Q98r69j693
3947i89j127J763K136j68k129j126K65J842J251p05k278m10J415J882k36j393
3963gj490R0K068J063p79j844q75J317K199k95j672j627M79K074J057j110j422
$$ [...]
8191A30
##END NTUPLES=NMR FID
##END=
