##TITLE=1H_DE-46EA2_D2O
 D2O
 8 sc, 
 22.7.2024
##JCAMPDX= 6.0         $$ Bruker NMR JCAMP-DX V2.0
##DATA TYPE= NMR FID
##DATA CLASS= NTUPLES
##ORIGIN= UXNMR, Bruker Analytische Messtechnik GmbH
##OWNER= root
$$ XWIN-NMR		Version 3.5
$$ Mon Jul 22 15:45:30 2024 Russian Standard Time (UT+4h)  she@DPX200
##.OBSERVE FREQUENCY= 200.1308
##.OBSERVE NUCLEUS= ^1H
##.DELAY= (6, 6)
##.ACQUISITION MODE= SIMULTANEOUS
##.ACQUISITION SCHEME= undefined
##.AVERAGES= 8
##.DIGITISER RES= 18
##SPECTROMETER/DATA SYSTEM= spect
##.PULSE SEQUENCE= zg30
##.SOLVENT NAME= DMSO
##.SHIFT REFERENCE= (INTERNAL, DMSO, 0, 15.7039)
##AUDIT TRAIL= $$ (NUMBER, WHEN, WHO, WHERE, WHAT)
$$ ##TITLE= Audit trail, XWIN-NMR		Version 3.5
$$ ##JCAMPDX= 5.01
$$ ##ORIGIN= Bruker BioSpin GmbH
$$ ##OWNER= she
$$ F:/spectra/data/she/nmr/H-F/1/audita.txt
$$ ##AUDIT TRAIL=  $$ (NUMBER, WHEN, WHO, WHERE, WHAT)
(   1,<2024-07-22 15:44:14.04 +0400>,<she>,<DPX200>,
      <created by zg, POWCHK disabled, PULCHK disabled
       configuration hash MD5:
       00 E9 B6 7A A2 85 ED C7 34 08 36 98 17 FE 4E 26
       data hash MD5: 16K
       77 76 92 1F 66 E4 87 84 F2 C7 07 1C 05 50 97 CA>)
$$ ##END=
$$ 
$$ hash MD5
$$ 90 D5 E6 A2 2F 71 89 16 0C F4 7B 58 B8 93 4A 61
##$RELAX= 
##$RELAX= 
##$RELAX= 
##$RELAX= 
##$RELAX= 
##$RELAX= 
$$ Bruker specific parameters
$$ --------------------------
##$DU= <F:/spectra>
##$EXPNO= 1
##$NAME= <H-F>
##$PROCNO= 1
##$TYPE= <nmr>
##$USER= <she>
##$AMP= (0..31)
100 100 100 100 100 100 100 100 100 100 100 100 100 100 100 100 100 100 
100 100 100 100 100 100 100 100 100 100 100 100 100 100 
##$AQSEQ= 0
##$AQ_mod= 1
##$AUNM= <au_zg>
##$AUTOPOS= <>
##$BF1= 200.13
##$BF2= 200.13
##$BF3= 200.13
##$BF4= 200.13
##$BF5= 200.13
##$BF6= 200.13
##$BF7= 200.13
##$BF8= 200.13
##$BYTORDA= 1
##$CFDGTYP= 0
##$CFRGTYP= 5
##$CHEMSTR= <none>
##$CNST= (0..31)
1 1 145 1 1 1 1 1 1 1 1 1 1 1 1 1 1 1 1 1 1 1 1 1 1 1 1 1 1 1 1 1 
##$CPDPRG= <>
##$CPDPRG1= <>
##$CPDPRG2= <>
##$CPDPRG3= <>
##$CPDPRG4= <mlev>
##$CPDPRG5= <mlev>
##$CPDPRG6= <mlev>
##$CPDPRG7= <mlev>
##$CPDPRG8= <mlev>
##$CPDPRGB= <>
##$CPDPRGT= <>
##$D= (0..31)
0 1.2 0 0 0 0 0 0 0 0.06 0 0.03 0 0 0 0 0.0002 0 0 0 0 0 0 0 0 0 0 0 0 
0 0 0 
##$DATE= 1721648653
##$DBL= (0..7)
120 120 120 120 120 120 120 120 
##$DBP= (0..7)
150 150 150 150 150 150 150 150 
##$DBP07= 0
##$DBPNAM0= <>
##$DBPNAM1= <>
##$DBPNAM2= <>
##$DBPNAM3= <>
##$DBPNAM4= <>
##$DBPNAM5= <>
##$DBPNAM6= <>
##$DBPNAM7= <>
##$DBPOAL= (0..7)
0.5 0.5 0.5 0.5 0.5 0.5 0.5 0.5 
##$DBPOFFS= (0..7)
0 0 0 0 0 0 0 0 
##$DE= 6
##$DECBNUC= <off>
##$DECIM= 24
##$DECNUC= <off>
##$DECSTAT= 4
##$DIGMOD= 1
##$DIGTYP= 9
##$DL= (0..7)
0 120 120 120 120 120 120 120 
##$DP= (0..7)
150 150 150 150 150 150 150 150 
##$DP07= 0
##$DPNAME0= <>
##$DPNAME1= <>
##$DPNAME2= <>
##$DPNAME3= <>
##$DPNAME4= <>
##$DPNAME5= <>
##$DPNAME6= <>
##$DPNAME7= <>
##$DPOAL= (0..7)
0.5 0.5 0.5 0.5 0.5 0.5 0.5 0.5 
##$DPOFFS= (0..7)
0 0 0 0 0 0 0 0 
##$DQDMODE= 0
##$DR= 18
##$DS= 0
##$DSLIST= <SSSSSSSSSSSSSSS>
$$ [...]
##$SUBNAM2= <"">
##$SUBNAM3= <"">
##$SUBNAM4= <"">
##$SUBNAM5= <"">
##$SUBNAM6= <"">
##$SUBNAM7= <"">
##$SUBNAM8= <"">
##$SUBNAM9= <"">
##$SW= 24.0690372696642
##$SWIBOX= (0..15)
0 0 2 0 0 0 0 0 0 0 0 0 0 0 0 0 
##$SW_h= 4816.95568400771
##$TD= 16384
##$TD0= 1
##$TE= 0
##$TE2= 300
##$TE3= 300
##$TEG= 300
##$TL= (0..7)
0 120 120 120 120 120 120 120 
##$TP= (0..7)
150 150 150 150 150 150 150 150 
##$TP07= 0
##$TPNAME0= <>
##$TPNAME1= <>
##$TPNAME2= <>
##$TPNAME3= <>
##$TPNAME4= <>
##$TPNAME5= <>
##$TPNAME6= <>
##$TPNAME7= <>
##$TPOAL= (0..7)
0.5 0.5 0.5 0.5 0.5 0.5 0.5 0.5 
##$TPOFFS= (0..7)
0 0 0 0 0 0 0 0 
##$TUNHIN= 0
##$TUNHOUT= 0
##$TUNXOUT= 0
##$USERA1= <user>
##$USERA2= <user>
##$USERA3= <user>
##$USERA4= <user>
##$USERA5= <user>
##$V9= 5
##$VALIST= <valist>
##$VCLIST= <CCCCCCCCCCCCCCC>
##$VD= 0
##$VDLIST= <DDDDDDDDDDDDDDD>
##$VPLIST= <PPPPPPPPPPPPPPP>
##$VTLIST= <TTTTTTTTTTTTTTT>
##$WBST= 1024
##$WBSW= 4
##$XGAIN= (0..3)
0 0 0 0 
##$XL= 0
##$YL= 0
##$YMAX_a= 119556
##$YMIN_a= -130889
##$ZGOPTNS= <>
##$ZL1= 120
##$ZL2= 120
##$ZL3= 120
##$ZL4= 120
##$ABSF1= 10
##$ABSF2= 0
##$ABSG= 5
##$ABSL= 3
##$ALPHA= 0
##$AQORDER= 0
##$ASSFAC= 0
##$ASSFACI= 0
##$ASSFACX= 0
##$ASSWID= 0
##$AUNMP= <proc_1d>
##$AZFE= 0.1
##$AZFW= 0.1
##$BCFW= 1
##$BC_mod= 2
##$BYTORDP= 1
##$COROFFS= 0
##$CY= 11.3945322036743
##$DATMOD= 1
##$DC= 2
##$DFILT= <>
##$DTYPP= 0
##$F1P= 15.6554695791079
##$F2P= 12.8336369535428
##$FCOR= 0.5
##$FTSIZE= 0
##$FT_mod= 4
##$GAMMA= 1
##$GB= 0.15
##$INTBC= 1
##$INTSCL= 1
##$ISEN= 128
##$LB= 0.24
##$LEV0= 0
##$LPBIN= 0
##$MAXI= 10000
##$MC2= 0
##$MEAN= 0
##$ME_mod= 0
##$MI= 1.114404
##$NCOEF= 0
##$NC_proc= 0
##$NLEV= 6
##$NOISF1= 3.799351
##$NOISF2= 2.8
##$NSP= 1
##$NTH_PI= 0
##$NZP= 0
##$OFFSET= 15.70392
##$PC= 1
##$PHC0= -25646.11
##$PHC1= 17.78749
##$PH_mod= 1
##$PKNL= yes
##$PPARMOD= 0
##$PSCAL= 0
##$PSIGN= 0
##$REVERSE= no
##$SF= 200.130013532006
##$SI= 16384
##$SIGF1= 3
##$SIGF2= 2
##$SINO= 400
##$SIOLD= 16384
##$SREGLST= <1H.CDCl3>
##$SSB= 0
##$STSI= 0
##$STSR= 0
##$SW_p= 3612.71676300578
##$SYMM= 0
##$S_DEV= 0
##$TDeff= 0
##$TDoff= 0
##$TI= <>
##$TILT= no
##$TM1= 0
##$TM2= 0
##$TOPLEV= 0
##$USERP1= <user>
##$USERP2= <user>
##$USERP3= <user>
##$USERP4= <user>
##$USERP5= <user>
##$WDW= 1
##$XDIM= 8192
##$YMAX_p= 0
##$YMIN_p= 0
$$ End of Bruker specific parameters
$$ ---------------------------------
##NTUPLES= NMR FID
##VAR_NAME=  TIME,          FID/REAL,        FID/IMAG
##SYMBOL=    X,             R,               I
##VAR_TYPE=  INDEPENDENT,   DEPENDENT,       DEPENDENT
##VAR_FORM=  AFFN,          ASDF,            ASDF
##VAR_DIM=   8192,          8192,            8192
##UNITS=     SECONDS,       ARBITRARY UNITS, ARBITRARY UNITS
##FACTOR=    0.0002076,     1,               1
##FIRST=     0,             0,               0
##LAST=      1.7004516,     0,               0
##MIN=       0,             -130889,         0
##MAX=       1.7004516,     119556,          0
$$ Real data points
##PAGE= N=1
##DATA TABLE= (X++(R..R)), XYDATA
$$ [...]
$$ plain form
1887 93 -150 -225 108 -125 131 -61 121 -29 5 9 288 160 -92 -17 182 -187 145 121 -140 316 -21 10 -45
1910 -45 -230 65 -66 27 116 37 164 -174 214 137 170 57 4 117 -145 242 187 48 80 -231 -125 -68 -36 183
1934 183 -88 -127 -43 198 149 -53 -125 182 171 -66 358 123 7 -169 -274 -128 -98 -19 17 -46 124 -107 -152
1957 -152 142 -100 44 3 127 -178 33 -21 99 -312 326 156 -143 84 -14 -63 92 -48 -88 161 72 -179
1979 -179 190 -104 46 -188 -52 99 -24 -99 -78 126 115 220 313 312 -317 -24 -35 109 206 -44 4 103 270
2002 270 84 -171 -104 134 16 -315 -51 115 2 -7 -12 -187 15 -97 -82 78 48 3 -149 -116 86 -120 -218
2025 -218 54 189 34 -36 -77 60 21 1 -15 -253 -12 -242 399 -203 -52 55 107 -35 135 -94 -39 51 8
2048 8 -191 3 -164 249 -94 -184 -13 -84 18 -128 -55 -209 -310 380 394 293 118 105 -31 -125 132 140 200 -47
$$ packed form
1887I3k43p5L33k33K56j92J82j50L4MK79j28k52P5J99l69L32k4k61M56l37L1n5
1910d5j85K95j31R3Q9p9J27l38L88p7L3j13n3J13k62L87n5j39L2l11J06N7L2K19
1934A83k71l9Q4K41m9k02p2L07j1k37M24k35j16j76j05J46L0P9L6o3J70k31m5
1957a52K94k42J44m1J24l05K11n4J20m11O38j70k99K27r8m9J55j40m0K49q9k51
1979a79L69k94J50k34J36J51j23p5K1K04j1J05R3jo29K93j1J44R7k50M8R9J67
2002B70j86k55O7K38j18l31K64J66j13rnj75K02j12J5J60l0m5j52L3K02k06r8
2025b18K72J35j55p0m1J37l9k0j6k38K41k30O41o02J51J07N2j42J70k29N5R0m3
2048Hj99J94j67M13l43r0J71p1J02j46P3j54j01O90J4j01j75j3j36r4K57QO0k47
$$ plain form
2072 -47 -33 -286 327 65 -163 -13 -2 -64 181 18 60 -13 132 -93 -187 143 -157 -166 408 82 280 -65 -155
2095 -155 -82 -139 180 172 66 -149 -14 -110 88 -99 4 106 -50 -270 352 -73 206 49 60 66 81 -122 -180
2118 -180 -88 -144 -316 -138 42 -160 -70 39 -45 -71 -19 -197 -128 -19 -10 130 227 -67 -147 9 26 -269 -70 -177
2142 -177 -65 -161 -68 -219 51 -288 -172 -145 1 341 -83 -96 -27 -48 -36 7 -160 -80 -65 253 -65 -231 31
2165 31 -51 24 -112 -81 -211 26 -230 66 205 10 -56 74 165 -84 -179 103 -112 -33 368 253 144 -9 195
2188 195 -70 -3 -130 9 -67 22 -11 118 133 97 60 -104 59 227 -20 9 -183 32 276 124 15 -128 -141
2211 -141 -121 -154 197 217 -9 -79 64 -65 -104 -255 -43 152 -45 143 -419 -194 -58 48 -56 -37 -13 -154
2233 -154 68 65 -129 72 259 -162 233 162 -46 -78 -81 -47 287 2 27 62 -35 192 48 29 -42 261 -243 -287
$$ packed form
2072d7J4k53O13k62k28J50J1o2K45j63M2p3J45k25r4L30l00rN74l26J98l45r0
2095a55P3n7L19qj06k15J35r6J98j87J03J02j56k20O22m25K79j57J1OJ5k03n8
2118a80R2n6j72J78J80k02R0J09q4k6N2j78O9J09RJ40R7k94q0J56J7k95J99j07
2142a77J12r6R3j51K70l39J16K7J46L40m24j3O9k1J2M3j67Q0J5L18l18j66K62
2165C1q2P5j36L1j30K37k56K96J39j95o6J30R1k49r5K82k15P9M01j15j09j53K04
2188A95k65O7j27J39p6Q9l3J29J5l6l7j64J63J68k47K9j92K15K44j52j09j43j3
2211a41K0l3L51K0k26p0J43j29l9j51K12J95j97J88n62K25J36J06j04J9K4j41
2233a54K22lj94K01J87m21L95p1k08l2lL4L34k85K5L5r7K27j44j9p1L03n04m4
$$ plain form
2257 -287 22 7 -63 -201 -81 -87 -287 52 53 119 190 -22 121 -104 200 -176 -181 -205 -54 15 -418 -128 99 63
2281 63 -73 -14 -121 274 144 -38 114 32 -53 -74 261 -34 -190 -14 -98 91 209 142 91 -104 59 334 -14
2304 -14 151 85 190 406 35 20 261 50 -112 -154 148 -145 132 100 19 124 78 224 204 28 -149 -70 -1
2327 -1 -9 288 156 -123 103 -49 -80 151 -252 -30 -196 361 323 -271 254 2 -130 167 42 -172 -108 86
2349 86 -59 137 -185 -46 127 -85 -46 -161 78 52 130 56 -72 22 -15 -9 -34 154 131 327 11 -35 285 -40
2373 -40 -2 -110 189 -92 184 149 122 35 -168 65 -4 -20 167 176 -169 -89 215 210 -54 241 -100 -64 -195 77
2397 77 -20 -338 -33 -71 83 -248 -79 -347 -12 -30 -250 -118 -12 -196 -53 -103 35 -60 110 -8 -121 -91
2419 -91 -24 -148 182 -78 18 274 14 -49 -82 -151 -312 150 339 -6 466 -79 -40 -48 249 236 63 245 227 -172
$$ packed form
2257b87L09j5p0j38J20ok00L39JO6P1k12J43k25L04l76nk4J51O9m33K90K27l6
2281F3j36N9j07L95j30j82J52q2q5k1L35k95j56J76q4J89J18o7n1j95J63K75l48
2304a4J65o6J05K16l71j5K41k11j62m2L02k93K77l2q1J05m6J46k0j76j77P9O9
2327aqK97j32k79K26j52l1K31m03K22j66N57l8n94N25k52j32K97j25k14O4J94
2349H6j45J96l22J39J73k12L9j15K39k6P8p4j28R4l7Ok5J88k3J96l16m6L20l25
2373d0L8j08K99k81K76l5k7q7k03K33o9j6J87Rl45Q0L04nk64K95l41L6j31K72
2397G7r7l18L05l8J54l31J69k68L35j8k20J32J06j84J43n0J38r5J70j18j13L0
2419i1O7j24L30k60R6K56k60o3l3o9j61M62J89l45M72n45L9qK97j3j73J82j8l99
$$ plain form
2443 -172 -94 -63 -109 85 -166 -224 -66 70 -124 6 315 -61 -205 -73 -81 -272 -301 -57 -7 -102 -81 176 -45
2466 -45 222 -96 -160 91 209 -224 -104 107 32 166 150 -116 -38 -190 -79 229 -31 13 -108 143 140 -85 -40
2489 -40 -90 -122 -98 163 132 90 269 -42 -34 66 197 -162 225 59 -121 234 134 -27 -64 168 -280 -95 256
2512 256 -54 233 -159 -213 -31 -39 -21 92 87 -297 245 0 -29 186 84 2 -256 -1 -194 -174 188 20 -191
2535 -191 -166 -15 165 146 -352 -119 -178 -131 -31 -61 103 64 -129 -4 319 119 176 3 -124 70 56 97 -102
2558 -102 74 -8 -6 -30 128 -110 49 -118 -203 -91 84 -374 85 -162 140 182 287 72 210 118 -237 105
2580 105 -92 -5 150 -150 -247 -93 109 -163 -341 179 6 -15 239 -47 -33 209 157 34 358 -154 -176 37
2602 37 31 58 -20 97 -145 -89 51 133 -236 -189 117 122 -43 -90 -198 -81 -338 -80 -118 342 -262 -54 306 -146
$$ packed form
2443a72P8L1m6J94k51n8J58J36j94J30L09l76j44J32qj91k9K44N0r5K1K57k21
2466d5K67l18o4K51J18m33J20K11p5J34j6k66P8j52J11L08k60M4j21K51lk25M5
2489d0n0l2K4K61l1m2J79l11QJ00J31l59L87j66j80L55j00j61l7K32m48J85L51
2512B56l10K87l92n4J82qJ8J13nl84N42k45k9K15j02q2k58K55j93K0L62j68k11
2535a91K5J51J80j9m98K33n9M7J00l0J64l9j93J25L23k00N7j73j27J94j4M1j99
2558a02J76q2Kk4J58k38J59j67q5J12J75m58M59k47L02M2J05k15J38r2l55L42
2580A05j97Q7J55l00r7J54K02k72j78N20j73k1K54k86J4K42n2j23L24n12k2K13
2602C7oK7p8J17k42N6J40Q2l69M7L06Nj65m7j08J17k57K58l8M60o04K08L60m52
$$ plain form
2626 -146 -22 190 237 -79 94 -32 -59 88 128 -31 40 -354 -174 -87 127 2 229 -108 263 98 -46 165
2648 165 54 74 79 -88 212 -238 40 158 49 79 256 231 -142 65 -29 -23 185 -30 -94 39 -51 36 -14 -94
2672 -94 -152 -46 344 -124 56 46 -438 -70 217 -359 115 -163 27 -238 -3 68 -190 111 210 -6 -256 115
2694 115 -89 -32 155 -94 -216 -38 -269 9 -78 -170 -264 -59 41 -186 19 126 347 136 -134 229 -284
2715 -284 41 -46 119 -115 184 195 -111 3 36 89 163 -71 -352 -372 103 -62 128 232 -58 -52 192 79 212
2738 212 -190 37 -100 -153 89 -16 -82 47 -24 213 -44 -34 -7 -94 -50 61 66 5 199 71 68 -417 -90 211
2762 211 -49 10 94 284 -77 -54 -219 -188 62 -212 262 48 -177 -331 206 -134 151 -82 56 0 -48 -48 -67
2785 -67 -45 32 -135 -141 -113 117 -41 160 -2 -199 -131 -1 150 63 -296 91 69 -4 -127 192 36 47 -64 -126
$$ packed form
2626a46J24K12M7l16J73j26k7J47M0j59P1l94J80Q7K14j25K27l37L71j65j44K11
2648A65j11K0Nj67L00m50K78J18j09L0J77k5l73K07r4OK08k15o4J33r0Q7n0q0
2672i4n8J06L90m68J80j0m84L68K87n76M74k78J90k65K35P1k58L01R9k16k50L71
2694A15k04N7J87k49j22J78k31K78q7r2r4K05J00k27K05J07K21k11k70L63n13
2715b84L25q7J65k34K99J1l06J14L3N3P4k34k81k0M75j65J90J04k90OK44j13J33
2738B12m02K27j37n3K42j05o6J29p1K37k57J0K7q7M4J11No1J94j28lm85L27L01
2762B11k60N9Q4J90l61K3j65L1K50k74M74k14k25j54N37l40K85k33J38n6m8%j9
2785f7K2P7j67oK8K30j58K01j62j97O8J30J51q7l59L87k2p3j23L19j56J1j11o2
$$ plain form
2809 -126 315 23 -25 42 -105 -152 134 160 40 166 49 -270 12 18 59 19 202 142 189 119 120 78 -167 -51 -10
2834 -10 113 -53 62 3 250 214 9 291 39 -151 -133 124 -3 -47 -124 90 187 -86 -60 26 -249 97 -136
2857 -136 -16 23 -49 -506 64 0 272 135 245 -91 83 -126 -126 52 -331 -138 -275 -187 78 212 -78 -170
2879 -170 -195 14 178 152 -203 98 -175 42 -2 -88 -210 -287 119 -23 325 221 95 183 147 -45 -123 443 47
2902 47 101 -36 28 -8 61 405 -82 147 -57 -153 3 111 108 149 171 -44 -480 140 405 106 -182 -118 178 119
2926 119 397 378 80 -13 5 11 -122 -124 -320 102 96 4 -176 128 271 91 -311 -40 -82 -1 -78 96 -63 20 -356
2951 -356 -41 -158 108 130 -8 181 102 325 -28 24 -79 140 325 124 -18 -165 -61 50 129 216 -134 -142
2973 -142 -39 140 -358 -97 88 -201 48 288 67 -256 257 -42 108 -142 126 0 117 -141 -310 -135
$$ packed form
2809a26M41k92m8O7j47m7K86K6j20J26j17l19K82OM1m0J83o0M7p0Jm2k45J16M1
2834a0J23j66J15n9K47l6k05K82k52j90J8K57j27m4p7K14R7k73K6Q6k75L46k33
2857a36J20L9p2m57N70o4K72j37J10l36J74k09%J78l83J93j37Q8K65J34k90r2
2879a70k5K09J64k6l55L01k73K17m4q6j22p7M06j42L48j04j26Q8l6j92p8N66l96
2902D7N4j37O4l6O9L44m87K29k04r6J56J08lM1K2k15m36O20K65k99k88O4K96n9
2926A19K78j9k98r3J8Oj33kj96M22or2j80L04J43j80m02K71m2Q1p7J74j59Q3l76
2951c56L15j17K66K2j38J89p9K23l53N2j03K19J85k01j42j47J04J11P9Q7l50q
2973a42J03J79m98K61J85k89K49K40k21l23N13k99J50k50K68j26J17k58j69J75
$$ plain form
2993 -135 -52 98 -22 -96 11 -23 13 229 132 -136 -94 -262 -209 98 -240 -172 303 193 -191 257 19 95 -196
3016 -196 -30 -24 -174 -91 72 -12 -318 327 -75 -173 -118 -210 -71 -169 30 14 14 -52 106 21 -203 349 -98 -249
3040 -249 -124 78 -220 4 -46 -217 168 210 165 205 -66 164 133 115 -89 -14 105 -33 13 -75 -185 46 25
3063 25 -229 -63 -106 -68 -290 -146 155 333 -98 -234 -84 301 25 -17 -117 67 -3 218 -113 -105 43 142 -132
3086 -132 51 42 -85 -157 110 294 180 -375 164 -7 -307 12 -89 -67 -232 -114 -293 -121 -310 -121 -189 -98
3108 -98 -3 -124 -42 179 276 -11 -192 24 -120 111 225 112 -192 -80 -66 -57 144 -67 100 32 -304 -97 -150
3131 -150 24 -60 -110 114 336 48 -49 -241 301 127 -137 124 -66 -29 14 -106 71 -144 -97 225 -127 -164
3153 -164 -6 -142 179 35 16 157 -224 95 14 -75 49 -2 -140 97 -234 186 273 -190 183 -50 -205 -96
$$ packed form
2993a35Q3J50j20p4J07l4L6K16r7k68M2j68N3L07l38O8M75j10l84M48k38P6k91
3016a96J66Oj50Q3J63q4l06O45m02r8N5r2J39r8J99j6%o6J58q5k24N52m47j51
3040b49J25K02k98K24n0j71L85M2m5M0k71K30l1j8k04P5J19j38M6q8j10K31k1
3063B5k54J66m3L8k22J44L01J78m31j36J50L85k76m2j00J84p0K21l31QJ48R9k74
3086a32J83rj27p2K67J84j14n55N39j71l00L19j01K2j65J18j79J72j89J89o8R1
3108i8R5j21Q2K21R7k87j81K16j44K31J14j13l04J12J4RK01k11J67o8l36K07n3
3131a50J74q4n0K24K22k88r7j92N42j74k64K61j90L7M3j20J77k15M7L22l52l7
3153a64J58j36L21j44j9J41l81L19q1q9J24n1j38K37l31M20Q7m63L73k33j55J09
$$ plain form
3175 -96 -128 -95 76 114 -342 -135 187 113 182 7 -15 -166 -54 -34 132 -1 -249 164 371 -9 32 43 39 126
3199 126 220 -265 -74 245 -29 116 155 -217 -207 51 -37 2 26 -113 14 82 -190 91 21 -169 -194 37 208
3222 208 232 -147 74 68 -124 -63 68 237 -132 -81 234 114 -189 412 248 105 150 -4 43 23 37 -193 13
3245 13 61 40 -403 21 237 -104 -44 -84 164 104 323 108 -80 10 -3 16 -255 -104 -336 -162 -7 -231 50
3268 50 -135 185 -91 0 -86 -139 43 90 147 234 19 -134 -102 -82 143 -7 21 -180 315 115 -115 165 80 -69
3292 -69 143 -39 -50 110 322 128 156 -157 44 -318 -129 54 194 -6 -87 128 135 130 -99 -94 -108 103 -26 -197
3316 -197 -28 -147 -146 -7 -183 65 -128 -91 -198 48 -101 -1 9 159 61 77 319 103 -49 135 305 -270
3338 -270 217 63 18 -40 -185 -82 -70 -92 26 -88 -79 21 -28 -264 203 17 -118 -91 -327 281 65 -23 120
$$ packed form
3175i6l2L3J71L8m56K07L22p4O9j75k2j51J12K0J66j33k48M13K07l80M1J1mQ7
3199A26R4m85J91L19k74J45L9l72J0K58q8L9K4j39J27O8k72K81p0j90k5K31J71
3222B08K4l79K21oj92O1J31J69l69N1L15j20l03O01j64j43M5j54M7k0J4k30K06
3245A3M8k1m43M24K16l41O0m0K48o0K19k15j88R0j3J9k71J51k32J74J55k24K81
3268E0j85L20k76R1q6n3J82M7N7Q7k15j53L2K0K25j50K8k01M95k00k30K80q5j49
3292f9K12j82j1J60K12j94K8l13K01l62J89J83J40k00q1K15Pnk29Nj4K11j29j71
3316a97J69j19JJ39j76K48j93L7j07K46j49J00J0J50r8J6K42k16j52J84J70n75
3338b70M87j54m5n8j45J03J2k2J18j14RJ00m9k36M67j86j35K7k36O08k16q8J43
$$ plain form
3361 120 101 -96 -114 27 64 250 -266 -62 81 -148 226 132 72 -189 -116 -102 29 -56 112 21 5 -80 -24 -38
3385 -38 232 -54 -315 176 -37 52 -41 96 41 49 114 -21 31 -16 -77 243 72 -34 -146 -106 104 -43 -67 302
3409 302 -108 64 14 -9 -71 275 284 57 218 -83 -15 -37 362 27 9 -89 51 -187 -162 -95 -6 0 -177 -38 -34
3434 -34 -108 195 55 132 -42 215 10 -304 -275 -316 36 -218 281 -332 -191 212 -112 -143 22 -84 96 45
3456 45 -27 -215 -49 87 152 -204 -147 11 16 -193 72 300 -117 -266 -146 -93 35 82 297 -159 3 419 -126
3479 -126 -113 158 -339 -237 -41 21 24 80 -34 239 50 153 -9 -36 22 148 -151 -113 157 102 402 -181 -59
3502 -59 19 -98 -2 1 1 96 143 115 201 -17 79 103 -114 158 -385 44 -104 128 249 56 -186 251 -7 -71 70
3527 70 21 9 80 -12 -185 193 -29 -45 129 -156 -161 -11 -238 -3 -324 -212 128 60 78 -12 -16 -302 210 -6
$$ packed form
3361A20j9j97j8J41L7J86n16K04J43k29L74r4o0k61P3J4J31q5J68r1j6q5N6j4
3385c8K70k86k61M91k13Q9r3J37n5QO5j35N2m7o1L20j71j06j12M0K10j47k4L69
3409C02m10J72n0k3o2L46Rk27J61l01O8k2L99l35j8r8J40k38K5O7Q9Oj77J39M
3434c4p4L03j40P7j74K57k05l14K9m1L52k54M99o13J41M03l24l1J65j06J80n1
3456D5p2j88J66J36O5l56N7J58Nk09K65K28m17j49J20N3J28M7K15m56J62M16n45
3479a26J3K71m97J02J96O2LN6j14K73j89J03j62k7N8J26k99L8K70n5L00n83J22
3502e9P8j17R6L%R5M7k8Q6k18R6K4k17K72n43M29j48K32J21j93k42M37k58o4J41
3527G0m9j2P1r2j73L78k22j6J74k85nJ50k27K35l21J12L40o8J8r0mk86N12k16
$$ plain form
3551 -6 -6 -12 177 -112 125 -269 -223 117 -95 -55 37 -468 230 194 164 172 33 45 119 165 43 -211 -98 -188 87 -6
3577 -6 285 81 171 -161 -16 -89 -39 -161 65 -30 125 211 -179 27 -74 -204 -134 -15 -240 86 -159 -3 -192
3600 -192 -87 -24 100 -51 139 -108 181 170 -57 -180 -23 142 20 55 257 -99 -214 33 93 2 -71 41
3622 41 25 17 122 146 -97 -40 375 137 -164 164 161 94 -106 109 348 204 -14 -106 8 -190 17 99 -55 -125
3646 -125 -163 -32 -6 -42 -145 -281 31 -177 -4 102 -203 -237 -114 10 -181 -120 -132 90 -220 -100 -209 144
3668 144 169 42 209 -102 -143 -123 -75 404 -57 157 -80 -114 -6 -27 60 231 -265 -106 112 -145 -17 -76 -340
3691 -340 -168 209 -198 61 -15 -27 109 -289 -85 -62 164 231 -197 168 36 80 -1 -43 -232 250 153 -143 -74
3714 -74 78 -64 37 125 39 125 -129 363 110 -11 443 135 -32 -70 -107 -210 93 -386 -4 70 295 175
$$ packed form
3551f%oJ89k89K37l94M6L40k12M0R2n05O98l6l0Qj39J2P4M6j22k54J13r0K75r3
3577fK91k04R0l32J45p3N0j22K26r5J55Q6l90K06j01j30P0J19k25L26k45J56j89
3600a92J05O3J24j51J90k47K89j1k27j23J57J65j22L5K02l56j15K47O0r1p3J12
3622D1j6qJ05K4k43N7M15k38l01L28lo7k00K15K39j44k18r2J14j98K07Q2j54p0
3646a25l8J31K6l6j03j36L12k08J73J06l05l4J23J24j91O1j2K22l10J20j09L53
3668A44K5j27J67l11m1K0M8M79m61K14k37l4J08k1Q7J71m96J59K18k57J28n9k64
3691c40J72L77m07K59p6j2J36l98K04K3K26O7m28L65j32M4q1m2j89M82r7k96O9
3714g4J52j42J01Q8q6Q6k54M92k53j21M54l08j67l8l7j03L03m79L82P4K25j20
$$ plain form
3736 175 240 -85 234 30 -99 135 -393 66 -122 -215 131 -18 -59 -228 -67 184 -58 78 -15 -226 201
3757 201 -184 -69 84 -304 67 -167 -20 -12 -156 17 -177 -19 -52 -310 -126 85 -136 -222 188 -127 132
3778 132 -87 187 -62 -127 30 48 165 194 44 192 -187 25 170 86 222 -310 -310 114 125 -164 -66 -28 -139
3801 -139 -277 27 39 -186 187 249 323 35 121 -138 -125 -143 -363 -22 170 84 -81 -155 -61 212 -188 -281 139
3824 139 -65 -180 -22 -32 -140 -44 21 94 260 7 -51 -74 -229 38 -142 -25 228 23 -363 69 35 117 54
3847 54 100 -131 -105 107 213 122 -111 112 -260 -33 102 -76 254 -7 -376 -109 -16 175 -177 323 156 19
3869 19 81 93 14 -213 228 -2 75 88 -165 46 25 -144 -143 132 -66 -51 -154 123 111 177 -196 -56 -57 -18 98
3894 98 28 -197 117 207 -88 3 12 -10 -23 79 195 228 -15 -147 22 68 274 -46 -57 30 28 2 33 -111 -101 68
$$ packed form
3736A75O5l25L19k04j29K34n28M59j88r3L46j49m1j69J61K51k42J36r3k11M27
3757B01l85J15J53l88L71k34J47Qj44J73j94J58l3k58J84K11k21q6M10l15K59
3778A32k19K74k49o5J57J8J17K9j50J48l79K12J45q4J36n32%M24J1k89R8L8j11
3801a39j38L04J2k25L73O2P4k88Q6k59J3j8k20L41J92q6j65p4R4K73m00r3M20
3824A39k04j15J58j0j08R6O5P3J66k53n8k3j55K67j80J17K53k05l86M32l4Q2o3
3847E4M6k31K6K12J06r1k33K23l72K27J35j78L30k61l69K67R3J91l52N00j67j37
3869A9O2J2p9k27M41k30P7J3k53K11k1j69JK75j98J5j03K77j2O6l73J40jL9J16
3894I8p0k25L14R0k95R1Rk2j3J02J16L3k43j32J69M6K06l20j1Q7kk6L1j44J0J69
$$ plain form
3920 68 73 -281 -27 43 32 58 99 195 -276 11 16 163 -53 205 81 -190 -16 -168 -265 47 -245 -194 245 262
3944 262 -78 243 -5 28 -85 -19 261 104 -108 -166 150 227 116 233 162 -44 129 -84 381 -54 10 95
3966 95 -221 27 -49 140 -96 301 -6 310 -25 6 280 2 -126 -7 178 -215 55 168 -177 62 303
3987 303 37 153 -136 -247 -63 -297 25 -43 182 -110 -83 101 44 -252 -169 -51 -82 7 141 105 116 -105 176
4010 176 122 -97 255 -111 -389 -16 -119 -185 -53 -123 -22 218 145 -291 163 -109 -8 -80 -28 128 -59 -173
4032 -173 97 -308 -32 300 164 -170 157 -138 120 -131 -41 -72 -376 -69 100 119 -8 95 159 -26 101
4053 101 15 -294 151 78 -62 -31 208 0 130 -25 143 -157 -3 238 114 198 89 6 -130 -85 13 248
4075 248 82 -124 19 404 -66 -10 -142 226 -60 13 -38 35 -20 126 -133 -37 39 45 83 -127 115 -26 -10 34
$$ packed form
3920F8Nl54K54P0j1K6M1R6m71K87NJ47k16K58j24k71J74j52r7L12k92N1M39J7
3944B62l40L21k48L3j13O6K80j57k12n8L16P7j11J17p1k06J73k13M65m35O4Q5
3966I5l16K48p6J89k36L97l07L16l35L1K74k78j28J19J85l93K70J13l45K39K41
3987C03k66J16k89j11J84k34L22o8K25k92K7J84n7k96Q3J18l1Q9J34l6J1k21K81
4010A76n4k19L52l66k78L73j03o6J32p0J01K40p3m36M54k72J01p2N2J56j87j14
4032a73K70m05K76L32j36l34L27k95K58k51R0l1l04L07J69J9j27J03O4j85J27
4053A01q6l09M45p3j40L1K39k08J30j55J68l00J54K41j24Q4j09q3j36M5R8K35
4075B48j66k06J43L85m70N6j32L68k86P3n1P3n5J46k59R6P6OL8k10K42j41J6M4
$$ plain form
4099 34 -289 -128 -1 30 34 -182 25 -36 -82 13 5 -155 72 -79 -141 -266 -90 -103 -74 -113 -180 -16 370 -190 -125
4124 -125 -75 78 96 -231 190 -34 432 11 -64 155 -235 -250 -109 -59 178 -314 122 211 -9 -63 -5 -134 -40
4147 -40 -28 7 -313 -166 507 67 263 -35 -42 -253 34 -73 -269 260 51 -155 157 -16 87 -45 132 128
4169 128 -46 264 -93 -222 69 274 176 142 -28 30 -50 96 188 154 -78 43 -220 192 59 265 -35 254
4191 254 252 109 101 -143 -368 100 -136 64 50 -198 60 260 -84 -57 -156 -135 -171 -39 -248 98 99 -244 52 -115
4215 -115 -187 96 93 61 59 -381 -68 -61 43 -14 69 156 -120 201 72 97 154 -43 -280 -101 -136 139 -62 -82 332
4240 332 132 -47 62 124 23 61 -38 -248 -113 123 311 182 77 42 144 -69 -206 -65 -17 -2 -72 -27 -162
4263 -162 -171 -193 -294 65 47 1 -146 -239 -110 -126 95 305 132 -32 50 -34 247 -270 -26 -169 -24 71 227
$$ packed form
4099C4l23J61J27L1Mk16K07o1m6R5qj60K27j51o2j25J76j3K9l9o7J64L86n60O5
4124a25N0J53J8l27M21k24M66m21p5K19l90j5J41N0K37m92M36Q9k20n4N8j29R4
4147d0J2L5l20J47O73m40J96k98pk11K87j07j96N29k09k06L12j73J03j32J77m
4169A28j74L10l57j29K91K05r8l4j70N8q0J46R2l4k32J21k63M12j33K06l00K89
4191B54kj43qk44k25M68k36K00j4k48K58K00l44K7r9K1l6J32k09L46Jl43K96j67
4215a15p2K83ll2km40L13PJ04n7Q3Q7k76L21j29K5N7j97k37J79l5K75k01k0M14
4240C32k00j79J09O2j01L8r9k10J35K36J88j29j05l5J02k13j37J41M8J5p0M5j35
4263a62rk2j01L59j8m6j47r3J29j6K21K10j73j64Q2q4K81n17K44j43J45R5J56
$$ plain form
4286 227 -41 123 -178 44 -64 10 12 169 98 -292 112 26 159 -43 231 -302 -248 -330 -97 311 -252 -198 112
4309 112 271 -141 91 -28 -294 -23 -8 -54 108 100 204 25 125 274 -123 85 -52 -162 -141 44 129 10
4331 10 78 -212 -499 322 80 90 -49 -123 152 191 131 -32 -196 138 117 -73 -76 -265 -218 -235 19 230 44 35
4355 35 6 -198 -72 -95 100 82 203 -67 -43 73 348 -274 -130 -260 130 -12 231 190 7 -314 -87 -79 115
4378 115 110 -167 -40 -185 -109 -170 -188 137 -20 -79 -169 5 72 133 284 -316 -10 96 116 -71 -96 -163 -90 52
4402 52 -22 152 101 111 81 40 -115 165 -138 -9 13 -33 -55 11 46 -25 59 -37 84 -134 -59 -3 151 -15 -114 21
4428 21 -67 -269 136 67 120 -99 248 3 247 79 142 85 -20 -52 81 38 -507 138 -14 142 -52 133 -116
4451 -116 106 100 -6 -346 304 30 -175 232 166 -83 -12 136 -20 -30 -192 -92 44 47 -165 88 410 320 294
$$ packed form
4286B27k68J64l01K22j08P4KJ57p1l90M04q6J33k02K74n33N4q2K33M08n63N4L10
4309A12J59m12K32j19k66K71J5m6J62qJ04j79J00J49l97K08j37j10K1J85Q5j19
4331A0O8k90k87Q21k42J0j39p4K75L9o0j63j64L34k1j90lj89M7j7K54K11j86r
4355C5k9k04J26k3J95j8J21k70K4J16K75o22J44j30L90j42K43m1j83l21K27QJ94
4378A15nk77J27j45P6o1j8L25j57n9r0J74O7O1J51o00L06J06K0j87k5o7P3J42
4402E2p4J74n1J0l0m1j55K80l03J29K2m6k2O6L5p1Q4r6J21k18P5N6J54j66r9J35
4428B1q8k02M05o9N3k19L47k45K44j68O3n7j05l2J33m3n45O45j52J56j94J85k49
4451a16K22oj06l40O50k74k05M07o6k49P1J48j56j0j62J00J36Lk12K53L22r0k6
$$ plain form
4474 294 -242 82 -46 181 -5 10 -126 258 115 134 346 -71 22 237 -311 14 -166 -107 -45 268 13 157
4496 157 -119 233 -103 -150 -37 -101 167 14 -43 -53 130 105 65 50 307 296 374 -40 56 153 96 86 127 -14 -66
4521 -66 88 137 56 -287 304 -78 -215 -143 0 137 14 24 202 17 127 -424 330 57 148 202 -188 291
4543 291 80 -68 218 -19 -71 83 44 -66 157 46 61 1 85 8 -39 -155 374 73 -224 1 108 225
4565 225 -192 -21 -191 -147 241 -9 -52 -61 26 28 -3 -75 2 109 -108 -92 24 -71 -260 -12 94 -84 9 -3 38
4590 38 -64 10 70 45 366 -36 -76 69 164 85 213 -53 -109 82 222 17 10 144 224 -174 -145 -95 61 88 -1
4615 -1 -255 -9 243 -169 7 -198 -213 -72 277 -179 -127 76 33 -97 38 33 162 57 178 164 241 -77 -232
4638 -232 -177 -31 33 121 -91 124 381 -129 -123 160 -15 209 164 -208 -74 2 -34 -194 244 60 145 113 52 143
$$ packed form
4474B94n36L24j28K27j86J5j36L84j43J9K12m17R3K15n48L25j80N9O2L13k55J44
4496A57k76L52l36m7J13o4K68j53n7j0J83k5m0j5K57j1P8m14R6R7n7j0M1j41n2
4521f6J54M9q1l43N91l82j37P2J43J37j23J0J78j85J10n51P54k73R1N4l90M79
4543B91k11j48K86k37n2J54l9j10K23j11J5o0Q4p7m7j16N29l01k97K25J07J17
4565B25m17J71j70M4L88k50m3rQ7Kl1p2P7J07k17J6J16r5j89K48J06j78R3j2M1
4590C8j02P4O0k5L21m02m0J45R5p9J28k66n6J91J40k05pJ34Q0l98K9N0J56K7q9
4615ak54K46K52m12J76k05j5J41L49m56N2K03m3j30J35nJ29j05J21j4P7l18j55
4638b32N5J46O4Q8k12K15K57n10OK83j75K24m5l72J34P6l6j60M38j84Q5l2o1R1
$$ plain form
4662 143 65 159 104 71 -139 203 7 31 206 91 101 21 -117 -139 -6 -75 83 -11 -183 -222 -177 133 -20 206
4686 206 -170 171 141 178 7 104 215 205 72 -150 275 25 51 229 -130 -203 86 197 238 341 91 93 -149
4709 -149 74 64 62 -9 -86 -26 166 109 -101 370 180 94 -288 82 40 91 -134 -178 -88 102 157 440 181 55
4733 55 87 -173 274 -112 142 -61 -8 -37 -81 54 -206 161 -176 -54 -117 99 -179 23 195 42 -47 -8 -67
4756 -67 10 21 -359 130 -82 -276 -174 -31 -67 11 171 -315 13 -63 111 192 155 246 80 -382 307 24 -159
4779 -159 85 103 134 -71 -49 -18 -209 264 -189 227 124 1 56 3 208 -289 11 15 -71 -205 -19 -76 36
4802 36 -75 -187 -87 13 -124 7 106 80 229 33 136 -44 182 119 -40 45 -364 -303 -259 371 -130 -22
4824 -22 104 164 98 71 -212 18 -203 -7 114 42 168 181 -53 130 -98 -138 59 -92 -196 -181 136 -244 -341
$$ packed form
4662A43p8R4n5l3k10L42j96K4J75j15J0q0j38k2J33o9J58r4j72l9M5L10j53K26
4686B06l76L41l0L7j71R7J11j0j33k22M25k50K6J78l59p3K89J11M1J03k50Kk42
4709a49K23j0kp1p7O0J92n7k10M71j90q6l82L70m2N1k25m4R0J90N5K83k59j26
4733E5L2k60M47l86K54k03N3k9m4J35k60L67l37J22o3K16k78K02J72j53q9L9n9
4756f7P7J1l80M89k12j94J02J43l6P8J60m86L28p6J74Q1l7R1j66m62O89k83j83
4779a59K44J8L1k05K2L1j91M73m53M16j03j23N5n3K05m97L00Mq6j34J86n7J12
4802C6j11j12J00J00j37J31R9k6J49j96J03j80K26o3j59Q5m09O1M4O30n01J08
4824b2J26O0o6k7k83K30k21J96J21p2J26J3k34J83k28m0J97j51j04J5L17l80r7
$$ plain form
4847 -341 147 -95 55 -66 44 -142 -128 -98 93 495 73 392 -89 276 -79 -174 -313 73 186 155 32
4868 32 41 168 14 156 207 -150 -2 98 0 95 -68 -189 -334 16 6 85 -21 109 -95 368 -58 -64 -188
4891 -188 107 143 -9 -53 -165 36 33 -32 -70 -119 57 240 386 93 -115 -106 121 349 -103 7 173 62 154
4914 154 246 -3 -24 118 -103 154 -73 -153 -47 -276 -63 4 104 -103 119 -201 -17 -173 -108 85 219 16
4936 16 -59 269 -231 77 26 -7 -152 -148 18 103 305 30 -100 131 37 22 -135 -13 248 37 77 8 -133 59
4960 59 -239 -245 191 156 -124 -9 55 142 -366 42 185 -41 95 147 190 -53 357 4 35 -158 -161 18 -84 303
4984 303 -176 40 263 -88 70 -154 -78 143 -202 -178 183 1 -150 -108 310 352 138 107 -58 -82 10 -72 49
5007 49 -336 -208 153 -257 -303 -223 189 230 -73 108 33 -181 473 33 -131 -302 -232 -447 85 154 -26 283
$$ packed form
4847c41M88k42J50j21J10j86J4L0J91M02m22L19m81L65l55r5j39L86J13l1j23
4868C2RJ27j54J42N1l57J48J00r8R5j63j21j45L50j0P9j06J30k04M63m26oj24
4891a88K95L6j52m4j12K01lo5l8m9J76J83J46k93k08RK27K28m52J10J66j11R2
4914A54R2k49k1J42k21K57k27q0J06k29K13O7J00k07K22l20J84j56O5J93J34k03
4936A6p5L28n00L08n1l3j45MJ66Q5K02k75j30K31r4j5j57J22K61k11M0o9j41J92
4960E9k98oM36l5k80J15O4Q7n08M08J43k26J36N2M3k43M10l53L1j93lJ79j02L87
4984C03m79K16K23l51J58k24P6K21l45K4L61j82j51M2M18M2k14l1j65k4R2q2J21
5007D9l85J28L61m10m6Q0M12M1l03J81p5k14O54m40j64j71P0k15N32O9j80L09
$$ plain form
5029 283 68 -226 234 185 -22 124 11 -109 220 -127 184 154 111 231 -365 41 -46 -72 -202 67 -101 44
5051 44 -85 -122 5 -126 43 -76 -84 13 105 -136 -216 -147 -31 173 163 -33 174 -102 -129 71 190 -180 238
5074 238 -52 62 126 -205 20 67 -24 -211 102 44 -3 90 -218 -168 306 115 -17 216 66 -16 -263 -69 -10
5097 -10 135 -141 -245 9 49 160 -71 -191 157 85 20 46 -183 -88 253 131 -24 25 -60 -14 191 -84 -208
5120 -208 -6 -72 -17 225 351 -95 -85 357 -145 332 275 117 12 -59 -80 -166 163 23 -206 -162 -67 -300 -20
5143 -20 218 206 -67 185 -203 -256 -56 -9 183 243 34 348 -9 133 -139 252 -130 -86 179 -463 -120 214
5165 214 -123 -106 -12 377 -84 47 122 118 -137 -76 -142 88 -2 -37 119 -178 51 -40 34 -30 -20 -94 93 -355 -30
5190 -30 47 -42 -66 -15 -7 146 90 119 41 -172 -51 -230 -58 6 -10 -20 -36 -58 -196 169 -137 -87 353 -121 326
$$ packed form
5029B83k15k94M60m9k07J46j13j20L29l47L11l0m3J20n96M06q7k6j30K69j68J45
5051D4j29l7J27j31J69j19qR7R2k41q0O9J16K04j0j96K07k76k7K00J19l70M18
5074B38k90J14O4l31K25M7r1j87L13n8m7R3l08N0M74j91j32K33j50q2k47J94N9
5097a0J45k76j04K54M0J11k31j20L48p2o5K6k29R5L41j22j55M9q5M6K05k75j24
5120b08K02o6N5K42J26m46J0M42n02M77n7j58j05p1k1q6L29j40k29M4R5k33K80
5143b0K38j2k73K52l88n3K00M7J92O0k09L14l57J42k72L91l82M4K65o42L43L34
5165B14l37J7R4L89m61J31P5mk55O1o6K30r0l5J56k97K29r1P4o4J0p4J87m48L25
5190c0P7q9k4N1QJ53n6K9p8k13J21j79J72O4j6j0j6k2j38L65l06N0M40m74M47
$$ plain form
5215 326 67 22 -103 -137 86 -28 41 -54 -168 -190 171 -260 95 -15 101 34 85 105 -6 23 -64 27 -41 112
5239 112 258 -171 5 439 77 79 -144 -127 -169 -1 17 -108 9 -145 -97 -35 96 -25 -207 -89 121 -135
5261 -135 39 29 -9 -32 135 51 227 -12 -141 70 5 89 41 -196 -15 -220 82 -48 -81 -231 -47 80 -125
5284 -125 -45 27 -313 -355 -43 211 73 284 -50 39 -132 -589 -228 250 -76 -241 -332 -47 113 -124 96 -4
5306 -4 -304 18 57 -129 73 30 -141 -48 15 -137 153 93 -143 53 -170 -75 140 -63 -111 -77 287 -56 129
5329 129 57 -62 -300 39 294 122 -1 -7 -21 15 232 25 121 38 -160 -154 -56 112 -358 -18 -93 42 -100 -113
5353 -113 -56 -26 -253 89 73 -110 -286 -344 4 197 -387 127 199 89 104 233 -77 -101 92 117 208 21 74
5376 74 -447 132 -16 11 115 35 40 -277 -139 -13 -18 -15 94 -27 -175 216 -34 -146 26 -8 2 -150 -191 -153
$$ packed form
5215C26k59m5j25l4K23j14O9r5j14k2L61m31L55j10J16o7N1K0j11K9q7R1o8J53
5239A12J46m29J76M34l62Kk23J7m2J68J8j25J17j54M8O2J31j21j82J18K10k56
5261a35J74j0l8k3J67q4J76k39j29K11o5Q4m8k37J81k05L02j30l3j50J84J27k05
5284a25Q0P2l40m2L12K54j38K11l34Q9j71m57L61M78l26j65r1K85J60k37K20j00
5306dl00L22L9j86K02m3j71R3O3j52K90o0k36J96k23R5K15k03m8L4L64l43J85
5329A29p2j19k38L39K55j72j23oj4L6K17k07R6q3j98OR8J68m70L40p5J35j42j3
5353a13N7L0k27L42j6j83j76n8L48J93n84N14P2j10J5J29l10k4J93K5R1j87N3
5376G4n21N79j48K7J04q0Nl17J38J26nLJ09j21j48L91k50j12J72l4J0j52m1L8
$$ plain form
5400 -153 25 148 -22 2 -207 -82 -69 122 -213 -39 45 -3 -226 51 -232 67 -7 -35 41 -156 94 59 134
5423 134 261 -72 -131 267 -98 -193 -80 -15 111 66 39 -7 51 304 -214 59 -279 -571 33 -212 234 173 32
5446 32 -422 -355 -6 19 221 -79 -50 -205 112 0 127 143 -123 105 127 -65 -6 -475 208 197 27 -102 -15
5469 -15 475 -38 -149 49 32 -142 201 -158 -26 107 74 247 -82 31 -229 605 -181 -226 -38 -193 -42
5490 -42 128 24 165 13 181 145 97 6 -148 -32 68 -90 -267 388 111 -133 -126 -291 -262 173 47 138 14
5513 14 -37 121 97 297 -13 -153 -282 -30 -77 -12 124 -114 -93 116 -122 475 -182 -205 67 243 -28 8 -248
5536 -248 151 216 -47 219 50 157 236 -53 0 70 98 -20 202 -26 55 280 -40 47 -111 115 156 65 74 6
5560 6 -136 116 239 -140 -85 78 -19 -164 107 -4 102 -48 -69 -249 -113 -82 -41 50 233 141 131 -137 -163 9
$$ packed form
5400a53J78J23j70K4k09J25J3J91l35J74Q4m8k23K77k83K99p4k8P6j97K50l5P5
5423A34J27l33n9L98l65r5J13O5J26m5k7m6N8K53n18K73l38k92O04k45M46o1j41
5446C2m54O7L49K5K02l00K9j55L17j12J27J6k66K28K2j92N9m69O83j1j70j29Q7
5469a5M90n13j11J98j7j74L43l59J32J33l3J73l29J13k60Q34p86m5J88j55J51
5490d2J70j04J41j52J68l6m8r1j54J16J00j58j77O55k77k44Pj65K9M35j26R1j24
5513A4n1J58k4K00l10j40j29K52m7O5J36k38K1K09k38N97o57k3K72J76k71L6k56
5536b48L99O5k63K66j69J07P9k89N3P0K8j18K22k28Q1K25l20Q7j58K26M1r1Ro8
5560Fj42K52J23l79N5J63r7j45K71j11J06j50k1j80J36L1M1R1J83r2j0k68k6J72
$$ plain form
5584 9 -89 134 81 -157 156 -286 212 24 -362 26 -120 -32 -34 61 -126 73 -330 42 -253 224 -74 115 -166
5607 -166 110 -11 118 -87 264 -325 -49 -74 -241 -46 -160 123 28 258 -114 248 153 -69 81 -343 116
5628 116 68 -53 100 -175 174 62 149 -19 140 -56 1 -75 -95 -65 118 25 -106 243 -105 143 -120 148
5650 148 37 -124 -178 -166 295 97 -59 324 99 -265 161 -86 175 -160 -137 166 216 137 56 -117 -75 15 130
5673 130 -89 -275 -54 -64 2 -25 149 57 -149 167 55 269 66 -481 236 165 247 -209 -109 307 245 51
5695 51 -4 98 285 -130 270 232 -139 -49 121 -107 -326 19 104 -139 57 56 -134 -90 -319 -64 -242 101 224
5718 224 -52 24 -166 -191 69 133 66 79 -110 102 148 115 212 -121 -162 -206 15 123 -71 -39 31 -100 176 142
5742 142 -89 223 128 -137 -11 16 -82 -7 -103 184 110 -167 -193 -128 -230 307 -171 100 167 -91 56 -400 -13
$$ packed form
5584Ir8K23n3k38L13m42M98j88l86L88j46Q8kR5j87J99m03L72k95M77k98J89k81
5607a66K76j21J29k05L51n89K76k5j67J95j14K83r5K30l72L62r5k22J50m24M59
5628A16m8j21J53k75L49j12Q7j68J59j96N7p6k0L0J83r3j31L49l48K48k63K68
5650A48j11j61n4J2M61j98j56L83k25l64M26k47K61l35K3L03N0p9q1j73M2R0J15
5673A30k19j86K21j0O6k7J74r2k06L16j12K14k03n47P17p1Q2m56J00M16o2j94
5695E1n5J02J87m15M00l8l71R0J70k28k19L45Q5k43J96jj90M4k29K55j78L43J23
5718B24k76P6j90k5K60O4o7J3j89K12M6l3R7l33m1m4K21J08j94L2P0j31K76l4
5742A42k31L12r5k65J26K7r8P5r6K87p4k77k6O5j02N37m78K71O7k58J47m56L87
$$ plain form
5765 -13 -117 250 -141 75 260 213 36 115 -176 -40 39 -20 140 -113 -176 -67 175 82 39 146 -108 -240 -133
5788 -133 -281 -145 -105 39 27 126 238 -41 -220 -112 11 153 -160 18 -151 -62 34 -141 3 140 -317 -304
5810 -304 156 37 326 289 149 54 227 101 55 -124 -102 181 207 -50 74 48 263 100 -166 -86 -67 -3 134
5833 134 175 -213 -71 -158 155 118 303 78 -7 -233 -115 -266 -82 74 280 18 -227 -15 -102 -138 268 -183
5855 -183 -164 39 -132 -191 -107 -21 -112 13 -106 229 289 160 277 -176 214 16 -91 144 -80 49 137 199 287
5878 287 188 -14 191 -145 -3 -167 56 123 -36 -33 142 -8 47 34 -114 -8 126 -82 -248 106 -245 93
5900 93 -101 93 -130 174 69 -171 74 65 -39 -157 -240 -153 13 196 107 110 201 -126 -189 45 177 -267 -368
5923 -368 -119 49 -5 -94 84 72 162 -293 23 85 -311 214 -47 144 -298 25 -3 -258 -148 165 -172 265
$$ packed form
5765a3j04L67l91K16J85m7j77P9k91J36P9n9J60k53o3J09K42r3m3J07k54j32J07
5788a33j48J36M0J44j2R9J12k79j79J08J23J42l13J78j69Q9R6j75J44J37m57J3
5810c04M60j19K89l7j40r5J73j26m6j79K2K83K6k57J24k6K15j63k66Q0J9O4J37
5833A34M1l88J42q7L13l7J85k25q5k26J18j51J84J56K06k62k45K12q7l6M06m51
5855a83J9K03j71n9Q4Q6r1J25j19L35O0j29J17m53L90j98j07K35k24J29Q8O2Q8
5878B87r9k02K05l36J42j64K23O7j59LJ75j50N5j3j48J06J34k08j66L54l51L38
5900I3j94J94k23L04j05k40K45rj04j18q3Q7J66J83q9LR1l27o3K34J32m44j01
5923c68K49J68n4q9J78j2R0m55L16O2l96N25k61J91m42L23k8k55J10L13l37M37
$$ plain form
5945 265 -78 -215 -92 -27 85 131 -190 53 -53 134 407 206 -219 -220 -220 70 -10 -195 35 171 3 -377
5967 -377 -45 -123 214 -55 259 156 -197 -61 -267 271 120 25 -52 -153 81 211 69 -154 -29 -256 48
5988 48 -145 32 -2 -49 30 -98 -84 -12 -200 -101 -26 -30 246 -16 63 120 -194 -55 -30 154 -78 -1 248 195 -142
6013 -142 -73 9 19 -246 -162 -136 -9 118 105 -296 144 -43 157 61 -175 238 -114 189 -136 308 15 -195
6035 -195 79 -212 -19 13 -125 116 184 -52 -32 177 -264 115 -160 -247 -2 214 60 -131 94 -145 148
6056 148 -82 74 73 -134 -2 104 -237 -308 130 -190 90 -3 44 -295 -184 -56 -148 167 -80 36 -76 98
6078 98 34 -79 250 226 109 114 200 264 -90 54 -102 -17 91 3 323 -114 98 -98 209 153 -21 213 -161
6101 -161 31 -102 18 -223 -17 -80 108 -158 120 106 31 -224 -48 17 58 -50 -184 122 -212 -122 97 28
$$ packed form
5945B65l43j37J23O5J12M6l21K43j06J87K73k01m25j%K90q0j85K30J36j68l80
5967c77L32p8L37k69L14j03l53J36k06N38j51r5p7j01K34J30j42k23J25k27L04
5988D8j93J77l4m7P9j28J4P2j88R9P5mK76k62P9N7l14J39K5J84k32P7K49n3l37
6013a42O9Q2J0k65Q4K6J27J27j3m01M40j87K00r6k36M13l52L03l25M44k93k10
6035a95K74k91J93L2j38K41O8k36K0K09m41L79k75q7K45K16j54j91K25k39K93
6056A48k30J56jk07J32J06l41p1M38l20K80r3M7l39J11J28r2L15k47J16j12J74
6078I8o4j13L29k4j17NQ6O4l54J44j56Q5J08q8L20m37K12j96L07n6j74K34l74
6101a61J92j33J20k41K06o3J88k66K78j4p5k55J76O5M1j08j34L06l34R0K19o9
$$ plain form
6123 28 -54 -152 11 111 -40 35 -12 -63 78 -65 -176 216 103 160 -120 -235 189 -195 67 124 -62 -127 -234
6146 -234 -255 -172 -188 -20 117 100 -133 178 -30 -51 116 -47 -28 85 186 170 218 177 -155 -5 -258 228 67
6169 67 -339 -3 71 -13 132 20 200 185 -187 7 -37 -83 86 87 32 122 95 207 -51 -26 -232 -282 85 18 -157
6194 -157 283 -71 0 -61 68 -80 271 24 -6 72 -112 42 39 122 10 -177 319 81 162 168 -80 183 180 74
6218 74 -295 70 -55 -123 6 9 -107 107 2 64 63 -52 23 156 347 -126 -28 -256 -72 -66 -212 -53 63 -69
6242 -69 -112 9 437 -271 62 -99 117 -122 -360 242 88 153 66 161 -183 66 -159 -280 -44 164 6 -81
6264 -81 181 -399 97 -311 -24 49 127 308 35 -145 -136 51 -60 233 248 205 -71 90 54 -125 -167 3 -111
6287 -111 -106 -153 -16 48 267 306 -91 -185 128 41 -89 97 -86 176 404 -182 -86 -34 42 -149 17 -105 172
$$ packed form
6123B8q2r8J63J00j51P5m7n1J41j43j11L92j13N7k80j15M24l84K62N7j86o5j07
6146b34k1Q3j6J68J37j7k33L11k08k1J67j63J9J13J01j6M8m1l32J50k53M86j61
6169F7m06L36P4q4J45j12J80j5l72J94m4m6J69Jn5R0k7J12k58K5k06n0L67o7j75
6194a57M40l54P1o1J29j48L51k47l0P8j84J54lQ3j12j87M96k38Q1Ok48K63lj06
6218G4l69L65j25o8J29Lj16K14j05O2jj15P5J33J91m73R8k28J84Oj46J59J16j32
6242f9m3J21M28p08L33j61K16k39k38O02j54O5q7R5l44K49k25j21K36K08j58q7
6264h1K62n80M96m08K87P3P8J81k73j80RJ87j11K93J5m3k76J61l6j79m2J70j14
6287a11Nm7J37O4K19L9l97r4L13q7j30J86j83K62K28n86R6N2P6j91J66j22K77
$$ plain form
6310 172 142 163 -35 10 74 -106 16 119 129 -208 189 -75 -15 135 -115 62 -54 -116 -134 -172 -175 94 -57 -229
6334 -229 -205 55 281 275 -90 112 -64 281 -156 196 -202 -199 -46 107 -258 -41 -69 74 -230 87 110 -179
6356 -179 63 -154 -68 -88 68 68 49 97 201 90 -183 -100 -288 -127 -296 -136 -163 -130 209 11 116 -33 141
6379 141 -221 40 -36 123 -248 162 242 -204 125 -54 277 14 -34 33 284 -7 -165 97 -108 -237 7
6400 7 78 -42 -152 6 39 -221 7 -59 13 34 90 -52 -40 -219 -184 -157 175 78 -145 2 298 101 -72 -345
6424 -345 127 -41 -99 59 162 121 -152 201 -181 267 10 155 -71 18 -352 42 87 -186 82 17 9 -41 -162
6447 -162 -147 -32 -63 227 177 -40 -64 -213 218 26 -105 -197 29 -6 124 116 -188 20 95 -366 74 176 -362
6470 -362 190 -40 -95 -185 -115 -137 333 56 121 -209 -62 104 268 142 54 -49 -56 230 -44 52 -106 -138 182
$$ packed form
6310A72l0K1j98M5O4j80J22J03J0l37L97k64O0J50k50J77j16o2j8l8lK69j51j72
6334b29K4K60K26ol65K02j76L45m37L52l98LJ53J53l65K17k8J43l04L17K3k89
6356a79K42k17Q6k0J56%j9M8J04j11k73Q3j88J61j69J60k7L3L39j98J05j49J74
6379A41l62K61p6J59l71M10Q0m46L29j79L31k63m8O7K51k91j58K62k05j29K44
6400GP1j20j10J58L3k60K28o6P2K1N6j42J2j79L5K7L32r7k23J47K96j97j73k73
6424c45M72j68n8J58J03m1k73L53l82M48k57J45k26Q9l70L94M5k73K68o5qn0j21
6447a62J5J15l1K90n0k17k4j49M31j92j31r2K26l5J30ql04K08P5m61M40J02n38
6470c62N52k30n5r0P0k2M70k77O5l30J47J66J64j26q8j03pK86k74R6j58l2L20
$$ plain form
6493 182 -167 -238 14 -70 57 117 -90 142 126 -388 -93 -29 156 111 -80 -306 -9 232 -22 208 -322 28
6515 28 157 -112 74 157 -119 -291 266 -205 -1 -181 -7 46 35 158 -189 -205 24 -147 -69 73 104 -227
6537 -227 -18 199 -36 27 351 -241 -226 -92 -186 122 -128 117 121 -7 -231 -250 -72 143 27 40 192 239 -69
6560 -69 219 130 79 253 -108 -146 77 -21 -42 -231 -309 11 -150 -217 -143 -145 -259 319 185 -79 80 -202 209 -141
6584 -141 -92 166 159 -134 -164 -82 50 210 75 -233 224 247 -143 -78 -49 274 77 264 -125 155 -187 -24 -292
6607 -292 211 230 207 180 257 52 110 -90 98 -52 36 -92 284 31 -118 25 -128 50 -382 13 -5 228
6629 228 -239 -27 81 -48 -127 -196 -36 230 268 -7 -183 36 87 104 151 25 -224 208 -30 -126 114 -54
6651 -54 121 -29 252 -67 -117 122 306 -383 212 112 83 104 189 -135 131 -32 -29 -149 -88 -230 130 -6 366
$$ packed form
6493A82l49p1K52q4J27O0k07K32j6n14K95O4J85m5j91k26K97K41k54K30n30L50
6515B8J29k69J86Q3k76j72N57m71K04j80J74N3j1J23l47j6K29j71P8J42L1l31
6537b27K09K17k35O3L24n92J5J34r4L08k50K45Mj28k24j9J78K15j16J3J52M7l08
6560f9K88q9n1J74l61l8K23r8k1j89p8L20j61o7P4kj14N78j34k64J59k82M11l50
6584a41M9K58pk93l0Q2J32J60j35l08M57K3l90O5K9L23j97J87l89K80l42J63k68
6607b92N03J9k3k7P7k05N8k00J88j50Q8j28L76k53j49J43j53J78m32L95j8K33
6629B28m67K12J08j29p9o9J60K66L8k75j76K19N1J7M7j26k49M32k38r6K40j68
6651e4J75j50K81l19n0K39J84o89N95j00k9K1Q5l24K66j63Lj20O1j42L60j36L72
$$ plain form
6674 366 44 44 -187 230 90 -73 -168 31 1 -64 -135 111 -112 161 209 -8 18 174 263 54 -80 33 -128
6697 -128 -109 151 93 45 -140 230 -381 13 -247 18 234 12 577 87 -107 7 161 -160 525 -4 -168
6718 -168 80 -141 -138 17 -78 132 -328 -95 337 -4 376 156 174 29 -123 120 87 17 99 -37 133 108 -123
6741 -123 -58 -318 -139 -68 70 77 129 -30 -75 69 148 -77 -113 -115 359 -56 -172 -120 -202 136 237 -106 -185 124
6765 124 -29 -220 79 -148 -239 238 218 -300 42 -88 62 -139 36 -43 25 -61 -122 20 -9 -67 -164 -95 -66 160
6789 160 146 129 107 326 -108 -92 -67 -139 -116 -151 26 -30 -109 -71 133 160 82 24 -229 8 -492 200 215 0 -168
6814 -168 41 -77 187 332 275 180 76 49 -26 43 -53 173 -155 -93 -232 -197 86 142 138 -41 170 -71 -282 -19
6838 -19 173 -172 -164 -67 -224 47 78 63 -239 51 -292 -143 -80 -4 -127 236 265 70 83 106 -172 97 98 94 -167
$$ packed form
6674C66l22%k31M17j40j63r5J99l0o5p1K46k23K73M8k17K6J56Q9k09j34J13j61
6697a28J9K60n8m8j85L70o11L94k60K65K16k22N65m90j94J14J54l21O85n29j64
6718a68K48k21LJ55r5K10m60K33M32l41L80k20J8j45j52K43l3p0Q2j36J70k5k31
6741a23O5k60J79P1J38PN2j59m5J44P9k25l6kM74m15j16N2q2L38J01l43p9L09
6765A24j53j91K99k27r1M77k0n18L42j30J50k01J75p9O8q6o1J42k9n8r7O9K9K26
6789A60j4j7k2K19m34J6K5p2K3l5J77n6p9L8K04K7p8n8k53K37n00O92J5k15j68
6814a68K09j18K64J45n7r5j04k7p5O9r6K26l28O2j39L5K83N6mj79K11k41k11K63
6838a9J92l45QR7j57K71L1j5l02K90l43J49O3P6j23L63K9j95J3K3k78K69Jmk61
$$ plain form
6863 -167 -14 -29 33 -42 194 5 -13 -31 -18 -297 -21 -44 -13 158 116 -73 -343 334 -131 136 65 118 40 -118
6887 -118 -252 -429 -179 71 -219 298 28 -24 40 -15 291 216 -29 -156 -436 47 176 210 245 -108 87 100
6909 100 66 -154 -202 293 -90 19 198 16 -24 135 160 7 -27 14 191 -146 69 -75 -121 43 -154 -5
6931 -5 -21 73 35 10 -13 -75 62 -137 95 177 126 -146 -204 -118 -132 -262 -52 -74 -46 47 -86 -78 -132 90 -28 -243
6957 -243 -314 -11 139 8 18 -97 -60 84 136 -119 126 -103 153 42 -93 -20 11 -38 -147 155 -23 145
6979 145 -231 -66 34 -170 136 54 151 -174 -46 -66 139 166 107 -122 68 344 104 -41 62 28 -197 -12
7001 -12 172 42 -36 192 -42 -216 -223 79 -219 67 20 16 277 146 -26 36 244 -132 254 46 -100 58 34
7024 34 14 -119 -211 233 -181 -33 89 -240 -83 122 -40 -84 214 -286 -153 99 93 -41 159 -154 -87 100
$$ packed form
6863a67J53j5O2p5K36j89j8j8J3k79K76k3L1J71m2j89k70O77m65K67p1N3p8j58
6887a18j34j77K50K50k90N17k70n2O4n5L06p5k45j27k80M83J29L4L5l53J95J3
6909A00l4k20m8M95l83J09J79j82m0J59K5j53l4M1J77l37K15j44m6J64j97J49
6931ej6R4l8k5k3o2J37j99K32Q2n1k72n8Q6j4j30K10k2K8R3j33Qn4K22j18k15
6957b43p1L03J50j31J0j15L7J44N2k55K45k29K56j11j35P3L1m9j09L02j78J68
6979A45l76J65J00k04L06q2R7l25J28k0K05K7n9k29J90K76k40j45J03l4k25J85
7001a2J84j30p8K28k34j74pL02k98K86m7mK61j31j72O2K08l76L86k08j46J58k4
7024C4k0j33r2M44m14J48J22l29J57K05j62m4K98n00J33K52oj34K00l13O7J87
$$ plain form
7046 100 -281 -200 150 -162 -159 -38 90 -169 -56 120 -133 -140 -211 -72 -107 -257 -189 57 -103 -272 131 215 -15
7069 -15 -139 216 92 54 -24 -109 -311 136 -55 -59 -176 -114 29 133 -105 -336 -110 -320 167 -212 -169 -16 -173
7092 -173 170 6 182 29 43 130 66 160 -52 -163 97 97 80 117 149 -116 -271 -284 43 88 -2 150 -150 -168
7116 -168 -31 75 -75 133 -128 -378 -36 275 24 -110 25 25 17 146 23 -14 -265 -58 -25 -146 -71 -29 -145
7139 -145 -43 -14 243 -41 130 122 -190 -147 54 -92 -24 57 -173 -9 -11 82 -11 154 -124 42 -58 15 219 74
7163 74 -36 53 168 -155 -13 -90 -235 25 124 -199 -140 -208 119 -186 -194 -130 -215 -93 31 -107 -50 -181 -343 128
7187 128 207 -8 25 61 210 -23 173 -97 28 306 120 -91 -86 148 -161 -68 119 293 48 -167 -60 -392
7209 -392 -18 -1 -39 -287 38 343 147 -97 357 -51 -103 -65 69 112 327 -65 331 -203 11 -75 -205 266
$$ packed form
7046A00l81Q1L50l12LJ21J28k59J13J76k53pp1J39l5j50O8K46j60j69M03Q4k30
7069a5j24L55j24l8p8q5k02M47j91mj17O2J43J04k38k31K26k10M87l79M3J53j57
7092a73L43j64J76j53J4Q7o4R4k12j11K60%j7L7L2k65j55j3L27M5r0J52l00j8
7116a68J37J06j50K08k61k50L42L11k51j34J35%qJ29j23l7k51K07L3j21P5M2j16
7139a45J02K9K57k84J71ql12M3K01j46O8Q1k30J64kR3r3J65k78J66j00P3K04j45
7163G4j10Q9J15l23J42p7j45K60R9l23N9o8L27l05qO4q5J22J24j38N7j31j62M71
7187A28P9k15L3L6J49k33J96k70J25K78j86k11NK34l09R3J87J74k45k15J07l32
7209c92L74J7l8k48L25L05j96k44M54m08n2L8J34M3K15l92L96n34K14q6j30M71
$$ plain form
7231 266 178 150 350 75 -25 44 -80 -155 -106 -16 -35 207 -151 -60 94 -225 -95 -35 -165 -128 -83 159 -8 88
7255 88 344 112 -114 202 -17 188 152 29 78 164 210 10 -62 -81 166 163 89 17 8 34 58 -104 84 62 108 317
7281 317 286 179 -271 -182 -156 -222 228 255 92 104 -170 -109 100 -10 -57 54 -190 -99 88 -80 -143 -1 -281
7304 -281 373 -16 40 -36 -9 -60 -296 -63 -27 -71 -4 78 -120 -85 170 -162 -460 37 61 7 95 168 182 -143 -130
7329 -130 273 44 -192 107 213 218 380 73 143 -20 229 -49 -78 -182 225 322 -141 -301 358 8 -34 192
7351 192 147 -189 -191 -1 131 65 -82 20 -15 204 -68 9 159 -226 -184 -150 97 477 -472 -138 -193 52 189
7374 189 71 327 17 45 6 -155 161 -149 137 156 215 -58 196 -107 290 237 -90 -44 -12 391 -23 -177
7396 -177 115 -24 13 -21 -267 -137 -192 -85 -33 -186 247 273 197 -39 -89 55 -291 34 -63 -75 249 -127 -166
$$ packed form
7231B66q8k8K00k75j00O9j24p5M9R0j9K42l58R1J54l19J30O0j30L7M5K42j67R6
7255H8K56k32k26L16k19K05l6j23M9Q6M6k00p2j9K47lp4p2rK6K4j62J88k2M6K09
7281C17l1j07m50Q9K6o6M50K7j63J2k74O1K09j10m7J11k44R1J87j68o3J42k80
7304b81O54l89N6p6K7n1k36K33L6m4O7Q2j98L5K55l32k98M97K4n4Q8P3J4l25J3
7329a30M03k29k36K99J06NJ62l07P0j63K49k78k9j04M07R7m63j60O59l50m2K26
7351A92m5l36kJ90J32o6j47J02l5K19k72P7J50l85M2L4K47L80r49L34n5K45J37
7374A89j18K56l10K8l9j61L16l10K86J9N9k73K54l03L97n3l27M6L2M03m14j54
7396a77K92j39L7l4k46J30n5J07N2j53M33K6p6k36n0J44l46L25r7j2L24l76l9
$$ plain form
7419 -166 -124 -131 115 -108 -50 -171 -78 26 102 179 47 176 -3 27 85 48 -114 -283 43 97 -26 216 -433 -39
7443 -39 184 -64 58 48 253 401 -228 58 218 172 -186 -70 242 4 53 6 32 65 98 0 26 37 -244 27
7467 27 54 -25 95 -242 -303 -50 172 50 -25 -47 33 -160 -42 -87 33 -140 111 -20 247 -262 372 175 -73
7490 -73 149 -26 2 224 -77 -18 -134 -201 232 96 118 -188 20 65 74 113 99 -134 103 84 -174 30 -59 3
7514 3 16 -134 30 -252 -58 -43 -63 125 324 32 191 -101 -97 212 -121 135 -274 56 -152 14 65 126 195
7537 195 -71 133 -18 -37 -19 -64 -266 69 57 -144 367 -36 -80 236 131 30 -131 137 81 5 -238 -37
7559 -37 74 -200 -246 -127 213 -68 -20 -39 145 30 -14 -10 -4 311 -51 83 106 60 -94 29 -110 123 -33 11
7583 11 -204 -144 -176 -130 -228 -52 -135 167 57 -115 -69 89 5 -95 -19 71 -74 -51 -91 -171 251 -185 170 110 -128
$$ packed form
7419a66M2pK46k23N8j21R3J04P6P7j32J29j79L0N8l7j62j69L26N4j23K42o49L94
7443c9K23k48J22j0K05J48o29K86J60m6l58J16L12k38M9m7K6L3L3r8K6J1k81K71
7467B7K7p9J20l37o1K53K22j22p5k2Q0j93J18m5J20j73K51j31K67n09O34j97k48
7490g3K22j75K8K22l01N9j16o7M33j36K2l06K08M5RL9j4k33K37j9k58K04q9O2
7514CJ3j50J64k82J94J5k0J88J99k92J59k92ML09l33K56m09L30k08J66N1O1O9
7537A95k66K04j51j9J8m5k02L35j2k01N11m03m4L16j05j01j61K68n6p6k43K01
7559c7J11k74m6J19L40k81M8j9J84j15m4MOL15l62J34K3m6j54J23j39K33j56M4
7583A1k15O0l2M6r8J76q3L02j10j72M6J58q4j00P6R0j45K3m0q0M22m36L55o0k38
$$ plain form
7608 -128 39 120 91 43 -168 -19 -66 -529 223 -189 199 113 262 413 470 9 -73 209 69 52 -125 60 -85
7631 -85 102 -79 90 -238 -41 -366 -104 -149 -25 69 7 127 157 -74 -111 -108 296 303 -133 -66 42 94 205 120
7655 120 -93 153 57 -216 -64 -133 -16 231 -209 -141 -173 -254 78 59 -53 -164 4 186 175 149 60 194 18
7678 18 30 -67 -4 -131 -91 149 0 208 310 -39 178 68 55 -114 -170 1 24 -113 41 54 -109 196 -50
7701 -50 -302 42 -112 -131 -72 -137 112 -341 2 -60 105 116 -452 -196 -136 -143 -14 446 29 29 -171 -67 -117 228
7725 228 -144 -268 185 -174 -55 -131 62 27 340 131 -286 175 -296 -63 -79 -220 -65 -54 137 35 -265
7746 -265 198 -39 271 -125 240 -56 -200 135 93 -268 201 -180 -6 -7 -46 -169 -65 -72 306 0 -208 123
7768 123 -135 -559 346 41 -21 60 177 -129 149 38 -6 184 -101 -347 -33 -132 2 190 56 -251 34
$$ packed form
7608a28J67Q1k9m8k11J49m7m63P52m12L88q6J49J51N7m61q2K82j40j7j77J85j45
7631h5J87j81J69l28J97l25K62m5J24R4o2J20L0k31l7LM04Pm36O7J08N2J11q5
7655A20k13K46r6k73J52o9J17K47m40O8l2q1L32j9j12j11J68J82j1k6q9J34j76
7678A8J2r7O3j27M0K40j49K08J02l49K17j10j3j69n6J71K3j37J54J3j63L05k46
7701e0k52L44j54j9N9o5K49m53L43o2J65J1n68K56O0pJ29M60m17%k00J04n0L45
7725B28l72j24M53l59J19p6J93l5L13k09m17M61m71K33j6j41J55J1J91j02l00
7746b65M63k37L10l96L65k96j44L35m2l61M69l81J74jl9j23J04pL78l06k08L31
7768A23k58m24R05l05o2Q1J17l06K78j11m4J90k85k46L14r9J34J88j34l07K85
$$ plain form
7789 34 -151 -33 235 194 66 147 195 -63 52 12 227 -37 -165 -187 -144 138 68 27 73 -56 -86 -8 -57 -36 -82
7814 -82 -134 134 54 -87 -269 320 180 295 -147 -82 283 216 -188 244 -128 272 -446 201 340 381 270 -158
7836 -158 60 358 247 -66 -126 272 130 -51 -239 -48 20 125 31 -1 180 -4 99 -57 200 -143 57
7857 57 -258 227 92 209 99 -69 37 208 60 163 -149 -115 -194 -20 -62 -158 79 -147 61 -145 -141 -60 -159
7880 -159 -251 -22 106 532 -226 143 65 -5 190 -409 -166 256 88 278 190 24 86 -265 245 47 -141 66
7902 66 51 52 150 -275 -49 -50 -9 158 269 -45 39 20 -54 -163 -181 123 86 46 94 41 53 78 -304 174 -31 174
7928 174 34 -91 137 157 60 227 253 -30 322 385 1 -139 479 102 39 28 -58 -4 247 101 -18 399 143
7951 143 -111 -144 -68 -199 -330 104 97 -132 -190 -218 4 106 59 -62 -144 -52 242 64 -110 -264 -63 0 1 64
$$ packed form
7789C4j85J18K68m1j28Q1M8k58J15m0K15k64j28k2M3K82p0m1M6j29l0P8m9K1m6
7814h2n2K68q0j41j82N89j40J15m42O5L65o7m04M32l72M00p18O47J39M1j11m28
7836a58K18K98j11l13o0L98j42j81j88J91O8J05r4l2J81j84J03j56K57l43K00
7857E7l15M85j35J17j10j68J06J71j48J03l12L4p9J74m2r6K37k26K08k06MQ1r9
7880a59r2K29J28M26p58L69p8p0J95n99K43M22j68J90q8j66O2l51N10j98j88K07
7902F6j5JR8m25K26jM1J67J11l14Q4j9p4j09j8L04l7m0M8n3J2K5l82M78k05K05
7928A74j40j25K28K0r7J67K6k83L52O3l84j40O18l77o3j1q6N4K51j46j19M17k56
7951A43k54l3P6j31j31M34pk29n8k8K22J02m7j21q2R2K94j78j74j54K01O3JO3
$$ plain form
7975 64 -190 44 213 369 144 -105 -96 -36 -107 -98 -147 -93 -51 72 -340 -28 -118 -13 251 167 188 -165 -62 87
7999 87 102 -148 269 -30 -71 83 138 280 200 47 -40 152 15 212 -182 26 -43 31 -93 -76 -272 258 113
8022 113 -80 -97 37 -27 -77 202 287 3 57 -89 -127 -176 -69 35 -4 -147 -28 33 -292 158 -64 -12 114
8045 114 -161 236 111 68 19 0 28 -285 24 102 -290 -164 101 -63 -248 -165 -13 -144 153 -132 -188 43
8067 43 145 -54 -114 50 -141 -85 -158 79 -42 30 -150 323 83 -96 24 -106 -163 27 -139 100 -95 5
8089 5 -15 4 -96 -18 114 -264 104 -145 35 105 153 26 -302 228 -68 41 98 143 240 -15 -386 -180 -351
8112 -351 -323 -170 73 61 167 41 119 -112 23 86 25 27 -283 143 -112 146 -51 -52 396 6 -10 102 197 -68
8136 -68 -218 -103 155 128 -193 27 18 39 71 -148 -110 -159 -35 -62 -333 8 172 -260 258 -98 -44 216 14
$$ packed form
7975F4k54K34J69J56k25k49RO0p1Rm9N4M2J23m12L12r0J05K64q4K1l53J03J49
7999H7J5k50M17k99m1J54N5J42q0j53q7J92j37J97l94K08o9P4j24J7j96N30j45
8022A13j93j7J34o4n0K79Q5k84N4j46l8m9J07J04l9j43J19O1l25M50k22N2J26
8045A14k75L97j25m3m9j9K8l13L09P8l92J26K65j64j85Q3J52j31K97k85n6K31
8067D3J02j99o0J64j91N6p3K37j21P2j80M73k40j79J20j30n7J90j66K39j95J00
8089Ek0J9j00P8J32l78L68k49J80P0M8j27l28N30k96J09N7M5R7k55l71K06j71
8112c51K8J53K43j2J06j26P8k31J35O3o1Kl10M26k55K58j97jM48l90j6J12R5k65
8136f8j50J15K58k7l21K20rK1L2k19L8m9J24k7k71L41J64m32N18l56N4K60k02
$$ plain form
8159 14 -254 -116 78 184 54 -74 46 139 -160 39 -63 142 -117 196 -119 73 -60 -176 309 -69 149
8180 149 32 156 54 -27 -239 -9 -197 47 -45 137 204
$$ packed form
8159A4k68J38J94J06j30j28J20R3k99J99j02K05k59L13l15J92j33j16M85l78K18
8180A49j17J24j02q1k12K30j88K44r2J82O7
8191B04
$$ Imaginary data points
##PAGE= N=2
##DATA TABLE= (X++(I..I)), XYDATA
$$ plain form
0 0 0 0 0 0 0 0 0 -8 8 -8 8 -8 16 -16 24 -24 32 -40 41 -49 59 -70 80 -94 106 -121 139 -158 178 -202 227
31 227 -256 286 -321 356 -398 443 -492 546 -605 669 -741 820 -910 1007 -1118 1246 -1384
48 -1384 1547 -1739 1962 -2231 2561 -2981 3527 -4279 5381 -7154 10488 -18947 87171 115198
62 115198 -95446 -101361 -19680 72921 93139 1512 -130889 -71392 87206 112373 -7708
73 -7708 -88030 -69083 31331 104180 43581 -89740 -95429 21861 96639 49560 -48853 -93019
85 -93019 -13986 90917 71116 -40817 -88704 -31789 57989 81987 -2090 -92938 -51357 59021
97 59021 80409 5876 -64652 -64285 16883 86220 34690 -67324 -69809 14790 70529 44459 -32743
110 -32743 -74585 -18561 66631 58517 -27521 -70836 -26984 45427 64835 1768 -67049 -43113
$$ packed form
0@%%%%%%%qJ6j6J6j6K4l2M0m8N6p2Q1r0J08j29J50j74K00k27K60k97L36l80M29
31B27m83N42o07O77p54Q41r35J038j151J274j410J561j730J917k125K364k630
48a384K931l286L701m193M792n542O508p806R660j2535J7642k9435J06118K8027
62A15198k10644n915Q1681R2601K0218r1627j32401N9497J58598K5167j20081
73g708q0322J8947J00414P2849o0599j33321n689J17290P4778m7079r8413m4166
85i3019P9033J04903j9801j11933m7887N6915Q9778K3998q4077r0848M1581J10378
97E9021K1388p4533p0528L67Q1168O9337n1530j02014k485Q4599N5739k6070p7202
110c2743m1842N6024Q5192q114q6038m3315M3852P2411J9408o3067o8817K3936
$$ plain form
122 -43113 36540 62010 12911 -50514 -56817 12234 68438 28688 -45979 -52898 2133 50851
134 50851 42982 -21339 -65087 -19049 53120 47045 -17439 -51236 -25647 29408 55504 8386
146 8386 -55053 -40746 27365 51559 11144 -37872 -43807 4440 52662 29872 -33796 -48068
158 -48068 -714 42260 33966 -16583 -49426 -17238 38395 40531 -7879 -42244 -24855 24134
170 24134 44914 6437 -41755 -32750 17431 40907 13897 -28129 -37684 1911 42809 25516
182 25516 -25811 -38522 -3319 31432 29320 -10030 -40138 -16712 29964 34342 -4870 -34060
194 -34060 -20705 17002 34878 8039 -31281 -28140 11908 33545 12910 -21617 -30019 94
206 94 32301 21135 -17570 -30740 -5766 24490 24579 -6295 -30937 -14125 22091 27174 -1776
$$ packed form
122d3113P9653K5470m9099o3425o303O9051N6204l9750p4667o919N5031M8718
134E0851p869o4321m3748M6038P2169o075o4484l3797K5589N5055K6096m7118
146H386o3439J4307O8111K4194m0415m9016n935M8247M8222k2790o3668j4272
158d8068M7354M2974q294n0549l2843L2188N5633K136m8410l4365J7389M8989
170B4134K0780l8477m8192R005N0181K3476k7010m2026r555L9595M0898j7293
182B5516n1327j2711L5203L4751k112l9350l0108K3426M6676M378l9212k9190
194c4060J3355L7707J7876k6839l9320L141M0048K1637k0635l4527q402L0113
206I4L2207j1166l8705j3170K4974L0256Q9l0874k4642J6812L6216N083k8950
$$ plain form
219 -1776 -25721 -18365 11392 28114 8188 -23982 -23032 7867 26240 11867 -15514 -24530 -2450
232 -2450 24330 18186 -12047 -24965 -5924 18698 20418 -2865 -23748 -13115 15523 21954 -35
245 -35 -19980 -15536 7617 22133 7981 -17898 -18921 4511 20593 10702 -11423 -20344 -3510
258 -3510 18710 15397 -8377 -19593 -5921 13673 16882 -1195 -18821 -11654 11103 17914 1255
271 1255 -15338 -12883 5139 17964 7510 -13172 -15831 2443 15782 9241 -8134 -15660 -3552
284 -3552 14551 13047 -5651 -15716 -5448 10357 13567 -579 -14623 -9854 8111 14508 2163
297 2163 -11627 -10913 3459 14047 6518 -9961 -12737 1001 12470 8318 -5983 -13101 -3009
310 -3009 11370 10915 -3978 -12649 -5417 7730 11035 596 -11822 -8224 6323 11590 2224 -9118
$$ packed form
219a776k3945P356K9757J6722j9926l2170R50L0899J8373j4373k7381r016K2080
232b450K6780o144l0233j2918J9041K4622J720k3283k0883J0633K8638O431k1989
245c5j9945M444K3153J4516j4152k5879j023K3432J6082r891k2125q921J6834
258c510K2220l313k3774j1216J3672J9594L209j8077j7626P167K2757O811j6659
271A255j6593K455J8022J2825j0454k0682k659J8274J3339o541j7375p526J2108
284c552J8103j504j8698j0065J0268J5805L210j4146j4044M769J7965O397j2345
297B163j3790P14J4372J0588p529j6479k776J3738J1469m152j4301p118J0092
310c009J4379m55j4893q671P232J3147L305j0439j2418L598J4547N267r366j1342
$$ plain form
324 -9118 -9186 1951 11195 5524 -7844 -10163 119 9898 7026 -3956 -10166 -3303 8428 8886 -2647
339 -2647 -9942 -4868 5713 8832 1053 -9085 -7037 4845 9561 2536 -6898 -7587 901 8744 5498
354 5498 -5924 -8550 -431 7793 5898 -2902 -8354 -3236 6690 7324 -1417 -8189 -4021 4427 7438
369 7438 990 -7094 -6017 2937 7368 2355 -5382 -6272 467 7109 4511 -4372 -7124 -818 5762
384 5762 5101 -1922 -7006 -3143 4747 6051 -915 -5865 -3852 2975 6406 1401 -5618 -5258 1933 6071
400 6071 2374 -3963 -5324 -235 5233 4145 -2876 -5827 -771 4287 4224 -1075 -5378 -2733 3689 5196
416 5196 -313 -4611 -3092 2260 5112 1661 -3986 -4468 1326 4715 2464 -2722 -4075 -140 4184
431 4184 3353 -2007 -4643 -878 3546 3644 -513 -4059 -2558 2749 4064 85 -3865 -2851 1396 4236
$$ packed form
324i118o8J1137R244n671j3368k319J0282R779k872j0982o210O863J1731M58j1533
339b647p295N074J0581L119p779j0138K048J1882M716p025r434o89Q488P843l246
354E498j1422k626Q119Q224j895q800n452N118R926O34q741o772M168Q448L011
369G438o448q084J077Q954M431n013p737q90O739O642k598q883k752O306O580
384E762o61p023n084L863P890J304o966m950K013O827L431n005p019L60P191M138
400F071l697o337j361N089N468j088p021k951N056N058o3n299m303K645O422J507
416E196n509m298J519N352K852l451n647m82N794L389k251n186j353L935M324
431D184q31n360k636L765M424R8m157l546J501N307J315l979l950J014M247K840
$$ plain form
447 4236 1702 -3083 -3567 831 3743 2087 -2154 -3506 -770 3357 2775 -1646 -3648 -1299 2496 2916
463 2916 -92 -3196 -2120 2026 3641 361 -2718 -2678 830 3214 1109 -2135 -3061 232 2607 1817
479 1817 -1370 -2941 -709 2607 2392 -1032 -2784 -930 1966 2690 239 -2629 -1832 1363 2489 348
495 348 -2328 -2017 578 2473 1418 -1634 -2343 -86 2287 1324 -783 -2604 -575 1692 1896 -746
511 -746 -2183 -989 1075 2070 359 -1875 -1936 863 2269 767 -1914 -1716 447 2014 979 -1567
527 -1567 -2193 -74 1611 1298 -351 -1898 -893 1472 1597 -514 -1720 -792 1042 1348 394 -1607 -1372
544 -1372 578 1483 840 -1198 -1485 165 1711 1171 -678 -1320 -260 1441 1165 -369 -1209 -915 1399
561 1399 1714 -185 -1427 -891 554 1073 370 -926 -1359 468 1662 387 -1091 -1212 -101 929 745
$$ packed form
447D236k534m785m84M398K912j656m241j352K736M127n82m421k002K349L795M20
463B916l008l104J076M146J615l280l079M0L508K384k105l244r26L293K375p90
479A817l187j571K232L316k15l424j752J854K896P24k451k868P97L195J126k141
495C48k676L11K595J895j055l052p09K257K373r63k107j821K029K267K04k642
511g46j437J194K064R95j711k234o1K799J406j502k681J98K163J567j035k546
527a567o26K119J685l13j649j547J005K365J25k111j206R28J834L06r54k001K35
544a372J950R05o43k038k87J650J546n40j849o42J060J701k76j534q40K94K314
561A399L15j899j242N36J445N19p03j296m33J827J194j275j478j21J111J030j84
$$ plain form
578 745 -622 -1087 -186 1002 900 -175 -1385 -553 749 1176 -56 -1000 -967 405 1204 406 -746 -748 238
597 238 1029 483 -708 -1117 -120 926 968 -347 -1179 -149 795 787 3 -785 -578 352 977 264 -894 -593
617 -593 385 630 429 -969 -769 67 632 448 -468 -817 -122 741 910 -198 -897 -319 675 692 115 -766
637 -766 -605 659 904 498 -561 -985 -181 849 659 -399 -664 -195 673 169 -421 -559 -211 460 535
656 535 -106 -753 -848 373 562 109 -48 -399 -7 442 378 -497 -273 69 742 436 -309 -584 -307 284 343
677 343 -26 -312 -145 160 223 2 -590 -292 235 539 80 -79 -530 -64 473 96 0 -432 -42 223 476
698 476 -65 -560 -77 203 197 -257 -202 -118 385 343 376 -458 -550 16 214 158 -48 -371 -265 -72 305 1 -169
721 -169 -172 272 508 199 -254 -492 239 167 49 -283 -454 139 253 201 -57 -196 67 20 -105 -45 -380 -192
$$ packed form
578G45j367m65R01J188j02j075j210Q32J302M27j232r44L3J372P99p98j152kR86
597B38P91n46j191m09R97J046M2j315q32J030R44qp84p88K07R30O25p13j158L01
617e93R78K45k01j398K00Q36N65j84r16l49O95Q63J69j108o99N78R94J7n77q81
637g66J61J264K45m06j059m24Q04J030j90j058k65M69Q68n04n90j38L48O71P5
656E35o41o47r5J221J89m53j57l51L92M49o4q75K24L42O73l06p45k75K77N91N9
677C43l69k86J67L05O3k21n92K98N27L04m59j59m51M66N37l77r6m32L90K65K53
698D76n41m95M83K80om54N5Q4N03m2L3q34r2N66J98n6k06l23J06J93L77l04j70
721a69lM44K36l09m53k38P31p2j18l32j71N93J14n2k58j39K63m7j25O0l35J88
$$ plain form
743 -192 -31 56 85 -201 -127 150 333 -357 -172 -29 4 209 235 158 -268 -102 105 -146 -274 -110 236 333 -60
766 -60 192 88 -85 -2 75 80 -135 194 149 80 0 -229 -183 188 133 245 -219 111 -62 -49 -28 -332 -168 -378
790 -378 118 186 135 -283 -301 -191 139 122 -269 -258 1 132 -124 -180 -143 224 -105 84 83 -105 2 68 66 83 163
815 163 -342 -151 147 -100 194 -50 382 0 122 -349 216 30 -62 38 -62 155 17 -14 182 -288 -169
836 -169 136 248 42 -11 -18 115 25 85 -263 -176 -235 1 -16 34 -136 91 -30 156 -86 -3 -1 -77 271 149 7
861 7 25 -22 15 -133 88 144 249 -267 -126 40 -61 36 -215 7 -106 279 -347 -118 28 68 13 -1 9 -189
885 -189 147 75 -36 -59 103 -414 51 -86 103 -343 -282 -135 232 296 -356 127 504 31 96 126 3 28 -107
908 -107 -113 160 67 -39 9 85 261 -25 52 -100 -124 -76 -148 -212 96 226 223 -101 100 84 -26 -8 67 -34 317
$$ packed form
743a92J61Q7K9k86P4K77J83o90J85J43L3K05K6p7m26J66K07k51j28J64L46R7l93
766f0K52j04j73Q3P7Nk15L29m5o9q0k29M6L71n5J12m64L30j73J3K1l04J64k10
790c78M96O8n1m18j8J10L30j7l91J1K59J31k56n6L7L67l29J89jj88J07O6kJ7Q0
815A63n05J91K98k47K94k44M32l82J22m71N65j86r2J00j00K17j38l1J96m70J19
836a69L05J12k06n3pJ33r0O0l48Q7n9K36j7N0j70K27j21J86k42Q3Kp6L48j22j42
861GJ8m7L7j48K21N6J05n16J41J66j01R7k51K22j13L85o26K29J46M0n5j4J0j98
885a89L36p2j11k3J62n17M65j37J89m46O1J47L67O4o52M83L77m73O5L0j23K5j35
908a07oK73r3j06M8P6J76k86P7j52k4M8p2o4L08J30ll24K01j6j10J8P5j01L51
$$ plain form
933 317 -311 185 5 -72 244 152 73 -89 -40 -32 -208 -160 33 -63 -172 -363 -103 243 -263 108 -171 -164 302 -72
957 -72 -528 -327 -59 331 176 91 -317 -73 232 229 -131 -295 -189 76 -79 -25 -165 -81 45 -99 -63 -126 -369
980 -369 -57 97 42 -9 150 -278 -46 178 145 -41 121 73 292 -112 27 -366 87 -34 -38 -42 -259 91 482
1003 482 -132 -201 -184 126 -67 -143 54 -171 66 -126 333 -574 -275 -289 214 -60 10 -46 7 -14 -152 -75 -142
1026 -142 -432 -200 17 145 147 -273 27 258 190 -178 -200 -173 226 -146 -121 171 -150 -115 169 60 -95 -39 289
1049 289 -43 14 -157 65 151 288 269 -328 -241 16 303 13 61 -108 -14 380 -52 -30 -269 270 84 -282
1071 -282 33 45 4 234 125 -132 -267 -21 233 217 -60 368 -340 48 -108 170 -41 -64 -234 122 292
1092 292 -25 -60 -154 212 -102 258 216 -253 -142 186 233 -193 -215 -288 92 477 -57 -187 164 331 144 81
$$ packed form
933C17o28M96j80p7L16r2p9j62M9Qj76M8J93r6j09j91K60L46n06L71k79PM66l74
957g2m56K01K68L90j55q5m08K44L05ll60j64J06K65j55N4j40Q4J26j44L6o3k43
980c69L12J54n5n1J59m28K32K24l3j86J62m8K19m04J39l93M53j21mmk17L50L91
1003D82o14o9J7L10j93p6J97k25K37j92M59r07K99j4N03k74P0n6N3k1j38P7o7
1026a42k90K32K17J28Km20L00K31o8l68k2K7L99l72K5K92l21L5K84j09j55N6L28
1049B89l32N7j71K22Q6J37j9n97Q7K57K87k90M8j69R4L94m32K2k39N39j86l66
1071b82L15J2m1K30j09k57j35K46K54j6k77M28p08L88j56K78k11k3j70L56J70
1092B92l17l5r4L66l14L60m2m69J11L28M7m26k2p3L80L85n34j30L51J67j87o3
$$ plain form
1114 81 -101 154 124 -140 -179 -91 -224 202 243 123 84 20 174 231 -93 -48 -274 -24 131 109 -66 7 -80 193
1138 193 181 15 1 -126 7 -7 153 214 1 -391 134 247 76 -39 187 214 191 47 73 -145 138 -17
1160 -17 -83 73 -139 -238 218 -206 -73 -176 192 -47 9 -176 -26 -6 54 33 204 299 -37 58 9 -132 -361
1183 -361 177 -186 131 -357 8 213 205 21 -52 -386 -151 -101 -153 -351 -323 73 -67 98 92 -100 -120 11 154
1206 154 68 2 16 -11 10 127 56 -439 -64 325 35 -122 92 325 45 81 58 41 -134 193 -69 171 -188
1229 -188 -161 -77 210 -38 -86 77 70 -199 27 -53 -118 72 -195 215 -63 140 -74 382 -79 -129 30 215 132
1252 132 125 -52 -181 -109 -16 75 56 126 56 67 -75 10 1 -52 -21 -286 258 -20 90 -121 130 44 157 166 -165 254
1278 254 -36 144 18 -112 -163 422 -145 99 -60 132 346 182 84 -23 -499 -16 -16 -34 -65 -83 -19 -11 26 186
$$ packed form
1114H1j82K55l0k64l9Q8j33M26M1j20l9o4J54N7l24M5k26K50J55k2j75P3q7K73
1138A93j2j66j4j27J33j4J60O1k13l92N25J13j71j15K26K7k3j44K6k18K83j55
1160a7o6J56k12r9M56m24J33j03L68k39N6j85J50K0O0k1J71R5l36R5m9j41k29
1183c61N38l63L17m88L65K05qj84p3l34K35N0n2j98K8L96j40J65oj92k0J31J43
1206A54q6o6J4k7K1J17p1m95L75L89k90j57K14K33k80L6k3j7j75L27k62K40l59
1229a88K7Q4K87k48m8J63pk69K26q0o5J90k67M10k78K03k14M56m61n0J59J85q3
1252A32pj77j29P2R3R1j9P0p0J1j42Q5rn3L1k65N44k78J10k11K51q6J13Rl31M19
1278B54k90J80j26j30n1N85n67K44j59J92K14j64r8j07m76M83%j8l1j8O4QL7J60
$$ plain form
1302 186 347 62 265 336 86 -457 -246 -80 -224 28 94 299 44 52 -269 -109 -48 152 128 -98 -85 -100 95
1325 95 294 19 -64 -118 -2 -171 -40 -3 -195 -89 156 -2 43 -21 -284 -36 -43 108 -357 37 60 43 93 160
1349 160 140 -163 -135 -181 304 32 65 136 323 155 39 -64 -84 -123 -155 -322 -213 50 4 -64 23 3 13 57 111
1374 111 118 -148 264 267 -520 -263 -86 24 186 -31 -148 -40 -52 -273 27 -15 174 -27 36 51 202 -136 -89
1397 -89 161 189 179 -63 -263 -21 2 29 -274 -174 -110 150 388 -44 -73 -72 -79 114 128 -167 -166 185 57 -13 16
1422 16 -36 -67 135 -197 -9 114 -10 -100 270 119 117 232 -270 -10 -415 -185 -213 -97 -68 83 65 -335 -5
1445 -5 288 -55 92 69 241 303 -55 239 -181 5 -89 183 -192 -236 -158 51 -102 12 64 196 -188 -243 106
1468 106 -113 -103 -52 50 57 173 -28 -342 90 50 -114 210 202 -265 176 426 21 -64 -63 -50 29 -207 -210 -312 377
$$ packed form
1302A86J61k85K03P1k50n43K11J66j44K52O6K05k55Ql21J60O1K00k4k26J3j5J95
1325I5J99k75q3n4J16j69J31L7j92J06K45j58M5o4k63K48pJ51m65L94K3j7N0O7
1349A60k0l03K8m6M85k72L3P1J87j68j16j03k0l9l2j67J09K63m6o8Q7k0J0M4N4
1374A11Pk66M12Lp87K57J77J10J62k17j17J08j2k21L00m2J89k01O3J5J51l38M7
1397h9K50K8j0k42k00K42K3K7l03J00O4K60K38m32k9JpJ93J4k95JL51j28p0K9
1422A6n2l1K02l32J88J23j24r0L70j51kJ15n02K60m05K30k8J16K9J51j8m00L30
1445eK93l43J47k3J72O2l58K94m20J86r4K72l75m4P8K09j53J14N2J32l84n5L49
1468A06k19J0N1J02PJ16k01l14M32m0j64L24qm67M41K50m05q5JJ3P9k36lj02O89
$$ plain form
1493 377 -89 -51 -17 -103 320 52 -210 -143 -137 -115 -165 -132 -214 -153 57 -119 226 -92 64 -160 -32 117 24 -57
1517 -57 115 206 233 103 30 83 -14 271 74 134 -290 -71 196 242 124 -8 -16 123 175 -102 -22 56 236 -322
1541 -322 -87 6 -178 -123 -23 -157 -311 -15 516 139 -103 20 208 -120 23 11 14 12 56 -73 141 85 -127
1564 -127 220 161 -10 28 145 298 256 20 -43 -164 -159 112 72 159 75 49 43 449 47 26 214 -77 334 41
1588 41 26 -316 -83 132 -266 -162 76 195 456 296 155 -105 -22 -326 125 -171 2 -84 11 332 278 -39
1610 -39 -226 171 41 88 253 -128 -66 -147 203 15 -87 157 133 -259 -65 -300 94 57 -215 115 33 -112
1632 -112 34 -154 81 220 -19 -306 -97 160 79 -112 -45 -142 308 -209 155 242 -176 71 67 36 -145 233
1654 233 243 61 -329 -130 83 -273 60 1 97 94 104 144 -68 -34 -70 234 -267 -29 -262 110 -144 -165 68
$$ packed form
1493C77m66L8L4q6M23k68k62O7OK2n0L3q2O1K10j76L45l18J56k24J28J49r3q1
1517e7J72R1K7j30p3N3r7K85j97O0m24K19K67M6j18j32qJ39N2k77Q0P8J80n58
1541c22K35R3j84N5J00j34j54K96N31l77k42J23J88l28J43j2LkM4j29K14n6k12
1564a27L47n9j71L8J17J53m2k36o3j21NK71m0Q7q4k6oM06m02k1J88k91M11k93
1588D1j5l42K33K15l98J04K38J19K61j60j41k60Q3l04M51k96J73q6R5L21n4l17
1610c9j87L97j30M7J65l81O2q1L50j88j02K44k4l92J94k35L94l7k72L30q2j45
1632a12J46j88K35J39k39k87K09K57q1j91O7r7M50n17L64Q7m18K47ml1j81L78
1654B33J0j82l90J99K13l56L33n9R6lJ0M0k12L4l6L04n01K38k33L72k54k1K33
$$ plain form
1677 68 -425 58 49 -60 166 169 -271 -321 103 15 -89 -159 -38 409 -137 23 98 -209 30 90 182 -430 443 -433
1701 -433 233 -40 -164 197 -275 103 -20 -59 313 150 219 -20 -10 92 -82 96 -156 247 -160 -156 95 -194
1723 -194 233 192 156 230 184 210 -30 -14 -438 -119 175 -16 -74 -15 -101 -25 -85 362 -260 -170 106 106 -18 158 -153
1748 -153 -19 106 64 -14 -171 3 -263 82 -216 83 41 26 -5 88 -99 78 118 -191 -80 10 -219 17 -24
1771 -24 -151 193 182 184 -38 123 52 56 94 16 23 1 -180 243 177 15 -162 139 69 12 -58 -24 -194 -166 -10 114
1797 114 -341 -150 20 -76 59 6 -12 -52 112 -208 10 13 -51 24 -82 0 200 146 -162 87 223 -61 80
1820 80 27 14 10 17 56 252 281 205 -46 -268 -171 97 135 -64 248 -133 74 -120 -270 182 -40 47 -364 149
1844 149 -229 -33 230 114 278 -67 215 -119 -130 187 299 91 17 -206 201 -222 -20 64 -7 -93 84 61
$$ packed form
1677F8m93M83rj09K26Lm40n0M24q8j04p0J21M47n46J60P5l07K39O0R2o12Q73q76
1701d33O66k73j24L61m72L78j23l9L72j63O9k39J0J02j74J78k52M03m07MK51k89
1723a94M27m1l6P4m6K6k40J6m24L19K94j91n8N9q6P6o0M47o22R0K76%j24J76l11
1748a53J34J25m2p8j57J74k66L45k98K99m2j5l1R3j87J77M0l09J11R0k29K36m1
1771b4j27L44j1Kk22J61p1ML8p8Pk2j81M23o6j62j77L01p0n7p0L4j70K8J56J24
1797A14m55J91J70r6J35n3j8m0J64l20K18Lo4P5j06Q2K00n4l08K49J36k84J41
1820H0n3j3mPL9J96K9p6k51k22R7K68L8j99L12l81K07j94j50M52k22Q7m11N13
1844A49l78J96K63j16J64l45K82l34j1L17J12k08p4k23M07m23K02Q4p1q6J77k3
$$ plain form
1866 61 -40 256 -14 208 -45 -23 12 108 96 -166 -207 -98 -194 265 143 28 -140 183 117 263 -91 -185 -9
1889 -9 243 90 -13 -59 375 30 105 -149 322 350 -85 -240 -226 -120 -87 17 -134 -42 167 -185 -182 -90 91 -218
1913 -218 128 -63 -213 219 2 -21 -2 -40 84 -311 -20 -46 138 -106 315 -78 -15 362 -154 160 111 -14
1935 -14 105 -130 -18 -11 -43 70 -118 153 -247 -244 206 144 148 -112 -149 66 -189 5 72 153 68 46 202 34 11
1960 11 -53 -93 -129 119 162 11 -13 372 -145 -68 -42 -154 -31 121 -70 201 -183 103 -125 144 -37 12 219
1983 219 -95 -91 -134 -122 120 -114 12 -87 -294 -10 31 323 -133 66 -27 66 7 228 -33 38 -28 -9 44 -117
2007 -117 -12 230 -105 12 -33 -210 4 149 40 138 -83 296 52 -70 11 -204 10 56 103 -33 -184 102
2029 102 -126 -59 -34 -37 183 233 98 49 7 20 -89 226 144 -88 -170 13 134 220 281 -129 -31 279 118 -269
$$ packed form
1866F1j01K96k70K22k53K2L5R6j2k62m1J09r6M59j22j15j68L23o6J46l54r4J76
1889iK52j53j03m6M34l45P5k54M71K8m35j55J4J06L3J04j51R2K09l52LR2J81l09
1913b18L46j91j50M32k17k3J9l8J24l95K91k6J84k44M21l93O3L77n16L14m9j25
1935a4J19k35J12Pl2J13j88K71m00LM50o2Mk60l7K15k55J94O7Q1q5k2J56j68k3
1960A1o4m0l6K48M3j51k4L85n17P7K6j12J23J52j91K71l84K86k28K69j81M9K07
1983B19l14Mm3J2K42k34J26r9k07K84M1K92m56J99r3R3n9K21k61P1o6J9N3j61
2007a17J05K42l35J17m5j77K14J45j09R8k21L79k44j22Q1k15K14M6M7j36j51K86
2029A02k28O7K5lK20N0j35m9m2J3j09L15q2k32q2J83J21Q6O1m10R8L10j61l87
$$ plain form
2053 -269 133 -72 243 -67 -77 101 -54 19 62 73 192 -48 -74 118 -192 16 122 -164 -112 127 -96 9
2075 9 44 -26 -179 -92 80 -25 187 -155 62 81 -93 9 -23 6 -245 143 261 -37 140 -298 -122 49 -211
2098 -211 -84 167 355 111 -243 85 -9 -198 -79 80 301 263 118 43 364 -137 -19 139 -107 -95 196
2119 196 -11 57 120 -91 74 215 308 53 94 233 102 24 74 -83 -182 6 -88 -188 200 -129 71 39 201
2142 201 -28 -149 118 -116 152 -165 -104 -183 141 -22 -128 28 186 -64 269 -180 -35 80 -39 -52 24
2163 24 24 46 96 447 -45 -279 -3 -96 72 -88 54 203 -360 -168 206 113 -140 125 -106 71 127 -134 196
2186 196 -268 38 -153 -130 -13 72 122 -6 -38 32 -282 -354 350 -221 126 -12 37 183 118 -128 162 367 53
2209 53 315 -145 -164 -82 -77 -277 192 -219 249 -93 -60 85 190 52 350 -61 -110 169 -100 211 -84 138
$$ packed form
2053b69M02k05L15l10j0J78j55P3M3J1J19k40k6J92l10K08J06k86N2K39k23J05
2075IL5p0j53Q7J72j05K12l42K17J9j74J02l2K9k51L88J18k98J77m38J76J71k60
2098b11J27K51J88k44l54L28r4j89J19J59K21l8j45p5L21n01J18J58k46J2K91
2119A96k07O8O3k11J65J41R3k55M1J39j31p8N0j57r9J88r4j00L88l29K00l2J62
2142B01k29j21K67k34K68l17O1p9L24j63j06J56J58k50L33m49J45J15j19j3P6
2163B4%K2N0L51m92k34K76r3J68j60J42J49n63J92L74r3k53K65k31J77N6k61L30
2186A96m64L06j91K3J17Q5N0j28l2P0l14p2P04n71L47j38M9J46o5k46K90K05l14
2209E3K62m60j9Q2Nk00M69m11M68l42L3J45J05j38K98m11m9K79k69L11k95K22
$$ plain form
2231 138 -125 -53 48 27 -74 -271 139 -139 156 -157 21 61 -104 -244 -136 -89 14 26 18 14 -47 -137 189 282
2255 282 71 -351 -61 162 39 -177 -136 -31 -260 -57 -331 -130 -415 -94 66 -376 58 188 -48 353
2275 353 -77 19 140 17 182 -230 145 -119 -40 -25 -38 -53 -25 -212 -216 -133 -75 -7 -39 65 48 -443 121 3
2299 3 115 47 17 -458 51 380 37 106 6 210 45 -194 4 199 28 -51 -33 89 -16 33 294 -41 -7
2322 -7 49 -87 35 -157 -281 -38 -41 -24 -211 35 205 169 -111 -133 84 -290 83 157 14 251 365 275 -165
2345 -165 -457 60 -252 177 -53 -26 -283 -146 -150 -77 -189 13 -238 84 9 207 -101 -112 91 -207 167 -6
2367 -6 208 402 118 -354 -125 220 -82 219 391 116 -13 122 0 96 101 -285 151 158 -108 199 378 183
2389 183 53 128 94 6 -45 -143 -12 62 202 65 65 77 232 -134 -220 93 148 -175 6 45 9 -12 45 -11 -182
$$ packed form
2231A38k63P2J01k1j01j97M10k78K95l13J78M0j65j40J08M7J03J2qmo1r0L26R3
2255B82k11m22K90K23j23k16M1J05k29K03k74K01k85L21J60m42M34J30k36M01
2275C53m30R6J21j23J65m12L75k64P9J5j3j5K8j87mQ3N8O8l2J04j7m91N64j18
2299CJ12o8l0m75N09L29l43O9j00K04j65k39J98J95j71p9J8J22j05M9K61l35L4
2322gN6j36J22j92j24K43lJ7j87K46J70l6k80k2K17l74L73P4j43K37J14r0m40
2345a65k92N17l12M29k30K7k57J37mP3j12K02k51L22p5J98l08j1K03k98L74j73
2367fK14J94k84m72K29L45l02L01J72k75j29J35j22R6Nl86M36Pk66L07J79j95
2389A83j30P5l4q8n1r8J31P4J40j37%J2J55l66q6L13N5l23J81L9l6k1N7n6j71
$$ plain form
2414 -182 32 70 -166 -293 -54 -55 8 54 364 17 292 179 23 -38 57 58 85 40 -133 116 -330 -34 23 -215
2438 -215 -9 -8 130 39 197 260 32 144 164 -2 -4 135 -94 -280 -50 -275 -37 80 253 160 54 74 -219
2461 -219 -114 -15 -114 102 -176 -35 -103 168 -138 -338 -46 32 120 127 -167 -95 -15 122 432 14 102 83 -247 -54
2485 -54 256 -188 202 -75 183 -10 -69 -221 -19 167 -30 -87 23 172 -41 -2 38 37 215 -254 -42 -103 2
2508 2 195 137 43 -157 85 -186 41 357 -80 -98 49 204 -44 108 131 114 78 -30 112 -5 341 204 97
2531 97 -304 -103 81 -134 -268 -235 69 3 73 19 -527 -188 103 190 -174 110 -37 42 117 -161 -287 -26 -204
2554 -204 55 47 -51 -74 95 292 2 -206 -221 220 294 138 -24 114 -139 75 113 -46 -9 -166 214 183 -1
2577 -1 -5 -283 52 237 95 -258 -30 -102 43 -91 25 -26 7 -231 17 83 123 27 48 -186 31 151 23 -95
$$ packed form
2414a82K14L8k36j27K39jO3M6L10l47K75j13j56o1R5JK7m5j73K49m46K96N7k38
2438b15K06JJ38r1J58O3k28J12K0j66kJ39k29j86K30k25K38J17J73r3j06K0k93
2461b19J05R9r9K16k78J41o8K71l06k00K92P8Q8Pk94P2Q0J37L10m18Q8j9l30J93
2485e4L10m44L90k77K58j93n9j52K02J86j97n7J10J49k13L9M0jJ78m69K12o1J05
2508BJ93n8r4k00K42k71K27L16m37j8J47J55k48J52K3j7l6j08J42j17L46j37j07
2531I7m01K01J84k15j34L3L04o6P0n4n46L39K91Q7l64K84j47P9P5k78j26K61j78
2554b04K59qr8k3J69J97k90k08j5M41P4j56j62J38k53K14L8j59L7j57L80l1j84
2577amk78L35J85j42l53K28p2J45j34J16n1L3k38K48O6M0r6K1k34K17J20j28j18
$$ plain form
2601 -95 20 -100 -148 67 84 69 2 158 -85 191 161 78 -77 -73 100 -215 -111 -93 -69 -277 106 173 60 -48
2625 -48 129 -225 -12 251 -18 -91 206 57 17 -65 268 -143 -249 440 180 22 -88 -115 288 63 207 145
2647 145 -239 -242 133 -250 46 174 -146 226 94 -150 -53 88 -115 270 290 77 -175 -130 -77 -181 -93 -160 -182
2670 -182 51 -194 -155 285 -80 372 21 82 142 99 147 -5 -101 344 54 219 77 54 -73 23 -274 -123 108
2693 108 -217 19 -78 4 -169 206 -285 211 93 -147 -85 176 139 -151 -23 142 2 -148 323 178 -275
2714 -275 170 16 -265 17 -171 -235 -63 47 379 -169 -16 323 -72 -43 286 -135 76 123 24 37 14 -27
2736 -27 -69 -233 168 -29 -282 -185 141 54 17 168 -187 -152 125 -254 -78 -323 23 77 -106 61 -161 135
2758 135 -26 -253 1 118 -158 -50 -8 107 23 135 368 186 32 -24 -207 -95 217 278 90 267 195 -54
$$ packed form
2601i5J15j20m8K15J7j5o7J56k43K76l0q3j55MJ73l15J04J8K4k08L83O7j13j08
2625d8J77l54K13K63k69p3K97j49m0q2L33m11j06O89k60j58j10k7M03k25J44o2
2647A45l84lL75l83K96J28l20L72j32k44R7J41k03L85K0k13k52M5N3j04Q8o7k2
2670a82K33k45L9M40l65M52l51O1O0m3M8j52r6M45k90J65j42k3j27R6k97J51K31
2693A08l25K36r7Q2j73L75m91M96j18k40O2K61l7k90J28J65j40j50M71j45m53
2714b75M45j54k81K82j88o4J72J10L32n48J53L39l95K9L29m21K11M7r9J3k3m1
2736b7m2j64M01j97k53R7L26q7l7J51l55L5K77l79J76k45L46N4j83J67k22K96
2758A35j61k27K54J17k76J08M2J15q4J12K33j82j54n6j83J12L12O1j88J77p2k49
$$ plain form
2780 -54 -133 -77 -87 -24 -75 -291 120 -141 -139 50 238 89 211 12 274 108 18 -183 -24 -44 112 -30 -122 210
2804 210 97 -90 -137 165 12 113 105 114 48 -178 -210 23 -10 -46 -212 -67 35 56 -167 -23 2 -259 -11 -13
2828 -13 62 -223 36 -158 42 -8 68 -88 158 102 -77 416 -143 -36 -242 -7 -95 -224 202 -40 -40 30 -313
2851 -313 277 56 -142 70 135 113 -41 149 173 7 132 -21 -237 -59 -113 165 175 -127 -98 191 -99 85
2873 85 165 -113 43 -2 421 -54 81 -66 9 21 -30 -161 158 302 38 -258 -89 148 -60 -8 61 180 -112
2896 -112 -37 131 197 -28 39 -6 -165 265 131 32 -32 267 -65 -87 270 -27 106 19 46 134 70 128 145 -40
2920 -40 -47 97 -267 70 292 -140 -152 -140 -119 60 94 -51 -112 86 -128 -87 -102 29 -374 -31 -139 -8 -154
2943 -154 -8 -81 -97 58 -129 159 -166 -224 67 47 -136 -230 -32 -59 147 -68 25 66 4 147 142 56 -141 154
$$ packed form
2780e4p9N6j0O3n1k16M11k61KJ89J88j49J22j99K62j66r0k01J59k0J56j42r2L32
2804B10j13j87m7L02j53J01qRo6k26l2K33l3l6j66J45J02K1k23J44K5k61K48k
2828a3P5k85K59j94K00n0P6j56K46n6j79M93n59J07k06K35q8j29M26k42%P0l43
2851c13N90k21j98K12O5k2j54J90K4j66J25j53k16J78n4K78J0l02K9K89k90J84
2873H5Q0k78J56m5M23m75J35j47P5J2n1j31L19J44k64k96J69K37k08N2O9J19k92
2896a12P5J68O6k25O7m5j59M30j34r9o4K99l32k2L57k97J33q7K7Q8o4N8J7j85
2920d0pJ44l64L37K22m32j2J2K1J79L4j45o1J98k14M1j5J31m03L43j08J31j46
2943a54J46p3j6J55j87K88l25n8K91k0j83r4J98k7K06k15R3M1o2J43nq6j97K95
$$ plain form
2967 154 117 -181 39 -156 147 -85 -113 -182 133 317 -120 227 142 -88 -12 -107 52 -104 1 1 -99 138 97
2990 97 -261 -45 124 83 -164 219 172 146 264 -105 291 -152 -11 -55 -180 23 118 115 -152 234 -159 -51 -41
3013 -41 -184 74 111 -418 229 -107 -31 -142 -81 396 191 -210 -42 -72 107 -153 -85 -55 -74 202 49 295 -170
3036 -170 -196 43 31 5 -205 43 163 -183 -41 176 -105 193 23 -348 -2 -18 152 141 -56 178 142 411
3058 411 -187 -66 57 -249 -36 -368 0 -154 32 216 -4 -81 285 -186 -164 -200 -16 61 -39 -168 1
3079 1 128 -190 -186 25 -159 -105 -69 112 -36 -41 -190 19 235 -75 -65 182 82 97 -48 -228 265 79 288
3102 288 -82 -103 -7 -37 0 19 -8 -216 -121 47 -90 98 -146 109 98 158 -1 -211 -100 -189 187 213 43 118
3126 118 303 -155 -87 -12 144 -31 37 278 -34 108 149 -312 18 226 128 -50 42 -145 99 -139 -4 -72
$$ packed form
2967A54l7k98K20j95L03k32k8o9L15J84m37L47q5k30P6r5J59j56J05%j00K37m1
2990I7l58K16J69m1k47L83m7k6J18l69L96m43J41m4j25K03R5lk67L86l93J08J0
3013d1j43K58L7n29O47l36P6j11O1M77k05m01J68l0J79k60O8L0j9K76j53K46m65
3036a70k6K39j2k6k10K48J20l46J42K17k81K98j70l71L46j6J70j1j97K34l6K69
3058D11n98J21J23l06K13l32L68j54J86J84k20p7L66m71K2l6J84P7j00j29J69
3079AJ27l18MK11j84N4L6J81j48nj49K09K16l10J0K47j00J5j45j80M93j86K09
3102B88l70k1R6l0L7J9k7k08R5J68j37J88k44K55j1O0j59k10J11q9L76K6j70P5
3126A18J85m58O8P5J56j75O8K41l12J42M1m61L30K08r8j78R2j87K44k38J35o8
$$ plain form
3148 -72 -80 -6 -200 -34 82 -149 -9 487 -1 255 -65 93 -4 -5 -1 -283 -30 -29 -206 54 19 -215 137 110
3172 110 -199 164 145 51 112 63 -31 -6 -220 -139 53 -29 -7 -130 -190 -113 11 -25 -121 151 -36 132 28 -59 -60
3197 -60 -113 395 -26 321 50 -24 -12 32 142 -111 96 -260 296 -23 -85 27 305 -118 -33 218 -212 69
3219 69 -120 -150 -111 22 -8 201 109 -18 379 -95 144 -16 -152 -149 200 184 229 84 12 172 -24 30 64 74
3243 74 -54 -157 -23 105 96 63 33 -245 -39 35 -206 -77 -28 185 44 -40 107 -249 -163 -197 -224 -103 -198 55
3267 55 -18 -71 -31 -15 199 -142 131 -90 211 348 39 -32 27 139 -100 156 -184 182 193 -261 124 15 35
3290 35 143 -62 -262 -50 193 -201 -178 -81 39 274 -50 -134 290 147 -44 -210 -53 -189 197 7 137
3311 137 -222 -154 -15 78 -106 -202 98 73 -129 -63 -61 284 -31 131 62 -175 7 86 27 -60 57 58 376 -66
$$ packed form
3148g2qP4j94J66J16k31J40M96m88K56l20J58r7jMk82K53Jj77K60l5k34L52k7
3172A10l09L63j9r4O1m9r4K5k14Q1J92q2K2j23o0P7J24l6r6K72j87J68j04q7j
3197f0n3N08m21L47k71p4J2M4J10k53K07l56N56l19o2J12K78m23Q5K51m30K81
3219F9j89l0L9J33l0K09r2j27L97m74K39j60j36LL49j6M5j45p2J60j96N4L4J0
3243G4j28j03J34J28rl3l0k78K06P4k41J29M9K13j41q4J47l56Q6l4k7J21r5K53
3267E5p3n3M0J6K14l41K73k21L01J37l09p1N9J12k39K56l40L66J1m54L85j09K0
3290C5J08k05k00K12K43l94K3R7J20K35l24q4M24j43j91j66J57j36L86j90J30
3311A37l59O8J39R3j84r6L00k5k02O6KL45l15J62o9k37J82P9n9q7J17JL18m42
$$ plain form
3335 -66 -264 -16 56 135 -52 -38 246 -10 129 186 214 -130 -339 0 283 -86 -90 -371 -36 -13 71 -111 87
3358 87 109 250 401 -338 103 -50 -93 -37 -47 -202 74 -48 -132 -78 241 189 -197 59 184 -100 75 33 26 152
3382 152 -84 -55 182 255 -88 163 -206 -17 104 89 -111 243 -95 -239 -267 -258 -275 -108 -67 124 136 -41 -63
3405 -63 -56 126 106 170 37 -23 75 -6 95 176 -157 -33 133 33 -26 -66 -109 172 -119 -73 163 -117 320 256 -242
3430 -242 123 -76 85 -333 -221 82 31 83 122 122 -122 -51 33 13 20 -36 -2 135 86 -4 -59 100 204 66 88
3455 88 -72 -22 39 98 80 146 -171 -330 328 -10 -101 61 141 178 -136 -94 -207 247 -343 140 -109 -251 42
3478 42 63 84 28 -209 -106 55 -30 -332 -122 -59 -424 106 25 -17 230 -58 -97 269 264 -46 -112 89 44 -192
3502 -192 53 14 41 111 72 -30 175 -133 -113 187 388 -76 -222 92 -432 12 15 196 187 357 167 243 183 -37
$$ packed form
3335f6j98K48P2P9j87J4K84k56J39N7K8l44k09L39K83l69mk81L35K3Q4j82J98
3358H7K2J41J51p39M41j53m3N6j0j55K76j22q4N4L19n2l86K56J25k84J75m2pJ26
3382A52k36K9K37P3l43K51l69J89J21j5k00L54l38j44k8Rj7J67M1J91J2j77k2
3405f3PJ82k0O4j33o0R8q1J01Q1l33J24J66j00n9m0m3K81k91M6K36k80M37o4m98
3430b42L65j99J61m18J12L03n1N2L9%k44P1Q4k0Pn6L4J37m9r0n5J59J04j38K2
3455H8j60N0O1N9j8O6l17j59O58l38r1J62Q0L7l14M2j13M54n90M83k49j42K93
3478D2K1K1n6k37J03J61q5l02K10O3l65N30q1m2K47k88l9L66nl10o6K01m5k36
3502a92K45l9K7P0l9j02K05l08K0L00K01m64j46L14n24M44LJ81rJ70j90P6o0k20
$$ plain form
3526 -37 209 -39 178 -62 3 -50 -441 -116 -70 6 65 -77 -151 106 -25 62 22 -154 16 -75 -169 207 -239 -130
3550 -130 -141 -92 -148 59 195 85 395 -196 118 -58 -76 -16 135 -104 -91 113 307 289 -42 39 -148 -146 -24
3573 -24 31 182 20 14 -105 23 -65 39 11 51 -126 159 391 -1 3 -37 -158 -73 112 -95 47 153 -171 316
3597 316 -123 -164 -128 -12 333 181 77 15 -181 63 -14 -79 -286 -76 59 78 246 -260 -60 -29 -27 144 180
3620 180 15 -21 -12 -51 70 60 17 -19 49 -50 -87 -38 -237 -44 63 -159 -160 -129 88 31 -79 106 -105 -109 -148 155
3646 155 -115 299 2 171 35 211 -28 -83 172 112 73 -222 112 -59 -367 92 -42 -305 -109 130 405
3667 405 -34 76 63 -32 193 -176 48 -20 164 88 -209 59 7 -32 215 -128 164 180 -3 218 207 -52 91
3690 91 -169 -40 59 169 82 29 -68 -23 -1 -66 -132 41 325 65 -104 236 -56 -273 -139 -103 -123 -22 -31 -69 -141
$$ packed form
3526c7K46k48K17k40O5n3l91L25M6P6N9j42p4K57j31Q7m0j76J70r1r4L76m46J09
3550a30j1M9n6K07J36j10L10n91L14j76j8O0J51k39J3K04J94j8l31Q1j87KJ22
3573b4N5J51j62oj19J28q8J04k8M0j77K85K32l92Mm0j21Q5J85k07J42J06l24M87
3597C16m39m1L6J16L45j52j04o2j96K44p7o5k07K10J35J9J68n06K00L1KJ71L6
3620A80j65l6Rl9J21j0m3l6O8r9l7M9j99J93J07k22jL1K17n7j10J85k11ml9L03
3646A55k70M14k97J69j36J76k39n5K55o0l9k95L34j71l08M59j34k63J96K39K75
3667D05m39J10j3r5K25l69K24o8J84p6k97K68n2l9K47l43K92J6j83K21j1k59J43
3690I1k60J29R9J10q7n3r7M5K2o5o6J73K84k60j69L40k92k17J34L6k0J01rl8p2
$$ plain form
3715 -141 -122 -270 -194 -237 -21 441 17 355 94 80 399 52 -95 230 -79 -27 192 174 -155 19 14 -115 -194
3738 -194 176 -37 -80 -180 169 -135 281 -236 -171 68 55 119 142 306 -82 -148 -242 -44 -147 -191 27 36 -68
3761 -68 -183 151 -158 -148 279 -141 125 366 -260 -204 37 -135 26 -160 -339 -79 -194 -13 -337 24 14
3782 14 8 80 151 242 50 187 0 143 -38 43 125 -75 189 64 -26 -154 97 147 6 71 77 -201 -255 146 133
3807 133 -4 97 -1 -184 -171 -311 302 -79 -47 88 45 -11 31 60 93 249 126 43 -134 -37 -88 151 -363 -29
3831 -29 -351 -125 -141 -313 -18 122 -24 -24 -34 -9 21 175 -120 -33 16 -129 5 135 319 -6 -7 332 -177 235
3855 235 244 103 182 -127 58 -31 -291 16 -181 399 16 -91 85 -98 -58 105 -340 -11 210 61 -149 -358
3877 -358 -58 -109 216 9 52 -188 14 2 -166 5 -127 -260 -382 -56 6 139 95 -90 -159 167 -68 128
$$ packed form
3715a41J9j48P6m3K16M62m24L38k61j4L19l47j47L25l09N2K19j8l29J74nj29p9
3738a94L70k13m3j00L49l04M16n17O5K39j3O4K3J64l88o6r4J98j03m4K18Rj04
3761f8j15L34l09J0M27m20K66K41o26N6K41j72J61j86j79K60j15J81l24L61j0
3782A4oP2P1R1j92J37j87J43j81Q1Q2k00K64j25r0j28K51N0j41O5Ok78n4M01j3
3807A33j37J01r8j83J3j40O13l81L2J35m3n6M2K9L3J56j23q3j77R7n1K39n14L34
3831b9l22K26j6j72K95J40j46%j0K5L0J54k95Q7M9j45J34J30J84l25jL39n09M12
3855B35Rj41P9l09J85q9k60L07j97N80l83j07J76j83M0J63m45L29K21j49k10k09
3877c58L00n1L25k07M3k40K02j2j68J71j32j33j22L26O2J33m4j85o9L26k35J96
$$ plain form
3899 128 125 52 -142 -522 -98 23 -45 40 197 -235 195 -171 140 211 -298 79 148 -8 -86 -28 -104 47 -88
3922 -88 2 54 168 213 -31 35 56 116 -71 -139 -31 -130 -152 -153 -32 -200 224 -41 208 105 -153 108 136 -203
3946 -203 -561 -145 -121 114 8 -180 -2 -131 110 -69 280 -44 -16 106 -69 -60 -120 -61 90 85 -35 -99 16
3969 16 68 50 -80 -35 -247 -39 50 35 157 -201 117 54 73 -94 -238 -94 127 54 172 -114 85 -95 68
3992 68 42 -20 85 161 56 -62 -100 -67 -169 176 166 -102 -68 -257 10 224 -142 -457 -111 3 355 80 -27
4015 -27 274 109 -46 -170 -196 115 84 122 132 128 153 69 -142 -28 176 187 195 115 352 -225 50 -415 41 152
4039 152 39 -13 26 237 -138 68 -15 -53 63 13 -118 -80 106 13 -54 -50 -136 -59 8 -161 -218 -304 22 3 357
4064 357 11 70 22 -41 -79 297 81 195 108 105 25 -1 94 122 127 -77 -270 -29 -70 -16 -18 100 -104 -222 -342 64
$$ packed form
3899A28lp3j94l80M24J21o8Q5J57m32M30l66L11P1n09L77O9j56p8N8p6J51j35
3922h8R0N2J14M5k44O6K1O0j87o8J08r9k2jJ21j68M24k65K49j03k58K61K8l39
3946b03l58M16K4K35j06j88J78j29K41j79L49l24K8J22j75Ro0N9J51nj20o4J15
3969A6N2j8j30M5k12K08Q9j5J22l58L18o3J9j67j44J44K21p3J18k86J99j80J63
3992F8k6o2J05P6j05j18l8L3j02L45j0k68L4j89K67K14l66l15L46J14L52k75j07
4015b7L01j65j55j24k6L11l1L8J0mK5q4k11J14K04J1Qq0K37n77K75m65M56J11
4039A52j13n2L9K11l75K06q3l8J16n0j31L8J86r3o7Mq6P7O7j69n7q6L26j9L54
4064C57l46N9m8o3l8L76k16J14q7lq0k6R5K8Nk04j93K41m1N4kJ18k04j18j20M06
$$ plain form
4090 64 -94 50 319 -92 -48 91 154 387 30 8 -72 3 24 73 80 -8 -255 -151 -128 -130 37 67 -199 275 -182
4115 -182 -69 144 55 -339 18 -125 126 66 29 -155 54 10 224 -51 -81 -159 -77 75 48 -122 -110 -78 -78 65
4139 65 -195 -176 -140 -40 -149 5 93 -127 62 -163 -220 47 74 -113 177 175 -69 140 216 -241 -80 -187 -11
4162 -11 64 -246 -254 204 -157 -160 -238 195 48 -16 20 -195 354 -191 76 62 -134 -124 314 -37 -47 81 -33 209
4186 209 217 108 -105 -201 -40 -85 38 11 -88 28 -81 -171 -171 171 62 -185 168 -283 -280 296 205 65 -1 336
4210 336 -100 -56 -147 4 -59 14 -21 41 -101 8 -127 -307 48 -3 9 60 50 227 39 -150 19 -97 -45 30
4234 30 93 120 -175 -57 305 432 -437 -129 -43 82 24 -140 121 282 -5 -39 24 77 -27 -118 53 6 -249
4257 -249 -230 60 -131 98 -104 -118 34 103 -24 -39 -167 -248 -79 -151 12 -181 -190 43 -170 -7 345 -24 87
$$ packed form
4090F4j58J44K69m11M4J39O3K33l57k2q0P5K1M9Pq8k47J04K3kJ67L0k66M74m57
4115a82J13K13q9l94L57j43K51o0l7j84K09m4K14k75l0p8Q2J52k7j70J2L2%J43
4139F5k60J9L6J00j09J54Q8k20J89k25n7K67K7j87K90kk44K09P6m57J61j07J76
4162a1P5l10qM58l61lp8M33j47o4L6k15N49n45K67j4j96J0M38l51j0J28j14K42
4186B09Qj09k13r6J61m5J23k7r9J16j09r0%L42j09k47L53m51LN76r1j40o6L37
4210C36m36M4r1J51o3P3l5O2j42J09j35j80L55n1J2N1j0J77j88j89J69j16N2P5
4234C0O3K7k95J18L62J27q69L08Q6J25n8j64K61J61k87l4O3N3j04r1J71m7k55
4257b49J9K90j91K29k02j4J52O9j27j5j28q1J69p2J63j93rK33k13J63L52l69J11
$$ plain form
4280 87 99 -10 -189 202 -333 -7 -291 -160 34 -77 -58 115 -84 -88 -91 -49 -66 -12 137 361 -13 -134 143
4303 143 -451 -60 -121 -7 246 182 -58 -4 154 33 -314 368 340 -268 -159 -53 235 96 -119 -48 -59 10
4325 10 -259 309 86 237 110 -244 48 -167 95 182 -109 0 249 145 -90 45 141 3 24 -432 244
4346 244 71 -114 211 183 172 -9 -30 45 224 106 -170 -211 -194 -106 -108 39 136 50 6 90 -85 -32 33 -297 125
4371 125 -47 -153 -76 184 55 -64 -172 -35 13 186 -5 -242 -164 -368 434 -291 -97 -89 173 -64 156 -37
4393 -37 -49 -57 -195 134 -97 -22 -474 350 -282 166 87 -141 -227 -77 13 171 -44 -191 191 -386 -12 -167 -147
4416 -147 12 165 114 67 -38 -15 19 62 -124 164 8 -179 -20 109 -225 60 -106 -143 -143 -279 183 55 -185
4439 -185 -272 -182 165 169 -157 94 177 -197 25 18 -120 -72 -123 -118 490 -189 245 30 -68 95 -94 -57 -8 49 -328
$$ packed form
4280H7J2j09j79L91n35L26k84J31J94j11J9J73j99mlM2j7N4J49K24l74j21K77
4303A43n94L91o1J14K53o4k40N4J58j21l47O82k8o08J09J06K88j39k15P1j1O9
4325A0k69N68k23J51j27l54K92k15K62Q7k91J09K49j04k35J35R6j38K1m56O76
4346B44j73j85L25k8j1j81k1P5J79j18k76m1J7Q8kJ47R7q6m4Q4j75N3O5l30M22
4371A25j72j06P7K60j29j19j08J37M8J73j91k37P8k04Q02p25J94QK62k37K20j93
4393c7j2qj38L29k31P5m52Q24o32M48p9k28q6J50R0J58k15j47L82n77L74j55K0
4416a47J59J53n1m7j05K3L4M3j86K88j56j87J59J29l34K85j66l7%j36M62j28k40
4439a85q7R0L47Ml26K51Q3l74K22pj38M8n1NO08o79M34k15r8J63j89L7M9N7l77
$$ plain form
4464 -328 52 -127 -137 -90 -102 160 141 -295 -118 -149 -205 -242 -92 -176 146 -34 104 60 321 61 -56 -15 -194
4487 -194 190 59 -132 137 -218 -10 181 265 -14 12 -147 43 226 -148 140 -119 66 -113 200 -100 27
4508 27 109 -254 -206 -137 -56 44 -108 108 28 392 59 -144 77 26 -304 -68 -6 134 -187 -147 -3 -127 141
4531 141 61 28 -83 200 -43 -37 312 7 90 -137 -240 32 163 -125 -88 128 -53 230 -214 -120 68 -10 108
4554 108 142 -65 -221 3 6 252 270 -231 149 -26 -343 -17 -98 -60 -7 -95 -101 -119 -90 128 187 99 -119 197 -135
4579 -135 117 125 28 -99 90 -241 -15 -79 -9 -82 -282 -158 -219 131 176 224 73 129 -61 -11 -16 -101 256 59 160
4604 160 266 -91 135 214 -198 100 -143 -8 -41 -220 -84 -35 -233 -158 -250 -175 -22 -124 -210 -145 19 4 22
4627 22 70 107 -77 -47 111 -87 190 -92 -48 -155 -141 -5 50 -150 -120 -32 21 -223 -40 -119 -45 -327 122 -30
$$ packed form
4464c28L80j79j0M7j2K62j9m36J77l1n6l7J50q4L22j80J38m4K61k60j17M1j79
4487a94L84j31j91K69l55K08J91Q4k79K6j59J90J83l74K88k59J85j79L13l00J27
4508B7Q2l63M8O9Q1J00j52K16q0L64l33k03K21n1l30K36O2J40l21M0J44j24K68
4531A41q0l3j11K83k43OL49l05Q3k27j03K72J31k88L7K16j81K83m44R4J88p8J18
4554A08L4k07j56K24LK46J8n01L80j75l17L26q1L8N3q8oj8K9K18N9q8k18L16l32
4579a35K52Qr7j27J89l31K26o4P0p3k00J24o1L50M5M8j51N6j90N0nq5L57j97J01
4604A60J06l57K26P9m12K98k43J35l3j79J36M9j98P5r2P5J53j02q6O5J64j5J8
4627B2M8L7j84L0J58j98K77k82M4j07J4J36N5k00L0Q8N3k44J83p9P4k82M49j52
$$ plain form
4651 -30 -194 49 318 -191 152 -188 -196 193 -143 114 -133 234 -44 208 291 52 271 -18 -112 -57 273 -20
4673 -20 -69 82 -111 25 -154 -138 179 -142 -151 -92 42 164 -110 -130 -73 103 -106 115 136 -88 22 -89 10
4696 10 18 -268 -19 0 -100 46 238 429 17 55 -10 50 114 -9 224 -43 64 76 -160 -46 -430 -187 -256
4719 -256 -143 -32 -42 63 100 -182 175 47 31 100 -38 73 135 -251 -50 -110 132 -44 80 78 60 75 -182
4742 -182 139 157 69 117 15 -41 -27 241 -92 306 -34 193 -79 0 9 64 220 117 -146 -329 131 125 9 -175
4766 -175 -73 180 -84 346 -67 -89 267 -66 88 110 -260 255 -163 -77 77 -134 151 114 -72 -204 48
4787 48 -96 -13 -64 -181 135 -88 -137 -51 -148 60 -273 -124 300 -155 -221 23 -308 11 -197 -70 78 -17 -315
4810 -315 186 -16 -61 -50 175 45 -21 -173 50 334 -61 39 -156 102 1 -160 -197 29 189 177 -121 13
$$ packed form
4651c0j64K43K69n09L43l40qL89l36K57k47L67k78K52Q3k39K19k89r4N5L30k93
4673b0m9J51j93J36j79J6L17l21rN9J34J22k74k0N7J76k09K21K1k24J10j11R9
4696A0Qk86K49J9j00J46J92J91m12L8o5O0O4j23K33k67J07J2k36J14l84K43o9
4719b56J13J11j0J05L7k82L57j28j6O9j38J11O2l86K01o0K42j76J24kj8J5k57
4742a82L21J8q8M8j02n6J4K68l33L98l40K27k72P9RN5J56j03k63j83M60oj16j84
4766a75J02K53k64M30m13k2L56l33J54K2l70N15m18Q6J54k11K85l7j86j32K52
4787D8j44Q3n1j17L16k23m9Q6r7K08l33J49M24m55o6K44l31L19k08J27J48r5k98
4810c15N01k02m5J1K25j30o6j52K23K84l95J00j95K58j01j61l7K26J60j2k98J34
$$ plain form
4832 13 18 115 -276 -183 188 -33 1 -82 -41 -24 55 -93 76 -62 -117 153 -45 -66 -42 -187 134 -30 81 -15 -169
4857 -169 -148 378 162 178 -194 96 -21 -24 38 142 75 -6 -277 93 65 158 -104 -36 115 -41 -175 157 47
4880 47 -69 335 72 -189 -233 84 260 84 132 72 -260 90 137 122 129 26 -88 -250 64 -326 -263 18 97
4903 97 -131 139 -16 -263 -217 -69 -21 136 -194 -71 -49 -85 -3 28 52 -68 112 163 -80 44 -307 -75 270
4926 270 -123 30 -109 79 -25 161 128 55 62 49 -97 -61 -115 285 -117 355 -61 -238 -154 183 -39 -142 39
4949 39 29 -70 32 -81 -282 103 -28 -119 249 -200 -117 166 -108 68 -101 -264 81 -4 51 -179 -94 -118 37
4972 37 27 -203 2 -155 178 84 -41 -275 -4 156 -62 141 29 -170 205 -49 219 40 -169 -225 -204 75
4994 75 -20 22 -102 -140 19 -301 93 269 67 -166 -57 -4 24 -91 26 225 -143 170 -149 -149 -50 -59 83 139
$$ packed form
4832A3NR7l91R3L71k21L4q3M1J7P9j48J69j38n5K70j98k1K4j45L21j64J11r6j54
4857a69K1N26k16J6l72K90j17lO2J04o7q1k71L70k8R3k62O8J51j56j34L32j10
4880D7j16M04k63k61m4L17J76j76M8o0l32L50M7j5Pj03j14j62L14l90O3K81P9
4903I7k28K70j55k47M6J48M8J57l30J23K2l6Q2L1K4j20J80N1k43J24l51K32L45
4926B70l93J53j39J88j04J86l3p3Pj3j46L6n4M00m02M72m16j77Q4L37k22j03J81
4949C9j0r9J02j13k01L85j31r1L68m49Q3K83k74J76j69j63L45q5N5k30Q5k4J55
4972C7j0k30K05j57L33r4j25k34K71J60k18K03j12j99L75k54K68j79k09n6K1K79
4994G5r5M2j24l8J59l20L94J76k02k33J09N3K8j15J17J99l68L13l19%R9rJ42N6
$$ plain form
5018 139 -80 -14 -169 -121 -2 120 -105 241 -170 -232 183 -64 54 -17 -19 -76 14 -309 105 44 84 -113 236
5041 236 98 99 52 95 -127 21 -39 -62 -32 -38 -71 -82 6 203 88 -253 -82 -173 83 59 -304 -41 242 -153 286
5066 286 -118 88 -69 201 -209 34 -156 -23 147 -178 -98 -296 -296 -70 -29 -16 -191 -79 -261 -276 -237 -80
5088 -80 -111 232 -205 -136 41 48 -63 93 -163 -56 83 364 -307 163 116 -93 22 72 227 130 108 -292 277
5111 277 -7 31 -12 -154 -61 -49 30 -71 -137 101 -34 294 -1 -91 -87 -226 -113 -198 -103 -100 -191 216 -2 -171 135
5136 135 -77 -38 8 12 -278 75 -116 -133 75 -117 -23 -32 167 310 10 53 -38 -48 111 -351 270 -54 268 96
5160 96 245 -94 -318 148 77 -237 -48 -108 287 -2 -170 33 -281 -240 -145 84 361 35 -10 196 -67 201
5182 201 -10 -155 70 -93 90 69 -297 78 -22 42 237 140 -75 191 106 10 -441 -153 -197 22 237 -28
$$ packed form
5018A39k19O6j55M8J19J22k25L46m11o2M15k47J18p1kn7R0l23M14o1M0j97L49
5041B36j38Jm7M3k22J48o0k3L0ol3j1Q8J97j15l41J71r1K56k4l63K63K83l95M39
5066B86m04K06j57K70m10K43j90J33J70l25Q0j98%K26M1J3j75J12j82j5L9J57
5088h0l1L43m37O9J77Pj11J56k56J07J39K81o71M70m7k09J15N0J55r7k2m00N69
5111B77k84L8m3j42R3J2P9j01o6K38j35L28k95r0Mj39J13q5R5Lr1M07k18j69L06
5136A35k12L9M6Mk90L53j91j7K08j92R4rJ99J43l00M3r1j0J59m62O21l24L22j72
5160I6J49l39k24M66p1l14J89o0L95k89j68K03l14M1R5K29K77l26m5K06k63K68
5182B01k11j45K25j63J83k1l66L75j00O4J95r7k15K66q5r6m51K88m4K19K15k65
$$ plain form
5204 -28 -445 87 128 119 109 20 35 131 172 -94 -5 189 125 73 -50 -32 -7 195 34 17 137 -275 319 -77 -117
5229 -117 1 42 194 20 -432 -153 97 -216 148 -49 -183 203 -64 -279 25 -419 75 71 -84 117 22
5250 22 71 234 111 -55 -441 254 236 -306 -268 59 148 -23 14 119 78 4 64 197 176 -127 6 -177 -161 -77
5274 -77 24 144 -204 166 -217 68 223 -10 71 -151 17 21 20 -54 8 -66 -143 -104 29 175 -27 173 -288 -67
5298 -67 291 117 39 -298 -133 193 -157 59 62 93 -117 -158 70 -21 -214 -327 184 -91 3 -7 160 220 99
5321 99 108 295 -71 182 -92 154 -26 146 -11 -129 274 -291 -136 -115 81 -120 11 182 108 101 -203 61
5343 61 -113 -95 -231 -145 -276 -36 -73 191 110 -53 6 92 111 184 29 -227 19 15 -11 -253 182 -246 235 -87
5367 -87 -253 -102 269 -90 -81 175 -77 -138 234 -183 -79 238 130 -5 -218 27 177 44 -154 10 -279
$$ packed form
5204b8m17N32M1rj0q9J5R6M1k66Q9J94o4n2j23J8K5K02j61j7J20m12N94l96m0
5229a17J18M1J52j74m52K79K50l13L64j97j34L86k67k15L04m44M94mj55K01r5
5250B2M9J63j23j66l86O95j8n42L8L27Q9j71L7J05m1p4O0J33k1l03J33j83J6Q4
5274g7J01J20l48L70l83K85J55k33Q1k22J68Mjp4O2p4p7L9J33J46k02K00m61K21
5298f7L58j74p8l37J65L26l50K16LL1k10m1K28r1j93j13N11k75R4j0J67O0j21
5321I9RJ87l66K53k74K46j80J72j57j18M03n65J55K1J96k01J31J71p4pl04K64
5343F1j74J8j36Q6j31K40l7K64q1j63N9Q6J9P3j55k56K46mk6k42M35m28M81l22
5367h7j66J51L71l59RK56k52o1L72m17J04L17j08j35k13K45J50j33j98J64k89
$$ plain form
5388 -279 -178 -161 -65 74 135 167 63 60 -82 -110 -27 -164 -42 -315 -149 81 59 53 247 33 -27 -119 225 320 -122
5413 -122 -43 5 -182 -73 -188 197 190 404 192 51 -73 -52 175 27 -7 50 259 31 92 36 40 -53 -64 106
5437 106 -293 64 82 -59 -191 155 242 41 -84 75 -121 422 325 -51 260 50 -61 -99 151 -84 25
5458 25 -15 322 130 92 -87 20 -212 -171 156 20 210 163 -231 93 -104 -81 -69 221 -28 105 -50 64
5480 64 -101 149 -257 65 280 148 133 233 -46 57 1 -191 61 -73 76 -108 347 178 -7 -146 55
5501 55 138 50 249 -23 -62 280 206 -26 -156 -10 -20 13 117 -248 180 -7 161 183 -306 118 -239 259 99
5524 99 247 121 62 224 -150 -190 -153 62 -36 226 -107 -263 129 -208 -148 51 33 268 100 -340 127 101 49
5547 49 228 206 22 80 31 -108 19 -11 54 88 -108 9 131 6 -31 -96 64 -35 124 28 -29 -178 100 -134
$$ packed form
5388b79J01J7R6J39O1L2j04lj42k8Q3j37J22k73J66K30k2oJ94k14o0r2L44R5m42
5413a22P9M8j87J09j15L85pK14k12j41j24K1K27j48l4N7K09k28O1n6Mr3j1J70
5437A06l99L57J8j41j32L46Q7k01j25J59j96N43r7l76L11k10j11l8K50k35J09
5458B5m0L37j92l8j79J07k32M1L27j36J90m7l94L24j97K3J2K90k49J33j55J14
5480F4j65K50m06L22K15j32j5J00k79J03n6j92K52j34J49j84M55j69j85j39K01
5501E5Q3q8J99k72l9L42p4k32j30J46j0L3J04l65M28j87J68K2m89M24l57M98j60
5524I9J48j26n9J62l74m0L7K15r8K62l33j56L92l37O0J99j8K35j68m40M67k6n2
5547D9J79k2j84N8m9j39J27l0O5L4j96J17J22j25l7o5J60r9J59r6n7j49K78k34
$$ plain form
5571 -134 21 -422 161 -203 139 -378 327 61 -8 -67 -92 -115 -261 155 173 -90 316 44 142 -134 3 50
5593 50 -183 122 102 71 505 -65 -245 -263 225 83 47 -60 66 47 -100 44 160 161 14 177 -312 -308 -149
5616 -149 -134 -230 200 -245 -46 -33 -194 63 12 44 -111 35 135 -354 -97 175 -142 -154 211 96 -96 42
5638 42 -14 91 67 -119 271 -40 9 273 -58 -186 3 -7 -128 212 28 -90 -54 -333 456 94 -63 183
5660 183 -155 38 66 18 172 44 69 48 193 127 -61 96 170 80 48 -253 -209 -406 -3 52 -231 -103 97
5683 97 30 -86 65 -23 -71 22 178 160 36 203 -32 -187 180 -180 67 8 21 -10 170 -250 55 142 111 -114
5707 -114 -18 -119 -113 -176 -356 61 -18 -36 -81 -335 -164 -109 31 267 -57 -109 85 186 -18 83 52 -70 -16 6
5731 6 -31 -28 -61 -24 -355 -171 -241 78 -172 0 -105 -102 -71 -174 -235 -79 -60 -306 -108 49 171 259 -135 -131 24
$$ packed form
5571a34J55m43N83l64L42n17P05k66o9n9k5k3j46M16J8k63M06k72R8k76J37M7
5593E0k33L05k0l1M34n70j80j8M88j42l6j07J26j9j47J44J16Jj47J63m89MJ59
5616a49J5r6M30m45J99J3j61K57n1L2j55J46J00m89K57K72l17j2L65j15j92J38
5638D2n6J05k4j86L90l11M9K64l31j28J89j0j21L40j84j18L6k79P89l62j57K46
5660A83l38J93K8m8J54j28K5k1J45o6j88J57P4r0l2l01M4j97M03N5k83J28K00
5683I7o7j16J51q8m8R3J56j8j24J67k35j55L67l60K47n9J3l1J80m20L05Q7l1k25
5707a14R6j01Oo3j80M17p9j8m5k54J71N5J40K36l24n2J94J01k04J01l1j22N4K2
5731Fl7Ll3L7l31J84p0L19k50J72j05LL1j03o1J56J9k46J98J57J22Q8l94MJ55
$$ plain form
5756 24 -16 303 -110 -221 -105 6 12 -67 -168 17 -266 277 -142 -273 238 -168 -55 -110 70 149 -249 -33
5778 -33 28 146 -36 149 -112 57 -4 -113 -214 -266 10 -180 -93 -149 105 300 35 -109 -30 167 -67 172
5800 172 -85 -24 -290 54 -27 120 -106 -38 -63 -87 28 214 -210 -198 89 195 192 -97 146 234 -20 -342 78
5823 78 -53 71 182 31 76 88 202 -232 372 22 -146 -143 141 -152 -11 79 -79 -182 174 -265 30 -54
5845 -54 -9 -52 52 -181 -238 -112 99 -199 -30 377 -383 201 23 155 185 -30 33 28 107 66 133 -22 146 63
5869 63 81 -133 197 -162 244 -110 52 17 -69 -39 -103 10 27 -233 4 13 133 153 59 -60 -55 199 -26 124
5893 124 -84 296 -23 -250 -113 1 29 60 -275 -237 170 338 -195 -117 43 -163 71 55 -183 99 152 -156
5915 -156 -39 198 -32 -102 14 176 206 43 -317 251 99 3 122 342 150 -70 -129 -1 199 83 -209
$$ packed form
5756B4m0L19m13j11J16J11Op9j01J85k83N43m19j31N11m06J13n5J80P9l98K16
5778c3O1J18j82J85k61J69o1j09j01n2K76j90Q7n6K54J95k65j44P9J97k34K39
5800A72k57O1k66L44q1J47k26O8k5k4J15J86m24J2K87J06lk89K43Q8k54l22M20
5823G8j31J24J11j51M5J2J14m34O04l50j68LK84k93J41R0j58j03L56m39K95q4
5845e4M5m3J04k33n7J26K11k98J69M07p60N84j78J32L0k15O3nP9m1O7j55J68q3
5869F3J8k14L30l59M06l54J62l5q6L0o4J13J7k60K37RJ20K0r4j19NK54k25J50
5893A24k08L80l19k27J37J14K8L1l35L8M07J68n33P8J60k06K34j6k38K82N3l08
5915a56J17K37k30p0J16J62L0j63l60N68j52r6J19K20j92k20n9J28K00j16k92
$$ plain form
5936 -209 17 -28 -210 53 -171 -9 -9 -126 -127 27 -73 11 -291 314 -57 -332 -255 122 160 0 -64 -249 -86
5959 -86 -182 -208 -290 -44 302 218 120 71 -68 -147 -40 -74 45 2 -50 -104 -8 -139 234 141 94 -35 -291 376 -57
5984 -57 -12 -135 173 -114 -36 -192 116 -65 138 -47 -348 -35 -97 -271 219 74 -28 43 -13 11 -47 27 121
6007 121 203 122 126 55 277 26 81 -55 192 -7 -93 20 -164 -144 262 -129 84 141 -54 -116 -187 -13 121 -90
6031 -90 95 38 -80 87 25 213 -263 -34 -221 238 135 72 23 34 37 -13 108 99 135 96 86 154 -201 118 70
6056 70 107 -80 211 -12 54 96 -338 179 47 198 -85 263 -179 194 9 114 48 88 -257 98 -80 -164
6078 -164 60 372 -96 -117 57 39 76 -64 -28 -179 94 88 -242 -117 -107 7 120 -184 82 -30 158 138 -224
6101 -224 137 5 173 353 144 43 -435 220 -47 -151 85 14 33 114 -102 -44 57 -152 63 204 -196
$$ packed form
5936b09K26m5j82K63k24J62%j17jJ54j00Q4l02O05l71k75P7L77L8j60o4j85J63
5959h6r6k6q2K46L46q4r8m9j39p9J07l4J19m3n2n4R6j31L73r3m7j29k56O67m33
5984e7M5j23L08k87P8j56L08j81K03j85l01L13o2j74M90j45j02P1n6K4n8P4R4
6007A21Q2q1Mp1K22k51N5j36K47j99q6J13j84K0M06l91K13N7j95o2p1J74J34k11
6031i0J85n7j18J67o2J88m76K29j87M59j03o3m9J1Ln0J21rL6l9j0O8l55L19m8
6056G0L7j87K91k23O6M2m34N17j32J51k83L48m42L73j85J05o6M0l45L55j78q4
6078a64K24L12m68k1J74j8L7j40L6j51K73ol30J25J0J14J13l04K66j12J88k0l62
6101b24L61j32J68J80k09j01m78O55k67j04K36p1J9Q1k16N8J01k09K15J41m00
$$ plain form
6122 -196 -302 -54 -119 110 -227 220 94 98 -1 62 67 -129 -198 -6 -37 -82 -156 46 -137 48 321 331 -96 -164
6146 -164 -184 -147 -12 122 109 359 -5 -145 61 -199 12 -69 272 -250 -104 -113 59 87 135 105 -68 -182 131
6169 131 46 202 332 1 -99 124 136 50 -27 211 300 -144 -76 16 15 192 8 -198 176 12 -71 -2 -41 -302
6193 -302 27 -69 93 125 41 -119 -117 -41 -113 -152 -189 -56 47 -69 102 -327 69 -174 -137 46 -66 237 -334
6216 -334 226 -5 -63 -104 -295 172 -8 -33 131 164 308 107 30 -43 -89 29 298 -126 -107 136 -415 -84 102
6239 102 309 24 -204 148 221 85 212 -50 -82 262 95 -82 167 -282 -57 -202 -255 253 59 -164 182
$$ packed form
6122a96j06K48o5K29l37M47j26Mr9O3Nj96o9J92l1m5p4K02j83J85K73J0m27o8
6146a64k0L7J35J34j3K50l64j40K06k60K11q1L41n22J46rJ72K8M8l0j73j14L13
6169A31q5J56J30l31j00K23J2q6p7K38Q9m44O8R2jJ77j84k06L74j64q3O9l9k61
6193c02L29r6J62L2q4j60KP6p2l9l7J33J03j16J71m29L96k43L7J83j12L03n71
6216c34N60k31n8m1j91M67j80k5J64L3J44k01p7p3m6J18K69m24J9K43n51L31J86
6239A02K07k85k28L52P3j36J27k62l2L44j67j77K49m49K25j45n3N08j94k23L46
$$ [...]
8191c
##END NTUPLES=NMR FID
##END=
