##TITLE=1H_DE-46EA1_D2O
 D2O
 8 sc, 
 22.7.2024
##JCAMPDX= 6.0         $$ Bruker NMR JCAMP-DX V2.0
##DATA TYPE= NMR FID
##DATA CLASS= NTUPLES
##ORIGIN= UXNMR, Bruker Analytische Messtechnik GmbH
##OWNER= root
$$ XWIN-NMR		Version 3.5
$$ Mon Jul 22 15:54:20 2024 Russian Standard Time (UT+4h)  she@DPX200
##.OBSERVE FREQUENCY= 200.1308
##.OBSERVE NUCLEUS= ^1H
##.DELAY= (6, 6)
##.ACQUISITION MODE= SIMULTANEOUS
##.ACQUISITION SCHEME= undefined
##.AVERAGES= 8
##.DIGITISER RES= 18
##SPECTROMETER/DATA SYSTEM= spect
##.PULSE SEQUENCE= zg30
##.SOLVENT NAME= DMSO
##.SHIFT REFERENCE= (INTERNAL, DMSO, 0, 15.7039)
##AUDIT TRAIL= $$ (NUMBER, WHEN, WHO, WHERE, WHAT)
$$ ##TITLE= Audit trail, XWIN-NMR		Version 3.5
$$ ##JCAMPDX= 5.01
$$ ##ORIGIN= Bruker BioSpin GmbH
$$ ##OWNER= she
$$ F:/spectra/data/she/nmr/H-F/1/audita.txt
$$ ##AUDIT TRAIL=  $$ (NUMBER, WHEN, WHO, WHERE, WHAT)
(   1,<2024-07-22 15:53:01.43 +0400>,<she>,<DPX200>,
      <created by zg, POWCHK disabled, PULCHK disabled
       configuration hash MD5:
       00 E9 B6 7A A2 85 ED C7 34 08 36 98 17 FE 4E 26
       data hash MD5: 16K
       15 4E C4 8A C5 A2 9D 37 63 B7 2C F7 59 57 03 C8>)
$$ ##END=
$$ 
$$ hash MD5
$$ BC B1 A6 4E C1 7C 07 21 52 35 35 12 F0 FF CD 69
##$RELAX= 
##$RELAX= 
##$RELAX= 
##$RELAX= 
##$RELAX= 
##$RELAX= 
$$ Bruker specific parameters
$$ --------------------------
##$DU= <F:/spectra>
##$EXPNO= 1
##$NAME= <H-F>
##$PROCNO= 1
##$TYPE= <nmr>
##$USER= <she>
##$AMP= (0..31)
100 100 100 100 100 100 100 100 100 100 100 100 100 100 100 100 100 100 
100 100 100 100 100 100 100 100 100 100 100 100 100 100 
##$AQSEQ= 0
##$AQ_mod= 1
##$AUNM= <au_zg>
##$AUTOPOS= <>
##$BF1= 200.13
##$BF2= 200.13
##$BF3= 200.13
##$BF4= 200.13
##$BF5= 200.13
##$BF6= 200.13
##$BF7= 200.13
##$BF8= 200.13
##$BYTORDA= 1
##$CFDGTYP= 0
##$CFRGTYP= 5
##$CHEMSTR= <none>
##$CNST= (0..31)
1 1 145 1 1 1 1 1 1 1 1 1 1 1 1 1 1 1 1 1 1 1 1 1 1 1 1 1 1 1 1 1 
##$CPDPRG= <>
##$CPDPRG1= <>
##$CPDPRG2= <>
##$CPDPRG3= <>
##$CPDPRG4= <mlev>
##$CPDPRG5= <mlev>
##$CPDPRG6= <mlev>
##$CPDPRG7= <mlev>
##$CPDPRG8= <mlev>
##$CPDPRGB= <>
##$CPDPRGT= <>
##$D= (0..31)
0 1.2 0 0 0 0 0 0 0 0.06 0 0.03 0 0 0 0 0.0002 0 0 0 0 0 0 0 0 0 0 0 0 
0 0 0 
##$DATE= 1721649180
##$DBL= (0..7)
120 120 120 120 120 120 120 120 
##$DBP= (0..7)
150 150 150 150 150 150 150 150 
##$DBP07= 0
##$DBPNAM0= <>
##$DBPNAM1= <>
##$DBPNAM2= <>
##$DBPNAM3= <>
##$DBPNAM4= <>
##$DBPNAM5= <>
##$DBPNAM6= <>
##$DBPNAM7= <>
##$DBPOAL= (0..7)
0.5 0.5 0.5 0.5 0.5 0.5 0.5 0.5 
##$DBPOFFS= (0..7)
0 0 0 0 0 0 0 0 
##$DE= 6
##$DECBNUC= <off>
##$DECIM= 24
##$DECNUC= <off>
##$DECSTAT= 4
##$DIGMOD= 1
##$DIGTYP= 9
##$DL= (0..7)
0 120 120 120 120 120 120 120 
##$DP= (0..7)
150 150 150 150 150 150 150 150 
##$DP07= 0
##$DPNAME0= <>
##$DPNAME1= <>
##$DPNAME2= <>
##$DPNAME3= <>
##$DPNAME4= <>
##$DPNAME5= <>
##$DPNAME6= <>
##$DPNAME7= <>
##$DPOAL= (0..7)
0.5 0.5 0.5 0.5 0.5 0.5 0.5 0.5 
##$DPOFFS= (0..7)
0 0 0 0 0 0 0 0 
##$DQDMODE= 0
##$DR= 18
##$DS= 0
##$DSLIST= <SSSSSSSSSSSSSSS>
$$ [...]
##$SUBNAM2= <"">
##$SUBNAM3= <"">
##$SUBNAM4= <"">
##$SUBNAM5= <"">
##$SUBNAM6= <"">
##$SUBNAM7= <"">
##$SUBNAM8= <"">
##$SUBNAM9= <"">
##$SW= 24.0690372696642
##$SWIBOX= (0..15)
0 0 2 0 0 0 0 0 0 0 0 0 0 0 0 0 
##$SW_h= 4816.95568400771
##$TD= 16384
##$TD0= 1
##$TE= 0
##$TE2= 300
##$TE3= 300
##$TEG= 300
##$TL= (0..7)
0 120 120 120 120 120 120 120 
##$TP= (0..7)
150 150 150 150 150 150 150 150 
##$TP07= 0
##$TPNAME0= <>
##$TPNAME1= <>
##$TPNAME2= <>
##$TPNAME3= <>
##$TPNAME4= <>
##$TPNAME5= <>
##$TPNAME6= <>
##$TPNAME7= <>
##$TPOAL= (0..7)
0.5 0.5 0.5 0.5 0.5 0.5 0.5 0.5 
##$TPOFFS= (0..7)
0 0 0 0 0 0 0 0 
##$TUNHIN= 0
##$TUNHOUT= 0
##$TUNXOUT= 0
##$USERA1= <user>
##$USERA2= <user>
##$USERA3= <user>
##$USERA4= <user>
##$USERA5= <user>
##$V9= 5
##$VALIST= <valist>
##$VCLIST= <CCCCCCCCCCCCCCC>
##$VD= 0
##$VDLIST= <DDDDDDDDDDDDDDD>
##$VPLIST= <PPPPPPPPPPPPPPP>
##$VTLIST= <TTTTTTTTTTTTTTT>
##$WBST= 1024
##$WBSW= 4
##$XGAIN= (0..3)
0 0 0 0 
##$XL= 0
##$YL= 0
##$YMAX_a= 94386
##$YMIN_a= -100558
##$ZGOPTNS= <>
##$ZL1= 120
##$ZL2= 120
##$ZL3= 120
##$ZL4= 120
##$ABSF1= 10
##$ABSF2= 0
##$ABSG= 5
##$ABSL= 3
##$ALPHA= 0
##$AQORDER= 0
##$ASSFAC= 0
##$ASSFACI= 0
##$ASSFACX= 0
##$ASSWID= 0
##$AUNMP= <proc_1d>
##$AZFE= 0.1
##$AZFW= 0.1
##$BCFW= 1
##$BC_mod= 2
##$BYTORDP= 1
##$COROFFS= 0
##$CY= 11.3945322036743
##$DATMOD= 1
##$DC= 2
##$DFILT= <>
##$DTYPP= 0
##$F1P= 15.6554695791079
##$F2P= 12.8336369535428
##$FCOR= 0.5
##$FTSIZE= 0
##$FT_mod= 4
##$GAMMA= 1
##$GB= 0.15
##$INTBC= 1
##$INTSCL= 1
##$ISEN= 128
##$LB= 0.24
##$LEV0= 0
##$LPBIN= 0
##$MAXI= 10000
##$MC2= 0
##$MEAN= 0
##$ME_mod= 0
##$MI= 1.114404
##$NCOEF= 0
##$NC_proc= 0
##$NLEV= 6
##$NOISF1= 3.799351
##$NOISF2= 2.8
##$NSP= 1
##$NTH_PI= 0
##$NZP= 0
##$OFFSET= 15.70392
##$PC= 1
##$PHC0= -25640.91
##$PHC1= 11.58749
##$PH_mod= 1
##$PKNL= yes
##$PPARMOD= 0
##$PSCAL= 0
##$PSIGN= 0
##$REVERSE= no
##$SF= 200.130013532006
##$SI= 16384
##$SIGF1= 3
##$SIGF2= 2
##$SINO= 400
##$SIOLD= 16384
##$SREGLST= <1H.CDCl3>
##$SSB= 0
##$STSI= 0
##$STSR= 0
##$SW_p= 3612.71676300578
##$SYMM= 0
##$S_DEV= 0
##$TDeff= 0
##$TDoff= 0
##$TI= <>
##$TILT= no
##$TM1= 0
##$TM2= 0
##$TOPLEV= 0
##$USERP1= <user>
##$USERP2= <user>
##$USERP3= <user>
##$USERP4= <user>
##$USERP5= <user>
##$WDW= 1
##$XDIM= 8192
##$YMAX_p= 0
##$YMIN_p= 0
$$ End of Bruker specific parameters
$$ ---------------------------------
##NTUPLES= NMR FID
##VAR_NAME=  TIME,          FID/REAL,        FID/IMAG
##SYMBOL=    X,             R,               I
##VAR_TYPE=  INDEPENDENT,   DEPENDENT,       DEPENDENT
##VAR_FORM=  AFFN,          ASDF,            ASDF
##VAR_DIM=   8192,          8192,            8192
##UNITS=     SECONDS,       ARBITRARY UNITS, ARBITRARY UNITS
##FACTOR=    0.0002076,     1,               1
##FIRST=     0,             0,               0
##LAST=      1.7004516,     0,               0
##MIN=       0,             -100558,         0
##MAX=       1.7004516,     94386,           0
$$ Real data points
##PAGE= N=1
##DATA TABLE= (X++(R..R)), XYDATA
0@%%%%%%%%%%%JkOj3J6j6J6k1K9l2L6m4M9n7O6p5Q9j00J10j25J43j60J81k04K27
36A20k54K81l10L44l85M28m71N21n78O39p08P88q77R77j095J231j391J587j831
55i84K142k552L123l969N327j2047J03346j8079j18212j0156J6351N3094O8875
68H6259n3172j29232K5800J21465K4056o4390n4737j9474O0455Q6816l1470j12094
80e9718j5609P6942N8615p816p3414o0198N7388R3571j0692p7664m2634J9056
92d2173P5558M7068p4080q8770L9602Q6745J4402l9447o0855k6657P5045P6961
104H3399n2679r0771M043O2567M6327m716o9404n3204N4976Q4701j4348p4873
116b3982l5354K9417O7440K9489o6025o8228L1510O8733K2498l6007o8771j3510
$$ plain form
0 0 0 0 0 0 0 0 0 0 0 0 0 1 -1 5 -8 8 -8 8 -13 16 -16 20 -24 25 -32 34 -41 48 -52 58 -67 76 -84 97 -107 120
36 120 -134 147 -163 181 -204 224 -247 274 -304 335 -373 415 -462 515 -580 651 -740 847 -984
55 -984 1158 -1394 1729 -2240 3087 -8960 94386 76307 -41905 -52061 -35710 17384 86259
68 86259 33087 -96145 -70345 51120 75176 10786 -43951 -63425 -2970 83846 52376 -59718
80 -59718 -75327 1615 60230 52414 -21000 -81198 -23810 69761 59069 -18595 -61229 -42173
92 -42173 33385 80453 6373 -82397 -42795 43950 58352 18905 -41950 -68607 6438 83399
104 83399 30720 -60051 -56008 6559 52886 48170 -21234 -74438 -19462 65239 50891 -23982
116 -23982 -59336 -29919 37521 67010 985 -67243 -35733 33000 55498 19491 -49280 -62790
128f2790Q1388N3797n3622o4587K36M2898N2610K285q0182m8380O9087P0491k6035
141C7196n7431k7287J5210O6479L5405p1339p0140M0561P1101R331l9698n2499
153d3111r720O7751N4493m7638p2490L517N5041M3738j3766o8871l2266N8503
165d819O0590j7311n8633l3264K8611O8133J3923o9045m9395L6613N9299J3045
177D7747l8478n6524j929P2897M1129n3959n9220R058M7948L9059j3075o7812
189c3159k7375O1484N5260k4594n6749k2616L1351N7346Q952o2820m5108L7027
201b1001N7936P567m3168m7689Q346O4292K9168m8256n1396P315M8031L6259k1273
214B6131o1783j5568N7777M4024k4566m9773k0659L0452N5321K462o2467l4541
$$ plain form
128 -62790 18598 72395 18773 -45814 -45578 -2680 49930 52215 -27967 -76347 -7260 63231 37196
141 37196 -20235 -47522 -32312 34167 69572 -1767 -71907 -31346 39755 49086 9388 -43111
153 -43111 -52831 14920 69413 21775 -50715 -47198 7843 51581 37815 -31056 -63322 -4819
165 -4819 55771 38460 -20173 -53437 -24826 43307 57230 -11815 -61210 -24597 34702 47747
177 47747 9269 -47255 -49184 23713 64842 10883 -48337 -39279 8669 47728 34653 -33159
189 -33159 -60534 950 56210 31616 -25133 -47749 -16398 40948 49900 -12920 -58028 -21001
201 -21001 36935 44502 1334 -46355 -38009 26283 55451 7195 -44201 -36886 11145 47404 26131
214 26131 -35652 -51220 6557 50581 26015 -23758 -44417 -13965 41356 43818 -18649 -53190
226e3190L9219M9160M013l9657m3099J0300O1163K3054m8382m6171J1843M6315
238A4568K9485k2454n6239j0507N4271L8468k6024m7308j5927L2859M9507k731
250C7968n7970k7251L7646M4005R30l8861l9654J5191N7289J5950m7164l8653
262d0574J3811M2728K6394k5744n2504m709N3316L0689k6958m2720j1497L3099
274d669M4665p228n5080k1653L8286L9494l243l8036l3468J8183N3240J0382m6177
287e304l3087J5964M0198K1154k7469m8142J644N0111K5504k7300l9837p980L4369
300a75L9262j2682n0559j5283L7158L4997m905l7986k9547K3228M8272L605m3810
313h425k7658J6775L8333J7962l0076m3961P741M7781J8051k7396l4828o406L4856
$$ plain form
226 -53190 -13971 35189 39202 -455 -43554 -33254 27909 50963 2581 -43590 -31747 14568
238 14568 44053 21599 -34640 -45147 9124 47592 21568 -25740 -41667 -8808 40699 37968
250 37968 -20002 -47253 -9607 34398 35328 -3533 -43187 -27996 29293 45243 -1921 -40574
262 -40574 -26763 15965 42359 16615 -35889 -40598 12718 43407 16449 -26271 -37768 -4669
274 -4669 39996 32768 -22312 -43965 -5679 33815 30572 -7464 -40932 -22749 30491 40873 -5304
287 -5304 -38391 -22427 17771 38925 11456 -36686 -35042 15069 40573 13273 -26564 -34544 -175
300 -175 39087 26405 -24154 -39437 -2279 32718 27813 -10173 -39720 -16492 31780 35385 -8425
313 -8425 -36083 -19308 19025 36987 6911 -37050 -29309 18472 36523 9127 -25701 -32107 2749
326B749L6312j7599m8761p662L6660K9310o817l6348k6197K5191M6345k160m3284
339a2261k1548J8805L4545J4510l0081m0566J1282M6674J2614k9182l0707k090
351b8005L3280L1905j9557m5475m079L7214K5096j0303l4171k0614K5882M1284
363C2457m911m1350j8829K1124L3416R183l1617l4399J4519M1699R898k8737k9017
376b6564Q21L4858K6554k3347m0085K77L3937K2514j0485l4645j7726K9868L6754
389C2731j0311l8027j3849J9978L1635P287l2940l1487J8864L9517M580k8268
401b90k5524K665L4102K4000k5824l8484M960L3920J8310j2945l2342j4361L0224
414a589L4226j3033l7241j0337K2074K8467L525l2183k7585K0449L7492J669k8785
$$ plain form
326 2749 39061 21462 -27299 -34961 1699 31009 24192 -12156 -38353 -13162 33183 31023 -12261
339 -12261 -33809 -15004 19541 34051 3970 -36596 -25314 21360 33974 4792 -25915 -28005
351 -28005 5275 37180 17623 -27852 -31931 5283 30379 20076 -14095 -34709 -8827 32457
363 32457 27546 -13804 -32633 -11509 21907 31090 -527 -34926 -20407 21292 31190 2453 -26564
376 -26564 -25743 9115 35669 12322 -27763 -27486 6451 28965 18480 -16165 -33891 -4023 32731
389 32731 22420 -15607 -29456 -9478 22157 29444 -3496 -34983 -16119 23398 27978 -290
401 -290 -25814 -23149 10953 34953 9129 -29355 -24395 9525 27835 14890 -17452 -31813 -1589
414 -1589 32637 19604 -17637 -27974 -5900 22567 26092 -6091 -33676 -13227 24265 25934 -2851
427b851k3776O937L3508J8669k6973l4438O759L3244J6666j5851l1968r017L1722
440B631K8985j5236l4936q067K2917K8356j065l3990k1704K3271L3261q27k8209
453d613k1965R284L3986J3788k9261k9796J0122L0993J4145j7307l0965m922L2852
466F341K4348j8692l1149n579K3398K6425l682l4498j7341K5476K9442l909k6676
479f096j9628J0674L3821J0205l1378k6104J3890K8437J0861j6931k9664l362
491b5275L4342K1283k1793k9453m74K2012K3258m533l3679j5701K7427K8169p847
504A7736k6961j5249J2872L0197P980l0684k4034J4958K8863Q051j9340k6928
516b2539J198L1710J7985k1484k7368n65K4055K1652q272l2937j0490K7569K3828
$$ plain form
427 -2851 -26627 -19690 13818 32487 5514 -28924 -22165 11079 27745 11894 -20074 -29091 2631
440 2631 31616 16380 -18556 -26623 -3706 24650 23585 -10405 -32109 -8838 24423 23596 -4613
453 -4613 -26578 -17294 16692 30480 1219 -28577 -18455 12538 26683 9376 -21589 -26511 6341
466 6341 30689 11997 -19152 -24731 -1333 25092 21410 -13088 -30429 -4953 24489 20580 -6096
479 -6096 -25724 -15050 18771 28976 -2402 -28506 -14616 13821 24682 7751 -21913 -25275
491 -25275 9067 30350 8557 -20896 -21370 642 23900 19367 -14312 -30013 -2586 25583 17736
504 17736 -9225 -24474 -11602 18595 26575 -4109 -28143 -13185 15678 23729 4389 -22539
516 -22539 -21341 10369 28354 6870 -20498 -21063 2992 24644 16372 -16565 -27055 514 24342
529B4342q588k5223j4768J4300L0905L922l1832k0508J7226K6608N630j9155k5639
542b2780K890L2208J5251k3302k5892K845K3939J9280j0862l1289p420K7315K2060
555B4243r735k6275j2802J7970K8734j064l0327j5571J6682K4539N234k0957k5459
568b4788P505L3002R327k4655k0482L382K1653J9764j2632l2037l802K9897J7569
581B3703j2933k2665r853J6081K7809j960l1426j3290J9029K3042J349k0618k2033
594b3765R113L0867P068k3779j9890M494K4005J5839j5881k8699l7K7390J5133
607B1858j1937k2521r696J9889K6154p270k9820q886J8648K0388J610k1439k1382
620b4404J2168L0415L475k4617j7076O709K2313J3794j6415k7395K545K6806J3524
$$ plain form
529 24342 15754 -9469 -24237 -9937 20968 24890 -6942 -27450 -10224 16384 22014 2859 -22780
542 -22780 -19890 12318 27569 4267 -21625 -18780 5159 24439 13577 -17712 -25132 2183 24243
555 24243 14508 -11767 -24569 -6599 22135 21071 -9256 -24827 -8145 16394 21628 671 -24788
568 -24788 -17283 15719 25046 391 -20091 -16709 4944 24708 12076 -19961 -23763 6134 23703
581 23703 10770 -11895 -21748 -5667 22142 20182 -11244 -24534 -5505 17537 18886 -1732 -23765
594 -23765 -14652 16215 23283 -496 -20386 -15892 8113 23952 8071 -20628 -20665 6725 21858
607 21858 9921 -12600 -22296 -2407 23747 16477 -13343 -22229 -3581 16807 18417 -3022 -24404
620 -24404 -12236 18179 21654 -2963 -20039 -13330 8983 22777 6362 -21033 -18488 8318 21842
633B1842j3814k2127o847K1066K2939r074k7758p244J8486K0182l2k3131j8346
646b3858J5250K6993K48k2349j5470O292K3350J2850j9910k5291O433K5566R563
659A9667j2623k1585n729K2058K1402j1598k6860l847J8491J8100j971k2533j6230
672b3258J6030K5823j463k2478j3931Q419K2865R678k0134k2950P375K4489R212
685A9677j4362k1108k458K2163J8771j3252k4431l027J8262J7655l485k3547j2733
698b1875J7757K2640l125k1199j3423R866K2967O450k1260j9454R302K2569O914
711A8129j4090k0520j118K4114J5271j5542k1961j91J7534J5893m352k3863j0524
724b1220J9454K0745n904k0651j0155J0055K1232N069k1434j8415J1769K2149
$$ plain form
633 21842 8028 -14099 -20946 120 23059 13985 -13773 -21017 -2531 17651 17619 -5512 -23858
646 -23858 -8608 18385 18633 -3716 -19186 -12894 10456 23306 3396 -21895 -15462 10104 19667
659 19667 7044 -14541 -20270 1788 23190 11592 -15268 -19115 -624 17476 15505 -7028 -23258
672 -23258 -7228 18595 17132 -5346 -19277 -10858 12007 21685 1551 -21399 -14024 10465 19677
685 19677 5315 -15793 -18251 3912 22683 9431 -15000 -18027 235 17890 14405 -9142 -21875
698 -21875 -4118 18522 15397 -5802 -19225 -9359 13608 20058 -1202 -20656 -11354 11215 18129
711 18129 4039 -16481 -17599 6515 21786 6244 -15717 -15908 1626 17519 13167 -10696 -21220
724 -21220 -1766 18979 13075 -7576 -17731 -7676 13556 18625 -2809 -21224 -9455 12694
736A2694M065j4915j8109J322K2570J3208j6187k0506Q53J8640J3658o699k2130
749a1536p969J9394J9001p559j9846q597J1133K0415K770k1922j5306J2298K0538
762A2814K681j4701j7039K994K1814J1216j6412j9553L037J7739J2494q355k0732
775a2003o356J9798J6795q287j9353p077J2675J9007q5k1041j2753J2635J9126
788A3081J879j5780j5874M683K2240Q305j7421j7127M491J7133J0733q491k0939
801a3087m000K0299J4604r969j7815n138J2502J7707n55k1859j1169J4713J7631
814A3864n20j5543j3646N716K1092O735j7919j5954N992J6938R256j0150j9492
827a3631j866K0218J2680j0858j6710m208J3066J6823k904k1550q309J5084J5657
$$ plain form
736 12694 16759 1844 -16265 -14943 7627 20835 4648 -15858 -15005 3635 17293 10594 -11536
749 -11536 -19505 -111 18890 11331 -8515 -17112 -5979 14436 17206 -4716 -20022 -7724 12814
762 12814 15495 794 -16245 -13251 8563 19779 3367 -16186 -13149 4590 17084 8729 -12003
775 -12003 -18359 1439 18234 9947 -9406 -16483 -3808 15199 15114 -5927 -18680 -6045 13081
788 13081 14960 -820 -16694 -12011 10229 18534 1113 -16014 -11523 5610 16343 7852 -13087
801 -13087 -17087 3212 17816 7847 -9968 -15106 -2604 15103 14548 -7311 -18480 -3767 13864
814 13864 13344 -2199 -15845 -10129 10963 17698 -221 -16175 -10183 6755 16011 5861 -13631
827 -13631 -15497 4721 17401 6543 -10167 -14375 -1309 15514 12610 -8940 -17249 -2165 13492
840A3492j824j5048j2345P323K0212M336j8129j3613O877J6452P348j0778j8175
853a3872K64J9672J0748j1686j6261k368J3523J5287m786k0355o205J5219J4424
866A3604k578j5207j1190Q341J9544K038j8025j1874P913J5742O379j1959j7183
879a4455K309J9635Q115j2015j4750j266J3883J4116o743j9686l839J5097J2811
892A3212l462j5328r654R934J8490m39j7743r622Q722J4784N069j2453j6520M546
906a0464J9216N812j2835j3033J41J3614J2898p886j9385j596J5926J0721n149
919G980j4240q049J0571J7260j612j7627q499R858J3643L597j3432j4220O081
932h689J7420M567j2407j2506J292J4752J0648r823j7231m02J5743R268n663j3677
$$ plain form
840 13492 11668 -3380 -15725 -8402 11810 16146 -1983 -15596 -8719 7733 15081 4303 -13872
853 -13872 -13608 6064 16812 5126 -11135 -13503 20 15307 10521 -9834 -16039 -820 13604
866 13604 11026 -4181 -15371 -7030 12514 14552 -3473 -15347 -7434 8308 14687 2728 -14455
879 -14455 -12146 7489 15604 3589 -11161 -12427 1456 15572 8829 -10857 -14696 401 13212
892 13212 9750 -5578 -15232 -5298 13192 12753 -4990 -14612 -5890 8894 13963 1510 -15010 -10464
906 -10464 8752 14564 1729 -11304 -11163 2451 15349 7463 -11922 -13518 2408 13129 7980
919 7980 -6260 -14309 -3738 13522 11910 -5717 -14216 -4358 9285 12882 -550 -14770 -8689
932 -8689 8731 13298 891 -11615 -10323 4429 15077 5254 -11977 -12379 3364 12632 6969 -6708
946f708p286J2114J5580l518j7307o157J0015J2937K134j3178j3039O722J8066
959A0375K522j3537j1127K497J4401R147j0128j6370R38J5146Q983p062j4223
972h438m518J2786J3801m902j5922n368R952J3255Q35j4891j1165R437J5415J016
986A1293j2014j0666K777J5110P846j2547j4102L460J3945O982o815j3969l904
999a2604J4039J2435p159j5182k498R401J2035pj4730r787J0489J4824j196j2614
1013b554q911M170J4254O260j2815j3071M808J3911N181p348j3206k347J3871
1026B203J1427q296j4387j465J0422J0780j684j4092q341J0940J3587j970j2762
1039c638p638N573J3530M346j2466j2384N827J2924N191q707j2578o63J4093R094
$$ plain form
946 -6708 -13994 -1880 13700 10182 -7125 -13282 -3267 9670 11804 -1374 -14413 -7691 10375
959 10375 12897 -640 -11767 -9270 5131 14278 4150 -12220 -11282 3864 12847 5785 -8438
972 -8438 -12956 -170 13631 8729 -7193 -12561 -2609 10646 11481 -3410 -14575 -5138 10277 11293
986 11293 -721 -11387 -8610 6500 14346 1799 -12303 -8843 5102 12084 5269 -8700 -12604
999 -12604 1435 13870 6711 -8471 -10969 -1568 10467 10460 -4270 -14057 -3568 11256 10060 -2554
1013 -2554 -11465 -7295 6959 13219 404 -12667 -7859 6052 11233 3885 -9321 -11668 2203
1026 2203 13630 5334 -9053 -10518 -96 10684 9000 -5092 -13433 -2493 11094 9124 -3638
1039 -3638 -11276 -5703 7827 12173 -293 -12677 -6850 6074 11265 2558 -10020 -10683 3410 12504
1053A2504q361j2967j304J0668J0722l040j4714o105J1401J1707k327j1661p786
1066a1263N764J4001L416j3666j0454O080J2730L896q122j2704L1J5068P970r761
1080B986j2241L2J0290J0020l599j5110m780J2692J0977l907j1828o052O150J3654
1094I284J655j3902r446Q077J1761K317q956j1188J298J4502O983j0741j1426
1107i782J171J1029Q113m568j4347l185J2645J0315n337j1679n100P534J3042
1120I851oj4194p525Q326J1434J444r507j0632L347J4173M800j1050j0081K139
1134g481J0930P139n903j3584j335J2750P925n288j0519m930Q145J2245j753j3547
1148e206n402Q364R875J270r588j0031M258J4035L257j1501q649K654J0026P268
$$ plain form
1053 12504 4143 -8824 -10128 540 11262 8222 -6492 -12597 -1196 10511 8184 -3477 -11263
1066 -11263 -5499 8502 11918 -1748 -12202 -6122 6608 10504 2382 -10322 -10291 4777 12747 2986
1080 2986 -9255 -9223 1067 11087 7488 -7622 -12402 290 11267 7360 -4468 -10520 -4370 9284
1094 9284 10939 -2963 -12409 -4332 7429 9746 790 -10398 -9100 5402 12385 1644 -9782
1107 -9782 -8611 2418 10531 5963 -8384 -11569 1076 11391 6054 -5625 -10725 -3191 9851
1120 9851 9845 -4349 -11874 -3548 7886 9330 -177 -10809 -7462 6711 11511 461 -9620 -7481
1134 -7481 3449 10588 4685 -8899 -10234 2516 10441 5153 -5366 -10296 -2151 10094 8341 -5206
1148 -5206 -10608 -2244 7631 8901 -687 -10718 -6460 7575 10832 -669 -9318 -6664 3362 10630
1162A0630o373j3345m33J3039O834o006j0168m008Q433J1577k288j3694m843R232
1176a413R467j51r477q832M450J4032J926j1389p921L272R953O407o862j3354
1190i892R94J3067N957o871r687k705Q352J0941k810j3884l755R609Q851p46r684
1205b263q329N689J3579R81j1793p848M774J0152N089q003j1705K079J2207N444
1219A0053o985j0277j641R831R248m813j2294k208Q978Q204j083j0121p498P430
1233c176J2119o90j0978o081M014J0296M324q786j1101L281J2008M473p842r012
1247g151j327J0253Q614n646j1942j462R387P898k261j0672n649P750J1172j777
1261G187j0313n909N010J0244L459j0135r462M595J1129K417o842q780p12J0430
$$ plain form
1162 10630 4257 -9088 -9521 3518 10352 4346 -5822 -9830 -1397 10180 7892 -5802 -10645 -1413
1176 -1413 8054 7903 -1574 -10406 -5956 8076 10002 -1387 -9308 -6036 3917 10324 3462 -9892
1190 -9892 -8898 4169 10126 3255 -6432 -9137 -785 10156 7346 -6538 -10293 -684 8167 7421 -2263
1205 -2263 -10592 -4903 8676 9657 -2136 -9984 -5210 4942 10031 2028 -9677 -7598 4609 10053
1219 10053 3068 -7209 -8850 981 10229 5416 -6878 -9086 -108 8096 7013 -3108 -10606 -3176
1233 -3176 8943 8253 -2725 -8806 -4792 5504 9828 1042 -10059 -6778 5230 9703 1861 -7151
1247 -7151 -8478 1775 10389 4743 -7199 -8661 726 8624 6363 -4309 -9958 -2208 8964 7187
1261 7187 -3126 -9035 -4025 6219 9678 -457 -9919 -5324 5805 8222 1380 -7400 -8112 2318
1275B318Q361p330j1219K08R007O738k326r954n777Q169J1089k483j1385l680
1289h264N078R361K456r368r285M611J1366K492p966p832M19J0404O178o884j0519
1304g753M12R343O600l751j0196l700Q781R558l475j0137l906N465R551J578j0014
1319a644q254O138J0295J138p861p306J185J0092N711p612r855J116R700N479
1333H322m293r783k851Q774Q777l733r900l675O462Q972L19j0121o405O345R229
1348F439Q88p727p514K126J0408M272p999q805K203Q379N343m483r566k352R404
1363A016P856m786r278k355O389Q068L40j0230o434P186R193k78p883o441K639
1378d998J0029L745q597q174K552Q826M629n118q996j473R445O730n073r045j649
$$ plain form
1275 2318 10679 3349 -7870 -7662 1345 8083 5757 -4197 -9974 -1805 9284 6801 -4584 -8264
1289 -8264 -3186 6175 8631 -737 -10022 -5411 5955 8447 481 -7351 -6932 3472 9650 2766 -7753
1304 -7753 -7341 2002 8602 4851 -5345 -9045 -264 9294 5819 -4318 -8224 -2759 6792 8370 -1644
1319 -1644 -9898 -3760 6535 7673 -188 -7494 -6309 3783 9494 1882 -7973 -6857 2843 8322
1333 8322 4029 -5754 -8605 169 8946 5213 -4687 -8362 -1900 7072 7391 -2730 -9135 -2790 6439
1348 6439 7327 -400 -7914 -5788 4620 8892 893 -7912 -5709 2670 8013 3530 -6036 -8388 1016
1363 1016 8872 4086 -5192 -7547 -1158 6910 7250 -2980 -9414 -2228 6965 6687 -1196 -7637 -4998
1378 -4998 5031 8776 179 -7995 -5443 3383 8012 2894 -6102 -7575 1870 8600 3527 -5518 -7167
1393g167O465P780p83j0606m177O855Q578p56p562o185L401R484K424q555o934
1408g738L178Q129L903n334q348o17R568N443n546q148j323O881P339j978r858
1423d449l620P428P410j181p648n703M378R199J647q656o336L764P951K813n619
1438A378q167M57R616M455n696p808n07O704P092k782r788k511P835O486j941
1453D823p514m738M242R421N63q669n300L933P566K526n734p958J067R488L712
1468G428o023o952k55O900O148l093r591j623P717O133k367p473l897M625Q898
1483F575n57q253m803M673O785K160o441p472K495R000K707o373o195N16O915
1498A732N549m215q617r50P605N612k990p114l509N374Q109q13q992l383M503
$$ plain form
1393 -7167 -702 7078 6295 -4311 -8488 -1633 6945 6189 -1373 -7558 -4157 5327 7751 -804 -7738
1408 -7738 -4560 3569 7472 2138 -6210 -6827 2741 8184 2638 -5510 -6833 48 7387 5409 -4449
1423 -4449 -8069 -641 6769 5588 -2060 -7763 -3385 5814 7461 -1195 -7531 -3767 4184 6997 1378
1438 1378 -6789 -6332 3284 7739 2043 -5765 -6272 432 7524 4742 -5046 -7557 278 6764 4823
1453 4823 -2691 -7429 -3187 6234 6797 -1872 -7172 -3239 4327 6853 1119 -6839 -5772 3716 7428
1468 7428 1405 -5547 -5802 1098 7246 4153 -5438 -7061 656 6789 4422 -3051 -6948 -2323 6575
1483 6575 6018 -2235 -7038 -2365 4420 6580 139 -7333 -4838 4162 6869 496 -5699 -5183 1732
1498 1732 7281 3066 -5551 -6501 1104 6716 3726 -3388 -6897 -1523 6586 5773 -3219 -6602 -2099
1513b099O989J270o572o835L422Q628K035o565o069J223O626N236m998q112l03
1528f124P694M506k835o561l123N682P521j904q410k951N170O302N46o463o067
1543g017L795Q191J266o247n909J787O739M466n360p584N91P242M067l433o616
1558d022k121N812P086k671p692k624N045N973L35o756n171M415P426O02o457
1573h20n086K018P130L513n652p328J553P428L224l489o593j899O838N658l173
1588C322p472j379M906N429K31p171m882M881P439m56n808m602K044P165L011
1603F658o420o724K460O981K689l827o293j228P157N074l863p298k28M814M905
1618D857m51p223l976N291P152j229o207l548K382O935K065o330o185K747O943
$$ plain form
1513 -2099 4890 6160 -412 -7247 -3825 4803 6838 273 -5796 -4573 2053 7289 2291 -5821 -6124
1528 -6124 1570 6076 3241 -3320 -6443 -761 6760 4856 -3554 -6505 -1335 4967 5513 -950 -7017
1543 -7017 -3222 4969 6235 -12 -5921 -4134 2605 7071 1711 -5873 -5282 1960 6027 2594 -4022
1558 -4022 -6143 -331 6755 4084 -3608 -6232 -1187 4786 5121 -1635 -6806 -2391 5035 5637 -820
1573 -820 -5906 -3888 3242 6755 1103 -6225 -4672 2756 5980 2491 -4102 -6001 837 6495 3322
1588 3322 -4150 -5529 -623 4806 5037 -2134 -7016 -2135 5304 4848 -960 -5562 -3518 3647 6658
1603 6658 238 -6486 -4026 2955 5644 1817 -4476 -5704 1453 6527 2664 -4634 -4862 -48 4857
1618 4857 4406 -2817 -6793 -1502 5650 4421 -1786 -5334 -2952 3983 6048 -282 -6467 -3720 3223
1633C223K045l656o326l72O765M884m253o926l37N223N146j325p164k995N183
1648h85O374j229o368l260K928O492J523o416n323L243O616J783m826n677L20
1663d705O753M233m556o501j44N867M323k085o613k406N667N702j977o082k510
1678e034K948O541Q51o666m677L530O091J575m707n746J251O723L222m649o028
1693d775M66N383M271k169o887k114O070N331k386n995k431L867N849L86o862
1708a996l511L623N614J133m767n181J379P002K313m994n487J010N683L541k810
1723B552o535j299O258M404k715n452k206L913N800N2p099l350M196N292O94m857
1739c52n001J769P199J824n379m902J092N519L768l456o499m58O337L922l362
$$ plain form
1633 3223 5268 1612 -4714 -5086 1679 6563 2310 -4616 -4953 270 5416 4091 -3073 -6068 -885
1648 -885 5489 4260 -2108 -5368 -2440 4052 5575 -841 -6164 -2921 3695 5478 652 -5025 -4705
1663 -4705 2048 6281 1725 -4776 -4920 947 5270 3185 -3428 -5834 -167 5535 3558 -2524 -5034
1678 -5034 -2086 4455 5306 -1360 -6037 -2507 3584 5159 452 -5294 -4043 2680 5902 1253 -4775
1693 -4775 -4309 1074 5345 3176 -3711 -5825 245 5576 3190 -2805 -5236 -1369 4480 4866 -1996
1708 -1996 -5507 -1884 3730 4863 96 -5085 -3706 3296 5609 615 -4872 -3862 1821 5362 2552
1723 2552 -3983 -5282 976 5380 2665 -2787 -4993 -1080 4720 4772 -2327 -5677 -1481 3811 4505 -352
1739 -352 -5353 -3584 3615 5439 60 -4842 -3750 1769 5537 2081 -4418 -4876 1461 5383 2021
1754B021m686k118M095N638r47o489k914M602N027P2n170m284K191O633J164n046
1770b11m501J697N443K799l799n926j32O219L467l118n240j143M260N084j616
1785C283o593j602M146M547J0n114m178L178O507L12n268l772J668N280K461l833
1801A032n590M77O187L029l670m707j106M603M909k044o277j624M592M460o18
1816C653n418l363L410N703K13n263l493K117N089K421m526n420J286O140K063
1831D612l197m809n75M548M579k594o224j018M859L699o46n032l187L736N555
1846D306j36n816l058K594M846J684m518m904K154N445J758l523m395m83N019
1861I73L877k542o012n54M771L560r55n113k909M306N221q30n451k423K160N125
$$ plain form
1754 2021 -2665 -4783 -688 4950 4003 -2486 -5400 -798 4229 4301 -869 -5153 -2962 3671 4835 -211
1770 -211 -4712 -3015 2428 5227 1428 -4498 -4630 1589 5056 1938 -3302 -4445 -185 4899 3283
1785 3283 -3310 -4912 -766 3781 3791 -1323 -5501 -2323 4184 4496 -772 -4544 -2876 2404 4865 1032
1801 1032 -4558 -4081 2106 5135 1465 -3242 -4348 255 5164 3120 -3157 -4781 -189 4271 3653
1816 3653 -1765 -5128 -1718 3985 4198 -1065 -4558 -2441 2648 5069 543 -4877 -3591 2549 4612
1831 4612 1415 -3394 -3969 579 5158 2564 -3660 -4678 181 3880 3234 -1798 -4985 -1249 4306
1846 4306 4170 -1646 -4704 -2110 2736 4420 -98 -5002 -2848 2597 4355 832 -3563 -4046 973
1861 973 4850 2308 -3704 -4258 513 4073 3118 -1995 -4904 -598 4623 3793 -1658 -4081 -1921 3204
1877C204J249m728m446J860N899J117l537m279L2M935L524k949n672l60M978L287
1893D114j632m911k494M316M996j087m948k660K691M876R02m419m662K585N236
1908B903J109l880l918L37M961L364l484n439O72M654K891k172m440j932M423
1923D9M299j433m977j827K986M466O85n374l485K881M938L80l412l903Q52M896
1939B021K521l487n161Q47M697L000k341m971j245M375M151k240m842j050K771
1954i54M469J20n034l066L071M635K47l785l552J198N039K186m332m235J420M169
1970A596K117j709n160p56M529L665k474m446j320L484L955J74n335l057L980
1985g57M107k04l681l243J582M702J635m114m235J773M424J703k700m338k65M805
$$ plain form
1877 3204 4453 -275 -4721 -2861 3038 4155 618 -3661 -3629 1306 4830 1881 -3791 -4151 827 4114
1893 4114 2482 -2429 -4923 -607 4389 3302 -1646 -4306 -1615 3261 4163 -256 -4918 -2333 2903
1908 2903 4012 132 -3786 -3449 1512 4876 1392 -4047 -3375 1279 4170 1998 -2442 -4374 49
1923 49 4348 2915 -2062 -3889 -903 3563 4248 -1126 -4611 -1730 3208 3588 176 -3727 -2875 2021
1939 2021 4542 1055 -4106 -3259 1438 4438 2097 -2874 -4119 256 4407 2167 -2675 -3725 -954
1954 -954 3515 3635 -1399 -4465 -1394 3241 3488 -297 -3849 -2651 2388 4574 242 -3993 -2573 1596
1970 1596 3713 2004 -3156 -3912 617 4282 1808 -2638 -3958 -474 3481 3655 -1680 -4737 -757
1985 -757 3350 3146 -535 -3778 -2196 2506 4141 27 -4208 -2435 1989 3692 992 -3346 -3611 1194
2001A194L171k734m404j054L462M005p10n210j973L467M322l19m306k814J744
2016b159M902J222m498l459J913L953K155l242m294K10M665K813l074l763n56
2031c212L396L769j171n031j984M130L653j067l717k429J870M591O42m078l291
2046c929J845M148J384k729l998K10M599K546k979l853k72L420L000j172m777
2061b557j246L528L869j388l501k582K434M631O7m273k776K411L684J145l052
2076C94l818Q47M610J708l030l769Q9L594L233j861m831o13L640L053r97l614
2092a365j980K433M353j76m563k349K532L363J082l425l401J024M721J201l093
2107C57l524M46L520L157k531m345l52L951K581r57m113j860L016L886n24m222
$$ plain form
2001 1194 4365 1631 -2773 -3827 -365 3640 2930 -2280 -4253 -786 3536 3217 -1089 -3903 -2159
2016 -2159 2743 3965 -533 -3992 -2079 1874 4029 787 -3507 -3297 1368 4181 1107 -2656 -3212
2031 -3212 184 3953 2782 -2249 -4233 -103 3550 2483 -1234 -3663 -1793 2798 3440 -638 -3929
2046 -3929 -2084 2064 3448 719 -3279 -3069 1530 4076 1097 -2756 -3028 392 3392 2220 -2557
2061 -2557 -3803 -275 3594 2206 -1295 -3877 -1443 3188 3255 -1018 -3794 -1383 2301 3446 394
2076 394 -3424 -2577 2033 3741 711 -3058 -2969 625 3858 1997 -2834 -3447 193 3246 2249 -1365
2092 -1365 -3345 -912 3441 3265 -1298 -3647 -1115 2248 3330 -95 -3496 -2472 2249 3450 357
2107 357 -3167 -2721 799 3956 1425 -2920 -3272 679 3260 2303 -1810 -3670 -654 3232 2708 -1514
2123a514j844K571L101N54k841l787J645M606N37l215k478M70L523K452k478m706
2139c404M31L892K403j560l570j827L342L512p48l910k037K838L395J55l317k940
2155c345J540M288P66l621k556O48L519K278k785l919P70L616J876j944l203j059
2171c131L155L483j368m502p90K594L130p1l357k673J939M151L04l145k752R86
2187b047L854J528k795l877R03L565K263k665l002q10L535K732j102l984j226
2202c128K852L061m16l609k200K402L857k63l236k053J318L044J480k959l497
2217c347R26L825J541k001l491o9K987L108j819l901n84K697L021n80l738k264
2233c689L110L203j33l327j997J192L368J288l015l115J127L771J213k332l154
$$ plain form
2123 -1514 -3358 -787 2314 2868 27 -3760 -2115 2491 3028 -187 -2665 -2195 1328 3780 1302 -3404
2139 -3404 -2973 919 3322 1762 -1808 -3635 -293 3219 2471 -1439 -3476 -638 2757 2912 -405 -3345
2155 -3345 -1805 2483 3249 -372 -2928 -2280 1239 3517 732 -3187 -2417 1199 3075 1131 -2072 -3131
2171 -3131 24 3507 2139 -2363 -3153 -559 2571 2500 -857 -3530 -1591 2560 2864 -281 -3033 -2047
2187 -2047 1807 3335 540 -3337 -2434 1131 3394 729 -2273 -3083 452 3184 2082 -1902 -3128
2202 -3128 -276 2785 2369 -1240 -3440 -1038 2819 2556 -680 -2733 -1415 1629 3109 150 -3347
2217 -3347 -2421 1404 2945 944 -2547 -2616 371 3479 1660 -2241 -2825 -128 2893 2313 -1425 -3689
2233 -3689 -579 2624 2491 -836 -2833 -1641 1727 3015 0 -3115 -1988 1783 2996 664 -2490
2248b490n8L417K605k331l566k46K888K780o27l948j778L028L100o58l200j907
2264b991J826L585Q40l444k985J395L695Q94k377k969K2L709K098j999l769j45
2280b615K880K637j028l514j596L224K707o13l526j218J673L239N39l417k532
2295c160J704L417N25k373k777J64L651K039k537l028JK869K369j446l491j149
2311c222L736K668j658k980j254K228K860K57l546k133J999K734P24k301k764
2326b652O55L567J515k641k970M28L128J687j259l790m48L065K702j340l130j553
2342c036K416L432n70l274k286K356K899L29k343k860Q77L742J248k650k842L45
2358b217L083K082j817l387n48L463K344j571k790j552K353L139m71l667j330
$$ plain form
2248 -2490 -2548 869 3474 1143 -2423 -2669 219 2999 2372 -1576 -3354 -326 2774 2116 -1084 -2991
2264 -2991 -1165 2420 3260 -184 -3169 -1774 1921 2815 438 -2531 -2509 1200 3298 1299 -2470 -2615
2280 -2615 265 2902 1874 -1640 -3236 -12 2695 2082 -1444 -2662 -989 2250 2789 -628 -3160
2295 -3160 -1456 1961 2486 113 -2664 -2500 1151 3190 653 -2375 -2374 495 2864 1418 -2073 -3222
2311 -3222 514 3182 1524 -1456 -2710 -482 2378 2635 -911 -3044 -1045 1689 2413 112 -2652
2326 -2652 -1997 1570 3085 444 -2526 -2098 1030 2717 1458 -2332 -2780 285 2987 1647 -1483 -3036
2342 -3036 -620 2812 2242 -1032 -3318 -962 1937 2266 -77 -2937 -2060 1682 2930 280 -2562 -2217
2358 -2217 866 2948 1131 -2256 -2804 659 3003 1432 -1358 -2910 -557 2582 2111 -1556 -2886
2373b886K101K995R6k421k691J092L998L26k825k438P01L184J611j900l487J67
2389b377L080J974j611k715q36K160L006m79l805j308K351K778k36k600j830R92
2405a456L592L39k687k188P84K847J546k177k925Q5L067J684j674k745l00K503
2421B95K573q39l685j121K470K797n23k838j879J516L199P83l376j957J177K495
2437A087J844k286l355R52K768J380j432l144q6K468K415j233k999j040K660K600
2453B599p08k506j994J505L257R2l098j734J399L082Q18k325k931M08L401J199
2469B464j735k834k03K730K444j556k882j069K924K187q36k858j359J891L124
2484B432j2l350j497J574K668N17k423k596J089K875J172k221k363OK561K290
$$ plain form
2373 -2886 -785 2210 2306 -115 -2806 -1714 2284 2610 -215 -2653 -1952 1232 2843 943 -2544 -2377
2389 -2377 703 2677 1066 -1649 -2485 -325 2681 2202 -1603 -2911 -560 2218 1982 -618 -2448 -1456
2405 -1456 2136 2475 -212 -2400 -1616 1231 2777 600 -2325 -2240 827 2511 837 -1908 -2208 295
2421 295 2868 2029 -1656 -2777 -307 2490 1967 -871 -2750 -1234 1965 2748 -628 -2585 -1408 1087
2437 1087 2931 645 -2710 -1758 1010 2390 958 -2186 -2272 196 2611 1378 -1621 -2661 -1 2599
2453 2599 1891 -615 -2609 -1104 2153 2245 -853 -2587 -1188 1894 2712 387 -2544 -2136 1265 2464
2469 2464 729 -2105 -2308 422 2866 1310 -1572 -2641 283 2470 1634 -1224 -2583 -692 2432
2484 2432 2420 -930 -2427 -853 1815 2332 -91 -2687 -1598 1277 2449 228 -2135 -2129 432 2722
2500B722j371l586j29K753J811r31k769j325K359K707l78k837j610J599K789M73
2516B277k385k738J455K822N55j424k805J99K674J937j626l189PK986J387n88
2532A544k905j275K498K908j201k923r32J439K754K43k268k814K017K794L98k520
2548b43j817Q5K706J885k022k716r9K650J815q77k542j383K596K347j256k616
2564a487r54K149K214J23k804j639J336K942J66j798k403K94L027J333k255k221
2580a977J91K408J546j129k489r96K437K446j079k608p13J837K103q8k532j967
2596b610J391L259k83j965j978P47K615J177k241k351O18K409J646j688k406n64
2612b224K435J960j231k475n18J430K297m6k659j303J685K596j49k303j892J255
$$ plain form
2500 2722 1351 -2235 -2364 389 2200 1269 -1500 -2825 -466 2241 1863 -974 -2584 -985 1804 2277
2516 2277 -108 -2846 -1391 1431 1986 562 -2243 -2044 630 2567 941 -2248 -2241 745 2132 1544
2532 1544 -1361 -2636 -138 2770 1569 -1354 -2286 -847 1907 2150 -118 -2932 -915 1879 2277 -243
2548 -243 -2060 -1975 731 2616 594 -2122 -2221 429 2244 1367 -1175 -2558 38 2385 1129 -1487
2564 -1487 -2441 -292 1922 2045 -759 -2398 -1062 1880 2046 248 -2155 -1861 1166 2499 244 -1977
2580 -1977 -1786 622 2168 1039 -1450 -2446 -9 2437 1358 -1250 -1963 -126 1977 1889 -643 -2610
2596 -2610 -1219 2040 1757 -208 -2186 -1439 1176 2353 112 -2239 -1621 788 2434 746 -1660 -2224
2612 -2224 211 2171 940 -1535 -2053 -623 1674 1628 -1031 -2334 -649 1947 1798 -505 -2397 -1142
2628a142K503O57k194k161P35K536J213j466k508l13K758J755j633k293l69J883
2644c9K177n00k836j388K350K069k07k515j206J256K535L92k224k162Q37K510
2660A049J055j398k529l45L270J140j505k060o44J936K009m85k692j071K215J954
2676A899m44k006j568J420K329J46k202j825P03L011O63j607k642K35L046R66
2692B124j561k041m13K082K006j016k770n74J928K062k80k573q51Q99K532M85
2708B039k727j679J412K182N07j570k446Q65K459J091j866j784k00K077J902r89
2724A273k812p37K611J727o97k288j114J197K606M9k692j031J295K005L82j892
2740a18j744N49K487Q15j694j960J65J975J539j232k412l34K117J517m89k277
$$ plain form
2628 -1142 1361 2018 -176 -2337 -1602 934 2147 681 -1827 -2140 618 2373 740 -1553 -1922 -39
2644 -39 2138 1638 -1198 -2586 -236 1833 1626 -889 -2095 -839 1696 2088 -136 -2298 -1461 1049
2660 1049 2104 706 -1823 -2168 1102 2242 737 -1323 -1967 -31 1978 1493 -1199 -2270 -55 1899
2676 1899 1455 -551 -2119 -699 1630 1776 -426 -2251 -1548 1463 2126 519 -2123 -1888 1158 2124
2692 2124 563 -1478 -1891 191 2197 1181 -1589 -2163 -235 1827 1547 -1026 -1877 -978 1554 2039
2708 2039 -688 -2367 -955 1227 1734 164 -2282 -1417 1042 2133 267 -1517 -1717 360 2262 1273
2724 1273 -1539 -2276 335 2062 1365 -923 -2037 -840 1766 1815 -877 -1908 -613 1392 1774 -118
2740 -118 -1862 -1313 1174 1989 295 -1665 -1500 475 2014 782 -1630 -1964 153 1670 1181 -1096
2756a096j063J708K769n16k798q66J138K395J56j941k014J084K298M41j575j565
2772a445j01K121J099j104k051l63K552J258q92k105j045J863K090l57k411r63
2788a854J494J890K43k090j894J357K639L2j912j980J015J681J188j123k008l90
2804a712K536J223j468j674r38J878K350r49k349r59J710J656K89j961j638J080
2820i26K456N4k019j397L87K462Q75j793k104P85J714J493j149j928o07J958J704
2837A965j126j817r50J849J801q4k073j310J310J975m7j826j447O22J982R42j813
2854d7j528N98J809Q03r86j963n28J915J849r63j963q66J978J450r7k162j351
2871b052J790J942j78j863j151O49J997N00j415k138R18J889P95j036k217k64
$$ plain form
2756 -1096 -2159 -451 2318 1802 -996 -1862 -724 1671 1827 -114 -2128 -1044 1254 1695 120 -1445
2772 -1445 -1546 575 1674 570 -1481 -1844 708 1966 1074 -1031 -2076 -213 1877 1520 -891 -1854
2788 -1854 -360 1530 1773 -317 -2211 -854 1785 1817 -95 -2075 -1060 621 1809 686 -1322 -1712
2804 -1712 824 2047 579 -1095 -2033 -155 2195 1246 -1103 -2062 -352 1304 1593 -368 -2006 -926
2820 -926 1530 1584 -435 -1832 -1445 1017 1892 99 -2005 -1220 494 1987 838 -1090 -1697 261 1965
2837 1965 839 -978 -1928 -79 1722 1638 -435 -1745 -435 1540 1493 -333 -1780 -1158 824 1766 -47
2854 -47 -1575 -977 832 1635 649 -1314 -1842 73 1922 959 -1004 -1870 108 1558 1461 -701 -2052
2871 -2052 -262 1680 1502 -361 -1512 -863 1134 1634 219 -1919 -1001 888 1683 647 -1570 -1834
2887a834K225J844j519k001JJ441J503k09k508r71J503K098r3j852j445O37K582
2904A402N07j995j796P29K219R69j538j874m26K155J537j232k460K98J494J648
2920A637n41k259n74J452J802l83j777j043R26J924O63k377r73M56K462K57j395
2937B57j821K60K014J186j808j360k9J558J548j285j539n38J681J537q67j523
2953g29r48J355J800K00k247j058O16K310Q3j514j577N82J781J264j566j930l5
2970a613J739J469p13j713j001J783J715p45j753m40R33J740j03j903j395J546
2986d54J688L41j347j595L27J995O91j263k017L40J646J391p38k000m10J570J479
3003A644o86j917n70J219J496K08k230o74J067J546K22j340j499P26J860Q72j922
$$ plain form
2887 -1834 391 2235 716 -1285 -1284 157 1660 1451 -1057 -2028 -525 1573 1480 -372 -1817 -1180 1402
2904 1402 1909 -86 -1882 -1153 1066 2035 497 -1377 -1803 352 1889 657 -1803 -1505 -11 1637
2920 1637 1096 -1163 -1737 -285 1517 1134 -643 -1686 -760 1164 1827 -550 -1523 -1067 1395 1652 257
2937 257 -1564 -1304 710 1896 88 -1272 -1301 257 1805 520 -1019 -1557 124 1661 794 -729
2953 -729 -1677 -322 1478 1678 -569 -1627 -1011 1299 1382 -132 -1709 -1127 654 1918 352 -1578 -1613
2970 -1613 126 1595 882 -831 -1832 -49 1666 921 -832 -1272 -339 1401 1298 -605 -2000 -454
2986 -454 1234 1575 228 -1367 -1040 955 1646 383 -1634 -1294 352 1743 1005 -995 -1405 165 1644
3003 1644 958 -959 -1529 -310 1186 1394 -836 -1510 -443 1103 1325 -15 -1514 -788 1072 1944 22
3020B2j750M76K098O49p42k320J90J820J332j120j490n56J384J696o93j977p40
3037a721J677R69L37j690j335Q93K007K06j653r29M29J432J006j176j712l05K115
3054E50O86q37j360k34J138J800l45k609m39J271J780j84j821r50Q90J751M39
3071A526j845j230Q62J514O46j027j946L07K018O21j199j235k77J759R51n85j823
3088i63o76J767J485m48j598j160J143J421J64j527q50N17J507Q49j406j567j
3105a343J969P36j095j476K59J319J458j239j796j48J611J310m65j691p71R14
3121d48J670L4k076n78O14J591M53j077j883R92J278O78j071j317j76J967R39
3138A590r45j892p8J556R16k03j759o36J011K012o42j715n05Q85J220N40j480
$$ plain form
3020 22 -1728 -1252 846 1495 753 -1567 -1377 443 1775 655 -835 -1391 -7 1689 996 -981 -1721
3037 -1721 -44 925 1262 -428 -1763 -870 1137 1343 -310 -1239 -810 622 1628 452 -1260 -1565 550
3054 550 1236 399 -961 -1195 -57 1743 1398 -1211 -1650 -379 1401 1217 -604 -1554 -664 1087 1526
3071 1526 -319 -1549 -687 827 1473 446 -1500 -1193 825 1446 247 -988 -1265 494 1445 860 -963
3088 -963 -1639 128 1613 1165 -433 -1593 -450 971 1135 -392 -1242 -725 782 1631 225 -1342 -1343
3105 -1343 626 1362 267 -1209 -950 369 1827 588 -1208 -1356 255 1565 1100 -591 -1362 -448
3121 -448 1222 1256 -820 -1398 -784 807 1260 183 -1700 -708 570 1248 177 -1140 -1316 651 1590
3138 1590 645 -1247 -1325 231 1147 944 -815 -1451 -440 1572 930 -785 -1290 -405 815 1355 -125
3155a25j491N37J955L40j079j348R5J833O81r71j761J34J766O42m10j529p27J358
3173a00J547m63j608o90R68J488J77j576j120Q37J647J26j113j345R1J907P07
3190A480j091j450j98J644J303j140j273p79J461J276k70j621q20J023J581J36
3206A262j556j363J005J715M28j683j156O34J596O49j297j723L53J612P40q18
3222C98j475j73J360J319p48j307q87J216J486k17j374r50R66J460J28j353q83
3239a034O5J836O26j384j501P23J216N48n28j478m55J688J195r67j202p44J317
3256g9J228j97j562p72J055J382j66j129j104Q21J256O85j457j175K73J314R09
3273A282q80j551o3J550J240j193j503j51J386J264n13j539o11J393J270k68j598
$$ plain form
3155 -125 -1616 -1079 876 1216 137 -1211 -1116 717 1398 427 -1334 -1200 566 1208 798 -731 -1458 -100
3173 -100 1447 984 -624 -1314 -346 1142 1319 -257 -1377 -540 1107 1233 120 -1225 -1134 773 1480
3190 1480 389 -1061 -1259 385 1688 548 -725 -1504 -43 1233 963 -658 -1478 -455 1126 1262
3206 1262 -294 -1657 -652 1063 1491 -192 -1348 -714 882 1531 234 -1489 -1136 476 1216 398
3222 398 -1077 -1250 110 1429 681 -626 -1513 -297 1189 972 -402 -1352 -386 1074 1202 -151 -1034
3239 -1034 -969 867 1493 109 -1392 -669 547 1095 567 -911 -1366 322 1517 550 -652 -1396 -79
3256 -79 1149 952 -610 -1382 -327 1055 889 -240 -1344 -523 733 1418 -39 -1214 -941 373 1282
3273 1282 402 -1149 -1212 338 1578 385 -1118 -1269 117 1381 868 -671 -1282 111 1381 1113 -485
3290d85q58P60J644K28j462j269Q28J349M91j113j312J98J557P64q97j664K02
3307a039J303J357r39j480l59J058J138k91j034j060Q40J381J78j346r76O30J310
3324F71M62q75j476L19J216Q54r24j172J9J061J169o33j612l82J308J126k88j242
3342c99r91J028J559k01j388q00P02J014O91j313j068K83J405Q18r95j478M98
3359f35Q86J067q17j523k62J479P64l53j126n16J179J004k89j388o65R19J368
3376A092k15j146j073M22J572P31j576o81K2J224P37o36j527K08J023R73n92j284
3394g26m02Q05J687n57j520o18O94J441o5j111q75R75J139j47p23r16J85J182
3412D48P58q90j429K55J439P28o92j353o82J420R81m34j181o30J100J028j34j028
$$ plain form
3290 -485 -1343 -583 1061 1289 -173 -1442 -614 735 1226 113 -1199 -1001 556 1320 423 -1241 -1039
3307 -1039 264 1621 682 -798 -1157 -99 1039 748 -286 -1346 -506 875 1053 -293 -1269 -639 671
3324 671 1133 258 -1218 -899 317 1171 247 -925 -906 155 1324 691 -921 -1303 5 1131 843 -399
3342 -399 -1390 -362 1197 996 -392 -1192 -490 524 1215 -98 -1166 -883 522 1340 345 -1133 -635
3359 -635 251 1318 501 -1022 -1284 195 959 606 -520 -1036 143 1147 858 -530 -1195 -276 1092
3376 1092 877 -269 -1342 -920 652 1383 -193 -874 -852 372 1109 473 -1054 -846 177 1150 558 -726
3394 -726 -1128 -323 1364 807 -713 -1331 -637 804 739 -372 -1247 -272 867 720 -3 -919 -734 448
3412 448 1206 316 -1113 -858 581 1309 617 -736 -1418 2 983 549 -632 -1262 -162 866 732 -296
3430b96r12O44J556j68p97j137K03J573N01j278q31K59J120Q04n10j565k75J353
3448B44R61o66j055m22R42J041j10j307p89J016J134M8j263p02L98Q86M97r77
3466a24j257N86J389N28p50j262J29R13P99n80j140k3R14P57j81q74j018Q26J225
3485H57l6j015o61L06J153N74j439j050P42J310J37o10j418J59J432Q69j068q18
3503e76l32Q50P70J64j854m40J319J103K6j361o03M67J193M61j199j069N20J466
3521I05r4o16j247L62J027J002j014j195j56J521L75l48j132o51J413J116m91
3538G77j225r12R90J746k48j478m74K32J419M25j270j015K22J507N6n53j256J98
3556h59J357O27q24j063l64Q38J113k72r84p16Q96J281m8j406p73Q78Q18M83q02
$$ plain form
3430 -296 -1208 -564 992 824 27 -1110 -907 666 1167 -111 -942 -683 437 1241 731 -834 -1109 244
3448 244 1205 539 -516 -938 4 1045 935 -372 -1161 -145 989 1037 -226 -928 -530 356 853 -124
3466 -124 -1381 -795 594 1122 372 -890 -761 152 951 371 -769 -792 122 879 698 -176 -1194 -368 857
3485 857 821 -194 -855 -549 604 1178 -261 -1311 -569 741 878 268 -1150 -991 441 1310 242 -576
3503 -576 -908 -58 712 876 -978 -1418 -99 1004 1030 -331 -934 -467 726 1187 -12 -1081 -561 905
3521 905 811 195 -1052 -690 337 1339 325 -870 -1026 495 870 522 -610 -1261 152 1268 777
3538 777 -448 -1360 -370 1376 1128 -350 -824 -592 827 1252 -18 -1033 -811 696 752 199 -1057 -859
3556 -859 498 1125 301 -762 -1126 -288 825 553 -431 -1147 -251 1030 982 -424 -1197 -319 499 982 180
3575A80r68N5J137M65q03j222M54R81Q00o76j257l75J458L10Q2j537k63J173J052
3594A046k70j399n43R33R36J94q46j179L32J550K42r73j067J25J214P83o34j561
3612a117K97P97Q90k61j147l83R89P10j16j504k43Q36J105N4r50q72O40J126R6
3631I47j092q83K02J393L76o46j196J79J114O43q12p01l06Q56J294q60r94p18
3649a204Q21J177P9j250o33N09J337K21j106r16L18J062O56q84r98K80Q62M64
3667G95n23o80n03O93J202l10j398m81J206J055n82p99n32L94J073L17q83j101
3685a057N90R52L89q43j034n6J445Q03p94j301LJ066P82n25j169m27J322M73k92
3704C27n87o98N75J265l19o41j174P14J426l8r24j069M33J015N67p78r90p1J612
$$ plain form
3575 180 -788 -733 404 869 66 -1156 -702 279 1079 403 -854 -1229 229 539 621 -916 -1179 -6 1046
3594 1046 776 -623 -1166 -233 703 897 51 -1128 -796 754 996 23 -1044 -919 295 1078 444 -1117
3612 -1117 -820 -23 867 606 -541 -924 65 775 659 -845 -1088 -252 853 907 -43 -915 -275 851 947
3631 947 -145 -1028 -826 567 943 297 -899 -720 394 1037 225 -476 -782 74 1368 508 -486 -1204
3649 -1204 -383 794 873 -377 -1010 -501 836 1057 -49 -965 -647 415 1071 187 -811 -531 331 795
3667 795 272 -408 -911 -218 984 674 -724 -1205 1 1056 474 -325 -857 -463 610 927 44 -1057
3685 -1057 -467 485 874 31 -1003 -1059 386 1189 395 -906 -903 163 945 420 -749 -1176 146 619 327
3704 327 -260 -958 -383 882 563 -78 -1252 -538 888 850 -74 -1143 -710 305 872 94 -896 -967 645
3723F45K82n03j196l09J304R36m58r98j029R63J074p9j278j57O05Q39L78p81j268
3742a030L00J475L37q11j052L02N32R68n55j375K16P54Q90m07j122l24J064Q46
3760A008l14p58o76O42J011m56o77n36J14J285J89n92r10M1R45O03p14p55k50
3779h00J017O31l75j065k00M11J550m73j216n02O70J095j19r14o75K40J520n4
3797G41q75n66N4J065N28r43j004L17J094M57o02o88n80J069J291q09j133l17
3815i01R56M82R1q37r67Q77J138J5p75q89L01J197L40r89p10J85J084J18l99j152
3835h35n9R07J002l21j307l52J196L56P2j176l93Q83P67k05p05m11q0J196j43
3854C92m01r18L69J076j5k57r97n9J140N18m00j029k51P19Q05k82p72o31P26Q14
$$ plain form
3723 645 927 424 -772 -1081 223 1159 701 -297 -1326 -363 711 632 -646 -803 -198 641 1019 238 -1030
3742 -1030 -730 745 1082 271 -781 -479 53 1021 466 -909 -693 61 951 544 -578 -902 162 1008
3760 1008 694 -64 -740 -98 913 457 -220 -756 -642 643 832 240 -670 -629 316 919 205 -550 -800
3779 -800 217 848 473 -592 -792 -381 1169 696 -520 -1022 -352 743 624 -290 -965 -725 795 741
3797 741 -134 -700 -646 419 947 4 -1000 -683 411 868 266 -422 -1002 67 1358 549 -584 -901
3815 -901 55 537 628 -209 -1176 -299 839 854 79 -810 -509 688 1028 39 -671 -486 598 716 317 -835
3835 -835 -894 13 1015 694 -613 -965 231 587 659 -517 -910 -27 740 535 -170 -581 -661 535 392
3854 392 -9 -927 -558 518 503 246 -751 -810 330 848 448 -581 -832 -113 692 410 -362 -993 -267 547
3874E47J96j052p38M55J245M05j136n79M19P70K83m83r63k27R89J178q53j259
3892h03J38R05N08l81q59m49O22Q28K8p09o27L87J031k2q67o17L19Q88j04k18
3912br44P1R51P89o07r46R4P84N12j65q73l81Q95O84k06j253l02M81Q28J86q61
3933b65l91K56J025K05q66n89N3Q52L73k12j079KO70N75k04j030k97J047Q55m33
3953E47o91o32R46O09J89j422j24O22K87L53m83o89K98N68N39q67p76L41P55M65
3973H35n26j343N8J238M66m36r11j95N92Q81J30p66r59P74P72k9n39p90K89J039
3993E80Q6n41q88K82O47O84m91o10k85Q56O70n94q57j64P89O89l20q64n31P35
4013a27Q32j52o57m54j64J291J3o77m33K05O25N68n66r49L6Q61N73m64j082j6
$$ plain form
3874 547 743 -309 -1047 -592 653 1058 -78 -657 -238 532 815 332 -631 -858 131 1309 456 -803
3892 -803 -665 240 748 367 -492 -941 -319 509 537 -172 -799 -412 619 597 -270 -887 -568 320 216 -2
3912 -2 -946 -875 76 865 258 -688 -594 190 702 537 -336 -717 178 862 656 -597 -899 -418 410 596 -265
3933 -265 -656 -400 625 830 -36 -625 -572 280 653 441 -638 -636 34 609 405 -625 -922 125 980 547
3953 547 -144 -776 170 779 968 -454 -578 44 331 684 201 -488 -190 378 917 50 -726 -385 370 835
3973 835 309 -1034 -976 262 728 292 -619 -814 -222 659 789 23 -936 -162 610 581 42 -748 -459 580
3993 580 666 125 -763 -481 166 850 359 -251 -536 320 990 396 -461 -625 164 853 533 -331 -862 -127
4013 -127 705 553 -104 -558 -722 569 582 -95 -528 -323 302 870 304 -645 -609 252 825 361 -721 -737
4033g37O86R18m28q91l60P13Q79J52r21r79Q37N16L40p43p03L37P56L59o27o77
4053e73k9P21L90j13r02J03N92N43m36p36p6L20Q45j63o99p28O85Q42K35q70m29
4074d78q2J090M45q45j025N63Q18J75o98p22N42L90K03k44n83J16N49N55k61n47
4094c9o05O09K89L64q40n62L97P37K97r32p23N28J122j02n98k37k96J162L78o69
4114B80p45j60R01O21n72p31k67O40P89j15j150p5N16N98K12q26m41M6O15M82
4134F18k24r61k8Q14M47o67o04K09M73M83r2o63n84P10Q05m66o71j62K85N54J75
4155D51o51n33P33N21K08p14o14J43Q78ml27p86K96N93M54o53l24k84O66P30n06
4176B77p10kN01L16K20r68k13L24J027k37o27m43O8P19M68n10m90j83N06O36j04
$$ plain form
4033 -737 -51 867 439 -452 -812 -99 780 932 11 -968 -131 385 725 -18 -721 -384 372 731 104 -573
4053 -573 -602 119 509 396 -506 -403 189 732 296 -440 -516 -196 649 486 -213 -941 -256 586 821 -49 -478
4074 -478 -560 530 975 130 -895 -332 486 661 -37 -759 -217 173 376 132 -451 -335 214 769 508 -39
4094 -39 -644 -35 254 618 -222 -784 -387 350 647 -285 -1008 -480 642 540 -58 -295 -591 571 949 280
4114 280 -465 -625 276 897 325 -406 -673 -33 756 641 -509 -584 -68 530 742 -84 -525 -479 136 618
4134 618 394 -567 -595 219 666 -1 -605 -396 77 560 468 -195 -779 -69 736 270 -401 -563 -278 276 451
4155 451 -200 -733 0 521 729 15 -599 -456 422 418 91 -695 -399 194 648 -5 -329 -613 53 783 277
4176 277 -433 -435 66 382 602 -366 -579 -255 772 535 -92 -535 -467 252 720 210 -280 -463 43 679 575
4197E75r47l59O37R07o31m01k77M87L92l9q05l37O03M12L59o63n87O75M40N5o56
4218a60p50M79O05N43m60m72k95R04K70l09o42k25L09Q58k70q03j02N14R80l72
4238F02p84l47R2Q95J76n31o56N10K12N36o43m74j49J089p6j93p46K9M99L42M44
4259H27j039k32K63N42Rl47l67J0P03L88r87j04j83P90M66p69m57j21J035O19
4279A046o25r41R7M61K65k5q74k5N71P81l25o27n48O75N76K05p72n98O96L87J97
4300E97n56n83K41N57L94k92q94l0N60O91m60n32l11P06M68K0q10m25N42O23j58
4321C48n10n48M19Q55J35n38o42q4Q34L53k29n37k29N02P32o35p22r7Q10L25k67
4342B75l49n74N36N48k02n01K2j4Q49k41l19r00M98O73K08l77o68Q2Q21K71l56
$$ plain form
4197 575 -372 -731 -94 813 182 -219 -496 -9 383 344 -461 -798 -195 217 576 -87 -674 1 441 496 -160
4218 -160 -910 -431 174 717 257 -215 -510 394 664 355 -287 -512 -203 655 385 -418 -520 -6 974 602
4238 602 -182 -529 -437 458 634 103 -553 -43 169 705 62 -412 -561 528 452 259 -487 -458 41 383 827
4259 827 -212 -444 -181 361 370 23 -344 -334 369 757 -230 -334 -517 273 739 -30 -487 -608 427 1046
4279 1046 421 -520 -423 38 303 278 -596 -621 -50 731 406 -221 -769 -94 482 687 -85 -683 13 400 597
4300 597 41 -542 -301 256 650 358 -536 -566 -6 685 225 -307 -618 88 556 576 -234 -659 -117 506 348
4321 348 -162 -710 -291 564 699 161 -481 -565 269 622 393 -144 -373 129 861 226 -496 -593 217 542 275
4342 275 -74 -648 -112 436 234 -267 -245 -259 590 349 30 -870 -372 301 509 132 -536 -454 367 638 282
4363B82o65J5M37M66j84o51k64K56P28J5p21l11M16P08M9n08p66M23M34L13j44
4384C28p80L6M57N19j54j091Q2O79L21L1o86l06O73M55k91q77J58K17L56L01m68
4405d0p77N37O65J13o65k17K8O58K54o58n09J85O55J54k19n79j66O14N40l24n80
4426c31J5J49O40k49l03m58J96R49m7o02l51k5O39J86o92p3K67L06J56j23l31
4447h2m11O86M35j57p34m75N87O47k28m61j65L92L60J87o96l11L22M35J18n62
4467a13o46L44L58N10m89m25l5P21L22o32l19k90Q78J63j86n73j50L40P30K35
4487G43p20m50J57N02L67r14l02L49K01M10j70o33P8N87L52l43m38k22M07M92
4507D53O9j068P0L47L73j20j30p22M05O41k58j81n27K44P48m0j95l52k46N61M58
$$ plain form
4363 282 -383 -368 69 535 351 -300 -564 -308 420 435 -286 -597 -181 527 576 68 -698 -275 159 472 328
4384 328 -452 -416 41 560 406 -685 -603 76 397 428 -258 -564 109 564 273 -604 -446 -229 127 428 -40
4405 -40 -817 -280 385 498 -167 -384 -356 302 556 -102 -611 -426 229 383 164 -415 -581 33 573 249 -331
4426 -331 -316 -167 473 224 -79 -537 -341 608 561 -41 -392 -417 222 408 -284 -357 -90 216 372 249 -82
4447 -82 -493 193 628 471 -263 -738 -151 496 268 -193 -358 34 394 581 -115 -426 -104 331 449 -113
4467 -113 -759 -415 -57 453 -36 -461 -496 225 547 -85 -404 -694 184 347 161 -412 -562 -222 508 743
4487 743 23 -427 -270 232 599 -315 -617 -268 -67 343 173 -460 -382 205 557 214 -224 -446 -39 453
4507 453 522 -546 -476 -129 244 124 -6 -728 -323 318 60 -121 -648 -404 344 304 109 -243 -489 72 530
4528E30l25m84m47P65N99k87m95l97M88M54m1l63k36j5N95l22j39n07M51L39R5
4549B58l52l79J90K57O58l52o55K07J77M66l87j55l59N37K55P9m86n65M65P69
4569F28j08q08J41j27P31m3k65r09J73Q61N66p79l42l9L94L13j56n41P3L08L74
4590D45l10m58j73L83L94k7l66l89J48N66L04o94k40L1O39J48k70p30L14M13L47
4611D75r6o20k95O37l4J92m52l28N94N06k50m94l97J09R57J8q10j35M25L91Ol49
4633E0n02J40M87L7R9p37j16P90K01k54l83j24N08K07j36p11j96N02O00k36j58
4654F8n50L42O91m91q1j33l10R99j10p44j9K0L41M89o18o0q5K46M42j79m36m50
4676f28N33O33j13q78j95P43j58P39p70m52J13N03L36l18n23m2M53M15r83K25
$$ plain form
4528 530 205 -279 -726 39 638 351 -144 -541 -53 401 360 -3 -239 -254 341 19 -120 -627 -176 163 258
4549 258 -94 -473 -283 -26 632 280 -375 -168 9 475 88 -67 -426 111 366 445 -41 -606 -141 628
4569 628 520 -288 -147 -274 457 414 149 -760 -587 274 840 61 -281 -320 74 387 231 -310 -237 71 445
4590 445 135 -323 -496 -113 281 254 -112 -501 -353 213 517 -177 -417 -386 253 401 131 -599 -285 128 475
4611 475 379 -241 -536 101 67 259 -193 -521 73 579 329 -165 -562 -453 504 522 -288 -423 2 393 399 50
4633 50 -452 -312 175 212 311 -426 -542 248 449 195 -188 -312 196 403 267 -444 -640 -138 462 226 68
4654 68 -482 -140 551 60 -21 -154 -464 535 425 -319 -338 -318 23 512 -106 -166 -251 -5 437 258 -178 -628
4676 -628 -95 538 425 -453 -648 95 -63 676 -94 -546 -433 70 406 88 -435 -477 -24 391 -592 -367
4696c67l8O06L70n56j53Q0J2M85m31l4l79J78O17M1n59k06K35M33l24J08l25l99
4718f06Q12m1j02o09L57M12N47n49n12j63N32M60k96m99l10L80P04k35l96j90
4738c04J26N13M8n43k73K60M46J79l24l88K01J34L36j57q01L59L58K17k70m75
4758c58j7L43N79k30m55k25M46PL92q97J4K59L74R2m81m6k01N07K02n51Qj28K48
4781a18N78k04m44l49R07l7j13l39l6m8O19L2o67j04J96L78M50n56o84m4O06M88
4803E11n59n2m95N67L19J01q07J01J06N62n2l35k35L11L34M5p40j48O44J07j87
4824I8Q8l33k39N46K92m71l80L08OK91K71p27l15P40L15n22p66P2Q23N32l17m35
4846a23m09M64K74J81m71l91N23N77l01n12k94L94L03K21m75l97k40N70L67l00
$$ plain form
4696 -367 -405 201 571 15 -138 -58 -46 439 8 -26 -405 -227 390 431 -128 -334 -99 334 10 118 -207 -606
4718 -606 206 165 63 -546 -189 223 770 221 -291 -454 78 538 242 -257 -567 -187 517 282 -114 -304
4738 -304 -178 335 383 -160 -433 -173 273 452 128 -260 -59 75 411 254 -547 -188 170 387 117 -358
4758 -358 -375 -32 547 317 -138 -363 83 90 482 -415 -401 -142 232 324 -157 -203 -404 103 305 -246 -238 -366 -118
4781 -118 460 256 -188 -537 370 333 220 -119 -155 -203 416 448 -219 -323 -127 251 701 145 -539 -583 23 511
4803 511 -48 -100 -595 -28 291 392 -415 -314 -208 354 302 -33 -268 43 377 422 -318 -466 178 285 98
4824 98 186 -147 -386 160 452 -19 -399 -91 -85 206 477 -250 -565 175 490 -32 -798 -726 97 629 312 -123
4846 -123 -532 -68 206 387 -84 -475 48 625 324 -188 -482 -88 215 436 -39 -436 -676 -106 261 -39
4866c9m76K37L87M38k59m55J63J4J3L3k62q8K03L41J35n73j35K69J72J70l73l73
4888d58L07M13K22l84n09K48L52J5j02q5l85J58N50l03k9k47j52N08J90l75k90
4909c56L00J52K59l73m00K69N75j49j21l85k26L20K78J67o54j9N70K38m40k18
4929b13j85k03Q25R0l04m70N42K99M8m76m76KN80K03k91L7m33N52Q6J02l50m11
4951d46N32K18k01j72k66N48K59J40o42l81K54J60M08l34k68K25K75j54m47J2
4971b80j99Q72J86p01j03j66K55M72k07m19l02M02M63j59j92n87Q07l4K03k31
4991H0m61J22P02p6l52j08l22R0O21o1m26q5L06L84k28l21j30L16K75k23n71K71
5013a97J54O6J33Qp47O71J54J99k06r15N83M95j83j31m05K10K23J93k35k32n8
$$ plain form
4866 -39 -515 -278 109 547 288 -167 -4 10 23 56 -206 -294 -91 250 385 -188 -323 -54 118 288 -85 -458
4888 -458 -151 262 484 100 -409 -161 191 206 104 19 -366 -208 342 39 10 -237 -389 119 309 -66 -356
4909 -356 -56 96 355 -18 -418 -149 426 277 156 -229 -455 -135 143 310 -344 -363 207 445 5 -213
4929 -213 -398 -601 224 314 10 -460 82 381 429 -47 -523 -521 59 262 -29 8 -425 127 213 315 -35 -446
4951 -446 86 304 103 -69 -335 213 472 612 -30 -411 -157 3 411 77 -191 34 309 155 -292 -280
4971 -280 -479 393 579 -122 -225 -391 -136 336 129 -290 -592 -190 273 114 -78 -665 142 108 311 80
4991 80 -381 -259 443 367 15 -93 -415 -325 296 235 -191 -276 30 414 186 -135 -265 51 326 103 -468 -197
5013 -197 -43 23 156 164 -583 88 242 441 235 -680 -97 398 215 84 -321 -111 112 305 70 -162 -220
5034b20L03L38J53q11Q3n2L29q4l8m96M95K9J75L5n96N7L76L63m19l16K22M67
5056C93J8m26j10k18O56m6o3n61K34R2L33L19n88j78Q7K35J77p4r16K70N77n8
5078A53J11m66j31M59M97m66l93j4L94M93n38k31p0J73M17q3m54j8o9N02k01N1
5100A16m80L51L21K6m34k28J84K05j11J15k52q4L11J74J13p69l2L35O32r5l71
5121B7l0p3J29L50p07j40N25J18K06k29l49l19N84L47l17l11ML12q2O1m09J05
5143a98O3M47J5o70Q6J89J89p5j71J88l78M04p1J59l69L2N57J13n67J19l54L87
5165I5J29q6p09N52L9n2J60k82k89L73M27j75k84m36M58K1K43l63k83M58O7J68
5187B31N9p84K99M99j07k58k69Q1J78J68J10n55J17L13l4J7l78K8K78M75j88p59
$$ plain form
5034 -220 83 421 574 -237 -154 -206 123 39 1 -495 0 29 204 239 -357 -300 76 439 20 -296 -74 393
5056 393 411 -15 -125 -343 313 267 204 -357 -123 -31 302 621 33 -145 -58 177 354 280 -636 -366 211 153
5078 153 264 -202 -333 126 623 157 -236 -250 144 637 99 -132 -202 -29 388 305 -149 -167 -236 266 65 116
5100 116 -364 -13 308 334 -100 -328 -144 61 -50 65 -187 -271 40 214 327 -442 -474 -139 493 398 27
5121 27 -3 -76 53 403 -304 -444 81 199 405 176 -173 -492 92 439 122 -189 -185 127 45 106 -303 -198
5143 -198 -135 312 327 -343 -257 -68 121 46 -125 63 -315 89 18 177 -192 -160 397 510 -57 62 -292 95
5165 95 224 138 -571 -19 20 -32 128 -154 -443 -70 357 182 -102 -538 -80 -59 184 -179 -462 -4 63 231
5187 231 290 -494 -195 304 197 -61 -330 -249 -71 97 207 -348 -231 82 48 65 -313 -285 -7 468 280 -479
5209d79J48J92L56j0l77j41j72N33K57m40k29J97N04k40nj18k44K98J84j03Jp5
5231C7j30N27k40m23N2L44R5Q3R4j027P49K8K40m34j40l24P15P0j65m84p7L28
5253h2L71J2o05J00R9K64P8j86k85J6L80K21m55k17J82J75J31r4m60L20J03K10
5275B78j58m88L7L71K87k68j82j11m0K62K82k29p7j39K62o6k65n2P2P62m36M3
5297A45m88L09M4M57l01o14K89J30J73J83n46P0K09J34p6Q0n49K53L24p0l52p6
5319b72J16M14K67o89k54J29J84O30n80j87R6K14J97m24P5k24N87k87J45r4J00
5340A43J4O5k58L41o89O6N84r0o5n84L22L72j02L04r59J14N61q3P1m46J41K7K18
5363F7M1k35K2j46L34J55j97k68J44M87J80n58l37K60M56l01j25m5j19L43J01
$$ plain form
5209 -479 -331 -139 217 207 -170 -311 -483 50 307 -133 -362 -165 339 99 94 -24 -268 30 214 111 112 37
5231 37 -93 434 194 -229 -177 167 262 345 439 -588 161 189 429 -5 -145 -469 246 316 151 -333 -410 -82
5253 -82 289 301 -304 -204 -105 159 237 51 -234 -218 162 383 -72 -289 -107 68 199 105 -355 -35 68 278
5275 278 120 -368 -331 40 327 59 -123 -234 -274 -12 270 41 -36 -175 87 21 -244 -296 -224 538 102 145
5297 145 -343 -34 10 467 166 -448 -159 -29 144 327 -219 -149 60 194 118 198 -351 -98 226 156 -196 -272
5319 -272 -156 258 525 -164 -418 -289 -105 525 -55 -242 -146 68 265 -159 -84 -308 279 -8 137 43 143
5340 143 157 222 -36 305 -384 -318 266 176 111 -473 -151 221 119 423 -536 -422 139 56 127 -319 -178 -151 67
5363 67 108 -127 -105 -251 83 238 41 -227 -83 404 584 26 -311 -51 405 104 -21 -66 -185 158 259
5384B59m16R8l38M17M22m41rk42L04J16Pk06l49M30J36K06l41k40J91M07j28l01
5406a8l64J00P23m22l6r4j64K82K80k18m34Q6N17K05j03l73k83M33n8K1k6k17
5428a63J80J28K67n24k83J63N77j50p09N5K2O11J36j75m11L44J05J36j78k63m53
5449e85M80L59r3J4l17r0O02k62J33p83M41K47nn5m19J34K42K76j77m15k20P48
5471B55J43o2p74M0L70Q7J28l53j45K16M59m2r3n84O07J45o19K09j37K68k81M58
5493B95k18k64J5M14k75J56m40K7J34M16k37j1l71M29K14l27J78o51L24P8M68
5514C54j17m39q9N42K16p10j1PM54Q6k95j32J03K24j9J63l70k03L2O45l20l59
5536b38j41M87N0L05o87l70M82N5J11m7m36J34M47j08J57o43j79O77j4K02m68
$$ plain form
5384 259 -157 -59 -397 20 442 1 -8 -250 54 170 177 -29 -378 52 188 394 53 -187 4 411 283 -18
5406 -18 -382 -282 441 19 -17 -111 -275 7 287 69 -365 -279 238 443 340 -33 -316 117 59 80 54 -163
5428 -163 17 145 412 -112 -395 -232 345 195 -514 -459 -437 174 310 135 -276 68 173 309 131 -132 -585
5449 -585 -105 254 161 175 -142 -232 370 108 241 -542 -101 146 141 86 -333 -199 43 319 142 -273 -493 255
5471 255 398 336 -438 -398 -28 59 187 -166 -311 -95 364 322 229 -355 252 397 -222 -13 -150 118 -163 295
5493 295 77 -187 -172 242 -33 123 -317 -290 -156 260 23 12 -359 70 284 -43 135 -516 -192 -114 354
5514 354 237 -202 -291 251 467 -243 -254 -247 207 293 -2 -134 -31 193 174 337 -33 -236 -204 441 121 -238
5536 -238 -379 108 158 463 -224 -594 -112 -57 54 7 -429 -295 152 44 201 -442 -621 56 42 244 -224
5557b24m13O57J24j4k1l07N13k36J27m49j62K82L12M05p76K09q2J84q8J81o14
5578c92K75N59m2k66L3l61L57Q1j40q3j10K43J42jPl56L1J02K09m28l08M12J61
5601A25M45n91j96j29L95M18m99l15L05j44L95q2l41J13J4M99l44j92k31K19N28
5622C92n8l79p8JN87q7n13n39L45L16L97m59K3k40R9K53j20K31l73J77J76Q6K9
5645B66o38N12J25J49l17j42J25K6j40K75m75Q5K68J53k91n2J12K55l31K33m27
5666b29L5J71M67m53n8j28K06J9M0k74L41j15K22K88m30m21R4M37j32K3l15J54
5688e8P1L06k92J1j56J48J69N4k10j81M02o3J61l72l37J91N36j45N4o82K03K70
5710H0Lj35j96L0O5M04j56j89j97M21K43k44k70oL0J60K19j95o2K9J94Q0m68M2
$$ plain form
5557 -224 -637 20 144 130 109 -198 315 79 206 -243 -405 -123 189 594 -182 27 -55 129 41 222 -392
5578 -392 -117 442 400 134 167 -194 163 244 104 21 -89 154 296 295 302 -54 -23 79 288 -140 -448 -36 125
5601 125 570 -21 -217 -346 49 467 -32 -347 -42 -186 209 127 -214 -101 -87 412 68 -124 -355 -136 392
5622 392 334 -45 -123 -122 465 378 -135 -674 -329 -13 384 -75 -52 -292 -193 60 -60 171 -202 -25 151 237 266
5645 266 -372 140 265 414 97 -45 80 106 -34 241 -234 -149 119 272 -19 -71 41 296 -35 198 -229
5666 -229 -194 -23 444 -9 -67 -195 11 30 70 -204 137 22 244 532 102 -319 -225 212 80 103 -212 -58
5688 -58 13 319 27 38 -118 30 199 253 43 -138 264 201 362 -10 -347 -156 380 235 289 -393 -190 80
5710 80 83 -52 -248 -218 -153 251 95 -94 -291 130 373 129 -141 -147 -117 43 262 67 5 34 228 308 -160 -118
5734a18j50M37J98n16m10M72L07N9j27j37k82N89om00J45m03N21LK87n77q5K22
5756B9L21k65k22p7L71K56j99k87o7J72J9J19j97l06K49J65K10l63k03K93k89
5777b71M30j33m4l94K65P46o12m9M1j20L42j59j40j2P2j0M40m94j31J32J1M29
5799C39k60j60k77N19K3j99k27J55N6j71J57l35L98J44O5Kj93m07J31L51j76J06
5821D1m14K58J43L04o66n0K86J63J03m4k18RK59J97l12m17j32L57K43j11Rl68
5843c60J85K69K29m96P6J48j12Q9K18n95j6L80J97J38l21j6n7J06kl42j00N78
5865A96K76j32j93m75K48L97j59k70k93K85Q9K64J19n41j9k32Q81o42r8N5L62
5886A18p8L27n79q1M6K20O9l73N4J21K57K3j25R9j28Q9L70l41k56j70K10O13m15
$$ plain form
5734 -118 -268 169 367 -149 -559 -87 220 279 152 15 -267 322 316 -84 61 -342 179 182 469 -108 -193 29
5756 29 350 85 -137 -214 157 413 214 -73 -140 32 51 170 -27 -333 -84 81 291 -72 -275 18 -271
5777 -271 159 26 -18 -412 -147 599 -13 -62 -21 -141 201 42 -98 -110 -38 -48 392 -102 -233 -101 -90 339
5799 339 79 -81 -358 161 184 -15 -242 -87 -31 -202 -45 -380 18 162 227 229 36 -371 -240 111 -65 41
5821 41 -373 -115 28 332 -334 -384 -98 65 168 124 -94 -85 174 371 59 -358 -490 -133 110 -1 8 -360
5843 -360 -175 94 323 -173 -97 51 -61 28 246 -349 -365 15 212 350 29 13 -44 62 60 -282 -382 196
5865 196 472 340 147 -328 -80 317 158 -112 -405 -120 -31 233 352 -189 -208 -440 441 -201 -299 -244 118
5886 118 40 367 -212 -293 -247 -27 42 -331 -277 -156 101 124 -1 98 -30 59 429 88 -168 -338 -128 485 70
5909G0o9k08Q2K86Lm74K97K2K95j46l88P8K49J59q8l71R1K22n7j27J12m46J56
5932b52L74M1j38k18J92J48J41j73l01k67M22K34j62j20j42J97O42k44k75m55
5952c56K77J22Lp3j09k26L45M93l59k28j54M46J43k74l72K46K94J16j62l08j83
5973c19N22q7K5O8l22K1M48m7k20m64L73M59l13l08L28k64K5M73q7n48K76k87
5995b48M54K04l02r2q8K13J77k93j60M09J22k45j06m6n3L20k30J10o3m10N90j20
6017A43j07l26J98k8j5K49l27J57o8M96l33k97K42j45K74l1j82j36j8L94j94j5
6039f9J09j95L79rk23k82m2L75J63m27l31L08K48k55P4K89l49K99L3J42m99n8
6061c20N13j15R3j54o7R5J64K09k19o41J45L12K07l59K07l70L70J28j36P8k69
$$ plain form
5909 70 1 -207 -125 161 164 -310 -13 9 304 158 -230 -152 97 256 168 -203 -112 110 53 -74 38 -408 -252
5932 -252 122 163 25 -193 -1 147 288 115 -186 -453 -31 203 41 -79 -221 -24 618 374 99 -356
5952 -356 -79 43 46 -27 -136 -362 -17 476 117 -111 -265 181 324 50 -322 -76 218 334 172 -136 -319
5973 -319 203 116 141 209 -113 -92 356 309 89 -375 -2 457 144 -164 164 -100 -75 398 311 -237 39 -248
5995 -248 206 410 108 16 -72 141 318 25 -135 274 396 151 45 -1 -54 266 36 146 83 -327 263 143
6017 143 36 -290 -92 -120 -135 114 -213 -56 -124 372 39 -258 -16 -161 113 82 -100 -236 -254 140 -54 -69
6039 -69 40 -155 224 215 -8 -290 -332 43 206 -221 -552 -244 4 -251 -177 112 -237 62 95 237 -262 -320
6061 -320 193 78 171 17 -50 45 209 418 199 -442 -297 15 222 -137 70 -300 70 198 62 140 -129
6082a29P8M51l30o84N61l12O17r2m02K40k27K53P9j99L2l70N38K56n20J24j35
6103a71K03K7J05m32J43J78K27k35k70K96l46O51k24j01J9k18N4J06j86j51N24
6124A99rj42N0n9J86J22j58r9M5j48M8NK40l77n0K24Q6o4j85o9R1J93J57l84j16
6149b14L60r0J50j24l03K88r1K80l43K3R1p0Q1p4L7j04R3L01o3n16P0K48kJ40
6173A68k07jO8J6J03m41kK91J10J93j01l17k84M79P3j48j71o2J58M84m28k68R7
6196a90j07L82m7j72L6K65k3J51m35k32L15L94J67m15m21N48k26L54J42q38m7
6217c99M78P5L22p24J12o0L95k63o4Q3l7J72K72o28J68K20m4j20J24l37K08Q9
6239D2K98m32k18j28K65K28n4k8k22J82J72J35r7K4l05Q0J82J11k90K68J44m07
$$ plain form
6082 -129 -51 400 70 -614 -53 -365 252 160 -242 -2 -229 24 103 -96 -64 -434 104 360 -160 -36 -171
6103 -171 32 59 164 -268 -125 53 280 45 -225 71 -275 376 152 51 70 -148 -94 12 -174 -325 199
6124 199 190 48 98 39 225 347 189 90 135 -13 35 40 280 -97 -147 77 163 99 -86 -155 -64 129 286 -98 -214
6149 -214 146 56 206 82 -221 67 -24 256 -87 -64 27 -43 38 -36 1 -103 -10 291 228 -288 -218 30 28 168
6173 168 -39 -40 28 44 147 -294 -296 -5 105 298 197 -120 -404 75 148 0 -171 -233 -75 409 -19 -287 -190
6196 -190 -297 85 38 -134 -98 167 144 295 -140 -372 -57 337 504 89 -332 216 -10 344 486 -352 -399
6217 -399 79 154 476 -248 -136 -196 199 -64 -128 -45 -82 90 362 -266 -98 122 78 -42 82 -255 -47 42
6239 42 340 -92 -310 -438 -173 55 1 -27 -249 -67 105 240 143 167 -138 -58 124 235 -55 213 357 -50
6261e0K26n30L54M4K68k13m30Q9Q3q7K79k24k20M97L30n14J19k27M04J13j78l98
6283b65K11L6J80rj73P7l0J95r8Q5Q2m52P7K43j86j51J10k29O82k25m65J48j15
6306b72O87j50k52Qk26J99K77l00k44J71K39m1k73L32o91P72j0l76J88l22P9M12
6328B07k84k22N7j5M57L7l88Q0J08J96j19l10J29k37L74J15j03n75J70L88J14
6349A79j92l00L98p5j13rJ8j45K09M15l10J4k04J9M35l24K1J8j37J22K15k77j64
6372a87k0M17N1pl14Q4o0L66j61m70O41m19N4j9k29L15m0J19q4k77j59M14K98
6395C13o2j90N0k68K65J51l20r2K13J10J3N0k36k24M06K44k00k97J35qj50L69
6417B72k17l73L10J5J64l06j32J35%K62j45k64O7K24M72o47Q9j22L95j07r5K87
$$ plain form
6261 -50 176 -354 0 44 312 99 -331 -242 -159 -246 33 -191 -411 86 416 -98 21 -206 198 311 133 -265
6283 -265 -54 -18 162 153 -20 57 27 222 124 209 291 -161 -84 159 -27 -178 -68 -297 385 160 -305 -157 -272
6306 -272 415 265 13 21 -205 -6 271 -29 -273 -102 137 96 -177 155 -536 236 226 -150 38 -284 -205 207
6328 207 -77 -299 -242 -257 200 237 -151 -71 37 233 114 -196 -67 -304 70 185 82 -493 -323 65 179
6349 179 -13 -313 85 10 -103 -112 -94 -239 -30 385 75 89 -115 -96 339 15 36 54 -83 39 254 -23 -187
6372 -187 -207 210 261 254 -60 24 -36 330 169 -301 340 -79 -25 -44 -273 42 2 121 37 -240 -399 15 313
6395 313 251 61 111 -157 108 259 -61 -153 60 170 183 233 -3 -227 179 423 223 -74 61 53 -97 272
6417 272 55 -318 -8 7 171 -135 -267 -132 -132 130 -15 -279 -212 12 484 -163 -74 -196 199 92 -3 284
6439B84k40Q0q0J02l45n6M58K0j96q8k27J99M26l98J32O9k76L35j70j04k39R2
6461b22J40R1M9j36j74M74p0K15m92j69N68k41m7NL27j91Q0j07k74q4K36Q5K60
6484C23l19m04M15j13M67j89k65j52K54p6K16j24oM8K51l29j94Q7J8J68n3l7k99
6507c13M51k0J1j30k56J67J38k9R6m21K83J07K21k92l61L73j24L28j69k5l12K41
6529c6J47j92J52l28J35M09j85p0j76J06Q8J33k70Q9k09J01K75p0n86J76O43l16
6551A6j60O6L26k64J5J94m31J18J48k39J12R0l15L34k1K50r2k00j32J36k0k4r
6574a02j80K96M42m58J11L2m9J49r4O5o4j81J93K00l90j38k0M53j84P7l25RL97
6597B39R2k02k95n5Q2L71k55L0l35K46K41k47J03j98L72Q5k55l33qL26Q9J59l40
$$ plain form
6439 284 44 124 44 146 -199 -255 203 223 27 -61 -288 -89 337 -61 71 140 -136 199 29 -75 -314 -222
6461 -222 -82 9 58 -78 -252 222 152 367 -125 -294 274 33 -14 -9 318 127 207 100 -174 -258 -22 63 323
6484 323 4 -400 15 -98 369 180 -85 -237 17 -59 157 33 27 75 326 -3 -197 -110 -92 76 23 -14 -313
6507 -313 138 118 129 -1 -257 -90 48 19 115 -306 -23 84 305 13 -348 25 -99 229 60 35 -277 -36
6529 -36 111 -81 71 -257 -122 287 102 32 -144 -38 50 183 -87 2 -207 -106 169 99 -487 -311 332 16
6551 16 -144 -78 248 -16 -1 193 -238 -120 28 -211 -99 -9 -324 10 -11 239 147 -53 -185 -49 -69 -93 -102
6574 -102 -282 14 456 -2 109 141 92 241 147 212 148 -33 160 360 -30 -168 -188 265 81 158 -167 -158 239
6597 239 331 129 -166 -221 -139 232 -23 7 -328 -82 159 -88 15 -183 189 274 19 -314 -322 4 93 252 -88
6620h8K0K63j18J52k70J59j09L69k48j30o6k70M15j4R3j61k49O4M42R9k87m18
6642c52K82N79k54l63k41L73M64p05J49j1J55J2o0K16p36N04j58K48N6l47L0J60
6664AJ78J35m12K8J24r6K96m78K79pM8R8j41j06o7M3J08j39j78L45K0M20l36q1
6688H2k96J10K61m08K17j56n6M39o8l8k29j59M65J34l60j82K70P5n2j34j65L03
6710E3o0K09m66N4j60N17K78m39q3m36L60K93j05R6k60q9M63k05j63l28L87L97
6732C13m79J04J04n0M4J76j28o2j74L28q6R3k38l14L76K51J3l02l23J83J01L73
6754C03k19l11M36k8J71k29M0J55m93J77K89j14j21k56K95j4k14J50j43J68Q4
6775A26k53l45O71R3l74J61j57J43L44l63Om75M87J11J85k45m22N21n50N89l06
$$ plain form
6620 -88 -68 195 77 229 -41 118 9 378 130 0 -66 -336 79 65 158 -3 -252 -188 254 353 66 -352
6642 -352 -70 509 255 -108 -349 24 488 -217 -68 -79 76 88 28 244 -492 12 -146 102 158 -189 -159 1
6664 1 179 314 -98 -70 54 -42 254 -224 55 48 96 194 53 -53 -120 -77 31 -108 -286 59 79 499 163 82
6688 82 -214 -104 157 -251 -34 -190 -246 193 125 87 -142 -301 164 298 -62 -244 26 101 49 -85 -250 53
6710 53 -7 202 -264 -210 -370 147 425 -14 -97 -533 -173 120 15 111 -149 -238 225 20 -143 -471 -84 313
6732 313 -166 -62 42 -8 36 212 84 22 -152 176 90 183 -55 -369 7 258 271 -31 -354 -171 -70 303
6754 303 84 -227 209 181 352 123 163 318 -175 2 291 177 56 -200 95 81 -133 17 -126 42 126
6775 126 -127 -472 199 292 -82 79 -78 65 409 46 52 -423 64 175 360 115 -307 214 -336 253 -53
6796e3K1J3j08P3K60j19j03lK91m86L04j70J48j52L71m37m4P7L89j2l55m1J9J03
6820a4J52j94R0j08J40j00K15k11l45J89L1K50k56O5J36Rm9J2m77K84J50K83q7
6843A65k43k74N06R7j11l32K34p8J40PQ3m63L57M9J09l41k34J41M81o8j85M2k72
6866a90L39J07k67M7k85M33l29J70n5K0j40L05o4k95j6L76p5k77M88k69Q9j05
6888GJ54k09k91K19L17j25N2j62NM51j28j14n40L65J22k61L45m12m2K58J22j69
6910c6J2K7j61L57m6m27L60j81L79j41o7j56O4J17r4M3k11j7J11J13j91p7O0K20
6934E8rL2j27j94M70l21L9J20l1p3n4L45j77R7k58J48q9R8k61R4J84M9l85j11
6958c56K60j4K78j23r0j59L23K77k74m03k02O85Qj46j47J46j04j57K38j62j13
$$ plain form
6796 -53 -32 -19 -127 -54 206 87 -16 -19 272 -214 90 -80 68 -84 287 -150 -194 -117 272 260 -95 -136 -117 -14
6820 -14 138 -56 34 -74 66 -34 181 -30 -375 -186 -155 95 -161 -96 40 49 0 12 -465 -181 -31 252 165
6843 165 -78 -352 154 251 140 -192 42 -36 104 111 194 -269 88 137 246 -95 -329 -188 293 225 40 82 -190
6866 -190 149 256 -11 36 -249 184 -145 25 -30 -10 -150 155 91 -204 -220 156 81 -196 292 23 112 7
6888 7 161 -48 -339 -120 197 72 124 -38 -33 418 290 176 -364 1 123 -138 207 -205 -247 11 133 -36
6910 -36 -24 3 -158 199 153 -274 86 -95 284 143 76 -80 -16 101 7 50 -161 -178 -67 46 -145 -222 -162 58
6934 58 49 81 -46 -240 230 -91 -52 68 37 -36 -90 255 78 175 -83 65 -24 74 -187 -93 91 140 -245 -356
6958 -356 -96 -110 168 45 -45 -204 119 396 122 -281 -483 202 210 64 -83 63 -41 -198 40 -122 -235
6979b35Q7K2L26o0k82K71m7K28j81j00k63M57kj83P9o3P1j74j72P5L83k94k7L83
7003B99j91m98J92P0J32L5j37j25P1L99l59j18J43l79O59k84q1j14J57K31L3R0
7025B25m92J57L42o6k94L68l54J2M90n20k17P9N15o8k84l5p0M4M41l61lj76J29
7048a38M2O7J80k48R3K94l06r1j06N2jM1j21J63r9K78k9j9M5n9j32L42j84o3M3
7073D4R6k6j59K30k87j50M75k20q2N3K24l67J90J79k48KJ53K10n13M7K24o9k30
7096b24J75j55J85R0K08l29j8l83N30J90j17k22K6j05K20n8MO8Q9j1k85K01J35
7119B14l79Q6K25M4j23k10J34L8M9j57j63M56m64L66J06k02K8O8l33L70j02K8
7141G9J13j20k96k07L54J60k3R6l4j37j59J40l0j70J61L0L55l83j8K74k42K47
$$ plain form
6979 -235 -148 -126 200 140 -142 129 82 310 129 29 -234 223 221 38 117 54 125 -49 -221 -146 237 -57 -84 299
7003 299 108 -390 -198 -128 4 39 -98 -223 -152 247 -112 -230 -87 -466 193 -91 -172 -286 -129 102 135 225
7025 225 -267 -110 232 166 -128 240 -114 -102 388 -132 -349 -270 245 177 -107 -142 -212 -168 273 -88 -91 -267 -138
7048 -138 -96 -29 151 -97 -4 290 -16 -107 -213 -161 -162 -121 -242 -79 -178 100 71 52 97 38 -94 248 64 1 44
7073 44 140 114 -45 185 -102 -252 223 3 -79 -26 198 -169 21 200 -48 -46 107 317 -196 -149 75 6 -224
7096 -224 -49 -204 -19 71 279 -50 -68 -451 79 269 152 -70 -44 -149 71 13 17 85 174 163 -122 79 214
7119 214 -165 -79 146 190 67 -143 -9 29 78 -79 -242 214 -250 116 222 20 48 116 -217 153 51 79
7141 79 192 72 -224 -431 -77 83 60 156 122 -15 -174 -34 -64 -234 -73 -43 312 -71 -89 185 -57 190
7163A90r8J20j55J34J5k50P0j04j06J65L3k28k0J12P3K76j80K0k26l5N3L2K08
7186I9LJ18j66Q9k14j57L45J20j31j47j5j85K25J86j34j04o1L3Q3J96l13q2M85
7209B73j24j26m51L65P5r4p0K01m64N64Q0m62K51j66K88l2j15j23l4J15j55L92
7231A88l77J02K68j96L31j63K60m28j8M4k26J10j22J39K92m9m40K62j38L09l94
7252b46l9K19j7J27j47k44m6L68N6q4K68n02J44L46j76J2m9k78J93L17k46J69
7274A45k25J22j71l7L3Lm3lM6J53j27k4K51P1j9m85K48j1Q0Q9nj25Q7L6j12J56
7300A33j93j27K41o7k05J55%J47J70k71p0J09rP5M8j06l00M08l06K35k51j40M28
7323A04P4k1l36J76O2l04L96k74L8J08j45k6J99j64QJ33p5j02L23j14P7K4K2m37
$$ plain form
7163 190 92 212 57 191 206 -44 26 -78 -184 -19 14 -214 -234 -122 -49 227 47 67 -159 -194 -141 -109 99
7186 99 102 220 54 143 -71 -228 117 237 106 -41 -56 -241 -16 170 36 -68 -129 -96 -13 183 -130 -212 273
7209 273 149 23 -428 -63 12 -82 -152 49 -415 149 229 -233 18 -148 140 108 -7 -130 -164 -49 -204 188
7231 188 -189 -87 181 -15 316 153 413 -15 -33 11 -215 -105 -227 -88 204 155 -285 -23 -161 148 -246
7252 -246 -285 -66 -83 44 -103 -347 -393 -25 31 -53 215 -287 -143 203 27 39 -10 -288 -95 222 -24 145
7274 145 -80 42 -129 -166 -133 -130 -173 -176 -130 23 -104 -128 123 194 175 -310 -62 -73 7 96 91 -34 53 89 -23 133
7300 133 -60 -187 54 -13 -218 -63 -63 84 254 -17 -87 22 13 88 136 30 -270 138 -168 67 -184 -324 104
7323 104 178 157 -179 -3 59 -245 151 -123 -85 23 -122 -148 51 -113 -105 28 -47 -149 174 60 137 161 183 -254
7347b54O4K67K77l09j12k6J7K52Q5m96K31j03J97J54k58J98k76K54PL3l1k31j
7370f1O3K47l19j00L08j15M4L4k3l31N14k67m7j13J23K59l13m3P7L6j36N69m14
7393hj85J36P6k59K19P7l37L05O7j88J96p3r8J49p5N9r7J58J61R0n90L37k03J64
7417H1l6pj75J13R7j7j44K04n57M45j74J12J67p1n5M3L4j79K53K00m03J42j75
7440a02pJ72m0J36k71r9j58M14oN9k75K4n6L41kk40j43M79l18N8p9J79K17m31
7464a48L37l34K52j61P1l4O0j54k13J99J84j01k80L85l34L74j77J75l70J43J67
7485D1J34k85LK24Qm31q9M36j42J7L87n34M6R3K45j68O5J8J10j27j7O8k17R2j57
7510a80L04n2l48K2M49l09J28j06J80m0K35m1k05Mp8j3j01L35l15P1K36L31l05
$$ plain form
7347 -254 -190 77 354 45 -67 -93 -76 176 261 -235 -4 -107 90 244 -14 184 -92 162 169 202 171 -60 -61
7370 -61 2 249 -70 -170 138 23 67 101 78 -253 261 -6 -53 -166 -43 216 -97 -140 -63 -27 -163 406 -8
7393 -8 -193 -57 19 -240 -21 56 -281 24 91 -97 99 26 -72 77 2 61 -36 122 283 373 -217 120 -83 81
7417 81 45 38 -137 -24 73 56 -88 116 -441 4 -170 -58 109 38 -17 26 60 -119 134 334 -69 73 -102
7440 -102 -109 63 23 159 -112 -211 -369 45 39 98 -177 -153 -209 132 130 -110 -253 226 -92 -34 -113 66 283 -148
7464 -148 189 -145 107 -54 17 -17 43 -111 -324 -125 59 -42 -322 63 -271 103 -74 101 -269 -126 41
7485 41 175 -110 -107 117 125 -306 -395 41 -101 -84 303 -231 -185 -92 153 -15 50 68 178 51 34 102 -115 -23 -180
7510 -180 124 72 -276 -254 195 -114 14 -92 88 48 283 242 37 41 -37 -50 -151 184 -131 -60 176 507 202
7533B02l03k24M83k43N5L9j35PJ77J62l4k84J99l74N45n00K61J66k88N9j38O3
7555a05J59j99k6Q6J17LMl3k39K89Rk54K30k57k2L36L8M9j15j61j34N8L14q5n4
7580HR2k68K61k3j84J66j09m2K05j06J36J29j97j56K88m24n2L57L95l49p4J53
7602B06J8J73k66j59J62j89J86J85m27K3n9k13L38O8j7M4P5j4J12l24j84J64L74
7625B76J68k91n44M41K6j39n3K17j33R2J82m87L04P5Q4Jl14k56M23K2r9m03N1
7648c57K63K09k35J19m1K54j9j63j20J73p7m2J15Lj14J3K39l77k5k3K7L21K15
7671C58k70k64M1K3R6J46k92p8J00K20k35J20L18l63J85j51J34j54r9k51M47j24
7693i3K15r4k40K57K0j23OK23k54J85j90L2O3j95M44l20k39K65pJ9J36k21K03
$$ plain form
7533 202 -101 -325 158 -85 -30 9 -126 -119 58 220 186 -98 101 -273 272 -228 33 199 -89 -30 -168 -105
7555 -105 54 -145 -171 -85 32 35 39 6 -233 56 65 -189 41 -216 -238 98 136 185 70 -91 -225 -167 147 62 8
7580 8 100 -168 93 70 -114 52 -57 -99 106 0 136 265 68 -88 200 -224 -276 81 476 127 53 206
7602 206 224 397 131 -28 134 -55 131 316 -111 -88 -147 -360 -22 46 29 73 148 134 246 -78 -262 -98 276
7625 276 444 153 -391 50 76 -63 -116 101 -32 60 242 -245 59 134 218 219 -95 -351 72 94 -5 -408 -357
7648 -357 -94 115 -120 -1 -42 212 193 30 -90 83 6 -36 79 82 -32 -19 220 -157 -182 -205 -178 143 358
7671 358 88 -176 -135 -112 -16 130 -162 -240 -140 80 -155 -35 283 -80 105 -46 88 -66 -165 -416 31 -93
7693 -93 122 28 -212 45 65 -58 -52 171 -83 102 -88 -56 7 -188 256 -64 -303 -38 -45 -26 110 -111 92
7716I2j85K91j60N6k23L08n5K41m52k75K15K81K6j8m20r2K21L69m76q9K70R8K85
7739C08k86n0j0k31J55J35k70K33Q9q9L30n40L41k41L30j74oM6j27J51j85j80
7761b71K8J22P6K10K13k24o2l1o6L2K54n26K77J38M1k89j20L87k39n6K43j76L14
7784B75j77K13l63q0K58l21P5L05l15J87j25K92k25j45P8m1K52J45j57j03O1m2
7806D7Q4l41N25m51K2j80j42K35j34M17j59J24j81m21O97Km17N2r3J56L45j47
7828D0j3j76M09q8lm98K21K62j03J38m58J16J82k90L60R1m16J7K54j29J85l71
7850b70mK23j43N00l01p2k28N3K16K18j91j84J62L36k00j13k0nK4M3j82P2p1J69
7874C2K45m84K73k70q0J63J8l3K21j99J45oo7j32R6K57j00l83M94r9k36K33k00
$$ plain form
7716 92 -93 198 38 94 -129 179 124 365 -87 -362 -147 134 160 142 -278 -370 -149 220 -256 -345 -75 23 308
7739 308 22 -28 -38 -269 -114 21 -249 -16 73 -16 314 -226 115 -126 204 30 24 70 -57 94 -91 -271
7761 -271 -243 -121 -45 165 378 154 92 61 -5 27 281 -245 32 170 211 -78 -198 189 -50 -106 137 -39 275
7784 275 98 311 -52 -132 126 -195 -120 185 -130 57 -68 224 -1 -146 -68 -109 143 288 131 28 89 47
7806 47 131 -210 315 -136 -114 -294 -436 -201 -335 82 -77 47 -134 -555 142 144 -273 -221 -314 -158 187 40
7828 40 27 -149 260 172 169 -329 -108 154 51 189 -269 -153 29 -261 99 190 -226 -209 45 -84 101 -270
7850 -270 -274 -51 -194 306 5 -67 -295 -242 -26 192 1 -183 -21 315 115 2 -18 -23 1 44 -138 -66 -137 32
7874 32 277 -207 66 -204 -284 -121 -103 -136 85 -114 31 25 -42 -174 -78 179 79 -304 190 91 -145 88 -112
7897a12K64l84M17l51J99m0m50P08L1l51J89j69J68j63K98k68k01L65L2j97k9
7918d4J41J19p1m19j2M41R8j51j03K2O9l45K79K49l42K16k19N9J33k07m0K63l29
7941a93j7L64k43k5J79p1J66k46R6J36k8m6j76n1k4J91K42n64M1M9J71N08n42
7964h3K18n6p8o4K8P0k09J37k40M10k0K0k15O8J78k65J74m5o8J90r4J06j26j93
7988a57Q0p2K01J3l02L10m35K04M1J70J78m52K60m55M18k96J73l54L02K85o5m0
8010Gm2k25L55K80k93m17L24j23J30K84l59J69%r4l4m9J66n9jk63M15l77K49N8
8034A01j21P8k92K38J10k89L9K15j3k22K71K42j43k03J45n2k48L83l69Q5k1p9
8056a45j72K49J60j15J17j3k51o7M06j76J8k08l4L87j33J43p5q2j8j00K47m0m61
$$ plain form
7897 -112 152 -232 185 -166 33 -7 -457 251 282 -69 120 -49 119 -44 254 -14 -215 150 182 -15 -44
7918 -44 97 216 145 -274 -286 155 253 102 -1 21 90 -255 24 273 -69 147 -72 -13 120 -87 -127 136 -193
7941 -193 -210 154 -89 -114 65 -6 160 -86 10 146 118 72 -104 -155 -179 12 254 -310 -269 -220 -49 459 -83
7964 -83 135 79 1 -63 -35 35 -174 -37 -277 133 113 133 -82 -14 164 -101 73 28 -40 150 56 162 36 -157
7988 -157 -77 -149 52 65 -237 73 -362 -158 -117 53 231 -221 39 -416 2 -294 -121 -475 -173 112 47 7
8010 7 -35 -260 95 375 82 -335 -11 -134 -4 280 -79 90 90 -4 -38 -87 79 20 19 -244 171 -206 43 101
8034 101 -20 58 -234 4 114 -175 -136 79 66 -156 115 357 214 11 156 104 -144 239 -130 -45 -66 -145
8056 -145 -317 -68 92 -23 94 81 -170 -237 169 -7 11 -197 -231 156 23 166 91 9 -9 -109 138 98 -363
8079c63L08J70Mj37j32n3M56k9l48K89k59L92l02j76K09j38m2K19j07J08r8L89
8101C60o89P49m18J34o1R3N6q2k28j69J60M40n02J19j22j58L93k41j13J69J47
8122C7j04J68l02l4J15J34J91l69J91J29J86k65j48m9J31r1q6k16J32K27J95j62
8144A0j71n7K0m5L73o0L3j47J78q8k1k36M54j40k12j99L26K11j1N2m45L45M7m1
8168A76j5j3kk20K23n9k97O7nM11j60j2j5M3KJ11l98L89j54k63K18P9m
$$ plain form
8079 -363 -55 115 119 -18 -150 -203 253 224 -124 165 -94 298 -4 -180 29 -109 -151 68 -39 69 -29 360
8101 360 -329 420 2 136 75 168 224 142 -86 -255 -95 345 -157 -38 -160 -318 75 -166 -279 -110 37
8122 37 -67 101 -201 -235 -120 14 205 -164 27 156 342 77 -71 -120 11 -80 -166 -382 -250 -23 172 10
8144 10 -161 -218 -198 -243 130 70 103 -44 134 46 25 -211 243 103 -109 -308 18 229 218 270 -175 170 217 176
8168 176 161 148 146 -74 149 90 -207 -140 -145 266 106 94 79 122 124 235 -163 226 72 -191 27 106 102
8191A02
$$ Imaginary data points
##PAGE= N=2
##DATA TABLE= (X++(I..I)), XYDATA
0@%%%%%%%%Qj6J6j6J6k4L2l7M5n6O4p2Q8j04J20j39J60j83K09k36K67l04L45l87
32b04M35m87N42o04O72p46Q26r16J016j125J247j380J526j691J879k093K335k616
50a384K948l342L822m422N195o236P721j0026J4117k3538Q5104J2046j64263K1402
64f0856N8008M2559K2339n2386j10222M7603J30330J976j00923l9605K0601O3201
76B2625N5255m8334j08013J0615R9838M0524m5208o9140k9494P0195Q1985l6478
88D4370r2286j6400N0830O3840J5258p9450p2616O0662R3401j3142o7838m0367
100e3738O092P3072N5524o8311q8871L0178Q1740K3057l5846o2184k6658O6421
112D76P3643l7188q5094j0823N5953N4980P20p1826n2372N2069P3106n460n6012
$$ plain form
0 0 0 0 0 0 0 0 0 0 8 -8 8 -8 8 -16 16 -21 24 -32 32 -40 48 -56 64 -75 85 -98 111 -125 142 -162 183 -204
32 -204 231 -256 286 -318 354 -392 434 -482 534 -591 656 -724 802 -889 990 -1103 1232 -1384
50 -1384 1564 -1778 2044 -2378 2817 -3419 4302 -5724 8393 -15145 69959 82005 -82258 -60856
64 -60856 -2848 39711 62050 9664 -100558 -52955 77375 79351 -21572 -61177 -40576 22625
76 22625 77880 29546 -78467 -67852 31986 72510 27302 -41838 -71332 -1137 80848 44370
88 44370 -47916 -64316 -13486 50354 65612 -13838 -86454 -25792 67609 54467 -13371 -53738
100 -53738 -47646 25426 80950 12639 -76232 -46054 35686 58743 22897 -39287 -65945 476
112 476 74119 36931 -48163 -58986 -3033 51947 52667 -19159 -71531 -19462 53644 48184 -7828
125g828m8031J1317Q0544L6681p1615o4285K8810N7580K8285k2222p1306k6751
137f8821P9533O3646n0208o8302j240L8990N0280J0342p3926n5781N9617P5065
149E9195j6177n9092l3259J6165O4218L4472o1952o7337K7006O7495K1951l6612
161A6073o0274r848O8181M9493m0613o3415q731M6651N3907p520p3343l3798N6241
174f996N7753j2064n2302l7242J9961O8854K2673o7188n3861L3874N7139J5714
186D6315l2457n7501o911O9068M4131m6116n9982J189M6769M2940j1962o4683
198b9200k8689N3505N4716j5101n3866k9454K6813O0484J1162o0382m3643K9985
210b3670N3243J5468l6812n2620L114O4076L1873m4246n0080J780M2993M0184
$$ plain form
125 -7828 -55859 -44542 36002 72683 1068 -63217 -34407 23173 51458 29236 -42070 -68821
137 -68821 10712 74358 24150 -44152 -45392 -6402 43878 54220 -19706 -75487 -15870 59195
149 59195 43018 -16074 -49333 -33168 31050 65522 3570 -63767 -36761 30734 52685 16073
161 16073 -44201 -54049 14132 63625 23012 -40403 -49134 -2483 51424 43904 -29439 -63237 -6996
174 -6996 50757 38693 -13609 -50851 -30890 37964 60637 -6551 -60412 -26538 30601 46315
186 46315 13858 -43643 -50554 18514 62645 16529 -43453 -42264 4505 47445 35483 -29200
198 -29200 -57889 -4384 50332 35231 -18635 -48089 -21276 39208 50370 -10012 -53655 -23670
210 -23670 29573 45041 8229 -44391 -41277 22799 54672 10426 -39654 -37874 5119 45303
222D5303j4718o3046j9184N4048M4443j8384m6972k5949K6468N6071O530n8253
234a3643l6756L1890M9462R766l6757m5938O224N8843K6476m3304m5633N788M2603
247I021L5052j8730n7650j3150N1063L8241j9903m4248k2009K9075N2203M59n5915
260a6491k9155L2610M3376O725l6441m2644J1404N6219J9418m2815l9357Q191
272b8960M0742K9979k2007n2869p820M9773L2562k1949m1434j6276L0090M6725
284C8556m300n3205k3540L3381L8926L024l6278l6573J5265N2266J2820m1482
296a140l4493J0035L9710K4942k5154m7779j730M7415K6659k2281l9204j2796
308c5816L2148M1699j0238m9019j6684L1886L5318Q30l6545l2954J9833M9057
$$ plain form
222 45303 30585 -32461 -51645 2403 46846 28462 -18510 -44459 -17991 38080 44610 -13643
234 -13643 -50399 -18509 30953 40719 3962 -41976 -35752 23091 49567 6263 -39370 -33582 9021
247 9021 44073 25343 -32307 -45457 5606 43847 23944 -20304 -42313 -13238 38965 39424 -16491
260 -16491 -45646 -13036 30340 37065 624 -42020 -30616 25603 45021 2206 -37151 -28960
272 -28960 11782 41761 19754 -33115 -40935 8838 41400 19451 -21983 -38259 -8169 38556
284 38556 34256 -18949 -42489 -9108 29818 32842 -3436 -40009 -24744 27522 40342 -1140
296 -1140 -35633 -25598 14112 39054 13900 -33879 -35609 11806 38465 16184 -23020 -35816
308 -35816 -3668 38031 27793 -21226 -37910 -6024 29294 30124 -6421 -39375 -19542 29515
320B9515N848m0686k8257J1445L7076K3157k8090m5299N063M5530J9951k3270
332A1983l4527j0916L2891L8276j4049m7849j0571L3283L0234k367l4383l0053
344c8048K2285M6579P54m0395k3165J4587L4231J8348k8727m1159Q192M3928J6045
357C3455k5232l2298n469L2370L3430j7046m3858p508L3511K7832o169l5048k3233
370c5263K4761M0796k874l7750k0762J6015L4289J3596l1077l5764J2799L9593
382A8359J2009k4175l0583l302L4027K8962k1211l9739j717L0496K4456o747l4640
395a3805k0674K7537L8274p810l6156j6058J6633L1791J1307l1926l3604J6554
407a7937L8987O949k5134k7356m09L3411K6119k3311l8331J585L1773K0854r621
$$ plain form
320 29515 35363 -5323 -33580 -22135 14941 38098 10008 -35291 -30228 15302 35253 11983
332 11983 -22544 -33460 -569 37707 23658 -24191 -34762 -1479 28755 26388 -7995 -38048
344 -38048 -15763 30816 31570 -8825 -31990 -17403 16828 35176 6449 -34710 -26518 17410 33455
357 33455 8223 -24075 -29544 2826 36256 19210 -24648 -32156 1355 29187 23018 -12030 -35263
370 -35263 -10502 30294 27420 -10330 -31092 -15077 19212 32808 1731 -34033 -21234 18359
382 18359 30368 6193 -24390 -27692 6335 35297 14086 -25653 -27370 3126 27582 20835 -13805
395 -13805 -34479 -6942 31332 23522 -12634 -28692 -12059 19732 31039 -887 -34491 -17937
407 -17937 21050 27999 2865 -24491 -24900 8511 34630 11319 -27012 -25427 6346 27200 17579
420A7579l3186j6512K8637L4124r873l5316j3330J9058L0375O066l1928k9001
432c3307J8519L6484N164k6314k5836L493L3902K0351k5240l3936L412L1396J9401
445B7489j2662l3285j1639L0515L0181j3620l2369j1330K0126K9946J937l3948
457h659k2986K0929L2844K061k5611k4305O547L4298J5305k7159l0059P234K9208
470I647J6744j4226l2659p219L2102K5136j5936l0038q355J9968K8449l69l4450
483a1206j9187K3889K9119j570k4296k1529P106L4212J3036k9987k6910J1441
495a5882K7159J2916j4095l0200o130L2389K3278j8870k9389l652K1053K4480
507B3057k430l2528j7339K4418K8342l638k6149j8757J1457L1532Q442k8543k3899
$$ plain form
420 17579 -15607 -32119 -3482 30642 20769 -14547 -27877 -8819 21556 27622 -4306 -33307
432 -33307 -14788 21696 26860 546 -25290 -21797 12105 32456 7216 -26720 -23308 8088 27489
445 27489 14827 -18458 -30097 418 30599 16979 -15390 -26720 -6594 23352 25289 -8659
457 -8659 -31645 -10716 22128 24189 -1422 -25727 -19180 15118 30423 3264 -26795 -19561 9647
470 9647 26391 12165 -20494 -27713 4389 29525 13589 -16449 -24804 -4836 23613 23244 -11206
483 -11206 -30393 -6504 22615 21045 -3251 -24780 -17674 16538 29574 -413 -27323 -15882
495 -15882 11277 24193 10098 -20102 -26232 6157 29435 10565 -18824 -22476 -1423 23057
507 23057 20627 -11901 -29240 -4822 23520 19882 -6267 -25024 -13567 17965 26407 -2136 -26035
520b6035J1141K7301J1940j7363k9502o30L1987J8942j9582k6286l439K0969K4480
533B3923n290l3978j2420K6396K4807o423k4156j6808J1895L1246O017k9744k1797
546b6332J4263K6716Q253j8765k6341J676L0563J6613j9776k6191j433K3200K2246
559B4692r945l1342q098K5177K1560n997k4110j6665J5312L1048Q44l0760j5469
572b3753J4495K2944Q513j8638k7782M955L3018J1340k2610k1431J230K1393J9815
585B3489r655l1559o560K7350J9652r366k3622j2723J5898K8510j116k9100j4740
598b3542J5288K3717N968k1016k4223Q419L0245P515k0640k0275J147K2856J9108
611B4567j4069l0161j349K6435J5721r538k2084j2180J7919K7115m306k9376j1147
$$ plain form
520 -26035 -14894 12407 24347 6984 -22518 -23148 8839 27781 8199 -18087 -21526 -557 23923
533 23923 18633 -15345 -27765 -1369 23438 17015 -7141 -23949 -12054 19192 25209 -4535 -26332
546 -26332 -12069 14647 22900 4135 -22206 -20530 10033 26646 6870 -19321 -20754 2446 24692
559 24692 14747 -16595 -24693 484 22044 16047 -8063 -24728 -9416 21632 22476 -8284 -23753
572 -23753 -9258 13686 22199 3561 -24221 -19266 13752 25092 2482 -18949 -17719 3674 23489
585 23489 13834 -17725 -24285 3065 22717 13351 -10271 -22994 -7096 21414 20298 -8802 -23542
598 -23542 -8254 15463 21431 415 -23808 -15389 14856 22371 1731 -18544 -17397 5459 24567
611 24567 10498 -19663 -21012 5423 21144 11606 -10478 -22658 -4739 22376 18070 -11306 -22453
624b2453J6878K1064M243k1139k2108J0115K9310N799k1947j8837L600K3106J5675
637B3306j6028k6858J058K4092J4981r665k3419r564K0599K4006q011k6550q128
650b0181J5382K0478L670k2661k0675J3764K7009J946k0193j6725L854K2962J4647
663B3277j8016k5890M076K4216J1948j0725k1905p876K0893K2178r238k5845o481
676a9388J6500J9466P80k2979j7191J4687K5406N00k0509j5764O048K2941J1386
689B1883j9000k2773N284K3312J0551j1621k2098m967K2239J8977j0921k3719
701a2853n490J6406J9251j416k3575j4229J6697K2149j043j9469j4817O874K3486
714A1971R322k1336k0096Q131K0954R183j1658k1551l303K3081J6799j3774k1750
$$ plain form
624 -22453 -5575 15489 19732 -1407 -23515 -13400 15910 21709 -238 -19075 -15475 7631 23306
637 23306 7278 -19580 -18522 5570 20551 10886 -12533 -22097 -1498 22508 14497 -12053 -20181
650 -20181 -4799 15679 19349 -3312 -23987 -10223 16786 18732 -1461 -18186 -14332 8630 23277
663 23277 5261 -20629 -16553 7663 19611 8886 -13019 -20895 -2 22176 12938 -12907 -19388
676 -19388 -2888 16578 17358 -5621 -22812 -8125 17281 17781 -2728 -18492 -12444 10497 21883
689 21883 2883 -19890 -14606 8706 19257 7636 -14462 -19429 2810 21787 10866 -12853
701 -12853 -18343 -1937 17314 15898 -7677 -21906 -5209 16940 15897 -3572 -18389 -11515 11971
714 11971 21293 -43 -20139 -12008 8946 18129 6471 -15080 -18383 4698 21497 7723 -14027
727a4027k577J6402J6892k503k3079j2307J7656K1444l515k0314j1903Q402K2252
740A2823O400k0714j8416R435K0474P462j3279j9642o70K2587J3837j4193k0522
753a4418j054J6896J5361m576k2355r707J8439J9001n184j8660j0440R160K0526
766A2989M764k0681j6201J0365K0249M627j4102j7313P85K1886J2046j4816j9683
779a5085P87J7326J4182o915k1329p237J8292J7154o208j8263r533J0653K0504
792A4328J936k1124j3358J1609J7978L977j4002j7359K769K2357R137j5992j7113
805a4857K930J5871J2390p281k0983n584J9230J5173p689j7500p383J1376J8844
818A4537M16k0977j1871J2573J7522J896j4529j5584M944K0592Q024j6469j5965
$$ plain form
727 -14027 -16604 -202 16690 14187 -8892 -21199 -3543 17901 14386 -5928 -17831 -9429 12823
740 12823 19223 -1491 -19907 -10472 10002 17464 4185 -15457 -16127 6460 20297 6104 -14418
753 -14418 -15472 1424 16785 12209 -10146 -19853 -1414 17587 12403 -6257 -16697 -7537 12989
766 12989 17753 -2928 -19129 -8764 11485 16112 2010 -15303 -14518 7368 19414 4598 -15085
779 -15085 -14298 3028 17210 10295 -11034 -18271 21 17175 10967 -7296 -16829 -6176 14328
792 14328 16264 -4860 -18218 -6609 11369 15346 1344 -16015 -13246 9111 18248 2256 -14857
805 -14857 -11927 3944 16334 9053 -11930 -17514 1716 16889 9200 -8300 -15683 -4307 14537
818 14537 14953 -6024 -17895 -5322 12200 14096 -433 -16017 -11073 9519 17543 1074 -14891
831a4891L669J6283J0790q322k0284l303J9541J3241r128j6453n914J2231J7096
844A4556j477k0473r873J3595J5821L58j3979j3942N815K0158N587j6623j4041
857a4518M542J5660R693r844j8719j418J9501J1092r740j5777m536J2696J6299
870A4931l251k0292p188J3991J4251p15j4511j2748P429J9802L303j7219j2137
883a4354N412J5756Q007j0833j7822R91J8687R037r977j5010l383J3517J5185
896A5213n804j9251m708J3988J3228k178j4241j1547Q888J8915R49j7263r969
909a3780O834J4310P002j1286j7250K963J8509O891j1205j3412j516J3226J3840
922A5126o555j8638l758J4413J1825l145j4375r494R789J7419o63j6638q732P433
$$ plain form
831 -14891 -11222 5061 15851 7529 -12755 -16058 3483 16724 7596 -8857 -14771 -2540 14556
844 14556 13079 -7394 -17267 -3672 12149 12507 -1472 -15414 -9599 10559 16146 -477 -14518
857 -14518 -9976 5684 15377 5533 -13186 -14604 4897 15989 6249 -9528 -14064 -1368 14931
870 14931 11680 -8612 -15800 -1809 12442 11727 -2784 -15532 -8103 11699 15002 -2217 -14354
883 -14354 -8942 6814 14821 3988 -13834 -12843 5844 14881 4904 -10106 -13489 28 15213
896 15213 9409 -9842 -14550 -562 12666 10488 -3753 -15300 -6412 12503 13452 -3811 -13780
909 -13780 -6946 7364 14366 3080 -14170 -11207 7302 14193 2988 -10424 -11940 1286 15126
922 15126 8571 -10067 -13825 588 12413 9268 -5107 -14601 -4812 12607 11944 -4694 -13426 -5993
936e993J4509M995j2603j5407M966J7538N015j1005j2565m59J3594J2316q153
949F748j7913j367J4696J0078m437j3591q280J0862J6297k078j6590p846Q983
962d438J3391L434j2956j3571O034J6642M586j2005j2389J272J4356R536r256
975D636j5486p37J3971R999m694j5217o164J2694J4255m630j4676o196P873J3767
989I395L139j4968j2024Q240J5670J648j0919j1027J078J5082R022j1362j5057
1002a2083K443J3099Q128n588j4247m791J3640J2646n946j4611m290Q842J2508
1015I750J175j4065j0746R321J4455L11j1129j0051K793J4118P607j1788j3568
1028a1817L393J3041O497o126j3326l609J3181J1903p005j3520l838R893J1559
$$ plain form
936 -5993 8516 13511 908 -14499 -9533 8005 13020 2015 -10550 -11009 2585 14901 6748
949 6748 -11165 -12532 2164 12242 7805 -5786 -14066 -3204 13093 11015 -5575 -13421 -4438
962 -4438 8953 12387 -569 -14140 -8106 8536 13122 1117 -11272 -10000 4356 13892 4636
975 4636 -10850 -11587 2384 12383 7689 -7528 -13692 -998 13257 8627 -6049 -12245 -4372 9395
989 9395 12534 -2434 -14458 -6218 9452 11100 181 -10846 -9768 5314 14336 2974 -12083
1002 -12083 -9640 3459 11587 5999 -8248 -13039 601 13247 7301 -7310 -11600 -2758 9750
1015 9750 10925 -3140 -13886 -4565 9890 10201 -928 -10979 -8186 5932 13539 1751 -11817
1028 -11817 -8424 4617 11114 4988 -8338 -11947 1234 13137 6132 -7388 -11226 -1333 10226
1041A0226r4j4325q795R242J3585m32j1513r090M133J4155N225j1857j2325M074
1055g791J2525O272o548j3731j850J3767R864p343j2841k707R275J1981j540j4868
1069e535p368J1041J2078j579j0970q770M498J4845M034j3582j0805N799J1952
1082E638N384p867j3097p14J5196Q402r197j2242j106R922J0400k435j4794n681
1096a2191J1330J1622k943j1201p732N974J3779K796j3818r500O636J1318M207
1109A0277q367j2018N60J4642P397r929j1648LJ0702R148l887j4379m442J2126
1123A85J0348l580j1342o371O501J3752N32j3322q233P105J1375L035r165j1311
1137a0491K317J4229N094r706j0378P53J0432Q398m812j4182j959J1572Q700m058
$$ plain form
1041 10226 10132 -4193 -12988 -3746 9839 9407 -2106 -11196 -7063 7092 12317 460 -11865 -7791
1055 -7791 4734 11006 4458 -9273 -11123 2644 12508 5165 -7676 -10383 -1108 10873 9333 -5535
1069 -5535 -12903 -1862 10216 8637 -2333 -11103 -6605 8240 12274 -1308 -12113 -6314 5638
1082 5638 11022 3155 -9942 -10656 4540 12942 3745 -8497 -9603 319 10719 8284 -6510 -12191
1096 -12191 -861 10761 7818 -3383 -11115 -5141 8638 11434 -2384 -11884 -5248 6070 10277
1109 10277 1910 -10108 -9548 5094 12491 2562 -9086 -9083 1619 10767 6880 -7499 -11941 185
1123 185 10533 6953 -4389 -10760 -4259 9493 10025 -3297 -11530 -4425 6950 9985 820 -10491
1137 -10491 -8174 6055 11149 1443 -8935 -8182 2250 10648 5836 -8346 -10305 1267 9967 5909
1151E909j0396o279P591J2748k74j3639o481P574J0437K276r114j1001L273J4156
1165F780L750r969r436J296J0091Q314n792j3821r01J2279P264m833j0143m742
1179i863P545J2320j857j3108n027P656R336J840r388j0141M214J3974K689j0623
1193d33q096J966R529P800o518j3489J8J2387P013o212r604m032Q343J1568k611
1208G629j3171m950Q697R603J01r684q453M670J3089J845j0394q028K742J0141
1222C837O771p986j1987J638J1209N958n478j0452l439R961J0132l764j2646l233
1236i479Q578Q632J1r776q809O805J2366K95j0348p270L514J0195N494q373j1314
1251i479K539J1045N192o494r538j959R798Q727m879j1197k855Q334Q868p69j0984
$$ plain form
1151 5909 -4487 -10766 -3175 9573 9299 -4340 -10821 -3247 7190 9466 352 -10649 -7376 6780
1165 6780 10530 561 -8875 -7579 2512 10826 5034 -8787 -9688 2591 9855 5022 -5121 -9863
1179 -9863 -2318 10002 8145 -4963 -9990 -2334 7002 8842 -546 -10687 -6473 7501 10190 -433
1193 -433 -8529 -6563 2966 10766 4248 -9241 -9223 3164 10177 3965 -5639 -9671 -1328 10240 7629
1208 7629 -5542 -10492 -1795 7808 7909 -1775 -10228 -5558 7531 9376 -1018 -9046 -6304 3837
1222 3837 10608 2622 -9365 -7727 3482 9440 3962 -6490 -9929 32 10164 6400 -6246 -9479
1236 -9479 -901 7731 7742 -2034 -10843 -4038 8328 8623 -1725 -8995 -5481 4714 10208 1835 -9479
1251 -9479 -6940 4105 9297 2803 -6735 -8694 1104 9831 4952 -6245 -9100 -766 8102 7333 -3651
1266c651o501P506J1069p72r946o118L174J0446N044r654j0460M225J0468L767
1280H597o126r190j859J0079Q682n805j1594r52Q488P465j768r864n811P098J1383
1295H823j589j0382n178M483R495L523r299r211M024J0548K881o426r039l03J0161
1310B511P517o690j0655j85Q398O924k181j0363m922Q310R888k189r855m417M672
1325c237R200K208r045q609M830J0571J712o984p972K17J0223O318o789r981L12
1340g026Q516O543l180j0051l577Q571Q714l215q983m264N090R368J501r934p214
1355i141N726R057J721p209p546J158J0092N314p377r520J474Q620N253l282r647
1370e307l403R245Q289l942q919l738O000Q405P52j0086o019N713R248P56p385
$$ plain form
1266 -3651 -10152 -2646 8423 7651 -2295 -8413 -5239 5207 10251 597 -9863 -5638 4830 8597
1280 8597 2471 -6719 -8578 1501 10183 4378 -7216 -8168 320 7785 6017 -3847 -9658 -2560 8823
1295 8823 7234 -3148 -8326 -3843 5652 9175 -124 -9335 -5311 5237 8118 1692 -7347 -7650 2511
1310 2511 10028 3338 -7317 -7502 896 7820 5639 -4724 -9646 -1336 8552 6363 -3492 -7909 -3237
1325 -3237 5963 8171 -874 -9483 -4653 5918 7630 646 -7326 -7109 3114 9432 2643 -7338 -7026
1340 -7026 1490 8033 4853 -5198 -8775 -204 8510 5295 -3688 -7952 -2862 6506 8007 -1927 -9141
1355 -9141 -3415 5642 7363 154 -7392 -6234 3858 9172 1795 -7725 -6251 2369 7622 4340 -5307
1370 -5307 -8710 535 8824 4882 -4037 -7775 -1775 6630 7382 -2704 -8723 -3010 6238 6994 -391
1385c91p152J922J0142M203p814q372J763Q056N454m311r431k240R207P353m349
1400D040q711k383N377Q578m00r639n761O797Q529l96o988o435K407J0010L117
1415H142p991p688K420Q030M501m699q942j195R458O094m827q135j859O222P672
1430G203j558r729m105O986P295k46p302o145L311R273K383q187o553L261P314
1445C201M294n366q706j93R593M725m976p630j239N889P613k145r409l300O779
1460h70P306j171p033n612L541R649J217q385n710L156P475L457n258q836J343
1475e731R232M229n778p045j331P006O503k677r079k395P056O475j868o828n108
1490g339M725Q865K85q556m870L728O984K773o016p438J696Q808L258n738o642
$$ plain form
1385 -391 -7543 -5621 4521 8724 910 -7462 -5699 2357 7811 3500 -5931 -8171 1036 8389 4040
1400 4040 -4671 -7054 -1677 6901 6501 -3138 -8899 -2102 6427 6031 -957 -7392 -4985 5025 8142
1415 8142 151 -7537 -5117 2913 7414 2715 -6227 -7422 2036 8130 3303 -4832 -6691 -469 7203
1430 7203 5645 -4084 -8189 -1203 6092 5846 -1456 -7601 -4290 4983 7366 -821 -7374 -4113 3201
1445 3201 7495 2129 -6577 -6770 2823 7548 2572 -5058 -6297 -408 7205 5060 -4349 -7649 -870
1460 -870 6436 5265 -1768 -7380 -3839 5810 7027 -1358 -7068 -3912 3563 7020 1762 -7074 -5731
1475 -5731 3501 7730 1952 -5093 -6424 582 7085 4408 -4671 -7066 -10 6465 4597 -2231 -7339
1490 -7339 -2614 6251 6536 -2020 -6890 -3162 3822 6595 579 -6859 -5163 3645 6903 1165 -5477
1505e477j42O789O189l703r006j327P436N312j796p026m228M844Q401l63q217
1520b314m253L869O840K171o026p454K775Q383K560n857o173J53O835N780l957
1535C332q926m23P091N254k621o765l539N348P609j219q088l361M345O095K194
1550F326o830o255L049P941J864n647n859N89P120M598m755p504P9O725M713k643
1566C511o647l257N669P261k261p387k932M050O711R95o730n729L719P643R80
1581E596n807n025Q01O883M245n203p235Q69O811L819k845o661k495O319O439
1596F511k833p168j956L946O316N85p255m994M395P187M06n621n003J666O821
1611C003L696n928o851J736O664L228l106o453j784O424O070l459p318j216M458
$$ plain form
1505 -5477 -5619 1170 7359 3656 -5350 -6677 759 6071 4275 -2751 -6979 -2135 6266 5903 -2314
1520 -2314 -6567 -2698 4142 6313 287 -7167 -4392 3991 6551 694 -5479 -5326 1509 7289 3332
1535 3332 -5594 -6017 1074 6328 3707 -3058 -6597 -1249 6360 5141 -2947 -6308 -1963 4132 6326
1550 6326 -504 -6759 -3710 4231 6095 448 -5411 -4822 2298 6896 2141 -5363 -5284 1441 6154 3511
1566 3511 -3136 -6393 -724 6537 4276 -3111 -6043 -1993 4718 5713 -1017 -6746 -3027 4616 5596
1581 5596 -211 -5236 -4435 2448 6693 1490 -5745 -4876 1935 5754 2909 -3752 -6247 72 6511
1596 6511 3678 -3490 -5446 -1500 4816 5401 -1854 -6848 -2453 4734 5140 -481 -5484 -3818 3003
1611 3003 6699 771 -6080 -4344 2320 5548 2442 -4011 -5795 629 6699 3240 -4078 -5294 -836
1626h36N623Qo938m436M600P067k2o352m025J892O939K548n656o482J944O503
1642B377K833l409o242p85O617M884l284p032j148N330M873n41p064l666N115
1657a142O664j068n782m165K384O768K194o614n092K174O479K644m163n665m02
1672d786O389M527m149o255m32M752N371j483o965k714M957N603p48n780l527
1687e240K422O760J622o696m509K747O132J837m250n851M78O963L166m202n662
$$ plain form
1626 -836 4787 4795 -2143 -6579 -1979 5088 5066 -1286 -5311 -3419 3520 6068 412 -6070 -4126 2377
1642 2377 5210 1801 -4441 -5226 1391 6275 2991 -4041 -5189 141 5014 4473 -2591 -6257 -1142
1657 -1142 5522 4454 -1328 -5493 -3109 3659 5853 -761 -5853 -3679 2800 5444 1281 -4384 -4786
1672 -4786 1603 6130 1981 -4274 -4706 46 5417 3934 -3031 -5745 -788 4815 4067 -1713 -5240
1687 -5240 -2818 3942 5564 -1132 -5641 -2894 3238 5075 825 -5026 -4548 2415 5581 1379 -4283
$$ [...]
8191G3
##END NTUPLES=NMR FID
##END=
