##TITLE=1H_DE-44_EA3c_W
 D2O
 8 sc, 
 10.4.2024
##JCAMPDX= 6.0         $$ Bruker NMR JCAMP-DX V2.0
##DATA TYPE= NMR FID
##DATA CLASS= NTUPLES
##ORIGIN= UXNMR, Bruker Analytische Messtechnik GmbH
##OWNER= root
$$ XWIN-NMR		Version 3.5
$$ Wed Apr 10 16:35:42 2024 Russian Standard Time (UT+4h)  she@DPX200
##.OBSERVE FREQUENCY= 200.1309
##.OBSERVE NUCLEUS= ^1H
##.DELAY= (6, 6)
##.ACQUISITION MODE= SIMULTANEOUS
##.ACQUISITION SCHEME= undefined
##.AVERAGES= 8
##.DIGITISER RES= 18
##SPECTROMETER/DATA SYSTEM= spect
##.PULSE SEQUENCE= zg30
##.SOLVENT NAME= CDCl3
##.SHIFT REFERENCE= (INTERNAL, CDCl3, 0, 15.7039)
##AUDIT TRAIL= $$ (NUMBER, WHEN, WHO, WHERE, WHAT)
$$ ##TITLE= Audit trail, XWIN-NMR		Version 3.5
$$ ##JCAMPDX= 5.01
$$ ##ORIGIN= Bruker BioSpin GmbH
$$ ##OWNER= she
$$ F:/spectra/data/she/nmr/H-F/1/audita.txt
$$ ##AUDIT TRAIL=  $$ (NUMBER, WHEN, WHO, WHERE, WHAT)
(   1,<2024-04-10 16:34:47.84 +0400>,<she>,<DPX200>,
      <created by zg, POWCHK disabled, PULCHK disabled
       configuration hash MD5:
       00 E9 B6 7A A2 85 ED C7 34 08 36 98 17 FE 4E 26
       data hash MD5: 16K
       69 53 70 F6 D9 B1 EF 53 17 B5 BE 1A B2 70 5C 5A>)
$$ ##END=
$$ 
$$ hash MD5
$$ 07 DC 9C 19 C4 76 9D 88 AA CB 31 E6 15 D7 80 6B
##$RELAX= 
##$RELAX= 
##$RELAX= 
##$RELAX= 
##$RELAX= 
##$RELAX= 
$$ Bruker specific parameters
$$ --------------------------
##$DU= <F:/spectra>
##$EXPNO= 1
##$NAME= <H-F>
##$PROCNO= 1
##$TYPE= <nmr>
##$USER= <she>
##$AMP= (0..31)
100 100 100 100 100 100 100 100 100 100 100 100 100 100 100 100 100 100 
100 100 100 100 100 100 100 100 100 100 100 100 100 100 
##$AQSEQ= 0
##$AQ_mod= 1
##$AUNM= <au_zg>
##$AUTOPOS= <>
##$BF1= 200.13
##$BF2= 200.13
##$BF3= 200.13
##$BF4= 200.13
##$BF5= 200.13
##$BF6= 200.13
##$BF7= 200.13
##$BF8= 200.13
##$BYTORDA= 1
##$CFDGTYP= 0
##$CFRGTYP= 5
##$CHEMSTR= <none>
##$CNST= (0..31)
1 1 145 1 1 1 1 1 1 1 1 1 1 1 1 1 1 1 1 1 1 1 1 1 1 1 1 1 1 1 1 1 
##$CPDPRG= <>
##$CPDPRG1= <>
##$CPDPRG2= <>
##$CPDPRG3= <>
##$CPDPRG4= <mlev>
##$CPDPRG5= <mlev>
##$CPDPRG6= <mlev>
##$CPDPRG7= <mlev>
##$CPDPRG8= <mlev>
##$CPDPRGB= <>
##$CPDPRGT= <>
##$D= (0..31)
0 1.2 0 0 0 0 0 0 0 0.06 0 0.03 0 0 0 0 0.0002 0 0 0 0 0 0 0 0 0 0 0 0 
0 0 0 
##$DATE= 1712752487
##$DBL= (0..7)
120 120 120 120 120 120 120 120 
##$DBP= (0..7)
150 150 150 150 150 150 150 150 
##$DBP07= 0
##$DBPNAM0= <>
##$DBPNAM1= <>
##$DBPNAM2= <>
##$DBPNAM3= <>
##$DBPNAM4= <>
##$DBPNAM5= <>
##$DBPNAM6= <>
##$DBPNAM7= <>
##$DBPOAL= (0..7)
0.5 0.5 0.5 0.5 0.5 0.5 0.5 0.5 
##$DBPOFFS= (0..7)
0 0 0 0 0 0 0 0 
##$DE= 6
##$DECBNUC= <off>
##$DECIM= 32
##$DECNUC= <off>
##$DECSTAT= 4
##$DIGMOD= 1
##$DIGTYP= 9
##$DL= (0..7)
0 120 120 120 120 120 120 120 
##$DP= (0..7)
150 150 150 150 150 150 150 150 
##$DP07= 0
##$DPNAME0= <>
##$DPNAME1= <>
##$DPNAME2= <>
##$DPNAME3= <>
##$DPNAME4= <>
##$DPNAME5= <>
##$DPNAME6= <>
##$DPNAME7= <>
##$DPOAL= (0..7)
0.5 0.5 0.5 0.5 0.5 0.5 0.5 0.5 
##$DPOFFS= (0..7)
0 0 0 0 0 0 0 0 
##$DQDMODE= 0
##$DR= 18
##$DS= 0
##$DSLIST= <SSSSSSSSSSSSSSS>
$$ [...]
##$SUBNAM2= <"">
##$SUBNAM3= <"">
##$SUBNAM4= <"">
##$SUBNAM5= <"">
##$SUBNAM6= <"">
##$SUBNAM7= <"">
##$SUBNAM8= <"">
##$SUBNAM9= <"">
##$SW= 18.0517689322627
##$SWIBOX= (0..15)
0 0 2 0 0 0 0 0 0 0 0 0 0 0 0 0 
##$SW_h= 3612.71676300578
##$TD= 16384
##$TD0= 1
##$TE= 0
##$TE2= 300
##$TE3= 300
##$TEG= 300
##$TL= (0..7)
0 120 120 120 120 120 120 120 
##$TP= (0..7)
150 150 150 150 150 150 150 150 
##$TP07= 0
##$TPNAME0= <>
##$TPNAME1= <>
##$TPNAME2= <>
##$TPNAME3= <>
##$TPNAME4= <>
##$TPNAME5= <>
##$TPNAME6= <>
##$TPNAME7= <>
##$TPOAL= (0..7)
0.5 0.5 0.5 0.5 0.5 0.5 0.5 0.5 
##$TPOFFS= (0..7)
0 0 0 0 0 0 0 0 
##$TUNHIN= 0
##$TUNHOUT= 0
##$TUNXOUT= 0
##$USERA1= <user>
##$USERA2= <user>
##$USERA3= <user>
##$USERA4= <user>
##$USERA5= <user>
##$V9= 5
##$VALIST= <valist>
##$VCLIST= <CCCCCCCCCCCCCCC>
##$VD= 0
##$VDLIST= <DDDDDDDDDDDDDDD>
##$VPLIST= <PPPPPPPPPPPPPPP>
##$VTLIST= <TTTTTTTTTTTTTTT>
##$WBST= 1024
##$WBSW= 4
##$XGAIN= (0..3)
0 0 0 0 
##$XL= 0
##$YL= 0
##$YMAX_a= 80411
##$YMIN_a= -129457
##$ZGOPTNS= <>
##$ZL1= 120
##$ZL2= 120
##$ZL3= 120
##$ZL4= 120
##$ABSF1= 10
##$ABSF2= 0
##$ABSG= 5
##$ABSL= 3
##$ALPHA= 0
##$AQORDER= 0
##$ASSFAC= 0
##$ASSFACI= 0
##$ASSFACX= 0
##$ASSWID= 0
##$AUNMP= <proc_1d>
##$AZFE= 0.1
##$AZFW= 0.1
##$BCFW= 1
##$BC_mod= 2
##$BYTORDP= 1
##$COROFFS= 0
##$CY= 11.3945322036743
##$DATMOD= 1
##$DC= 2
##$DFILT= <>
##$DTYPP= 0
##$F1P= 15.6554695791079
##$F2P= 12.8336369535428
##$FCOR= 0.5
##$FTSIZE= 0
##$FT_mod= 4
##$GAMMA= 1
##$GB= 0.15
##$INTBC= 1
##$INTSCL= 1
##$ISEN= 128
##$LB= 0.24
##$LEV0= 0
##$LPBIN= 0
##$MAXI= 10000
##$MC2= 0
##$MEAN= 0
##$ME_mod= 0
##$MI= 1.114404
##$NCOEF= 0
##$NC_proc= 0
##$NLEV= 6
##$NOISF1= 3.799351
##$NOISF2= 2.8
##$NSP= 1
##$NTH_PI= 0
##$NZP= 0
##$OFFSET= 15.70392
##$PC= 1
##$PHC0= -25303.11
##$PHC1= 12.58731
##$PH_mod= 1
##$PKNL= yes
##$PPARMOD= 0
##$PSCAL= 0
##$PSIGN= 0
##$REVERSE= no
##$SF= 200.130013532006
##$SI= 16384
##$SIGF1= 3
##$SIGF2= 2
##$SINO= 400
##$SIOLD= 16384
##$SREGLST= <1H.CDCl3>
##$SSB= 0
##$STSI= 0
##$STSR= 0
##$SW_p= 3612.71676300578
##$SYMM= 0
##$S_DEV= 0
##$TDeff= 0
##$TDoff= 0
##$TI= <>
##$TILT= no
##$TM1= 0
##$TM2= 0
##$TOPLEV= 0
##$USERP1= <user>
##$USERP2= <user>
##$USERP3= <user>
##$USERP4= <user>
##$USERP5= <user>
##$WDW= 1
##$XDIM= 8192
##$YMAX_p= 0
##$YMIN_p= 0
$$ End of Bruker specific parameters
$$ ---------------------------------
##NTUPLES= NMR FID
##VAR_NAME=  TIME,          FID/REAL,        FID/IMAG
##SYMBOL=    X,             R,               I
##VAR_TYPE=  INDEPENDENT,   DEPENDENT,       DEPENDENT
##VAR_FORM=  AFFN,          ASDF,            ASDF
##VAR_DIM=   8192,          8192,            8192
##UNITS=     SECONDS,       ARBITRARY UNITS, ARBITRARY UNITS
##FACTOR=    0.0002768,     1,               1
##FIRST=     0,             0,               0
##LAST=      2.2672688,     0,               0
##MIN=       0,             -129457,         0
##MAX=       2.2672688,     80411,           0
$$ Real data points
##PAGE= N=1
##DATA TABLE= (X++(R..R)), XYDATA
$$ [...]
1937A54k59j17L04J03Lm47L00j15nJ90l26N43k07J3j05J12R5k41L0k7j39p0J52
1960e9J00l4Q6k1n9K37l89J01K55m01o0K63l9J08n7k05K90n9m7K71k84o5QJ11
1984E1q5j09NJ19K8q1J07j14N3J26M3j81j64L13k11J85j77K23nq2M1j07q3j62
2008b67K58K94l00j50Q3m3N7J16j10j63N09k92L8p6J65k06j7j68J23K5J43k90
2030b71J01K23o2l35O42k48M1k19J6K44l44J61j56M58k13j84L20L5l94m2J58L1
2052c8J09o7m5P8J84k24j78Q7L79l96J97J55k12l49M33o9J40j63k41J39J22k0
2074B1J36k90L04m45K62J5k50J23M4M5J48j83K54J42m01k55K20Q0l6R3j24J14
2096A7J37j14J04k23M3o7J75J9k51K24j30J85p9J55k94j04J42L2K89l43L08O0
$$ y = [154, -105, -222, 82, 185, 188, -259, 41, -74, -79, 111, -215, 328, 121, 134, 29, 141, 236, -5, 25, -2, -141, -211, -59, 41, 7, 93, 72, 13, 250, -139, -38, 217, -184, -244, 19, -20, 88, 31, -174, 116, 57, 10, 281, -3, -68, -60, 51, -34, -143, -138, -19, 9, -72, 35, -79, -26, 100, 143, -38, -202, 111, -100, 85, -92, 131, 126, 44, 85, -22, -105, -267, -9, 285, -15, -165, -82, -125, -68, 48, -62, -225, 284, -8, 30, -46, 119, -87, -104, -272, -149, -124, 19, -271, -170, 53, -9, -344, 298, 50, 91, -128, -112, 132, -212, -51, -207, 251, 38, -146, 174, 209, -185, -227, -69, -38, 71, 4, -41, 37, 221, -3, -181, -94, 285, -111, 86, 241, 29, -320, 113, 44, 184, 21, -220, -81, 41, 21, 157, -133, 171, -274, -12, 3, -247, -124, -80, -35, 113, -70, 184, 326, -75, -330, -110, -30, -66, 27, -97, 17, 154, 40, 144, -79, -36, -103, 72, 91, -160, 64, -66, 119, 40, 195, -99, -203, -61, -29, 260, -83, 225, 285]
2118B85k68m2l1J7J36l21J33J5K88m11K55m4J02k58Q7NJ49m17M30l2m6n9J66k2
2142A17q0J8KJ07j93p1M06m96M02N0k70k6J24k4j17j84J21L43k94p1J98j42j51
2165b31J67j05L82j07P3j58k12j8K31l19J62J09j78K91n8J97k07k44J37K06k06
2186h8O2J1k1m8R2K90k12k17L88k59q6N4J17n7M2m5k51n2M50k10R2K2q9p2L48
2211B61l45J51l3k9J16q2L1k6J03l89L78l00K90k31J75k45J38J00l7l00M20J1
2233A57l05J35l7K32k59J61P4r0J1j12o0k05K46K77j10k9J59j51l30J4L34k4N0
2256A38Rn26L65j02L65l63oN69j94j99j04J99J36n77K17J58j20p6J08Lr8K27M0
2279A69m18L99k26K00k00K37l7k58J25j92N17m96M67l42j50L05j39J06k20N07
$$ y = [285, 17, -25, -56, -39, 97, -224, -91, -76, 212, -199, 56, 12, 114, -144, -57, -52, 97, -320, 110, 78, 32, -27, 139, 117, 37, 55, 57, 164, -29, -100, 306, -190, 212, 262, -8, -34, 90, 66, -51, -235, -114, 229, -65, -136, 62, -80, -231, -64, -169, 213, 106, 179, 21, -191, -209, 22, -297, -135, -26, -204, 87, 29, 226, 19, -225, -88, 118, -88, -26, -15, -36, -84, 8, 298, 86, -131, 257, -2, -88, -34, 83, 26, 68, 23, -228, -280, 170, -40, 52, 74, -15, -87, 261, -84, 67, 34, 5, 121, 39, 70, 44, 147, -242, 136, -164, 126, -105, 70, -175, -37, 63, 26, -274, 146, 157, -148, -13, -50, 182, -77, 84, 158, 68, 79, -33, -93, -298, -52, 225, 115, 86, 245, 94, -236, -222, 112, 88, 138, 147, -379, -14, -116, 249, -114, -120, 449, 255, 56, -48, 151, 287, -290, -73, 85, -35, -111, -3, 0, -98, 129, 169, -249, 150, -76, 124, -76, 161, 124, -134, -9, -201, 316, -180, 287, -55, -205, 100, -39, 67, -153, 354]
2299C54j91k67J51j4mj05J30p9J79rj58K0Q5k32%K03k07k27L73K9j42O2K04k71
2323a16J69k25j30K62J00l86J80K61p0l10L29N1K16m72J74j06j37J59J20m56K65
2344a22l5J23J04k84J14J44j36N1J18J15j79J21l87L81n46M65Ok7j52R7K39j96
2366A4J94l30K21l33L60l9R0j93n8R0q0k6J73j29j85L61n7P5j59J15n3J67J4m01
2390a69O6j05L48l23j49J97K55J88l25P1j90J32q7K24j61m7K1R8k8m3j42Q6J32
2413D9J77k79J45q5R0J81j23N7r1j62j89K74N1k4l5j95K63K9j98K20n8k72l7Q7
2437a25K16n3P9l55L19n5o4o5J11o3J38OK3m05L23p2j37J70R2j14Q7q9L31j63
2461A35l5r8p5J98k82K60j7o2r3Q2j14K70l35M0N9k0j15K34J20j22nJ89jl36K31
$$ y = [354, 163, -104, 47, 33, 29, -76, 54, -25, 154, 145, -13, 7, 92, -140, -140, 63, -144, -371, 2, 31, -111, -49, 155, -116, 53, -172, -302, -40, 60, -326, -146, 115, 45, -265, 64, 115, 331, -141, 33, -73, -210, -51, 69, -387, -122, -157, -34, 70, -214, -100, 44, -92, -41, 77, 192, 13, 134, -253, 128, -418, 47, 53, 26, -126, -29, 210, 14, 208, -122, 99, -234, 126, 87, 177, -16, -74, 16, -64, -90, 83, -46, -231, 130, 73, 148, -11, 104, 51, 218, 232, -169, -103, -208, 140, -183, -332, -135, 120, 308, -17, 54, -136, -4, -91, 133, -28, -75, -54, 44, 16, -27, -169, -83, 49, 226, -53, 92, 7, 97, 278, 155, 212, 121, -41, -230, 44, 95, 71, 36, -159, 104, 133, -65, 155, 97, -175, -212, -125, 91, 38, 117, -238, 81, 26, -38, -103, 8, -55, 83, 89, 112, -293, 30, -42, -179, -9, 83, -31, 56, -33, 298, 135, 100, 2, -73, 125, -157, 103, 86, 24, -69, 13, -101, 169, -166, -126, -67, -87, -202, 32, 152, 30, 25, 214, 213, -123, 108]
2486A08j8l6j8J98j8j4k36j39M43m00k13J34R5J40q7Lp3K61j27L9qJ54m5j58m6
2511f1l1R8K28k39j1k36L9L31k27J41Q5Lk28q9N5N9J87p0K61n49M42l01J51j82
2535a44J55O2J8On5J67m64L44L0k95K59j9J8k06L01l61qN5M46k13P2k07J4K35
2559B10m23K98j33j8J19r4l3R8r0K62l00J65k4k87K94p7K46k71P4J06l79L61k1
2582H3j34J45k57J41N68o66L52j99J4k40J66O3p0J9K60l00K8P7J3L2k8j80pL27
2606B07j81K6k81L59k19l1M9k6RK26J65k95j29J67Q8l17K26N7k07J35l5J56O4
2629B13o7l48M43l29j38L46J9j51jM15m73J11J12l2l44L1J77n5Q4j8P9j25J68
2652A17j88K53l5k29R0O0j06nRj16J06k67l4J53K94j09k11K15o2q6L36m8nq1k45
$$ y = [108, 90, 54, 36, 234, 216, 202, -34, -173, 270, -130, -343, -209, -114, 26, -61, -58, -131, 130, 3, 42, 34, 188, 143, -15, -61, -92, 6, 234, -5, -16, -252, -213, 118, -109, 32, 117, 120, -108, -197, -142, -83, 104, 34, 295, -254, 188, -113, 38, -144, 11, 73, 91, 97, 42, 209, -255, 89, 119, -176, 83, 64, 82, -124, 177, -184, -192, -137, 309, 96, 168, -39, -25, 210, -213, 85, -48, -66, 53, -41, -74, 24, -66, 196, -104, 61, 37, -250, 44, -33, 213, -58, 16, 122, -257, 104, 83, -51, 94, -163, -22, 546, -120, 232, 33, 47, -193, -27, 36, -34, -15, 245, -55, -27, 50, 63, 95, 67, -113, -120, 207, 26, 52, -229, 130, -89, -120, -71, -97, -88, 138, 303, 8, -121, 46, 134, -183, 43, 100, -107, 28, -7, 149, 213, 146, -202, 241, -88, -226, 120, 139, -12, -13, 402, -71, 40, 152, 120, -224, -193, -16, -71, 13, -5, 74, -51, 117, -71, 182, 147, -82, 8, 68, -38, -43, -34, -150, -44, -311, -345, -192, 102, -7, -218, -3, -65, -151, 185, 137, 132, 51, -194]
2677a94J68J4nMK1r2J50j38J62M9k55K62Q0k50Rl66K84J01m2K06l19J03J12J0
2701G4Q5j46N2m1J6M7j05K2j12k8L41M5l00m8J26L8J07p7Rj79J73l94K98J21j55
2726c1j00J86k4Q6k02J36l61J21K24m9j67L60k88K77k15j05R8J1J34j6l80N54
2748B49%m1p9l8K9J25j18k79J66j19J82q9n4J44j01J30Q8j01k64J60K20k02q5
2771g7J41N1J3k10N4n1J37k69J05K02m73N09j62j8j68K76k1Jq0K47k64p0L91l08
2795d4J54l1j01Q8K5k34L49Mp0j60kL36m15J09L31k65j2pJ14j88k77N18l00J46
2819F8J5k64K90j77J04M0k0r6q7K44l76J49r1%K82j27J15J9j79K08j61K59l67
2842a52K82l06L62k38m7n9Q9L17k01k45M38j67l55J33K25j68J78%j91j74J28K50
$$ y = [-194, -26, -12, -17, -13, 8, -84, 66, -72, 90, 139, -116, 146, 226, -24, -15, -381, -97, 4, -38, 168, -151, -48, 64, 74, 159, 13, 65, 24, 40, 87, -18, 4, -108, -136, 205, 250, -50, -98, 28, 66, 173, 96, 105, -74, 99, -295, 3, 124, -31, -131, 55, 31, 117, -85, 51, -310, -189, 35, -14, -181, 179, -109, 168, -47, -152, -54, -43, 91, 75, -305, 249, 249, 208, 129, 91, 120, 245, 127, -152, 14, -105, 77, -12, -66, 78, -23, 107, 195, 94, -170, -10, 210, 8, -77, 64, 115, 128, -82, -28, -79, 58, -211, -106, 96, -377, 132, -30, -48, -216, 60, 39, 40, -40, 207, -57, -127, 264, -44, 110, 79, -22, 66, 91, -143, 206, 210, 140, -20, -22, 314, -101, 8, 339, 74, 62, 55, 169, -19, -296, 222, -78, 68, 83, -181, 109, -68, 36, 76, 56, -40, -127, 117, -259, -110, -201, -201, 81, -46, 69, 88, -91, 117, -44, 215, -152, 130, -176, 186, -52, -99, -158, -69, 248, 47, -198, 240, 73, -282, -149, 76, -92, 86, 86, -105, -279, -151, 99]
2864I9j87J39O0k45Q3Jk90K12J19Oq2J18j39L9o9J34J5k14K29j9m5j00L6j25M0
2889a85L80k66K05mo4J5L6j21R6k81J63J06M3k55L45k03J00k22k52N54k65J31
2911E6J03k1j46R5r7J27k32o1K56j70Q7l2q3L55l06p3M17k27R0m4R8l42J27K7
2935DJ29k79j6K30J3n5P7q8l3M3j27L05l31m8K04M24o22m0K29p7P7j11J32N8J4
2960A12m9r9k89L19k56M22rl4k66P2J9J15L66n25K70l21Q6K6mJ15J39O8k23J1
2984F5J55J00k61M8k47L58k71J3k3L14k52j64J87l5qJ61n0r3L2J83j81lm2J00
3008H6j26j35M46l72K76k45r1k6O6J7O9j05Q6n4j08L22J28p4o5k57J76j59j03
3031b48M98p4l70L98N8k42n6J7m7l3q4O18k96k4n2j16N01j63l74J30J67k78J3
$$ y = [99, -88, 51, 111, -134, -51, -50, -340, -128, -9, -3, -85, 33, -106, -67, -136, -2, 13, -201, 28, 9, -36, -136, -100, -225, -185, 195, -71, 134, 130, 66, 81, 117, -4, 92, -189, -26, 80, 123, -132, 213, 10, 110, -112, -364, 190, -75, 56, 159, 138, -8, 87, -10, 117, -115, -176, 80, -90, -3, -35, -118, 237, -69, -142, 275, 48, 138, 94, 192, -150, -23, 4, 133, -146, -162, 68, 81, 26, 103, 15, -18, 25, -102, 203, -128, -176, 28, 452, -170, -210, 19, -58, 19, -92, 40, 98, 112, 63, -36, -325, -6, -262, 160, 151, 117, -149, -77, -58, 57, 423, -102, 168, -153, -67, -41, -45, 70, 209, 277, 54, 65, 220, 320, 59, 107, -140, 218, -53, -40, -63, 251, -1, -165, 22, -13, -21, 140, 90, -3, 29, 212, 31, 28, -14, 86, -40, -175, 271, -101, 175, -70, -161, -187, -121, -104, -35, -140, -54, -108, -216, 106, 234, 160, 95, -162, 14, -145, -248, 250, 176, -194, 204, 262, 20, -36, -19, -66, -99, -183, 435, 139, 115, 63, -53, 448, 285, -89, 41, 208, -70, -57]
3054e7q7L26m18J09L62l51K07j27N4LO4j29r9J10J14l76J65J74l46R5L26j37k27
3077b45K48R1m8p5L4Q3pJ4n6j68J47o7K0k1J16mJ98k92k03K65o9m8J11J1k07J79
3103GL1Q5j61LO9J83j66J10l43Q7R8j39L99m8l25P7N0K16l43q6J55N7k88K84K7
3128C9KK2k24K02p9R3K5k9J33j30l10J34J31j77J19P3k03L24j01l62J13L15Qk57
3152a39Q9MN5r4j06L00k71J4q2K19J27j63R9L1k36K41N3p3k64O7K43J1o0j32j73
3177b40J75Q6P9mR6j87P6m2j63M02m30j09L46J3j26j03K39p2O7k25K59n5r7R3
3201G8k59J18K8K86k06K6L7j59K97Mm91J10LQ2J31j53K05k64n5K7J38J31k22K51
3225A43r0J97k09O7j05Mm9L7ol08J67L03l78J84J28L3k21J0J00k24J95m7j76J87
$$ y = [-57, -144, 182, -236, -127, 235, -116, 91, -36, 18, 21, 85, -44, -143, -33, 81, -295, -130, 44, -302, -207, 119, -18, -245, 3, 94, 46, -29, 5, 88, 81, 95, 39, -129, 18, -49, -29, -50, 66, 62, 260, -32, -235, 30, -39, -87, 24, 35, -172, 7, 38, 123, -38, -35, 34, 217, 51, 161, -182, -95, 3, -136, 263, 215, -110, -33, 17, 233, -110, -196, -41, 16, -272, 12, 39, 41, 63, -161, 41, -38, 55, 80, 51, 184, 54, -256, -122, 9, -168, -49, 24, -179, 145, 44, -318, -205, 110, 118, -139, -50, -46, 9, -85, -191, 109, -162, -148, -230, -11, 116, -47, 52, 83, -153, 88, 141, 68, -196, -129, 114, 125, 65, -67, -240, -65, 21, 100, 96, 192, 5, 81, 39, -124, 278, -152, -261, 85, 98, -28, -131, 108, 36, 103, -122, 137, 82, -15, 78, -181, -63, -35, 251, 45, 71, 108, -51, 246, 250, -241, -131, -128, -46, 85, -68, 137, -127, -182, -155, -17, 114, -108, 143, 53, 250, 41, 108, 3, 7, -42, -5, -11, -319, -152, 151, -227, -43, 85, 118, -103, -93, 7, -217, -22, -69, -245, -58]
3249e8NM4k9j95J57J46p3K0K29k94K24j18m5J50k10L4K98k88J89k48K82l41J36
3272A5k15K59%q1M0J2j06J48j86K04Q7j71j16JK96m17K55j89L2J02j73L53k43
3295i3Q5q8j06J62N1k88L43k92P5K89j96J15n0K46k11P2j22j25K85j62J29k77
3317a58Q6j0J60j4J55j66l1o5K08k07J91kj56K04o6l55K09J46j56J47k40K18l28
3340b30N68l50J13k85J94J32l22J41p2J78o0kj69J35J58P0n6j50K4l9p7L36k59
3363b2p5P8l2q0N1J76N7r8j03j08J35j74M27l67L26j53J22k57k0L5J31J20k84
3386a15LJ34L1m8j26L42m08Q5J19J87m21J36n2k9N37m18J90m7r5RM8l8n9K04k38
3411f9K49p7M4j45L13k58kr2N1m80K64l7J05J2O0L40m78M23l01lJK45k60k8O2
$$ y = [-58, -53, -9, -38, -233, -76, 70, -3, 17, 246, -48, 176, 58, 13, 163, -47, -13, 285, -3, 186, -62, 220, -121, 15, -200, 59, 59, -22, 18, 30, -76, 72, -114, 90, 177, 6, -110, -109, 187, -230, 25, -164, -132, -30, -203, 150, -93, -8, -96, -202, -40, 11, -277, 66, -226, -151, 138, -58, 57, 7, 253, 42, 114, -8, -133, 152, -10, 119, -158, -72, -82, 78, 64, 219, 53, 22, -43, 165, -42, 149, 147, -9, 195, 129, -226, -17, 129, -27, 120, -120, 98, -230, 338, -12, 101, -184, 10, 142, -180, -39, -111, 67, 7, 5, -164, -29, 129, 199, 143, -7, 17, -22, -99, 237, -22, -97, -19, -51, -131, -80, 96, 153, 55, -48, -156, -21, -195, 232, -135, 191, 38, 160, -97, -117, -82, 49, 169, -115, -112, 22, 53, 5, -121, 221, -187, -102, 17, 204, -217, -81, -133, -162, 375, -43, 147, 100, 5, 14, 62, 24, -35, 169, -69, 180, 103, 147, 2, 315, 57, 55, -37, 14, -466, -202, -239, -134, -122, -62, 278, -200, 223, -78, -81, -80, 165, -95, -123, -61]
3436f1J64l33K1K42j65L23j57j03L10l79L01pk58K03J17k57O6j93K58R2l29J96
3458E1r0m9J88J20l54K93j01p8j25O3K67L6k55P4J65J12n50K79l8Q5l9l2r8l6
3482a12Q1j2j44K47j09R8j27RN1k55P0L76k55K6o7J51j20q6J58m3K31P1k78L40
3506C01n71K75l8o2J32J38J72n14K37RM0k83K9J26N9J19k34l47L51K94j41l35
3528b43K92o3m5K2j01J46j10M9Q9o6o3J54Jj73j0J23J56n6j06K47k18j85J54p2
3552g8N6Mn8J06l1L6o1k5N7j23M8l7j16K74K76k57o7j15J38l1J86j91j47J00N4
3577bk6L5L26k44j23j12M59l63N2j0J76k96K68m0j69P6k47L68r6j06J0r6J71l34
3601c23K94J24l79M16j27J0r2k00K69Qo4K44j27N6J20l67K22Q1j06m2q3J42l30
$$ y = [-61, 103, -230, -209, 33, -132, 191, 34, -69, 241, -138, 163, 156, -102, 101, 218, -39, 27, -166, 92, 184, -145, 51, -39, -88, 100, 220, -134, 159, 58, -20, -145, -82, 185, 221, -34, 40, 205, 317, -233, 46, 8, 93, 54, 22, -76, -112, -31, -43, -187, 60, -49, 49, -78, -69, -18, -273, -203, 173, -82, -56, -123, 28, -92, -178, -20, -63, 168, 239, -39, 301, -270, 5, -33, -95, 37, 175, 347, -167, 70, 79, 119, -164, -135, -9, 50, 169, -65, -412, -61, 233, 92, -243, 49, -14, -59, -37, -138, 8, -102, -53, 36, -30, -93, 61, 62, -111, -121, 2, 158, 102, -4, 243, 25, -160, -6, -78, -22, -18, -76, 30, -1, 35, -26, -51, 6, -117, -69, -106, -222, 52, 328, 71, 4, -111, 27, -4, 182, -9, -156, -56, -2, -28, 7, 333, 89, -34, -146, 313, -50, 2, -8, 168, -128, 140, 100, -69, 7, -240, 128, 32, -74, -64, -160, 11, -323, -29, 95, -284, 132, 5, 15, -77, -277, -8, 0, -64, 180, 53, 109, 229, -138, 84, 165, 59, 17, -66, 76, -254]
3624b54J84j5L32q0m41K22K04k72K30J75k23j77J17k7K69m46J51J80k28k0RJ21
3646A1o2J6K43p7k13p5nJ00J37N8p0j4L8j3k54J7J05Q4j00m4K01J75k51J39j58
3671a2K6K46k41k2k76J74j66K17P8K1J1j84M0j58J10K96J56m41J33q0J76m7k7
3694C0J63n75N68l19M15n1n5j12J68l47o2J54K3n4K03N7L1p8M7l49j54K22J68
3717I3l92K3N32k12l4K06k13O1o3j74L31l08J65q5j07J21R7K12j87n0K05j53l06
3740b38J65L39k72J9m9K79j10N4j33p6j2J00j3J30k3M6j68J71m18M10m40M23j98
3763a4j19R2L49k40l40N25l22J57l84N30l16M3K31k87j82K55n3J19P8r4N8K0j19
3786a3p6L72k74O8j41L23l97K68k9k65O2L49k23q5K1J09j02J7K6K7j6K23k74K93
$$ y = [-254, -70, -85, 247, 167, -274, -52, 152, -120, 110, 285, 62, -115, 2, -25, 244, -202, -51, 129, -99, -119, -110, 11, -51, -35, 208, 131, -82, -157, -162, -62, 75, 133, 63, 49, 87, 74, -180, -163, -58, 26, -74, -118, 83, 258, 7, 146, -12, 14, 260, 19, -3, -279, -105, -271, -54, 24, 45, 56, -128, -88, -246, -136, 160, 316, -125, 8, -72, 104, 57, 30, 193, -382, 186, -133, 282, 231, 176, 64, 232, -115, -177, -23, 0, -54, 149, 206, 237, 159, 206, -143, -297, -75, 93, -299, -276, 256, 44, 10, 216, 3, 64, 1, -173, 158, -150, 15, -70, -177, -56, 41, 253, 66, 16, 221, 68, -238, -73, 266, -6, 13, -36, 243, 133, 187, 54, -22, -34, 66, 53, 183, 160, 206, 38, 209, -209, 201, -239, 184, -14, -133, -41, 308, 68, -272, 253, -69, 88, -296, 234, -82, -39, 192, -95, -277, -22, -75, 44, 122, 28, 86, 106, -13, -89, 283, 9, 77, -64, 259, -138, 130, 101, -164, -102, 247, 24, -61, -40, 69, -33, -16, 10, 37, 21, 244, -30, 263]
3810B63k32k64K73O2r8j35J40j71oK49J88l75P4m1J76k31P3J60j19J38j80r5J26
3833b5J61j16l0r8l8J84J08k4J9j10j9J21k76q4K03K58k76j53L53l14K25K25j95
3856I9k68J53J05l49L24q4r6K44k49K23j4k6o1n7M0J34q8m23M11j10o8J86l42
3879c16K93J3O0j39k95L44l9J87p7j23Q4J6N3M4l6k71J45j89K10p2O9J66k15Q2
3903fJ0k00n1M56k97m4O9K1j15K08k6N2J28j14P9k16J25n7L0K8J69k86K0p9R5
3928aQ8n3J2o8J45o5n4j77m7M82k97K8q5k21J64M4L8M4J1K99k13k9j92K19k40
3953a68J65PJ06q2Q1qp5KJ80j17j24n4j41K18j13L03J8l46k8Q8l2j90J74J74k04
3978a66N08k85k7m9j92M51l42K19p5l7P2Q3j15k3j9P6j08q4n4J40N9p2Q0o6j83
$$ y = [263, 31, -233, 40, 102, 4, -131, 9, -162, -168, 81, 269, -106, -32, -73, 103, -128, -55, 105, -14, 124, -56, -151, -25, 136, 20, -10, -108, -146, 38, 146, 122, 141, 31, 12, 133, -143, -227, -24, 234, -42, -195, 158, -156, 69, 294, 99, -169, -16, 89, -260, 64, -20, -116, 128, -121, 102, 88, 62, 1, -56, -16, 118, 30, -393, 18, -92, -160, 26, -316, -23, -10, 50, -89, -384, -40, -79, 108, 31, -92, -8, 8, 61, 105, 69, -202, -57, -246, -36, -108, -39, 127, -88, -6, 4, -196, -247, 209, -88, -132, -63, -42, -157, 51, 25, 77, 205, 91, 170, -46, 79, 22, 52, 80, 249, -37, -17, -96, -1, 87, 34, 46, -22, 123, 58, 4, -173, -220, 262, -35, -7, -92, -313, -149, -105, -67, -23, -12, 287, 74, 45, -147, 72, -168, -3, 4, 110, 28, 109, 101, 26, 28, 208, 91, -33, -87, -228, -10, -123, 180, 198, -148, -176, -88, -120, -310, -136, 38, -166, 342, 57, 30, -19, -211, 240, -102, 117, 42, 5, 77, 160, 45, 22, 3, 79, -29, -113, -167, -27, 32, -40, 40, -26, -209]
4003b09K21J34k73J0Q6K95k41J20k68K50k30J32m0l80O08k47n1Q2K5j08j14L10
4025A12J20k83Q1q4r2m1L14j84J30j65K07k62K10k61j2K25J9Jj76K87m64J15l5
4048b38M10l72N8r0j63J90K36ro1p4N2j41N3M08l20Jqm19M05J3J9J51j44m4P5
4073a2N4L89m14q6J10J33k14n0K8q7K42qL5rk61k68M23N5J42j96o3L37l36J81
4097A25j60Q4l64K13Q2RK9N2n03K88L33j24k53L33n9k62J23L6k84K25k7j38Q7
4120a55J95K46l60K18r3O2PM7jl35K85lMm69K68l7J11j12J76l43K95K76n64J53
4144a29K28j79p0M70j76J03n11M70j46j23%J42j6p8O5qJ3j3k43P9%J39k3k05J87
4169b4j07K02k29o1P5J76J16r5lJ37j20j51j05K54j49J2N5j77P2K06k49K85p7
$$ y = [-209, 12, 146, -127, -117, -31, 264, 23, 143, -125, 125, -105, 27, -13, -393, 215, -32, -83, -1, 24, -84, -198, 112, 232, -51, 30, -54, -146, -187, 127, -57, 73, -92, 115, -147, 63, -198, -210, 15, 34, 35, -141, 146, -318, -203, -238, 172, -200, -142, -232, -395, -205, 31, 22, -39, -113, -61, -202, -149, 259, -61, -60, -68, -487, -82, -69, -50, 101, -43, -87, -12, 42, 431, 17, -69, 41, 174, -40, -90, -62, -149, 93, 85, 120, 111, -150, -418, 5, 60, 202, 6, -57, 280, -56, 125, -35, 49, -315, -102, -20, -11, 18, 70, -433, -145, 188, 64, -189, 144, 85, -177, -54, -18, -302, -77, -104, -242, -155, 40, 286, -74, 144, 51, 113, 120, 167, 166, -169, 116, 113, 117, -352, -84, -121, -10, -122, 54, -289, 6, 282, -282, -129, 99, -80, -150, 320, 144, 247, -264, 206, 60, -63, -63, 79, 63, -15, 50, 42, 55, 42, -201, -122, -122, 17, -6, -211, -24, -131, 71, -158, -219, -144, 32, 148, 53, 50, 187, 67, -84, -189, 65, -84, -72, -17, -194, -122, 84, -165, 120, 43]
4192D3kJ08l66L29k34K05k25n0L72j43J11k42J25j9j19J26k50J62J61k66K60l8
4214D8k11J46r3K76l2m67M26k8j02P5j87K35q1J38l49K87p5k24mK54j78Q3L3O9
4238C9j49J85K6k95M34k25k05L8K25K7j06j4p5K83k75K1m5J65k06J67N6k33K10
4261D8k9J89O9k33J26j71q0K31k25r6K3L47k31k51M37l28J64R0m0N9j37O4K3R5
4285A44j67j0M1J08l00M26m00n5M27r2Q4m47L67j33l3p7J63j76o8L91j65J56k52
4308f8J84p9k04K51j12K28m1rk24P5R8n9J52k77K93K7J5l35J56J05k17J27J19
4331B05O2j96l37M6K66J90k79J18K5M8k75k0m6J99L9j10K28k35J36K3k03Q6k04
4354b34k1L04q5j03K89j93J12j64J08J34j95J01j85P4L7J57n5L1m25M90jO5j62
$$ y = [43, 41, 149, -217, 112, -122, 83, -142, -192, 180, 37, 148, -94, 31, 12, -107, 19, -231, -69, 92, -174, 86, 48, -163, -17, -110, 166, 134, -333, 93, 65, -37, 38, -149, 86, 5, 143, -206, 81, 6, -218, -222, 32, -146, -63, -30, 39, -110, 75, 101, -194, 240, 15, -190, -152, 73, 100, -6, -20, -95, 188, -87, -66, -111, 54, -152, 15, 71, -162, 48, 19, 208, 277, 44, 170, -1, -81, 150, -75, -171, -148, 199, -32, -283, 154, -174, -10, 80, 40, 99, -38, 26, 49, 144, -23, -33, 8, 116, -184, 242, -158, -213, 214, 122, 206, -241, 126, -7, -40, -117, 46, -130, -198, 193, 28, 184, -68, 116, 37, -167, 84, -28, 200, 159, 150, -74, 1, 99, 40, 192, -85, 208, 235, 250, -85, 71, 176, -41, 86, 205, 267, 71, -266, -220, 46, 236, -43, 75, 100, 148, -127, -147, -193, 6, 45, -65, 163, -72, 64, 87, -116, -30, -234, -255, 49, -36, -139, 150, -43, 69, -95, 13, 147, -48, 53, -132, -58, -21, 136, 81, 112, -313, 177, 176, 241, 79]
4377G9o7k32J29K6k11K65M4k93J44L77k91J34m1j23J58j93J74k19P8K76k78R1
4399B7L50k48M7l47J77j99K85j1l5pk3o4K25Q9l06j98M11K4j34J5j57J24j60Q4
4423c1K23j63N0j10Q7O5r6P6j16l3j25K42m3r9r3O2j05N4K00k34L85l42K66l3
4447H7K7o0J56m8m57J74L4j3J68k31J71J78j98j14J37Q0p3J03j60l1Q0l71K32
4470a29K39J56j69k10L26l9m08K99j78L21l80K80j23m5o4J25Pk9K1L4J21j75j05
4493a25o9K85n2M2Q1j61p4K00j03j05Q9k4n1O8n9N8K03k41J34l35MK08K2%J04
4518I9q5j4N0j76J37k03K42k83M48k35j3l5j29P7K08J54j52N0J67k30j34J02k7
4541A8l0j58M9j9R0j41K66l21K60J19j64J62p4j10M7n5L0K71l18M5J43M2k01l1
$$ y = [79, 12, -220, -91, -65, -276, -11, 33, -260, -116, 261, -30, 104, 63, -60, 98, -95, 79, -140, -62, 214, -64, 27, 377, 129, 176, -171, 6, -193, 92, 81, 46, 39, 16, -48, 177, 266, -40, -238, 173, 197, 63, 78, -79, 45, -115, -31, 192, 29, 79, -31, 56, 121, 25, 101, -15, -48, -173, 69, 26, -73, -166, -104, -209, -155, 45, -189, 196, -146, 120, 87, 114, 54, 210, 162, -295, -121, -87, -100, 68, -163, 8, 186, -12, -126, 11, 91, 18, 121, -39, -70, 10, -361, -129, 110, 266, 97, -113, 213, 174, -234, 65, -113, 208, -172, 108, -15, -60, -124, 1, 8, -21, 0, 34, 155, -20, -125, -194, 91, 39, 81, 162, 1, -73, 127, 24, -81, 8, -16, -67, 1, -58, 0, 203, -38, 96, -239, -235, -27, -5, -5, 99, 14, 0, 50, -126, 11, -192, 50, -233, 215, -20, -33, -68, -197, -120, 88, 242, 90, 140, 307, 77, -57, 45, 18, -12, -170, -121, -140, -50, -191, 75, -246, 14, 133, -31, 131, 57, -53, -6, -61, -31, 240, -78, -33, 110, 152, -49, -80]
4565h0N4j67K52k89J61J45k03J75P7k33R3J4K2j16L21k30M6K16k14M7j26j39J01
4588g3k2l1n1R8J70j55L4J14j41J67r9k36J78N8j8N8n9n1n8J21j43k1Q5J41l51
4613b85M20qn5j72J29o7K04k88j23L19j55k5L02j22LM1j23J17k11P7J77r4K02
4636B63k46l3j14R2K0j02K65k4k74M4J55k12L26j81L1m4L3j41L23k36j86J87k6
4659h0L73m28J16j94K81k8K78l09Q3P1k12j9lL0N1J43J41R7l75j03J31J88l09
4682g7K97j02k97P3J96j96O7J78m1Ll2k9p0L2j72J96N9p5j65M90j77M8k66J68
4706A08l68K27K58m02L12j16o8j55J57r4P6j25K44o3K75j41k59MK02R1k30J56
4728H9k47L90l20M1l21M16J25l54K00N4%k6N3k68K12P4K3k14n8R5J08M1j08jj67
$$ y = [-80, -26, -193, 59, -230, -69, 76, -127, 48, 125, -108, -15, -1, 21, -95, 226, -4, 42, 258, 44, 91, -35, -174, -73, -95, -126, -177, -79, 91, -64, -30, 84, -57, 110, 11, -225, -47, 11, -7, 51, -8, -59, -117, 4, -139, -160, -75, 66, -285, 135, 127, 72, -100, 29, -38, 166, -122, -245, 74, -81, -106, 196, 74, 77, 118, -5, 112, -99, -22, 155, 61, 263, 17, -16, -130, -38, -18, -120, 145, 121, -153, -109, 46, -166, 160, -21, 10, -34, -1, -142, 181, -55, -241, -54, -80, 293, -135, -19, -213, 68, 40, 318, 9, 92, 163, -49, -68, -71, -41, 10, 153, 294, 391, 16, -87, 44, 232, -77, 220, 118, -179, -106, 90, -106, -39, 139, 98, 101, 69, 40, -30, 2, -170, 26, 85, 10, -155, 335, 158, 206, -60, 108, -260, -33, 225, -177, 135, 19, -49, -204, -47, -141, -65, -190, 54, -9, 266, 125, -134, -130, 72, 163, -67, 89, -158, 232, -88, -47, -368, 48, 173, -181, 19, 73, 73, 47, 100, -168, 44, 118, 141, -73, -131, -36, 72, 113, 5, 4, -163]
4753a63L73m78J79P0O4J4j28nL0P7k75j74L60J19o1q7m9K75l82O0L20k05J06K05
4777B45k63j83K75j38K78j53k30jl7K17M3k34m1J36K22j35n1J90k24L8r2Q3L7
4800a8L1J65j19j36j45N09m34L19j44n5L4j03J63j20p0J87Q7M0k4l18j08K77o8
4823e0l4J54O6l55J83k24R4M02l09k05K43L08l30j15K34l97L09j9J11J32j98j
4845aK32q2k06J44j9p8j29P6L5l8n1L23Q1k27N3k60J86j19M2m1K4j1J56k18J5
4870a13q8J62j02L19m0k4K1j96K05l44J56J46k4k6j99K11l65m9L49j26J39J32
4892A44j25o9J18j84O9k43L26j0Q9Q0k81K9J63l54J43J78ML23k44l31L47j35n2
4915a5Q1j30l8J32m1k7K66m44K59J58l5r9J02L1k65L38o27N24k77r2L22k20J86
$$ y = [-163, 210, -268, -89, -19, 45, 59, -69, -74, -44, 33, -242, -416, -56, 63, 2, -85, -134, 141, -241, -181, 139, -66, 40, 245, -18, -201, 74, -64, 214, 61, -169, -170, -207, 10, 53, -181, -222, -86, 136, 1, -50, 140, -84, -46, -138, -55, -18, 13, 178, 59, -77, -222, 287, -147, 172, 28, -27, 7, -96, 67, -53, -123, 64, 151, 191, 167, -151, -259, 18, -50, -84, 70, 136, -219, -36, -260, -166, 236, -73, -278, -35, 273, -57, -172, 62, -335, -26, -45, 66, 198, 0, -1, 231, 149, -57, 87, 68, -10, -139, -63, -28, -66, -117, 206, 287, 60, 113, -147, 39, -80, -38, -79, -55, -66, 90, -128, -113, -201, -39, -141, 178, 138, 114, 135, -61, 144, -200, -44, 102, 78, 52, -147, 64, -301, -350, -1, -127, 12, 144, 19, -50, 68, -116, -47, -290, 36, 26, 115, 195, -86, -57, 106, -248, -105, 73, 77, 400, 156, -175, 172, 37, -15, 66, -64, -102, 30, -11, -38, 228, -216, 43, 201, 166, 67, 169, 200, -65, 273, -354, 170, -107, -199, 123, -97, 89]
4938H9k92K21J54k85n1O0O0O0k31j85J06L88j56J83Q9l56K32j92K06Oj32k35L52
4961I1J51k97K5P4k4R1m5o5O8P8j08K7K3K9j16Q3lj72R9R3rj75J14k52L01N2j96
4988f3J9j22r3M26k7k00n7O2J94l33K04K02m22K75K04p5k58L0k24J90J16j62J04
5011a0k79J98j11J19P9L5J8k9P2M9k02K14k48L75m03K45j01J20k98j01L24J17
5033A83l95L60o6j6O6k13O2M73n21k39L70J24k90j57M82J6l59K18j14k1J99j41
5055B1n7l3N2o9j41J16R2J81j78l79N88j72n4M53n09L48m44K31Ml4M9k22K92l00
5079a65p2M6K81p6k08J47J0M3j8l9P8j7k24J48J93k09J75l73L39k4j85K14j10
5102d6N7J03n07J54J97j41J68j67K35k44L43j44L55m29k01J11J52R2k15L10m95
$$ y = [89, -203, 18, 172, -113, -164, -104, -44, 16, -215, -400, -294, 94, -62, 121, 210, -146, 86, -106, 100, 106, -26, -261, 91, 242, -55, -30, 44, 20, 111, 66, 1, 69, 147, 39, 66, 89, 118, 2, 85, 82, -90, 9, 102, 93, -82, 32, -220, 81, 133, -63, -44, -166, -259, 167, 140, -60, -117, -55, 139, -194, 10, 212, -210, 65, 269, 194, -64, -34, -258, -68, 48, -114, -10, -289, -91, -202, -83, -4, 31, 49, 20, 92, 141, -61, 153, -95, 280, -123, 122, 21, 141, -157, -258, 66, 183, -212, 148, 82, 66, 132, -81, -19, 454, -67, -306, 64, 188, -102, -259, 223, 239, -120, 98, -16, -37, 162, 21, -36, -69, -17, -86, -227, -111, -19, 162, -16, -395, 193, 21, -33, 420, -89, 259, -185, 46, 50, 16, 65, -157, 135, -165, -237, -191, 90, 14, -194, -47, -37, 6, -12, -51, 27, 10, -214, -66, 127, -82, 93, -280, 59, 35, -150, 64, -46, 11, 114, -393, -239, -42, -183, -15, -182, 53, -191, 152, 8, 363, -66, -267, -156, -4, 88, -127, 183, -312]
5123c12K97J59j83J42l31P6L02L2j64Q8j47j16J85j36o3K62j38J64j74J1k10M90
5145B34k64J54r2N5L85m00l79Q9J28j93K95o6J4K73N0k63J00j30N8J23p7Ro4Q6
5169A25J75j59j59J46l16R5J82j44P4j44N9J62J53j60J67l84J55J45p3l34J64
5190g1J66p0L0m9m1L39k95nJ84j77J08l51M08o2l29J63r2K49k48K43J29k29j38
5213a38m3O0K60j0l52J22K53j38K1J87l13j2M00j56j59k2q2K72j72O1qP1j82K44
5237A64j76m0PK58J8k19k84M82j02j47k5j23J49r2J90p4j74K80j41R9j63L8K72
5260A97k59p7ML51o0j79Rm3J11k30J09K76m46L1P1M8J68l8qmpJ32k99m7K64M8
5286A22j65J98j84M6J10j40m7J35L0l5J12k14R8o6K40j10j56P3k30k1K25k2J12
$$ y = [-312, -15, 144, -39, 103, -228, -152, 150, 182, 18, 106, -41, -157, 28, -108, -171, 91, -47, 117, -57, -46, -256, 234, -30, 124, 32, 87, 472, 72, -307, -218, -90, -283, 12, -54, -40, 233, 283, 20, 120, -10, 48, 171, 94, 103, 39, 125, 300, 141, -18, 128, -188, -93, 89, -55, 19, -125, -66, 96, 249, 89, 256, -128, 27, 172, 99, -235, -71, 95, 25, 55, 6, -35, 304, 9, 4, 188, 11, 119, -232, 176, 114, -215, -52, -144, 105, -143, 100, 229, 0, -138, -181, -121, 139, 129, -223, -101, 152, 14, 35, 222, -91, -103, 297, 141, -18, -40, -122, 150, -22, 39, 31, 102, -80, 164, -12, -52, -45, 213, 231, 12, -272, 210, 108, -39, -64, -187, -38, -130, 60, -14, -188, 92, -49, 50, -113, -75, 197, -62, -139, -135, 216, 156, -23, -14, -57, 54, -176, -67, 209, -237, -206, -135, -87, 81, 43, 35, 31, 24, 156, -143, -190, 74, 122, -43, 155, -29, 17, 127, -13, -60, 75, 105, 70, 182, -32, 66, 0, 240, 130, -26, 47, -183, -204, 21, -1, 111]
5309A11j51J51l4N5p8j20L60m65J54N9k14P0L16m34J85J79j75M1J0r2m6m8L6K16
5333H6j52O4j78P9N2J03J7j27p7j63K84L3l54L51n6j1J8Q8J24p0j30NJk2k1K35
5359A79k06j7L79l39J3J84j11l9l0k18L69Qk76J65k67J67J25j83K25k65J22N2
5381C7j20M9k61L50l72L56j62J35k82L27l52M19j65K5J9j61N2J35j55L27l07j96
5403c02M44k2l04j01k19M79J1K1m6q0K34k7J81k64k76K39L21k56j1J40j84J26
5425A04j88Q2L04l34J11k47J60lJ1k2J60l03J72qMM0L8j70qj36R2M94l37j47K09
5450G8k19O5j5J02m2j88M0R3L4q2K55kr4K56k30R0m3j54q5L78j59j04J33j12j50
5475a55J53m6K48j97k9K55l25J48j1j5J14K4p4l1k51J80M7J37j89j64J2K06o1
$$ y = [111, -40, 111, 77, 132, 54, -66, 294, -171, -17, 42, -172, -102, 214, -220, -35, 144, -31, 10, 20, -72, -118, -166, -130, 86, -66, -2, -180, -101, -49, 54, 71, -56, -133, -296, -12, 21, -333, 18, -38, -49, -31, 57, 181, 111, -19, -14, -13, -35, -56, 179, -27, -44, 335, -4, 9, 193, 82, 43, 13, -205, 164, 172, -104, 61, -206, -39, 86, -97, 128, -137, -15, 37, -83, -34, -295, 55, -317, 39, -123, 12, -270, 57, -295, 124, -41, -16, 3, -158, -106, 29, -126, 201, -106, -302, 142, 120, -184, -285, -504, -25, -14, 7, -39, -119, 115, 88, 269, 5, -271, -32, 289, 33, 22, 162, -22, 104, -84, -2, 302, -32, 79, -168, -8, -11, 0, -22, 138, -165, 7, -1, 3, 43, 81, -89, -97, -233, -141, 353, 16, -131, 78, -141, -76, -91, 11, -31, -219, -179, -86, -52, -134, 121, 119, 25, 281, 51, 141, 98, -56, -141, 237, 78, -26, 107, -5, -155, -2, -48, 200, 3, -26, 229, -96, 52, 41, 26, 140, 164, 90, 59, -192, -12, 35, 172, -17, -181, -169, 37, -24]
5498b4pJ45l04N36m41J30k0n0K77j82L7k21k3L01J22k41J66N0l21o0K24k15Q3
5521c8J63l3k59J89q7K42k0k63R4o0J06k1Om37L66m36N30k29l9K64j89p3K15Q7
5545G8J47N2k69Mr6K56l89J28J48q1N9n7K96l60K98k05k28Q7k8J05p8J11k30J81
5569g1J30l07N20l94n7J90J08j12L4J3k9J03l75K52k61K10j1J22j97jR1J12q3
5592a3N3Q8j48J20j70o2L2OL5J59k08J57l10L03k54Q0J77k40K00j13m5J31j05
5615a27N0q0k9L26J89l79K72m73J92O1j20J02j77J94Q4k3l6j82J10l9J70M1j65
5638c9n3K79j02n9J02k56l2L58q9k0P9j48O7k5l16K11J0J19j20M9K31k29j7k39
5662b39J39j43M31k69l1M26k33J2m7Q3m7op2J1LJ8o0J50j40o2P0j12j0M1o9J42
$$ y = [-24, -31, 114, -190, 346, -95, 35, 15, -35, 242, 60, 97, -124, -147, 154, 276, 35, 201, 251, -70, -130, 94, -121, -38, 125, 92, -167, 22, -65, 177, 157, -106, -12, -72, 34, 13, 19, -418, -52, -488, 42, -187, -226, 38, -151, -224, -9, 78, 225, 277, 8, 12, -84, 172, -217, -89, 59, -22, 37, -20, 276, -84, 214, 9, -219, -132, -160, -55, -133, -22, -252, -71, 59, -248, 272, -122, -179, 11, 119, 7, 41, 54, 25, 128, -247, 5, -256, -46, -57, 65, -132, -133, -42, 70, -13, 40, 128, -20, 100, -70, -132, -100, -94, -59, 100, -108, 49, -261, 42, -212, -132, 45, -195, 5, -108, -153, -22, -127, -77, -157, -186, 140, 329, -50, 222, -251, -59, 2, -118, -16, -193, 1, 85, 62, 26, -156, -46, -85, 85, 126, -39, -92, 187, 85, 26, 128, -128, -160, 198, 109, 89, 168, 20, 87, 62, -254, -43, -33, 86, -34, 15, 246, 17, 0, -239, -100, -243, 188, -81, -112, 314, 81, 93, 46, 129, 82, 76, 4, 15, 18, 36, -24, 126, -14, -76, -6, -118, -128, -87, -156, -14]
5688a4K1J39j49J63j23Q0k68o9L8m8K46J09%l61J66J32j89K6k2K58m56J56K15
5711E0j0j03J16p2j74K01K27n2k41K66o6j10K27m10J97k83K38M4j28P3O1l92M87
5734A46L2k84M60k05k77R1K55N9j00j84Q3p3J64m78J23P4K41j10R1k07J97q8P4
5757H4j03O1m9j42L81k46J5K61r4O9k54R2q5J16p7j32Q8Q1j20J8L6J11J14j33
5781I2j37n1L60j10j21j61J82n8q5J02R3j55j8j06L02o6M0o9j95K65p9qn5j2o7
5806a17L14n1j12K0L7j73J77j29M4Nq6J04J8L8L02n20R6J20j13j92J55K15Oq1
5830G7l6j39K04j79p7N9J89j49L9N7m1Q9N9j11m0l3m1J02o4J01J15p6J53m34J48
5855b8k2R5Qk38M3N5M6J15N3p8j90J46n7J27q8j5j9k09K93J57j86R4j20P7k6l80
$$ y = [-14, 7, 146, -3, 160, 37, 117, -151, -220, -182, -230, 16, 125, 125, -236, -70, 62, -127, -101, -123, 135, -321, -165, 50, 40, -63, 53, -19, -193, 8, 235, 183, -58, 208, 142, 32, 259, -151, 46, -237, 1, 45, -83, -10, 51, -341, 146, 178, -106, 354, 149, -128, -37, 218, 277, 177, -7, 76, 3, 167, -311, -188, -114, 127, 17, 108, -99, 98, 10, 84, -19, 42, -7, -149, 232, -14, 1, 262, 168, 237, -17, 75, -10, 106, 29, -103, -15, 66, -54, -36, 0, 111, 225, 92, -45, -96, 264, 154, 33, -128, 54, -4, -89, 13, 106, -49, -67, -173, 129, 63, 103, 34, -161, 104, 25, 17, -38, -50, -117, 197, 146, 34, 54, 91, -82, 95, -34, 10, 15, -71, 33, 51, 89, 391, -129, -33, 87, -26, -218, -63, 152, 158, 77, 41, -98, 106, -73, -150, -91, 98, -51, -12, 45, 4, 93, 152, 41, 1, -32, -73, 29, -35, 66, 181, 105, 258, -176, -28, -50, 45, 53, -185, -142, -87, -41, 74, 127, 49, -141, 5, -52, 75, -13, -28, -47, -256, 37, 194, 8, 102, -18, 59, 33, -347]
5881c47L07J18k60K13J97k62j16J26LK15k32j87K90Q5m91L04J47j75P7j14o2K93
5903A29l14j06K52n4J64j66K01j63j04K46j72J12j96L15k69K2K9Q2j28k0O8J59
5925H7k35j5K90j97L9J54n8J86n16L51k01K75J41k82O4J03p1O7j80j16N5Q0k11
5948a90L75p3k15J80j71M14n47M8L47J7j97r6J18j77K35l27K95j35K77j31m9K32
5970B30N5l25n9l2J64J22p6r0j66J35Rj13J52j57K59l33N06n56N29r8J21l7j1
5993B29k78J32q1p0K0l1n0J4J83Q4k08O4j71j16J97n8p4L59j09L7l58k1L84m9
6017B9j80J37J93j46Q0k36L5K01p2k79L22o0m8j50P9n0K65J19m18J4K38l88J25
6040a90K06p7O8L15m24K9J76k8RO0l30K36J7J71k0k34j3j72J37J5o6j9J09J42
$$ y = [-347, -40, 78, -182, 31, 228, -34, -150, -24, -21, 194, -38, -225, 65, 150, -341, -37, 110, -65, 12, -102, -164, 129, -185, -291, -39, -93, 71, -95, 106, -57, -161, 85, -87, 25, -171, 144, -125, -103, -74, 8, -120, -140, -72, 87, -148, -163, 127, -70, -31, 123, 65, 251, -265, 86, -115, 160, 301, 19, 83, 186, 115, 182, 2, -114, -59, 21, -190, 185, 112, -103, 77, -94, 320, -227, -179, 168, 185, -12, -108, 10, -167, 68, -259, 36, -99, 178, 47, -2, 230, 285, -40, -99, -131, 33, 155, 79, -11, -177, -42, -33, -146, 6, -151, 108, -225, 281, -275, 254, 156, 277, 240, 229, -49, 83, 2, -68, -48, -79, -129, -115, 68, 152, -56, 8, -163, -279, -82, -140, -214, 145, 36, 73, -285, -306, 78, 29, -151, -14, 179, 33, 113, -123, -88, 113, 41, -238, 84, 24, -24, -174, -95, -145, 120, 239, -179, -165, 73, -315, -190, 16, -61, 7, 322, -102, -73, 103, 75, 84, 144, -186, 50, 67, 238, 218, -16, -29, -201, -64, -49, -115, -134, -25, 117]
6064A17l32K06Q5j07K48k32n3J91J99j53l5M8l57K18j6J52o9J42j23k87R7j95
6086b56L79l52moN47l00j74K74j93J76k2J08k58J23k20K44k91L34k63O3K87j53
6108D3r9qL49j51j38K7n0N1j51K9K60m26O5J52K18j33j11J4J59r5N3N0j90J8J59
6133I5k92K94j77k9j8J71j53J13J4k23L02j74j81L95j26j28j8P6K44j01Q7J0M
6156A85o1L9k37k00J34L05l92M50j27r9Jj18J34J22j76R2l58L22j72r3L14j65
6178a00K88O3k60J20j18O2K0k26j02J45L00j92J5L5j35K92k35j52K56j45Q1j20
6200a08O3kO1p3L2J56k40K1q7Q6r3K17L14k83M1j90J58J39k03k74K49j05J8p9
6224a82K61o0j09m4N8K29p8O8k83J5J69nR8j89Rp4J57R5j92K98Pk42J47l0k5m35
$$ y = [117, -215, -9, 76, -31, 217, -15, -68, 123, 322, 169, 134, 182, -175, 43, 27, 179, 110, 252, 129, -158, -61, -256, 123, -229, -233, -239, 308, 8, -166, 108, -85, 91, 69, 177, -81, 42, -178, 66, -225, 109, -154, -91, 196, 43, -56, -64, 285, 134, -4, 23, -27, 24, -127, -98, 162, -264, -199, -47, 171, 38, -73, -59, 100, 5, 58, 108, -82, -64, 95, -197, 97, -80, -109, -127, 44, -109, 4, 18, -205, 97, -77, -258, 137, 11, -117, -135, -59, 185, 84, 171, 181, 185, 124, 163, -74, -274, -140, 165, -227, 223, 96, -3, -2, -120, 14, 136, -40, 52, -306, 16, -156, -249, 65, -100, 188, 251, -9, 111, -7, 55, 75, -151, -253, -108, 192, 0, 15, 50, -85, 207, -28, -180, 76, -69, 12, -108, -45, -47, 14, -59, -27, 129, -111, -90, -177, -91, -184, 33, 347, 64, 105, -85, 73, 212, 9, -265, -16, -121, -103, -182, 79, 19, -90, -134, -76, 153, 75, 143, -140, -125, 44, 39, 137, -52, -43, -117, 40, 135, -57, 241, 248, 6, 153, 123, 98, -337]
6250c37M37j12p5N9L1j54K18J31k90Q3j51J15J70P5n5r5K26j75P7j07k8j41j8
6273a16k07N10M8k10jj14K65j79j13J8M1J60l10O5J68j55K11O1M3P8K1j33p9j59
6297h7K61k67l2Q8J3P2K6P4l18K93Q7m00K6R3M1J79j68K23o7k49L36m80J74kK60
6322A76l59J63q1L94k18k16J13J11l4R3j43o4R9m4O5j02j36O0L00k15k69K99J12
6345A04J34l32J45K4Oj56O3n1J15K1J37k5k22m2o5K79k32J87k11K42k05J49j53
6368h8K33j95j65M34l38O1J19Qk3J84l60L68l57J58j27L30n2l33M13k91q7O5l0
6391g3j42J73R6k87K60K0K09k48j8j26K90q5pj61J60M3j3n0j46l6K44k17K51m9
6415H8j11O2j61q3mJ57M0L4k2j19R5J13m3r6L02k18j0j02L88n67P3K70j05p7O1
$$ y = [-337, 100, -12, -87, -28, 3, -151, 67, 198, -92, -9, -160, -45, 125, 200, 145, 50, 276, 101, 178, 71, 43, -98, -116, -323, 187, 235, 25, 24, -90, 175, -4, -117, -99, -58, 102, -208, -143, 25, -130, 81, 142, 185, 263, 284, 151, 72, -87, 174, -93, -125, -37, -24, 48, 74, 148, -170, 123, 210, -190, -164, -71, -30, 149, -19, 204, 137, -112, 224, -256, -82, -84, 176, -183, -20, -101, 293, 75, -141, -28, 83, 49, 142, -1, -65, 34, -10, 55, -47, -183, -123, 177, -38, -307, -8, 104, 238, -94, 51, 75, 81, -75, -12, -63, 52, 73, 210, 185, -37, -79, -144, 135, -97, 90, -121, 121, -84, 65, -88, 145, -50, -215, 219, -119, -58, 61, 69, 46, 230, -130, 238, -119, 39, -88, 242, 190, -143, 270, -21, -108, -43, -73, -215, -42, 54, -233, 27, 47, 256, 8, -10, -136, 154, 69, 62, -99, 61, 104, 91, 41, -105, -141, 103, -114, 137, 88, -23, 39, -122, -205, -209, -52, -12, 22, 0, -119, -24, 89, 46, -50, 252, 34, 24, -78, 310, -257, -184, 86, -19, -96, -35]
6440c5J30J29j7j63j64oJ01O3l3O0M9K56l94J72O7j05j22O3J04m19J74L9K47k07
6464a1j17L5J32Q6J17l93L21l69K00Nr6R5Kj60R9J87k35P0J37K1K63l68pO3m1
6489C6j81J9k0K41l3j62K72pj41j92J19K1R2q6J94k48j05R9m2L8J17L2j82N3P7
6514A1M2j29L23q3k06J17j36J06J72j96J67m21M88o44M19J1j18k49M19j80J47
6535F0k48J17J32m3k0J43j80Q6Nl2N1n8j3L1K86l23K84m92J78J89j67L7J79k35
6559c3J4M0j08p0J04j34L64q6o2M6j19L7K52m32J67J76k44n1K17r9J71k7Qk56
6583a25j31K35P5j34q3K23k39M9l2J28M5k50K75j05R1J17j34O6p1n4k5k3J79j78
6607a01J94o6J01j86p7r9L18r0J4J28r6K40k12l7K27k96K9j18K09J11M7m02J85
$$ y = [-35, 95, 224, 207, 44, -120, -126, -25, 38, 5, 65, 114, 370, -24, 148, 215, 110, -12, 51, 155, -264, -90, -51, 196, -11, -128, -93, 39, 125, 242, -151, 170, -199, 1, 6, -90, 5, 7, -153, -54, 133, -102, -32, 105, 126, 389, 21, 14, 77, 36, -145, -126, -146, 95, 62, -100, 172, 165, 24, -168, -49, -28, 64, -22, 172, -76, -181, -82, -124, -86, 31, 63, -119, -66, 11, 53, -76, 247, 164, -42, 75, -61, 45, 217, 21, 188, -233, 255, -389, 30, 41, -77, -326, 93, -87, 60, -188, -71, 61, 18, -2, 141, -39, 47, 52, 20, 71, 13, 0, 31, 317, -6, 278, -214, -36, 153, -14, 23, 202, -33, -19, 21, -87, -157, -53, -187, 177, 91, 29, 75, -44, -7, 245, -187, -20, 156, -88, -139, 78, -21, 150, 123, 131, -125, -256, -21, 54, -80, -163, 60, -179, -130, -162, -34, 11, -239, 36, -69, 22, 139, 5, 71, 0, -54, -79, -102, 77, -101, 93, 27, 128, -58, -135, -234, 84, -6, 8, 136, 40, 280, 68, 31, 258, -38, -9, -127, 82, 193, 240, -162, 23]
6630B3J86m1k01J21k38N2J08K7K24n89N30n9k26J85j24O2j15K18j75l1k7K21M7
6653A78j8k40k6K80j65j89JO9j9LL1L43l17L49J8m28M39k37K6l03M34l06mJ77
6677I6l70L10P7n3J18R1k70K99j74p2qj51L4Q4R4j53lK86j82n8J89m46L10J16
6701A64l95K23J15m11L05o3Q8k16M4K33r3n5k01J84K59l99K34Kj76K15m5l3J05
6724H4j36j68m3K95j8k80J83Qp6J85K9l68J48K62p3j69J11J75l21O6J83M3j17
6747Cj97J25O1J38P0k22K24k29oq5J62q7o3J25j83P1L08r0k26n5L72k13NQ5k04
6772a11l5O4L0L11k42j77K27j80%M73l38J18l03L86j64M0j69m8pL4O2K43m15P0
6796a31J83r3L41j74oq4P0j44O3J36j64j15L45k63K02k62J93j83k14N43m36K25
$$ y = [23, 209, 168, -33, 88, -150, -98, 10, 37, 261, -328, 202, 143, -83, 102, -22, 40, -75, 143, -32, -63, -90, 131, 178, 160, -80, -106, 174, 9, -180, -179, -110, -129, -126, -95, 248, -69, 280, 298, -130, 309, 72, 98, -205, 229, -77, -81, 96, -274, 36, 113, 60, 178, 269, -1, 298, 124, 52, 44, -107, -73, 11, 105, -48, -51, 235, 53, -5, 184, -262, 48, 164, -231, -8, 107, -304, 1, -62, 26, -190, -146, 87, -6, -61, -262, -78, 181, -218, 16, 18, -158, 57, 12, -21, 84, -52, -220, -263, 32, 14, -266, -83, -75, -151, 34, 63, -305, -157, 105, 32, -137, -26, 149, -172, -106, 77, 120, 3, -194, -69, -8, 130, 200, -22, 202, -27, -33, -118, 44, -43, -106, 19, -164, -93, 215, 125, -101, -156, 216, 3, 8, 93, -111, -146, -82, -52, 259, 17, -160, 67, -113, -113, 360, 22, 140, -163, 223, 59, 99, -70, -118, -125, -91, -29, 214, -201, -131, 52, -41, 300, 126, 120, 36, 106, -38, 25, 161, -3, -118, 227, -36, 166, -96, 97, -86, -300, 243, -193, 32]
6818C2j15j45J78q0J19l1k0R5L12m00L7L7k3J66j40M9j32oO5q5M5L1P5j01q6n9
6844a82J35J60P2j06r4K28k24J65j09j69J49P2p6lj26K21j49j1Q9k71k5J51R6
6867gJ94k34R6l34J69K8L07l48J32J36j55J57K0L0j90J31J07j17Q4j09j89k0J53
6890D1J54k64N9j04M3r9L37l04J81m7rp6P5K83m9j84R2j37K26j40p0J34Q8M3k20
6915E3J05k46K1Q1p0l6O7J3J41R6m08L90l04K48o4r8j44J96n0j40M6J96nj3L7
6940A12n3k49J15J63p7j7J46k20K43n7r9pQl2P4L66m06P3k81J1kJ98m5p0O4O1
6966A9J25k24M0l2r3K36j33N9P0J13j45J51l52M2J54K3k2O8j29J20j29j02J28
6989a3Q6o4O9m9J07j55J18k28L42k92q3l8J29L70k76J56k01P8j48J69k04P0J17
$$ y = [32, -83, -228, -50, -130, -11, -42, -62, 33, 345, -55, -18, 19, -4, 162, 22, 71, -61, -67, -2, -87, -42, -11, 64, -37, -123, -182, -47, 113, 185, 79, -15, 213, -11, 154, 45, -124, 25, 97, 21, 18, -108, 113, -36, -47, 42, -229, -254, -103, -7, 187, -47, 49, -285, -116, -88, 219, -129, 3, 139, -16, 141, 161, 191, 1, 132, 239, 122, 206, 97, -92, -112, 41, 195, -69, -10, -114, -71, -170, 167, -137, 44, -3, -12, -88, -13, 270, 221, 37, 129, -8, 218, 78, 8, 142, 230, 273, 53, 158, -88, -67, 14, -56, -92, -25, -12, 129, 225, -183, 207, -97, 151, 87, -11, -155, 41, -9, -149, -103, 93, 88, 75, 112, 59, -190, -75, 88, 11, -6, 140, -80, 163, 106, 7, 0, 8, -24, 50, 416, 10, 83, -198, -187, -189, 9, -36, -106, -42, 19, 144, -80, -40, -72, -165, 71, -62, -3, 67, 180, 35, 186, -166, -124, 30, 53, 31, 99, -30, 90, -39, -141, -13, 73, 9, 78, 29, 136, -19, 99, -129, 213, -79, -162, -200, -71, 299, 23, 179, -22, 56, -92, 77, -127, -57, 60]
7012F0k76J4J2L63j82j04P6L65nN9l00L1p8l20M42m57M62j49P1k14L54j48O8j90
7036d6j42j2K74r3j86J82k89M66j88K18k73K4om0Q7J54p8l58K98m2M1J0J8j73
7060a54J38J9J6j25J77r3J7J40j09N9J55l43Pm0K50K9J31j09j58J55j28J88j03
7083A19n7l68oL84k51J44j19J9R4K37K6k53Jj12p7J72j37M0J00J7R4p9j2k95L15
7108dj0J98k87J39L9j4j05%Q7j04J63j17J39J41l2k24k6%K00k63L44m53K25r4
7132e8K66l06K05J80l49O3J16k8J35k43MK41l77J79p3N9J88k70J2R3k91K84M5
7155G5J62j29k03K84O8k22K8n7m9L9r2L37k36K8K06l53K49j22Q8k51K72O6J1l69
7179a70r9L14kj17J87l6J14ml00L1K1j32L10j97n3K00M2j16Q1Q9p9l13J20M9j5
$$ y = [60, -216, -202, -190, 173, -9, -113, -37, 328, 323, 382, 82, 113, 35, -285, 157, -300, 162, 13, 84, -130, 224, 76, 144, -46, -188, -200, 74, -19, -205, -23, -312, 154, -34, 184, -89, -65, -71, -111, -24, 130, 52, -306, -8, -50, -9, 1, 19, -154, -16, 3, 19, -106, 71, -22, -5, 135, 26, 85, 240, -103, -96, -136, 114, 143, 274, 165, 7, 162, 34, 222, 119, 62, -306, -312, 72, -179, -35, -154, -135, -41, 196, 222, -31, -30, -142, -219, -47, -184, -144, -44, -27, 67, -12, -24, -319, -4, -14, 184, -103, 36, 75, 61, -44, -44, 43, -61, 102, -15, 124, 265, 233, 9, -17, -17, 183, -80, 264, -189, 36, -58, 208, -98, 107, 287, -62, 1, 117, 89, 224, -19, -15, 226, -151, 28, -45, 14, 202, -68, -56, 37, -254, 30, 75, 237, 108, -95, 189, 257, 35, 63, 6, -43, -4, -96, 241, 5, 33, 239, -114, 135, 13, 101, -150, 122, 188, 199, -170, -269, 45, 43, -74, 113, 77, 191, 187, -113, -82, -61, -193, 117, -80, -133, 67, 109, -7, 74, 163, 84, -229, -109, -60, -75]
7204g5k6K6k4J3J53O8k25K22k45Q7o0K17q8j12K9k25K55L53l20j91O6L9L87n99
7228b75L10k5O3j09J63l30L71j72o0K65l1j93M9k03L01p3N0j83J44P4O5j40J18
7251A79l44N14l60j48K38k27J58r9J97l43N5L26J50l88j6J02m2N7M8Q7m4j26J2
7274a4K14q4j7l92N71r8l01L30l18R9K34n7k52K37k04j42J62K15p6k7j73J9LJ45
7298G4l3J06j12j06J69r4PK39l12J25J6k08M30k08L5j37j03J77r6J13k27J88j17
7321g4K65k5j27J83k98L17m3l00J51k0p3K46n50K73n6M48l70J04l86M37o6r3n6
7344a13Q1J39N6l23K35k1Q4q2j4j51k06L02J69j40N9j62J01mp8J35p6j62m5l1
7368b47Q3K49P3o0j21P2j41k05J53L73l35J11k21J50r1J42J7q2K39j25K8r8j36
$$ y = [-75, -101, -75, -99, -86, 67, 135, -90, 132, -113, -26, -86, 131, 43, -69, -40, -265, -10, 343, 23, -168, -102, -63, 324, -275, 35, 10, 73, -36, 127, -203, 168, -4, -64, 201, 170, -23, 26, -177, 124, 51, 101, -82, 62, 136, 201, 61, 179, -165, 349, -11, -159, 79, -148, 10, -89, 108, -235, -180, 146, 296, -92, -108, -6, -48, 9, 57, 144, 100, -26, -14, 200, 116, 99, -293, 278, 180, -121, 209, -109, -10, 224, 167, -85, 152, -52, -194, -32, 183, 107, 80, -93, -74, -71, 74, 41, 147, 35, -71, 98, 4, 11, 250, -62, 63, 79, -129, 301, 93, 128, -9, -112, 65, -31, 82, -145, 43, -74, 191, 166, 39, 222, -76, 241, 198, -102, 49, 29, -44, 202, -348, -75, -131, 317, -53, 51, -335, 102, 36, -57, -113, -32, 107, 163, -160, 75, 54, 138, 56, 42, -109, -315, -13, 156, 16, 75, -87, 14, 10, -68, 67, -9, -171, -216, -247, -164, 85, 158, 98, -23, 49, -92, -297, -144, 229, -106, 5, -216, -66, -157, -15, 2, -80, 159, 34, 62, -36, -172]
7391a72K54j79J95j14%k53J68Q5p4K77l72M24j16J10l43J63Q2k80o8M93m17M06
7413B69m63J85K70l30J23Kj4j4J41l1m4l27K61k29K51j4k67J59J00K3J56j69r5
7436e7J38R4j22j94J34j32N4R4j3p0J46j27L45l27m9N5M25l95q8J09J07j74J55
7459A08j66Q6J71j93n2K17o0N6r1j45K30k7k74M9J17M5j16r6J46j52J42Q1R9M2
7483B17j67k06O1j95L25k28k4K6J42J19Mj74Q5J59QJ46m1n58L47k70M76l18J45
7506G9K82n18J30P3J08j51J73j26M0j06PK8j18j51M9L02l6J63l48P6Q4q5k2L25
7530B58j42m5j68K03p2o8N8j36q4J3M03k42J71L8q4q3j73J13j4k82K10J36j18
7553a08J31r6JJ82j57L43j69k8l6j79J2k1J2K16j80j72K83j87J37J34j76j68K47
$$ y = [-172, 82, -97, 98, -16, -16, -269, -101, -16, -90, 187, -185, 239, 123, 233, -110, 53, 135, -145, -213, 280, -137, 269, -194, -9, 261, -69, 54, 56, 42, 28, 169, 138, 94, -233, 28, -201, 50, 36, -231, -72, 28, 51, 207, 38, -57, 81, 175, 53, -141, -7, -139, -85, 9, -4, -74, 72, -55, 290, -37, -86, -31, 394, -1, -89, 20, 127, -47, 108, -58, 28, 199, 6, -46, 171, 111, 167, 76, -69, 161, 134, -140, -91, 26, 71, -45, -141, 5, -147, -5, 76, 175, 217, 50, -156, -95, -290, 35, -193, -217, -191, -49, 70, 74, -100, -15, 144, 152, 298, 257, -301, 46, -224, 252, -66, 79, 361, -157, -27, 46, 154, 3, 176, 50, 90, -16, -9, 19, -99, -250, -201, 101, 65, 228, -120, -44, 40, -45, -67, 258, 116, 71, -97, 106, 34, -34, 24, -112, -196, -183, 220, -22, 149, 187, 103, 20, -153, -40, -54, -336, -126, 10, -108, 23, -73, -72, 110, -47, 296, 127, 99, 63, -116, -104, -125, -113, 103, -77, -249, 34, -153, -16, 118, -58, -226, 21]
7576B1k1Q7n5J37O1l35n0OJ7J79K4J64k16J33J6m8j20j12K09k96J21K54l75%j74
7601c73P05l45K87l25K91m21K39j91ML80k00k68R0J70mK07l93K42pK67m96K86
7623A45k7j67J08J05j58j08J8K8J92k26Q1J9J57k66J59j28P0N3q2J48j91J2j53
7646b11J95J37k15R9l0Q5j09Q1k07L16n2q0%j27j76K15m1L39j77r0j14q9L16O3
7670A28j85k91M59j92J95J3j49jK53l98oJ54j55L35Nj6L7l25q9J93j87K52J34
7693A64k94RJ60kK02k87j15K39k28K07j18K13k01r4K23j46J91Q2k15p6J68j29
7715d7p7K55k20K15j94J38J58j69k99L46k97M32k71K03l28J31J20j54J13K14j5
7736B54l46J05l8J58j06k95M15N1p4o6j17J07p2O3k13K6L1J70k9j19J06J40j68
$$ y = [21, 0, 87, 32, 169, 230, -105, -155, -149, -132, 47, 71, 235, 19, 152, 168, 120, 0, -112, 97, -199, -78, 176, -199, -199, -373, 332, -13, 274, -51, 240, -181, 58, -133, -129, 251, 51, -217, -127, 43, 39, 246, -147, 95, 88, 355, -141, 145, 118, -49, 59, 164, 6, -102, -84, -56, 136, -90, -9, 10, 167, -99, 60, -68, 2, 55, -27, 121, -70, -58, -211, -16, 121, -94, 5, -25, 60, -49, 32, -175, 141, 89, 9, 9, -118, -294, -79, -120, 219, 42, -48, -162, -251, 65, 128, -57, -348, 111, -81, 114, 127, -22, -23, 230, -168, -174, -20, -175, 160, 165, 149, 186, -139, -228, -35, -222, 30, 164, -130, -121, 39, 37, 239, -48, -163, 76, -152, 55, -63, 150, -51, -145, 78, -68, 123, 205, -10, -86, 82, -47, -124, 131, -89, 126, -68, 70, 228, 59, -240, 106, -191, 241, -30, 173, -155, -24, 96, -58, 55, 269, 254, -92, 13, -25, 133, 27, -268, 147, 198, 124, 58, -59, 48, -24, 39, -174, -148, -117, 53, 24, -95, 11, 151, -17]
7759a7J51Q0k88K65l61Q7K65l82J16l1K01k11L4J47o5o8J30l00J03J83k88K57
7781Hj01k62O87l81J7L9Oq6j42j0K48j30J73r8l3j7J95l10J99k31J59K40j55j8
7805cJ14k47Q9k98N35o7L0j38k79L69j07R5j70n2J50n9JJ31q0R0K0N3j42J7p7
7830b5J0n0j42M41j97J38j40r7K72L7k74K01l41J60K36j18n7J97k09M6K05k36
7852E7k45R6L3j44L70j53k86K58k01K97o3j99KJ68k68K64Qn4N5R1j26p7J82K07
7876B72m9l27J69p5K40m05L65l29KK23k9Q6j02J04Ml28J59j76J89n8J09N6k01
7899a01P5r4J29K02j0J4j22q4J89k03k68J39O0k8J72o1N8m4RK05P6r1k92K84k35
7924b1L6M1j91K16m0J16l25J08J24j4j00j8l9J09n7K1k03M12k29k72L52jl2m7
$$ y = [-17, 134, 214, -74, 191, -170, -83, 182, -200, -84, -115, 86, -125, -91, 56, -9, -77, 53, -247, -144, 39, -249, 8, -93, -355, 332, -49, -32, 7, 13, -73, -215, -225, 23, -107, 66, -32, -65, -82, 113, -197, 2, -229, -70, 170, 15, -3, 111, -136, -47, -345, 190, 123, 153, 15, -264, 105, -2, 93, -77, -129, 21, -38, -37, 94, 14, 104, 124, 177, 35, 52, -25, -15, -65, -207, 234, 37, 175, 35, -62, 210, 247, -27, 174, -167, -7, 229, 111, 54, 251, 42, 88, 293, 57, -188, -92, -59, -203, 167, 14, -272, -14, -215, 82, 19, -180, -178, -10, -278, -14, -6, -60, -5, 86, -40, -117, 65, 272, 223, -104, 65, -10, 230, -175, 190, -139, -137, 86, 57, 143, 41, 145, 149, -179, -20, -196, -7, -65, 44, 100, -101, -26, -120, 9, 211, 201, 215, 93, 9, 198, -5, -273, -134, -74, -102, 70, 9, 67, 23, 32, 237, 313, 222, -70, 214, -21, 15, 56, -135, 81, 41, 157, -168, -60, 64, 50, -50, -68, -107, 2, -55, -34, -237, 175, -54, -326, 26, 25, -7, -54]
7948e4K41l4l30J51m9J09j94J38M0r2N45n08l8J18P2r0J63j23J81k41p6J97j90
7971f4%M17l10k62M39k39l9K17n2k09J18j8M7n6QJ66O5j06k16n3p2L29p0nJ45
7996A80q1J0O2q3q0j37l6K20J71l34K31j14O6J00j25N6j01j01J94l97L47r1Q6
8019D3Q8j25R9j83j10J74J86l9p6j78J21Q3k87J04J94n13M58q7K5P2K46m50J50
8042eJ4j46N00k77m3J50n2k0j62jj67O7J13K09j0l7j00j20L1J03K11m22K14l05
8066b55J43J55j53J4K33%K6k00Q1j55K39k90J27l5j1L4M44k84k51O67n42J27j50
8089c6J80j89p6J05j71K16R1j52q6K69k16O5p8J54p2Q1k8j54J70q1j67K72l40
8112b43L00j52J55j30N4j88L48k8j58l4r9J43N9o3J29m6j26J12J05R1k50J56l24
$$ y = [-54, 187, 153, -177, -26, -75, 34, -160, -22, 18, -74, 471, -37, -75, 43, 115, 25, 188, 65, 246, 5, -71, 126, -64, -64, 353, 43, -219, 220, -19, -58, 159, 107, -102, 16, -2, 45, -11, -3, 163, 228, 122, -94, -147, -219, 110, 40, 35, 180, 99, 109, 171, 88, 8, -129, -165, 55, 226, -108, 123, 9, 75, 175, 50, 106, 5, -96, 98, -299, 48, -43, 43, 131, 6, 105, -78, -188, -14, 172, 133, 57, -121, 0, 83, -204, -100, 94, -419, 39, -48, -23, 49, 295, -155, -5, 9, -137, 363, 86, 43, 193, 141, 121, -41, -42, -209, -142, -29, 180, 170, 133, 33, -87, -56, 47, 258, -164, 50, -255, -112, 43, -110, -96, 137, 137, 163, -37, 44, -111, 128, -162, -35, -70, -81, -47, 397, 113, -138, 529, -13, 114, -36, 144, -45, -121, -16, -187, 29, 120, -32, -118, 151, -65, 0, -78, 76, 4, 85, 57, -97, 73, -8, -175, 97, -243, 57, -95, 60, -70, -16, -204, 144, 116, -42, -76, -175, -32, 27, -36, 93, 47, -79, 33, 138, 229, -21, 135, -189]
8135a89L42l55k3L8K47M6l4j05J5m4P5l7qJ76k74L78n65M02j54j56J75j20M32
8158B62l55O1K74k32M11m71J16l5m2L7j25K70k29k16K33J43l1J81k90J09J30j73
8180B8o2q3K36l1J2N9k06j46K98j17j0
$$ y = [-189, 153, -202, -225, -187, 60, 106, 72, -33, -18, -62, 13, -24, -32, 144, -130, 248, -317, 85, -69, -225, -50, -170, 262, -93, -32, 242, 10, 421, -50, 66, 31, -11, 26, -99, 171, -58, -274, -41, 102, 71, 252, -38, 71, 201, 28, -34, -117, 119, 88, 100, 159, -47, -193, 105, -12, -22]
8191b2
$$ Imaginary data points
##PAGE= N=2
##DATA TABLE= (X++(I..I)), XYDATA
0@%%%%%%%%%%%%%qJ6j6J6j6K4l2L2m0M8n6P1p9Q8j04J20j41J65j87K11k40K72
35A44l07L46l89M36m85N39o00O67p39Q18r04R97j101J213j337J474j623J789j973
54a035K180k412K674k974L321l727M209m797N531o474P738r537J2315j7227K8527
69A8312j07516j7935J53441j708j4766J0457L3880l0406l9644k5616K407k0957
81d0051k8441l261N4728N2705J9105Q38J0654k3524o0954m3569J5840K5934m082
94b4078j2289K5200M0062J6897j651K140j4431m1917l9815r221J2107K4355K8006
107E365K1788N792o833q303L639L552k5504m3327j3264K3947K0822R813K3185
120B0672K6248j308k5098k2111r494o956q500k668Q778R217O790J9212L0219P378
$$ y = [0, 0, 0, 0, 0, 0, 0, 0, 0, 0, 0, 0, 0, 0, -8, 8, -8, 8, -8, 16, -16, 16, -24, 24, -32, 39, -40, 48, -56, 64, -77, 88, -99, 112, -128, 144, -163, 183, -206, 230, -255, 284, -316, 351, -388, 430, -474, 523, -578, 635, -702, 772, -851, 938, -1035, 1145, -1267, 1407, -1567, 1754, -1973, 2236, -2561, 2970, -3504, 4234, -5303, 7012, -10215, 18312, -89204, -107139, 46302, 44594, 29828, 40285, 74165, 43759, 4115, -21501, -19094, -40051, -68492, -71753, -17025, 35680, 54785, 55623, 66277, 42753, -18201, -61770, -45930, -19996, -24078, -36367, -11167, 28895, 45792, 44141, 46281, 31850, -10067, -49882, -59103, -46996, -22641, 5365, 27153, 32945, 26112, 17809, 21448, 25000, -504, -43831, -57095, -33148, -12326, -2513, 20672, 46920, 45612, 20514, -1597, -11091, -18047, -26547, -29215, -20437, -11220, -4430, 14782, 45001, 52379]
134E2379k9955l5601j2474J342k269j592J3765K2234J0584j624M083R202q124
147B1950k5769j9935p306j742O942K2639K5082Q089r132p893N22m257j8822j6868
161b6500J337Q604J586P262K1940J9394j279j6154j5775j0369q919m185N449R084
175h525M786L799J2754J4798o93j6008j4296p018p559q047L648J8273J6406L144
189A5462l235K627R99q715j2262o439o240n202N379J6544J5301N107k474l385
203A3467m020j0175j2951l505N450K459j332O425J5669J0138k596p342q073r786
217f172j0261k177O507P445L427N392Q753M419m423p321n211n579r036o204N482
232a4959J3117R530K929J619J583m441r245n563k294m338l254N209J0228P724
$$ y = [52379, 22424, -13177, -25651, -24309, -26578, -28170, -14405, 7829, 18413, 16789, 20872, 30074, 21950, -3819, -23754, -31060, -32802, -25860, -3221, 21861, 29950, 20818, 12925, 13447, 9190, -9632, -26500, -25163, -16559, -14973, -7711, 14229, 33623, 32344, 16190, 415, -9954, -18873, -23058, -17609, -8525, -3739, 60, 12814, 27612, 26919, 10911, -3385, -10403, -17962, -26009, -22361, -4088, 12318, 15462, 12227, 14854, 15853, 7138, -5124, -11563, -17803, -23005, -17626, -1082, 14219, 19326, 16852, 13467, 9447, -728, -13679, -17184, -11734, -9275, -10607, -4182, 11487, 21625, 19029, 11687, 3614, -6172, -16433, -18610, -12103, -4658, -1231, 4161, 12914, 17333, 12910, 5589, 378, -5201, -14237, -20441, -14959, -1842, 7688, 10617, 12236, 13819, 9378, 133, -5430, -7724, -12062, -15316, -10107, 121, 7845]
246G845L521K161J76o119j1739q426Q77L395R95J674P473P903K757j599j940m326
262D628r027q370j332M703N044L896O712N676j88m892m114k346m432p163k779
277a3984N117P235N321M283L610O0n662o940l894k389k510l5M916O069M036K626
293G859K591J86o065q526m409j52P4R53M888P146L956m43j192j54m110p099m718
310i215K73J865J885M486O954M403j854m238k373k672m487m094Q05L474L450K718
326A380M235L791k82m835m696k809l223k306J507N020L784K092J963K222r09m399
342B535n006k562j503j235J668N312M777J971J94K77j578m702m701j282P79k73
358e329J056M131M879K450j009j894j248l970m599j857K078K460J706K492L760
$$ y = [7845, 11366, 13527, 13703, 7584, -4155, -12581, -11704, -8309, -7314, -5640, 1833, 9736, 12493, 10894, 8954, 4628, -4399, -12769, -14101, -9398, -4354, -458, 6254, 11930, 11742, 6850, 2736, 390, -4042, -11205, -13984, -8867, -1632, 3689, 7972, 11582, 11642, 5980, -960, -4854, -7243, -9753, -9788, -4872, 1197, 5233, 7859, 10450, 10636, 4571, -3955, -8364, -8516, -8442, -7489, -2601, 4545, 8501, 8058, 6866, 6712, 2602, -4497, -9215, -8942, -7077, -5192, -706, 6248, 10651, 8797, 4559, 2186, -486, -4973, -9067, -8262, -4788, -1338, 1380, 5615, 9406, 9124, 4289, -407, -3216, -6439, -8745, -7238, -2218, 1566, 3658, 5621, 7843, 6934, 2535, -2471, -5033, -6536, -7771, -6103, -791, 3986, 5957, 6151, 6428, 4850, 148, -4553, -5835, -5056, -5329, -4273, -142, 4737, 7187, 6178, 4284, 3036, -934, -5533, -7390, -5312, -2852, -1146, 1346, 5106]
373E106J854j869k593j600k546m134k205K496M236K640J850K001Q39k087l515
388D73k242j166j708j176J548M052K782J687R09Q79k708m687k912J9M57m8J382
405b459K733L296R30m91Q2j764l378l263j182J411J171K339K774K601j58k007
421B635p95o03k561l230o40J500K087J633K657K262J58k263k724j752r86j435
437d057O3J802J626J319J300K377L86k047l587k093l78l98O8J971L288J395k96
454B739p0K12q95k823j952n49l19O43K110L303J468o06j166n88j167k235j341
471c236L98M40O74J226K044K183J23j223k083k065j244q22O74J948J117K74J251
488A679J441K72j950j706q68j235j593P57K592J884J097k23K4n58r60j249j185
$$ y = [5106, 6960, 5091, 2498, 898, -1648, -5782, -7987, -5491, -1255, 1385, 3235, 5236, 6075, 3988, 473, -1769, -2935, -4643, -5819, -4271, -219, 2563, 4250, 5159, 6038, 3330, -1357, -4269, -4250, -3793, -3841, -2459, 274, 3570, 4500, 4009, 4091, 2327, -1051, -4314, -5496, -4085, -2914, -575, 2199, 4800, 4642, 2635, 1840, 1237, -1324, -4554, -5194, -3694, -1607, 26, 2683, 4945, 5103, 2840, 116, -1636, -2622, -4057, -3994, -2192, -566, 753, 2053, 4430, 4816, 2769, -818, -2911, -3289, -3687, -3619, -1648, 1640, 3035, 2739, 2669, 2881, 1986, -837, -2789, -3338, -3657, -3014, -904, 2399, 3867, 3261, 2095, 1507, 340, -1895, -3236, -2838, -2398, -1724, -498, 1546, 3729, 3852, 2629, 546, -1519, -2763, -3585, -2911, -963, 154, 428, 1679, 3120, 3392, 1442, -264, -1132, -2367, -3960, -3203, -611, 1273, 2370, 2147, 2171, 1613, 653, -596, -1781]
505a781o14m87L25J780K538R39q8k82p90j753k148k12P97N94L46M48J782J290
523B684m3n77j092j900j456r44J070J575R53N76J033L72n49q82m77j017j119j199
541b992M62J688J813O74O14k24n12j585q72m25l24k69K83J176J444L95Q70N2q72
560A396j962j650j82Q20O73K45J040P93M49J07j53l11j567j760m69K97J388Q24
578b2J262R51q8j219p41J5j62j322p21M37Q85R18R11Q92M19j004j524q45l74k78
598a610K74N49P31Q87L30M35K85n67j684q86m03j87O60Q52R48P17l5j54P0o05
618F07r95o80q9l39M07N04J744R20l71j195r3l82o15q11N5M69K94N10Q38R08K34
639A920o25j254l85r65k96L17J027N99m9M69O85j45n85q26o97l55n40J9J443J251
$$ y = [-1781, -2395, -2882, -2557, -777, 1761, 2700, 2612, 2330, 1540, -213, -2361, -2573, -1776, -1182, -836, -388, 1394, 2684, 2641, 2064, 972, -928, -2384, -3328, -2258, -683, 270, 846, 1879, 2251, 1702, 820, 343, -674, -1793, -2992, -2530, -842, 971, 1645, 2259, 2035, 1523, -62, -934, -1359, -1683, -1952, -1669, -493, 951, 1346, 2216, 2268, 1396, -566, -2216, -2398, -1578, -905, -660, 380, 1173, 1622, 1729, 1576, 1265, -302, -2062, -2531, -2234, -846, -22, 1240, 2191, 2103, 884, 143, 158, -4, -1326, -2047, -1610, -725, 193, 1104, 1996, 2415, 1411, -113, -958, -1332, -1610, -1336, -787, -56, 831, 1161, 1596, 1881, 1314, -370, -1256, -1659, -1846, -1186, -334, 614, 1331, 1296, 1142, 1212, 607, -388, -1068, -1157, -1496, -1089, -585, 1159, 2079, 1708, 513, 420, 38, -577, -1388, -1333, -864, -570, -60, 778, 1686, 1920, 1295, 41, -344, -1309, -1605, -1288, -261, 338, 289, 758, 1443, 1298, 713, -113, -810, -1165, -1705, -1686, -243, 1008]
659A008RJ72k06j40o31o39m53j26j30M7O85J074Q61k65k22l95p45r16j35M03K95
680d49L8M51N40L46J86l74m74o82o41l09K94O52Q45o3M03P8l21J19o03m36l88
701g88m79L02O53P09M90K7O1l35q34j99k82J7K7p0Q66M36L40K69j91l53p01r48
723i83j13L63L46J28O66M7N07j04On36n31o63k13K31O18J01M63L78K42m77m54
744B2l20l06j59l2p9O39L88K07M46K3k58o81k35l28J17k81P26L15L54J16N9L5
766G68k30n84o02j2L4K07N2O87N87l36q2j38r7m62k10k44J70M58j82P91K51L4
788H60j52m62l80r4n95J39K46L37L64j25M20oj53j56o02j31k06J76M26K77L10
809D93l1R8Q4l50l66l64J3j90K6L74M43K53J29l21Kl12j57l91K04j77Q6L74O14
$$ y = [1008, 1017, 1189, 983, 843, 212, -427, -880, -1006, -1136, -1089, -404, 670, 1531, 1266, 1044, 649, -96, -1012, -1147, -744, -449, -411, 40, 580, 926, 1112, 738, 264, -418, -1059, -1368, -1074, -422, 423, 360, 763, 841, 520, 639, 36, -400, -788, -1267, -965, -312, 397, 887, 914, 975, 640, -194, -393, -675, -658, -631, -701, 165, 601, 941, 1210, 1019, 666, -35, -983, -1096, -733, -387, -259, 407, 454, 961, 857, 863, 327, -204, -867, -1080, -849, -231, -130, 333, 711, 953, 476, 22, -298, -604, -763, -795, -874, -235, 153, 360, 806, 829, 571, -110, -345, -673, -556, -837, -111, 204, 558, 674, 733, 768, 538, -46, -648, -660, -626, -419, -367, 320, 907, 571, 489, 351, 254, -208, -418, -662, -492, -34, -216, 575, 826, 860, 708, 246, -134, -228, -823, -684, -438, -101, 263, 138, 558, 552, 399, 243, -359, -490, -696, -520, -94, 183, 493, 462, 560, 644, 294, -72, -436, -423, -613, -587, -213, 230, 483, 612, 291, 293, -19, -176, -567, -363, -540, -454, -80, 534]
832E34p9K09k01l11l17j45n53N19n5K54K72L8M22j81l00j23r8p1k58kO39j73K24
855B44K02Qk93m4j29k03m1j93J56K17K03L44m14M68k8k54o02K6J0j40K35J50L23
878B45K9K23o4q4m11l70l8J11J37L5K99J38L0q6l1k37Pj27k75L09o6M73j64N90
902F73p6m17l74K39l27k3P0m68N45M01p9qj7R7k54k37rL0Q1l27M42K06M44m59
926A53J07p9l51j55j63K55j18n7Q0M19J11l4o9l2k52o5L4N1J2k9K46k27L96l4
950A99k26K62l55k40n6K40j8M10O9j3l4k1nl26k32J86j63K4K59M20oJ29j47q0
974B76k68l6l9K69m20J49J36J18q4P8M1j96O7j58j81J1M1J71J47j4K42l08J86
997B28p2j40k91q4K22n1K57M6j01L93l99K83o2l72j27j8K42K09p9J4L60k25M9
$$ y = [534, 455, 664, 463, 152, -165, -310, -863, -344, -399, -145, 127, 165, 587, 406, 106, -17, -115, -186, -444, -446, 193, 20, 244, 446, 454, 161, 117, -12, -215, -256, -449, -293, -76, 127, 471, 57, 525, 497, 243, -359, -333, -323, -463, -228, -78, 245, 274, 497, 433, 349, -62, -432, -470, -359, -222, -187, 112, 250, 280, 194, 163, -74, -67, -194, -469, -160, -226, 247, 83, 673, 597, 180, -194, 45, -282, -305, -235, -703, -158, 243, 164, 156, 139, 236, -18, -255, -264, -234, -153, -480, -38, 168, 612, 153, 260, 181, -170, -325, -488, -233, -351, -408, -328, 91, 202, 168, 99, 67, -185, -250, -216, -165, -153, -182, 64, -163, 233, 199, -27, 235, -120, -360, -416, -176, -194, 216, 285, 272, 238, 217, 212, -114, -346, -160, -323, -299, -40, 380, 374, 503, 356, 276, 8, -28, -67, 202, -218, -69, 67, 185, 101, 179, 220, 24, 91, -67, -248, -237, -196, -25, 122, 108, 350, 42, 228, 156, 16, -275, -359, -137, -188, 69, 115, 14, 407, 8, 291, 229, -143, -270, -288, -46, 163, 84, 98, 458, 233, 282]
1020B82k00j72P7K2l7k07K58n2K76k21M26j74n86N11k92r9oK03J63Q5P4J27j00
1043C58m03j40p9J61l7k8j4M60j21J71R9l57j08J65l27J64k96K06M01l37J66K36
1065C40j3k31q5l43P6R5q1K85n6Op4K40m6pj3m37P2P0Q8J04K13M6j76K34K8l28
1091Gk05l14N01l23K67N2L50K8pl75p1O8r7n1J3k76M56l6O1J30j90J43j29j81
1115a79j89P6N4K52K3j78K00o4L04l33q2J43j96P9j46J09K59L0P9l2j96l4j30
1138a51p0KJ52K9J20N5j14Q5j6J61m15R9j80J26L4J5j57L5J34J71K37l03N3m30
1162c28M3J13J88l07K78nJ25J82l22J78l40l8L1J43l31O48K6P2j5l46j28K78k41
1185i6o2o5J58K62j69L17K5j39k21j26k79K07%k5J57J0j9L47q8k85K06k22k60
$$ y = [282, 82, -90, -13, 9, -28, -235, 23, -29, 247, 26, 452, 278, -308, 203, -89, -188, -194, 9, 172, 257, 331, 458, 358, -45, -185, -264, -103, -140, -168, -182, 278, 157, 328, 427, 70, -38, 127, -200, -36, -332, -126, 275, -62, 104, 340, 327, 96, 11, -332, -256, -161, -242, 43, -13, -7, -81, 159, 113, 106, 93, -344, -272, -202, -114, -10, 203, 249, 73, 307, 335, 7, -198, -512, -11, -334, -67, -15, 335, 363, 356, -19, -90, -22, -119, -170, -157, -433, 23, -13, 48, 178, -12, 131, 2, -179, -368, -292, -238, 14, 37, -141, 59, -5, 299, -34, -116, 27, -169, -90, -236, -127, 132, 162, 241, 209, 13, -21, -151, -221, -219, -67, -38, 82, 137, 23, 108, 92, 253, -162, -63, -243, -117, -83, -68, -225, -190, -56, 115, 352, 49, 102, -328, -285, -172, 16, -291, -13, -18, 107, 289, -33, 145, -195, -233, -202, -59, -390, 258, 284, 356, 341, -5, -133, 145, -96, -158, -223, -65, 197, 28, 345, 370, 231, 10, -116, -395, -188, -188, -213, -56, -46, -65, 282, 194, -91, 115, -107, -367]
1208c67J11K40K01k23R0J70k75J3q1J17j46l4M9Q5L26j8k25K42q4K58m79J66m23
1231b87n2J97J69J92k40L57k47p1L3m8rJ90l77N0Q4mL41j04p5J19j23k00J55j91
1255a41m4q7K15Q2J30m2j62P2P6l84J37l1K12p6kJ17J73j00j65rJ25m13K11J57
1279E1k59K15J42q2M03m64M0j24rl09O4J70J32O2J13J69j55N9j21q3J49m18O3
1302a92J34p0j6L02j29L79l84k29J58l8J36pj41J01M0J79k96K06l26O7r8j15K02
1325a37J49K64k62L7nR5P0j12l09L42j15r7Q9n2k1J51Q5l1N7J40o12L92j79R3
1349C2N5r5J68j38K82k54j65J69j85O6k6J38J14k47M18k79j53OL52m17j26n0j39
1372d74O34j50l30K98K9N4j46o4j78K75j03o4K66N3J82K4l48N4n4j71k1J78O7
$$ y = [-367, -256, -16, 185, -38, 52, 222, -53, -40, -121, -4, -150, -184, -135, -50, 276, 258, 33, 275, 191, 449, -30, 136, -287, -339, -142, 27, 219, -21, 336, 89, 18, 51, 3, -6, 184, -193, -143, -59, -63, 278, 174, 99, 218, 95, -105, 50, -141, -185, -272, -57, 25, 155, 113, -49, 23, 99, -285, -148, -179, 33, -43, -45, 72, 245, 145, -20, -29, 96, -317, -106, 51, -208, 7, 149, 67, 470, 6, 46, -78, -87, -396, -332, -162, -30, 32, 145, 314, 159, 218, 97, 14, 163, -255, -192, -58, -128, -144, 158, 29, 408, 24, -205, -47, -85, 51, 44, -97, 4, 44, 223, -73, 133, -193, -126, -224, -339, -137, 12, 276, 14, 51, 46, 141, 211, 99, -210, 132, 17, -80, 9, -43, -64, 87, 172, 141, 198, 338, -274, 118, -61, 32, 87, -8, 160, 22, 304, 50, -115, 54, -131, -65, -91, 47, 161, -86, 332, 53, -100, -94, 258, -159, -285, -335, -474, 160, 10, -320, -22, 7, 61, -85, -149, -327, -52, -155, -219, 47, 100, 282, 306, -42, 12, -42, -213, -234, -56, 11]
1395A1p8L21j51n4O8k51L72l0l06q6O1J35Q8R1pl8K50m11J27j53J13k33K20r0
1419c1l9Q8k0N5l0j86q7J77K1k38p3M66j9K4l81L30j35O7K8k16K02r2P1Rj2Q6
1445F5j01J7k04L64k60k83L60J66j84M4K46l05j85J54l1O9Ll2q6K62k67J91J79
1468A82k33l14O17j80j41m8N7J22Q8j33j51J25j86J72J96m25J47j22K84q9K27
1489A95j36J69n9j51O4k03J89j45J24oP5R9j56M8R4l05L71n54P2m3R8J41R6P1
1513A48P3r0j6r3j26pj66K84J75k04K65k35m1J4%r4p2P6j05K23k45K6L04o8j08
1538h2J64k29j0rj19L95n0N8k15q4J03N5p0m1J25j61J60j0k9q0J18J50R0q2r8
1563D9J06k46J3K9J38j64L81l49Q4l32K38L5P7P5l61R9k38N43r8J12p1l96R2n2
$$ y = [11, -67, 254, 103, 49, 117, -134, 238, 208, -98, -184, -123, 12, 100, 191, 184, 146, 396, -15, 112, -41, 72, -161, 59, -31, -70, 18, -2, 53, 23, -163, -250, -73, -52, -290, -363, 103, 84, 108, -273, 57, -78, -11, 17, -199, 3, -89, -18, -9, -21, 65, -36, -19, -223, 141, -119, -402, -42, 124, -60, -16, 230, -75, -260, -106, -137, -68, -65, -97, -183, 79, -188, 3, 182, -51, -365, 252, 72, -69, -117, -60, 62, 150, 17, -134, -9, -195, -23, 173, -252, -105, -227, 57, -32, 195, 59, 228, 169, 18, 82, -121, 68, -77, 47, 41, 116, 215, 59, 107, 201, -104, 267, -287, -215, -258, -160, -19, 77, 148, 221, 131, 115, 22, -104, -111, -277, 7, 182, -22, 243, 8, -33, -19, -19, -113, -185, -109, -214, 9, -236, -210, 94, 26, -82, 82, -147, -157, -166, -285, 110, 60, 118, -97, -181, -78, -23, -93, -134, -9, -170, -10, -20, -49, -129, -11, 139, 229, 147, 49, 155, -91, -78, -49, 89, -75, 306, -43, 41, -291, -53, -18, 59, 134, -227, -128, -366, 177, 79, 191, 120, -276, -184, -236]
1587b36L8n2M48k57j13L93k25K00m35J32N0j79L69J4k76M1K73k22J58k59LM50
1609C15j96m9r6o2K20l18j5J23O3nJ7k0J5k9M3o0J22l5j91K86k11m1K16l73M29
1634A48m9J0l44J11L93j0K6j97K19k01j73K78j22j22L9J3l33J98Oj36K49J02l08
1657b03K23J62l41J17O7NM3j3j11%J37j57K03m16N31l56K06j87J26J38k53RJ0
1680f0P8r8L8k69O00k26O4l08J93K24m9l13L20j13j96O3j23J69%m1N5j3p8j45
1704b28J02K77j20k57K78O1L4l54K48j85M1J79j39J36k28J90r7L10o16M95k98
1725a71L03j79J28k58J99k38K67K00l03Q6j55K29j24j92K07k80K72k28L0K26m
1746A5j9o8q4l6O7j85N93j44k72Q5J02R8pr2k75L44j4o8L6k30K95pj47l6m3J39
$$ y = [-236, -198, -250, 198, -59, -172, 221, -4, 196, -239, -107, -57, -236, 133, 147, -129, -88, 185, -37, 121, -138, -135, 315, 119, 70, -26, -88, 132, -186, -201, -78, -15, -20, -3, -23, -8, -37, 6, -54, 68, 33, -158, 128, -83, -124, 92, -281, 148, 99, 109, -235, -124, 269, 259, 285, 88, 307, 106, -67, 211, 89, -33, 6, 19, -314, -116, -110, -246, 3, 105, -203, 20, 182, -159, -42, 25, 30, 73, 60, -51, -51, 86, -71, 132, -284, 247, -109, 97, -90, 36, 174, -79, -70, -60, 18, -80, -42, -311, 289, 63, 127, -181, 12, 236, 187, -126, 194, 81, -115, -52, -175, -6, -6, -47, 8, -5, -83, -228, -126, 151, 31, -226, 52, 113, 147, -207, 41, -144, -103, 76, -63, 73, -155, 35, -62, 248, -368, 127, -171, 132, -47, 81, -177, 22, -216, 51, 251, -52, 34, -121, 108, -16, -208, -1, -281, -9, -237, -207, 19, 15, -4, -72, -156, -192, -125, -310, 283, 139, -133, -48, 54, 152, 145, 53, -222, 122, 108, 40, 76, -154, 141, 134, -13, -49, -92, 47]
1772D7l5r3O3K0l2L41l20K02J85l13n0J13k95N5O0j11L81j44J17n09K26R5q3J43
1796F3K8p3rK21l95L02k84K30O2j42m3J7m7P9j92J10O7J7j29M2J27n4K4k26L43
1821A38j43K9R3j32mO7k08J15j96J51K2j08q3N17l08K04J2l03J00j67nM9K99j73
1845c4j54j14L07j91J97k94L16j95K3L06Kr4n9J78j61j5l5jr2J49j80J11p3K16
1869A13P8j39J03m19J41J46k40K0K04O7q5J17n3j30N4J53j28R8j83O4j02O5q0
1892a36L05j91j7J76n14K63Q4j43P6l3P0J90J97n02J69q7K8J91J22k01K32k30
1914D9j47J75P2j54K49k48jj4pJ63l6j74N4r7J23M3l5j67p2L08k24R9p3n4L90
1939B22j63l25K83q4M3K6O2oj06J46k45K69n8Oo9L0J63p1k82L80k39p7jJ66k55
$$ y = [47, 12, -81, -18, 2, -30, 311, -9, 193, 378, 65, 15, 128, -167, -112, -52, -163, 218, 74, 191, -318, -92, 3, -80, 63, 91, 18, 9, 230, -165, 137, -147, 83, 145, 3, -40, -23, -70, 9, -183, -73, -6, 11, -118, -76, 51, -3, 21, -205, 138, -5, 24, 117, -15, -19, 48, -160, -45, -241, -90, -68, -176, -259, 258, -50, 154, 166, -137, -37, -204, -209, -160, 139, -34, -188, -302, 5, -186, 11, -283, 33, -162, -139, 167, 169, 75, 16, 194, 33, 18, -17, -18, -110, 39, -141, -30, -103, 113, 191, 52, 155, -264, -123, 23, -217, -197, 7, 74, -11, 106, 53, -77, -23, 130, 2, 100, -83, -19, -121, -56, -136, 169, -22, -39, 137, -377, -114, -30, -173, -97, -130, -60, 130, 327, -175, -6, -93, -65, 126, 248, 47, 279, 49, -98, 77, 149, -5, 244, -4, -5, -19, -26, 137, 101, -73, -19, -116, 7, 50, 15, -152, -224, 84, -140, -41, -114, -168, 222, 59, -266, 17, -67, -24, 2, 64, 58, -48, 98, -147, 122, 64, 70, 1, 31, 194, 123, -159, 221, -18, -95, -96, 70, -185]
1964a85K79k58K53r9Q0j8j38J9R5L3r0k5O1j2K32k08J07k17m6J00n8J73L5j04
1988IQ1k5J1k66K02j24J61J61k56K20n9j18L06k52k32o4Q7oK11k30K65N7j7m6
2012G6J0j51q8L38m18M49l33J3K10J3k43M1K1J23l04K16m7P6j26L42l49N6K77
2035B02l47Q5K0J21k28K11J3k33L36j96j35J32K36o3Ll49L37j49j37M6n6P4J01
2058B4k20M13o4O3k74j88K49O7J21m25R9K48k48L95n12K88l5j62K60j17J24J05
2080B11j01r5j45lJ02J7J92j9J55k05k82J93k18K05Q3M1m76M78j99J78j75R6K01
2103B34l53o3P0P2N0j6j0n6n2J41P6rJ71o1k72N3O5j81K8L07N7j47j38k3O3P0
2129G6P9k12K05J4l94K64P6o1l22J94L38l14j17K02J88k36j62K03m4J1O0J16R
$$ y = [-185, 94, -164, 89, -10, 70, 52, -86, -67, 28, 61, -29, -54, 7, -5, 227, 19, 126, -91, -137, -37, -95, 78, 113, 9, 90, 65, 76, -190, 12, -112, 49, 210, -46, 174, 115, -3, 303, 51, -181, -245, -158, -164, 47, -183, 82, 139, 122, 76, 86, -65, -153, 185, -233, 216, -117, -104, 106, 119, -124, -83, -62, 61, -243, -27, -74, 2, -124, 218, -131, -75, 202, -145, -60, -40, 81, -147, 64, 77, -156, 180, -16, -151, -19, 217, 154, 157, -192, 145, -4, -141, -95, -151, -77, 24, -196, 217, 153, 216, -58, -246, 3, 70, 191, -234, -135, 113, -135, 260, -252, 36, 1, -161, 99, -18, 106, 211, 110, 15, -130, -133, -31, -14, 178, 159, 314, 109, -173, 20, -198, 7, 90, 131, -345, 133, -66, 112, -63, 33, 234, -119, -182, -112, -40, 10, -6, -16, -72, -124, 17, 93, 84, 255, 194, -78, -25, 40, -141, -113, 194, 251, 104, -34, -57, 6, 76, 155, -57, 148, 162, -232, 32, 108, 47, -275, -81, 257, -57, -174, 28, 216, -20, -182, 21, -23, -12, 48, 164, 173]
2152A73N8q9k87J25J30j37j85J12j79K59R0J41j97k51J00K79j68M2j02o3J64n8
2174d3K71k87J05Kj51K44j18k46L89k66K45k61j04J16J35K60j50j30n5q2K78J3
2196A65j48O7k36K01k22J53Q3p6L1Ql07K92M1J99k81j13m9J48qJ31q2Jn5j85K52
2221A0j15j5K31j23Q5m2Q3j77J45L8j66J05k9J70j01J96j05O6l42L35n83L20R6
2244H2r3J74n2M6J95o11O31m29k55L49m4l52L16jJ93l39K98k27R8J88j97j49J50
2267b9K53m03J12J18n7m1K64k91O4q2N7O0j49J86J3l6n7MJ5o4J49q7J09n0J62
2292B20j29J00k00M5J29N5qj7j41j97J89O1q8J18k66J96%N7l51J71J07j14J25
2315F2J03r3l02M42r0M2j67J36P4r1l24L01j85K33M2j05k09K91p7j64K68l9k26
$$ y = [173, 231, 142, -145, -20, 110, -27, -212, -100, -279, -20, 70, 211, 14, -237, -137, 142, -26, 16, -86, -149, 15, -43, 228, -59, 46, 48, -103, 141, 23, -223, 166, -100, 145, -116, -220, -104, 31, 291, 141, 11, -44, -126, 152, 165, 17, 84, -152, 49, -173, -20, 63, -13, 18, 26, -281, 11, 52, 251, -30, -143, -192, -44, -52, 79, -3, -2, -57, -242, 10, -105, -120, 111, -12, 73, 31, 114, -63, 82, 120, -46, 59, 30, 200, 99, 295, 190, 256, -86, 249, -334, -14, 82, -11, 163, 111, 157, 352, -259, 372, -57, -312, 37, -7, -359, -43, -44, 149, -190, 108, -119, -21, 167, -30, -179, -29, 224, -179, -67, 51, -6, -47, 217, -74, -10, -92, -35, 25, -124, 62, 75, 39, -18, -14, 1, -63, 86, -1, 108, 58, 220, 91, 191, -9, 36, 165, 220, 212, 195, 54, -143, 46, 107, 19, 137, -129, 67, 67, 124, -227, -56, 51, -63, 62, 165, 72, -230, 212, 122, 164, -3, 133, 207, 116, -208, 93, -92, 141, 183, 78, -131, 160, 83, -81, 187, 148, -78]
2338g8K14k02j8J11N1o8J99l09P5K29k41n0K0k82L78J73m08J40Nn8J76P4j97J38
2362G2l62K60J65l57K79r8K33m9j11j80o4M09l35M32k13J71k89J30qp9Pk16K97
2385I4j69j2K7k10K56j56M0N0j3O8K44l12P2L15l10j65L30j82%R5k2J49m13M62
2409B38k41K4N3k62J59P2j30p6J41K12k69j33J37q1L02l30K9m7K75Pj10n4N5N4
2433B5J21m7p1j23J42k93L00j15Q8L5r2o3O5K09l77L08k00J41Q2L5k64L9J79j17
2457Gp9L49l57J04L16l79o0P2J96j85J10l7p3K33k88K54j31J0l6j04p2J6J97o1
2481BP3J1j87K76N0m4k3j26k41L7R5j0J8o1J27L05L3l48j86J92J23j60m4r7K19
2506C4J16P7J13j79J91k99j4K03k96j9K98l87L51l5j86l4R5K8l61K35K2K02m09
$$ y = [-78, 136, -66, -84, 27, 78, 10, 209, -100, -25, 204, -37, -87, -67, -349, 29, 202, -206, -66, -61, -119, 57, 131, -66, 72, -290, -30, 135, -222, 57, -41, 192, 143, 32, -148, -212, 197, -138, 294, 81, 252, -37, 93, 85, 6, 13, -203, 94, -75, -87, -60, -270, -14, -170, -130, -80, -93, -25, 219, -93, -21, 294, -16, -181, 149, -33, -33, 62, 40, 189, -224, 238, -3, 21, 74, -188, -29, 43, -87, -163, -22, 190, -79, -212, -75, -156, 146, -184, -155, -202, 73, 80, -30, -84, -29, 25, 146, 99, 28, -95, 47, -246, 54, -61, 27, 62, -30, -93, -28, 181, -196, 112, -88, 53, 135, 170, -94, -55, 124, 7, -72, 277, -80, 24, 340, -39, -99, -27, 169, -16, 94, 57, -16, 217, -71, 183, 52, 62, 26, -78, -150, -134, 63, 2, 75, 86, -101, 175, 225, 181, 158, 32, -209, -172, -77, -87, -69, -130, -3, 302, 335, -13, -199, -7, 116, -44, -88, -185, 34, 150, 227, 340, 161, 352, 53, 39, 242, -54, -73, 225, -162, 189, 154, -32, -66, 29, 57, -304, -69, -47, 155, -254]
2529b54L11n3J43n5k05J75j58K12j96J01J58m69M19q4n5k7P7k06K79o2n9L30k14
2552A08j10j87K8K35k20K35l6Mj99q5J01K13n3j01M7Pj26K31j56o5K26O6k9o3
2576G1J36j36J75L1J05n71JJ79M7j66K66j57J65j53j13K28m15K05J64k4L3J73
2598B44j58P8N8j90j74K53j98R9J31j2j11J52J27l12M5l34L22j90N04p1l10nl5
2621h7n7p0K2J94j67J42QJ75m6k28K80J0j34J04j69k38K04N5m6Q2L6j1m0N5j26
2646e2m4P7L7L2qK1O4j14J24k86K73j93o6M73k84m33L87Q6k01k08K53K35k60J11
2670B4K1J76l91J34R2n6K74l54K14j4p9J05k9L4j6j05j34J90n5J08r6k35L15j52
2694b9j7P4N8J72o22M13k94N42l41J01j38J07j03J63l7l5L33n40K05P0j43K41
$$ y = [-254, 57, 4, 147, 92, -113, 62, -96, 116, -80, 21, 179, -290, 129, 45, -10, -37, 40, -166, 113, 51, -8, 322, 108, -2, -189, -161, 74, -146, 89, 53, 57, -142, -227, -126, 87, 34, -67, -20, -13, -139, 92, -64, -129, 97, 163, 134, 71, 207, 71, 246, 277, 382, -189, -188, -9, 38, -128, 138, -19, 146, -7, -120, 108, -307, -102, 62, 38, 71, 244, 86, 164, 222, 32, -142, 111, -87, 12, 143, 131, 20, 172, 299, -13, 32, -302, 20, -170, 334, 263, -47, -52, -87, -144, -214, -192, 2, -165, -23, -15, 160, 114, -114, 166, 176, 42, 146, -23, -261, -57, -2, -48, 34, 70, 59, 19, 74, -52, -96, -19, 18, 50, 42, 63, 127, 13, 137, -149, 124, -69, -135, 338, 54, -379, 8, 94, -107, -315, -62, 173, -87, 24, 45, 221, -170, -36, 56, 0, 274, -80, 134, 120, 41, 146, 117, 151, 135, 30, -104, 86, 31, 139, 43, -192, 123, -29, -46, 28, 86, 258, -364, 49, -245, 297, -44, 57, -81, 26, -77, 86, 49, 14, 347, -193, 12, 82, -61, 180]
2716A80k56L1K49k98K1j32M16p1j44J63q5O9m7l20J15L80m04J81J1q9j44R3m6
2739a27L27k55J75j75J33j15J82l84M36j69m8pn1N7k6j4m1j71K67j47K72k6p5
2762A8n1R0p7J13k95km4K00J07j53J7J44j9J6J9j06K60n84K33J25N6q7J40p0j19
2787f9O8r6J49j45k12J64K27q7l17L29j44K25j20o3J53O4j71l43L50k97M63k69
2809a41L07M4j34j51R2N7k20J87j77O1j02J44r4R6R4M2J70j14j02r8J50k40kJ35
2833DJ21j29K3K6J18k95J78j9J64j58r5K71k79K04L4l9k84kJ00K69l5k22J04k19
2857a60Q1nO4o9J50j10k2K14k12j15L9n5nN0p2K10J69l23L75O1m76L07m5J42l9
2882A54l05M2M99p26K31j74K73k1l8K40m21L03K05k61j18K62k92O2K16k99M7R0
$$ y = [180, -76, -45, 204, -94, -73, -205, 211, 140, -4, 159, 74, 143, 96, -224, -109, 271, -133, 48, 59, -30, -174, -81, -127, 200, -55, 120, -55, 78, -37, 145, -239, 197, 28, -20, -27, -78, -21, -47, -61, -102, -273, -6, -153, 119, 93, 18, -33, 57, -20, 93, -202, -204, -248, -48, 59, -94, -77, 67, 48, 64, 83, -23, 237, -347, -114, 11, 67, -20, 120, 50, -69, -1, -97, 52, -93, -305, -141, 86, -1, -318, 11, -133, 92, -28, -91, 62, 126, -45, -388, -38, -335, 128, -141, 166, 210, 76, -75, 17, 74, -146, 41, -136, -75, -177, -33, -127, -31, 63, 105, 275, 161, 59, -39, 111, -129, -131, 4, 125, -4, 19, 45, 163, -132, 46, 27, 191, 33, -62, 209, -70, 134, 168, 129, -155, -157, -57, 212, 177, -45, 59, -160, -79, -84, -20, -89, 61, -49, -71, 143, -69, -184, -145, -200, -205, -155, -227, -17, 152, -171, 204, 265, -211, 96, 51, 193, 154, -151, -109, 390, -336, -105, -279, -6, -27, -65, 175, -246, 57, 262, 1, -117, 145, -147, -85, 131, -168, -121, -31]
2904c1q1j76N44l8j76J35k18J58j92l1J6N3J06j97L0J28j03R4L9j17j59N9J01
2927e6J18M8k44L8kJ03j01j04L33j82M6m5R4Q3J56m92J48J00J32k31Q9Oj27J28
2951C8L0p8r1K15m5j74J28j65J19J12j53J68J52l21R8j35nR6P7k2p2K90l92J23
2975gk26J17J55K4R3k3n30N71k41jk4r3R9M28k95q0J05j66K08q5l9J08q3N0J21
3000A86Mj10J45l30N1O2N1k7J1n1j71JM8J17N5j10q6J69Km9K20l99K42j43K6J78
3026I2K3k33Q9L11j61j65qJ71Q3j17q9j17J68%M7N9j64j0n3K6K6r9K38k26pRK20
3053A13j09J3o4P3N1k25J64l4m7K1k15J33N5%K58j25Q3j98L84k52OP4k63K25n8
3078F3K1j25R7r1M8j4k24L27oj78R3j33K4K09j70L05j03j99j8N3J35l25N3K80
$$ y = [-31, -112, -288, 256, 218, 42, 177, -41, 117, -75, -106, -90, -37, 69, -128, -98, 30, -73, 21, 60, -57, -216, -157, -56, 62, 110, -134, -96, -98, 5, -96, -200, 133, -49, -3, -48, 46, 129, 285, -207, -59, 41, 173, -58, 31, 37, -90, 38, 68, -10, -101, 114, 69, -105, 23, -142, -23, 89, -64, 104, 256, -65, 33, -102, -107, -11, 66, 44, -28, 262, -130, -7, -233, -116, 39, 63, 156, 133, -397, 174, -67, -68, -92, -185, -86, 342, 47, -33, 72, -94, 114, 29, -10, 98, 15, 65, 186, 190, 80, 225, -105, -54, 8, 59, 32, 43, -8, -179, -178, -130, -13, 42, -68, -154, 15, 17, -32, 188, -211, 31, -112, -86, 92, 115, -118, -29, 282, 121, -44, -52, 119, 202, 85, -4, -121, 47, 47, 94, 153, -11, -21, -74, -48, -22, -121, 117, -109, -116, -107, 113, 4, 17, -47, 26, 77, -148, 16, -18, -65, -44, -259, -126, -71, -71, 187, 62, 145, -53, 331, 79, 85, 159, -104, 121, 63, 84, -41, 56, -35, 13, -1, -225, 102, 96, -82, 11, -122, -98, 111, -59, 246, 143, -56, -74, -21, 114, -211, -158, 122]
3102A22j83o9J94l0K3j19k65M55j83R3L1j75m3K26l96K86J78k17K61n93M38k62
3124b28K70R7l39J31L9q9j49R5M7k85N81J72k24l31J95n2N7j51J44L42k69j23
3146g0j47JJ87k52K53Q9k18M12j63k96k64L08L01r8P5l0L8r9r9J15k35k9J48R4
3170B1K00J05n07K21j01R4l9j09K4J86K0r3J01j76J07j94N7N8k3K7L5J2Qj88N2
3195a02N5k3l17R3J27J25l5n7P4K09M2or6q2o3L17r1j5j76K0Kp4K20k7J86j87
3221A19j72L0q2J62q3K1M7j11K3R7J46k73K26q2j17R2q6J89N0k10K33q2j19K65
3245B83l81J70k59K02J9k50K30j13qj26J85K39o0n17J82Q9J84L7m19K91L8J04
3267A20L3J30j90l44M9Q0J35p3J29J57j99o7q9J56m8R2k32P8q0J12L8P1q3K28
$$ y = [122, -61, -130, 64, 34, 57, -62, -327, 128, -55, 38, 69, -106, -149, 77, -319, -33, 145, -72, 189, -404, 34, -228, 42, 139, -200, -69, -30, -119, -268, -173, -126, -411, 170, 342, 118, -213, -18, -70, -13, -164, -20, 322, 53, -70, -217, -216, -29, -281, -28, 61, -157, 255, 92, -204, -468, -160, 141, 43, 118, 88, 126, 27, -72, 43, -192, -221, -73, 21, 221, 326, -181, 40, -61, 33, -6, -115, -91, 95, 115, 22, 123, -53, 54, -140, -83, -25, -48, -21, 14, 26, 34, -154, -102, -47, -70, -387, -294, -167, -42, -77, -134, -60, 149, 191, 185, 89, 7, -56, 261, 170, 155, -21, -1, 1, -73, 147, 120, 306, 119, -53, -23, -105, 57, -26, -5, 42, -69, -46, 51, 197, -76, 150, 68, -49, 43, -43, 146, 196, -14, 219, 137, 18, 283, -98, 72, -187, 15, 34, -216, 14, -99, -107, -233, -48, 191, 131, -386, -204, -115, 69, 106, -313, -22, 16, 120, 153, 283, 93, -251, -202, -122, 13, -60, 69, 226, 27, -40, -129, 27, -21, 71, -161, -83, -163, -51, -13, 58, -25, 203]
3291B03l0j98o7j17P4J44J06r3m03L67m1O5m1j7KJj31K10J5j56LN1Q8j64J98k53
3317a84L41j64P5r2l24K91J66R3k30J50k12K04p2pk01K99j11J04n9j47K23k28
3339h5K7R2k3J8j47K48j80O2r7J84M7j8m4M4J3k65J19p1K58j60P1r6k19K32L4
3364D4k22J60m3Q1j57J11J00j20P6r5K9J51j80k6j72M07j75M8L64l52l5j37M5
3387i8J13j53J74k03L21l58L96j08N8j34J55J52m59L23k2m6L7Lj06%j24J20j25
3410h4J98P6l39O3k07J44J71j55oRP7j28Q6L20j13k04O6J43l04J44Q9K6L1j96
3434i3K45k25O5m3J81j61qJ76j23m9j0J13j11j2j6K68m59L08p0r0L8O4J39p6j91
3459a40J78PL0p6J55j71J61j20R6j08N7P2o0k55J18K26j30p2o7J00k89J02J50
$$ y = [203, 173, -25, -92, -209, -135, 9, 115, 22, -381, -14, -55, 10, -31, -48, -46, -45, -176, 34, 49, -107, -104, -53, 35, -129, 69, -184, 157, -7, 68, -24, -348, -57, 109, 202, -28, 122, -90, 114, 42, 35, -166, 133, 22, 126, 67, -80, 143, -85, -58, 34, 11, 29, -118, 130, -50, 12, -85, 99, 146, 128, 84, 128, 141, -124, -5, -76, 182, 22, 93, -3, -222, 10, 44, -178, -18, -61, 20, -137, -26, 74, -46, 30, -65, -36, 115, -65, -91, -263, 144, -31, 17, 381, 29, -6, -143, -98, 15, -138, 36, -167, 154, -204, 192, 84, 142, 8, 163, 315, -144, 179, 157, 111, 148, 151, 45, 45, -79, 41, -84, 114, 190, -149, -86, -293, -149, 22, -133, -139, -130, -53, -181, -95, 225, 112, -92, -26, 117, -187, -43, 46, 72, 103, -93, 152, -73, -8, -51, 130, -31, -39, 137, 14, -35, -45, 68, -43, -55, -71, 197, -262, 46, -24, -114, -76, -12, 127, 51, -140, 38, 45, 75, -1, 154, -17, 144, 24, 120, 12, 69, 141, 81, -174, -56, 170, 40, -32, -99, 1, -288, -186, -36]
3482c6k07K83m40L52L9q6J08L5J9K03k47r2J07J32Ok59MO2J14l20K34J62P6l38
3506h9J40K91m93K79l68M27k53L3j09L90l13K37k42J8J13j22Q8j15j75N75k22
3527I0j04O3%j02J42m9j28j40L57j4j46J73k49K19j79K2J54Q5k22J32K4j69j3
3550e4J77j78K70j48j54k04K01K19k63K14J76l82J12J49j68k2J3r7K51l13J77
3571b4k82L42K0K2kj2k2j28J0k57M68J00k70N7J01k22K07J42o7k16m4O8j88K25
3595B8Q3o3N6k92K34J15k84K1K15j16J32P7k33l9k7K63l1j31Q7j43K43q1k32K85
3619A67j01j00O1m24L31l8J30J73l75J50L26l24J29j39j72K48o1J49j74Q1p6R9
3641F0j88KJ73r8J4n4j2j75J80p6J51Q5j30J12J23l71J24J97j48j78L60J71k52
$$ y = [-36, -243, 40, -400, -48, -9, -95, 13, 48, 67, 270, 23, -69, 38, 170, 176, -83, -79, -17, 97, -223, 11, 173, 249, -89, 51, 342, -151, 128, -240, 187, -66, -33, -142, 248, -65, 172, -70, -52, 61, -61, 27, -88, -263, 312, 90, -14, 49, 49, -53, 89, 40, -88, -228, 129, 115, -31, 142, -107, 112, -67, -45, 109, 194, -28, 104, 128, -41, -54, 123, -55, 215, 67, -87, -291, -90, 129, -134, 80, 256, -126, -14, 135, -33, -55, -42, -139, 112, -201, -24, -306, 36, 56, 78, 76, 64, 42, -86, -76, -333, 135, 235, -35, 22, 123, -99, 108, 250, 183, -33, -77, -9, -197, 28, 111, 48, 104, -188, 46, 161, -123, -102, 113, -3, 129, 206, -27, -66, -93, 170, 139, 8, 95, -48, 195, 114, -118, 167, 66, -34, 27, -397, -66, -104, 26, 199, -176, -26, 300, -24, 105, -34, -206, 42, -19, 130, -44, 37, -39, 60, -128, -126, 47, -51, -37, -91, -103, -278, -98, -174, -23, 62, -68, 44, 167, -204, -80, 117, -31, -209, 151, 322, 70]
3664G0l56N70l90N9L6Q0j43n1m0K34N8l6M7j68j10K23j17J35k26Q8J19%r7k92
3688c07L25n0J59m53L24R5j20P2n4P0r0K25l01L25k48KR9k06Q4j32M78k24j4k1
3712C8O4k02K54m42J50K21l5j18p6J66K2K11l84J78l2j06p8j2J96l51L86k67K17
3735@j52J03L3J44j34j60J25K39p0o5j58L17k2j99o2O5k8J23k90L60l43O3J39
3758B8jN1M7J1k93L28J9j10J33j5j66M6l3J3j53J89j04q3J16R6l7K56j55k05K67
3783B45k75J01J46l47j37M30l04R6J8p6q1K55k42J17M8n7Q5k0k3M5O7k00O6J27
3807H4qJ01j3j82J50P5j76j39J23K5j03Q8j53M05k23r4Qp8k6N3r8K61j31N1LR9
3833A02p8M5j80n0R9R9O2l4J26r1j74rJ86J11j83l1P3j31K17k30j46M49j68o8
$$ y = [70, -286, 284, -106, -47, -11, 69, -74, -125, -165, 69, 127, 91, 138, -30, -140, 83, -34, 101, -125, -37, 82, 82, -15, -307, 18, -32, 127, -326, -2, 93, -27, 45, -9, 61, -29, 196, -105, 220, -28, -26, 73, -133, -49, -181, 297, 73, 59, 38, 102, -100, 154, -288, -138, 83, 48, -70, -146, 20, 42, 253, -131, 47, 15, -91, -169, -181, 15, -336, 50, -217, 0, -152, -49, -16, 128, -6, -166, -41, 198, 128, 63, -95, 222, 200, 1, -61, 4, -24, 99, -191, 169, -174, -111, 28, 27, 78, 125, 136, -157, 171, 190, 80, 213, 198, 32, 78, 45, 58, -95, 94, -10, -93, 23, 119, 82, 338, 183, -22, 245, -30, 71, 217, -130, -267, 163, -141, -45, -27, -103, -184, 71, -171, -54, -6, -63, 22, 2, -21, 24, 91, -109, -43, 84, 76, 177, 164, -18, 132, 207, 31, -108, 15, 40, -63, 25, -128, 277, 54, -40, -32, -110, -136, -83, -181, 80, -51, 0, 3, 102, 24, 69, -111, -161, -62, 37, 99, 65, 191, 100, -74, -83, 103, 214, 31, 0, 73, -58, 159, -71, -217, 232, 64, -4]
3857dj3l73N07k51L4l4J97j00M4R6m1j5k53J33J70j2n4n0J9m1j27K08n1Mk5L39
3883C07m61L57o6l4J13j64j79k48K79P2J06K14j48l87N1J75K4p3n1K7J12j83J01
3906e6o2l0JJ73l8K77l58j2P6j72K96k65L0J93Q2j36j72K48l05L99l30K34N2p7
3930D8J10o6roj71k21L19q1m6J18j1j73L2J94pl5n8j22J88M2j93M2J32j45LK29
3956A13j80J93j58J04Oj49jM7j86O2L20n08M53n0l03M72l79M1J25k33J12K13K
3979A16j94o8P4P8p6J56p8J17k78J90J09m9P6r2q0J81k15L9K06m00J68O4m73N63
4003A34l9k52K84k66K06j39K09k7l2j59P9J23M6k55o7L12k41r4K07J55k58k44
4025c18J42K24m5j12m0J72mk2n9L66l78L40k40K0n3l5l4J52R4k37J59oj27J9j2
$$ y = [-4, -17, -390, 117, -134, -100, -134, 63, -37, 7, 103, 62, 47, -206, -73, 97, 85, 31, -19, 0, -41, -168, 40, -11, -7, -32, 307, -154, 203, 137, 103, 216, 52, -127, -375, -96, -24, 82, 296, 148, -239, -188, -13, 11, -62, -113, -86, 26, -157, -56, -118, -148, -147, 26, -12, 265, -93, -105, -29, -201, 95, -170, -140, 53, 135, -1, -173, 75, -230, 169, -161, 73, 125, 48, 158, 92, 83, 77, -94, -315, 4, -77, -123, -5, -16, -189, -157, 37, 30, -5, -63, -185, 3, 45, -148, -106, 26, -119, -116, 113, -67, 126, -32, 72, 78, -71, -72, -25, -211, -149, 171, -337, 116, 66, -237, 235, -144, -103, 22, -211, -99, 114, 116, -78, -146, -72, 6, -70, 86, 8, 125, -153, 37, 146, 97, 173, 81, 1, 182, -33, 6, 212, -188, -20, 44, -429, 134, 95, -157, 127, -139, 67, -72, 137, 110, 78, -81, -2, 121, 167, -88, -155, 157, -84, -178, 29, 184, -74, -318, -176, 48, 3, -109, -149, 23, 19, -3, -62, 304, -74, 266, 26, 46, -7, -42, -76, 76, 170, -67, 92, 86, -41, -22, -34]
4050c4N5k28M25n6k22K26oN9m10p4L53K94m00Q7r0J71o0j43j28J97J04j0o6R9
4074A43l9O3k75L63q7j83J56l72N15l24R6J85O6k37Nq8J33j07O3j81M48j73n5
4097A15j50j21J94J67k60J85L7k15o4K69l15K97k29K63o7q4P8lJ41l63L96m01
4119a30K21m05K73j2J10M9j13K0k64R3J69J42l7Jj12R3J51j16j02q4J79j0k17
4142a01M8J94j22j3m7R6L8k87K89j3l6q0p5M6J83P6j75j31J47r4Q5K0p1N4r3J19
4168E7Qk56K99on5p1J96l49K43K5O6o1j23L9K33M8k24O3J5j22k05J21l0J08j90
4193a71K34k32J20n2O5J82j38l35J85J20p5J89j90K42p3j93L90m35M00l31K22
4214A24n06M96m5J83J7j7k32j70K44p6L23j76l25J94j08J94k12K66j26j38l7J34
$$ y = [-34, 21, -207, 218, 162, -60, 166, 160, 219, -191, -265, 88, 382, -18, 69, -21, 150, 90, -53, -181, 16, 120, 110, 44, 143, 104, 167, -108, 255, 168, -15, 141, -231, 284, -40, 56, 241, 307, 70, 75, -13, 120, 13, 76, -105, 343, 170, 115, -35, -156, 38, 205, -55, 130, 167, -48, -112, 157, -158, 139, -90, 173, 106, 22, 100, 97, 238, -125, 271, -130, 91, -314, -41, -53, 57, 106, -7, 13, -251, -158, 11, 153, 116, 117, 5, 98, 249, 133, 31, -53, 126, 116, -101, -53, 141, 19, 6, -41, 55, 93, -194, 95, 82, 46, -34, -109, -63, 120, 196, 21, -110, 37, -57, 28, 48, -23, 31, -62, 57, 65, -191, 108, 102, 47, -24, 172, -177, 66, 91, 157, 96, -27, 12, 245, 293, 69, 132, 147, 25, -180, -59, -89, 19, -171, 63, -169, -49, -101, -36, 146, 8, -327, -142, -22, -97, 92, -98, 144, 71, -122, 268, -167, 233, -98, 124, -382, 114, 69, 252, 269, 252, 20, -150, 94, 18, 341, 165, -160, 34, -74, 120, -92, 174, 48, -90, -127, 7]
4236GJ49j47J29k36K08M1j5m68L44j35L32k70r1J5O9J56l03R7J64J15j47l2n1
4259f9Q6j81M23m94J93p2M09l73p5L03j19k15j22K88O3O9k04o9K20k39J48j44
4281a74J26P6o0J3P4k56J40J30l6k06J67o0j49K99l10J99K11m96L32J84j52pk9
4304A6j17J44qn5L4j19o3Q1K5R5j71L49o8j64N4j79j4M88q7k84rJ93k17K08p7
4329E5n9J3k35J39O7L8N6m5k01K63k66J14M31l35j96M24n89M15k19P4k33M90l02
4352a01J63J36m6l19K32K4J52k8jl0j14j33r3J54n6K00j64L1m4l06M03K1k8o2
4376io3J40j98J57J43N0l49OO2p3J65K58l98J89q1N3j96L30J54l90j6k7R9o5K
4401e7K07q8j69K41k20j39J93J70o1j2r7kJ88j19j92K42n2K75k24n4L34n48J31
$$ y = [7, 156, 9, 138, -98, 110, 151, 136, -332, 12, -123, 209, -61, -152, -137, -68, 88, -215, -118, 46, 161, 14, -18, -69, 17, -164, 259, -235, -42, -114, 295, -78, -153, 150, 31, -184, -306, -18, 45, 114, -90, -159, 61, -178, -30, -174, -48, 28, -32, -19, 55, -201, -61, 69, 33, -173, -6, -66, -215, 84, -226, -27, 184, -312, 20, 204, 52, 45, 16, -101, 43, 35, -20, 14, -105, -168, -87, -62, 33, -138, 211, 143, -21, 33, -146, -160, 328, 241, -43, -52, 141, -76, 132, 55, -4, 9, -226, -87, -20, 18, 74, 29, -172, 91, -175, -61, 370, 35, -161, 263, -326, 89, -130, -56, -289, 201, -101, 62, 198, 152, -167, 65, 89, 241, 213, 212, 182, 68, -65, -158, -4, -60, 140, -24, 7, -37, -343, 60, 81, 53, -9, -72, 68, -130, 27, 170, 220, -129, -123, -61, -134, 31, 289, -109, 80, -1, 52, -144, 186, 340, -50, -66, -93, 6, -59, -57, 150, 62, -107, 134, -86, -225, -32, 138, 77, 65, -32, -34, 154, 35, -157, 85, 33, 308, 84, 30, 364, -184, -53]
4424e3P9o9NJ03o5j32K59o0k53Q0j14K87k10L9J6J84N3K5j51k40L39k43K25j15
4448a1j86J67k7l9P8K7J8M7m0l7M2K38m02K57j37M3m4J12K8j70L3k2j49L30p8
4473G8j92r8L7L04j71J17j3j3j53L7J80j00%PQ8o9j33J39m6J50k16K01l03J33
4497c6l7J5K19l34K20K26l77J96J72r6j71K39j31j74JK74l1l81J77L09m7l09N6
4520b0K44k82j4J59k33L42m27O9R1k7n3P7R5j31K10Kk04Q7k21K02pK97m07K70
4544A19q9m2J84M7m08P1lJ73j27M14m83M39m22K9J61l31Q9P7L97m31N9l9Q0K06
4568A70k95M19k93J05l24L18l2j30Lj18J47j17K49l0j1O0l47P3k31K01N7J10J06
4591I0J68l64R8O7J49m24N17k96J55j37m5mJ07Q7j85K35n16K96O6m4o5J72j4q1
$$ y = [-53, 26, -43, -38, 65, 0, -132, 127, 67, -186, -106, -220, 67, -143, -104, -88, 96, 149, 174, 23, -217, 122, -121, 104, -11, -197, -30, -57, -96, -18, 9, 27, 74, 34, -3, 39, 277, -125, 132, -5, 38, -6, 106, 134, -36, -3, -25, -174, 156, 78, -114, -212, -175, 129, -42, 75, 62, 49, -104, -67, 113, 13, 13, 20, 108, 39, -94, 45, -1, 149, -67, 134, -169, -36, -73, -58, 161, -173, 47, 273, -104, 92, 264, 168, -3, 236, 105, -69, -68, 206, 175, -206, -29, 280, 233, -76, -20, 224, -58, -72, 87, -146, 196, -231, -162, -71, -98, -151, -74, 21, -110, 100, 102, -102, -15, -236, -34, -41, 256, -151, 119, 30, -12, 172, 219, -189, -118, -121, 52, -75, 339, -144, 295, -127, -98, 63, -268, -179, -102, 295, -136, -77, -116, -36, 170, -125, 294, 1, 106, -218, 100, 68, -62, -59, -177, -30, -147, 102, 72, 61, 121, -226, -153, -384, -183, -126, -16, 90, 258, -106, -8, 59, 208, -216, 301, 5, 160, 23, -22, -26, 81, 168, -17, 218, -298, -2, 64, 20, -45, 127, 113, 32]
4615C2J37j63K17k29j29K26J9r4qj01m9L89J54m06J01j73p3N2K56m59K75K44j39
4638G9J1n8R1k46k5O3LJ93J14j60l98L28J6k9K0n3k6N2O5n7J22k99r0L60j22L4
4664a2j41K30j90J97J8l36L83k5p6J08j46L24l03P0j27O9P2Q4q2l41L28j52L5
4687a3J73Ll12M01j04m7J0k32M4J16op4L38l45p2J06j75J20N8P2P3j55J51k61
4711a31O0J6l5O0j51L66j33j18L75l37J47J68r5l01P0J65l65K06J29k08L9P6K8
4734C1K8q7%O0J07l55n3L67n6L3j28K88k25j9R0J03l71M2R9o2J30j99O8k99M99
4759I1l84L46n1K8k18K95RJ30r5k66K92l05j17J41K71p0pJ14j04m5l2J36j18R0
4783A31j13nP1j77K05j22j12J89P2j93M2N4m3pj3Q6K6j48l27L40J7K6k09N00l42
$$ y = [32, 169, 6, 223, -6, -135, 91, 110, 16, 8, -93, -142, 247, 401, -5, 96, -77, -150, -98, 158, -301, -26, 218, 79, 90, 32, 123, -123, -148, -85, -82, 111, 225, 65, -333, -5, 11, -18, 2, -51, -77, -25, 40, -17, 105, -194, -284, 76, -46, -12, -153, 77, -113, 84, 102, -234, 149, 124, 48, 156, 10, 334, 31, 101, -26, 43, 115, 199, 117, -224, 104, -48, -13, 160, 163, -149, 252, 148, 101, 111, -121, -77, 39, 33, -41, 297, -48, -120, -14, -189, -69, -11, 61, 134, -21, 130, -131, -71, -55, -90, -30, -181, 185, 52, -66, 309, -28, 119, 287, 192, -109, -39, 126, -239, -33, 96, -112, -73, 3, 31, 59, -28, -28, 32, 139, -216, -269, 98, 42, 75, -53, 235, 10, -9, 81, 184, -187, -145, -46, -108, 22, -177, -109, -408, 91, -293, 53, 2, 30, -188, 107, 116, 246, 151, -115, 177, -128, -245, -104, 167, 97, 90, 204, 100, 55, 23, 159, 41, 131, 18, 13, 84, -93, 112, -10, -122, 67, 139, -54, -12, 42, -1, -8, -21, 65, 91, -57, -384, -44, -27, -1, -210, 290, -52]
4808e2O5m3nP7L42n04rM47m23M6J3r2O0K88k67J14Q8l16J24l28L09k8J76l01N9
4833a60L18l04K95k02oJ99l09R5j7L3K13m9k84O7l1Q4j32K22j40K4P3k2j01J49
4857A5P5N2j2R2l64J71M3L9J43l3j66k67l3k5M57k44j01K90k42j33M81k19j53
4880a34l8J34j44P9K22M8j80Q4j52j8O4O8J45p5j56JL4N1M6m7J14j93p5M1j16
4905a97L13o7J77m23K52j11J37K7k63J30j55J13K51k62O2k7L9R5k46M96l09P1
4927A03j18j84J92MN4n6M9J28j63Q3LL4k61K50om0j27k2K28k18K03o7k43m0J41
4952g3OJ79k63K85j81j10L2j7j31J97J71k61L6M4L13j51r1q9J57j47O3J30j33
4975c4J27k47J91j88MJ31J97j99l5m9Q1J23K01o31N96j04q7m7k98N43k92L09j60
$$ y = [-52, 13, -30, -35, 42, 384, -120, -129, 318, -105, -59, -46, -138, -78, 210, -57, 57, 145, -171, -47, -375, -66, -94, 82, -219, -160, 158, -146, 149, -53, -59, 140, -169, -74, -91, -58, 155, 106, -178, -111, -142, -58, -190, 32, -108, -84, -11, -33, -134, 15, 90, 142, 130, 222, -142, 29, 72, 111, 254, 221, 55, -212, -245, -270, 187, -57, -158, 132, -110, -243, 238, 19, -134, -172, -38, -182, -103, 119, 167, -13, 71, -81, -99, -35, 33, 178, 103, -53, -52, -18, 33, 79, 32, 146, -47, -122, -81, -197, 116, 49, 226, -197, 55, -56, 81, 108, -155, -25, -180, -67, 184, -78, -16, -43, -4, 91, -155, 341, 32, 103, -15, -199, -7, -3, 51, -5, 44, 172, 9, 92, 95, 129, -132, 118, 112, 72, -55, -77, 151, -67, 136, 69, -174, -214, -73, -67, 112, -151, 134, -47, -157, -125, -142, -273, -76, 95, -166, -130, -86, 227, 76, -15, -104, 53, -94, -31, 99, -34, 93, -154, 37, -151, -147, -16, 181, -18, -53, -102, -21, 102, 303, -328, 268, 164, 77, 30, -268, 275, -17, 292, 132]
4998A32j27k31J03Q5O2o0p0L80m70j10J56J51J2j66m4J53j87L18k2j03J41J09
5020B12j01j17j38K89k16Q4K24l87K57n3j16j5qj17Q2J52L5K4q0j83JpK06J3j49
5045a08l1J20j09PQ4L04k51j01J13j10K07j44k7Q7nj8j93K60o7M5l8j69K43J11
5069B10j05k25K16MJ72l03k3o2O4j36K43j15J64j76K2P0O6J37m06K1p6M49l4m7
5093A30k76J33K7p4K62k55K2J49K05k53p5j48J38J06k8p6k0J88J1R9j32k98O3
5116a02q8L95k46M3j56NJ44L6p7L51l82q5L59l51J37j02J99N7k07j32K15K22j22
5139A13j09R2k30Q2j37J63j87L07J0J14r1j79J52N3j31q4J30q3m4j53K94q0J31
5162A33j42O4k2K44k49M8qm3J86p2k68K98k71Q5p7J95k97M55n28L43L3p9l7jJ14
$$ y = [132, 5, -226, -123, -38, 24, -36, -106, 274, -196, -306, -150, 1, 13, -153, -197, -44, -231, 87, 65, -38, 103, 212, 111, -6, -144, 145, -71, 13, 237, -150, 107, 54, -62, -77, -85, -202, -120, 32, 67, 91, 11, -172, -171, -178, 28, 41, -108, -139, -19, -128, -121, -37, 267, 16, -85, 28, -82, 125, -19, -46, 41, 36, 18, -175, 85, 18, 63, 25, -144, 99, 210, 105, -120, 96, 100, 272, -31, -54, -116, -52, -188, 55, -60, 104, -72, -50, 20, 86, 223, -183, -162, -238, 211, 177, 130, -146, -13, 14, -60, 202, -53, -31, 118, 323, 70, -5, -153, -15, 91, 63, -13, -33, 155, 166, 265, 133, -165, -102, -190, 205, -41, 2, -154, -149, -5, 31, -46, 305, -77, -162, 197, -154, -17, -119, 80, 137, -70, -202, 13, 235, 113, 4, 96, -134, -52, -189, -26, -213, 94, 104, 218, 127, -52, 100, 153, 22, -62, 68, -15, -59, -212, 82, 2, 133, -9, 55, 33, 277, 28, 76, 68, 25, 211, 139, -129, 169, -102, -17, -94, 101, -196, 259, -269, 74, 107, 28, -9, -10, 104]
5187A04l84L78p0o0j76K59o3J76k70J15O7P0k90j63L77q9O1j32k16L26Q8j86J97
5210A19k14Q3k4r4M53m57J52k67K56Q9o1J9J12l17K9K58m2n0L9l0k94J48L25q2
5234A50j50j07N6j08J07J74M7l13J97L2j70L6J04j0m00J98QK35j34j41L27q1k07
5257a50Kj2J12Mn0J83j66j87M56m05J53K18l5l2r6N7k80J76RL18m9k54K18j25
5281F5L2K3pl0P4j08k99J42Q3P0j91J28j22K24j40r6K21l03K82K33j07j02p4J50
5305A48m87K65q9J76R2k72K1L19k91K36m0O0k05P2P8p3l9p8J24j00L13j87p9J25
5329H9n2j43J50K6j02N5k11J00L1J41k14J24L43l46O9K35k22k82J70P8j48L72
5351B63k97q8M76l87M1M2j32L57n00K36j4J32k86J72J5k7J16L5m7R3k60J52K2
$$ y = [104, -280, 98, 28, -32, -208, 51, -12, 164, -106, 9, 76, 146, -144, -307, 70, -19, 42, -90, -306, 20, 108, -78, 119, -95, -12, -36, -130, 323, -134, 18, -249, 7, 96, 35, 54, 166, -151, -122, 136, 94, 44, 83, 53, -241, -93, 232, 150, 0, -107, -51, -159, -52, 122, 169, -144, 53, 85, -85, -49, 55, 45, -355, -157, -149, 86, -48, -189, 138, 57, -150, -148, -160, -48, -44, -94, 89, -77, -264, 192, -213, -60, 158, 123, 91, -5, 52, -228, -52, -43, 275, 226, -28, 190, 65, 97, 120, 113, 83, 157, 49, -250, -108, -25, 45, -146, -18, -140, 84, -56, -152, 69, -234, 48, 281, 174, 72, -2, 148, -339, -74, -163, 13, 105, -167, -146, 173, -118, 118, 78, 138, -67, 5, 83, 10, -29, -107, 17, -83, 230, 43, -36, 89, 37, -106, 44, 70, -32, 23, -188, -88, -57, 84, -130, -6, 337, -9, 60, 295, 73, -209, -39, 39, -109, 263, -34, -122, 354, -33, 8, 50, -82, 275, -225, 11, -3, 129, -157, 15, 30, 3, 119, 154, 107, 200, -60, 92, 114]
5374A14l9M7j80J35J0j34m7k58K48J90j74j38K31l7l3J96Jl3j3j58k40L51RO1
5398A09l87J77nN1M9NK86k92K64l29P4R9Oo0j57K3J54j64k07L47j57j89L50j84
5422a37K06J04l74M23j14n5Pq2K26k74J28k99M76q2j07n6j50l5M14k88P5q3J58
5445H1j83J23m8k2L9r7r0L35K31l29j79j45K82p7K82l24J22j11L08j86J14j53
5467b7j82J48M8j65J43jK13j42j06J95j34P4QJ53m32K15l0M3j76K63o1k56O6L14
5491A71k46n0J34K9j7j43Q0k76L43k6J35k31J99k78J62K20j55Q1j33J18j95J2
5513f6J04J9j80j53K84m5N6OK67j84J31o8m45L70j77J24r7n6L9K1j05J19L20p9
5537B05k91kP4J66k86J92j50j3N8p5J8J38N2j70R3J33k20J03K5J8j21J88j59j58
$$ y = [114, 75, 122, -58, 77, 87, -47, -94, -352, -104, 86, -88, -226, 5, -32, -65, 131, 132, 99, 86, -72, -312, 39, 48, 109, -278, -101, -106, -55, -6, -1, 285, -7, 257, -72, 2, 101, 107, 47, -110, -87, 67, -97, -304, 43, -114, -303, 47, -137, 69, 173, -201, 222, 108, 53, 60, -22, 204, -70, 58, -241, 235, 153, 46, -10, -160, -195, 219, -69, 6, -77, 81, -102, 21, -27, -49, -10, -107, -197, 138, 369, 40, -139, -284, -2, -79, 203, -121, 1, -110, 198, 12, 126, -27, -209, -61, -13, -178, -35, -36, 177, 35, -71, 124, -10, 64, 72, 225, -207, 8, -22, 21, -155, 108, 47, -209, -143, 171, -75, -125, 9, 38, 21, -122, -42, -318, 25, -1, 134, -97, 102, -176, -14, 206, 51, 132, -1, 117, -78, -66, 38, 57, -123, -276, 8, -37, 19, 25, 292, 108, 239, 171, -274, 96, -81, 43, -54, -110, -71, -50, -155, -36, 284, 205, -86, -88, -14, 152, -134, 58, -92, -105, -47, -122, -104, 34, 86, -84, 9, 142, -78, 25, 50, 68, -53, 135, -24, -182]
5561a82J32J20j53L4nJ27P0l00K84Q2k50J1J8l02M33j38K8l74L21RJ35J55l13
5584e8kN3l9J8kjK75k91K97k58P4O7Q3k56k3J05J7j21mrJ16Ro1j50K42L2k38p9
5612b04J65J48r0OJ25j24l17K92j4J81j89J56m01j33K29P3J74l37J68K07j2q9
5634A4l2j06L83k63L0J49j96K71k80J36n7p1N3O6r0j64P6L5O8K84m48K34J89o4
5658B17l53p4jK10j90J59M3J43q7l5R3j43q0K87k46K07O0j75j19K21r4j92L44
5681A95m20J91j63N7K38j54n6p1j5Q1K36q8n8J22J41j46l26L23n9J72n8k55r4
5704b07J31K1J65k80L60j04pN5N9j90P5N1j12j08Q7J88j38J99l95J12l7n6p3J32
5728g2k47J70K84m9L28m77o5O3j25J43J85j59m0J53m02L81N3j2J85j08k45j03
$$ y = [-182, -50, 70, -83, -49, -54, 73, 143, -157, 127, 209, -41, -30, -12, -314, 119, -19, 9, -365, -44, -35, 100, 255, -58, -60, -7, -46, -28, -30, -31, 244, -47, 250, -8, 66, 133, 216, -40, -63, 42, 59, -62, -66, -75, 41, 50, -11, -161, 81, 113, -125, -204, -39, 109, 19, 25, 150, 26, -291, 1, -13, 168, -21, 135, -266, -399, -170, -97, 77, -260, -92, 115, 103, 14, -18, -124, 259, -4, 26, 175, -21, 250, -30, 106, 49, -22, 31, 97, 7, -157, -81, -46, 22, 306, -142, 92, 281, 217, -136, -210, -211, -1, -191, -32, 11, 154, 67, 32, 125, -18, -98, 189, -57, 150, 210, 35, -84, 137, 43, -149, 195, -225, -34, -197, -140, 98, -56, -112, -183, -198, -117, 119, 31, -27, 95, 236, 90, -236, 87, 28, 200, 142, -113, -207, -76, -55, 110, -170, 190, 86, 79, 134, 193, 3, 78, 129, 17, -91, -4, 184, 46, 245, -150, -38, -75, -131, -204, -72, -319, -149, 135, 86, 414, -63, -128, -65, -190, -47, 138, -21, -61, 92, -310, 71, 124, 112, 297, 189, -56, -159]
5750a59o7J94l5j2J06j54M6j48J22K65k17k94J86L24n0k8j31J08Ll27K18J41k10
5773a19K46Jj73L8P5Kj43j96M29k99j91K88J72j7r4J66k85J15J71o4l00L30K0
5796A72n0k16j18K02k04K94L06m00n6Q7j4J84l88O9J70J39j07K05j64k5j31J71
5818A26j19Oj60J13N7K9j57J52J7j87J73j31J34o0J0j41P8m0o7K81lk56j6R0J37
5843F6L5r2k43o9L60j20J15J0l54K31R3k9N4l42K58o1J62j68k1K91k20J32j74
5866h6J80k7k9K46l73N5j31L97l84K51j0j16l1q3L18l38K10P5j64k09L28l33J83
5889g1k2L34l37K78k49M4l08L15k59J58J11j38K15J33m50J25K01j81J90lj23j87
5911b24J29K70l16K91k47J36o4K35j19j33r2K16n4j11M3k3j0k5j9K77k39kO4R0
$$ y = [-159, -226, -32, -67, -79, 27, -127, -81, -229, -107, 158, -59, -353, -167, 157, 107, 79, -52, 56, 59, -268, -50, 91, -119, 127, 128, -45, -7, 68, 70, -73, -269, 160, -139, -330, -42, 130, 113, 19, 185, -100, 15, 186, 122, -178, 152, 172, 122, -94, -212, -10, -214, 80, 386, -14, -70, 17, 3, 187, -201, -132, 38, 177, 70, 275, 111, 86, -45, 126, 7, 13, -147, -34, 23, 52, -105, 47, 64, -123, 50, -81, 53, -7, 3, -138, -60, -100, -167, 114, 111, -145, -161, -71, 66, 101, 9, -234, -303, 57, -63, 52, 62, -292, -61, 32, 3, 57, -285, -27, -88, 74, -94, -115, 176, -44, 88, -86, 94, 67, 38, 284, -89, -34, -165, 232, -152, 99, 89, -27, -58, -141, 177, -161, 49, 124, -40, -249, 79, -254, -71, -93, 241, -96, 182, -67, -23, -331, -16, -275, -117, -6, -144, 71, 204, -246, -121, 80, -101, 89, 86, -37, -224, -95, 175, -141, 150, -97, 39, -25, 210, 91, -42, -134, 82, 28, -83, -40, -63, -73, -98, -117, 160, -79, -81, -17, 73]
5935G3J38k75m5J36J49k39P7R2j43n5J45k26J89O8RM26n53N5%M5N1j87p0J46J67
5960A73k76P9Q0K1J10j26j34K28Q0k86J0Lj27L06K85n62m8q8L54k71K6R2j07L04
5984A26k15M6k7q4N1K08K9k59K20j24P4J86l45R7r1j79K81p7j65M24k41J23q4
6007b6Q6j84R0L7O5lj65q4J21K01l73M6J53j36K64P3l86L06k2j18p3kL8K04Q6
6032A98l66L29j59J48l09Jp5P7P0J15K7p4P8r2J91q5J29j80J43k41J47j64J56
6055F4j65L51k47N3m9K50j58j58J04N7M4pj01l07K07M1k13J56JK88k8j24jJ43
6079B01j61l3l9P3j94K10PQ0j28J06k69L09p1k23q2R6J13j40J75J97j59j88R7
6102b3j74J68M9J62k84K5J73q6L6O8k76L14p0M8j8j92J49q7L4j46L66j08M1l67
$$ y = [73, 211, -64, -109, 27, 176, -63, 14, 106, -37, -92, 53, -173, 16, 84, 93, 519, -34, 21, 21, 66, 117, -70, -140, 6, 173, -103, -24, 56, 77, 187, 61, -73, 155, 235, -51, -41, -38, -165, 141, 426, -136, -184, -272, 82, -189, -163, -71, -178, 126, -89, -43, -70, -154, -103, 105, 134, -125, 95, -29, 45, 231, -114, -17, -108, -287, -6, -83, -248, 176, -65, 58, -26, 60, -124, -34, 3, 68, 65, -100, -184, -63, 138, -235, -189, -36, -172, 92, 165, -221, 85, 63, -55, -128, -130, -92, 112, 198, -168, 161, 2, 150, -159, -158, -233, -156, -86, 29, 56, -18, 60, -32, 159, 74, 203, 23, 166, -75, 72, -92, 64, -101, 250, 3, 56, 7, 257, 99, -59, 45, 102, 146, 139, 38, -269, -62, -21, -234, -78, -77, 211, 183, 59, 58, 201, 40, 7, -32, 41, -153, 57, 64, 144, 16, 122, -147, 162, 91, -132, -214, -118, -5, -145, 30, 227, 68, -120, -23, -197, -29, 20, 182, -102, -77, 96, 10, 46, 114, -162, 152, 82, 130, 112, -80, 69, -18, 16, -130, 236, 128, 169, -198]
6126a98Q6m1J39j14p3K0L35J3k27j68P1M69l88J2K0l8J39j20k36K50K36k24O5
6149B8j58p6K97J32l01m7K0P6j88J93L16n03M54m09K67J43l55P8m4J24K04k62
6171a1j55j97K91PN0L1J57k78j11N9L33j76l3L5k8m1j84K88j6N8l24K28O0J81
6195B24m22L05j69J39j3j00q3j97J74J88j55J49R8k11J89l62J70K13R4l53Q7J09
6217G4j19L2K05oj50j10J69j28JO8k64K94Q3r7q1N6r0J56k9J33j51L18l22l4m6
6242c8L04m94K49r7P8j38Q1j4q0O1L54j60j53K1P3Q4K1m5n6j05J96j02J17N9k81
6267f5L7j14KJ31P2J21j99J38N0k82j39L79J0k73j97K83n1m9R5l7K79j74K01p4
6291A44k56R9j22J88P0n60N05K7j68J29J76j98p5J58j93j52K64M3m1Q6l24o5n5
$$ y = [-198, -112, -153, -14, -128, -201, -181, 154, 167, -60, -228, -157, 312, -76, -64, -44, -82, 57, -63, -299, -49, 187, -37, 28, -130, -206, 91, 223, -78, -125, -105, -29, -217, -24, 292, -211, 243, -166, 101, 244, -111, -33, -77, 47, 251, -11, -166, -363, -72, -65, -15, 16, 173, -105, -216, -157, 176, 0, -33, 2, -26, -67, -251, 37, 21, 79, -245, -17, 43, 224, -198, 107, -62, 77, 64, -36, -119, -316, -142, 46, -109, 40, 138, -73, 116, -246, -76, 137, 231, -122, -35, 74, -45, -13, 192, 186, 36, -74, 95, -33, -32, 36, -228, 66, 149, 52, -29, 27, -63, 93, 64, 197, 46, 364, 42, 8, -38, 266, -228, 21, -76, 2, -136, -55, -69, -149, -88, 266, 106, -47, -26, 47, 131, 152, 107, 51, -54, 142, 40, 157, 216, -65, -28, -142, -140, -9, 63, 184, -15, 123, 173, -109, -248, 131, 141, -132, -329, -46, -97, -146, -51, -88, 191, 17, 218, 144, -112, -13, -135, 53, 123, -437, 68, 95, -73, 56, 232, 34, -41, 117, -76, -228, 36, 79, 38, 124, -200, -265, -320]
6314c20L55o2m1J10j25L3rM2K9j50J34R4n0j23O4J3J45k99M2K81j97J90k64j16
6338b24J07m2K99k38J17L0m5j38J11J06o5Q7p4k48L14N6k3j15l39N26n54O6L91
6361A05j33m4k02M04K46j27l65M8k3j9R7k24K62Q4m8p3K33l00R3j38J35KL2rj02
6386f6L41j88p6N7Qj72q4J38p3K27k4nJp1k47K02J03k35J32j18M7N9R0k25K45
6411F6J3m7K9J97k21j42j4J73p9o4K04P6j65Pj38J24J21j34R4n9J27k86J72%m7
6436GO1o3k07lQ8K37k92NJ08J2K31k90K01m3q7jO7j46n8lj06J56J00l62M78j72
6462h2kK50k23j3N3j54jQ9rm2K13J0j50o7J31k65J91k66J33P6m8L26j33n4P5k24
6488a86J6M31r0j23J92k21O6j80j05L13k00K44l38j44L78K2q4K01l23P3J83r8
$$ y = [-320, 35, -27, -68, 42, -83, -50, -59, -17, 12, -138, -4, 90, 40, -83, -19, -6, 139, -160, -118, 163, -34, 156, -108, -224, -117, -159, 140, -98, 19, 49, 4, -134, -23, 83, 18, 105, 31, -217, 97, 153, 130, 15, -324, 202, -352, -286, 105, -28, -72, -274, 130, 376, 249, -116, -68, -91, -110, -13, -237, 25, 109, 61, -12, 221, -79, 14, -124, 11, 13, 45, 36, -66, 275, 87, 11, 68, 76, -96, -180, -42, -115, 112, 88, 83, 84, 13, -234, -32, 71, -164, -32, -150, -103, -44, 46, -179, 66, 79, 32, 61, 258, 37, -105, -119, 54, -25, -89, 115, 191, 26, 33, -105, 19, 140, 6, 100, 41, 168, -118, 54, 54, 7, 68, 5, -202, -205, -117, 120, -172, -167, -59, -47, 184, -106, 95, 52, -35, -36, 31, -115, -173, -176, -282, -126, -26, -388, 90, -82, -84, 166, -57, -70, -17, -171, -172, -83, -92, -134, 79, 89, -61, -128, 3, -262, -71, -337, -204, -128, -176, 150, 17, -37, 38, -186, -170, 261, 171, 48, 240, 19, 85, -95, -200, 113, -87, 157, -181, -325, 53, 75, -9, 192, -131, -58, 125, 27]
6510B7l15M14P6l34K44k29K82j78j36K01l1K2O4o1j68M8K90j80J97m36L14J07
$$ y = [27, -288, 126, 202, -132, 112, -117, 165, -13, -149, 52, 21, 43, 107, 46, -122, -74, 216, 36, 233, -203, 111, 218]
$$ [...]
8191B08
##END NTUPLES=NMR FID
##END=
