##TITLE=1H_DE-44_EA3_TFA
 DMSO-d6
 8 sc, 
 9.4.2024
##JCAMPDX= 6.0         $$ Bruker NMR JCAMP-DX V2.0
##DATA TYPE= NMR FID
##DATA CLASS= NTUPLES
##ORIGIN= UXNMR, Bruker Analytische Messtechnik GmbH
##OWNER= root
$$ XWIN-NMR		Version 3.5
$$ Tue Apr  9 15:31:08 2024 Russian Standard Time (UT+4h)  she@DPX200
##.OBSERVE FREQUENCY= 200.1309
##.OBSERVE NUCLEUS= ^1H
##.DELAY= (6, 6)
##.ACQUISITION MODE= SIMULTANEOUS
##.ACQUISITION SCHEME= undefined
##.AVERAGES= 8
##.DIGITISER RES= 18
##SPECTROMETER/DATA SYSTEM= spect
##.PULSE SEQUENCE= zg30
##.SOLVENT NAME= CDCl3
##.SHIFT REFERENCE= (INTERNAL, CDCl3, 0, 15.7039)
##AUDIT TRAIL= $$ (NUMBER, WHEN, WHO, WHERE, WHAT)
$$ ##TITLE= Audit trail, XWIN-NMR		Version 3.5
$$ ##JCAMPDX= 5.01
$$ ##ORIGIN= Bruker BioSpin GmbH
$$ ##OWNER= she
$$ F:/spectra/data/she/nmr/H-F/1/audita.txt
$$ ##AUDIT TRAIL=  $$ (NUMBER, WHEN, WHO, WHERE, WHAT)
(   1,<2024-04-09 15:29:47.12 +0400>,<she>,<DPX200>,
      <created by zg, POWCHK disabled, PULCHK disabled
       configuration hash MD5:
       00 E9 B6 7A A2 85 ED C7 34 08 36 98 17 FE 4E 26
       data hash MD5: 16K
       EF DF A6 C8 CF 31 95 E9 C6 32 79 D3 86 26 04 22>)
$$ ##END=
$$ 
$$ hash MD5
$$ 48 19 93 52 E7 95 2C CA 90 12 B6 09 00 E1 97 82
##$RELAX= 
##$RELAX= 
##$RELAX= 
##$RELAX= 
##$RELAX= 
##$RELAX= 
$$ Bruker specific parameters
$$ --------------------------
##$DU= <F:/spectra>
##$EXPNO= 1
##$NAME= <H-F>
##$PROCNO= 1
##$TYPE= <nmr>
##$USER= <she>
##$AMP= (0..31)
100 100 100 100 100 100 100 100 100 100 100 100 100 100 100 100 100 100 
100 100 100 100 100 100 100 100 100 100 100 100 100 100 
##$AQSEQ= 0
##$AQ_mod= 1
##$AUNM= <au_zg>
##$AUTOPOS= <>
##$BF1= 200.13
##$BF2= 200.13
##$BF3= 200.13
##$BF4= 200.13
##$BF5= 200.13
##$BF6= 200.13
##$BF7= 200.13
##$BF8= 200.13
##$BYTORDA= 1
##$CFDGTYP= 0
##$CFRGTYP= 5
##$CHEMSTR= <none>
##$CNST= (0..31)
1 1 145 1 1 1 1 1 1 1 1 1 1 1 1 1 1 1 1 1 1 1 1 1 1 1 1 1 1 1 1 1 
##$CPDPRG= <>
##$CPDPRG1= <>
##$CPDPRG2= <>
##$CPDPRG3= <>
##$CPDPRG4= <mlev>
##$CPDPRG5= <mlev>
##$CPDPRG6= <mlev>
##$CPDPRG7= <mlev>
##$CPDPRG8= <mlev>
##$CPDPRGB= <>
##$CPDPRGT= <>
##$D= (0..31)
0 1.2 0 0 0 0 0 0 0 0.06 0 0.03 0 0 0 0 0.0002 0 0 0 0 0 0 0 0 0 0 0 0 
0 0 0 
##$DATE= 1712662186
##$DBL= (0..7)
120 120 120 120 120 120 120 120 
##$DBP= (0..7)
150 150 150 150 150 150 150 150 
##$DBP07= 0
##$DBPNAM0= <>
##$DBPNAM1= <>
##$DBPNAM2= <>
##$DBPNAM3= <>
##$DBPNAM4= <>
##$DBPNAM5= <>
##$DBPNAM6= <>
##$DBPNAM7= <>
##$DBPOAL= (0..7)
0.5 0.5 0.5 0.5 0.5 0.5 0.5 0.5 
##$DBPOFFS= (0..7)
0 0 0 0 0 0 0 0 
##$DE= 6
##$DECBNUC= <off>
##$DECIM= 32
##$DECNUC= <off>
##$DECSTAT= 4
##$DIGMOD= 1
##$DIGTYP= 9
##$DL= (0..7)
0 120 120 120 120 120 120 120 
##$DP= (0..7)
150 150 150 150 150 150 150 150 
##$DP07= 0
##$DPNAME0= <>
##$DPNAME1= <>
##$DPNAME2= <>
##$DPNAME3= <>
##$DPNAME4= <>
##$DPNAME5= <>
##$DPNAME6= <>
##$DPNAME7= <>
##$DPOAL= (0..7)
0.5 0.5 0.5 0.5 0.5 0.5 0.5 0.5 
##$DPOFFS= (0..7)
0 0 0 0 0 0 0 0 
##$DQDMODE= 0
##$DR= 18
##$DS= 0
##$DSLIST= <SSSSSSSSSSSSSSS>
$$ [...]
##$SUBNAM2= <"">
##$SUBNAM3= <"">
##$SUBNAM4= <"">
##$SUBNAM5= <"">
##$SUBNAM6= <"">
##$SUBNAM7= <"">
##$SUBNAM8= <"">
##$SUBNAM9= <"">
##$SW= 18.0517689322627
##$SWIBOX= (0..15)
0 0 2 0 0 0 0 0 0 0 0 0 0 0 0 0 
##$SW_h= 3612.71676300578
##$TD= 16384
##$TD0= 1
##$TE= 0
##$TE2= 300
##$TE3= 300
##$TEG= 300
##$TL= (0..7)
0 120 120 120 120 120 120 120 
##$TP= (0..7)
150 150 150 150 150 150 150 150 
##$TP07= 0
##$TPNAME0= <>
##$TPNAME1= <>
##$TPNAME2= <>
##$TPNAME3= <>
##$TPNAME4= <>
##$TPNAME5= <>
##$TPNAME6= <>
##$TPNAME7= <>
##$TPOAL= (0..7)
0.5 0.5 0.5 0.5 0.5 0.5 0.5 0.5 
##$TPOFFS= (0..7)
0 0 0 0 0 0 0 0 
##$TUNHIN= 0
##$TUNHOUT= 0
##$TUNXOUT= 0
##$USERA1= <user>
##$USERA2= <user>
##$USERA3= <user>
##$USERA4= <user>
##$USERA5= <user>
##$V9= 5
##$VALIST= <valist>
##$VCLIST= <CCCCCCCCCCCCCCC>
##$VD= 0
##$VDLIST= <DDDDDDDDDDDDDDD>
##$VPLIST= <PPPPPPPPPPPPPPP>
##$VTLIST= <TTTTTTTTTTTTTTT>
##$WBST= 1024
##$WBSW= 4
##$XGAIN= (0..3)
0 0 0 0 
##$XL= 0
##$YL= 0
##$YMAX_a= 191363
##$YMIN_a= -118560
##$ZGOPTNS= <>
##$ZL1= 120
##$ZL2= 120
##$ZL3= 120
##$ZL4= 120
##$ABSF1= 10
##$ABSF2= 0
##$ABSG= 5
##$ABSL= 3
##$ALPHA= 0
##$AQORDER= 0
##$ASSFAC= 0
##$ASSFACI= 0
##$ASSFACX= 0
##$ASSWID= 0
##$AUNMP= <proc_1d>
##$AZFE= 0.1
##$AZFW= 0.1
##$BCFW= 1
##$BC_mod= 2
##$BYTORDP= 1
##$COROFFS= 0
##$CY= 11.3945322036743
##$DATMOD= 1
##$DC= 2
##$DFILT= <>
##$DTYPP= 0
##$F1P= 15.6554695791079
##$F2P= 12.8336369535428
##$FCOR= 0.5
##$FTSIZE= 0
##$FT_mod= 4
##$GAMMA= 1
##$GB= 0.15
##$INTBC= 1
##$INTSCL= 1
##$ISEN= 128
##$LB= 0.24
##$LEV0= 0
##$LPBIN= 0
##$MAXI= 10000
##$MC2= 0
##$MEAN= 0
##$ME_mod= 0
##$MI= 1.114404
##$NCOEF= 0
##$NC_proc= 0
##$NLEV= 6
##$NOISF1= 3.799351
##$NOISF2= 2.8
##$NSP= 1
##$NTH_PI= 0
##$NZP= 0
##$OFFSET= 15.70392
##$PC= 1
##$PHC0= -25303.12
##$PHC1= 13.98731
##$PH_mod= 1
##$PKNL= yes
##$PPARMOD= 0
##$PSCAL= 0
##$PSIGN= 0
##$REVERSE= no
##$SF= 200.130013532006
##$SI= 16384
##$SIGF1= 3
##$SIGF2= 2
##$SINO= 400
##$SIOLD= 16384
##$SREGLST= <1H.CDCl3>
##$SSB= 0
##$STSI= 0
##$STSR= 0
##$SW_p= 3612.71676300578
##$SYMM= 0
##$S_DEV= 0
##$TDeff= 0
##$TDoff= 0
##$TI= <>
##$TILT= no
##$TM1= 0
##$TM2= 0
##$TOPLEV= 0
##$USERP1= <user>
##$USERP2= <user>
##$USERP3= <user>
##$USERP4= <user>
##$USERP5= <user>
##$WDW= 1
##$XDIM= 8192
##$YMAX_p= 0
##$YMIN_p= 0
$$ End of Bruker specific parameters
$$ ---------------------------------
##NTUPLES= NMR FID
##VAR_NAME=  TIME,          FID/REAL,        FID/IMAG
##SYMBOL=    X,             R,               I
##VAR_TYPE=  INDEPENDENT,   DEPENDENT,       DEPENDENT
##VAR_FORM=  AFFN,          ASDF,            ASDF
##VAR_DIM=   8192,          8192,            8192
##UNITS=     SECONDS,       ARBITRARY UNITS, ARBITRARY UNITS
##FACTOR=    0.0002768,     1,               1
##FIRST=     0,             0,               0
##LAST=      2.2672688,     0,               0
##MIN=       0,             -118560,         0
##MAX=       2.2672688,     191363,          0
$$ Real data points
##PAGE= N=1
##DATA TABLE= (X++(R..R)), XYDATA
$$ [...]
1819b44K00L9j63K48j30J58P7m21m2M9K29K53k68q3J01K6J87r7Ql61J56J10l7
$$ -244 -44 -5 -168 80 -50 108 185 -236 -278 -229 0 253 -15 -98 3 29 216 119 127 -234 -78 32 -5
1842er7K25l58Q7J11J80n6N9j61k6n7J37P9o1j86K91j86K62j43r5J81k77K01j22
$$ -5 -102 123 -235 -148 -37 143 87 146 -15 -41 -98 39 118 57 -129 162 -24 238 95 0 181 -96 105 -17
1866a7j84N41r4m40O8J48o4J09k00j36K53J82j83N1j54j68M51k55J22k13J88l14
$$ -17 -201 340 246 -194 -126 22 -42 67 -133 -269 -16 166 -17 34 -120 -288 163 -92 30 -183 5 -309
1888c09L26qj64L03k19r8Q4J18N6r6j33m1K02K7k73N25k96j2N8K62j33o3l25O9
$$ -309 17 9 -155 148 -71 -169 -85 33 89 -7 -140 -181 21 48 -225 300 4 -8 50 312 179 116 -209 -140
1912a40L7K20j47k10K69nJ72j58k07M0J58j31Kj19K73l41J93l5J46j89K54k10
$$ -140 -103 117 -30 -240 29 24 196 38 -169 -129 29 -102 -100 -219 54 -287 -94 -129 17 -172 82 -128
1934a28J61j58R4K60R7j43j18Q5l29L01j36j45q7K70p9m6P0J38K4k92N5J48o8
$$ -128 33 -125 -31 229 326 183 65 150 -179 122 -14 -159 -246 24 -55 -101 -31 107 131 -161 -106 42 -26
1957b6j63L92k31p1J98l3J08j18J06j67J68pj84K35k31j80N6o1K33j46M3k2J32
$$ -26 -189 203 -28 -99 99 66 174 56 162 -5 163 156 -28 207 -24 -204 -148 -209 24 -122 -79 -101 31
1980C1q2O0j20L20k77L3K40l40P5O5O8N6l5j24K13j57j94L8j53M24j8j25J20j71
$$ 31 -51 9 -111 209 -68 -35 205 -135 -60 5 73 129 94 -30 183 26 -168 -130 -283 141 123 -2 118 -53
2004e3K9q4J57J3j7R6k28K65j41o8r0j24J3L65k59L52l52J32O6q0J34j09M1k22
$$ -53 -24 -108 49 62 45 141 -87 178 37 -31 -121 -245 -232 133 -126 226 -126 6 72 -8 126 17 58 -164
2028a64Q0J09j82k20j49M84o5J98k39K1j39L77j41j20J88J20K56r2l49j81K2L46
$$ -164 -84 25 -157 -377 -526 -42 -107 91 -148 -127 -266 111 -30 -150 38 158 414 322 -27 -208 -186 160
2050A60M9j80J70k52Q5J95k4j64l81K33j59R0K37k44J16j17L97k53J54j32nj80
$$ 160 209 29 199 -53 32 227 203 39 -342 -109 -268 -178 59 -185 -69 -186 211 -42 112 -20 -25 -205
2072b05J65KN3j7K71K9k50pQ3m9k8j17l57L37k19M29k28K9m8J67O6j23j01J3J27
$$ -205 -40 -38 15 -2 269 298 48 41 124 75 47 -70 -427 -90 -309 120 -108 -79 -127 40 106 -17 -118 -105 22
2097B2m33K95rj71J56J62Q9j38j56J22J0P5j09J12j38m7K09Q1o4Q8M2J7l91J36
$$ 22 -411 -116 -125 -296 -140 22 111 -27 -183 -61 -51 24 -85 27 -111 -158 51 132 68 156 198 215 -176 -40
2121d0p2J42J97j24j65K50j58L2j23K41k99J61m7J23k4p6J9J59j80J44j58M4k9
$$ -40 -112 30 227 103 -62 188 30 62 -61 180 -119 42 -5 118 94 18 37 196 16 160 2 46 17
2144A7JL46k69p9K08j8%m60K03J44k62k08L75n8k6K43J9j51r7J18m0m0Q9j90J99
$$ 17 18 364 95 16 224 206 206 -254 -51 93 -169 -377 -2 -60 -86 157 176 25 -72 46 6 -34 55 -135 64
2169F4j80K37l17K34J64l46K70r1J37j06J0k38K23j62L5l4K65J3l50K02n3n8J60
$$ 64 -116 121 -196 38 202 -144 126 35 172 66 76 -162 61 -101 -66 -100 165 178 -172 30 -23 -81 79
2192G9k47K12j14jP9k01N4M6k8L38k57J85M6j15L7M8k83J12J98l59J03K12j12
$$ 79 -168 44 -70 -71 8 -193 -139 -93 -121 217 -40 145 191 76 113 161 -122 -10 188 -171 -68 144 32
2215C2J66k17n2J78k89K10k70L12k61Q5J80k10r2M11l91M06k50kj25J09P7p2L66
$$ 32 198 -19 -71 107 -182 28 -242 70 -191 -106 74 -136 -228 183 -208 198 -52 -54 -179 -70 7 -65 301
2238C01l16p3K39j83M41n27J98p6L6o7J82l10l9K14j47L11l52L05j97j48J0O4
$$ 301 -15 -88 151 -32 409 -118 80 4 40 -27 155 -155 -194 20 -127 184 -168 137 -60 -208 -198 -134
2260a34K25l5j39M3R3Q7J74q9k98J32l19L33J16l82L14r7J32m26jK69J50j59n02
$$ -134 91 56 -83 -40 53 140 314 225 -73 59 -260 73 189 -193 121 24 156 -270 -271 -2 148 -11 -513
2283e13P50k17n3J04l25K39J69l55J31l9K4n5K29k58K24J02j10K03m76R3LK64
$$ -513 237 20 -33 71 -254 -15 154 -201 -70 -109 -85 -140 89 -169 55 157 47 250 -226 -133 -130 134
2305A34j04m3M2j25K52l94K83J02k93K20P3k98Q0K40k03j45J72j1J46m4k56J66
$$ 134 30 -13 29 -96 156 -238 45 147 -146 74 147 -151 -71 169 -34 -179 -7 -18 128 84 -172 -6
2327fj90J20j18K49k25K89j67J95k13R9p5M6k4J71j31Q9p6q4K82k18J22o6K7M6
$$ -6 -196 -76 -194 55 -170 119 -48 147 -66 33 -42 4 -20 151 20 109 33 -51 231 13 135 69 96 142
2351A42N4j49l30L69L8k42J21j2J00j27R3j40J71k71P0K05j2k34K40l7N0L0ok02
$$ 142 196 47 -283 86 124 -118 3 -9 91 -36 57 -83 88 -183 -113 92 80 -154 86 49 99 129 123 -79
2375g9L6M6R8j91J47J75j02j27K04j40m3J66j33P3o1k52K31Q0J39l20k07L54o6
$$ -79 -43 3 101 -90 57 232 130 3 207 67 24 190 57 130 69 -183 48 128 267 -53 -260 94 28
2398B8O0j3j20R7k67L29J9l59K58j15J14j65L0O2K26O4p4j12k1J52l44J53Q6l28
$$ 28 88 75 -45 52 -215 114 133 -226 32 -83 31 -134 -104 -42 184 248 174 62 41 193 -151 2 88 -240
2422b40K57oJ2J95k34j06L12m54J70P4J42K2j05NJ38l12J53j14L31l63J82k1j31
$$ -240 17 11 23 218 -16 -122 190 -264 -94 -20 122 144 39 44 182 -130 23 -91 240 -123 59 38 -93
2445i3n6L37k13R1j71J23q2Q9K13l61L00k85k5O9j11J79M3k37J36K28k12J25k27
$$ -93 -149 188 -25 66 -105 18 -64 25 238 -123 177 -108 -133 -64 -175 4 47 -190 -54 174 -38 87 -140
2468a40J69O1q6J5k08J41k7l6K22jj2j92J21L4j69l2L64k61K03j60J3ml5J05k04
$$ -140 29 90 4 19 -189 -48 -75 -111 111 110 98 -94 27 61 -108 -140 224 -37 166 6 19 15 -20 85 -119
2493a19N5R7L6QL6k14j08K98qO0j70k13N7K32j36L2K73j38q3j29M1J4K17N2k46
$$ -119 -64 33 69 77 113 -101 -209 89 81 141 -29 -242 -185 47 -89 -57 216 78 -5 -134 -93 -79 138 190 -56
2518e6M9N9M4R3m03r4O04j91P1l06J95%k69N3K29Rk42K72l50J39K89j06Qkj69
$$ -56 -7 52 96 189 -214 -308 296 105 176 -130 65 65 -204 -151 78 87 -155 117 -233 -94 195 89 97 95 -74
2543g4L62k12k0j88J42j04p6L2QK61l16K24j6LL9M5K23l57J38J07l57J86j31J05
$$ -74 288 76 56 -132 10 -94 -170 -138 -130 131 -185 39 23 26 65 110 333 -24 114 221 -136 50 -81 24
2567B4L58m92J79n8L7j00J45k66L7K47j22J29j5o9k3n1n5J90j56K03j85K46k58
$$ 24 382 -110 69 11 48 -52 93 -173 -136 111 -11 118 103 34 11 -40 -95 95 -61 142 -43 203 -55
2590e5l8K49k91K1n1K37j39J34j46L27N2j83jj81QJ14j53j7J07j31K53L09n76
$$ -55 -93 156 -135 -114 -165 72 -67 67 -79 248 300 117 116 -65 -57 57 -96 -113 -6 -137 116 425 -151
2613a51K92k27N5j25m9Q6j01J39J50R8p0j39J15q0J0k59J79R1l2O0n1jL45k72
$$ -151 141 -86 -31 -156 -205 -119 -220 -81 69 167 97 -42 73 -7 3 -256 -77 14 -18 42 -9 -10 335 63
2637F3j01R1j51J04o3J46j92J61j68L7J27O5l11O6L15j60Qj11O3p9M44k34m7j33
$$ 63 -38 53 -98 6 -57 89 -103 58 -110 -73 54 119 -192 -126 189 29 37 -74 -11 -90 354 120 73 -60
2661f0K00j51j05J21R3n7n7R7q9j36J78j92J67r9J8J79l40K27O1j54K33m91M05
$$ -60 140 -11 -116 5 98 41 -16 81 -8 -144 34 -158 9 -90 -72 107 -233 -6 55 -99 134 -357 48
2684D8j71K7N6K2Pk26P25m41j25K93l37j81M06j73J52j03l7Q1p2J96j94k9k04
$$ 48 -123 -96 -40 -18 -11 -237 488 47 -78 215 -122 -303 103 -70 82 -21 -58 23 -49 147 -47 -76 -280
2707b80J22M5J55q7q0J66J17j55J7J32j90n1O4n8L98m49k3J7L7o5K22j00k7l7
$$ -280 -158 -113 42 -45 -125 41 158 3 20 152 -38 -89 -25 -83 315 -134 -157 -140 -103 -168 54 -46 -73 -110
2731a10Q3k9K13p5r7P5K11j50j73M6n4l6J47j46R3Q7j82K51n00j0M95l34l6N7
$$ -110 -27 -56 157 82 -15 60 271 121 -52 -6 -60 -96 51 -95 -2 85 -97 154 -346 -356 139 -195 -231 -174
2755a74K94j28m0J85k75J26j96j00K50J37j29l42J24K75j95J74K83l19o9L92l78
$$ -174 120 -8 -48 137 -138 -12 -208 -308 -58 79 -50 -392 -268 7 -188 -14 269 -50 -119 273 -105
2776a05M72n37j22J16pM05j73j84k4J74J53j03o3n8K50k90M5r3J42l3j22K57j22
$$ -105 367 -170 -292 -176 -183 222 49 -135 -159 15 168 65 2 -56 194 -96 -51 -144 -2 -35 -157 100 -22
2799b2K36j40l02J93J14J53p4p8o1L8j49J71Mj93L63k24j70L18N1l35l3J84o6
$$ -22 214 74 -228 -35 79 232 158 80 19 57 -92 79 83 -110 253 29 -141 177 228 -107 -140 44 -22
2822b2O0l6q3K26k36J14O4k26K57j8j32k53O18m02p2n7K81O9L8k36J5K02j02j58
$$ -22 38 2 -81 145 -91 23 87 -139 118 100 -32 -285 333 -69 -141 -198 83 152 190 -46 -31 171 69 -89
2846h9K76l53K41k49O1J20R7j00m1N8l1o5N4r6J87k52J53O5r0J90k48j5K02K45
$$ -89 187 -166 75 -174 -113 7 104 4 -37 21 -10 -75 -21 -117 70 -182 -29 36 -54 136 -112 -127 75 320
2870C20n12p3N68l54k0P4J39mj7j50j74Q6P9q3L1p7J3J60J79k32J45q0J12k34
$$ 320 -192 -265 303 -51 -71 3 142 138 121 -29 -203 -117 -38 -121 -90 -167 -154 6 185 -47 98 18 130 -104
2894a04K17r7P9j19m7L08l34K25o8n4J34rj02k56J32J72k5L3l7k73L82k23M09
$$ -104 113 16 95 -24 -71 237 -97 128 60 6 140 131 29 -227 -95 77 52 85 48 -225 157 -66 343
2917C43m90J43oQK48o8l78J4M55k51J2R2k06K2J62O5jK4j34j41Q0K4p2J18L5j00
$$ 343 -147 -4 -10 -2 246 178 -200 -186 269 18 30 122 -84 -62 100 165 164 188 54 -87 -7 17 -55 63 98 -2
2943bM5l20K19k21L06n9L9J56k68q8K32j29j00J48L4p7L71k64K95n04o5J37J93
$$ -2 43 -277 -58 -279 27 -32 7 163 -105 -193 39 -90 -190 -42 -8 -85 286 22 317 -187 -252 -115 78
2966G8j97M0J4qK84k40n1o5K29k73J31J5m3J55m6l95K61K62j74J52q8K36l0l45
$$ 78 -119 -79 -65 -73 211 -29 -80 -145 84 -189 -58 -43 -86 69 23 -372 -111 151 -23 129 41 277 247 -98
2990i8J27J47k47N2j6k61M02j54K26j30q1J61j80k52K40JQ4J41k81Q3K58jk36
$$ -98 29 176 -71 -19 -35 -296 106 -48 178 48 -33 128 -52 -304 -64 -63 21 162 -119 -36 222 221 -15
3013a5j36K04m8K16k17Q3j06m2j66K23k62J46K07oP3j23l4J99l61J56J86j90l9
$$ -15 -151 53 5 221 4 87 -19 -61 -227 -4 -266 -120 87 81 154 31 -3 196 -165 -9 177 -13 -52
3036e2O2L28l94O5M3r9J51Kj10Q8j38K59j30m2l3n9k19J22K15k4J14r5j15J97
$$ -52 10 338 -56 9 52 -47 104 106 -4 84 -54 205 75 33 0 -59 -278 -156 59 35 149 54 -61 136
3060A36j55K0j26J37o5L86n99L8K39J2Pl89N68j92j62K56j46j38M26q4m62L56
$$ 136 -19 1 -125 12 -53 333 -266 -228 11 23 30 -359 209 17 -145 111 -35 -173 253 169 -293 63
3082F3k48K55j97oL52k67L57n06J44J49O8k44Q2L23l29Q9j31N9k1n6J64mj13P8
$$ 63 -185 70 -127 -133 219 -48 309 -197 -53 96 164 -80 2 325 -4 85 -46 13 -8 -64 100 96 -17 61
3106F1M2n4M8o4m0K26m85MM3J71pJ36J24j73kj87L58k42j05K83k05L03m15J75
$$ 61 103 49 97 33 -7 219 -266 -262 -219 -48 -55 81 205 32 30 -157 201 -41 -146 137 -68 235 -180 -5
3130er4J29p7J0l1L5P4J09q4O5l0P0J17m28J23J11l34L55k0j32j78Q5K72o3j53
$$ -5 -99 30 -47 -37 -68 -33 41 150 66 131 101 171 288 -140 -17 94 -240 115 95 -37 -215 -130 142 79 -74
3155g4p4M2m7K50j69J46m30K74k3Q1j38L2Jq7J55J95j03q8J62m7J32m66J50j00
$$ -74 -148 -106 -153 97 -72 74 -356 -82 -105 -24 -162 -130 -129 -216 -61 134 31 -57 105 58 190 -276 -126 -226
3179b26J57p1J26J04k06O6JM9j6n5J20j83n3M01k67j01J36o0k29M07L4L0o9L8
$$ -226 -69 -140 -14 90 -116 -50 -49 0 -16 -71 49 -134 -187 214 -53 -154 -18 -78 -307 100 134 164 95 133
3203A33j9j82J82k06L2K64j66K3J45j95R4O2j80j4o5J53k6j6Pq2q9K09J5j51R1
$$ 133 114 -68 114 -92 -60 204 38 61 206 11 105 167 -13 -27 -92 61 35 19 26 -56 -145 64 79 -72 19
3228A9q7J93m59M76k03J71j06m20K99J29J04j40j78L93k20K38j90J61k53K49N6
$$ 19 -68 125 -334 142 -61 110 4 -416 -117 12 116 -24 -202 191 -29 209 19 180 -73 176 232
3249B32m14L88m25L37n0k08L29k21K85p1j60O9j41N2k86K52K41l1j69j61J88Q6
$$ 232 -182 206 -219 118 68 -140 189 -32 253 182 22 91 -50 2 -284 -32 209 178 9 -152 36 122
3271A22j71p2L6K89J13m58M7K8M5p8N8K4O7j33J21%l59N52K0j65Jj44j29L26m5
$$ 122 -49 -121 -85 204 317 -141 -94 -66 -21 -99 -41 -17 50 -83 38 38 -321 231 251 86 87 -57 -186 140 95
3296I5j28o6j3L11j15k62lJ89M1k02J85K3R9l15Nj44J63J44J3K01j30j28K3J4
$$ 95 -33 -99 -112 199 84 -178 -181 8 49 -153 32 55 154 -161 -156 -300 -137 7 20 221 91 -37 -14 0
3320@K97l03n1M3m6j20K10o3R9j5J52j35q0o4M20l93L39j90j63K83m76K42J0O
$$ 0 297 -6 -57 -14 -60 -180 30 -33 66 51 203 68 -12 -76 344 -49 290 100 -63 220 -256 -14 -4 2
3344Bk56J36L8M0O3J63o5k21l6l1K15J45k25K56P0m01K81j62o8J20j99L6J14k32
$$ 2 -254 -118 -80 -40 23 186 121 -100 -136 -167 48 193 -32 224 294 -107 174 12 -56 64 -135 -99 15 -217
3368b17N4J58P8K05l10O1m5k53J21L03k18Mln7K8J06l3j46Q2K4j3j6J50l94J84
$$ -217 -163 -5 73 278 -32 29 -16 -269 -148 155 -63 -59 -62 -119 -91 15 -18 -164 -82 -58 -71 -87 63 -331 -147
3393a47n8J09L4K9j65K00o8L30m50J75J90l57K87K1k7j92K22J0m3j51R8j61J48
$$ -147 -205 -96 -62 -33 -198 2 -66 264 -186 -11 179 -178 109 130 103 -89 133 143 100 -51 47 -114 34
3416C4j0K23k41n2q2K91r6J34r0j68r1Q2K24pj80J31j22k8K92m3j23M0q5J58%
$$ 34 24 247 6 -46 -128 163 67 201 111 -57 -148 -66 158 151 -29 102 -20 -48 244 201 78 118 33 191 191
3441A91k25R1R9j26j2R4l24L51o6R7p9k30M9M15k57J2Rj01L2p4j59K99N6k69j6
$$ 191 -34 57 156 30 18 112 -212 139 73 170 91 -139 -90 325 68 80 89 -12 20 -54 -213 86 142 -127 -143
3466a43jL00J6j32l7J34R9k60J17j18k0m3j14J55q0M4M38l51N2O6k07K9K32j0
$$ -143 -144 156 172 40 3 137 236 -24 93 -25 -45 -88 -202 -47 -127 -83 355 4 56 122 -85 -56 176 166
3490A66l33K01n1j5m5Q4R4l12L64k23P4L3k27J6k9J74J29j01%J94j17n5R6K05
$$ 166 -167 34 -17 -32 -77 7 101 -211 153 -70 4 37 -190 -174 -203 -29 100 -1 -1 193 76 21 117 322
3514C22j66l49L17P1j71J10M0n8M1j27K56m14k09O3L75l13K9PK74P9O7j88J12
$$ 322 156 -193 124 195 24 134 174 116 157 30 286 -128 -337 -274 101 -212 -183 -176 98 177 244 56 168
3537A68j37j07K27k50j86L28K2m68J66L78p8j18M9Q4m0k29K32k55K40n4J01l7
$$ 168 31 -76 151 -99 -285 43 65 -403 -237 141 63 -55 -6 78 38 -191 41 -214 26 -28 73 36
3559C6j29N2J40p4j21k9r3K91K3p4L34n43K95k07N5N4k23K62j67J1j38K17j55
$$ 36 -93 -41 99 25 -96 -125 -218 73 96 22 356 -187 108 -99 -44 10 -213 49 -118 -107 -245 -28 -183
3582a83J84K25k20j9J6j6j83J78J12j16L8J48l28K65J86k98L21k45j10K01j57
$$ -183 1 226 6 -13 3 -13 -196 -18 94 -22 16 164 -164 101 287 -11 310 65 -45 156 -1
3603ak0K52l49m9q1L55L4j68K57j20l48R1K99L9j04k18n5K66n19O25N5m33M16
$$ -1 -21 231 -118 -167 -248 107 141 -27 230 110 -238 -147 152 191 87 -131 -186 80 -439 186 241 -192 224
3626B24j88k24L46L3l81L83k16Qm8K62j68j03K14l11Q6R2o9m7K63k76k8R4L28
$$ 224 36 -188 158 191 -190 193 -23 -15 -63 199 31 -72 142 -169 -83 9 -60 -107 156 -120 -148 -54 274
3649B74j93K85o32J89L70m48J96j09N6q2Q1K06o4n22M00m1k6K59p3j91J09o7r3
$$ 274 81 366 -266 -77 293 -155 41 -68 -12 -94 -13 193 129 -393 7 -34 -60 199 126 -65 44 -23 -116
3672a16J51k44L20j78o2j37M91j39j06K03l29N4K80k09J63K1k69J00k9n6J19k28
$$ -116 35 -209 111 -67 -129 -266 225 86 -20 183 -146 -92 188 -21 142 163 -106 -6 -35 -91 28 -200
3694b00K39J61k44j3J48J0k05p3K27J5m6J11k62O0K19J64k18j51l1J4N7q5O7J25
$$ -200 39 200 -44 -57 91 101 -104 -177 50 65 19 130 -132 -72 147 311 93 -58 -89 -75 -18 -103 -36 89
3718H9l41P2M44k71JJ94r6j22J6J0k47J93J70j94K10M9K23m00m9J93nl00K20k7
$$ 89 -252 -180 264 -7 -6 188 92 -30 -14 -4 -251 -58 112 -82 128 177 400 0 -49 144 139 -161 59 32
3742C2n1J54l3k26R4L29l45j38K27j50MK18k41mJ97j06Q4qJ51j89N2j74K27k29
$$ 32 -19 135 102 -124 -30 299 -46 -184 43 -107 -103 115 -126 -130 67 -39 45 37 188 -1 51 -123 104 -125
3766a25J00k27K54mnM6j76Q8J48j98P5R3l4P8n5L8l27o8J50K13l21M07j75K9M2
$$ -125 -25 -252 2 -2 -7 39 -137 -49 99 -99 -24 69 35 113 58 96 -231 -299 -149 64 -257 150 -25 4 46
3791D6k1j85K70k08k72N06j25N4N9J0jj36M4O5m1j89K58r6j61L90l51J77k96J89
$$ 46 25 -160 110 -98 -370 136 11 65 124 134 133 -3 41 106 65 -124 134 38 -123 267 -84 93 -203 -14
3815a4m6j89K11j09q8M63r3J67l34k05L17p5K5oj28P0J54q5q5j9J31J37k21j05
$$ -14 -60 -249 -38 -147 -235 228 135 302 -32 -237 80 5 30 24 -104 -34 120 35 -50 -69 62 199 -22 -127
3839a27K46l39J00J27R9M5k39K6K4O0j83L36n2j74P7q5M9J71j15k42K03%J09p8
$$ -127 119 -220 -120 7 106 151 -88 -62 -38 22 -161 175 123 -51 26 -59 -10 161 46 -196 7 7 116 38
3863C8R4l28R8M8K47l28j18J48N6Q7j86Q4R7j56q1J16J66j37N5K10k34p5P6J05
$$ 38 132 -196 -98 -50 197 -131 -249 -101 -45 42 -144 -60 37 -119 -200 -84 82 -55 0 210 -24 -99 -23 82
3887H2k78K05L3j98Q8J45N0j44L8K0J38j76m6J35J29l38n9J16K41k15p9J5L8j14
$$ 82 -196 9 42 -156 -68 77 127 -17 21 41 179 3 -43 92 221 -117 -176 -60 181 -34 -113 -98 -60 -174
3911a74K70K2j07J00p8N7l41K34o3J86k89J2K05l7q7R5q8K6Q5k2O9k01KPK05O4
$$ -174 96 118 11 111 33 90 -251 -17 -80 106 -183 -171 34 -3 -90 5 -83 -57 28 6 75 -126 -124 -117 88 152
3937A52pj23J60j82jM12o10Q2J57P5q2J56j69P8o2J43k14Q3j52J5j9J10L77m41
$$ 152 145 22 182 0 -1 411 -199 -117 40 115 33 189 20 98 36 179 -35 48 -104 -89 -108 2 379 -62
3961f2L1M3j05Q3rj25K42P3j75R1j18J64k3j78K87k33O0J22k00K58j84M3o3L4
$$ -62 -31 12 -93 -10 -19 -144 98 171 -4 87 -31 133 110 -68 219 -14 46 168 -32 226 42 85 22 56
3985E6K3J09j20r7k85M90j51k16J55JN6J57j52J19j73Q7n3k7J37k82K19j38n7
$$ 56 79 188 68 -29 -314 176 25 -191 -36 -35 21 178 26 145 -28 59 6 -21 116 -166 53 -85 -142
4008a42K04r2J40p1mo9j39J08K52J63n12R2j36J58J91Oo0j76J86Q7Jm56J03O5
$$ -142 62 -30 110 39 35 -34 -173 -65 187 350 -162 -70 -206 -48 143 149 89 -87 99 186 187 -269 -166 -101
4032a01J66p3n6J72J0l36p3L73J68K7l02M3K39j13j4l24J66J4J52j60p2o7L74
$$ -101 65 -8 -64 108 118 -218 -291 82 250 277 -25 18 257 144 130 -194 -28 -14 138 -22 -94 -161 213
4055B13k32J05m6O7J25l28J7RL1r9R4j04K69j84l0J92pk1j26K94k30m3j9j43K74
$$ 213 -19 86 40 107 232 -96 -79 -70 -39 -138 -44 -148 121 -63 -93 99 92 71 -55 239 9 -34 -53 -196 78
4080G8l16K09K0O1l23J69Rj16m7L50q0K67l48p3LJ04J06j65J19q8j09P1Q4k7M
$$ 78 -238 -29 -9 52 -271 -102 -93 -209 -256 94 14 281 -67 -140 -137 -33 73 -92 27 -61 -170 -99 -15 -42 -38
4105c8j19K18j56K27q1K10r4r6k3j27J06j21K63j03j99K69oj79R6M8J81l77J65
$$ -38 -157 61 -95 132 51 261 167 71 48 -79 27 -94 169 66 -133 136 130 -49 47 95 276 -101 64
4128F4k51L54m7j66M8K97K7k48K8k20NJ84k56J82q6K59l65J94J30p8j0J32p8q5
$$ 64 -187 167 120 -46 2 299 326 78 106 -114 -109 75 -181 1 -85 174 -191 3 133 55 45 177 99 14
4152A4j16K19k47J88j80K59j94l15j30Q09k12J69q5k71J01j25P8j08Q6K63l48
$$ 14 -102 117 -130 58 -122 137 -57 -372 -502 307 95 264 179 -92 9 -116 -38 -146 -60 203 -145
4173a45L38k15j82K61q0J52j8K7l24J05j55K18P8j4k02k2R9J73j92J46j74K6K46
$$ -145 193 -22 -204 57 -23 129 111 138 -186 -81 -236 -18 60 46 -156 -178 -79 94 -98 48 -126 -100 146
4196A46j54m4K43k45m8%J3J03m9J70l32K97j93J12j19L13j07k66M4L17j23m7Q2
$$ 146 -8 -52 191 -54 -102 -102 -89 14 -35 135 -197 100 -93 19 -100 213 106 -160 -116 201 78 31 113
4219A13k03L6L0pj2K46mm52M02J59l53L23n28m3L53j4J32k90L3M3k41M41k34L11
$$ 113 -90 -54 -24 -31 -43 203 199 -253 149 308 -45 278 -250 -293 60 46 178 -112 -79 -36 -277 164 -70 241
4243B41j92J51k56l73N57k29M3J50K4j11j24K99r7J08J6o4p3j63K49j65qk01M52
$$ 241 49 200 -56 -429 128 -101 -58 92 116 5 -119 180 83 191 207 143 70 -93 156 -9 -17 -218 234
4266B34k89k06K25k7K11l07L21o2l14K41J10k82P1L6K22m6j93L0Q9j59N4k46L35
$$ 234 -55 -261 -36 -63 148 -159 162 100 -214 27 137 -145 -74 -38 184 138 -55 -25 64 -95 -41 -287 48
4289D8r1j27J5J64l0j3Km7L48m80J32N2P8k17L24k48j30K77N3Kj54o0K79l84L18
$$ 48 -43 -170 -155 9 -21 -34 -32 -79 269 -211 -79 -27 51 -166 158 -90 -220 57 110 112 -42 -102 177 -207 111
4314A11j2j04j38J69m4K4L1R7l9j19K66K2k98N1J64m3k73K85j27j22P5l8J49q5
$$ 111 99 -5 -143 26 -18 6 37 134 95 -24 242 264 -34 17 181 138 -135 150 23 -99 -24 -62 87 2
4338Bk18N6K07k91K74J9j93k5K42j64K63k76J51j87p7N2o1K45r9l2J20p6K86j28
$$ 2 -216 -160 47 -244 30 49 -144 -169 73 -91 172 -104 47 -140 -217 -165 -226 19 -80 -112 8 -68 218 90
4362I0J59l05j76L88m18K27o5K54k40J44j02j8J19k66J39K67j25j7N3k22J51K1
$$ 90 249 -56 -232 156 -262 -35 -100 154 -86 58 -44 -62 57 -209 -70 197 72 55 108 -114 37 58
4384E8q8L89m72O8n1L19j27j26M48k81k55J69r6R3l00L86k67P6LK99o8j48j42
$$ 58 -30 359 -113 -45 -96 223 96 -30 418 137 -118 51 -45 48 -252 134 -133 -57 -54 245 177 29 -113
4407a13M1K13j38J10k57L31j99j88K81q1j35J38j4J0l58L66J96l25J79j00O9k17
$$ -113 -72 141 3 113 -144 187 -12 -200 81 0 -135 3 -11 -1 -359 7 203 -122 57 -43 26 -191
4429a91J32n8MP2J55l02J97N3Q8j25N0j64J05M7M0r6N0j71j78J87K27l19K97l1
$$ -191 -59 -117 -113 -41 114 -188 9 62 150 25 75 -89 16 63 103 7 57 -114 -292 -105 122 -197 100 69
4453F9k45L4R0K1J55q7J16k21L5k1N2J41k74K26m0K8k51K93j12P5p9k57M86j90
$$ 69 -176 -142 -52 -31 124 37 153 -68 -33 -54 -2 139 -135 91 51 79 -172 121 9 84 5 -252 234 44
4477D4k26M2J08k44J60K54k52L43k16j84j39R4L15j36O7j27j2Q2J96N4l37J67
$$ 44 -182 -140 -32 -276 -116 138 -114 229 13 -171 -310 -216 99 -37 30 -97 -109 -27 169 223 -114 53
4499E3O3r0l6l01L90j52K49j23p6m1K49k48n2mK78k6k84J29K3o2R9j69J83p7j03
$$ 53 116 26 -10 -311 79 -73 176 53 -23 -64 185 -63 -115 -119 159 133 -151 -22 1 -61 38 -131 52 -25 -128
4524a28J20m0K87J4k50R7m2Q3j20o9J29j80OJ58j79q7K36j80M77k23K7j28j2p2
$$ -128 -8 -48 239 253 3 100 58 141 21 -48 81 -99 -93 65 -114 -201 35 -145 332 109 136 8 -4 -76
4548g6J69j77J19J89J6j11k29j06J0K20M7j51L82r7j98j06K30k54KJ15J54j8j94
$$ -76 93 -84 35 224 240 129 -100 -206 -196 24 71 -80 302 205 7 -99 131 -123 -121 -6 148 130 -64
4571f4K30l23LJ34J5k3j8j89K47m7p7R6j10R1M7j83m3N1K37J73O1l72M64o43M35
$$ -64 166 -157 -154 -20 -5 -28 -46 -235 12 -35 -112 -16 -126 -35 12 -171 -214 -163 74 247 308 -64 400 -243 192
4596A92k61K59j73k33K42J85k31j37r7J55J67Q9k09J27k40P2K19Jk46J22J50j81
$$ 192 -69 190 17 -216 26 211 -20 -157 -254 -99 68 157 -52 75 -165 -93 126 127 -119 3 153 -28
4618b8J85k35Q9q7k7K38j00j39K15M3l9J22k70J15j8M6J63m47L74P5L2k97K43
$$ -28 157 -78 11 -76 -103 135 35 -104 111 154 115 237 -33 82 64 110 273 -174 200 275 307 10 253
4641B53l75j76N36k95j6Q4j25N9J92q2O9n0J53l09K86j52l8P8j11o6J75k30k14
$$ 253 -122 -298 238 -57 -73 11 -114 -55 137 55 124 74 227 -82 204 52 14 92 -19 -85 90 -140 -354
4664c54L15J79l13J51j48K52r2K9Jlk31K11K72l03K64o4l11L56n01L70N3j35J09
$$ -354 -39 140 -173 -22 -170 82 -10 19 20 17 -214 -3 269 -34 230 166 -145 211 -290 80 133 -2 107
4687A07L64l96l62J65P4n5L20j25j27l43L52r4L65Q1l67P7m06L11r9L11l00J01
$$ 107 471 75 -287 -122 -48 -103 217 92 -35 -378 -26 -120 245 326 -41 36 -370 -59 -158 153 -147 -46
4709d6N9n3L3P3n8J3r6N60k34l24k6K11k71J27K31k51K29l70J43J07J82l55J43
$$ -46 13 -40 -7 66 8 21 -75 485 251 -73 -99 112 -159 -32 199 -52 177 -193 -50 57 239 -116 27
4732B7k36L08n1q6k26J57J28O4J07l69M40j23k63R4j90K40n6j46J04J09k7R3j00
$$ 27 -209 99 48 -38 -264 -107 21 85 192 -177 263 140 -123 -29 -219 21 -35 -181 -77 32 5 98 -2
4755bo2n8J52K2o4k1L19m29O3j77N4J16K32K0l46J06J07m5pO0J03j07k3p1o7K63
$$ -2 -64 -122 30 52 -12 -33 286 -143 -80 -257 -203 -87 145 165 -181 -75 32 -13 -20 40 143 36 13 -58 -125 138
4781A38L0o0k71J55N2J93l52J71Q6j09J23k83J90j21M13k13rl25OL98K1k07K9
$$ 138 168 108 -163 -8 44 237 -115 56 142 33 156 -127 63 -58 355 142 133 -192 -186 212 233 26 55
4804E5k39P6J2J25j85n3K09j09m2j18K60Q7P6p0j03J0n5J03r1k2R1q3J96%j58
$$ 55 -184 -108 -96 29 -156 -209 0 -109 -151 -269 -9 78 154 84 -19 -9 -64 39 -52 -74 17 -66 130 130 -28
4829b8J00L7k24P0M7J26j35k18K24k0J91q6j31M5J48k61J19K29j8j05j40K01p5
$$ -28 72 109 -115 -45 2 128 -7 -225 -1 -21 170 84 -47 -2 146 -115 4 233 215 110 -30 171 96
4852I6j66m7j8k37J37N2J18p9n0K32Q3k78J56j91K08kJ05K3k25Q4j8j63N4J76
$$ 96 -70 -117 -135 -372 -235 -183 -65 -144 -194 38 121 -157 -1 -192 16 14 119 142 -83 1 -17 -180 -126 50
4876E0k09K17J34j04L9Mk4j62k3j04J61J5J6k03J63r1L49j33j37J69n63N17j81
$$ 50 -159 58 192 88 127 131 107 -55 -78 -182 -21 -6 10 -193 -30 -121 228 95 -42 127 -436 81 -100
4899a00N2K27k54K11K67o67o8K75j72L89k17k05J02O4J69j41l2J09p8K45k52J6
$$ -100 -48 179 -75 136 403 -264 -332 -57 -229 160 -57 -262 -160 -96 73 -68 -100 9 -69 176 -76 -60
4921f0K21k41j28L83o6K8j08k56K67p3O4mJ10l49M61k38n8RR9m6j12J01l2rN0
$$ -60 161 -80 -208 175 109 137 29 -227 40 -33 31 27 137 -212 249 11 -47 -38 61 15 -97 4 -28 -37 13
4946A3J31K9j51J21O9j14k22J37p6N8kJ7j12O8k9L08m06J04P9k37K59j13P8K8
$$ 13 144 173 22 143 212 98 -124 13 -63 -5 -7 10 -102 -34 -63 245 -161 -57 22 -215 44 -69 9 37
4970C7k07J66j74M68k60K5k19J45J74j16l2j40J53qk2l15L18n2K31j78K36l11
$$ 37 -170 -4 -178 290 30 55 -164 -19 155 39 7 -133 20 12 -10 -325 -7 -59 172 -6 230 -81
4992h1K52K8n50K70K03j31N3O3r0j11M8n8M50l69j02K66k90J80J05k67J30j0j17
$$ -81 171 199 -351 -81 122 -9 44 107 17 -94 -46 -104 346 -23 -125 141 -149 31 136 -131 -1 -11 -128
5015a28r9N4J84N3k3j93K86j84j12l5j67N56j24j43N1K86j68l03L23R9j93L1k03
$$ -128 -227 -173 11 64 41 -152 134 -50 -162 -197 -364 192 68 -75 -24 262 94 -209 114 213 20 51 -152
5038a52Q6L2r9k5j41J90P3j07q7M73k94J39Q3q4k18M68l70J6k69J86M80p04M66
$$ -152 -66 -34 -133 -158 -299 -109 -36 -143 -230 243 -51 88 171 87 -131 337 -33 -17 -286 -100 380 -324 142
5061A42j19K49k27K69l97M71l90k48L14Ol08L63k41%O0K20j90K8k51L51M6q8l9
$$ 142 23 272 45 314 -83 388 -2 -250 64 70 -238 125 -116 -116 -56 164 -26 2 -249 102 148 60 21
5084B1j7kno6J8J60K4k22m0J10K9jJ02L95m68j11P9m4J09r7K29k1l41J97j68J44
$$ 21 4 2 -3 -69 -51 109 133 -89 -129 -19 10 9 111 506 38 -73 6 -38 71 -26 203 182 -159 38 -130 14
5110A4Q5l11J31j16J59N8j10K0k0j08L56k87M7R1O8J25l20J8P8J2L4L10k69R0
$$ 14 99 -212 -81 -197 -38 20 -90 -70 -90 -198 158 -129 -82 9 77 202 -118 -100 -22 -10 24 334 65 155
5134A55n78L17J07n0M0M1j21M8J88k24P5J57k91m7M14l28L09o9k54L71l92R0L39
$$ 155 -423 -106 1 -49 -9 32 -89 -41 147 -77 -2 155 -136 -183 231 -97 212 143 -111 260 -132 -42 297
5157B97j24m8rk28O2K51j05L1k38K64k44J05j70J66n5K64k9k76L59m18K41j39
$$ 297 173 125 116 -112 -50 201 96 127 -111 153 -91 14 -156 10 -45 219 190 -86 273 -145 96 -43
5179d3l69J3M64k01p0L46j40J05k09J1J03n5k09K67q2K58j14J38j4l26O9L4J18
$$ -43 -412 -399 65 -136 -206 140 0 105 -104 -93 10 -45 -254 13 -69 189 75 213 199 -127 -58 -24 94
5202I4J18m02J61R6k14J38n3K80l87L72j37K6Pq0J95l67K05j75M56m51J19M7q8
$$ 94 212 -190 -29 67 -147 -9 -62 218 -169 203 66 92 99 19 214 -153 52 -123 333 -118 1 48 -40
5225d0j08K27Mj61k8J27J64K5J36n57K63J32k44o0K06O1j13R8j20m5KJ40O2k71
$$ -40 -148 79 83 -78 -106 21 185 210 346 -211 52 184 -60 -120 86 147 34 132 12 -33 -31 109 171 -100
5249a00K15p8j18j00LK42k03j42M13N2j04qj44J65j49J49j44K31l6l26K22Q0k66
$$ -100 115 37 -81 -181 -178 64 -139 -281 132 184 80 72 -72 93 -56 93 -51 180 144 -182 40 120 -146
5272a46k6n6K79L8j6rk22L27m33K72K00j81j02J10J43p0p6J85j06m66K84K27K46
$$ -146 -172 -228 51 89 73 64 -158 169 -264 8 208 27 -75 35 178 108 32 217 111 -355 -71 156 402
5295D02l84L1q7N7Pj37J93q7k16K26k14R7O4j15L18j72K98l39K67L7k93r8J2n8
$$ 402 18 49 -38 19 26 -111 82 -5 -221 5 -209 -112 -48 -163 155 -17 281 -58 209 246 -47 -145 -133 -191
5319a91J34J82Kj16mP4k10L14j97j21K26l7j30L8k11N38l83Q4J13m3K85k39j73
$$ -191 -57 125 127 11 7 81 -129 185 -12 -133 93 56 -74 -36 -247 291 -92 -8 105 62 347 108 -65
5342f5r7J99L8j19q7K9k03M81k30K06k08p1J46J13nM4l62Q6R6N6j22J4P4k26K95
$$ -65 -162 37 75 -44 -131 -102 -305 176 -54 152 -56 -127 19 132 127 171 -191 -105 -9 47 -75 -61 13 -213 82
5367H2J61m24K91j67M35l95L5q9j5l2k1N2q0J47J51k38k11J02j0K96j43K05j58
$$ 82 243 -181 110 -57 378 -17 18 -71 -86 -118 -139 -87 -167 -20 131 -107 -318 -216 -226 70 -73 132 -26
5390b6J25j10j44K04J46l02j40N04j04m06K45rp0N7k3K60J97m21j0j64k2L05o5
$$ -26 99 -11 -155 49 195 -107 -247 257 153 -253 -8 -17 -87 -30 -53 207 404 -17 -27 -191 -213 92 27
5413B7J71k36O6K3j61J03k79K29k9kK32k40j57K40K59k26m5j6J79L9q5l3o9P6
$$ 27 198 -38 28 51 -110 -7 -286 -57 -86 -88 144 -96 -253 -13 246 20 -25 -41 138 177 92 59 -10 66
5437F6OP9m60N86l93K89k74M4J40j87N0K99p5j23j42o6K89k03R8p7J69j09K53
$$ 66 72 151 -309 277 -116 173 -101 -57 83 -104 -54 245 170 47 -95 -161 128 -75 23 -54 115 6 259
5460B59m64L96j86o0M3J35j16j15L27j65J33k70L3M4Q6k21J81J33k76p7J28r0
$$ 259 -205 191 5 -55 -12 123 7 -108 219 54 187 -83 -50 -6 80 -141 40 173 -103 -180 -52 -142
5482a42K23N4P3j98n2j17K42N9j72j60J67Q1j45K41k35K38l04l10L26j05K65k0
$$ -142 81 135 208 10 -42 -159 83 142 -30 -190 -23 58 -87 154 -81 157 -147 -457 -131 -236 29 9
5504IjJ71j58J23j87K21l07K7J94J2J1k33J97P9kj0k13J18r6L56n03J54p2L45
$$ 9 8 179 21 144 -43 178 -129 -102 92 104 115 -118 79 158 156 146 -67 51 -45 311 -192 -38 -110 235
5528B35j73Q2j92J02K29k67jk15L42l62j0K52r8J22j12K39k69M08m16o5J01KJ60
$$ 235 62 144 -48 54 283 16 15 -200 142 -220 -230 22 -76 46 -66 173 -96 312 -104 -169 -68 -66 94
5551I4j05k14l3J28N3k15J52J4nK69J20j07k56K33j34j57K93K4l38L57m27J67
$$ 94 -11 -225 -258 -130 -77 -292 -140 -126 -131 138 258 151 -105 128 -6 -163 130 154 -184 173 -254 -87
5573h7Q8j46P7j69L24j42J99j72L23l07j9R1k96L47j91L3K93k14k12P4k09J57
$$ -87 1 -145 -68 -237 87 -55 144 -28 295 -12 -31 60 -236 111 -80 -47 246 32 -180 -106 -315 -158
5595a58J62rm8K4k1K70r0l73K49O8k44L15j09L3j24J31l55L18o2q0K85q5J58n95
$$ -158 4 -5 -53 -29 -50 220 130 -243 6 74 -170 145 36 69 -55 76 -279 39 -23 -103 182 97 255 -340
5619c40M43l7L06m72L73k43l3q0kj4K45l01Q1q7K26j9jJ78O2j48q0j42L02l01
$$ -340 103 66 372 -100 273 30 -3 -83 -85 -99 146 -155 -74 -161 65 46 45 223 285 137 57 -85 217 -84
5643h4K92K41n07j89J96M3q6K03l0L1p8m4J57j09k87K52j83M2J36n5Jk25J74n0
$$ -84 208 449 -58 -247 -51 -8 -94 109 79 110 32 -12 145 36 -251 1 -182 -140 -4 -59 -58 -283 -109 -159
5667a59J76j22m4L52k34PJ12j25O2k29J30R9Q6K31j90M2J10m00J95j25J02L4k13
$$ -159 17 -105 -149 203 -31 -24 88 -37 25 -204 -74 25 111 342 152 194 304 -96 99 -26 76 110 -103
5690a03R8J16K54r1l50p3l2J72j24j45K64Q7j5k65R0r5K32J99j48l32N98n72M33
$$ -103 -5 111 365 274 -76 -149 -181 -9 -133 -278 -14 73 58 -207 -117 -212 20 219 71 -261 337 -235 198
5713A98k03K27l79J70j13L5l0K16O5l96K52JOp0j03M79n61J60K41l44K45n0L3
$$ 198 -5 222 -157 13 -100 -65 -95 121 186 -210 42 43 49 -21 -124 355 -206 -46 195 -149 96 46 79
5736G9K33j33l35J27p0j17L84q2p3j97K99l78J99L04k53l2o4K32o7J43j50K6J15
$$ 79 312 179 -156 -29 -99 -216 168 86 13 -184 115 -263 -64 240 -13 -45 -109 123 56 199 49 75 190
5759A90k37M8K85m65Q7j8l5J62L3r8k40L20r9J59p7O7j72J91k52K78j31j47K5
$$ 190 -47 1 286 -179 -92 -110 -145 17 50 -48 -288 32 -67 92 15 82 -90 101 -151 127 -4 -151 -126
5782a26j8L80m43K77k33M59l82M46k50j35L0j07L38l74J30q4J97K1k86J40N7j68
$$ -126 -144 236 -207 70 -163 296 -86 360 110 -25 5 -102 236 -138 -8 -92 105 126 -160 -20 37 -131
5804a31K63j69P0P5M9J27k76Oj10N4p6Q1L15l55J10m4j92J5K69j39J03j0J57p9
$$ -131 132 -37 33 108 157 284 8 14 -96 -42 -118 -37 278 -77 33 -11 -203 -188 81 -58 45 35 192 113
5828A13j27Q2k4R4j19j05J95r1j6l5q1J62j53L43l30J63k05L4J40P1k49J73o5
$$ 113 -14 68 44 138 19 -86 109 18 2 -33 -114 48 -105 238 -92 71 -134 -100 40 111 -138 35 -30
5851c0j63N6J11J82k55J93k47L21M5o0k94J37o5q0J60k47L44j26L0J46q9k64K28
$$ -30 -193 -137 -26 156 -99 94 -153 168 213 153 -141 -4 -69 -149 11 -236 108 -18 12 158 69 -195 33
5874C3K08n8k60OJ61j58L05J20l43q6j0J15j36K55n0j7K6K0k76L16J1j26p1K01
$$ 33 241 183 -77 -71 90 -68 237 357 14 -72 -82 33 -103 152 102 85 111 131 -145 171 182 56 -15 186
5898A86j24j6J6R2K4l16J34J12l58O8J0K28j28J35p4l9K53j45o5J34K2j59o0q2
$$ 186 62 46 62 154 178 -138 -4 108 -250 -182 -172 56 -72 63 -11 -50 203 58 -7 127 149 -10 -70 -152
5922a52J28J19%nj50O3J74m45Q9L09n7J95k65M36k82k09J2J91k27k37N05o8l16
$$ -152 -24 95 95 90 -60 3 177 -268 -179 130 73 268 3 439 157 -52 -40 151 -76 -313 192 124 -192
5945a92K55j33K70k56M6K68k67J09l05J42J0J36J13l7q1L23k98n1J2j27J62p3
$$ -192 63 -70 200 -56 -10 258 -9 100 -205 -63 -53 83 196 159 78 401 103 52 64 -63 99 26
5967B6J18k41k1j21M2J75J57j43n5l2M8K40l77J29k9l0j40L55j01k8m8J40k13
$$ 26 144 -97 -118 -239 -197 -22 135 -8 -63 -95 -47 193 -184 -55 -84 -114 -254 101 0 -28 -76 64 -149
5990a49M7j42M00k87%k98M46J32l18K27l0J09j10J01j58o0L45m50J31L9K22k11
$$ -149 -102 -244 156 -131 -131 -429 17 149 -169 58 28 137 27 128 -30 -90 255 -195 -64 -25 197 -14
6012a4M1r2nJ62K14j77P5j58J1n0L0n3J50r7J54j94n1j7J25r2J45p2j33J41N2
$$ -14 27 -65 -70 92 306 129 204 46 57 7 37 -16 134 37 191 -3 -54 -71 54 -38 107 35 -98 43 95
6037I5k25J35K00r7N9m38J16L49j38j66J57m2p3R1K18k68R3l7M5J11P2k84J08
$$ 95 -130 5 205 108 167 -271 -155 194 56 -110 47 5 -68 23 241 -27 66 29 74 185 257 -27 81
6060H1n3p7J73l60k27K50K97l48M60q8r3J01k11j50j0J14J70QJ24l04K27M8L6
$$ 81 28 -49 124 -236 -463 -213 84 -264 196 108 15 116 -95 -245 -255 -141 29 37 161 -143 84 132 168
6083A68O2k63r9M21k29k26K57k1J42j32m3k00J47k14o6J48M7P1J61r8l1j01k33
$$ 168 230 -33 -132 289 60 -166 91 70 212 80 37 -163 -16 -230 -296 -148 -101 -30 131 33 2 -99 -332
6106c32L63Q5P0k13j15MN2nP1J31j21kN7j81j0L37jl27K95k02o9L54O4k59N5m2
$$ -332 31 116 186 -27 -142 -138 -86 -91 -20 111 -10 -12 45 -136 -146 191 190 -137 158 -44 -113 241 305 46 101 59
6132E9L8Rq6L5k68M12k57J88j82J48o3j00J42J33k1r9M7j84l3K9q1K0K54l1k69
$$ 59 97 106 20 55 -213 199 -58 130 -52 96 33 -67 75 208 187 88 135 -49 -82 -53 -134 -114 140 109 -160
6157a60J73m9J16l7q0j05K69j77p3J89K4M2k72J76N9q3j97J54n8j4P0j40K07J89
$$ -160 13 -36 80 43 -37 -142 127 -50 -123 66 90 132 -140 36 95 12 -185 -31 -89 -103 -33 -173 34 223
6181B23k4l25J37J75k38L02j85r4J88L8k29J95r4j4L2J72l44K91j31o7j37J91
$$ 223 199 -126 11 186 -52 250 65 -29 159 197 -32 163 69 55 87 259 -85 206 75 8 -129 62
6203F2J92j80j54j99L37k66K48k06K23J06kl12J01J27q7m1L06k71j96J76j62K59
$$ 62 254 74 -80 -279 58 -208 40 -166 57 163 161 -151 -50 77 -10 -51 255 -16 -212 -36 -198 61
6225F1nj01r6L29l60J40k00J95m1K55k46l0K89j09J07k72l9J12J82k20mj43K73
$$ 61 56 -45 -141 188 -172 -32 -232 -37 -78 177 -69 -99 190 81 188 -84 -123 -11 171 -49 -53 -196 77
6248G7K45k14j34K7Lj4j21K22n47L94j28M59j06k44k81N58p6m9j6k85K31r9j68
$$ 77 322 108 -26 1 4 -10 -131 91 -456 -62 -190 269 163 -81 -362 196 120 71 55 -230 1 -98 -266
6271b66J85L42k01k18j8J85J18j1K06m16K31j92K77NLj85J65l30K12n5j14J10
$$ -266 -81 261 60 -158 -176 9 127 116 322 -94 137 -55 222 227 230 45 210 -120 92 37 -77 33
6293C3q5M5p3k1J95Kj23j18J92K4j16N2kk25M00j64j76J48k58K44K01k51J09k25
$$ 33 -52 -7 -80 -101 94 96 -27 -145 47 71 -45 7 5 -220 180 16 -160 -12 -270 -26 175 -76 33 -192
6317a92K84R5k25j8l2J03K96k92K01j84k0Q7P7lm80K10J76k93K64o7k3K08j23
$$ -192 92 187 -38 -56 -88 15 311 19 220 36 16 103 180 177 -303 -93 83 -210 54 -13 -36 172 49
6340D9K4k28J43J66j05k6k17J85J96k61J36R4lq6l81O59l79J18j64K25l61O7J76
$$ 49 73 -155 -12 154 49 23 -194 -9 187 -74 62 156 153 67 -314 345 -34 84 -80 145 -216 -149 27
6363B7k09L23j49J06k70N8K76o2j76O9J73n9l9j42l5k0K05L4r5j74P0J40k95m6
$$ 27 -182 141 -8 98 -172 -114 162 100 -76 -7 166 107 68 -74 -109 -129 76 110 15 -159 -89 51 -244 -290
6387b90M9K36j89J96q4Q3r8L99l41l6J39Q3K1l53M16J58k80k64l3L16k19p3K91
$$ -290 -241 -5 -194 2 -82 1 -97 302 -39 -75 64 147 168 -185 231 389 109 -155 -188 128 -91 -164 127
6410A27j17k01L4O6J14K30j83Q8k42J61L19m22j79j56M94k22N6q3Q6K81k17Pm7
$$ 127 10 -191 -157 -91 23 253 70 158 -84 77 396 -26 -205 -361 133 -89 -33 -116 -30 251 34 41 -6
6433fL20n64N07k12j0OJ18r0N1j57J0K0N7Lk08M08k41k5R6k57K13n1J9q4J89k5
$$ -6 314 -250 257 45 35 41 159 69 120 -37 -27 -7 50 53 -155 253 12 -13 83 -174 39 -12 7 -77 112 87
6459H7k23j16K98k80J9J90k3P6j37J55j12o4m4N48o69N9J72J12L61n26J68k05
$$ 87 -136 -252 46 -234 -215 -25 -48 28 -109 46 -66 -130 -174 374 -295 -236 -64 48 409 -117 51 -154
6481a54M73k10j7k25QK72J38l68M5m3P8J91l80R6n7L01J06j93m0Q1l46M63k97
$$ -154 319 109 92 -133 -125 147 285 -83 -38 -81 -3 188 -192 -96 -153 148 254 61 21 102 -244 219 -78
6504g8J0o2J82k9j23JP9L22n03J57K59l55K52j2K2j21q7J42k19L19p5n5n6p8M21
$$ -78 -68 -130 52 23 -100 -99 -20 302 -201 -44 215 -140 112 100 122 1 -86 56 -163 156 81 26 -30 -108 313
6529C13j21l31N5J96p5M2j74K55p0j79l1K27j37L08k99M0J36k82J00%K36j49K8
$$ 313 192 -139 -84 112 37 79 -95 160 90 -89 -120 107 -30 278 -21 19 155 -127 -27 -27 209 60 88
6552H8J1j44L77l96K10J28l23J73q6n7J79j24j24K6K49m9L1k1l30O5m3Q4K69k95
$$ 88 99 -45 332 -64 146 274 -49 124 38 -19 160 36 -88 -62 187 138 169 148 -182 -117 -160 -76 193 -102
6576a02l2K30J62l69K17p9J6K31k89J7J08K59m70J79k71J67kJ06j05k07J71j23
$$ -102 -134 96 258 -111 106 27 43 274 -15 2 110 369 -101 78 -193 -26 -28 78 -27 -234 -63 -186
6598a86K29k60L26j30P7K22m63K26k53J83N3K0N0k25p3K29j19K15o7jj34kJ22
$$ -186 43 -217 109 -21 56 278 -185 41 -212 -29 24 44 94 -131 -204 25 -94 121 54 53 -81 -83 39
6621C9o0L16n76J98r0O5P9j30L18k04J1R1j61K11jp8j37K07p5p5OO4j9J38l30
$$ 39 -21 295 -281 -83 -173 -108 -29 -159 159 -45 -34 57 -104 107 106 28 -109 98 23 -52 -46 18 -1 137 -193
6646a93q9K51k41M99j66r5J26j16L2R5p0P2j66J26m6J9k1Q7J29k56N7J19m16M67
$$ -193 -282 -31 -272 227 61 -34 92 -24 8 103 33 105 -61 65 19 38 17 104 233 -23 34 153 -263 204
6670B04j90J86l10K35l26K09j80J29K00j24k7j54J64L2J2N2J67l19J23J49j42
$$ 204 14 200 -110 125 -201 8 -172 -43 157 33 6 -148 16 48 60 112 279 -40 83 232 90
6691I0j92R2j12n7M6J44k19J9K53j14q1r4K66j06R6n5J05m15J77K15M3k22J17
$$ 90 -102 -10 -122 -179 -133 11 -208 -189 64 -50 -131 -225 41 -65 31 -24 81 -334 -157 58 101 -121 -4
6714dJ05r9J01j82M0k11L90k39N5J20p3J60j78n4J30k99J74kL4k38N16l22J21
$$ -4 101 2 103 -79 -39 -250 140 -99 -44 76 3 163 -15 -69 61 -238 -64 -66 -32 -270 246 -76 45
6737D5Jpmk5M3N0k79J38kj21K01l9N2k09j9Q8M6K21k36J72m06K50j37K35j76L20
$$ 45 46 39 35 10 53 103 -176 -38 -40 -161 40 1 53 -156 -175 -87 -41 180 -56 116 -290 -40 -177 58 -118 202
6763B02l40k8J00k02L39j36J29j97J43K9j63Qj0J85j52N3P0m1J69l84M03k61l6
$$ 202 -138 -166 -66 -268 71 -65 64 -133 10 39 -124 -116 -126 59 -93 -40 30 -11 158 -226 177 -84 -120
6786a20q8M9K45n6n8Ok45R8M66n51J49k26K10M4J81q2K25j54Rj83N4q9O2k13Q9
$$ -120 -208 -159 86 30 -28 -22 -267 -169 297 -254 -105 -331 -121 -77 104 22 247 93 102 -81 -27 -116 -54 -267 -178
6811a78K03j40N05l67J10l27K97r0M3r1P7l00M85l14N9K44o7l06J08K5P5j19J0
$$ -178 25 -115 390 23 133 -194 103 13 56 -35 42 -258 227 -87 -28 216 149 -157 -49 -24 51 -68 -58
6834e8j26j33K08L57j39J0l56L00P6l56J01p9J45k08K72j0J14J8m1M1l1j25k13
$$ -58 -184 -317 -109 248 109 119 -237 63 139 -217 -116 -195 -50 -258 14 4 118 136 95 136 105 -20 -233
6857b33M7L75j39l92J75J52K5K4j41J22P5J37q7l79K06J23j30J45j23k2J8Q3m6
$$ -233 -186 189 50 -342 -167 -15 10 34 -107 15 90 227 140 -239 -33 90 -40 105 -18 -40 -22 61 15
6880A5J41K9l05J7L20P9J44o18J72j11J5M06k82k1o2J6K9j13L75l42p9O3Q1K65
$$ 15 156 185 -120 -103 217 296 440 -178 -6 -117 -102 304 22 1 -61 -45 -16 -129 246 -96 -175 -112 -31 234
6904B34j11l09M5J76j07O4j13K42r3k70J65Q3Q4M2m5Nk09K26j13Q2ol13M59n08
$$ 234 123 -186 -141 35 -72 -8 -121 121 28 -242 -77 6 90 132 87 92 -117 109 -4 78 72 -241 218 -290
6928b90N13j68k35l2L1K44l6J56k33M1l63K30K83l00QL07q8k58K21l0j00Q2kJ36
$$ -290 223 55 -180 -212 -181 63 27 183 -50 -9 -372 -142 141 -159 -151 156 68 -190 31 1 -99 -17 -19 117
6952A17j6J05l08K4j16K79j39j72L07j08K91k38R6k52R6K64j97qK07k44K3r6j27
$$ 117 101 206 -102 -78 -194 85 -54 -226 81 -27 264 26 122 -130 -34 230 33 25 232 -12 11 -85 -212
6975b12L19n7K21j67L2p9o2k3K42j0k31J03k04J58j18O6K55k96Q5p7K67j58J59
$$ -212 107 50 271 104 136 57 -5 -28 214 204 -27 76 -128 30 -88 -22 233 -63 22 -55 212 54 213
6998B13q0k94J87O4j7M1j21m1k15L60j89J24k30J56L7n3K27n55M15Q4j11J2k13
$$ 213 133 -161 26 90 73 114 -7 -48 -263 97 -92 32 -198 -42 -5 -58 169 -386 29 113 2 14 -199
7021a99J53J71l7qj55Q5L7P3j79k6O0j01o6J28J15K14m58K18M1j62J68l18L64
$$ -199 -46 125 88 80 -75 10 47 120 -59 -85 -25 -126 -192 -64 51 265 -193 25 66 -96 72 -246 118
7044A18l21K20RN8M2Q4k01L3J81k89J43J0k18j27L17k07L47NN1m25K43m00L87
$$ 118 -203 17 26 84 126 210 9 42 223 -66 77 87 -131 -258 59 -148 199 204 255 -170 73 -327 60
7067F0R4k55K73k47j24J26M16k43Kj37K16J05k66qj67K75r7j71J30M3n5J02k46
$$ 60 154 -101 172 -75 -199 -73 343 100 102 -35 181 286 20 12 -155 120 23 -148 -18 25 -30 72 -174
7090a74K02jp0k2K31k99K10j44j15J36J42R9l21Q9JL5J10k57O4J84k49J28J03
$$ -174 28 27 -43 -65 166 -133 77 -67 -182 -46 96 195 -126 -37 -36 -1 109 -148 -84 100 -149 -21 82
7113H2j94J23R9K2P9l22R7q9J6J79k93P8R8J81j4j36K6l6j32k3n4N48m99K82k51
$$ 82 -112 11 110 132 211 -111 -14 -103 -87 92 -201 -123 -25 156 142 6 32 -4 -136 -159 -213 335 -164 118 -133
7138a33R9j95M96j81l81K47j45K23l38L22K4J42k04L0J56k69L1j12P5J99j85J09
$$ -133 -34 -229 267 86 -295 -48 -193 30 -308 14 38 180 -24 6 162 -107 -76 -188 -113 86 -99 10
7160A0q0K27m4l0r3J04l76M06m18N17j42j90K55j70Q2J10j57p8P3j31J84J25j20
$$ 10 -70 157 113 83 -10 94 -282 124 -294 223 81 -109 146 -24 58 168 11 -67 6 -125 59 184 64
7183F4K0k07L06l49N06n06J28R5P4j62J61j54J3j52K64L3k08J51k41J11J27j1
$$ 64 84 -123 183 -166 340 -166 -38 57 131 -31 130 -24 -11 -163 101 134 -74 77 -164 -53 74 63
7205F3J9J33k63O3K50k25K48L1l73o0r6L84k13K71k29J82p9J04l45L05k50R9J66
$$ 63 82 215 -48 15 265 40 288 319 -54 -114 -210 174 -39 232 3 185 106 210 -135 170 -80 19 185
7228A85k85J57J2k91P0L22j48n9J62n8O0j62J86j34M2j41N1J00p4k24r4L74Q2
$$ 185 -100 57 69 -222 -152 170 22 -37 125 67 127 -35 151 17 59 -82 -31 69 -5 -229 -323 51 133
7251A33k78P1j37K92j6J9N7k9j21k01K60k52K6J56O7j82K55J1R1k77N0L0j44J52
$$ 133 -145 -74 -211 81 65 84 141 112 -9 -210 50 -202 -176 -20 47 -135 120 131 222 -55 -5 25 -119 33
7275C3m1N0l11J64J41k33m4M71j36J89l96K89q3r5n0J71J13l00J30m8K27m38K36
$$ 33 -8 42 -269 -105 36 -197 -241 230 94 283 -113 176 93 -2 -52 119 232 -68 62 14 241 -197 39
7298C9j5P0q2j14K01l34L5K08q0L3L71l83O0J37q2k18K4J26R5k31J83k0K3j56
$$ 39 24 94 12 -102 99 -235 -200 8 -72 -39 332 -51 9 146 64 -154 -130 -4 91 -140 43 23 46 -110
7322a10K4k08K26J58l19O9k9J93j28L57l82K15l86M81l35K4N8J63J15k80J45j
$$ -110 -86 -294 -68 90 -229 -160 -189 4 -124 233 -149 66 -320 161 -174 -150 -92 71 186 -94 51 50
7344E0j56J04j37J74K06k93P3j00Q4J49j15j56l7OJ28J30J2l10L28j66Pl8j24
$$ 50 -106 -2 -139 35 241 -52 21 -79 5 154 39 -117 -154 -148 -20 110 122 -188 140 -26 -19 -57 -181
7367a81L13k97K67j31N7k5j87J92J41m89M66j8j04O8k07K68l57J86P4j34j11Q4
$$ -181 132 -165 102 -29 28 3 -184 8 149 -340 126 108 4 72 -135 133 -224 -38 36 -98 -209 -125
7389a25J71j78K2KJ32L1k35M6Q0q4J40l33K29N28n35K54k20J88J0n0j33k69M01
$$ -125 46 -132 -110 -108 24 55 -180 -134 -54 -138 2 -331 -102 426 -109 145 -75 113 123 73 -60 -329 72
7412G2j2Q6k01K12p5j1K2k87K10r7K1J37j02K74l54K03n3M6k79J12J33j0k02M91
$$ 72 60 146 -55 157 82 71 93 -194 16 -81 -60 77 -25 249 -105 98 45 91 -188 -76 57 47 -155 336
7436C36l25Kp7k7J68Q4j65q9J55%J53k28J98r3PJ9j68L9K6j36p2K12P3l87N29
$$ 336 11 13 -64 -91 77 161 -4 -93 62 62 215 -13 185 92 99 118 -50 -11 15 -121 -193 19 92 -295 234
7461B34J46m69j58L59o4J11m48M00r2k58L51j84j25K37%Q7r0j4p9j4j10J42n0
$$ 234 380 -89 -247 112 48 159 -289 111 19 -239 112 -72 -197 40 40 127 37 23 -56 -70 -180 -38 -88
7484h8K54k92K45O4k47K22l85o3M36j73K48j0m06J39j8K47K6Jj98J77M6k46j37
$$ -88 166 -126 119 183 -64 158 -227 -290 146 -27 221 211 -195 -56 -74 173 199 200 2 179 225 -21 -158
7507a58J1K38k3j8j33o5l9K12k0lm4q6M1K7J23l1L02k72p4j26M3j63M33L4q7K7
$$ -158 -147 91 68 50 -83 -148 -187 25 5 2 -42 -128 -87 -60 63 32 334 62 -12 -138 -95 -258 175 209 122 149
7533A49j94M4j54J35j16j27L24j99k9K19k39J24O3p6Q0L20j37o8j51j98M38l7
$$ 149 -45 -1 -155 -20 -136 -263 61 -138 -167 52 -187 -63 0 -76 4 324 187 119 -32 -230 208 171
7555A71l32K18k41J30P6K3J62j87j37J27l2K1L8n2Qq4KK62q1j5j30j46L63J1k77
$$ 171 -161 57 -184 -54 22 45 207 20 -117 10 -22 -1 37 -15 -7 -91 -89 173 92 77 -53 -199 164 175 -102
7580a02L78M4l40j77K47j21k7J63o6r8Q3K68j00P1r3j24k9J19j1j9M5k70J36K5
$$ -102 276 320 -20 -197 50 -71 -98 65 -1 -99 -16 252 152 223 130 6 -23 96 85 66 111 -159 -23 2
7604Bn8P1j5K14l56M4J47J10Rl07R2L2J5L46k47j51m3J18j32J11K29j24j71r4
$$ 2 -56 15 0 214 -142 -98 49 159 168 -139 -47 -15 0 346 99 -52 -95 23 -109 2 231 107 -64 -158
7628a58N17k85L1k13J48r3J38j77J31l6lO8j97M5rO9K02k79o3O0J87j57NK04q0
$$ -158 359 74 105 -108 40 -53 85 -92 39 3 0 68 -129 -84 -93 -24 178 -101 -164 -104 83 -74 -69 135 55
7653E5j56L65l17J26j73l9J52J08k45j57L69k55K06Oj13K22j32J66l53J67K5k38
$$ 55 -101 264 -53 73 -100 -139 13 121 -124 -281 88 -167 39 45 -68 154 22 188 -165 2 27 -211
7675b11J37j19L38l92K08P5ml25J77K51L1j87l4l6M6K26k81J14M7K01j85j42K32
$$ -211 -74 -193 145 -247 -39 36 32 -293 -116 135 166 -21 -55 -91 -45 181 -100 14 61 262 77 -65 167
7698A67j33K7m8J75q3K2k32r9k2L8qJ11K95o2j39J80j30l5k77K70J13o6M4j45
$$ 167 34 61 13 188 105 127 -105 -204 -226 -188 -196 -85 210 148 9 189 59 24 -253 17 130 64 108 -37
7722c7Q3j82N6PJ62q0k6O3J6o1j5j67N2J67l4J8J34j53J52j22J30j26J83j47K2
$$ -37 46 -136 -80 -73 89 9 -17 46 62 1 -14 -181 -129 38 4 22 156 3 155 33 163 37 220 73 95
7747I5p2rO7L5j24l8k30L03R8nl30J12O6j63J9j11K32J62l2l02N43j74j55L02
$$ 95 23 14 81 116 -8 -46 -276 27 125 120 -210 -98 -32 -195 -176 -287 -55 107 75 -227 316 142 -13 289
7771B89r2l22oK12k79L30j96L28j37k11J77%n0j4L2j57J40r6K27k40J24j19J09
$$ 289 197 -125 -131 81 -198 132 -64 264 127 -84 93 93 43 29 61 -96 44 -52 175 -65 59 -60 49
7794D9j31L4m4L15j81j45J3L22k58j01K05l01K57k28K09kn0L3j43L45l6J8l9j56
$$ 49 -82 -48 -92 223 42 -103 -90 232 -26 -127 78 -223 34 -194 15 13 -37 -4 -147 198 162 180 141 -15
7818a5j7r6P2%K33l08L09j72J13p1j11j69J07J92J85j04j20J22N1k45O9R2j55
$$ -15 -32 -128 -56 -56 177 -131 178 6 119 48 -63 -232 -125 67 252 148 28 150 201 -44 25 117 -38
7841c8j06M5n9nJ41j9J25j56J66L23l51j03j36j21M24p2j65K1M91m70O4l7K38
$$ -38 -144 -99 -158 -163 -22 -41 84 -72 94 417 66 -37 -173 -294 130 58 -107 -86 405 -65 -1 -38 200
7864B00j64k20L15Q7k79j10K04N0L3k10J4O6J19lQ4r2R6l58K56j75q2J49R0l1
$$ 200 36 -184 131 218 -61 -171 33 83 116 -94 -80 -14 105 102 186 94 190 -168 88 -87 -169 -20 70 39
7888C9r2M36k01m45J62J10k04K28K0j96J19J49kkk58N2K88l05l98M74J92q2n6
$$ 39 -53 383 182 -263 -101 9 -195 33 53 -143 -24 125 123 121 -137 -85 203 -102 -500 -26 166 84 28
7911B8j04K64j73n3K23O4l68N8j36J52m9l0L5K98j07k68O8J36Q5j31O6L7j19L65
$$ 28 -76 188 15 -38 185 249 -119 -61 -197 -45 -94 -124 -89 209 102 -166 -98 38 123 -8 58 95 -24 341
7935C41l98n4J25k32k0Q3K62o8J87n08K42%K18j98j68P9Q3o5J42k50J41o6J89
$$ 341 -57 -111 14 -218 -238 -155 107 39 226 -282 -40 -40 178 -20 -188 -109 -26 -91 51 -199 -58 -124 65
7958F5k6L7j23q5r3Q4L47q5J85k73P7j27K9l61M28o6n3N3k56J39J15K59k24J57
$$ 65 39 76 -47 -132 -225 -141 206 121 306 33 110 -17 12 -349 79 13 -40 13 -243 -104 11 270 46 203
7982B03j81RK5L02l03j03L1p4Q6m2L5r0K23K8k80J51l3j93mM29l63J14k0j26K06
$$ 203 22 31 56 358 55 -48 -17 -91 -5 -47 -12 -102 121 149 -131 20 -13 -206 -210 219 -144 -30 -50 -176 30
8007C0j11j1J71k40K17L7J07j29k09M85m44R1P6L6k75L03j49p8J07l6M4P2k21
$$ 30 -81 -92 79 -161 56 93 200 71 -138 347 -97 -6 70 106 -169 134 -15 -93 14 -22 22 94 -127
8030a27J82O2j56J3pR0Q3r5k83J91mJ04k16K74k4k73R1K38n1p8m4j50M10j43L7
$$ -127 55 117 -39 -26 -33 57 140 45 -238 -47 -51 53 -163 111 87 -186 -95 143 92 14 -30 -180 230 87 124
8055A24m15M90k49J56k30L30k92L3n5J34J61l35L42l37K74j65oN4j18J75Jj57
$$ 124 -291 199 -50 106 -124 206 -86 -53 -108 26 187 -148 194 -143 131 -34 -40 14 -104 71 72 -85
8077h5J29j26Q7j72L9K9o7qK76j93J38J66o2k23p8q2M44k97j02P3Q0Mn6P1k00
$$ -85 44 -82 5 -167 -128 -99 -166 -174 102 -91 47 213 151 -72 -150 -232 212 -85 -187 -114 -34 -30 -86 -15 -215
8102b15R6L2k66K42J93l94L97l83L17r6J10o8k6J38J19k13Lj19pN24l53j2K21
$$ -215 -119 -87 -353 -111 82 -312 85 -298 19 -77 33 -35 -61 77 196 -17 -14 -133 -140 384 31 19 240
8125B40m00J18K23j74p8K80j2k09K11k13k59L13k03L38j23k76K08K4Qo5N1J59
$$ 240 -160 -42 181 7 -71 209 197 -12 199 -14 -273 40 -163 175 52 -224 -16 8 16 -49 2 161
8147A61k71M8O9k05J23K19k0J6k53J54p6J19J56n05M62l22J88M8l2k14J61K26
$$ 161 -110 -62 7 -198 -75 144 124 140 -113 41 -35 84 240 -265 197 -125 63 111 79 -135 26 252
8169B52j46l68J73L64m87O1K45n8k01K19m04M03Q4lJ6J49l15q8j78K48J6n8
$$ 252 106 -262 -89 275 -212 -151 94 36 -165 54 -350 53 137 134 150 299 -16 -104 -282 -34 -18 -76
8191g6
$$ Imaginary data points
##PAGE= N=2
##DATA TABLE= (X++(I..I)), XYDATA
0@%%%%%%%%%%%qJ6j6J6j6K4l2L2m0M8n6P2q8J04j20J36j56J80k08K40k72L08l50
$$ 0 0 0 0 0 0 0 0 0 0 0 0 -8 8 -8 8 -8 16 -16 16 -24 24 -32 40 -48 56 -64 72 -84 96 -112 128 -144 164 -186
34a86L96m46N02n64O30p03P83q71R67j072J187j312J448j597J762j941K138k355
$$ -186 210 -236 266 -298 332 -371 412 -459 508 -564 623 -689 759 -838 924 -1017 1121 -1234
52a234K595k864L163l498L878m312M814n403O107o960Q023r392J1223j3822J7821
$$ -1234 1361 -1503 1660 -1838 2040 -2272 2542 -2861 3246 -3714 4309 -5083 6140 -7682 10139
67A0139k4831M0634j42175L9449K68147j52630j57293Q9676J41702j01185q8587
$$ 10139 -14692 25942 -116233 -76784 191363 38733 -118560 -28884 112818 11633 -76954
78g6954P5991P4589q5445m4269P5866L9624r2666m1456Q2654O5612o3702o1793
$$ -76954 -963 73626 -11819 -56088 19778 59402 -33264 -74720 7934 73546 9844 -51949
90e1949L8720N1480l7994l4023L9028K4580m4548o060M9879l023o4551K249P0682
$$ -51949 -13229 38251 257 -33766 5262 29842 -14706 -20766 29113 26090 -38461 -36212 34470
103C4470J4662o3387k8447L9464K9087j8974k2440N004J7654N281j2733q148M428
$$ 34470 49132 -14255 -42702 -3238 25849 6875 -15565 -10561 7093 12374 -359 -8507 -4079
116d079p45J81K1630Q512l7690k4649L9519L6365l1900l7416K4376L1572k1362
$$ -4079 -4824 -4643 16987 25499 -12191 -36840 2679 39044 7144 -30272 -5896 25676 4314
129D314k6284J5612J6791j1327l718J3504m601k2662P36L1398J6597k4059k6763
$$ 4314 -21970 -6358 10433 -894 -4612 8892 4291 -18371 -17635 13763 30360 6301 -20462
142b0462J1409K5359m541k3209k745J4245O310k853m244r406m929J9513K0493
$$ -20462 -9053 16306 11765 -11444 -14189 56 6366 3513 -731 -10137 -15066 4447 24940
155B4940j6245k7356Q390K3648m435j6558J549R344Nj320M80o152p606O673J5196
$$ 24940 8695 -18661 -10271 13377 8942 -7616 -6067 3277 3282 1962 2442 -3710 -11316 -4643 10553
170A0553K455j3629j1942L318J4121O349j1440j0576Q992J3777m647j5356l078
$$ 10553 13008 -621 -12563 -9245 4876 11225 -215 -10791 -1799 11978 7331 -8025 -11103
183a1103J0268J0115L89r686r638J196R765P370m214r387k391P395N954m619r502
$$ -11103 -835 9280 9669 -17 -9655 -8459 1306 8676 4462 -4925 -7316 79 6033 1414 -8088
198h088J342J3194M826r604q643J904O156N283L75p959p725L607Q796l88p519
$$ -8088 -6746 6448 11274 1670 -6973 -5069 1087 6370 6745 -1214 -8939 -5332 3464 3076 -4443
213d443j402O977M503j331l794m609j163P542P600n661j1889j411J0282N957o710
$$ -4443 -5845 1132 5635 4304 510 -4099 -5262 2280 9880 4219 -7670 -9081 1201 7158 448
228D48p643L751R989P49r455p069M317R750K662m917n961p69L136L115Q2k196
$$ 448 -7195 -3444 6545 7294 -2161 -9230 -4913 4837 7499 2582 -3379 -4148 -1012 2103 2185 -11
244a1j180J137J445N14l274l499J946P838K541p699p917L022R063K724n993m901
$$ -11 -1191 -54 1391 1905 -1369 -4868 -2922 4916 7457 -242 -8159 -5137 3926 6650 657 -4244
260d244J158N097K112m355m268K601O581J393n663n315Q38L986L129j245l222
$$ -4244 -3086 2011 4123 -232 -4500 -1899 4682 6075 412 -4903 -4065 -79 3050 1805 -1417
275a417k778K611M711k16m815j250N067L938l211n720k153L968L966k39k966k308
$$ -1417 -4195 -1584 3127 2911 -1904 -3154 1913 5851 2640 -3080 -5233 -1265 2701 2462 -504 -2812
291b812K82K539J940j090k016M02K814O48k743l926M91M952L678k288n881k316
$$ -2812 -2530 9 1949 859 -1157 -755 2059 2707 -36 -3962 -3471 1481 5159 2871 -3010 -5326
307e326M534M698k393m274O65L935Q94l497k480J556L173J526j135l141j541J699
$$ -5326 -792 3906 1513 -2761 -2096 1839 2733 -764 -3244 -1688 1485 3011 1876 -1265 -2806 -1107
323a107K455M38j455j369j28J260J754j399k602K28L715K008l513m259N59M938
$$ -1107 1348 1786 331 -1038 -1166 94 1848 449 -2153 -1925 1790 3798 285 -3974 -3415 1523
339A523J512k629k117Q85K283J43j504j191M50J497R38j284k742j120K259K607
$$ 1523 3035 406 -1711 -826 1457 1600 96 -1095 -645 852 1790 506 -2236 -3356 -1097 1510
355A510O18j685j809N39J647Q91j726j428J190K067m93l443r27K616K240N5j826
$$ 1510 2128 443 -1366 -827 820 1711 -15 -1443 -253 1814 1321 -2122 -3049 -433 1807 1862 36
372C6j082k39J354J141k2j500r70J511J105p03j945p6J531J830j64k921j084J796
$$ 36 -1046 -1285 69 1210 1188 -312 -1282 229 1334 631 -1314 -1390 141 1971 1807 -1114 -2198 -402
390d02K090q04j962m71K086Q06j297j203K37J340L80q1m78j019n41J033J672k49
$$ -402 1688 884 -1078 -1549 537 1343 46 -1157 -920 420 800 719 241 -778 -1319 -286 1386 1137
408A137j760l92J309P66j069j265K30J677O64j261j596K48K287J390j546j464
$$ 1137 -623 -1015 294 1060 -9 -1274 -1044 633 1297 36 -1560 -1312 975 2365 819 -645
424f45r7J101m83J95l52n8q9N65K35o47p00M88J492K52j172j266L08J525L22j071
$$ -645 -742 359 -124 71 -281 -339 -428 137 372 -275 -975 -487 1005 1257 85 -1181 -873 652 974 -97
444i7n66L40O57O8p85o73O97J096K87j096p53j82L63Q26M47k97m60l40Q98J75
$$ -97 -663 -323 334 402 -383 -1056 -359 737 1024 -72 -825 -1007 -644 182 629 332 -128 -468 430 605
464F05r81m72J318P08n85j226m62N70J124J21n80o87Q25k49k72k94O35J12j02
$$ 605 -376 -848 470 1178 593 -633 -1095 -525 599 720 140 -547 278 29 -243 -537 98 210 108
483A08K05J00o96q8N48N16n7p22p68M08N04j1n30n6R48N04q90n46L56L82L22n20
$$ 108 313 413 -283 -371 177 693 636 -86 -854 -446 58 47 -483 -539 409 913 23 -523 -167 215 537 17
505A7j34l78K31J76n3k14L31O5l22N55r2q30J35R96J55m55p69J1P43J06O4m52
$$ 17 -117 -495 -264 -88 -141 -355 -24 41 -281 274 182 -648 -513 483 638 183 -586 -575 168 274 338 -114
527a14J52O8J81m00m28N30P9R0p3n3l30m43J229q8m00k06K06k58N57l09r9J35
$$ -114 38 106 287 -113 -541 -11 68 158 85 32 -298 -741 488 400 0 -206 0 -258 299 -10 -109 26
549B6M66m02k09o71O80L01j09l31J56K1k37K71J46k39M24N1j17K5l48l05J93K69
$$ 26 492 90 -119 -790 -110 191 82 -249 -93 -72 -309 -38 108 -131 293 344 227 252 -96 -401 -208 61
571F1N89m07r77Q25K36k79k02J34J65L12n14k98L85J07K98m81J94j63l15N5M05
$$ 61 650 243 -734 91 327 48 -154 -20 145 457 -57 -355 30 137 435 -46 148 -15 -330 -275 130
592A30K14k16l09n8k9K32Mq7Q5M26m25m77K76L50Q2k38l6N1L41l70K79l07L23
$$ 130 344 128 -181 -239 -268 -36 -32 -119 -34 392 -33 -510 -234 116 198 -40 -76 -25 316 -54 225 -82 241
615B41l39R9krm28J37Q2Q82l59j72j68K08l6k68K86j60M20n05Q0k63L63l57M23
$$ 241 -98 1 -1 -10 -438 -301 -219 663 304 132 -36 172 136 -132 154 -6 414 -91 -11 -274 89 -268 155
638A55l35M25l09K13l07L01K73l25R8m17O0NJ70P2J26K6P2o23K37L91l33o8L25
$$ 155 -180 245 -64 149 -158 143 416 91 189 -228 -168 -163 7 79 205 231 303 -320 -83 308 -25 -93 232
661B32j2j55l58jK36J01J90k69l6K10k46J11P3J80j09m46J93P0J73k38K68j87
$$ 232 220 65 -293 -294 -58 43 233 -36 -72 138 -108 3 76 256 147 -299 -106 -36 137 -101 167 -20
683b0K15k09j57K57j17J66l26M44l30J46r8P3l3j2k65K02M79m11j93M59k55L45
$$ -20 195 -14 -171 86 -31 135 -191 253 -77 69 -29 44 11 -1 -266 -64 415 4 -189 270 15 360
705C60k96j41r5O6J10q9j04L77q2m8k72J70R7j59J89K6j39P6on08M99j74K84j68
$$ 360 64 -77 -172 -106 4 -85 -189 188 106 58 -214 -44 53 -106 83 109 -30 46 40 -468 31 -143 141 -27
729b7K4J85k14o0RJ85J44l21j05J30m7j57N34l00L16k12j60N0p3N05n74K03K18
$$ -27 -3 182 -32 -92 -83 102 246 -75 -180 -50 -97 -254 280 -20 296 84 -76 -26 -99 406 -168 35 253
752B53m11J00J83M2j35n8n7M0M3J61l92M35r7r9J3J53P4j86L7J63n29L59j80K55
$$ 253 -158 -58 125 167 32 -26 -83 -43 0 161 -231 204 107 8 21 174 248 62 99 262 -267 92 -88 167
776A67m45J01J08J81j14J80J36k80J84j61n9K38j12l8p5J32n43O75l96Q3K2j70
$$ 167 -278 -177 -69 112 -2 178 314 34 218 57 -2 236 124 86 11 143 -400 275 -121 -38 -16 -186
798a86R1J16K23n4j52M9k36J5RJ15J06n9O2l29K60N9m6r6K32p0j74j21K9K39r8
$$ -186 -95 21 244 190 38 87 -149 -134 -125 -10 96 37 99 -230 30 89 43 -53 179 109 -65 -186 -157 82 -16
823a6N9l7J46j84j55M0K82j57q8k11J27L37j57k19K82K6j50j31J19J97j60q8J53
$$ -16 43 6 152 -32 -187 -147 135 -22 -110 -321 -194 143 -14 -233 49 75 -75 -206 -87 110 -50 -138 15
846A5J01J86k54j55p4K75J02l54K24J52k33K34j54N6J37l19K7n0J88j06Oo7m8
$$ 15 116 302 48 -107 -181 94 196 -158 66 218 -15 219 65 121 258 -61 -34 -84 104 -2 4 -63 -111
869a11R5R8o0kK03Q0k97j39J37Kn5K54j27m4J61j32Q7l7l21J59J70k0k95K04L3
$$ -111 -16 82 22 20 223 303 6 -133 4 6 -49 205 78 34 195 63 150 113 -208 -49 121 101 -194 10 43
894D3k2K34l82o0J42J21l63J45K34J5K4l08R8k2K27j89kL45k41J27m1p1K5j29
$$ 43 21 255 -127 -187 -45 76 -287 -142 92 107 131 -177 -79 -101 126 -63 -65 280 39 166 125 54 79 -50
918e0L48l69J15n8J42n2qJ6O4k28K60j27k08K83j79J27j92K6K38j3k22m7J11K44
$$ -50 298 -71 44 -14 128 76 68 84 148 -80 180 53 -155 128 -51 76 -116 -90 148 135 -87 -134 -23 221
942B21j07l31P8L31j89k7j23J75K5o9nQ3l2K2k96r3M4J31J26l6N3K48l62L77k44
$$ 221 114 -217 -139 192 3 -24 -147 28 53 -16 -21 62 30 52 -244 -337 -293 -162 -36 -72 -19 229 -133 244 0
967@J71l32J81l6q9K83j01k22J08n4KK98n3l3j04qk42L21N0k71n1J9j12N3J23
$$ 0 171 -161 20 -16 -105 178 77 -145 -37 -91 -89 209 156 123 19 11 -231 90 140 -131 -182 -163 -275 -222 -99
992i9N8j13J17J6J65j92K67k01O0P9l10L3l9J7J33n4Kp6K50j46k33L21N9p1j44
$$ -99 -41 -154 -37 -21 144 -48 219 18 78 157 -153 -120 -159 -142 -9 -63 -61 -137 113 -33 -266 55 114 43 -101
1017a01L0R4P0r5J39j74R6j91K68l8K44l06o7r3j6R2m8J79L70n01J27K00m03Q1
$$ -101 -71 23 93 -2 137 -37 59 -132 136 98 342 36 -31 -124 -140 -48 -96 83 453 -48 79 279 -124 -43
1041d3M3J54J6k61J8j64L46j10K60k77P9JN6j57Q2j46K70M3J25l68M2j1n6j1j0
$$ -43 0 154 170 -91 -73 -237 109 -1 259 -18 61 62 118 -39 43 -103 167 210 335 -33 9 -2 -58 -69 -79
1066g9J19j73j14L51O3k11J10k71M84l10O6k19K38J25j02j13N8l5j14J68M4j25
$$ -79 40 -133 -247 104 167 -44 66 -205 279 -31 35 -184 54 179 77 -36 22 -13 -127 41 85 -40
1088d0L02l43R5j16P5l69L87Q9k09J14R3k7l2J07J41k68k5k72K74J22k40J37K75
$$ -40 262 -81 14 -102 -27 -396 -9 80 -129 -15 78 51 19 126 267 -1 -26 -298 -24 98 -142 -5 270
1111B70l57q6J40r3J38j18J15m8r7M2N6P3O5n0o3R1r2j1k0J76k14JL19j88l8k3
$$ 270 -87 -173 -33 -126 12 -106 9 -39 -136 -94 -38 35 100 50 -13 78 -14 -25 -45 131 -83 -82 237 49 11 -12
1137a2J05K1j30n9p5J31L79l11Q5j01l03L04K31l12l0Q5q3R3N4l66M54j31k34
$$ -12 93 114 -16 -75 -150 -19 360 49 134 33 -270 34 265 -47 -77 8 -75 18 72 -294 160 29 -205
1160b05J06nM0Q7q9Q5K88k43QM2p0Q0J01m76K94L2j36LJ26J44k56j07J55j74K4
$$ -205 -99 -104 -64 23 -66 19 307 64 72 114 44 124 225 -251 43 75 -61 -58 68 212 -44 -151 4 -170 -146
1185a46K35k99Q0P6L30r0j99j09J41k2k6j00K6o5L42l19j70O06j42j32K0k45R
$$ -146 89 -210 -130 -54 276 186 -13 -122 19 -3 -29 -129 -103 -168 174 -145 -315 291 149 17 37 -208 -199
1208a99R8J34k07j1N03l80Q9j92K37J24m3l83L91m85K08J64J4r7m3J8o7K52j85
$$ -199 -101 33 -174 -185 318 -62 27 -165 72 196 153 -230 161 -324 -116 48 62 -35 -78 -60 -127 125 -60
1231f0K34j37J42l03K11k77N69l69j00M4K24K1k66K4J46o6k7J65o0k62J04lm4
$$ -60 174 37 179 -124 87 -190 379 10 -90 -46 178 199 -67 -43 103 37 10 175 115 -147 -43 -46 -90
1254i0M29m07P0L8o6K40j27M3k05N4o7J14l13Q6J26p1L50k16K45k97J64P2k13
$$ -90 339 -68 2 40 -26 214 87 130 -75 -21 -88 26 -287 -201 -75 -146 204 -12 233 -64 100 172 -41
1277d1J42k56K80m79L82l0j35K96P5k71K22k42j27J67O3r1J0j9J98k14J17l11
$$ -41 101 -155 125 -354 28 -2 -137 159 234 -37 185 -57 -184 -17 46 -45 -35 -54 144 -70 47 -264
1299b64R7q4K52k6O0m0r2J72k69K87j22J04n6p3J05Jj1J2o9J80j24r2J07k13K57
$$ -264 -167 -251 1 -25 35 -5 -97 75 -194 93 -29 75 19 -54 51 52 41 53 -16 164 40 -52 55 -158 99
1324I9k37pK83j73o9J76j4k09K16K1M7j85J4lr0J33n1m3j76J55L7J82J06j61j39
$$ 99 -138 -145 138 -35 -104 72 58 -151 65 86 133 -52 -38 -41 -131 2 -49 -92 -268 -113 -76 106 212 51 -88
1349h8q1L66m85K58j32J30q2J99p1K68l22N4K08k53o0j7L87j20k96J11L2j81K34
$$ -88 -169 197 -288 -30 -162 -32 -114 85 14 282 -40 14 222 -31 -91 -108 279 159 -137 -26 6 -175 59
1372E9k04J7J2l3n3K70j16J31j86Q1J49k30j26J26N2K6l6Q7j4J51l89L82j38O8
$$ 59 -145 -128 -116 -149 -202 68 -48 83 -103 -22 127 -103 -229 -103 -51 -25 -61 26 12 163 -226 156 18 86
1396H6j37O2o4J24L4k69J22L14n10K65r5j83K85j21M8R8o3J5Q0m05k6o0M49k90
$$ 86 -51 11 -53 71 105 -164 -42 272 -238 27 -68 -251 34 -87 -39 59 -4 11 91 -314 -340 -400 49 -241
1420b41J33L63m8k56j54K66Q6n4j74k07j48K82L32Rk43P2l3j51m1M34J0j15j61
$$ -241 -108 255 207 -49 -203 63 149 95 -79 -286 -434 -152 180 189 -54 18 -15 -166 -207 227 237 122 -39
1443c9m4l2L58l82Q9K42j66M7l03K82N3k92K6M69l37j3J21p4j32Q0q2J38M8k26
$$ -39 -83 -115 243 -139 -50 192 26 73 -230 52 105 -187 -161 308 -29 -42 79 5 -127 -47 -129 9 57 -169
1467a69K66j15j4M5j38J52q6J22j40R1q4J71L5j28J09l9j73J39QJ06k13R7J39
$$ -169 97 -18 -32 13 -125 27 -59 63 -77 14 -70 101 136 8 117 78 -95 44 52 158 -55 42 181
1490A81N5k96J67k69J59k42J24M6L15k3k17j55L56l62J10l6J83J06k9k06O2l8
$$ 181 236 -60 107 -162 -3 -245 -121 -75 240 217 0 -155 201 -161 -51 -87 96 202 173 -33 29 -9
1512ij78N2N6J38k40J56k16K12O6k39K62M4j87K28j20J1j70J23k29j3K64k6J13
$$ -9 -187 -135 -79 59 -181 -25 -241 -29 37 -202 60 104 -83 145 25 36 -134 -11 -240 -253 11 -15 98
1535I8QL4L4k20K41k17MK2p8K73k37QM3k8K22l60K7K31k42M8J18j25J97J9J61
$$ 98 106 140 174 -46 195 -22 -18 4 -74 199 -38 -30 13 -15 207 -153 -126 105 -137 -89 29 -96 101 120 281
1560B81j28j43m4R3J76k41m2LJ44K32l14o7K9M5J49j35m6J08j3l1j10L70k05k15
$$ 281 153 10 -34 59 235 -6 -48 -45 99 331 17 -50 -21 24 173 38 -8 100 87 56 -54 316 111 -104
1584a04%O9J24m00K55K22k57J1K07j65p7P8P2M0R9j70L05m00K24j4om6J31qk29
$$ -104 -104 -35 89 -311 -56 166 -91 -80 127 -38 -115 -37 35 75 174 4 309 -91 133 119 113 67 198 190 -39
1609c9m9r4L53l46m2L39m66O19j48j81Q0j35R1P5k33J26J37M2J39l67J28Or2J2
$$ -39 -88 -182 171 -175 -217 122 -344 275 127 -54 26 -109 -18 57 -176 -50 87 129 268 -99 29 35 -57 -45
1633d5o0L32k37R9k28J31K28m24L07m9J45j02j16j94K02l9K19j02J88k49O3l0
$$ -45 -105 227 -10 89 -139 -8 220 -204 103 54 199 97 -19 -213 -11 -50 169 67 255 6 69 39
1655C9R2N9J67k68o1j61K7pJ84o3k9r8J77p0O0o1k7J11l71J43N8l7K08m4k8k12
$$ 39 131 190 357 89 28 -133 -106 -113 71 8 -21 -119 58 -12 48 -13 -40 71 -300 -157 -99 -136 72 28 0 -212
1681b12j16J80Jo1J22k5K21K6J86n67M58j25K5q3j3k1N5K9j81R7Q5j68K06m1j61
$$ -212 -328 -148 -147 -208 -86 -111 110 136 322 -245 213 88 113 30 17 -4 51 80 -101 -4 81 -87 119 78 -83
1706h3m2L2j33M39o5l88L32o3k88J70K5K23K6j67p2j82mJ28N6K08k75j02J96J72
$$ -83 -125 -93 -226 213 148 -240 92 29 -259 -89 -64 159 185 18 -54 -236 -240 -112 -56 152 -123 -225 -29 143
1730A43n8r9Q9Q5k73j38K31L1J31r6k32N1J75j08p6k2o7J21l4L1j59J98L01k16
$$ 143 85 -14 75 160 -113 -251 -20 11 142 46 -186 -135 40 -68 -144 -166 -233 -112 -146 -115 -274 -76 225 9
1754Ik3j38J24N1j1J58l25j6M40j90j96%R7M53l86K16o6k64R1l5J40k41K98j89
$$ 9 -14 -152 -28 23 12 170 -155 -171 269 79 -117 -117 -20 433 47 263 197 -67 24 -11 129 -112 186 -3
1778cQ3k64O5K98k42J26j30o9L90m40J76j13K38n2r5q3q5L77m4j42J96j09p6l
$$ -3 80 -184 -119 179 -63 63 -67 -136 254 -186 -10 -123 115 63 -32 -115 -200 177 133 -9 187 78 2 -1
1802ak52J94j07K70J15jJ3n04K05q0J10jq3O4K2K1J4J95l02K48O7k05n2J35j15
$$ -1 -253 -59 -166 104 219 218 231 -273 -68 -148 -38 -39 -122 -58 -36 -15 -1 194 -108 140 207 2 -50 85 -30
1827c0j08K54L0l50K44M2k37J59j05K51l00J11L44J2l60O7n0J47j20j57L27k82
$$ -30 -138 116 146 -204 40 82 -155 4 -101 150 -150 -39 305 317 -43 24 -26 121 1 -156 171 -111
1849a11J78J1P0j88L4k25L43j62Jj66N7J25j87K62J10j32j44J60j49K39r8Q4o9
$$ -111 67 78 148 -40 -6 -231 112 -50 -49 -215 -158 -33 -220 42 152 20 -124 36 -113 126 28 112 43
1872D3j27P5j3J76j02j76J91k6k27P4J80N7k30L6J4J5j61L88l15j7q5L40k28l
$$ 43 -84 -9 -22 154 52 -124 67 41 -186 -112 68 125 -105 -69 -55 -40 -201 187 -128 -145 -230 110 -118 -121
1896a21J24j4j6J25l00K27j57K7J87j53K0J35Npp6k38N07l02j31M43j27l49L93
$$ -121 3 -11 -27 98 -202 25 -132 -105 82 -71 -51 84 89 82 6 -232 275 -27 -158 285 158 -191 202
1919B02k17L2J93k05p6Q2K22l40L33j53K5j48O0K6j14p6Q7J59M6J71l72j4j50
$$ 202 -15 17 210 5 -71 11 233 -107 226 73 98 -50 10 36 -78 -154 -67 92 138 309 -63 -77 -227
1942b27M38N3l37r1R2K05j41n0L10m18M13l73K06l8K58m61K07R4l11M46n66N31
$$ -227 211 264 -73 -164 -72 133 -8 -58 252 -166 247 -126 80 42 300 -161 46 140 -171 275 -291 240
1964B40l41l5J47j65N2L29k92L9O4j18L17k64KJ20K6l63j22M40J09k14K60o2p0
$$ 240 -101 -136 11 -154 -102 227 -65 -26 38 -80 237 -27 -25 95 121 -242 -364 76 185 -29 231 169 99
1987I9k51Q6Q0P6j05K05l29K82l61O5K46j50%J56r8m9n0O8j55J81j83R9M3q8q0
$$ 99 -152 -66 14 90 -15 190 -139 143 -218 -153 93 -57 -57 99 1 -48 -98 -30 -185 -4 -187 -88 -45 -133 -213
2012b13K91q8l1j48K49J22m07K26p4J33L7l5k30L03j42Q2J60l68K51l5j05k14
$$ -213 78 -10 -41 -189 60 182 -225 1 -73 60 97 62 -168 135 -7 75 235 -133 118 83 -22 -236
2034b36K24l5j19L9o4J53L3P1j38J35l12K84j38O1K40l21j07J28K62j39k50j44
$$ -236 -12 -47 -166 -127 -191 -38 -5 66 -72 63 -249 35 -103 -42 198 -123 -230 -102 160 21 -229 -373
2056c73O6J37Q8m5J12%J7J0q8m5N1o1j37M48j98j0O2m1M2Oj52J00J88K4j90%O9
$$ -373 -307 -170 -82 -127 -15 -15 2 12 -76 -121 -70 -131 -268 180 -18 -28 34 -7 35 41 -111 -11 177 201 11 11 80
2083H0k52L23k06J41k44J14K21j44k24K18P3K9j72p2O8Pl7o1K36j81o2J73j94
$$ 80 -172 151 -55 86 -158 -44 177 33 -191 27 100 129 -43 -115 -47 -40 -77 -138 98 -83 -145 28 -166
2106a66L37j17J7L0k18J91m3j39K17j36J33k7n1k55L08n4j30J80J05k21L4J20
$$ -166 171 54 71 101 -117 74 31 -108 109 -27 106 79 28 -227 81 27 -103 77 182 -39 -5 115
2128A15O1j38l22L23J25j79R1j7m0m2J48j21j14J99k6n6j56K15l2K2m0J12K2l19
$$ 115 176 38 -284 39 164 -15 76 59 19 -23 125 4 -110 89 63 7 -149 66 34 56 16 128 150 -169
2152a69K11Q6k12l8K37k13J89j87K17j32k9j2K00n3o2rJ66j18J45j46J88om26
$$ -169 42 128 -84 -122 115 -98 91 -96 121 -11 -40 -52 148 95 33 24 190 72 217 71 259 253 -173
2175a73J81J70O1k81KK75l25J00l4Q0j64K60k49K2O1J04j2j07k8j03L0K13j28
$$ -173 8 178 239 -42 -40 235 -90 10 -24 56 -108 152 -97 -75 -14 90 78 -29 -57 -160 -130 83 -45
2198d5jK02j6q8k58K57J03Jj0j96K16k92M2j0r6J18j25L44j34k71K31L36k91j45
$$ -45 -46 156 140 52 -206 51 154 155 145 -51 165 -127 -85 -95 -191 -73 -198 146 12 -259 -28 308 17 -128
2222a28l2L08m3P6r4k37K43j66J27j18K68l90M39l00j86N69l67j77N18l10o1K26
$$ -128 -160 148 105 181 87 -150 93 -73 54 -64 204 -186 253 -47 -233 336 -31 -208 310 0 -61 165
2244A65J1o6j40j42J79m5m82M54j46J30j04L3R3JO8J52q2Q8k51R4J29j77L11k34
$$ 165 176 110 -30 -172 7 -38 -520 -66 -212 -82 -186 -153 -60 -59 9 161 79 167 -84 10 139 -38 273 39
2268C9j98o2J28l0L15j82m4J11k42L06P1l45J07L8L3m0r3K84l93K32l02K64L14
$$ 39 -159 -221 -93 -123 192 10 -34 77 -165 141 212 -133 -26 12 45 5 -88 196 -197 35 -267 -3 311
2291C11l09k24K1N0M16k25k11K64l00J5K11K7J2j75Q7J39J24l35J64j63M0m2J00
$$ 311 2 -222 -201 -151 265 40 -171 93 -207 -192 19 46 58 -117 -30 109 233 -102 62 -101 -61 -103 -3
2314cJ1k18J41K00m77M18l95J69j46J81J47j89qp0J40j05M41j88J35l38J36m9
$$ -3 8 -210 -69 131 -346 72 -323 -154 -300 -119 28 -161 -169 -239 -99 -204 237 49 184 -154 -18 -67
2336f7Q0P0j29p6Q3L3r0%j63n7L63j67r9J14R1o8K3J41k61K30k41L36p3j76Kj91
$$ -67 13 83 -46 -122 -39 -6 -96 -96 -259 -316 47 -120 -219 -105 -14 -82 -59 82 -179 51 -190 146 73 -103 -101 -292
2362b92L06J06k1J56k82r4lJ92n0K7j54J77J91k70MRk12QK33k7P8J7j3J19m4k24
$$ -292 14 120 99 255 -27 -121 -124 68 18 45 -109 68 259 -11 -7 2 -210 -202 31 4 82 99 86 205 161 -63
2388f3j22L47l37P0K08Q3j66pk9k06n6O1R9K44l6j33J98j61L1j45K8m8K67l0l04
$$ -63 -185 162 -175 -105 103 186 20 13 -16 -222 -278 -217 -118 126 90 -43 155 -6 25 -120 -92 -140 127 97 -207
2413b07L13j61R8k4J3nJ25l17L07m5p7o6o4jO1k45J29K8J21J41m09J32J28p8J57
$$ -207 106 -55 43 19 32 27 152 -165 142 97 20 -46 -110 -111 -50 -295 -166 -138 -17 124 -285 -153 -25 -103 54
2438E4J5j65M7K44k99J71l38K02K10Q0p6k81k00M15O3j11%J53j10k6K84j30j62
$$ 54 69 -96 -49 195 -104 67 -271 -69 141 221 145 -136 -336 79 142 31 31 184 74 48 332 202 40
2461D0r0L2mL6r7mJ28J54j93n7J72k35R1n2L3J78k83L66j27m1R6j91K45j48p4
$$ 40 -50 -18 -22 14 -83 -87 41 195 2 -55 117 -118 -27 -79 -46 132 -151 215 88 47 143 -48 197 49 -25
2486b5n8J91k43O3J42p6K48l47J39j31l0J17j35J2Q0K24l31M53k37r2J09j95J59
$$ -25 -83 108 -135 -72 70 -6 242 -105 34 -97 -127 -10 -145 -133 -53 171 -160 293 56 -36 73 -122 37
2509C7j87J52ol00K47MK90p3k37K1M9q6N5L3j89K63j7n4P3j32K42k69K11q6k74
$$ 37 -150 2 -4 -304 -57 -53 237 164 -73 -52 -3 -89 -34 -1 -190 73 56 2 75 -57 185 -84 127 41 -233
2534b33K50n9n0R4RJ56k57K25m06L06l5j79R1J5J32k41L13K43k68n6O0l08K88
$$ -233 17 -42 -92 2 11 167 -90 135 -271 35 0 -179 -88 -73 59 -182 131 374 106 50 110 -198 90
2557I0j96l4P5J66l12L02l65N30o5j9l29J99j1l29M15k43R7J42kJ66j76l1l0m8
$$ 90 -106 -140 -65 101 -211 91 -274 256 191 172 -157 42 31 -298 117 -126 -29 113 111 277 101 70 40 -8
2581hj65J81Q5k83N2J99j45j2L30P3l99Q8L33l60P4k91L92j6k1k58J75k09M81
$$ -8 -173 8 93 -190 -138 61 -84 -96 234 307 -92 -4 329 -31 43 -248 144 128 107 -151 24 -185 296
2604B96k20k23J12p4P7K84k75j65L39j9j09p3K35k72K95l58J11o1R7j26K85l7
$$ 296 76 -147 -35 -109 -32 252 -23 -188 151 132 23 -50 185 -87 208 -150 -39 -100 -3 -129 156 119
2626A19k4K2o0Q4k75J90O9k16nMK54j80q0O7J15j0O1l3m4j24l2K79j49p5J28L1
$$ 119 95 117 57 141 -134 56 125 -91 -96 -92 162 -18 -98 -31 84 74 135 102 58 -66 -98 181 32 -43 85 116
2652A16Q3n1k02m3K76k27J22j88J56J12l74L75j27j60K78L4k51K37p7q6R3j33
$$ 116 199 148 -54 -97 179 -48 74 -114 42 154 -220 155 28 -132 146 180 -71 166 89 3 96 -37
2674c7k4J90j17P3j38k1j18Q1J37q3J18j25l9N8K09k8J27j7l47J67j51r8J50J27
$$ -37 -61 129 12 85 -53 -74 -192 -111 26 -57 61 -64 -103 -45 164 136 263 246 -101 66 -85 -183 -33 94
2698I4k9J62k58k1J32J49k16k22J62J3K55k24p6j81J79l55O11l60l0J66q0M2l5
$$ 94 65 227 -31 -52 80 229 13 -209 -47 -34 221 -3 -79 -260 -81 -436 175 -185 -215 -49 -129 -87 -122
2721a22K09l34K40k60M17k16J61Q7j40Q1j32jk36L51n4j27J70m41O27l76J12P2
$$ -122 87 -247 -7 -267 150 -66 95 182 42 123 -9 -10 -246 105 51 -76 94 -347 280 -96 16 88
2743H8o4k41M49l26p1P2O8J43j26O8k11N02k89o2M0J04J64k61O%r3P7k68J55J3
$$ 88 24 -217 232 -94 -165 -93 -25 118 -8 60 -151 351 62 0 40 144 308 47 53 53 -40 37 -231 -76 -63
2768f3P9L6Rk44mL63j64Q2l54M02k35r2J24Mj07M5p1LL50j87J69J12l7j94n2Q5
$$ -63 16 52 61 -183 -187 176 12 94 -260 142 -93 -185 -61 -57 -164 -119 -190 -187 163 -24 145 257 220 26 -26 59
2794E9j85J64r2J03J4l26J78J80j96N5M6p3J50l69M15l05J93J65k70L11m3j69
$$ 59 -126 38 -54 49 63 -263 -85 95 -101 -46 0 -73 77 -292 123 -182 11 176 -94 217 174 5
2816Emq6K33K5k92N21m74j53K35lo9M6J24j05O2k23J09J42q5O3L8m5j14RJ04j31
$$ 5 1 -85 148 173 -119 402 -72 -225 10 7 -62 -16 108 3 65 -158 -49 93 8 71 109 64 -50 -41 63 -68
2842f8j03K12R8k11P8k27L4J86J08O9l75L75l36L66j55K2n1Q4j77l7m7L82j48
$$ -68 -171 41 139 -72 6 -221 -187 -1 107 176 -199 176 -160 206 51 73 22 106 -71 -108 -155 227 79
2865G9J8k09K68j55K3l82J36K91J46k55L2L00m43J55k6k55M22J53l62K50m2k88
$$ 79 97 -112 156 1 24 -358 -222 69 215 -40 -8 292 -151 4 -22 -277 145 298 -64 186 144 -144
2887a44K31l47J90J58j8k27j44L42q0n2L0o9Jo8j26L49m3R9r1N9k00O7J13j84
$$ -144 87 -260 -70 88 70 -157 -301 41 -39 -91 -61 -130 -129 -197 -323 26 -17 82 -9 50 -150 -83 30 -154
2911a54K27j53J75j97J52o2j04L41l56J45j19K28j20j11K40J48k01k08J50l3k10
$$ -154 73 -80 95 -102 50 -12 -116 225 -131 14 -105 123 3 -108 132 280 79 -129 21 -12 -222
2932b22J27J32j30K04j33q2L60l17J62k71J54j2q6M14m15P2OJ86k09pJ90Ll40
$$ -222 -95 37 -93 111 -22 -104 256 -61 101 -170 -16 -28 -114 300 -115 -43 -37 149 -60 -67 123 126 -214
2955b14K73j9j26K17l79K64l6Q1j74Q8J12o8j21K41L7l21L67j60j25k74J23K23
$$ -214 59 40 -86 131 -248 16 -20 61 -113 -25 87 19 -102 139 176 -145 222 62 -63 -337 -214 9
2977IR3k10lJ99j12j04K30N3j59J37l00K27J82l6l44k12J24J66O7j18j14K57Q2
$$ 9 102 -108 -111 88 -24 -128 102 155 -4 133 -167 60 242 206 -138 -350 -226 -60 7 -111 -225 32 114
3000A14k0j22K87j43K29n58N43m14J14Q4j7J08k32K8j99J07J92k9j83K90r6l4
$$ 114 94 -28 259 116 345 -213 330 -84 30 114 97 205 -27 1 -198 -91 101 72 -111 179 83 49
3022D9n0r1K2l1MO2j80j12J82J5L19k20j2p4l8J56k94M47L0n0q1N3k65o6K93N2
$$ 49 -1 -92 -70 -101 -97 -35 -215 -327 -145 -130 189 -31 -43 -117 -155 1 -293 154 184 134 53 106 -159 -225 68 120
3048A20r6n4k04N27l38N5j97R5L70j97j75O2J24l74L84k31Q8j05M70m06J53o5
$$ 120 24 -30 -234 293 -45 10 -187 -92 278 81 -94 -32 92 -282 102 -129 -41 -146 324 -82 71 6
3070FK93k48J50l66K68R3k51J75k3P8l45J30J08J79k62l5j14p5J53J35k46L13
$$ 6 299 51 201 -165 103 196 -55 120 97 175 -170 -40 68 247 -15 -50 -164 -239 -86 49 -197 116
3092A16k65P8K37L4j5k22k81L92R0j48k7K16k38Q1k27qQ0J45j8Q9j19l5K65j01
$$ 116 -149 -71 166 200 185 -37 -318 74 164 16 -11 205 -33 48 -179 -187 -107 38 20 109 -10 -45 220 119
3116A19l16K19K36l76J03j36J34l7K08j74j37J52j79L16p9O7P7l5k8r6K01j72
$$ 119 -197 22 258 -118 -15 -151 -17 -54 154 -20 -157 -5 -184 132 53 120 197 162 134 38 239 67
3138F7j24N6j52N2J79j41%M4L08m81J6K86k74K97l46L30j17Q0j83R5Q2m28M62
$$ 67 -57 -1 -153 -101 78 -63 -63 -19 289 -192 -176 110 -164 133 -213 117 0 80 -103 -8 74 -354 108
3161A08j35R6k7j76J11J31L9q5N5q7J18k10P6k0M2K31k80J51k69Q5L3q3L6J9N
$$ 108 -27 69 42 -134 -23 108 147 62 117 30 148 -62 14 -6 36 267 -13 138 -131 -46 -13 -96 -60 -41 -36
3186c6L42j73m37K39M05j82k44O7Q7j2K07j10k74N4m5R2Q1l19J16l4J78l63N28
$$ -36 306 133 -304 -65 340 158 -86 -19 68 56 263 153 -121 -67 -112 -20 61 -258 -142 -176 2 -361 167
3209A67k08Q0o6l3K91m31R5k2J12K5p6K71j22J3k78K68L2j51o0k83K66P7q7pp2
$$ 167 -41 39 -27 -60 231 -200 -105 -127 -15 10 -66 205 83 96 -182 86 118 -33 -93 -376 -110 -33 -120 -127 -199
3234a99K96q7m9j81K24j88p8J40N7L33k81K4r5L8pj39L56k55j29K30M9J52n6j44
$$ -199 97 10 -39 -220 4 -184 -262 -122 -65 268 -13 11 -84 -46 -53 -192 164 -91 -220 10 59 211 155 11
3258A1k4J88N1j76m2o6J67R1j36qLn4R1j25M9m2Q4J62k91j78L03K51k01m1k4j10
$$ 11 -13 175 226 50 8 -58 109 200 64 56 59 5 96 -29 20 -22 62 224 -67 -245 58 309 108 67 43 -67
3284f7L45k46J04k05J45r5Q3k4j13l31N33j55K4J44n3m9L24m25O7l2k41K54p1
$$ -67 278 32 136 -69 76 -19 64 40 -73 -404 129 -26 -2 142 89 40 364 -61 6 -26 -267 -13 -84
3307h4J34j1J10l53j3Q5L43j35k83L57l96M11m5k31l7k7K23J10j25r4J23O8o1
$$ -84 50 39 149 -204 -217 -132 211 76 -207 150 -246 165 120 -111 -148 -175 48 158 33 -61 62 130 69
3330F9K9j88J78m5p9k6P7K34k36J2L1K67Lj13m29K37N5n2N3j7j6j02j68N3oJ48
$$ 69 98 -90 88 43 -36 -62 15 249 13 25 56 323 326 213 -216 21 76 24 77 60 44 -58 -226 -173 -179 -31
3356c1J21Rj33KQ6k6k08l3K15k54J85M34l89L2N2k24k66N57k62k7L75k22l55L41
$$ -31 90 99 -34 -32 54 28 -180 -213 2 -252 -67 367 -22 10 62 -162 -428 129 -133 -160 215 -7 -362 -21
3380b1n8K37j14J8L5r9K1j18J38K13J11m02J13j65J10J79k07J73k89K64j82j31
$$ -21 -79 158 44 62 97 -2 19 -99 39 252 363 -39 74 -91 19 198 -9 164 -125 139 -43 -174
3402a74L95j68N8j60QJ26j40K21j5Qjj01j90m8K55n9j09K50m56K40K27m3j88k1
$$ -174 221 53 111 -49 -41 85 -55 166 151 159 158 57 -133 -181 74 15 -94 156 -300 -60 167 124 -64 -85
3426h5k43J18O6M03j68N2q1j14j82J66J13j46k11K79J06j6l1p6K15k22j37J97
$$ -85 -328 -210 -144 259 91 143 62 -52 -234 -68 45 -101 -312 -33 73 57 26 -50 165 -57 -194 3
3448Ck05q2K33N5l9N4j06m4K56j41o1J72k65L08k69j79K67r5K00k99J04L08j20
$$ 3 -202 -284 -51 4 -35 19 -87 -131 125 -16 -77 95 -170 138 -131 -310 -43 -138 62 -237 -133 175 55
3471E5j17M8N9q6J21K31k16q5rM9j79J08j55P1J19J80j48k9o8j23M15m01J98J02
$$ 55 -62 -14 45 -41 80 311 95 10 1 50 -129 -21 -176 -105 14 194 46 17 -51 -174 241 -160 38 140
3495A40m8o1n6J24k04J53r2J04l24L28R0j15k10K68m1m1J21J36m14J97Q8m38R9
$$ 140 92 31 -25 99 -105 48 -44 60 -264 64 154 39 -171 97 56 15 136 272 -142 55 143 -295 -196
3518a96N3J99j66J2R7k3kJ98m85N33m02m4N2J09O2P6k82K62Q3k5j99J06pJ44O0
$$ -196 -143 56 -110 -98 -1 -24 -26 172 -313 220 -182 -226 -174 -65 -3 73 -209 53 136 111 -88 18 11 155 215
3543B15l98J16j1j11L97j50J00O6l21J96R9L2l62N50m52L6o5J03P9n5j82J17M6
$$ 215 -183 -67 -78 -189 208 58 158 224 -97 99 198 230 -132 418 -34 2 -63 40 119 64 -118 -1 45
3566D5j30N5p0rK98j40L2k06J7K11o9K14j30l32Q7J98J53j18l19J5J37R9J23j88
$$ 45 -85 -30 -100 -109 189 49 81 -125 -108 103 34 248 118 -214 -127 71 224 106 -213 -198 -61 38 161 -27
3590b7P5j44M18m82Q0J5p6K68n7J88j25q9J56l66m2K66J2M3j34j14O0K5J3Rl19
$$ -27 48 -96 322 -160 -80 -65 -141 127 70 258 133 44 200 -166 -208 58 70 113 -21 -135 -75 -50 -37 -28 -347
3615c47K37J60P9J64k97L8m2O4J39k20k9M9j7RQ8J04jl02L10l89L76k06m0J31
$$ -347 -110 50 129 293 -4 34 -8 56 195 -25 -54 -5 -22 -13 75 179 178 -124 186 -203 173 -33 -73 58
3639E8k55K77l07J55P6M9j12K94j83l04M72m02J55O3p7K5J4q0k3J67r2K9l5j37
$$ 58 -197 80 -227 -72 4 53 -59 235 52 -252 220 -182 -27 36 -41 -16 -2 -82 -105 62 -30 -1 -36 -173
3663a73J72j44K36jk9Q6j82J4l8J11n3j27L57k35k01L34l61L18k66K09m3K9k2
$$ -173 -1 -145 91 90 61 147 -35 -21 -59 52 -1 -128 229 -6 -207 127 -234 84 -182 27 -16 13 -9
3686ij75K45j86l05N26k48P5L50l97j17J08l8K33O7l20K42J60l47K69m5m08o5
$$ -9 -184 61 -125 -430 96 -152 -77 273 -124 -241 -133 -171 62 129 -191 51 211 -136 133 88 -320 -385
3708c85M90j26J81j21L67m13M5L3j14K89q1n8j88O5K2J61k8J70o10N27l67L85
$$ -385 105 -21 160 39 406 -7 38 71 -43 246 165 107 -81 -16 6 167 139 309 -301 226 -141 244
3730B44l61K30m08L7N01j04r0K80m72O6J45p5j60O7R8o9N1O4J70q7j83j33L43
$$ 244 -117 113 -295 -258 243 139 49 329 -143 -77 68 -7 -167 -100 -2 -71 -20 44 214 127 -56 -189 154
3753A54l19K43J8k04R3NJ74R2k49j76K1K55qK16k26o5K08j70k53P9j49J48K32
$$ 154 -165 78 96 -108 -15 -10 164 256 7 -169 -148 107 99 315 89 24 232 62 -191 -112 -261 -113 119
3776A19m54N28o0m14J17K24K0K30k87n8M9R5j56J40r0q3r6O9M8J16nk0J55j25
$$ 119 -335 193 133 -281 -164 60 80 310 23 -35 14 109 -47 93 3 -80 -176 -107 -59 57 52 32 187 62
3800F2k08J34K31m15P6q2J66q3M4j73J85K74l46K35J25k23j2J08j34R2k12K3R8
$$ 62 -146 -12 219 -196 -120 -202 -36 -119 -75 -248 -63 211 -135 100 225 2 -10 98 -36 56 -156 -133 -35
3823c5m8ln4K4M9Q1k78L85j78n8J09r2K96l87K71j54j11K77R1j02j22R2j37K94
$$ -35 -83 -86 -140 -116 -67 14 -264 121 -57 -115 -6 -98 198 -189 82 -72 -183 94 185 83 -39 53 -84 210
3847B10j34p1m5J67l8j54j46J95n6L1o2j88M04l15L00k6j04J24J64j66j12L5K60
$$ 210 76 5 -40 127 89 -65 -211 -16 -72 -41 -103 -291 113 -202 98 72 -32 92 256 90 -22 13 273
3870B73m36Q9J53j69L2L30k65J2m39M43K85l03J98l23J15Q2J18j84j78J26k0Q4
$$ 273 -163 -74 79 -90 -58 272 7 19 -420 23 308 5 203 -120 -5 77 195 11 -167 -41 -61 23
3892B3o6JpJ70k2q3K52l00J32o4K3k36R8K6Q6O1p5j09J02l5K7M9l27M93k22M5
$$ 23 -43 -42 -49 121 99 16 268 -32 100 36 59 -177 -79 -53 33 94 19 -90 12 -23 4 53 -274 219 -3 42
3918D2J60L9k62L7m0L6o5k7M5J06J22j72k3j57O2M0j03j06K45j72K44O4m8jk86
$$ 42 202 241 -21 16 -24 12 -53 -80 -35 71 193 21 -2 -159 -97 -57 -160 -266 -21 -193 51 115 67 66 -220
3943b20J40J20k98K82j36m8K62l59J51j16L36K8l55L07m4M8K9l28l0N32o13L82
$$ -220 -80 40 -258 24 -112 -160 102 -257 -106 -222 114 142 -213 94 50 98 127 -201 -231 301 -312 70
3965G0k16j18J34K87j96M5Rn9j87J12J56J8q5n2QJ65j76K45j62l10M69m23K61
$$ 70 -146 -264 -130 157 -39 6 15 -44 -231 -119 37 55 -30 -82 -74 91 -85 160 -2 -312 157 -266 -5
3988eK4k73J32J15j15K33K2j08L0j82j40RK57kM1L1J45j78mj58P2j39r0M32l98
$$ -5 19 -254 -122 -7 -122 111 133 25 55 -127 -267 -258 -1 -3 38 69 214 36 32 -126 -54 -193 -283 149 -249
4013b49K22j27K5P6k3j08K42j02J33k0j3k28M18j64j18J10q7R6j18j47M15k14
$$ -249 -27 -154 -129 -53 -76 -184 58 -44 89 69 56 -172 246 82 -36 74 -13 83 -35 -182 233 19
4035A9J05p1n1L5M9k37M32j70l7J11k25j4J3j4j7O2r0J24j69L26k00j59K7L3j19
$$ 19 124 53 2 37 86 -151 281 111 74 185 -40 -54 -41 -55 -72 -10 -100 24 -145 181 -19 -178 -151 -118 -237
4060b37K81J84k41J38j21j19K45q5j83r2m9K99J8m2q6N8q2J41J51J2l29R8J2M
$$ -237 44 228 -13 125 4 -115 130 45 -138 -230 -279 20 38 -4 -90 -32 -114 27 178 190 -139 -41 -29 -25
4084b5LRJ67m08J82j14L58k60n7J16Q5m1J79l74N4M6L43k80P0K90m88L04j91j0
$$ -25 -22 -13 154 -254 -72 -186 172 -88 -145 -29 56 15 194 -180 -126 -80 263 -17 53 343 -145 159 -32 -42
4108d2J45N7j92j09K17n6J37O9k55k6K25l58JK59l57M74k60J72l62K22O3J58k71
$$ -42 103 160 -32 -141 76 20 157 226 -29 -55 170 -188 -187 72 -285 189 -71 101 -261 -39 24 182 -89
4131h9K1J19M1j43K86k10J48k80%J04M0j49P3K3n4K96l29J97j9j6k9o3j70M47
$$ -89 -68 51 92 -51 235 25 173 -107 -107 -3 37 -112 -39 -16 -70 226 -103 94 75 59 30 -33 -203 244
4155B44r0m13O9J15j62K38k31L00j44J63k59p6M85m04K53M1o8J72k63j16J13K41
$$ 244 154 -259 -190 -75 -237 1 -230 70 -74 89 -170 -246 239 -165 88 129 61 233 -30 -146 -33 208
4177B08l11J01N9k11J82p9j58K03M3O6j59K05l15J68J07m8r6R2J3j57M43k57k7
$$ 208 -103 -2 57 -154 28 -51 -209 -6 37 103 -56 149 -166 2 109 61 -35 57 70 -87 356 99 72
4200G2j77J61q6O6j1J87k65M1r1K3P6R7J16m17O0K72m2l36M94k14j31K12j36j12
$$ 72 -105 56 -30 36 25 212 -53 -12 -103 -80 -4 93 209 -208 -148 124 82 -254 240 26 -105 107 -29 -141
4224a41j17J27L61m06Q8J38j65l4k1J84j15J53q8q0M91o69K09J83j23K02L1j59
$$ -141 -258 -131 230 -176 -88 50 -115 -149 -170 14 -101 52 -36 -116 375 -294 -85 98 -25 177 208 49
4246D9Ql12K13r8J82j89K05r9n1J2p5n0J05L8P4j54K51k20r5J19J23N7j70K49
$$ 49 57 -255 -42 -140 42 -147 58 -41 -92 -80 -155 -205 -100 -62 12 -142 109 -111 -206 -87 36 93 -77 172
4270A72J12m49k8L82k11N6O4J7R4k80K74r2j45k4J06Q5j7k18L48O4l57j22J37
$$ 172 284 -165 -193 189 -22 34 98 115 209 -71 203 111 -34 -58 48 133 116 -102 246 310 -47 -169 -32
4293c2j66P4J9J02j78L12k60R4j9K11j38r7k5q1O5N8m1J61j11k15J1L03o4j7L18
$$ -32 -198 -124 -105 -3 -181 131 -129 -35 -54 157 19 -78 -103 -184 -119 -61 -102 59 -52 -267 -256 47 -17 -34 284
4318B84l21R6j73r2L00K03l57Q5%J30k54j4J05M3n0J02k21j42K68L2Mr1L46m87
$$ 284 -37 59 -114 -206 94 297 -60 25 25 155 -99 -113 -8 35 -15 87 -134 -276 -8 24 28 -63 283 -204
4342b04j00M15l33J71L8n2R3p1j29J34R5L8p7j05J58m31O53m93L25m72K08J69
$$ -204 -304 111 -222 -51 -13 -65 28 -43 -172 -38 57 95 18 -87 71 -360 293 -200 125 -347 -139 30
4364C0M2j70J98m6P6j24k6J11j21P7k20k00L29M9k03J77j48K5J20k6J57l16K48
$$ 30 72 -98 100 54 130 6 -20 91 -30 47 -173 -373 -44 5 -198 -21 -169 -144 -24 -50 107 -209 39
4387C9k50k10L05oR2n6J38J74l28R3k29K76m3J62k22j7M0j09M61n1k81J15k23
$$ 39 -211 -421 -116 -122 -30 -86 52 226 -102 -9 -238 38 -5 157 -65 -82 -42 -151 310 259 -22 93 -130
4410a30j51K24O0OM7k09M12l74J35k07K23j10Q7j52o7K45j26pL38l10k15N28k71
$$ -130 -281 -57 3 9 56 -153 259 -115 20 -187 36 -74 13 -139 -206 39 -87 -94 244 -66 -281 247 -24
4433b4m6k9J64j60K24P3m53J61J44j40K0q4N2P8L2O6K67m81K33J0j07K33k69r3
$$ -24 -70 -99 65 -95 129 202 -251 -90 54 -86 -66 -150 -98 -20 12 78 345 -136 97 107 0 233 -36 -129
4457a29J44O5k19J39r8o8J15j27j65M99j3j11l1j03k07J02K52j28M5j03j94L97
$$ -129 15 80 -139 0 -98 -166 -51 -178 -343 156 143 32 1 -102 -309 -207 45 -83 -38 -141 -335 62
4479F2j19J25J35k27L38p6k57j20J41j56Q5L20k6k57K4J09O7j84k9P0j70K93j82
$$ 62 -57 68 203 -24 314 238 -19 -139 2 -154 -69 251 225 -32 -8 101 168 -16 -45 25 -145 148 -34
4502c4L2J75k09N8k23L07r5O3j33l5J32j91J48j06j06J97J18M7j47r3K90m45K29
$$ -34 -2 173 -36 22 -201 106 11 74 -59 -94 38 -153 -5 -111 -217 -20 98 145 -2 -95 195 -250 -21
4525b1J84j45j8j51J14K63jk54R3o1J1p1Kj24L22j27L9k76K84J31R8m78M6K44
$$ -21 163 18 0 -151 -37 226 225 -29 64 3 14 -57 -55 -179 143 16 55 -221 63 194 292 -186 -140 104
4549A04l65L47j8NmM1Kk8J57k09j27R3J86j92J30k29K67j21P6l2j38J66J7j24
$$ 104 -261 86 68 73 69 110 112 84 241 32 -95 -2 184 -8 122 -107 160 39 115 83 -55 111 128 4
4573D%k93P5O7J56L0Q0j72J1K74k99K6k43K47o7L06J41m48J36J0j09m2l92M79
$$ 4 4 -289 -214 -147 9 39 119 -53 -42 232 -67 -41 -284 -37 -104 202 343 -105 31 41 -68 -110 -502 -23
4597b3R4r4K43j93j63j63L44l6m7K3O9j18j15K0K99j36J41j39M6o0j29l9j6M41
$$ -23 71 -23 220 27 -136 -299 45 9 -38 -15 54 -64 -179 -159 140 4 145 6 52 -8 -137 -176 -192 249
4621B49j19j08j24J99m7j6l3q5J79k50J51J19r3m1j39K9M77m98J69k99J44J20
$$ 249 130 22 -102 97 50 34 1 -84 95 -155 -4 115 22 -19 -158 -129 348 -150 19 -280 -136 -16
4643a6Q7o4j8Q8K67k71j09J25j00r3K55j81M8J61k56J41j13q3l1M5K04q7K4Q1
$$ -16 71 7 -11 77 344 73 -36 89 -11 -104 151 -30 18 179 -77 64 -49 -132 -163 -118 86 -1 23 104
4667A04m10M91P1j43k99J87M8j73J62m0j71K75l40L74k00K54l35L74l63K18q1
$$ 104 -306 185 256 113 -186 1 49 -124 38 -2 -173 102 -238 136 -64 190 -145 229 -134 84 3
4688CJ73J21n04J73J39l10L59J00n5M1j64K11j43m8p6J2l0j03Q1M25m15Kn2O0
$$ 3 176 297 -207 -34 105 -205 154 254 199 240 76 287 144 96 20 32 2 -101 -20 405 -10 -8 -60 0
4712@n8J62O4j68np4j3N6l4J58j09J1j20K53k54J83k6l53M92r1j35P9J10k72J68
$$ 0 -58 104 168 0 -5 -79 -92 -36 -70 88 -21 -10 -130 123 -131 52 26 -327 165 74 -61 18 128 -144 24
4737B4J9o7k0L6O5k54O7L62r1j2k14j29K90r4J14Q9j05j55N4J0p0J88j25K05k01
$$ 24 43 -24 -44 -8 57 -197 -130 232 141 129 -85 -214 76 -18 96 185 80 -75 -21 -11 -81 107 -18 187 -14
4762a4K33j03m92L46O7j60J24j83k17N02k29K43j10k97M39j65M1k25K18r9rj72
$$ -14 219 116 -376 -30 37 -123 1 -182 -399 103 -126 117 7 -290 149 -16 25 -200 18 -81 -90 -262
4784b62j60M02L6j1r9K36j24M9R1R1l78J28K8K63m57NJ30P5q7L83j05j65J27k66
$$ -262 -422 -20 16 5 -94 142 18 67 158 249 -129 -1 27 290 -167 -162 -32 43 -44 339 234 69 196 -70
4808g0J90o8OP8j51j05L01k22J52k2j11j28L62k01NL5M4j69j09L37P1j30k63K72
$$ -70 120 52 58 136 -15 -120 181 -41 111 89 -22 -150 212 11 16 51 95 -74 -183 154 225 95 -168 104
4832A04q7K8jk08J04o3N0M3J43p7o7M0k8J47J4p1k40M4J05R0o3Q8j09R0O5J01
$$ 104 17 45 44 -164 -60 -123 -73 -30 113 36 -31 9 -19 128 142 71 -169 -125 -20 70 7 95 -14 76 141 242
4858B42k42Mn7j35J81q4J50k1r9K35l91M20k32N8j17J39J78j98J8J84j39m6l4
$$ 242 0 4 -53 -188 -7 -91 59 38 -61 174 -217 203 -29 29 -88 51 229 31 49 233 94 48 14
4881A4P4k06L7l1J49l50M48J3o1O9j63M2J47j14m8Q5K31l75K3K36l8j16j79K34
$$ 14 88 -118 -81 -112 37 -313 135 148 87 156 -7 35 182 68 20 105 336 -39 -16 220 182 66 -113 121
4905A21p8q1K25m15K26O1k6j52K42r2m0j2Kl20M61p4m8p5J9q7q0K17r4J84R8j8
$$ 121 43 -38 187 -228 -2 59 33 -119 123 31 -9 -21 -19 -339 122 48 0 -75 -56 -143 -223 -6 -100 84 182 164
4931A64j13r1j44J07k31K08L9R7J36J31k90J31k14L71k90k28K42j46J23o3P8J93
$$ 164 51 -40 -184 -77 -308 -100 -61 36 172 303 13 144 -70 301 11 -217 25 -121 2 -61 17 210
4953B10m19P7K65k83L5M09n38J39L14j18m21K62K08o4o6J40k15J97k10m6J77K00
$$ 210 -209 -132 133 -150 -115 294 -244 -105 209 91 -330 -68 140 76 10 150 -65 132 -78 -124 53 253
4975B53J13m78m8K12j81j25K31j32K34j90K2L2O5l2J2j4K35k22n0Q0J85o7l12
$$ 253 366 -112 -160 52 -129 -254 -23 -155 79 -111 -89 -57 8 -24 -12 -26 209 -13 -63 17 202 135 -177
4998a77L50j81L26m77K8J36j84K71J30k8j78j32K19k09J45j11J69j71L0J06M9
$$ -177 173 -8 318 -159 -131 5 -179 92 222 194 16 -116 103 -106 39 -72 97 -74 -44 62 111
5019A11p0j79m1Q0N6R4J4j53K71k82O2J51k06L23k29j82J38M4q9O7K69l73L31
$$ 111 41 -138 -179 -99 -43 51 65 -88 183 -99 -37 114 -92 231 2 -180 -42 2 -87 -20 249 -124 207
5042B07m21Q0Q5p6K32l95M62j09k48K13J12k49J5J46lj6p6K57k96K8J75k79J36
$$ 207 -214 -134 -49 -125 107 -288 174 65 -183 30 142 -107 -92 54 51 35 -41 216 -80 -52 123 -156 -20
5065b0J83q5p6k07J44O9r9P7LJ08J28L9l96J37Q8j77K98k08l5p7J67k36L31O9
$$ -20 163 78 2 -205 -61 8 -91 -14 -11 97 225 264 -132 5 93 -84 214 6 -29 -106 61 -175 156 225
5089B25j93K0q4N1rK40%j91l9k39L36j51K74l65J68J47j69N3n0O9l59K41Lj9k5
$$ 225 32 52 -32 19 10 250 250 59 20 -219 117 -34 240 -125 43 190 21 74 24 93 -266 -25 -22 -41 -66
5114f6j34J4L31j3j66L9K3J06j43K07r5l4j8j00kJ67j89K05m68J23K28LJ28k58
$$ -66 -200 -186 145 132 -34 5 28 134 -9 198 103 69 51 -49 -51 116 -73 132 -336 -213 15 18 146 -112
5138a12J06j16J15p2N0J17k94J42l1K15l56K54j14N2R6p2q0R5j52MK32j85j0J37
$$ -112 -6 -122 -7 -79 -29 88 -206 -64 -95 120 -236 18 -96 -44 52 -20 -100 -5 -157 -153 79 -106 -116 21
5162B1j29J88k57n3N6K83r7N1j47L02l59K00J7L3R4k83J5J58K4k01J27k32N3J15
$$ 21 -108 80 -177 -230 -174 109 12 63 -84 218 -141 59 76 109 203 -80 -65 93 117 -84 43 -189 -136 -21
5186b1O8j9k07o3K05J70j26L3m7q8J84j12j9K00k83L00N3k27L5N1J06k39J65j3
$$ -21 47 28 -179 -242 -37 133 7 40 -7 -95 89 -23 -42 158 -125 175 228 1 36 87 193 -46 119 106
5210A06mm20K77J63M3j34jj13p0J04J87k73J82L1r2J74k94k36J78J28l5LJ62n9
$$ 106 102 -318 -41 122 165 31 30 -83 -153 -49 138 -135 47 78 -14 160 -134 -370 -192 -64 -99 -96 66 7
5234GJ8k14J71m0j69L32J1L5k97J21J52q1j64J76R0m5k64K35K6l91N7J5K70k41
$$ 7 25 -189 -18 -58 -227 105 116 151 -146 -25 127 46 -118 58 148 103 -161 74 100 -291 -234 -219 51 -190
5258a90K82J57k64kj84J85J04rj53k2K74k76K27j91j38L78l10J07l30J28J91j00
$$ -190 92 249 -15 -17 -201 -16 88 79 -74 -96 178 -98 129 -62 -200 178 -132 -25 -355 -227 -36 -136
5280a36O7J75j58l9M54l61k46N29m57K28j16j9m2J78k34k17N40k78L60m19J31
$$ -136 -69 106 -52 -91 363 2 -244 285 -172 56 -60 -79 -121 57 -177 -394 146 -132 228 -191 -60
5301f0K48jk25L39j94k30M5NP2Nj01J95J79p5k99q8L1j93K92K50l37K75r2j84
$$ -60 188 187 -38 301 107 -123 -78 -73 -1 4 -97 98 277 202 -97 -185 -154 -347 -55 195 -142 133 41 -143
5325a43J63J4K12m71J32P7j30M2K05j13P0j6J21m54PM54M1k64K70l17L28k27k20
$$ -143 20 34 246 -225 -93 -16 -146 -104 101 -12 58 42 163 -291 -284 170 211 -53 217 -100 228 1 -219
5348b19K52n0Q6n1N2j45J45j19K1K08k21j54L06l56K63k11J36k6Q2K5J8p5J72
$$ -219 33 -17 69 18 70 -75 70 -49 -28 180 -41 -195 111 -245 18 -193 -57 -83 -1 24 42 -33 139
5371A39l14L05k75O26o14J35lJ76k26J03l5k20M2L64l08L61l21j53K28o5J43J5
$$ 139 -175 130 -145 481 -133 2 -1 175 -51 52 17 -203 -161 203 -105 256 -65 -218 10 -55 88 103
5393A03l60R5J22lq3K17k20P8l3l36L62J06j11J93k29j23J88K5o4O9j13J95J50
$$ 103 -257 -162 -40 -43 -126 91 -129 -51 -84 -420 -58 48 -63 130 -99 -222 -34 -9 -73 -4 -117 78 228
5416B28p9l31M96j90J6j17j46J07K69j43k87J93k40J39J56J96m19J97j34l29L31
$$ 228 149 -182 314 124 140 23 -123 -16 253 110 -177 16 -224 -85 71 267 -152 45 -89 -418 -87
5437h7K5P8K13j32j32J79L6q6k56J84L6N2P0j43j41O4l2Mj36k2K15L0P7j05j23
$$ -87 -62 16 229 97 -35 144 180 94 -162 22 58 110 180 37 -104 -40 -72 -68 -204 -226 -11 19 96 -9 -132
5462a32J55P6n1r2R9N1J00j82J73j46k70R9K74j74K49n7k19J93k48N1j2j37K76
$$ -132 23 99 48 -44 55 106 206 24 197 51 -219 -120 154 -20 229 172 -47 146 -102 -51 -63 -200 76
5485G6K2j76m1K09N1k53M9L2K82k11j09R7R8m3n1J21K25m25J8r9n3o9L07q4J50
$$ 76 98 -78 -119 90 141 -112 -63 -31 251 40 -69 28 126 83 32 153 378 -47 -29 -128 -181 -250 57 -27 123
5510A23k7n9q5j9o9l9K15o2j65L40J85n02n6kK83n0N4k10L82l36j53L02n0j2P5
$$ 123 96 37 -48 -67 -136 -175 40 -22 -187 153 338 -164 -220 -222 61 11 65 -145 237 -99 -252 50 0 -12 63
5535F3r9R3n3N5p7m9P2K16l25J03qp8O4j2K34k87O4J29k81J31J58k65K51p8r5
$$ 63 -36 57 4 59 -18 -67 5 221 -104 -1 -9 -87 -23 -35 199 -88 -24 105 -176 -45 113 -152 99 21 -74
5560g4K11m21J87P7o4L06m7K0j00l44L58m0j22r1K9K83j83J60p3j10K60j44j36
$$ -74 137 -284 -97 -20 -84 222 175 195 95 -249 109 69 -53 -144 -115 168 -15 145 72 -38 222 78 -58
5583e8R0O6q2j65L61k90j6K78l78J45J17J05q6r5P3l8J22j72K67l12L61j94n2
$$ -58 32 98 16 -149 212 -78 -94 184 -194 -49 68 173 87 -8 65 27 149 -23 244 -68 293 99 47
5606D7j19k3K24k8j91L54l27J94M6j07Nr7k9r9K42K9m7p9Q7k24R3P8n8R1K0j11
$$ 47 -72 -95 129 101 -90 264 -63 131 177 70 75 -22 -51 -150 92 121 74 -5 82 -142 -49 29 -29 62 82 -29
5632b9J98j98j20K25O7o7k2j20K73j40j64L3j1M6M7k07O3k3J40J37k62J01j8R2
$$ -29 169 -29 -149 76 143 76 54 -66 207 67 -97 -64 -75 -29 18 -189 -126 -149 -9 128 -134 -33 -51 41
5656D1qMr3Q3j7M5j77m0J1K86j38j71R9j25nK53p2P1M3kk02Q5M0J01l52L87j70
$$ 41 33 37 -56 27 10 55 -122 -162 -151 135 -3 -174 -75 -200 -205 48 -24 47 90 88 -114 -29 11 112 -240 147 -23
5683b3kJ21o6J31l99L05N2j78K99p9J7p7j0l50J92P9j23N5j07J96N7l10L84J38
$$ -23 -25 96 30 161 -238 67 119 -59 240 161 178 101 91 -259 -67 12 -111 -56 -163 33 90 -220 164 302
5707C02j70j22m6M6K58k62K15n15K23k63L16J36N6J13k75N8q8K60j31m03K87k94
$$ 302 132 10 -36 10 268 6 221 -294 -71 -334 -18 118 174 287 12 70 -18 242 111 -292 -5 -299
5729b99K36J7j77L39j77j22J51R5Oj60N8K53k02k33K46j4q3L51n65M49m36M26
$$ -299 -63 -46 -223 116 -61 -183 -32 63 69 -91 -33 220 18 -215 31 17 -66 285 -280 169 -267 159
5751A59J2o6R0l12L03j62J77k82K20k23K45J9j64l0r3m6J48J52k32J23Q9l79L10
$$ 159 171 105 195 -117 186 24 201 -81 139 -84 161 180 16 -14 -107 -153 -5 147 -85 38 127 -252 58
5774E8j15r5L49l64J33J24p2j19M35l25j19J62k87M91j09j40J8o3J69m0n4j61
$$ 58 -57 -152 197 -167 -34 90 18 -101 334 9 -110 52 -235 256 147 7 25 -38 131 91 37 -124
5796a24K07K82l10j63l4K77j67M9L9o6j46L91r5k54J42r9L2q9L10m85J30K11j77
$$ -124 83 365 55 -108 -142 135 -32 17 56 -10 -156 235 140 -114 28 -71 -39 -128 182 -303 -173 38 -139
5819a39L38k34J39J5K55l42n6k08Q0R5J74N1r3r6N5n5K19k26RK00k32K5R7k4j06
$$ -139 199 -35 104 119 374 32 -24 -232 -152 -57 117 168 75 -21 34 -21 198 -28 -19 181 -51 -26 71 47 -59
5844e9K85n0l87J33O2J14l10O5M7Q3o7K23j59k07P7J34j90J66O1J0M4O5j85k44
$$ -59 226 176 -211 -78 -16 98 -212 -147 -100 -17 -84 139 -20 -227 -150 -16 -206 -40 21 31 75 140 -45 -289
5868b89J59K17j04J5J17P0n5p6k77J26K21k41Q7J54p2k89N17j32k27L22j50k10
$$ -289 -130 87 -17 -2 115 185 130 54 -223 -97 124 -117 -30 124 52 -237 280 148 -79 243 93 -117
5890a17J94k61J18M9j06R3J09m8k46J59j8k01K11K2J23P1j74K26j04Qn1J2kQ5
$$ -117 77 -184 -66 -17 -123 -30 79 31 -215 -56 -74 -275 -64 -42 81 152 -22 204 100 108 57 69 67 152
5914A52l6j2j52k5k56K13M2j03J18qJ05k35M62j59k58M0N4L10k56J15k60j24L44
$$ 152 116 104 -48 -73 -329 -116 -74 -177 -59 -67 38 -197 265 106 -152 -112 -58 252 -4 111 -149 -273 71
5937G1k6n9j02K2J60P1j37k74J53K14j73J96j76j05L12r1j30L2j69N21l18j33
$$ 71 45 -14 -116 -94 66 137 0 -274 -121 93 -80 116 -60 -165 147 56 -74 -42 -211 310 -8 -141
5959a41K12j13J85o5l04K54l7n6L0J39m02L11R8J63k06r4j34K24L5p9j16K3Q3
$$ -141 71 -42 143 78 -226 28 -9 -65 -35 104 -298 13 111 274 68 -26 -160 64 99 20 -96 -73 10
5982A0j67K52k3p0J70j29q0oo4K65k81pJ82O9q6k72J48K32k08Q5K02k92j80L17
$$ 10 -157 95 72 2 172 43 -37 -43 -107 158 -123 -130 52 121 35 -237 -89 143 -65 20 222 -70 -250 67
6006F7K18j77K4nq1p6K33k62J1J8j70L31l06K9k1O4K65k09P5K85j82m20K71M0
$$ 67 285 108 132 127 46 -30 203 -59 -48 -30 -200 131 -175 -146 -167 -103 162 -47 28 313 131 -289 -18 22
6030B2j0K21k32k02j13J26K10p0k9J4L06l60o2J89J0m2Q1p8N2q2k4j71K54J09
$$ 22 12 233 1 -201 -314 -188 22 -48 -77 -63 243 -117 -179 10 20 -22 59 -19 33 -49 -73 -244 10 119
6054A19j89R7K22m28J98J40Qj53j46K11k34J45j48p4M28P4k14n1j45K6J88J07
$$ 119 -70 27 249 -179 19 159 167 14 -132 79 -155 -10 -158 -232 196 270 56 5 -140 -114 74 181
6076A81r0k5k13J80j6j17m4K5K62j5l9k48O7L75j64o8k72K86r0m13O49m9J9k42
$$ 181 91 66 -147 33 17 -100 -144 -119 143 128 89 -159 -92 283 119 51 -221 65 -25 -438 211 162 181 -61
6100f1J14j11O3n6j13N09j70j93J81k42J62J14N2j77o5K71k83J64j84K1L14l79
$$ -61 53 -58 5 -51 -164 345 175 -18 163 -79 83 197 249 72 7 278 -5 159 -25 -4 310 -69
6122f9j7J69Qj19j5L64l64Q8j3m8nJ68l04J24L03m34J10J14J43l3l13Q2J28J41
$$ -69 -86 83 91 -28 -43 321 -43 45 32 -16 -21 147 -157 -33 270 -164 -54 60 203 170 -143 -61 67 208
6146B08l79J13l6j02K68l53M17l43L85j05l08L31l02L21J92k48N4j22K52j19j18
$$ 208 -171 -58 -94 -196 72 -281 136 -207 178 73 -235 96 -206 115 307 59 113 -9 243 124 6
6167Fj15N3J95l73L01p5j56J96P3j48J1l01L30o1L17p8j15n4j64L85k08P9j71
$$ 6 -109 -56 139 -234 67 -8 -164 32 105 -43 -32 -333 -3 -64 253 175 60 6 -158 227 19 98 -73
6190g3R9Q5j53j41J06N5p9K3K17k24J14j61l2J42O1N3k53M51k00r0l8J43J18k00
$$ -73 26 111 -42 -183 -77 -22 -101 -78 139 -85 29 -132 -164 -22 39 92 -161 290 90 0 -38 105 223 23
6214B3K1j23L22l00M3O7j66J41O0p7L5N7j17J34j37P4l36L39k41L60M7j82J73
$$ 23 44 -79 243 -57 -14 53 -113 28 88 11 46 103 -14 120 -17 57 -279 60 -181 179 226 44 217
6237B17k64J74k10K57O5j80J18l32K75l92L70j21p3J52l20K77r0K00Rk19J42r7
$$ 217 -47 127 -83 174 239 59 177 -155 120 -272 98 -23 -96 56 -264 13 -77 123 132 -87 55 -42
6259d2J64k85K06k65J4K80j03K20j00r7Q3J52l03k40P7J45j54K52J17j88j99L62
$$ -42 122 -163 43 -222 -208 72 -31 189 89 -8 75 227 -76 -316 -239 -94 -248 4 121 -67 -266 96
6281I6r8M2k66L30J80m20K95j31Lk05K07J48k75o0J35K05k54K33k8l67J98K2P9
$$ 96 -2 40 -226 104 284 -136 159 28 31 -174 33 181 -94 -154 -19 186 -68 165 137 -230 -32 -10 69
6304F9m00K35K88l86Q6j8r7J03K14k99k20O55j54n9Kn9L71n21J87L1j90O1R8R3
$$ 69 -331 -96 192 -194 -108 -126 -223 -120 94 -205 -425 230 76 17 19 -40 331 -190 -3 28 -162 -101 -3 90
6328I0j77J5qQ0j8o6J66l6P1l25J35N0J67q9P0k13R1PJ72j72N1j58o2J82j09j64
$$ 90 -87 -72 -80 0 -18 -84 82 46 117 -208 -73 -23 144 55 125 -88 3 10 182 10 61 -97 -159 23 -86 -250
6354b50K69J2j16M8J6j40N1L47q9k42Q1K10l25J97l6K2l22Q2J18l0J23j31Q9J31
$$ -250 19 31 -85 -37 -21 -161 -110 237 148 -94 -13 197 -128 69 33 55 -267 -185 -67 -97 26 -105 -16 115
6378A15j40J31j14j19M3J64p5k7RP3m34L57J48j51j14K22l16j40K60K65j89k7
$$ 115 -25 106 -8 -127 -84 80 5 -22 -13 60 -374 -17 131 -20 -134 88 -228 -368 -108 157 -32 -59
6400e9R2j51K40m7J7Q6k77J61O6j46J5r9k2r9M18q2pr3k2L5j18pJ01q2J19p2Q3
$$ -59 33 -118 122 75 92 178 -99 62 128 -18 -3 -102 -124 -223 195 113 106 13 -9 26 -92 -99 2 -80 39 -33 50
6427E0M7n3j29L41l22OJ32k14L54j99Jj40J56J5p7L0J44j6m19K54L8j19J35Jj17
$$ 50 97 44 -85 256 -66 -60 72 -142 212 13 14 -126 30 45 -32 -2 142 126 -293 -39 -1 -120 15 16 -101
6452a01K04o3m17K31K39j02j2O3Rk21R9K62n7k27l2L34Q2l19N5n7j48O2j59M95
$$ -101 103 40 -377 -146 93 -9 -21 42 51 -170 -71 191 134 -93 -125 209 291 -28 27 -30 -178 -116 -275 220
6476B20k19J43j43L2Pj44j24J19m8K08r3J47j21Kl8k19L3K63P8J51k12o7k21N13
$$ 220 1 144 1 33 40 -104 -228 -109 -157 51 -42 105 -16 -14 -52 -271 -238 25 103 254 42 -25 -246 267
$$ [...]
8191F8
##END NTUPLES=NMR FID
##END=
