##TITLE=1H_DE-44_EA2b_w
 D2O
 8 sc, 
 9.4.2024
##JCAMPDX= 6.0         $$ Bruker NMR JCAMP-DX V2.0
##DATA TYPE= NMR FID
##DATA CLASS= NTUPLES
##ORIGIN= UXNMR, Bruker Analytische Messtechnik GmbH
##OWNER= root
$$ XWIN-NMR		Version 3.5
$$ Tue Apr  9 15:39:44 2024 Russian Standard Time (UT+4h)  she@DPX200
##.OBSERVE FREQUENCY= 200.1309
##.OBSERVE NUCLEUS= ^1H
##.DELAY= (6, 6)
##.ACQUISITION MODE= SIMULTANEOUS
##.ACQUISITION SCHEME= undefined
##.AVERAGES= 8
##.DIGITISER RES= 18
##SPECTROMETER/DATA SYSTEM= spect
##.PULSE SEQUENCE= zg30
##.SOLVENT NAME= CDCl3
##.SHIFT REFERENCE= (INTERNAL, CDCl3, 0, 15.7039)
##AUDIT TRAIL= $$ (NUMBER, WHEN, WHO, WHERE, WHAT)
$$ ##TITLE= Audit trail, XWIN-NMR		Version 3.5
$$ ##JCAMPDX= 5.01
$$ ##ORIGIN= Bruker BioSpin GmbH
$$ ##OWNER= she
$$ F:/spectra/data/she/nmr/H-F/1/audita.txt
$$ ##AUDIT TRAIL=  $$ (NUMBER, WHEN, WHO, WHERE, WHAT)
(   1,<2024-04-09 15:38:23.10 +0400>,<she>,<DPX200>,
      <created by zg, POWCHK disabled, PULCHK disabled
       configuration hash MD5:
       00 E9 B6 7A A2 85 ED C7 34 08 36 98 17 FE 4E 26
       data hash MD5: 16K
       97 6E B3 25 C2 00 23 61 ED 64 20 3D 71 72 20 52>)
$$ ##END=
$$ 
$$ hash MD5
$$ 9D 6C AE DC C8 A7 C8 F7 C4 87 B9 E5 2A 03 66 59
##$RELAX= 
##$RELAX= 
##$RELAX= 
##$RELAX= 
##$RELAX= 
##$RELAX= 
$$ Bruker specific parameters
$$ --------------------------
##$DU= <F:/spectra>
##$EXPNO= 1
##$NAME= <H-F>
##$PROCNO= 1
##$TYPE= <nmr>
##$USER= <she>
##$AMP= (0..31)
100 100 100 100 100 100 100 100 100 100 100 100 100 100 100 100 100 100 
100 100 100 100 100 100 100 100 100 100 100 100 100 100 
##$AQSEQ= 0
##$AQ_mod= 1
##$AUNM= <au_zg>
##$AUTOPOS= <>
##$BF1= 200.13
##$BF2= 200.13
##$BF3= 200.13
##$BF4= 200.13
##$BF5= 200.13
##$BF6= 200.13
##$BF7= 200.13
##$BF8= 200.13
##$BYTORDA= 1
##$CFDGTYP= 0
##$CFRGTYP= 5
##$CHEMSTR= <none>
##$CNST= (0..31)
1 1 145 1 1 1 1 1 1 1 1 1 1 1 1 1 1 1 1 1 1 1 1 1 1 1 1 1 1 1 1 1 
##$CPDPRG= <>
##$CPDPRG1= <>
##$CPDPRG2= <>
##$CPDPRG3= <>
##$CPDPRG4= <mlev>
##$CPDPRG5= <mlev>
##$CPDPRG6= <mlev>
##$CPDPRG7= <mlev>
##$CPDPRG8= <mlev>
##$CPDPRGB= <>
##$CPDPRGT= <>
##$D= (0..31)
0 1.2 0 0 0 0 0 0 0 0.06 0 0.03 0 0 0 0 0.0002 0 0 0 0 0 0 0 0 0 0 0 0 
0 0 0 
##$DATE= 1712662702
##$DBL= (0..7)
120 120 120 120 120 120 120 120 
##$DBP= (0..7)
150 150 150 150 150 150 150 150 
##$DBP07= 0
##$DBPNAM0= <>
##$DBPNAM1= <>
##$DBPNAM2= <>
##$DBPNAM3= <>
##$DBPNAM4= <>
##$DBPNAM5= <>
##$DBPNAM6= <>
##$DBPNAM7= <>
##$DBPOAL= (0..7)
0.5 0.5 0.5 0.5 0.5 0.5 0.5 0.5 
##$DBPOFFS= (0..7)
0 0 0 0 0 0 0 0 
##$DE= 6
##$DECBNUC= <off>
##$DECIM= 32
##$DECNUC= <off>
##$DECSTAT= 4
##$DIGMOD= 1
##$DIGTYP= 9
##$DL= (0..7)
0 120 120 120 120 120 120 120 
##$DP= (0..7)
150 150 150 150 150 150 150 150 
##$DP07= 0
##$DPNAME0= <>
##$DPNAME1= <>
##$DPNAME2= <>
##$DPNAME3= <>
##$DPNAME4= <>
##$DPNAME5= <>
##$DPNAME6= <>
##$DPNAME7= <>
##$DPOAL= (0..7)
0.5 0.5 0.5 0.5 0.5 0.5 0.5 0.5 
##$DPOFFS= (0..7)
0 0 0 0 0 0 0 0 
##$DQDMODE= 0
##$DR= 18
##$DS= 0
##$DSLIST= <SSSSSSSSSSSSSSS>
$$ [...]
##$SUBNAM2= <"">
##$SUBNAM3= <"">
##$SUBNAM4= <"">
##$SUBNAM5= <"">
##$SUBNAM6= <"">
##$SUBNAM7= <"">
##$SUBNAM8= <"">
##$SUBNAM9= <"">
##$SW= 18.0517689322627
##$SWIBOX= (0..15)
0 0 2 0 0 0 0 0 0 0 0 0 0 0 0 0 
##$SW_h= 3612.71676300578
##$TD= 16384
##$TD0= 1
##$TE= 0
##$TE2= 300
##$TE3= 300
##$TEG= 300
##$TL= (0..7)
0 120 120 120 120 120 120 120 
##$TP= (0..7)
150 150 150 150 150 150 150 150 
##$TP07= 0
##$TPNAME0= <>
##$TPNAME1= <>
##$TPNAME2= <>
##$TPNAME3= <>
##$TPNAME4= <>
##$TPNAME5= <>
##$TPNAME6= <>
##$TPNAME7= <>
##$TPOAL= (0..7)
0.5 0.5 0.5 0.5 0.5 0.5 0.5 0.5 
##$TPOFFS= (0..7)
0 0 0 0 0 0 0 0 
##$TUNHIN= 0
##$TUNHOUT= 0
##$TUNXOUT= 0
##$USERA1= <user>
##$USERA2= <user>
##$USERA3= <user>
##$USERA4= <user>
##$USERA5= <user>
##$V9= 5
##$VALIST= <valist>
##$VCLIST= <CCCCCCCCCCCCCCC>
##$VD= 0
##$VDLIST= <DDDDDDDDDDDDDDD>
##$VPLIST= <PPPPPPPPPPPPPPP>
##$VTLIST= <TTTTTTTTTTTTTTT>
##$WBST= 1024
##$WBSW= 4
##$XGAIN= (0..3)
0 0 0 0 
##$XL= 0
##$YL= 0
##$YMAX_a= 44528
##$YMIN_a= -51649
##$ZGOPTNS= <>
##$ZL1= 120
##$ZL2= 120
##$ZL3= 120
##$ZL4= 120
##$ABSF1= 10
##$ABSF2= 0
##$ABSG= 5
##$ABSL= 3
##$ALPHA= 0
##$AQORDER= 0
##$ASSFAC= 0
##$ASSFACI= 0
##$ASSFACX= 0
##$ASSWID= 0
##$AUNMP= <proc_1d>
##$AZFE= 0.1
##$AZFW= 0.1
##$BCFW= 1
##$BC_mod= 2
##$BYTORDP= 1
##$COROFFS= 0
##$CY= 11.3945322036743
##$DATMOD= 1
##$DC= 2
##$DFILT= <>
##$DTYPP= 0
##$F1P= 15.6554695791079
##$F2P= 12.8336369535428
##$FCOR= 0.5
##$FTSIZE= 0
##$FT_mod= 4
##$GAMMA= 1
##$GB= 0.15
##$INTBC= 1
##$INTSCL= 1
##$ISEN= 128
##$LB= 0.24
##$LEV0= 0
##$LPBIN= 0
##$MAXI= 10000
##$MC2= 0
##$MEAN= 0
##$ME_mod= 0
##$MI= 1.114404
##$NCOEF= 0
##$NC_proc= 0
##$NLEV= 6
##$NOISF1= 3.799351
##$NOISF2= 2.8
##$NSP= 1
##$NTH_PI= 0
##$NZP= 0
##$OFFSET= 15.70392
##$PC= 1
##$PHC0= -25304.67
##$PHC1= 13.98731
##$PH_mod= 1
##$PKNL= yes
##$PPARMOD= 0
##$PSCAL= 0
##$PSIGN= 0
##$REVERSE= no
##$SF= 200.130013532006
##$SI= 16384
##$SIGF1= 3
##$SIGF2= 2
##$SINO= 400
##$SIOLD= 16384
##$SREGLST= <1H.CDCl3>
##$SSB= 0
##$STSI= 0
##$STSR= 0
##$SW_p= 3612.71676300578
##$SYMM= 0
##$S_DEV= 0
##$TDeff= 0
##$TDoff= 0
##$TI= <>
##$TILT= no
##$TM1= 0
##$TM2= 0
##$TOPLEV= 0
##$USERP1= <user>
##$USERP2= <user>
##$USERP3= <user>
##$USERP4= <user>
##$USERP5= <user>
##$WDW= 1
##$XDIM= 8192
##$YMAX_p= 0
##$YMIN_p= 0
$$ End of Bruker specific parameters
$$ ---------------------------------
##NTUPLES= NMR FID
##VAR_NAME=  TIME,          FID/REAL,        FID/IMAG
##SYMBOL=    X,             R,               I
##VAR_TYPE=  INDEPENDENT,   DEPENDENT,       DEPENDENT
##VAR_FORM=  AFFN,          ASDF,            ASDF
##VAR_DIM=   8192,          8192,            8192
##UNITS=     SECONDS,       ARBITRARY UNITS, ARBITRARY UNITS
##FACTOR=    0.0002768,     1,               1
##FIRST=     0,             0,               0
##LAST=      2.2672688,     0,               0
##MIN=       0,             -51649,          0
##MAX=       2.2672688,     44528,           0
$$ Real data points
##PAGE= N=1
##DATA TABLE= (X++(R..R)), XYDATA
0 0 0 0 0 0 0 0 0 0 0 0 0 0 0 0 0 0 0 0 0 0 0 0 0 0 0 0 0 0 0 0 1 -1 3 -3 3 -5 5 -6 6 -7 8 -8 10 -10 11 -12 13 -16 17 -17
50 -17 20 -24 25 -28 30 -35 39 -42 50 -58 68 -79 95 -118 153 -211 317 -555 1302 -7255 -51649 -44212
72 -44212 -20766 -18676 -11158 17839 41210 39586 25819 13859 317 -22520 -44265 -43229 -21545
85 -21545 -1744 13362 31688 41399 25441 -1304 -14264 -16796 -23825 -30389 -16772 9298 23779
98 23779 26497 30080 25658 2811 -23499 -34356 -32702 -23293 -7646 9339 22472 27952 23969 15756
112 15756 5341 -12935 -30954 -30848 -16384 -3751 9928 27849 34895 22432 4348 -9112 -19924
125 -19924 -28686 -28746 -17329 -523 12361 22587 31124 29531 10338 -12815 -24397 -24440 -19989 -11986
139 -11986 3116 18084 24047 20024 12953 3776 -11381 -26316 -27977 -18757 -7161 7867 23755
152 23755 30624 22238 7713 -4617 -12645 -19804 -23877 -17045 -1551 11842 17543 21259 20486 7909
166 7909 -10562 -21541 -23742 -19288 -9327 4293 17138 22370 20721 15902 7017 -7437 -21456 -25263
180 -25263 -18260 -7865 2908 14211 22279 20490 8722 -3695 -11513 -16297 -18950 -14732 -2982
193 -2982 8563 16242 21731 20049 8658 -6010 -16452 -19895 -18091 -11556 -1130 10448 17934 16857
207 16857 11469 4778 -4451 -15107 -20194 -15896 -5844 4781 15288 20762 18330 8809 -1336 -10205
221 -10205 -16876 -19738 -15850 -4995 6329 13955 18044 17717 10173 -1939 -13417 -17825 -15495 -8994
235 -8994 -1117 9052 16498 16807 12319 5280 -4938 -14771 -18924 -16272 -8644 1055 10821 17819 17666
250 17666 10728 558 -7644 -12420 -14691 -12928 -5352 5035 12753 15869 14472 7986 -2662 -12605
264 -12605 -17200 -15913 -10117 -1370 8382 15312 16303 12573 5674 -2373 -11461 -17031 -15388 -8016 1330
279 1330 9452 14968 15895 10364 1011 -7578 -12998 -15728 -13272 -6152 3647 11695 15847 15158 10220 1309
295 1309 -8697 -14646 -14964 -10441 -3747 4424 11635 14130 11153 5068 -1961 -9294 -14527 -14246 -8092
310 -8092 582 8272 13951 15468 11622 2978 -6135 -11960 -13862 -12324 -7353 1397 9555 13735 12803
325 12803 8514 1604 -7596 -13641 -13883 -9459 -3077 4344 11935 14922 12209 5552 -1378 -7987 -13741
340 -13741 -14819 -9754 -1517 6029 11021 13467 11563 4211 -3732 -9758 -11835 -11290 -6802 1175 8409
355 8409 12089 11603 8508 2894 -5682 -12624 -13424 -9652 -4083 2057 9041 13291 11755 5746 -524 -6083
371 -6083 -10667 -12654 -8801 -1133 5388 9818 12624 11341 4450 -4384 -10319 -11731 -11160 -7938 -668
386 -668 7253 11814 11515 9073 4620 -2759 -9990 -12750 -9723 -4835 810 7773 12131 10969 5609 -106
402 -106 -4867 -9812 -12737 -9214 -2300 4276 8316 11262 11225 6045 -1554 -8009 -10126 -9948 -7323 -1394
418 -1394 5991 9856 9512 7419 4045 -2433 -9506 -12169 -9196 -4594 621 7220 12059 11422 6264 428
434 428 -4523 -8748 -11549 -9334 -3595 2499 7062 10238 10959 6371 -1617 -7850 -9510 -9507 -7514 -1862
450 -1862 5079 9629 9804 8204 5001 -749 -7717 -11200 -9775 -5854 -988 4926 10322 10171 5813 799
466 799 -2906 -6789 -9804 -8757 -3001 2486 6539 9266 10002 7017 -146 -6654 -9618 -9676 -7515 -2928
482 -2928 3725 8374 8717 7789 5348 -56 -6542 -10041 -8906 -5388 -1153 4537 9590 10584 6284 1246
498 1246 -2490 -6631 -9311 -9067 -5034 746 5026 8400 10078 7713 1353 -4745 -7714 -8235 -7262 -3244
514 -3244 3229 7257 7890 6724 4742 664 -5241 -9413 -9322 -6011 -1426 3483 8295 10098 6776 2288
530 2288 -1920 -5539 -8005 -8330 -4705 185 4243 7111 8852 7047 1565 -4675 -7840 -8438 -6896 -3345
546 -3345 2040 6399 8042 7732 5666 1815 -3848 -7935 -8811 -6634 -2624 2052 6762 8584 6415 2399
562 2399 -1454 -4615 -7406 -7780 -4908 -707 3395 6691 8327 7354 2392 -2893 -6727 -7612 -6932 -4034
578 -4034 951 4905 6655 6724 5192 1717 -2971 -7105 -8243 -6033 -2226 2086 6237 8789 6852 3441
594 3441 -960 -4181 -6988 -7670 -5318 -1426 2521 5745 7805 7496 3581 -1905 -5965 -7019 -6256 -3897
610 -3897 105 4493 6613 6939 5205 2100 -2078 -6049 -7709 -6442 -3476 918 5273 7654 6848 3547
626 3547 -374 -3018 -5516 -6653 -5475 -1611 2296 5092 6737 6253 3279 -1679 -5272 -7020 -6611 -3983
642 -3983 -512 3514 6107 6621 5421 2720 -1452 -5239 -7568 -6280 -3200 442 4282 6934 6649 3532
658 3532 475 -2887 -5238 -6481 -5695 -2623 1263 4866 6792 6273 3808 -289 -4451 -6204 -6113 -4155
674 -4155 -1299 2354 5033 5849 4720 2805 -869 -4566 -6824 -6378 -3336 670 3799 6307 6605 4220
690 4220 701 -2644 -4932 -5877 -5428 -2848 998 4095 5889 5885 4213 218 -3668 -6226 -5820 -4206 -1120
707 -1120 2188 5059 6312 5071 2858 -141 -3727 -6273 -6462 -3863 -677 2658 5362 6008 4381 1373
723 1373 -2060 -3929 -5257 -4831 -2568 535 3761 5595 5811 3968 616 -3226 -5537 -5747 -4241 -2051
739 -2051 1243 4194 5844 4745 2904 155 -3131 -5459 -6022 -3744 -637 2635 5025 5875 4661 1492
755 1492 -1438 -4227 -5310 -5336 -3613 -356 3195 5029 5622 4529 1634 -2031 -4857 -5195 -3956 -1749
771 -1749 490 3378 5238 4625 2691 534 -2283 -4801 -5499 -3996 -979 1826 3932 5702 4870 2022
787 2022 -976 -3223 -4426 -4911 -3589 -494 2620 4434 4890 4006 1635 -1708 -4439 -5241 -3871 -2308
803 -2308 246 3224 5378 5122 3157 931 -1630 -4407 -5675 -4242 -1335 1199 3598 5056 4791 2317
819 2317 -579 -2843 -4345 -4590 -3485 -616 2171 4071 4702 4091 2413 -946 -4145 -5109 -4336 -2311
835 -2311 -303 2655 4377 4404 2876 937 -1287 -3579 -4758 -4074 -1449 1011 3080 4833 4781 2349
851 2349 -382 -2674 -3866 -4531 -3827 -1327 1880 3984 4196 3877 2484 -71 -3324 -4438 -3945 -2712
867 -2712 -637 2171 4207 4581 3093 1369 -988 -3174 -4795 -4365 -2160 327 2483 3911 4582 2973
883 2973 469 -1786 -3411 -3977 -3441 -1271 1143 3389 4055 3470 2419 45 -2832 -4608 -3912 -2651
899 -2651 -824 1973 3858 3972 2999 1354 -847 -3146 -4394 -3889 -1687 194 2052 3630 4566 3137
915 3137 477 -2043 -3321 -4005 -3671 -1555 1106 2479 3755 3790 3016 514 -2305 -3920 -3609 -2879 -1446
932 -1446 1390 3290 3898 2779 1430 -566 -2333 -4007 -3784 -2167 -420 1995 3625 4027 3235 724
948 724 -1306 -2884 -3742 -3330 -1727 603 2652 3435 3368 2832 885 -1981 -3624 -3876 -2966 -1213 1241
965 1241 2856 3893 3096 1689 -164 -1997 -3544 -3797 -2789 -636 1384 2890 3792 3216 1325 -1057
981 -1057 -2620 -3133 -3129 -1890 370 2298 3215 3219 2762 839 -1402 -3094 -3725 -2955 -1459 753 2831 3466
999 3466 3162 1664 126 -1502 -2970 -3568 -2235 -683 1081 2990 3417 3174 1313 -684 -2613 -3365
1015 -3365 -3494 -2206 -34 1933 3060 3328 2875 1593 -1071 -2717 -3609 -3003 -1620 537 2533 3288
1031 3288 3140 2082 590 -1270 -2700 -3243 -2525 -1007 828 2528 3544 3203 1730 -318 -2132 -3237
1047 -3237 -3274 -2100 -318 1477 2725 3044 2590 1405 -743 -2316 -3478 -3189 -1585 118 2081 3066
1063 3066 3344 2293 536 -1166 -2486 -3496 -2924 -1461 369 2310 3227 3062 1890 -119 -1802 -3019
1079 -3019 -3144 -2556 -652 1418 2671 2999 2602 1532 -445 -2106 -3248 -2914 -1980 -202 1400 2467
1095 2467 2998 2325 456 -707 -2236 -2727 -2764 -1628 464 1852 2782 3120 2044 193 -1708 -2954 -2776
1112 -2776 -2149 -959 768 2398 2656 2537 1655 63 -1703 -3074 -2866 -1905 -254 1433 2600 2899 2520
1129 2520 663 -527 -1797 -2826 -2689 -1605 -166 1621 2694 2989 2282 523 -1367 -2430 -2631 -2207
1145 -2207 -1195 601 1902 2475 2403 1792 105 -1359 -2743 -3101 -2058 -734 1226 2458 2978 2496 1323
1162 1323 -305 -1697 -2698 -2844 -1650 -283 1242 2314 2477 2110 818 -1128 -2353 -2737 -2159 -1298
1178 -1298 146 1867 2604 2586 1888 537 -964 -2332 -2787 -2014 -568 456 1700 2830 2181 1041 -177
1195 -177 -1239 -2254 -2784 -1892 -428 868 2272 2549 2268 1275 -902 -1973 -2469 -2233 -1435 56 1182
1212 1182 2078 2300 1829 543 -791 -2071 -2643 -2069 -826 384 1707 2673 2466 1520 52 -1183 -2067
1229 -2067 -2768 -2029 -544 690 1953 2538 2398 1445 -437 -1720 -2226 -2105 -1427 -289 1050 2350 2165
1246 2165 1473 631 -597 -1857 -2441 -2192 -936 -19 1248 2385 2224 1425 411 -823 -2050 -2444 -2002
1263 -2002 -776 752 1559 2103 2046 1268 -99 -1916 -2217 -1897 -1575 -675 724 1992 2342 2175 1088 -66
1281 -66 -1668 -2357 -2322 -1300 -181 895 2031 2563 1521 422 -736 -1833 -1991 -1850 -1120 57 1431
1298 1431 1726 2170 1533 93 -1047 -2057 -2115 -1584 -629 375 1643 2107 1618 790 138 -1268 -2061 -2288
1316 -2288 -1293 -149 976 2080 2293 1812 732 -667 -1136 -1852 -2052 -1016 266 1140 1692 2035 1662
1333 1662 540 -961 -1630 -2065 -1652 -1004 408 1609 1921 1855 1104 286 -1548 -1849 -1874 -1413 -335 459
1351 459 1787 2044 1544 805 -243 -1206 -1605 -1743 -1251 96 930 1587 1785 1483 540 -636 -1812 -1932
1369 -1932 -1550 -1000 119 1271 1795 1842 1165 537 -511 -1737 -1836 -1478 -630 499 1540 2117 1740 912
1387 912 -250 -1270 -1726 -1971 -1426 -149 466 1449 1739 1814 962 -586 -1687 -1592 -1456 -1050 156 1167
1405 1167 1677 1684 1311 477 -710 -1291 -1973 -1586 -827 250 1238 1876 1722 999 25 -743 -1468 -1648 -1195 -311
1425 -311 787 1460 1780 1682 1054 -417 -1095 -1760 -1790 -1122 -81 835 1731 1856 1403 388 -415 -1172 -1726
1444 -1726 -1797 -1100 34 1126 1646 1580 880 362 -875 -1389 -1658 -1453 -516 376 1157 1602 1516 1073 -90
1463 -90 -806 -1554 -2094 -1184 -352 503 1374 1995 1286 520 -349 -971 -1345 -1430 -906 161 924 1287 1657 1016
1483 1016 497 -506 -1232 -1741 -1594 -610 320 1067 1578 1488 987 174 -872 -1441 -1626 -1331 -575 309 1240
1502 1240 1568 1401 600 -140 -555 -1692 -1614 -977 -109 784 1398 1221 1564 477 -512 -902 -1413 -1237 -909
1521 -909 -76 812 1355 1214 1246 227 -305 -1255 -1472 -1183 -681 306 1143 1488 1197 643 65 -778 -1448 -1405
1541 -1405 -1048 -463 254 910 1346 1310 801 -152 -959 -1210 -1426 -973 -286 855 1315 1395 1073 507 -211 -904
1561 -904 -1441 -1266 -892 284 1076 1539 1223 842 421 -337 -1212 -1211 -1143 -189 367 961 1603 1502 760 -345
1581 -345 -1018 -1128 -1360 -1121 -222 702 1249 1400 1428 622 -195 -1072 -1064 -1126 -669 -98 616 1391 1453 847 454 -273
1603 -273 -687 -1445 -1092 -498 249 658 1373 1399 979 224 -799 -961 -1398 -982 -636 234 1038 1066 923 394
1623 394 61 -889 -1293 -1233 -866 -320 405 1486 1212 878 533 -40 -900 -1294 -1154 -840 79 771 1124 1017
1643 1017 828 -64 -672 -1154 -1238 -1072 -365 446 1386 1419 1088 927 157 -430 -1229 -1253 -1097 -322 365 933 1183
1664 1183 981 542 -86 -413 -1068 -1382 -700 -82 425 1136 1176 769 161 -404 -799 -1156 -1124 -487 365 608
1684 608 1300 1059 832 209 -281 -1237 -1287 -571 -262 221 556 1321 890 661 -118 -390 -983 -1110 -660 -326
1704 -326 558 1088 1116 904 224 -112 -865 -897 -862 -533 -222 784 916 1114 798 196 -341 -895 -977 -698 -502
1725 -502 14 772 1434 1013 449 61 -595 -778 -961 -698 -555 114 658 1292 927 562 -357 -660 -938 -1100
1745 -1100 -595 138 600 929 960 885 293 -357 -980 -910 -742 -611 7 599 1173 933 752 37 -609 -942 -1055
1766 -1055 -997 -454 -45 689 1317 1064 563 -96 -585 -797 -1082 -598 -293 257 325 768 1182 691 -148 -560
1786 -560 -986 -838 -497 -135 351 865 967 582 378 -186 -752 -772 -930 -481 132 516 1065 1030 657 -164 -556
1807 -556 -916 -909 -771 -122 141 887 821 906 545 -161 -451 -876 -1002 -808 -214 412 791 864 814 311 -400 -738
1829 -738 -986 -858 -428 -65 512 1049 1051 757 422 -337 -702 -944 -758 -297 143 339 802 817 550 63 -442
1850 -442 -900 -1018 -790 -158 332 624 746 846 419 -208 -371 -780 -1083 -592 314 632 870 1068 839 502
1870 502 125 -637 -1175 -648 -331 156 456 765 680 568 -162 -410 -691 -864 -726 -432 97 624 827 467
1890 467 404 44 -491 -405 -906 -707 -101 199 705 885 628 414 -100 -533 -962 -1073 -357 -221 353 767 533
1911 533 829 246 -183 -673 -798 -835 -578 68 724 885 886 482 -70 -518 -573 -1077 -643 -96 262 247 709 798
1933 798 639 -193 -518 -811 -752 -732 -22 287 623 813 649 546 -334 -515 -854 -759 -473 63 614 937 1136
1954 1136 884 109 -239 -786 -785 -620 -228 239 581 637 724 423 -21 -490 -567 -898 -687 -442 443 650 850
1975 850 471 265 -29 -656 -793 -915 -581 -282 267 516 809 925 -5 -303 -572 -685 -427 -455 269 576
1995 576 687 729 503 107 -249 -863 -756 -542 -273 237 601 589 478 355 -44 -617 -710 -784 -483 90 217
2016 217 823 671 590 269 -95 -622 -750 -879 -276 217 333 724 642 490 10 -273 -673 -738 -680 -156 224
2037 224 576 891 860 410 21 -584 -565 -888 -531 -406 -66 774 765 616 359 -35 -678 -923 -791 -447 -45
2058 -45 249 691 811 654 220 -111 -720 -630 -454 -375 52 519 704 1007 761 389 -206 -751 -620 -588 -174
2079 -174 228 310 845 601 246 -28 -459 -625 -702 -521 -108 342 495 723 686 464 33 -557 -672 -449 -572
2100 -572 -153 302 708 586 710 289 -239 -621 -907 -355 -100 517 193 840 886 610 156 -442 -468 -704 -476
2121 -476 -277 195 700 632 403 168 -241 -557 -523 -516 -599 6 433 329 925 499 77 -148 -602 -793 -377 -294
2143 -294 118 429 602 645 702 113 -417 -669 -648 -516 -419 -68 490 669 614 689 -9 -151 -621 -328 -352 -136
2165 -136 396 415 638 605 246 -228 -493 -580 -887 -353 -58 184 686 778 500 199 -175 -432 -596 -560 -304 47
2187 47 309 535 764 606 70 -167 -684 -545 -481 -325 92 479 472 513 454 -114 -255 -508 -611 -336 -131 474
2209 474 746 790 731 -38 105 -584 -715 -636 -257 49 262 521 738 316 105 -151 -520 -461 -446 -278 -233 651
2231 651 504 739 261 15 -476 -635 -703 -288 -179 578 626 568 793 301 83 -545 -658 -604 -282 323 302 502
2253 502 619 435 169 -117 -573 -700 -421 -110 111 378 498 673 214 -185 -286 -613 -584 -514 -274 -25 687
2274 687 738 736 431 78 -768 -316 -525 -295 -28 18 642 351 652 178 -122 -475 -586 -225 -254 -11 368 707
2296 707 651 278 18 -98 -616 -399 -427 -180 160 229 634 589 301 97 -319 -661 -768 -478 -189 341 366 433
2318 433 362 64 -32 -414 -361 -846 -312 -113 412 664 656 369 391 -67 -280 -641 -677 -173 250 519 423 500 401
2341 401 -111 -203 -592 -571 -417 -22 51 429 600 599 269 -17 -358 -583 -698 -492 -67 308 643 645 368 -42
2363 -42 39 -254 -421 -495 -76 34 198 675 337 402 62 -279 -231 -598 -224 -332 262 281 523 470 30 -41 -391
2386 -391 -609 -442 -401 -288 340 430 411 600 347 -29 -150 -640 -504 -339 -223 195 154 634 363 138 -75
2407 -75 -416 -373 -594 -189 -62 507 651 444 296 278 -438 -525 -678 -309 54 23 459 270 460 243 81 -470
2429 -470 -665 -253 -150 136 282 325 594 601 107 -283 -232 -519 -301 -106 100 367 550 452 134 -76 -220 -331
2451 -331 -524 -414 -37 -31 156 748 382 200 -31 -462 -259 -432 -442 -263 102 432 656 296 176 -114 -321
2472 -321 -492 -304 -236 139 388 199 414 316 181 -75 -523 -522 -391 -271 -66 219 367 165 166 -123 -364 -259
2494 -259 -516 -480 -3 157 444 399 368 192 -189 -297 -560 -665 -105 16 272 318 431 423 68 -168 -392 -173
2516 -173 -532 -87 92 580 510 461 11 -5 170 -269 -458 -345 -181 -167 235 272 504 397 108 -197 -464 -239
2538 -239 -590 -154 224 256 292 297 72 -171 -333 -606 -254 -305 11 515 394 289 187 -155 -207 -36 -396 -848
2560 -848 -214 87 259 317 334 156 166 -110 -290 -328 -467 -150 84 219 554 319 123 98 -196 -489 -528 -217
2582 -217 -124 85 199 654 615 231 86 -400 -406 -382 -284 192 361 501 583 422 28 -285 -456 -213 -724 -9
2604 -9 63 149 529 151 124 47 -404 -560 -475 -274 -236 182 509 481 110 80 129 -67 -238 -344 -231 -14 5 474
2628 474 285 475 5 -2 -300 -448 -651 -441 74 462 531 448 145 117 -245 -442 -440 -288 -117 32 84 352 533
2651 533 127 -188 -366 -69 -660 -159 -33 347 430 298 333 275 96 -189 -565 -379 -126 306 278 146 355
2672 355 394 185 105 -149 -393 -407 -48 -49 289 422 262 144 -101 -315 -246 -200 -300 -104 -257 358 181 262 298
2695 298 -172 -128 -384 -284 -545 -38 139 281 333 621 136 228 -269 -489 -154 -261 -48 254 288 343 544 183
2717 183 -263 -386 -505 -181 -68 145 322 407 426 512 -261 -174 -333 -391 -212 79 217 229 210 51 -11 -8 -438
2740 -438 -284 -310 -264 -106 218 553 239 445 147 -114 -217 -481 -213 -367 196 343 325 396 293 25 -237
2761 -237 -225 -493 -221 -42 127 229 448 281 14 -185 -246 -191 -363 20 43 167 190 241 192 -74 0 -202 -314
2784 -314 -444 -198 -174 310 310 325 174 296 59 -505 -459 -243 -99 -64 232 360 261 278 -53 -327 -220 -463 -335
2807 -335 -9 195 240 549 129 -10 -302 -438 -507 -70 -171 -54 145 360 220 -17 -73 -103 -327 -391 -257 -193
2829 -193 11 297 316 194 107 102 -238 -302 -88 -257 -90 239 408 544 116 294 -26 -282 -283 -245 -249 -246 307 510
2853 510 305 216 239 -148 -228 -184 -193 -23 -74 213 118 347 272 149 -230 -163 -354 -279 -133 71 254 578 -33 133
2877 133 -74 -245 -406 -334 -181 -334 383 550 487 333 268 -214 -96 -208 -201 -262 243 306 281 139 121 385 -245
2900 -245 -239 -205 -335 -2 -65 386 599 221 173 -18 -179 -339 -149 -429 8 -18 232 233 386 87 74 -363 -259
2923 -259 -105 -300 -128 333 293 216 327 49 12 -314 -257 -326 -279 95 482 239 103 216 193 -131 -328 -396 -61
2946 -61 -168 67 230 315 281 -66 -2 -150 -265 -278 -194 -102 -152 63 512 357 156 -68 -322 -293 -464 -444 -76
2969 -76 185 233 340 309 218 -11 -238 -210 -378 -92 -105 60 421 193 32 -135 -332 -406 -354 -45 -66 4 275
2992 275 -166 102 18 -111 -398 -516 -143 72 83 56 269 401 254 -92 -277 -227 -214 -266 -234 -94 221 256 384
3015 384 210 -218 -151 -385 -369 -123 -296 115 101 138 283 313 -170 -182 -459 -503 -336 149 -19 291 415 307
3037 307 205 -43 -177 -291 -76 27 -118 299 370 334 -2 -134 -187 -113 -410 -42 198 275 383 261 568 -44
3059 -44 35 -284 -54 -77 -143 -355 116 168 437 177 -28 -299 -87 223 -273 -144 66 163 220 142 89 -257 -217
3082 -217 -230 -431 -221 93 127 211 172 58 332 -215 -162 -309 -273 -287 -88 4 474 264 259 -67 53 -121 -414
3105 -414 -361 -4 -55 12 88 273 228 -88 -125 -387 -33 -636 -21 -125 554 77 454 153 -159 -120 -387 -474 117
3128 117 -319 156 222 366 269 34 -92 -406 -187 -185 -159 -51 2 418 380 105 173 -257 -87 -44 -252 -58 -13
3151 -13 -74 456 -19 130 127 -142 -107 -103 -371 -128 -75 175 426 165 275 -158 -125 -297 -433 -176 38 248 104
3174 104 44 370 -196 84 -182 -70 -436 -83 14 246 401 416 203 30 -226 -76 -181 -226 -147 -58 378 100
3196 100 332 -7 194 -44 -234 -230 -231 128 213 -64 247 81 50 58 -30 -147 -176 -117 73 159 -128 47 150 -147
3220 -147 -293 -31 -9 -263 -67 -47 206 535 155 312 83 3 -222 -203 -267 -122 -107 159 199 425 80 285
3242 285 -228 -263 -130 -52 136 14 173 168 123 184 -1 -128 61 -298 -106 36 8 231 176 33 -98 58 -180
3265 -180 -442 -347 -394 -62 120 418 311 114 71 -52 -129 -59 -273 -153 130 128 332 268 37 -240 -185 -414 -297
3288 -297 -291 169 262 120 293 199 -192 63 -177 -351 -261 -190 -27 -21 179 306 266 -50 -111 -305 -111 -351 68
3311 68 -166 30 128 -38 231 217 -100 -184 -184 -191 -193 147 103 235 143 2 -165 48 -191 -386 -181 318 -183 96
3335 96 242 52 145 95 -124 -539 -158 -46 -189 180 158 111 257 -216 -148 -106 -104 -256 -68 9 103 229 225 117
3359 117 36 -144 -449 -323 -171 101 69 290 102 141 60 51 -141 -186 -201 -293 176 114 134 191 162 37 25 -329 13
3384 13 -399 -28 347 194 374 298 110 27 -71 -230 -62 -154 299 147 245 -224 139 185 -3 -162 -43 -273
3406 -273 -121 -11 227 118 144 37 151 -1 -284 -97 -200 -160 330 -87 51 178 -117 98 6 -201 -530
3427 -530 74 -24 288 206 -36 195 118 70 -97 -261 -115 -240 127 84 83 227 308 -143 -242 -401 -336 -159 -70 -71
3451 -71 88 125 23 -88 35 -85 -298 -199 -414 -166 -164 328 63 152 -9 3 -174 -11 27 -104 152 21 119
3474 119 -71 -50 254 -69 -32 -161 -152 -88 -88 128 17 51 -66 -1 2 -121 -126 -305 15 56 286 329 -119 37 -57
3499 -57 -268 -253 -113 -421 -157 -3 275 165 213 214 -302 -370 -142 -383 29 57 113 -7 277 247 -195 -141 -149 -170
3523 -170 -29 -63 -89 52 -99 273 30 148 -309 -176 30 46 -105 104 365 83 67 54 198 -34 -150 -171
3545 -171 57 199 -50 -24 173 64 170 -145 245 -141 -331 72 87 94 303 434 22 42 -187 -249 -11 29
3567 29 -44 209 32 12 197 -23 -79 -20 -202 -143 -22 206 119 378 183 270 -70 -106 -126 -118 -100 -379 -51 99
3591 99 260 268 83 -175 -16 -215 -230 -200 -107 117 -112 22 143 291 15 12 -54 -253 -182 -354 -203 42 124 190
3615 190 230 -61 -192 -186 -212 51 157 265 343 200 24 -234 -286 -226 -316 -293 -35 118 -213 89 367 390 -7
3638 -7 -193 -39 -205 -268 56 211 135 484 101 287 -77 137 -341 -287 191 -157 127 387 174 201 269 32
3660 32 -244 -237 -155 -183 190 191 134 202 128 -68 -58 -389 -208 -267 -142 -184 85 131 105 151 -124 282 -197 -176 -64 -236
3686 -236 228 102 212 240 158 -35 51 -329 -157 -142 -31 217 109 -78 423 14 -187 -74 -144 -119 -119 -93 -49
3709 -49 -8 136 101 -38 -160 -133 -221 -76 -155 1 178 -26 -13 50 -79 -103 -237 -51 -84 -195 249 237 38 63
3733 63 36 57 12 32 134 6 11 31 161 -17 -56 43 20 -270 -249 -58 108 -263 14 336 6 60 -382 -278
3757 -278 -260 -255 -56 103 11 -55 -101 289 93 9 -191 -280 -217 -87 227 -94 27 128 -2 -137 -129 -72 89 -172
3781 -172 -232 418 46 280 -68 -81 56 -186 -145 -57 5 41 172 164 46 242 226 125 -110 131 -297 -99 -102 268
3805 268 78 221 183 105 -60 -218 -152 -170 53 104 244 156 24 135 113 -200 15 -73 -223 -54 360 277 -293
3828 -293 333 -26 -84 -12 -339 -71 -316 -130 -60 102 187 141 282 181 -152 -99 -181 32 -60 -244 105 92 89 -116
3852 -116 -91 50 61 60 138 232 373 112 -135 8 -71 -166 -322 -86 -76 -296 77 -229 156 18 121 -172 -154
3875 -154 -83 -122 -193 -143 -47 263 -78 95 114 20 4 -187 171 4 237 -162 285 -125 51 282 -123 36 73
3898 73 -146 -73 76 11 74 -1 103 14 -119 -60 -410 -71 -36 117 68 245 65 -214 200 -339 -277 -199 -105 27
3922 27 -34 221 93 -110 14 -139 -121 262 -7 -179 94 -5 79 117 251 -32 -86 -95 153 -146 -248 -35 137
3945 137 132 155 189 -23 176 -89 -137 -361 163 91 -3 330 46 53 5 -23 202 -269 -149 -348 67 45 -87 10
3969 10 -93 -120 -458 -29 -157 -333 34 330 6 6 56 -48 -142 -339 -105 251 65 71 -19 -94 29 -74 -252
3992 -252 -5 -181 122 212 -68 176 87 -80 -17 141 220 -217 -119 162 124 137 94 88 196 -196 47 -74 -207
4015 -207 -38 20 -148 18 91 188 15 252 161 -131 -96 66 -42 62 322 172 274 179 -52 61 176 -91
4037 -91 122 71 120 78 198 -12 73 2 -176 -203 -35 -273 90 142 -146 145 3 -195 -152 -164 -100 -264 -131 23
4061 23 235 205 178 60 -33 -306 -220 -274 -171 106 -39 87 248 216 42 117 -53 24 122 23 -158 78 287 -208
4085 -208 51 56 89 -216 -211 -93 43 84 25 47 126 124 -134 -93 -219 -160 -92 60 -155 76 23 -194 248 91 12
4110 12 -285 -34 -69 29 124 11 288 229 -246 45 -181 19 -229 -146 178 -355 -19 129 -64 127 9 159
4132 159 -46 -81 -129 -122 -73 154 -87 -206 -234 -136 -257 -57 -98 -166 -90 47 359 60 103 -78 -46 -93 -11 -48 -35
4157 -35 71 117 497 300 6 -225 -202 -84 12 -95 -73 -52 107 -202 195 149 -195 183 -68 37 -436 -143
4179 -143 -176 29 56 18 -207 28 -61 -116 60 -302 167 209 32 223 -45 75 -39 -221 -85 -77 -16 39 -165
4202 -165 -105 160 243 19 -277 -9 -146 -59 51 357 136 -179 242 93 -123 -243 -37 138 72 -5 295 21
4224 21 170 -96 20 -185 36 -109 33 -157 154 162 196 75 257 -13 -138 -278 -147 18 -20 138 8 69
4246 69 100 -147 97 -134 -25 -14 11 187 -9 106 151 127 8 -259 -183 143 -275 -188 89 122 -125 142 18
4269 18 -79 -20 -72 -227 -14 -51 -48 132 180 45 177 26 146 -105 -62 -167 -217 116 228 70 14 247 -214 -137
4293 -137 -133 181 128 103 46 23 -149 -72 -142 135 -199 -109 33 -128 286 73 53 -84 1 -119 -159 -57 -104 -89 -75
4318 -75 -165 249 -90 -342 -47 -2 -124 -41 -203 -34 225 314 -77 -46 116 -50 25 11 -51 -13 -38 130 -8 -76
4342 -76 188 -19 -43 24 -174 266 -143 -78 -251 -68 65 283 -203 -232 28 -126 -57 135 217 165 -43 176 -41
4365 -41 -24 69 -12 143 -182 -6 -77 -149 22 -75 -32 356 -15 -218 10 -119 -105 159 42 -100 55 63 61 -309
4389 -309 -199 -108 -47 77 141 318 98 44 128 47 47 157 -113 -109 53 -183 85 385 234 138 -127 4 -71 -28
4413 -28 41 -185 -101 29 -22 123 -155 -78 53 -13 116 57 75 56 10 29 211 -193 -207 -132 81 185 42 -129
4437 -129 -124 -8 19 61 -221 -138 -37 -264 -182 97 28 -16 -33 181 288 -14 193 -162 36 137 132 314 -93 -74
4461 -74 -2 116 -161 -82 -134 -58 56 -179 298 118 -83 193 -67 46 -178 -123 -141 173 -84 44 179 41
4483 41 225 -76 -106 165 229 117 -160 -32 125 5 169 383 259 -133 17 113 181 -14 236 14 -52 237
4505 237 -55 104 73 188 -169 45 382 114 -152 -29 161 90 -104 -131 -68 202 9 -146 200 -256 -76
4526 -76 -176 -109 173 190 24 -145 63 264 136 -123 -31 -148 58 -73 -196 1 -156 17 200 4 -165
4547 -165 -70 -26 9 -213 169 -181 114 6 -256 -37 59 135 -56 37 -105 -2 18 -31 121 127 113 -87 68 109
4571 109 -191 113 -74 -110 71 81 43 43 -47 -174 38 -14 -187 96 193 -54 84 -159 -194 58 -158 -138 -166 32
4595 32 -65 -187 53 95 233 -3 174 -202 -403 163 -203 283 -46 -104 67 214 2 -114 -38 135 20 68
4617 68 -32 114 -23 109 179 101 20 109 11 -81 108 -124 -56 -287 108 -78 -73 -34 376 -176 -34 34 33 -72 66
4642 66 -132 125 160 -64 48 32 65 -289 -179 -138 -173 45 47 108 -85 -33 10 -75 -166 -102 -207 -59 31 120 -110
4667 -110 -142 91 167 -49 -134 157 -27 -40 -10 21 104 -229 -114 137 -15 -115 -57 145 72 -37 -5 -95 1 283
4691 283 101 4 138 2 106 310 -303 22 -64 -77 148 -149 -103 107 44 -26 -74 -126 193 -299 43 57 -192
4714 -192 -185 50 41 169 -51 -2 48 -190 42 28 -123 179 -257 202 140 -115 -76 -200 -8 133 9 154 -251
4737 -251 159 43 203 -108 -148 10 -213 40 -340 -155 61 -67 -26 185 -361 -30 -195 -6 -179 95 -4
4758 -4 125 232 124 -9 -387 87 -133 -250 -213 199 -126 -159 -36 -80 5 -178 -141 101 -43 186 187 68 -75
4781 -75 -158 -58 -56 -76 60 70 133 71 -71 -108 99 211 24 -232 148 147 45 -59 -274 -64 137 62 46 -98
4805 -98 -8 -73 -59 -205 -142 -83 58 -57 -82 -38 -254 -104 157 18 19 -68 15 8 -10 -95 -94 -67 -14 -227 -233 224 100
4832 100 235 57 -145 118 -128 139 94 226 -181 315 -215 203 -79 222 -212 -95 -157 -158 47 -180 169
4853 169 -18 -88 40 66 -19 -8 44 198 145 -57 14 10 100 391 0 -72 284 36 -136 -313 -17 159 -3 161
4877 161 -1 -30 -79 -31 77 130 85 202 -28 2 -215 114 12 136 243 -89 -88 -112 -350 273 66 -202 219
4900 219 -6 67 -81 15 -14 83 -88 -220 -3 -91 131 187 -332 -228 4 143 186 420 -108 78 -100 -7 85
4923 85 -42 145 -147 88 -155 120 -65 -38 68 69 -157 187 -99 57 177 167 27 164 -27 48 -41 227
4945 227 172 225 0 123 118 332 -182 -103 73 37 101 64 107 214 -146 262 -22 -178 59 -103 172 -27 231
4968 231 -350 -90 -56 76 108 134 -128 -8 -37 151 89 -13 -113 71 28 -15 51 32 21 245 87 36 55 -26
4992 -26 -181 -292 -17 -177 151 41 92 20 -228 -1 151 2 -39 114 79 17 97 -86 -34 144 -131 -437 -219
5015 -219 -202 -189 -13 -87 89 18 289 73 -163 -27 100 -54 -278 -22 -3 -160 234 324 410 70 -81 -79 -25
5038 -25 62 85 24 -60 -85 35 206 -153 -174 220 -42 -172 310 366 -18 -136 129 -160 4 -8 57 -274 -47
5061 -47 -33 -60 -162 -360 -147 -256 138 6 48 -223 3 352 -98 165 -27 -59 -164 -108 260 -154 135 -101
5083 -101 -101 72 -47 10 -91 -119 52 -88 23 -5 -78 2 5 -36 -45 91 -98 -54 -307 24 84 -330 48 13 86
5108 86 -419 185 -96 -148 102 -127 -197 -95 25 -69 56 15 -141 94 41 -215 70 -97 -157 46 169 203 -110
5131 -110 171 27 -129 127 214 156 -159 112 -180 -24 18 -2 -191 -49 -30 -233 -55 -97 64 64 91 30 -146
5154 -146 -3 112 75 128 -191 85 -114 -111 218 -201 136 94 -165 -72 -142 61 47 -304 30 -110 22 193 -408
5177 -408 -109 -33 112 165 126 218 200 -124 9 127 63 -57 -217 -181 -190 12 -18 127 -39 -147 -137 308 165 -293
5201 -293 -240 -93 40 79 -154 29 1 49 14 -47 -101 92 -57 -78 50 -2 213 -207 -132 -118 -49 -132 -38 17 -14
5226 -14 15 43 -42 232 107 158 -16 -37 67 68 -78 197 -78 -73 -110 -314 -46 -6 -7 -172 165 -113 -60 110 -18
5251 -18 169 -113 23 71 -109 -45 -6 -80 -32 -21 -148 166 -151 22 -104 95 43 -182 227 52 -118 -86 211
5274 211 32 -224 118 69 -139 33 90 -51 46 37 334 -89 19 -122 93 246 92 -66 -224 -120 164 22
5296 22 202 313 17 -278 123 -145 88 -92 -66 -86 67 -60 275 158 -111 -34 66 -19 37 9 -226 41
5318 41 -17 -65 186 -48 186 -118 43 94 7 140 34 -96 -115 -114 -93 115 -169 -281 -248 61 -127 121 168 116
5342 116 42 -34 -115 -30 361 -20 72 258 153 -2 -284 -133 -48 -224 219 53 23 -8 126 -79 100 34 296
5365 296 308 33 -125 -93 25 -2 -121 158 39 -34 106 166 83 124 186 -9 -45 176 192 78 -62 298 -15
5388 -15 99 147 72 39 140 105 365 -85 86 62 153 315 83 201 -156 -144 169 -10 -178 131 6 131 -121
5411 -121 -73 -49 -219 20 -145 -118 66 -44 79 292 -102 -217 4 -116 -70 -75 448 69 112 -258 159 170 122
5434 122 110 37 -5 -238 -40 31 -156 87 -273 -108 -434 32 -3 -158 -149 45 -38 43 -54 121 194 69 -152 -121
5458 -121 -32 167 -82 -82 133 154 99 18 66 128 304 81 3 346 180 78 52 61 -201 252 43 -2 -69 -20 -135
5483 -135 -9 39 -54 152 108 -3 -213 6 28 -27 -66 -161 66 -171 114 -425 -328 182 -125 -15 170 210 40
5506 40 142 -25 -259 -72 180 225 -50 -50 136 148 -115 320 169 10 65 -135 223 155 24 -170 -9 -91 89
5529 89 -210 20 77 -25 16 -71 8 131 234 -229 8 241 169 206 -85 -9 17 184 48 158 77 297 -251
5552 -251 90 174 -132 5 4 72 -89 -190 -173 241 103 151 2 30 -109 120 -5 -285 235 -137 55 -115
5574 -115 105 24 -180 278 -95 -145 305 -231 43 45 83 -154 -191 24 -253 65 57 -2 -192 95 12 -61 7 209
5598 209 66 213 -35 -4 86 -273 -110 124 -120 52 -343 78 96 34 -110 44 -143 -8 -107 -186 48 -60
5620 -60 79 -88 -26 -279 -218 81 -306 -3 155 -23 -135 38 87 -107 91 -90 215 31 -16 -207 59 -191
5642 -191 174 103 330 102 16 1 136 -70 123 -108 113 121 -98 124 53 185 27 -71 -81 87 36 -64 -124
5665 -124 259 234 -102 -256 21 -13 -41 151 -3 57 -17 -166 104 -134 -17 53 -131 228 53 1 62 -30 -45
5688 -45 48 -219 -35 -110 -148 181 -120 -29 -80 10 -111 95 -7 -288 -236 -134 1 90 157 36 40 120 18 -130
5712 -130 -51 -55 25 -132 -260 -90 239 51 58 116 54 179 59 -60 176 53 231 -69 159 120 -267 18 114
5735 114 21 -31 72 -19 88 260 53 -127 168 26 -110 66 169 -147 161 -238 82 -76 57 -111 -15
5756 -15 48 56 -53 202 -228 192 -72 132 118 14 -211 75 -81 -243 299 82 -110 245 -185 -200 314 -92
5778 -92 62 187 170 -111 264 -107 11 -49 -66 191 4 101 -212 -121 -99 4 298 -90 -49 48 147 23 5 -258
5802 -258 -139 -241 123 -102 20 -2 -47 294 -25 -1 -138 -132 165 62 -27 106 -126 -204 -239 -44 -12 -193 -54
5825 -54 -54 64 -74 105 -80 -205 -146 -99 15 119 111 129 343 12 135 -140 -7 73 71 -162 129 -164 152 30
5849 30 114 -139 111 9 -78 -111 -227 131 -106 42 -116 -224 -51 -89 166 -18 -200 -210 -21 25 49 -245 -123
5872 -123 -126 -155 38 36 -215 -152 137 148 91 -64 -294 217 199 188 14 -46 198 -95 -147 -242 181 11 -3 149 -15
5897 -15 -204 168 -117 -10 79 141 147 71 283 71 -169 -85 116 -101 -135 284 80 -159 106 -168 -60 -96 -19
5920 -19 -53 14 -12 -146 2 -27 36 -11 157 77 -52 9 185 -424 -41 39 -100 16 -112 155 -170 16 196
5943 196 -148 -25 92 -49 95 -127 -93 35 72 73 -104 63 191 -236 -117 -104 44 -289 -166 181 134 -101
5965 -101 -208 194 157 12 -49 60 362 164 -116 -27 -32 77 -111 -15 212 -184 -163 -238 -160 11 12 -11 0 -27 -59
5990 -59 -247 206 -99 102 108 58 -227 -224 204 -222 -96 102 127 123 236 45 271 122 88 157 41 95 -374 49
6014 49 -46 57 -130 45 -167 -37 106 39 120 -74 59 -107 -28 -51 -6 11 115 134 59 330 84 -190 70
6037 70 123 56 -190 -45 25 80 -97 43 66 -127 -38 49 53 43 -165 -2 32 -266 -159 -208 -102 -4 163 -252 -124
6062 -124 173 -59 250 -81 4 -7 66 36 -78 -50 -14 -159 -172 -57 15 -20 101 -12 -61 -214 -40 61 -6 -34
6086 -34 -7 -17 -304 -127 5 -72 -60 -34 -225 -56 284 49 139 114 209 45 19 -27 78 69 148 -64 37 5 86
6111 86 -50 -10 -185 142 86 186 -34 28 174 -241 -189 -348 -80 81 -90 -147 -128 179 -92 -38 -134 -227 151
6134 151 286 -199 -82 9 -60 36 -204 7 300 -286 73 271 -13 -26 -101 -127 88 139 -49 -195 141 5
6156 5 67 -20 118 159 -159 -246 -78 -141 61 -64 -11 63 -8 154 169 222 24 -4 -15 190 -35 164 -202 233 247
6181 247 43 166 10 174 180 122 47 10 -74 82 -92 -67 121 -98 -175 36 -75 -247 -182 -35 74 240 180
6204 180 -121 -88 -252 52 -9 -90 -8 55 296 167 155 -50 182 -122 -77 30 250 66 -154 266 -83 -66 40
6227 40 34 -69 -177 -21 155 50 -5 -92 226 -2 -21 104 -28 -130 99 104 106 79 96 -78 -84 205 -186 43 180
6252 180 81 -126 6 44 -238 152 166 104 76 341 -190 107 -97 -208 -182 37 -68 -104 -176 37 17 118 -87
6275 -87 -160 5 120 -29 88 144 179 104 0 170 87 111 115 9 -60 -140 -174 7 -185 -3 -10 -97 105 2 -66
6300 -66 13 184 112 -137 -135 48 -120 -87 -112 28 27 -32 72 -33 226 -85 -57 -139 -12 87 -108 160 36 -175
6324 -175 21 -108 125 -196 -174 -82 -91 211 243 131 -77 -72 55 -174 34 136 -398 -51 -134 -61 -53 98 -26 8
6348 8 36 64 167 -87 -59 68 -136 -205 -9 72 113 61 -32 3 -214 68 -44 -282 177 22 -5 -49 9 -30 -238
6373 -238 -285 2 -28 81 -8 135 -169 -50 -72 -135 98 -197 239 -78 -81 -157 -80 -201 4 -104 65 3 -30 216
6397 216 -262 210 -173 76 109 -334 183 -24 72 -3 206 -146 17 118 154 254 184 14 87 321 -40 39
6419 39 27 -73 182 -71 60 -31 16 226 -4 157 -251 103 -29 228 191 -30 67 -147 -50 146 130 266 291
6442 291 -68 -141 185 52 349 23 -6 -49 37 5 -251 -5 21 53 -189 46 55 -25 211 134 38 -99 -273 255
6466 255 83 -53 -161 -215 36 -10 36 77 -310 -269 13 70 284 21 92 90 -210 -157 -179 -148 -131 48 73 174 274
6491 274 -58 -169 250 89 112 129 -225 198 112 201 92 32 23 -177 2 105 -48 -46 -10 -29 -56 89 -62 1
6515 1 -21 -167 -57 -35 90 148 -9 160 223 -176 -85 -114 2 -269 63 -138 178 -105 53 178 41 150 -104
6538 -104 -18 -75 -148 -80 163 -170 112 10 -247 -31 -95 -26 160 50 -205 142 -96 -86 -94 25 -75 -59 15 -35
6562 -35 84 60 85 -106 -4 0 -40 64 -130 315 269 48 -168 -76 -99 113 -209 150 -138 320 5 38 -64
6585 -64 198 74 56 164 -69 18 75 121 -28 18 -181 130 24 55 -132 361 -94 192 -29 -66 182 -165 -49
6608 -49 67 282 143 8 86 -23 201 17 -472 -230 43 166 -44 -304 -12 63 -88 -10 70 163 83 80 163
6631 163 -134 -132 -194 225 165 -119 227 138 -158 -103 -18 -156 150 -117 -171 -35 153 -73 76 144 85 42 182 260
6655 260 63 -135 -285 123 -150 -6 88 228 -137 -15 -285 46 144 22 -221 -69 125 -9 -138 43 145
6676 145 53 133 59 -129 20 -82 -121 -83 -254 129 -304 -5 34 66 136 118 94 57 50 -27 21 -152 28 138 -123
6701 -123 47 20 100 -153 253 -111 84 305 -207 -13 -112 -186 136 44 -255 11 122 -8 120 23 15 -82 -298
6724 -298 152 133 101 120 -28 -57 137 196 281 -184 -165 53 -3 -52 16 -8 122 202 -31 280 -74 -215 55 -48
6748 -48 204 -260 -69 330 3 -38 -227 -70 -325 97 -197 -89 -61 -125 -102 3 12 -102 -7 -153 43 -146 -40
6771 -40 -206 -188 -2 566 171 166 -130 30 -192 -2 -183 27 104 -69 36 39 -14 26 28 125 -225 -3 -29 -88 -65
6796 -65 -50 371 -85 -190 1 5 73 -104 -40 -46 -299 -32 223 49 -57 39 133 -69 177 304 -47 -33 -128 -3
6820 -3 255 21 119 246 -17 -122 -82 186 -464 22 209 -91 3 -287 205 -45 89 -16 100 -155 -182 -8
6842 -8 26 -47 -39 134 -46 -49 63 255 186 -211 -25 -169 -1 75 66 146 117 73 12 28 18 147 -144 118 -89 -33
6868 -33 -88 -24 250 174 -180 -135 133 11 356 -20 163 36 -38 -104 -383 14 281 -160 36 56 169 -55 -109
6891 -109 209 -110 -223 196 -63 -115 -16 -62 -107 184 187 -16 92 64 228 180 78 60 76 -231 -237 193 -80 -31
6915 -31 -131 -78 211 58 -9 62 -123 -63 45 149 -56 112 123 29 -39 -38 -88 -58 -327 145 -93 -176 -207 231 -262
6940 -262 -24 -148 -94 90 73 -55 -168 -19 29 183 142 57 -24 140 -139 134 -125 -37 190 204 -60 -71 -77 102
6964 102 -46 -132 -350 -166 20 -24 -100 3 -162 -55 -57 -96 15 227 5 -250 -49 -16 -268 -203 321 -139 37
6987 37 -68 -260 2 -23 76 76 94 -203 -117 67 33 -11 132 22 -72 8 40 7 -45 100 10 58 100 53 81 -40
7013 -40 174 -135 -74 24 90 9 -29 208 94 -162 -146 -4 -175 32 14 -122 -79 65 -17 171 -1 -149 53
7036 53 33 -57 -27 -15 182 38 28 60 -55 -142 157 -32 93 100 -35 208 -273 -141 -38 -92 -20 17 208 -77
7060 -77 -63 5 -14 323 -123 -110 -48 -220 -330 44 120 -164 -81 -128 144 85 362 185 82 89 -82 34 171 193
7084 193 -252 78 71 -106 -49 -5 28 -291 49 -167 41 -338 75 -67 0 -13 -73 -147 28 -75 -14 -82 -436 -17
7108 -17 135 65 1 -186 204 251 -62 91 58 -269 153 -22 -128 61 37 -31 -195 -77 211 58 -127 -92 75
7131 75 200 -22 8 -150 -5 -188 -121 39 67 16 -146 -339 -230 46 -140 -178 -8 36 -6 -136 -43 -75 -37 100
7155 100 8 -241 177 -126 -354 -5 -40 -145 20 229 124 -136 -206 -45 110 126 108 92 -56 198 141 -201
7177 -201 -33 -136 70 -164 -52 107 85 173 1 337 -141 -238 142 -13 168 56 101 -34 96 -218 144
7198 144 -45 -180 -80 -192 120 -70 -38 2 20 17 -159 -55 -26 -57 16 17 -241 -37 67 8 -92 120 -107 -180
7222 -180 84 -116 -74 -3 120 127 -141 107 147 36 199 -185 -15 175 276 -12 -90 194 -135 62 -21 49 180
7245 180 11 119 226 79 86 -97 -15 94 -99 -2 -47 11 -63 -51 -296 -145 -92 -69 93 59 -238 73 108 -111
7269 -111 -129 155 -113 105 89 -454 -151 18 101 -22 -178 -80 -79 270 328 223 262 -61 246 -144 118 15 30
7292 30 111 -172 54 -394 54 27 28 -189 26 -83 -179 -64 201 -87 10 -73 90 -155 155 -93 13 195 -279
7315 -279 6 154 73 -42 -120 102 306 243 -63 21 33 -78 -137 7 -79 486 70 51 146 -35 161 85 -176
7338 -176 71 91 -102 5 134 215 -62 5 26 63 -114 -37 -79 188 158 87 -148 224 40 73 -8 240 12 -166
7362 -166 244 -9 -39 -10 178 45 44 -32 -185 -60 140 -157 -9 -18 272 129 49 -65 -2 -73 71 -137 20
7385 20 67 91 61 174 -108 -70 -31 81 -97 -297 20 -61 -31 227 -60 -142 -242 -143 48 50 -21 -82 -88 -136 159 -122
7411 -122 19 -229 -138 215 -74 149 288 216 194 163 217 157 -276 187 9 -391 -44 -136 168 26 26 274 -123
7434 -123 110 148 51 -12 5 -65 342 -307 -99 -248 -273 114 -140 171 -95 52 2 -13 -317 9 -86 -43 75
7457 75 -35 81 -16 -129 -24 111 -93 20 180 101 -95 36 -128 -85 -134 -7 24 93 181 327 -59 -223 222
7480 222 76 -68 265 -203 64 6 -56 -61 -92 250 66 -303 -218 49 220 232 64 32 79 -91 50 -86 14
7503 14 83 -193 -206 -163 42 -13 176 60 -415 209 -217 -223 -84 80 124 -8 -28 -286 60 37 -46 -42 140 16
7527 16 -14 196 -123 -74 13 -152 28 29 268 -86 -172 -115 -53 -37 100 274 224 10 109 -233 135 86 -60 13 -11
7552 -11 -139 83 234 100 -2 51 -191 -87 -37 -92 -65 81 -20 -87 203 172 -81 -155 174 -98 157 -40 56
7575 56 -31 17 257 55 -334 23 68 128 128 -106 -38 -40 118 8 -316 187 231 214 299 95 96 156 -165 -28 360
7600 360 -44 -386 -33 -13 209 -50 -55 7 -163 67 76 -73 177 186 141 62 -68 70 -263 -54 -135 88 102 72
7624 72 141 123 142 83 -8 85 19 104 -136 58 -40 -29 -237 -142 -29 -51 278 47 46 -93 -71 -59 -37 -19 61 -72 -104
7651 -104 -169 -16 -70 287 44 -50 148 -94 37 -135 101 -137 105 96 218 -223 -127 203 73 8 29 -185 17
7674 17 184 30 -57 108 190 -6 197 100 192 51 -141 166 -214 -28 229 -151 -73 8 -11 77 123 -75 111
7697 111 1 -50 37 96 121 -40 -162 -249 63 -38 -45 64 -84 -226 -163 121 -65 149 -126 120 124 17 124
7720 124 -178 198 -51 -335 -200 -15 -40 17 -248 -4 72 -76 48 108 -53 1 -71 -39 51 -67 -126 166 -142
7743 -142 126 80 -58 13 -10 -83 158 -74 -100 -1 18 98 -130 -41 229 -65 107 -23 -255 -156 208 -72 -120 -66
7767 -66 -40 -113 106 140 -8 -180 -193 -192 106 36 -37 -184 -161 -204 253 94 153 4 -205 140 -85 -50 -41 67 103
7792 103 -2 -98 -196 179 -49 -126 110 22 -132 7 -30 -139 -68 62 -22 -137 -10 202 229 41 92 -151 -15
7815 -15 26 67 49 -237 39 67 176 -27 106 -180 19 37 -82 -208 -169 214 -90 -106 116 9 -11 147 5
7838 5 179 63 122 -98 147 -134 8 -48 189 -71 56 -102 -235 -155 -22 -2 2 -93 205 157 287 38 93 -194
7862 -194 -83 104 -71 -60 90 -29 192 -8 -161 28 -19 -40 -220 267 -272 -190 168 179 221 166 264 -217 -171
7885 -171 77 2 -145 -88 -32 -71 140 44 139 309 -117 -35 -133 72 153 -36 95 -154 -47 46 -192 -240 221 -68
7909 -68 108 -43 -72 -158 127 -123 -148 100 321 -51 -92 -127 80 101 -156 190 -103 -19 -205 50 -144 -33 166
7932 166 112 118 -101 -139 137 -50 175 132 -139 -75 -125 104 -69 -155 29 -115 -138 -100 146 23 64 -75 126 64
7956 64 -50 29 -131 57 114 -434 -145 -155 -113 0 155 -46 -198 64 99 74 164 -99 -135 158 -61 -3 -43 143
7980 143 -176 117 -67 -146 132 -58 -142 248 165 66 126 24 -217 257 23 58 1 -101 169 44 -8 -328 58
8003 58 -89 111 -146 -65 67 -28 198 18 -70 209 118 -133 -77 64 -92 72 161 -41 43 -58 -69 -262 109
8026 109 -42 -44 75 51 105 76 13 -3 -164 121 57 -38 22 234 84 97 -16 -178 130 80 32 58 225 237 -1
8051 -1 383 -175 -85 39 23 418 86 174 60 106 -61 115 -30 -19 252 -207 -326 -15 -78 -268 -53 -338 -1
8074 -1 -136 -120 -34 110 -198 49 133 -118 56 96 -145 -18 195 -184 -50 -64 -125 -164 -184 -113 181 118 -151 270
8098 270 177 -160 -115 259 47 -48 89 51 -80 -74 -139 151 228 262 40 -7 -235 2 56 -105 216 134 -23 24
8122 24 131 -42 -96 -3 -19 31 -30 88 169 118 -116 160 305 51 -79 -292 -96 200 50 -376 -32 -96 -201
8145 -201 -80 -126 131 42 -114 334 41 76 -16 22 -423 -271 13 30 100 -108 -19 -328 -82 -13 -153 -289 -388
8168 -388 -50 171 -290 -42 6 -23 59 -125 -159 132 -209 -80 -75 105 -173 167 170 26 -89 179 -97 -362 3
8191C
$$ Imaginary data points
##PAGE= N=2
##DATA TABLE= (X++(I..I)), XYDATA
0 0 0 0 0 0 0 0 0 0 0 0 0 0 0 0 0 0 7 -8 8 -8 8 -8 15 -16 16 -22 24 -25 32 -37 40 -47 55 -61 69 -77 87 -95
38 -95 109 -119 135 -148 164 -182 203 -225 247 -273 299 -330 363 -400 441 -487 539 -597 661 -738
58 -738 826 -929 1054 -1208 1400 -1652 1998 -2504 3316 -4839 8725 -46096 -51477 10650 11671
73 11671 19668 33627 44528 20939 -3235 -19234 -23312 -32151 -31093 -13247 18449 33696 33661 28275
87 28275 18198 -9347 -35384 -38142 -23684 -15302 -8202 10406 33328 36358 22747 10284 -1668
100 -1668 -22545 -36861 -29581 -9784 7742 21002 27880 25524 14436 -749 -14219 -22483 -29050
113 -29050 -30206 -14043 11528 25801 29174 30798 22462 -741 -21357 -26798 -24393 -18989 -8215
126 -8215 8442 21876 25303 20661 13171 359 -19904 -34204 -29168 -11838 3049 14491 24801
139 24801 28950 21363 5613 -8147 -16532 -23852 -26232 -15425 2842 15663 22320 24507 16602 -1184
153 -1184 -17146 -22612 -19669 -14000 -6205 6834 21432 26675 19893 9967 572 -14637 -27618 -26895
167 -26895 -15033 -1550 10953 19948 22557 16356 4577 -5457 -13390 -19871 -21993 -12647 3329
180 3329 15725 21081 21479 16484 4003 -11856 -21577 -21144 -15587 -8522 1260 13681 20099 17971 12391
195 12391 3062 -10138 -20244 -19907 -11665 -1671 8443 15895 19566 16147 5218 -6195 -13679 -17664
209 -17664 -19405 -13931 -1244 11797 18816 19812 15094 4587 -7737 -15678 -16940 -13745 -7524 2602
223 2602 13007 18709 16289 9961 939 -9250 -18694 -21284 -14729 -3257 7476 14649 18452 17023
237 17023 8852 -1548 -9550 -15158 -17040 -12406 -1830 8150 14675 16267 13023 4513 -6547 -15450
251 -15450 -17344 -13010 -6513 1151 10217 17204 17257 11031 2443 -6740 -15052 -17940 -13219 -4327 4936
266 4936 12082 15631 13963 6735 -2450 -9889 -14402 -15229 -11658 -2371 8579 15676 17114 13212 6136
281 6136 -3742 -12616 -16158 -14216 -8611 -1226 7729 14163 15273 10515 3044 -5094 -12338 -15986 -13378
296 -13378 -5032 4176 11195 14606 14152 9092 -156 -8499 -13271 -14609 -11916 -5107 4866 12068 14077
311 14077 11988 6250 -1758 -10155 -14397 -12492 -6830 436 7178 12919 14821 10775 2563 -5096 -11896
326 -11896 -15152 -13868 -6742 2339 9592 13288 13715 9673 1566 -6753 -11601 -12397 -10556 -5085 3561
341 3561 11437 13935 11465 6239 -482 -8854 -13956 -13531 -8231 -1710 5191 10900 13767 10907 3941
356 3941 -2195 -7862 -12402 -12308 -6458 1794 8207 11019 11700 8686 1310 -6635 -10996 -11957 -9875 -5301
372 -5301 2466 10164 13124 11405 6892 974 -6532 -12618 -12719 -7801 -1790 4135 9517 12705 10261
387 10261 3969 -2334 -7740 -11410 -12393 -8007 275 7175 10949 12127 10267 3414 -4820 -9704 -10571
402 -10571 -9460 -6546 116 7422 11059 9756 6315 1534 -5149 -11083 -11881 -7455 -1816 3856 8879
417 8879 11785 10027 4266 -1919 -6029 -10115 -12118 -8327 -653 5512 9091 10800 9255 3939 -4245
432 -4245 -9335 -9787 -8629 -5466 330 7395 10844 10096 7481 2843 -4409 -10997 -12489 -8764 -3019 1651
448 1651 6614 10683 9937 4823 -401 -4750 -8178 -10458 -7922 -1563 4664 8474 10013 9153 3998 -3660
464 -3660 -8585 -9052 -8381 -6353 -1240 5538 9672 9498 7034 3374 -2383 -8300 -10689 -8233 -2784 2128
480 2128 6403 9653 9200 4984 -389 -4268 -8324 -10820 -8544 -2555 3471 7534 9923 9493 5417 -1459
496 -1459 -7067 -8780 -7834 -5968 -2290 3989 8164 8991 7039 3752 -1757 -7578 -10559 -8522 -3839 1056
512 1056 5442 9395 9371 5094 650 -3040 -6036 -8969 -8143 -3587 2161 6702 8600 8261 4642 -1298
528 -1298 -6448 -8020 -7455 -5629 -1669 3678 7997 8781 7374 4134 -673 -6769 -9852 -8952 -4496 208
544 208 4287 7615 8310 5523 1713 -2214 -5881 -8260 -7597 -3914 1172 5778 8276 8329 5787 213
560 213 -4995 -7476 -7441 -5822 -3032 1850 6160 7644 6855 4437 -139 -5008 -8442 -7680 -4245 -276
576 -276 3774 7070 7847 5566 1362 -2288 -5347 -7641 -7901 -4590 469 5398 7696 7805 5674 1002
592 1002 -4178 -6520 -6780 -5611 -2861 1682 5859 7131 6768 4408 235 -4164 -8407 -8446 -5151 -1269
608 -1269 2642 5957 7530 6121 2787 -830 -4236 -6615 -7041 -4645 -298 3888 6421 7210 5486 1184
624 1184 -3431 -6375 -6606 -5344 -3116 800 5025 6869 6602 4733 1113 -3202 -6858 -7412 -5034 -1457
640 -1457 2519 5640 6709 5574 2649 -949 -4059 -6449 -6915 -5210 -644 3557 6528 7185 5698 2490
656 2490 -2249 -5665 -6732 -5844 -3391 -423 3222 5907 6362 4575 1431 -2561 -5935 -7072 -5130 -1774
672 -1774 1988 4867 6050 5831 3158 -425 -3498 -5529 -6396 -4966 -1681 2586 5728 6624 5272 2499
688 2499 -1410 -4969 -6306 -5193 -3301 -331 3140 5862 6407 4612 1805 -2088 -5440 -6994 -5769
703 -5769 -2431 1394 4093 5483 5811 3747 754 -2644 -4824 -5734 -5052 -2142 2143 5204 6040 5121
719 5121 2617 -817 -4179 -5675 -5462 -3713 -962 2140 4773 5989 4764 1882 -1188 -4420 -6054
734 -6054 -5258 -2598 720 3378 4872 5403 3441 430 -2566 -4785 -5748 -4816 -2320 1153 4775 5900
750 5900 5006 3169 -324 -3383 -5395 -5276 -3280 -1434 1881 4561 5559 4245 2139 -853 -3607 -5920
766 -5920 -5866 -2875 252 2991 4542 5452 3936 1415 -1782 -3917 -4670 -4522 -2719 113 3977 4823 4813
783 4813 2732 104 -3025 -4992 -4866 -3312 -1112 1296 4227 5438 4711 2204 -411 -3078 -5336 -5436
799 -5436 -3309 155 2444 4148 4840 4113 1728 -1622 -3678 -4441 -4281 -2782 553 3670 5210 4866
815 4866 3320 960 -2313 -4452 -5288 -3461 -1846 753 3372 5086 4754 2485 144 -2377 -4415 -4840
831 -4840 -3215 -428 1946 3808 4578 3954 1701 -1186 -3198 -4405 -4290 -3047 -266 3269 4467 4476 3288
848 3288 1130 -1822 -4387 -4671 -3419 -1434 308 3238 4721 4534 2603 383 -2029 -4211 -5087 -3632
864 -3632 -840 1517 3224 4433 4468 2177 -670 -2765 -3699 -4028 -3113 -780 2227 3946 4179 3191 1556
881 1556 -1201 -3582 -4560 -3510 -1958 136 2339 4219 4141 2542 701 -1522 -3800 -4564 -3517 -1260
897 -1260 1188 2799 4051 3929 2348 -584 -2730 -3489 -3991 -3206 -669 2084 3434 4091 3733 1857 -769
914 -769 -3273 -4454 -3577 -2270 -87 2049 3727 3997 2621 850 -1233 -3189 -4451 -3469 -1564 1000
930 1000 2528 3874 4008 2399 109 -2013 -3421 -3296 -3198 -1487 1188 2916 3740 3249 1902 -524 -3195
947 -3195 -3894 -3629 -2251 -200 2239 3697 4133 2578 930 -977 -2979 -4242 -3833 -1691 556 2319
963 2319 3661 3840 2655 360 -1979 -3115 -3784 -3146 -1230 1179 3022 3625 3410 2271 -155 -2384
979 -2384 -3690 -3583 -2087 -688 1419 3174 3879 2822 1273 -383 -2328 -3547 -3606 -1813 235 2211
995 2211 3317 3500 2685 365 -1522 -2913 -3342 -2938 -1663 788 2664 3363 3302 2306 308 -1783 -3571
1012 -3571 -3492 -2595 -825 1160 2915 3632 2865 1035 -313 -2040 -3606 -3504 -2346 -250 1824 3236
1028 3236 3506 3007 1045 -1038 -2549 -3047 -2935 -1879 -9 1927 3100 3281 2158 401 -1530 -3042
1044 -3042 -3557 -2668 -763 1003 2548 3162 3017 1515 -131 -1651 -3086 -3484 -2186 -635 1389 2865
1060 2865 3166 2643 1021 -1032 -2329 -3098 -2886 -1841 243 1838 3300 3487 2434 1114 -1136 -2708
1076 -2708 -3328 -2574 -1283 655 2128 3149 2782 1781 218 -1423 -2492 -3219 -2373 -926 1262 2704
1092 2704 3041 2644 1126 -515 -1912 -2885 -2521 -1818 -516 1077 2736 3144 2137 948 -1030 -2490
1108 -2490 -2952 -2561 -1236 450 2000 2958 2892 1913 373 -1376 -2276 -3211 -2503 -1437 1024 2346 2912
1125 2912 2931 1464 -117 -1849 -2794 -2407 -1853 -642 799 2216 2781 2153 1297 -656 -1926 -2861 -2726
1142 -2726 -1376 -22 1577 2389 2675 2106 520 -804 -2011 -2515 -2738 -1578 650 2213 2649 2582 1574
1159 1574 40 -1627 -2448 -2473 -1998 -615 659 2150 2969 2352 1417 126 -1827 -2832 -2705 -1524 -339
1176 -339 1107 2382 2693 2254 952 -494 -1763 -2407 -2530 -1607 336 1637 2640 2530 1685 444 -1255
1193 -1255 -2119 -2587 -1993 -1301 348 1773 2596 2319 1309 263 -1191 -2613 -2819 -1566 -302 994 1747
1210 1747 2242 2305 784 -643 -1803 -2559 -2649 -1692 -45 1553 2443 2445 1728 675 -932 -1985 -2382 -1773
1228 -1773 -1140 130 1742 2476 2210 1629 119 -1041 -2211 -2715 -2003 -536 749 1787 2420 2259 1000
1245 1000 -611 -1511 -2398 -2407 -1810 -262 1221 1899 2163 1794 830 -472 -1874 -2344 -1986 -1311 205 1324
1263 1324 2228 2298 1711 754 -747 -2034 -2396 -1796 -703 655 1304 2264 2123 1080 15 -1207 -2025 -2585
1281 -2585 -1858 -339 1101 1804 2068 1816 1116 -451 -1691 -2392 -1889 -1478 -132 909 1776 1971 1781 605
1299 605 -722 -1904 -2464 -2055 -742 204 1276 1839 2055 1516 188 -1018 -1960 -2270 -2091 -817 418
1316 418 1578 2042 1876 1255 -96 -1523 -1864 -2087 -1177 -421 944 1974 2341 1751 699 -153 -1452 -2388
1334 -2388 -2000 -1118 -121 1000 1777 2290 1584 308 -836 -1474 -2062 -1637 -720 450 1205 1849 1764 1278 24
1353 24 -1333 -1798 -1619 -1383 -613 658 1589 2112 1805 957 -39 -1062 -1875 -1960 -1197 -309 786 1559 1894
1372 1894 1355 471 -680 -1651 -2112 -1662 -960 233 1020 1682 2022 1558 174 -908 -1639 -1659 -1449 -761 353
1391 353 1268 1961 1648 821 -306 -806 -1724 -1754 -1271 -272 605 1601 1836 1488 588 -307 -1151 -1938 -1524 -979
1411 -979 -164 839 1665 1675 1281 630 -653 -1502 -1554 -1495 -912 276 1310 1815 1519 986 208 -870 -1693
1430 -1693 -1919 -1731 -648 399 1318 1704 1643 913 -278 -1193 -1806 -1813 -1181 -374 819 1539 1828 1413 526
1449 526 -561 -1312 -1774 -1358 -825 -257 877 1657 1507 1089 603 -603 -1544 -1822 -1174 -764 571 1380 1610
1468 1610 1670 944 -253 -1072 -1289 -1506 -1196 -225 622 1562 1828 1595 947 -507 -1047 -1774 -1525 -1001 -93
1487 -93 598 1426 1668 1156 433 -601 -1108 -1636 -1655 -836 232 1044 1729 1650 770 268 -847 -1333 -1500 -1143
1507 -1143 -722 278 1008 1572 1603 869 39 -1093 -1602 -1651 -1001 60 467 1375 1879 1360 887 -227 -894
1526 -894 -1679 -1320 -894 -190 673 1333 1370 887 429 -686 -1313 -1436 -1234 -652 116 1097 1484 1492 908 31 -461
1547 -461 -1400 -1417 -946 -406 643 1153 1659 1163 806 55 -644 -1349 -1375 -928 -81 736 1242 1581 1157 524
1567 524 -395 -899 -1555 -1398 -803 -205 787 1293 1468 837 491 -650 -1173 -1325 -1283 -205 488 950 1373 1224
1587 1224 754 -90 -736 -1173 -1318 -979 -162 726 1066 1551 1225 381 -404 -804 -1068 -1097 -710 -126 674 1250
1607 1250 1341 939 293 -399 -1155 -1679 -1465 -396 223 1005 1324 1301 1023 280 -478 -1204 -1020 -924 -498 436
1627 436 951 1278 1043 619 -36 -527 -1106 -1183 -877 -337 383 1176 1125 997 560 -268 -917 -1268 -900 -619 50
1648 50 755 1005 1551 968 29 -200 -1046 -1443 -1269 -457 264 620 1116 1384 871 -50 -515 -1017 -899 -889 -459
1669 -459 244 1037 1238 1020 455 -85 -892 -1192 -837 -708 113 649 1407 1241 776 485 -187 -813 -1179 -1160
1689 -1160 -698 272 630 1083 869 620 193 -427 -889 -1003 -1028 -289 409 1098 1216 968 659 -26 -685 -1209
1709 -1209 -1355 -781 -393 369 853 1069 1247 387 -274 -439 -741 -1246 -768 -279 650 952 1208 864 248 -34
1729 -34 -868 -985 -846 -738 348 639 1162 949 778 236 -523 -1081 -1011 -495 -306 66 595 1389 884 462
1749 462 -21 -537 -1216 -1344 -707 -270 391 992 1135 677 263 -241 -742 -979 -793 -716 -198 639 939 1108
1769 1108 579 193 -306 -746 -1249 -1037 -488 35 845 1266 733 394 157 -665 -1093 -832 -623 -306 409 582
1789 582 1005 1047 343 54 -693 -898 -705 -609 250 404 672 1044 707 148 -223 -884 -1080 -819 -368 81 767
1810 767 1123 762 491 45 -317 -898 -1128 -741 -171 428 758 645 958 842 -183 -583 -919 -906 -839 -522
1830 -522 635 887 956 573 515 -120 -642 -889 -1006 -438 -219 678 1069 832 594 326 -261 -708 -1001 -925 -198
1851 -198 230 857 907 909 726 253 -316 -776 -948 -873 -46 363 653 982 749 413 166 -318 -845 -903 -951 -188
1873 -188 357 748 710 570 508 -355 -675 -1131 -925 -467 121 372 558 1081 531 -60 -501 -646 -853 -704 -13
1894 -13 71 793 741 996 457 27 -661 -963 -655 -673 -72 284 796 732 829 365 -375 -710 -606 -716 -565 -152
1916 -152 365 934 1094 565 364 -266 -841 -807 -697 -368 137 445 995 1002 516 100 -98 -930 -614 -708 -249
1937 -249 450 670 879 782 488 -302 -391 -498 -974 -405 -5 346 664 758 662 286 -56 -1043 -764 -696 -545 281
1959 281 496 932 838 563 255 -453 -625 -476 -744 -372 -137 827 721 715 221 -153 -382 -841 -584 -580 -327 202
1981 202 499 757 1015 478 -122 -726 -966 -729 -681 -9 563 477 666 506 132 76 -686 -716 -786 -216 -16 674
2003 674 734 1000 495 99 -174 -606 -779 -527 -377 63 799 527 812 686 31 -542 -712 -661 -508 -50 159
2024 159 535 835 718 222 24 -51 -854 -758 -269 -38 617 571 489 731 84 -239 -296 -563 -416 -216 -75 221
2046 221 715 386 379 174 -383 -619 -593 -356 -302 263 647 831 572 409 115 -488 -770 -833 -419 -231 451 773
2068 773 758 451 110 22 -715 -711 -733 -328 -247 295 802 776 322 -11 -249 -656 -420 -673 -414 30 513 767
2090 767 503 103 223 -365 -619 -695 -728 -44 208 576 709 630 349 -184 -650 -641 -576 -531 -155 446 686 765 460
2113 460 322 -549 -461 -619 -626 -160 -61 406 612 798 496 109 -292 -770 -868 -427 -207 397 552 805 527 195
2135 195 -128 -244 -498 -855 -412 157 608 517 831 755 96 -328 -398 -831 -691 -357 67 123 291 512 523 174
2157 174 -224 -405 -744 -356 -412 -39 385 567 529 216 -6 -320 -741 -340 -385 63 207 812 552 559 189 -279
2179 -279 -375 -795 -651 -452 11 458 602 625 446 -27 9 -429 -790 -552 -8 -130 532 483 595 469 98
2200 98 -319 -567 -466 -607 -178 407 426 949 724 187 -144 -287 -470 -388 -339 -198 249 558 509 529 211 -442
2222 -442 -411 -684 -522 7 -29 334 631 665 409 -258 -37 -330 -698 -616 17 155 279 651 678 271 105 -515
2244 -515 -717 -511 -342 -314 168 391 415 550 140 -1 -499 -565 -631 -217 -62 361 409 621 232 193 -280 -512
2266 -512 -564 -326 -72 211 264 214 515 518 -84 -115 -585 -707 -622 -53 370 525 699 440 72 -8 -296 -735 -621
2289 -621 -574 -55 348 301 636 327 193 -8 -165 -515 -298 -251 97 69 543 479 323 -184 -278 -301 -591 -504 -50
2312 -50 -28 366 617 330 207 -196 -168 -673 -385 -283 245 299 367 445 399 25 -230 -395 -353 -639 -391 104 185
2335 185 265 748 151 139 -78 -557 -368 -748 -403 86 323 551 462 287 167 -297 -230 -500 -313 -338 152 515
2357 515 504 278 521 212 -393 -361 -576 -331 -243 103 631 409 549 -10 -324 -112 -555 -539 -298 -111 131
2378 131 308 608 83 -151 -227 -120 -558 -524 -148 -43 101 392 394 342 109 -435 -396 -577 -465 -151 368 381
2400 381 643 452 131 90 -451 -771 -619 -399 145 296 406 608 492 156 -20 -78 -378 -344 -48 -7 236
2421 236 444 702 396 -97 -320 -445 -413 -413 -122 220 558 596 418 270 -13 -76 -669 -503 -228 -352 284 585
2443 585 587 592 197 38 -490 -720 -364 -360 81 200 621 523 599 91 -399 -470 -580 -484 -43 194 401 546 307
2466 307 234 203 -399 -486 -511 -303 -159 178 309 430 157 160 146 -474 -513 -594 -397 -23 379 518 214 404 90
2489 90 -271 -217 -444 -348 -184 203 98 579 210 182 -23 -111 -809 -458 -492 -197 214 374 621 283 225 -114
2511 -114 -332 -504 -232 -347 -97 152 324 638 576 335 -105 -488 -595 -319 -203 56 31 375 329 486 160
2532 160 -177 -410 -568 -493 -262 1 624 558 186 94 166 -292 -363 -207 -624 227 92 409 612 335 97 136
2554 136 -385 -443 -670 -281 19 183 514 396 339 79 147 -458 -198 -434 -235 74 239 653 508 485 -113
2575 -113 -63 -442 -532 -205 -247 79 388 612 470 417 92 -377 -285 -453 -327 -115 276 611 578 541 -189 -104 -447
2598 -447 -563 -529 -218 -98 343 531 329 323 228 -90 -223 -448 -300 93 72 8 492 626 189 -60 -127 -292
2620 -292 -313 -335 -287 185 185 355 368 9 -173 -315 -628 -432 -334 23 279 389 369 275 -67 -107 -515 -233 -271 -182
2644 -182 -36 407 363 338 345 -49 -155 -444 -253 -461 -376 315 245 543 347 69 145 -230 -469 -589 -392 139
2666 139 109 501 603 428 292 80 -370 -486 -120 -93 -283 -158 284 124 132 0 -129 -478 -162 -401 -408 40
2688 40 388 378 6 122 -9 -381 -458 -452 -503 -312 42 436 494 225 -113 -188 -325 -321 -297 -275 138 427 453 272
2712 272 240 4 -128 -498 -562 -348 -78 18 91 486 395 189 304 -159 -355 -92 -261 -276 19 -135 302 375
2734 375 134 -189 -331 -306 -324 -376 -133 138 241 328 344 32 23 -31 -220 -294 -200 107 -124 345 203 211 13 28
2758 28 -313 -353 -85 -189 47 145 541 609 197 101 94 -207 -375 -71 -49 220 127 418 280 115 -434 -112 -209
2781 -209 -439 -170 41 31 171 268 688 8 -129 -86 -546 -290 -183 321 230 354 374 118 15 -101 -187 -510
2803 -510 -231 -369 -71 97 283 463 302 -278 -322 -251 -492 -141 10 379 227 198 260 300 -215 60 -324 -703
2825 -703 -207 312 144 432 376 237 -124 -141 -176 -494 -398 26 146 271 307 495 75 -3 -191 -379 -331 -158
2847 -158 -256 114 397 388 523 212 89 -101 -491 -51 -242 -112 139 193 156 413 70 -237 -398 -237 -291 -163
2869 -163 -26 51 374 90 395 72 -40 -297 -408 -181 -147 214 256 388 407 89 -37 -205 -314 -555 -183
2890 -183 148 -160 193 570 322 116 15 -204 -332 -380 -256 -67 329 368 359 114 42 -41 -393 -384 -187 -23 -8
2913 -8 380 184 277 -95 -12 -136 -498 -406 -300 178 186 338 154 596 -90 -96 -218 -348 -150 -184 40 89 365 239
2937 239 429 11 -36 -204 -276 -293 -184 -96 248 360 216 7 69 -297 -161 -134 -481 -7 127 385 335 116
2959 116 181 83 -282 -226 -322 -150 -52 -96 282 327 326 -173 -91 -374 -151 -110 35 3 186 438 304 150 -138 61
2983 61 -332 -513 -210 -264 90 142 360 153 370 72 -296 -148 -449 -184 -245 -41 14 259 359 -133 -196 -107
3005 -107 -255 -268 -225 34 152 243 65 140 211 -265 -347 -94 -116 -72 18 138 272 113 169 129 -218 -326 -175 -207
3029 -207 -12 53 86 184 210 194 45 -290 -312 -266 -227 -266 165 308 393 409 -23 129 -116 -226 -255 -162 -160 84 153
3054 153 127 291 41 -217 -593 -214 -59 -277 228 338 542 150 127 54 -64 -341 -157 -251 -224 -3 443 204
3076 204 500 50 -149 3 -175 -146 -554 -121 453 520 188 243 184 -147 -112 -204 -263 -188 90 128 241 134 187
3099 187 23 -297 -93 -394 -290 -65 185 18 304 170 397 147 -302 -62 -18 -449 31 -285 187 384
3119 384 238 -67 -288 -131 -147 -151 -388 -93 144 321 295 356 162 -16 -149 -315 -220 -14 178 230 288 273 271 140
3143 140 -207 -309 -227 -146 32 200 382 196 118 -136 162 -64 -256 -246 -112 -44 479 37 294 271 139 -113
3165 -113 -103 -383 -273 -120 -5 261 500 240 -21 72 -123 -227 -267 -242 -156 221 202 236 -33 64 94 -134 -82
3188 -82 -269 39 154 107 75 323 307 99 -270 -302 -174 -233 -76 106 185 365 142 291 -57 -234 -185 -77 -121
3211 -121 -162 -151 266 261 88 377 260 185 -110 -421 -276 -221 0 112 179 169 208 -169 -11 -207 -279 -77 -193
3234 -193 381 156 267 249 -74 -136 -8 -239 -230 28 260 127 434 165 81 -17 -450 -225 27 -214 -39 237
3256 237 233 168 22 -120 -37 102 -484 47 -379 -41 217 36 185 120 19 -132 -205 -304 -154 -143 50 140 253
3279 253 142 171 -95 29 91 -237 -233 110 182 253 57 199 114 32 -56 -306 -397 -329 -191 103 310 222 178 -61
3303 -61 -203 -234 -236 -168 98 85 248 413 -1 303 30 -149 -166 -236 -282 -103 80 136 488 226 -65 -368 -234
3326 -234 -305 -241 -54 -70 -79 409 171 254 53 -74 -238 -80 -129 -258 138 -126 303 421 252 69 -52 -78 -43
3349 -43 -225 -208 177 94 118 228 166 -32 -236 -261 -88 -115 -13 139 94 67 199 9 -93 -207 -166 -225 -161 -148
3373 -148 -137 -12 276 191 -245 72 -280 25 -188 -3 48 375 324 171 101 33 173 -198 -204 -95 -184 74 210
3396 210 202 205 -37 -214 119 -124 -199 -187 -190 -24 -17 434 148 -189 53 -198 -152 -174 -322 -159 -19 145 325 268
3420 268 136 179 13 -215 -37 -156 165 65 316 190 123 50 -60 -69 -20 -124 80 142 268 97 421 138
3442 138 -190 -151 -133 -158 -264 76 334 141 268 191 83 -186 -184 -369 -260 -230 149 -59 425 169 62 -29 17
3465 17 -89 -305 -194 -76 -204 271 246 231 102 29 -23 -120 31 -132 -218 47 348 303 281 106 139 -154 -155 -83
3489 -83 31 -42 260 180 233 -97 -90 -1 -92 -272 -253 -114 135 61 68 221 313 -239 -119 -88 -43 -349 -392 -156 121
3514 121 127 120 200 -162 -73 -177 -57 -280 -192 105 -2 -28 257 -54 -157 -232 -300 -413 -225 -164 123 -160 409 212
3538 212 -59 -182 -166 -217 -351 -81 155 274 406 170 73 -162 -165 -156 -19 -64 -106 96 3 305 -24 64 -81 -89
3562 -89 -196 -153 -216 -27 387 273 209 287 105 -406 -150 -17 -6 59 146 -55 42 129 18 47 5 -116 -80 14 -22
3587 -22 146 252 92 29 -15 20 -120 -52 -292 -114 -193 312 217 140 242 -58 -311 -190 -138 -185 55 217 92
3610 92 234 229 148 194 -106 82 128 -59 49 107 137 500 354 232 -30 -305 9 -202 -232 49 126 359 64
3633 64 202 -117 -65 -239 -110 -454 -119 114 205 274 134 414 15 -345 -261 238 23 -191 186 -55 369 408
3655 408 88 -104 -104 -474 -367 -183 -203 -29 100 -17 195 193 36 -23 -125 -3 23 -79 175 134 -36 372 -27
3678 -27 -61 -53 -146 -32 -194 -75 -123 146 316 175 -297 236 -410 123 -415 172 89 233 128 127 -147 156 -27
3701 -27 -77 -211 -55 -83 100 -36 94 266 295 -84 -217 -75 -200 -47 -260 -13 -9 365 60 -67 1 19 -84
3724 -84 -152 -289 200 151 226 56 -82 156 -24 -301 -162 90 -124 393 14 111 334 90 -112 43 -239 -7
3746 -7 6 -74 214 26 199 43 173 31 -293 -266 -109 -81 -21 78 323 92 -55 191 31 -380 -216 -245 -243 43
3770 43 -26 301 137 33 -336 4 118 -193 -322 -31 99 124 126 -80 -56 118 -123 -108 92 -51 -85 -97 167
3793 167 52 79 47 -155 -102 64 -65 -21 -58 280 353 -33 -131 -20 -63 -64 52 78 -271 295 26 227 82 8
3817 8 6 48 7 -60 -102 5 43 85 221 -63 157 7 -146 -214 -255 41 287 -125 243 169 398 -181 65 -176
3841 -176 -297 127 91 -20 188 167 192 138 -52 -88 -204 -144 -159 -196 -35 83 182 299 112 -151 -189 -181 -234 -61
3865 -61 -8 75 205 236 407 181 -288 -105 -6 -278 -21 -164 11 127 57 81 48 49 -160 -113 -56 23 -4 54 427
3890 427 363 265 -200 10 -96 -56 26 -21 160 1 -18 77 -180 -105 -75 -116 -179 -20 146 25 113 141 86 -67 -122
3915 -122 24 -201 -380 114 -75 -82 191 -27 48 -25 -28 -31 -120 -423 -130 172 66 96 63 100 112 279 57 -49
3939 -49 -189 -284 86 110 110 130 -130 -131 -101 -120 -214 -202 -106 310 210 346 -202 47 -330 -204 -170 0 50 51 272 75
3965 75 227 137 -99 -158 -18 -9 58 316 -27 32 120 -19 58 -52 85 -132 38 146 13 -3 -125 -30 -153 -303
3989 -303 -76 -165 -190 -45 -109 215 222 353 -237 -112 168 224 -122 -116 -43 -31 381 412 -146 -65 212 221 -152 -91 -18
4014 -18 -359 30 -36 -57 269 -205 90 -11 -33 -230 -51 26 39 -259 -18 255 -174 220 -234 -94 -243 12
4036 12 -95 -344 357 240 89 274 -9 -177 -61 115 -240 179 -142 32 23 -46 30 213 19 -47 -427 -6
4058 -6 165 31 147 163 -10 80 -101 -321 -278 -200 41 168 136 96 81 -161 -24 2 -185 -14 117 -33 -160
4081 -160 50 -64 93 -117 -208 -243 -37 -163 72 138 64 236 102 -162 -28 -17 -14 -208 -196 -82 63 305 -46
4104 -46 -33 -99 -77 74 -139 -164 -166 -89 106 20 124 112 -43 60 191 -13 -166 -206 -245 42 398 58 217 -157
4128 -157 313 8 -230 100 -84 144 201 290 190 -117 226 -227 -160 -107 21 -259 102 117 320 62 209 167
4150 167 3 -69 7 13 80 86 19 359 -112 236 66 -288 -253 188 -107 -124 132 195 135 272 -124 -148 -124 -45 -112
4175 -112 -106 238 62 140 228 224 -156 65 99 -222 -202 -169 101 46 125 161 -156 -217 -114 -99 -32 -132 -47 -18 -71 180
4201 180 33 131 -179 105 -22 -97 -68 14 177 -17 167 174 72 111 -358 74 -259 -26 244 -84 659 -296
4223 -296 0 96 -389 -256 -281 -147 43 233 -202 85 51 289 -94 -87 -214 -264 -124 125 46 55 -63 133 -172
4246 -172 -124 -210 -105 89 152 146 8 66 125 18 -228 -121 -92 165 -145 330 51 -2 67 43 56 -142 -15 -5
4270 -5 -146 13 104 -76 210 80 285 -67 -227 -69 -226 -16 46 -58 -67 214 302 354 -147 -173 -94 -58 -169 100
4294 100 -128 229 114 -117 24 -185 36 -359 210 -14 -137 30 58 358 166 91 87 -101 -15 121 -192 -20
4316 -20 139 -92 87 -205 -214 44 -32 -100 89 -133 -162 185 -7 327 -224 -94 120 -34 -135 93 -20 -169
4338 -169 -168 71 62 123 19 249 -265 50 -56 -115 16 -32 -19 -107 -85 -249 -172 -95 -188 353 -3 200 337 -75
4362 -75 5 -162 -51 -219 2 288 -99 475 150 -202 -150 136 -217 -114 -130 -85 -73 -117 38 158 -51 0 246
4385 246 -184 36 -131 -84 -123 -24 -49 -120 220 -45 -94 120 53 -58 -277 -132 -256 301 -117 49 -131 -63 33
4408 33 -288 -117 -41 -107 -34 74 130 289 20 97 169 3 18 103 -140 -183 -78 168 176 -127 -124 -123 87 -136 98
4433 98 97 -135 31 147 138 84 -1 -311 -189 278 54 164 117 -462 59 261 -5 93 20 191 -12 174 64
4456 64 152 68 165 -248 315 76 -94 -167 -21 58 63 -15 189 8 -62 -95 -364 -5 29 61 -61 -248 90 132 -18
4481 -18 -281 -271 -46 111 65 204 -73 -37 188 -59 -81 156 -287 -376 -90 222 -70 82 89 113 0 81 31 -114
4505 -114 189 -366 65 -84 -79 -371 -4 68 140 -49 47 -62 -85 -191 -47 168 146 -7 38 -4 71 56 254 144
4529 144 25 -89 -65 -234 -50 111 -234 -183 131 -57 80 15 134 175 -47 93 -135 -200 -82 -348 -197 144
4551 144 154 126 50 -15 -19 -23 -231 -263 -140 128 -69 -206 92 108 100 -58 32 84 -109 -141 -168 81 365 161 -157
4576 -157 -100 -26 -41 -31 -73 5 227 -64 -71 -22 -10 40 169 -34 -143 19 -110 -91 -155 240 55 181 -9 195
4600 195 298 -101 -59 87 -19 -269 51 5 27 6 -120 -79 -1 4 36 155 -75 63 -25 -7 -38 -51 -27 91 -15
4625 -15 -33 -76 77 -36 128 -93 60 -143 -172 40 -76 -125 -218 48 -175 272 83 -200 -136 -1 -147 63
4647 63 -150 -145 60 163 -96 -67 128 159 -44 -132 109 -189 -119 -110 400 256 -40 -36 -35 -98 85 254 -52 -194 -73
4672 -73 104 -103 -93 -277 -133 220 -96 14 171 -86 3 80 190 -52 -17 195 -88 233 -64 -102 -104 79 95
4695 95 -174 -65 -406 89 -61 308 183 -185 -21 -93 48 21 -295 -280 -11 -277 -57 -29 -41 45 101 36 -45
4718 -45 216 37 -59 88 31 -152 -10 -36 -16 -63 -31 74 67 12 -79 -70 281 92 200 -17 -39 -90 -199 80 43
4743 43 -47 -25 -43 160 59 85 -4 53 27 87 59 9 84 -20 -41 -59 26 -48 155 -39 32 146 153 -255 174 246 2
4770 2 117 -11 46 22 -92 346 218 -194 -186 -15 65 227 135 -177 67 46 187 -115 -22 69 -38 -219 113 -247
4794 -247 190 213 37 173 102 -227 -2 85 -188 -212 -38 58 163 -9 292 17 -58 -52 81 -6 117 5 -107
4817 -107 198 56 -49 -31 -112 218 -65 62 -353 -296 -53 49 -145 -260 110 -49 -153 206 -58 -2 -36 58
4839 58 56 71 68 422 -41 -278 75 15 -329 26 -163 -131 -235 -218 207 115 183 -51 -151 -19 175 -227 -312 -151
4863 -151 30 -157 -115 271 -2 -10 66 -41 -50 102 146 -242 -311 -122 197 -9 -97 64 82 153 200 11 116 -13
4887 -13 -81 161 -99 260 -35 14 180 14 107 67 -81 -138 -123 90 -234 200 -235 -7 18 41 -11 165 122 -84
4911 -84 -132 147 -71 148 -120 -78 -24 48 -70 -280 54 -106 2 173 -187 257 434 13 -206 385 111 331
4933 331 169 -98 6 67 -121 120 -151 44 -10 -27 -144 -55 -127 73 -192 -180 -46 90 45 -29 149 107 174
4956 174 -53 115 73 195 163 -227 -75 -39 95 107 25 71 -234 -107 -7 -9 90 -221 -186 -91 68 4 307 263
4980 263 -29 65 -117 199 125 27 -50 239 6 -70 158 -100 -82 100 174 130 -160 -83 -73 12 -132 -103 5 154
5004 154 -34 284 -27 15 64 -77 140 -112 1 -128 231 -153 -75 39 135 73 -61 -182 -81 48 275 4
5026 4 -103 8 38 -127 -116 127 58 -74 -133 58 -159 -77 -293 80 -4 99 -40 126 53 -44 -239 -109 62
5049 62 -17 216 197 -37 -47 -37 -182 105 80 67 144 -13 31 25 137 -130 46 -13 -90 -3 105 -268 -98 -121 230
5074 230 112 90 63 -117 112 -32 -97 -19 -136 319 -171 -232 -154 -85 172 281 -34 -32 -8 28 -18 394 127 -79
5098 -79 -59 -113 95 -60 -37 -134 -111 50 -190 49 56 169 -196 -269 -200 -320 -331 52 62 -100 120 73 -90 -302
5122 -302 166 135 158 125 -15 64 203 134 55 -54 -112 -152 132 -134 253 82 -60 48 177 -45 -60 -302 -152
5145 -152 108 230 155 -166 30 -177 -130 -5 6 49 116 2 24 -197 44 154 157 -80 185 263 99 -103 -67
5168 -67 361 86 -101 69 177 -210 -29 177 -117 -182 51 250 -199 148 23 -111 307 257 79 40 -81
5189 -81 -72 55 328 -99 179 -250 -37 -195 -434 225 72 -91 94 239 64 -2 155 -55 83 -16 77 117
5211 117 -70 -148 424 180 -108 84 112 -135 -6 16 -36 -117 -158 80 -149 -61 -28 -21 -51 111 95 15 -97 107
5235 107 -1 70 -6 -8 -39 26 -195 -177 -12 -292 36 -171 -116 -83 79 -77 76 128 87 86 14 21 -69 249 95 -61
5261 -61 -32 154 28 54 157 -17 84 160 -96 193 3 163 -23 92 -150 -229 -221 -53 82 41 -119 -237 -246
5284 -246 -150 -62 -67 31 167 -168 -54 -210 -22 66 -37 -46 101 244 -32 -1 -195 -66 -74 12 -383 163 34 -130
5308 -130 124 75 37 103 184 102 94 41 -39 -26 -2 -75 -124 9 59 19 -99 -75 232 55 -108 7 -117 110 16 189
5334 189 61 -67 66 235 153 -125 -10 4 36 -38 21 184 -91 81 -48 155 -122 60 -162 45 -98 -151
5356 -151 33 -12 94 154 136 -77 57 -146 -48 -96 9 238 -79 40 -109 -382 37 -117 34 166 30 409
5378 409 182 -20 214 -192 71 -85 148 -166 93 299 -33 -235 96 -31 17 21 79 109 92 144 60 217 -139
5401 -139 -179 143 37 16 136 123 8 -57 -17 209 44 -115 -170 61 123 94 -69 29 67 -32 -220 -35 -11 -109
5425 -109 12 106 22 -280 -82 -66 70 -18 -63 -158 -200 96 -58 74 -128 22 61 343 -76 -115 -23 128 138 77
5449 77 -29 89 -78 166 58 173 -91 82 141 -154 -27 1 2 -100 9 -336 130 201 24 80 114 81 -15
5472 -15 146 -104 -96 -150 -146 83 331 233 131 -42 99 194 -12 -120 170 -222 0 72 30 66 11 220 189 -32
5496 -32 -189 -146 -246 0 110 23 34 79 -42 -244 -6 -25 -33 -210 -250 34 281 -147 -87 -104 -80 -108 -23 15 284
5521 284 -17 -59 53 6 -128 -145 65 -48 43 186 109 -37 469 -15 8 -8 425 -23 -130 -17 22 -56 93
5544 93 -90 -211 229 124 -14 -56 -42 -30 -9 -104 19 -113 -322 107 90 169 105 -78 -150 -172 103 9 343 -61
5568 -61 -4 103 -139 185 -230 -145 -147 60 -32 277 59 -258 102 -164 -219 -88 26 84 155 -337 96 98 275 199
5592 199 119 205 -45 -159 83 -2 -7 45 64 80 -163 -99 3 -149 -49 5 -243 -114 -90 -287 19 -10 55 -128
5616 -128 12 273 102 -31 -67 5 -136 -17 67 117 -133 -84 -152 -65 2 101 106 190 40 -77 104 -198 -31 30
5640 30 35 11 -171 198 -54 45 83 25 103 197 178 160 207 -70 -202 101 36 -110 -35 197 -497 86 70 177 -8
5665 -8 -65 209 14 201 -159 -150 -84 119 -158 75 -104 51 -31 -7 -79 -198 155 10 41 106 -231 243 78 41
5689 41 105 143 174 -78 13 168 145 61 -119 -126 148 -37 -25 -99 18 3 -52 -308 -1 206 50 -14 -181 39 -32
5714 -32 21 33 -205 121 95 52 -156 61 -34 190 -14 75 20 -59 -80 -143 -47 94 -141 108 1 -136 -71 -14 49
5739 49 31 -168 45 -141 294 120 29 -204 -119 16 76 -5 250 19 -42 62 25 -151 -199 76 319 17 294
5762 294 26 32 151 -66 76 -75 -17 124 -2 10 41 -252 253 66 215 51 80 46 39 -203 35 68 52 36
5786 36 -124 61 8 -13 133 77 -54 99 5 13 -3 -47 -64 67 333 121 98 -164 -1 97 82 117 162 -269 292
5811 292 60 62 -57 -95 -194 -20 -130 -165 140 214 391 243 -111 -120 248 113 -154 129 16 -103 -45 438 140
5834 140 226 -128 59 115 52 -22 -176 -122 -45 -212 28 307 -67 -92 -253 244 -30 -146 -95 13 258 9 7
5857 7 229 -26 -83 -88 95 -69 77 57 -96 154 6 -61 -284 -72 70 -74 -92 -234 -219 -428 173 -70 247
5880 247 35 -88 -175 26 -195 39 80 -62 350 55 -12 163 -52 -31 -110 -216 208 161 -196 74 15 -73 12
5903 12 -87 -49 244 -241 -322 -86 18 -24 -55 -64 30 -160 -227 135 -197 0 -90 -100 17 -9 111 -88 -289 -99
5927 -99 -166 178 -83 -24 79 -99 99 223 129 -12 65 -50 -139 307 13 -3 104 -40 167 14 -45 -243 279
5950 279 -227 -27 36 133 9 -23 217 -149 105 39 113 131 -35 -128 40 -182 -145 -26 -42 105 380 -33 -114
5973 -114 -35 107 216 11 -118 -14 -43 -109 133 -19 173 -83 70 77 -153 -62 40 -65 0 92 -109 -20 -44
5996 -44 132 -33 -175 -106 129 110 -160 291 -220 47 49 27 -146 23 253 94 25 37 36 -131 -290 78 -148
6019 -148 -16 19 -73 173 -11 -77 -125 -119 -5 22 -335 -77 -157 -154 -45 -47 201 -334 183 -36 -71 6 12 13 -51 -152
6045 -152 -262 -241 214 125 -149 151 -210 -220 62 -143 250 17 27 56 191 -180 149 140 -118 117 -160 -53
6067 -53 -151 -108 -61 -5 -106 -111 99 -20 180 -37 100 -218 21 -8 -26 -43 -17 -25 -177 15 -143 40 -82 30
6091 30 -151 129 -54 -200 58 -10 -112 -36 -135 -203 -218 -19 -34 -141 -48 -159 -182 -378 -125 -198 -24 -221 132
6114 132 -56 120 -90 -176 -56 68 104 -75 -48 68 -79 250 -246 -189 114 46 -15 -35 -178 -25 -149 -173 -300
6137 -300 -144 124 -262 150 39 -363 -163 32 302 145 -112 -31 -53 -76 -17 -50 -281 92 60 -43 34 43 138
6160 138 -330 -156 -140 -149 97 116 45 18 -13 -5 2 -27 -108 62 -120 -34 -36 -154 10 -136 -72 19 119 2 -94 147
6186 147 345 -92 140 174 -187 -78 -114 -91 -26 125 -61 -158 -96 130 -37 -330 -41 144 -197 37 21 -65 -15
6209 -15 -166 199 3 -131 -295 -205 400 122 154 220 -83 -11 12 -87 42 123 -147 145 -132 -61 209 376 110
6232 110 -119 -74 27 -139 64 -85 165 -199 -34 -82 23 134 25 164 -29 -188 200 -93 61 70 -56
6253 -56 -264 -103 -167 -6 -4 41 81 6 19 -38 -205 23 43 -32 -31 -118 -227 -119 128 -58 -193 -152 97 -87 22
6278 22 198 -68 -25 -32 249 -173 38 288 -31 33 -123 62 147 -93 267 -33 195 -21 74 -68 1 86 -28
6301 -28 -172 192 41 63 110 98 36 74 271 -161 -391 -16 -88 -372 129 -48 -26 78 -129 101 105 22 260 4
6325 4 28 90 115 -222 -31 -129 -20 164 216 -21 307 160 21 269 -166 -27 -25 38 -156 -141 124 256 292 -317
6349 -317 -144 -171 44 -57 202 76 -210 -35 -226 20 -220 -114 208 -23 96 -20 -31 -45 72 -39 -298
6370 -298 205 -91 126 -93 2 -89 25 -263 -118 -70 -56 154 422 -44 54 -98 26 -198 9 210 -86 -237
6392 -237 115 -85 226 61 64 -22 212 92 -88 114 -99 1 83 311 151 252 -122 -69 -73 -78 -225 -184 145
6415 145 -215 -25 43 254 216 -160 305 -79 -6 -42 11 -130 72 -127 76 -2 -260 65 34 87 -180 223 -198
6438 -198 85 -84 71 140 -10 -103 148 -187 116 62 -159 -101 -304 6 -131 -87 -83 -146 8 109 7 100 -124
6461 -124 -235 -56 -60 115 -148 -106 -117 206 -250 -68 34 -62 78 -93 166 80 63 -168 -31 17 -86 -71 70
6484 70 17 138 395 27 23 -74 -86 126 -127 -95 67 -142 159 -177 88 214 -59 96 10 158 -153 138 110
6507 110 -13 -61 157 -72 -44 38 -12 -68 88 121 97 -39 234 -83 -127 -208 -161 -34 72 -95 -28 -138 -58 -41
6531 -41 154 2 310 -129 -35 112 -72 -43 38 217 -146 -76 135 22 -33 16 -92 98 106 26 48 -102 70 -10
6555 -10 136 76 -131 297 -177 68 -213 210 127 131 -27 -73 -219 96 117 -79 184 -24 -97 -81 -93 21 -167
6578 -167 -117 30 55 224 -83 -98 225 -4 103 -14 -97 209 -63 23 211 -32 -111 236 -27 -68 -163 -307 -196
6601 -196 -10 -102 61 99 97 131 11 28 -40 -49 -75 50 62 110 -265 -41 9 -87 5 -180 -169 223 -93 -86 -58 9 185
6628 185 0 220 -84 -131 162 -157 237 107 -38 -97 126 134 -116 -114 -22 7 120 314 221 30 58 46 -24 170
6652 170 -72 -303 -135 45 -210 237 172 -1 94 5 150 233 -71 -11 -235 -179 -99 47 -34 57 23 92 -50 -148
6676 -148 -49 123 -209 -104 -106 18 11 162 -110 -16 141 -92 82 63 -5 -94 -103 -30 -30 95 -129 114 175 -29 -18
6701 -18 99 111 -181 283 12 82 22 -113 22 -201 170 -274 -31 -260 195 68 -253 111 -258 -318 32 98
6723 98 93 -60 -62 -59 -38 50 -170 103 37 120 -172 -153 286 48 -28 -178 65 7 59 203 -43 -130 -141 230 -364 -172
6749 -172 -327 -191 -300 -103 -142 113 -337 10 -81 -13 -48 -90 -35 131 -177 -92 -61 -239 -186 107 -95 -9 209
6772 209 18 19 -183 85 149 -71 -117 -150 -47 44 203 119 216 109 117 -83 157 125 -26 -129 -194 137 -53 42
6796 42 -88 73 150 -30 92 -103 39 42 320 58 -134 -150 -183 229 42 -108 133 -17 -22 176 -219 63 -156
6819 -156 -4 32 -88 31 68 110 319 88 -60 11 4 64 263 -47 -115 -23 -143 234 -76 41 -132 -126 -122 46
6843 46 22 57 161 4 57 -66 -49 60 130 95 18 204 32 -76 -243 -244 251 -100 -52 -58 -122 -38 -107 -54 -50 -32 -46
6870 -46 126 180 -36 -32 -243 -24 -117 127 -9 46 172 -442 203 204 86 -27 -64 -28 110 8 114 161 -79 54
6894 54 -156 59 -83 -16 9 -41 -49 -44 101 -24 9 176 187 -71 -146 -1 -91 -111 -18 -58 -304 -118 76 147 7
6919 7 120 31 -157 63 94 -129 -64 44 -236 99 221 124 90 64 -114 -122 -187 39 -153 280 -28 220 38 -200
6943 -200 9 70 -67 -89 -143 -28 35 161 -145 -42 -170 -9 45 36 289 -65 288 -43 -151 -143 197 -191 6
6966 6 114 -97 199 -27 61 107 190 -197 -122 -8 -44 -10 24 116 120 -6 55 -225 -90 -16 20 -14 -139 305 -2
6991 -2 8 164 96 203 -107 43 -114 3 83 -189 173 89 -24 164 75 278 33 143 188 -160 16 61 -82
7014 -82 -30 -335 95 104 -51 29 120 41 71 -115 195 -26 163 48 273 -48 27 -78 -175 94 154 225 -115 -132
7038 -132 94 -67 61 -105 -159 75 47 -212 -78 4 -98 -82 -203 -221 136 148 -190 -208 -68 -11 -227 186 37
7061 37 86 85 27 55 266 -221 92 316 -37 12 -93 -247 37 115 141 21 -51 130 -18 138 -36 49 -175 41
7085 41 26 141 -17 -62 109 -29 -28 -133 -260 -85 160 3 -130 66 298 -116 -114 284 154 -169 -103 47 114
7108 114 88 -236 209 53 -149 -29 129 -130 -29 81 137 -317 -185 -30 -10 142 -72 -88 -167 73 38 136
7130 136 -42 133 -111 137 -97 -184 130 -64 226 226 8 71 -167 24 84 128 0 -284 -97 9 41 74 14
7153 14 169 94 130 56 204 265 -103 104 146 64 -55 364 106 -3 77 91 -179 -83 23 186 -50 111 -209
7176 -209 -164 -190 -62 -41 -82 29 9 -172 3 100 57 -155 75 -39 -435 110 -8 100 238 199 -12 41 -270
7199 -270 -208 1 -60 102 -145 63 32 -14 374 -78 133 78 -17 125 40 -42 206 61 -306 -17 114 -178 164
7222 164 -145 -3 -39 -35 62 -44 209 -170 -47 -19 105 54 202 82 104 26 39 140 -148 -38 16 -58 91 130
7246 130 68 132 103 79 -70 96 106 -247 -182 121 -262 70 11 240 -85 318 -4 140 62 230 -215 -63 79
7269 79 -40 -53 146 -203 -98 -38 -86 -36 -52 3 227 9 69 84 79 162 49 21 -135 71 78 -160 -96 30 76 51
7295 51 -229 17 124 -22 -121 -124 -124 -8 -128 123 273 -206 76 70 -58 20 -126 -45 162 -47 66 -269 -139
7318 -139 31 86 -97 15 -45 -199 -146 216 -298 -9 -227 16 91 118 79 -253 -282 -66 193 -73 164 -53
7340 -53 -95 48 164 225 87 -130 133 42 5 -61 -23 -106 213 -29 88 -74 219 112 94 -75 198 289 28
7363 28 -235 -166 326 156 4 -73 149 -96 230 -208 -73 -266 134 119 46 212 6 37 -42 -29 -52 -189 -287
7386 -287 -190 -81 -46 20 -36 95 55 -45 169 60 -78 88 137 -10 -375 -232 161 137 -244 28 -304 -264 -130
7409 -130 175 10 -60 258 118 59 21 -97 110 203 -78 9 41 100 -111 -224 119 -201 -34 28 121 -136 173
7432 173 -29 -24 23 -183 282 -220 229 -256 280 14 -139 3 -131 -8 63 125 -33 117 -189 -114 31 -83
7454 -83 -144 155 23 80 41 17 10 -81 -149 75 116 -21 -105 -63 -153 265 -46 -61 -88 -121 -60 -14 -198 -134 -19 -96 -77
7481 -77 38 -6 128 -114 179 33 203 395 94 -230 -71 103 119 -68 334 156 95 -76 -34 99 -218 9
7503 9 126 -63 241 -219 -28 -36 248 -177 107 -29 -62 21 -71 -7 122 -13 -152 -114 -20 30 -161 298 23 64
7527 64 -139 -116 104 -87 151 -151 -283 88 -47 -101 -99 -114 -192 12 95 59 250 -215 129 -25 118 21 -35 -53
7551 -53 -33 -391 52 342 -94 -209 20 14 16 94 -109 -107 -54 -11 -113 82 -134 201 -16 -114 23 -52 23 -88 -203
7576 -203 -196 -296 -196 192 135 210 134 216 -180 -6 6 -165 313 131 -76 175 -108 -61 -13 185 -209 115 -143
7599 -143 -92 276 -91 106 -115 170 -53 -81 159 -11 -95 -275 -80 -121 170 -186 41 31 -241 -56 -27 130
7621 130 -123 270 -219 -62 -63 -130 -32 -151 347 -151 -92 231 39 -58 -61 -79 13 76 -136 163 -94 -35 -212 -102
7645 -102 -103 -215 249 162 -95 36 78 -52 125 -160 -82 75 -101 89 66 88 -25 11 145 187 59 -199 -227
7668 -227 -37 -33 81 -31 167 -36 -87 -128 88 -268 -39 3 32 133 33 -243 20 7 124 34 -73 -95 226
7691 226 -295 71 -26 49 117 52 -99 -172 -88 52 302 -118 -31 103 -75 -50 -32 13 69 -146 -13 -103 -173 -79 2
7716 2 -22 -23 208 -108 -184 -85 -202 -178 101 3 -64 -112 -132 -176 -151 -39 187 23 -45 76 143 172 -109 69 -48 -167
7742 -167 -108 91 -32 -22 227 -44 88 -34 41 149 -232 -95 -7 -120 22 -201 -100 -201 228 126 -24
7763 -24 -266 94 -45 28 -222 36 74 209 134 -7 17 -13 -32 49 280 35 -6 -24 31 -31 178 202 -174 90
7787 90 -238 112 74 200 -284 -322 63 -166 -75 63 125 -32 477 -136 214 -85 -145 126 -42 -16 226 124
7809 124 118 -218 61 45 -270 -41 166 91 223 159 104 -217 -170 -224 -90 -24 116 -53 9 -114 35 -135 192
7832 192 85 -126 93 -249 120 -113 -343 -107 -194 75 -128 -5 240 215 -79 164 -131 -29 -30 -319 207
7853 207 69 102 -280 -194 3 -24 269 -8 88 86 93 82 10 41 -112 10 -138 71 -55 279 130 131 178 -272 -10
7878 -10 114 75 -66 -281 -192 85 -45 24 -70 163 -9 -35 40 190 43 23 -97 253 89 141 112 47 -160 149
7902 149 -95 13 -4 111 -265 -142 -80 -16 -135 201 160 208 169 -34 156 -4 78 89 -128 -36 157 22 -143
7925 -143 -78 -62 -98 -316 -10 -97 -71 159 -59 195 92 -137 -33 103 24 -194 156 254 47 22 168 109 -165
7948 -165 -54 -45 21 55 -155 -66 -8 -83 -243 38 -287 21 101 108 -47 245 -33 26 -23 -78 -283 -77 173 -67
7972 -67 -98 1 16 77 101 -31 59 197 -17 -81 -120 16 9 -67 212 -67 -213 -162 -69 53 -44 130 -19 49 -41 62
7998 62 -22 311 -151 -16 297 -77 -9 -8 -35 12 -209 152 -28 297 118 67 60 5 101 176 200 62 35 65 -58
8023 -58 -26 -64 194 -85 -279 46 -5 174 43 267 169 48 89 -203 334 -187 101 301 134 20 -105 103
8045 103 -338 36 249 13 -13 -18 158 242 45 16 134 91 21 170 98 77 -87 195 -57 -92 194 -134 9
8068 9 133 -40 -15 174 56 -85 -36 90 -71 187 -283 193 58 81 -34 132 -3 43 63 -94 -80 68 -5
8091 -5 -85 -25 -54 -20 184 -47 -179 40 -27 -46 -94 -167 54 -44 -29 -79 -41 70 150 75 28 296 -104 -13 -73 -122 198
8118 198 264 -243 -99 39 -11 17 -20 38 129 53 -326 113 -171 153 -169 -237 -25 -33 61 -104 58 41 280 66
8142 66 -154 -38 173 140 58 49 -41 157 80 72 -341 29 273 -129 203 119 -54 99 -251 39 203 69 167 -105
8166 -105 -19 119 78 141 -42 -124 134 254 127 3 210 249 -128 -56 104 107 44 -74 288 1 -11 -71 75 -8
8190hK4
8191A6
##END NTUPLES=NMR FID
##END=
