##TITLE=1H_DE-44_EA2_TFA
 DMSO-d6
 8 sc, 
 8.4.2024
##JCAMPDX= 6.0         $$ Bruker NMR JCAMP-DX V2.0
##DATA TYPE= NMR FID
##DATA CLASS= NTUPLES
##ORIGIN= UXNMR, Bruker Analytische Messtechnik GmbH
##OWNER= root
$$ XWIN-NMR		Version 3.5
$$ Mon Apr  8 16:13:51 2024 Russian Standard Time (UT+4h)  she@DPX200
##.OBSERVE FREQUENCY= 200.1309
##.OBSERVE NUCLEUS= ^1H
##.DELAY= (6, 6)
##.ACQUISITION MODE= SIMULTANEOUS
##.ACQUISITION SCHEME= undefined
##.AVERAGES= 8
##.DIGITISER RES= 18
##SPECTROMETER/DATA SYSTEM= spect
##.PULSE SEQUENCE= zg30
##.SOLVENT NAME= CDCl3
##.SHIFT REFERENCE= (INTERNAL, CDCl3, 0, 15.7039)
##AUDIT TRAIL= $$ (NUMBER, WHEN, WHO, WHERE, WHAT)
$$ ##TITLE= Audit trail, XWIN-NMR		Version 3.5
$$ ##JCAMPDX= 5.01
$$ ##ORIGIN= Bruker BioSpin GmbH
$$ ##OWNER= she
$$ F:/spectra/data/she/nmr/H-F/1/audita.txt
$$ ##AUDIT TRAIL=  $$ (NUMBER, WHEN, WHO, WHERE, WHAT)
(   1,<2024-04-08 16:12:48.29 +0400>,<she>,<DPX200>,
      <created by zg, POWCHK disabled, PULCHK disabled
       configuration hash MD5:
       00 E9 B6 7A A2 85 ED C7 34 08 36 98 17 FE 4E 26
       data hash MD5: 16K
       BB 67 B4 0B 03 39 A2 05 B6 30 D9 82 B3 2B 94 CC>)
$$ ##END=
$$ 
$$ hash MD5
$$ E0 98 B7 75 92 32 C6 7A DC 35 67 F9 22 F7 F3 13
##$RELAX= 
##$RELAX= 
##$RELAX= 
##$RELAX= 
##$RELAX= 
##$RELAX= 
$$ Bruker specific parameters
$$ --------------------------
##$DU= <F:/spectra>
##$EXPNO= 1
##$NAME= <H-F>
##$PROCNO= 1
##$TYPE= <nmr>
##$USER= <she>
##$AMP= (0..31)
100 100 100 100 100 100 100 100 100 100 100 100 100 100 100 100 100 100 
100 100 100 100 100 100 100 100 100 100 100 100 100 100 
##$AQSEQ= 0
##$AQ_mod= 1
##$AUNM= <au_zg>
##$AUTOPOS= <>
##$BF1= 200.13
##$BF2= 200.13
##$BF3= 200.13
##$BF4= 200.13
##$BF5= 200.13
##$BF6= 200.13
##$BF7= 200.13
##$BF8= 200.13
##$BYTORDA= 1
##$CFDGTYP= 0
##$CFRGTYP= 5
##$CHEMSTR= <none>
##$CNST= (0..31)
1 1 145 1 1 1 1 1 1 1 1 1 1 1 1 1 1 1 1 1 1 1 1 1 1 1 1 1 1 1 1 1 
##$CPDPRG= <>
##$CPDPRG1= <>
##$CPDPRG2= <>
##$CPDPRG3= <>
##$CPDPRG4= <mlev>
##$CPDPRG5= <mlev>
##$CPDPRG6= <mlev>
##$CPDPRG7= <mlev>
##$CPDPRG8= <mlev>
##$CPDPRGB= <>
##$CPDPRGT= <>
##$D= (0..31)
0 1.2 0 0 0 0 0 0 0 0.06 0 0.03 0 0 0 0 0.0002 0 0 0 0 0 0 0 0 0 0 0 0 
0 0 0 
##$DATE= 1712578368
##$DBL= (0..7)
120 120 120 120 120 120 120 120 
##$DBP= (0..7)
150 150 150 150 150 150 150 150 
##$DBP07= 0
##$DBPNAM0= <>
##$DBPNAM1= <>
##$DBPNAM2= <>
##$DBPNAM3= <>
##$DBPNAM4= <>
##$DBPNAM5= <>
##$DBPNAM6= <>
##$DBPNAM7= <>
##$DBPOAL= (0..7)
0.5 0.5 0.5 0.5 0.5 0.5 0.5 0.5 
##$DBPOFFS= (0..7)
0 0 0 0 0 0 0 0 
##$DE= 6
##$DECBNUC= <off>
##$DECIM= 32
##$DECNUC= <off>
##$DECSTAT= 4
##$DIGMOD= 1
##$DIGTYP= 9
##$DL= (0..7)
0 120 120 120 120 120 120 120 
##$DP= (0..7)
150 150 150 150 150 150 150 150 
##$DP07= 0
##$DPNAME0= <>
##$DPNAME1= <>
##$DPNAME2= <>
##$DPNAME3= <>
##$DPNAME4= <>
##$DPNAME5= <>
##$DPNAME6= <>
##$DPNAME7= <>
##$DPOAL= (0..7)
0.5 0.5 0.5 0.5 0.5 0.5 0.5 0.5 
##$DPOFFS= (0..7)
0 0 0 0 0 0 0 0 
##$DQDMODE= 0
##$DR= 18
##$DS= 0
##$DSLIST= <SSSSSSSSSSSSSSS>
$$ [...]
##$SUBNAM2= <"">
##$SUBNAM3= <"">
##$SUBNAM4= <"">
##$SUBNAM5= <"">
##$SUBNAM6= <"">
##$SUBNAM7= <"">
##$SUBNAM8= <"">
##$SUBNAM9= <"">
##$SW= 18.0517689322627
##$SWIBOX= (0..15)
0 0 2 0 0 0 0 0 0 0 0 0 0 0 0 0 
##$SW_h= 3612.71676300578
##$TD= 16384
##$TD0= 1
##$TE= 0
##$TE2= 300
##$TE3= 300
##$TEG= 300
##$TL= (0..7)
0 120 120 120 120 120 120 120 
##$TP= (0..7)
150 150 150 150 150 150 150 150 
##$TP07= 0
##$TPNAME0= <>
##$TPNAME1= <>
##$TPNAME2= <>
##$TPNAME3= <>
##$TPNAME4= <>
##$TPNAME5= <>
##$TPNAME6= <>
##$TPNAME7= <>
##$TPOAL= (0..7)
0.5 0.5 0.5 0.5 0.5 0.5 0.5 0.5 
##$TPOFFS= (0..7)
0 0 0 0 0 0 0 0 
##$TUNHIN= 0
##$TUNHOUT= 0
##$TUNXOUT= 0
##$USERA1= <user>
##$USERA2= <user>
##$USERA3= <user>
##$USERA4= <user>
##$USERA5= <user>
##$V9= 5
##$VALIST= <valist>
##$VCLIST= <CCCCCCCCCCCCCCC>
##$VD= 0
##$VDLIST= <DDDDDDDDDDDDDDD>
##$VPLIST= <PPPPPPPPPPPPPPP>
##$VTLIST= <TTTTTTTTTTTTTTT>
##$WBST= 1024
##$WBSW= 4
##$XGAIN= (0..3)
0 0 0 0 
##$XL= 0
##$YL= 0
##$YMAX_a= 160170
##$YMIN_a= -101214
##$ZGOPTNS= <>
##$ZL1= 120
##$ZL2= 120
##$ZL3= 120
##$ZL4= 120
##$ABSF1= 10
##$ABSF2= 0
##$ABSG= 5
##$ABSL= 3
##$ALPHA= 0
##$AQORDER= 0
##$ASSFAC= 0
##$ASSFACI= 0
##$ASSFACX= 0
##$ASSWID= 0
##$AUNMP= <proc_1d>
##$AZFE= 0.1
##$AZFW= 0.1
##$BCFW= 1
##$BC_mod= 2
##$BYTORDP= 1
##$COROFFS= 0
##$CY= 11.3945322036743
##$DATMOD= 1
##$DC= 2
##$DFILT= <>
##$DTYPP= 0
##$F1P= 15.7292609196834
##$F2P= 12.9074282941183
##$FCOR= 0.5
##$FTSIZE= 0
##$FT_mod= 4
##$GAMMA= 1
##$GB= 0.15
##$INTBC= 1
##$INTSCL= 1
##$ISEN= 128
##$LB= 0.24
##$LEV0= 0
##$LPBIN= 0
##$MAXI= 10000
##$MC2= 0
##$MEAN= 0
##$ME_mod= 0
##$MI= 1.114404
##$NCOEF= 0
##$NC_proc= 0
##$NLEV= 6
##$NOISF1= 3.799351
##$NOISF2= 2.8
##$NSP= 1
##$NTH_PI= 0
##$NZP= 0
##$OFFSET= 15.70392
##$PC= 1
##$PHC0= -25303.82
##$PHC1= 8.18731
##$PH_mod= 1
##$PKNL= yes
##$PPARMOD= 0
##$PSCAL= 0
##$PSIGN= 0
##$REVERSE= no
##$SF= 200.130013532006
##$SI= 16384
##$SIGF1= 3
##$SIGF2= 2
##$SINO= 400
##$SIOLD= 16384
##$SREGLST= <1H.CDCl3>
##$SSB= 0
##$STSI= 0
##$STSR= 0
##$SW_p= 3612.71676300578
##$SYMM= 0
##$S_DEV= 0
##$TDeff= 0
##$TDoff= 0
##$TI= <>
##$TILT= no
##$TM1= 0
##$TM2= 0
##$TOPLEV= 0
##$USERP1= <user>
##$USERP2= <user>
##$USERP3= <user>
##$USERP4= <user>
##$USERP5= <user>
##$WDW= 1
##$XDIM= 8192
##$YMAX_p= 0
##$YMIN_p= 0
$$ End of Bruker specific parameters
$$ ---------------------------------
##NTUPLES= NMR FID
##VAR_NAME=  TIME,          FID/REAL,        FID/IMAG
##SYMBOL=    X,             R,               I
##VAR_TYPE=  INDEPENDENT,   DEPENDENT,       DEPENDENT
##VAR_FORM=  AFFN,          ASDF,            ASDF
##VAR_DIM=   8192,          8192,            8192
##UNITS=     SECONDS,       ARBITRARY UNITS, ARBITRARY UNITS
##FACTOR=    0.0002768,     1,               1
##FIRST=     0,             0,               0
##LAST=      2.2672688,     0,               0
##MIN=       0,             -101214,         0
##MAX=       2.2672688,     160170,          0
$$ Real data points
##PAGE= N=1
##DATA TABLE= (X++(R..R)), XYDATA
0 0 0 0 0 0 0 0 0 0 0 0 0 0 0 0 0 0 0 0 0 0 0 0 0 0 0 -3 4 -5 7 -7 7 -7 10 -10 10 -12 15 -16 17 -21 22 -25 28 -31 35 -38
46 -38 41 -46 50 -56 61 -67 75 -84 90 -99 111 -123 135 -152 171 -192 215 -245 284 -329 388 -453
68 -453 471 1361 18092 -29434 -41563 54537 68958 -37537 -62135 36338 52315 -37047 -47787
81 -47787 27182 26455 -29369 -10573 32079 -5128 -40315 11669 48302 -3883 -38210 1750 23357
94 23357 -7023 -13394 9983 4329 -11015 6659 16391 -11647 -22274 8178 21861 -2003 -14397
107 -14397 -476 4000 -3778 -605 5646 -617 -4363 4893 8977 -3918 -11450 -2146 8787 5867
121 5867 -2887 -5068 -937 1708 1658 716 -1100 -2134 368 2784 -618 -4887 -1693 4766 4499 149
137 149 -1136 -935 -2024 -330 2989 548 -3713 -2090 2502 1984 -2131 -2294 1063 2335 1280 51
153 51 -1757 -1680 627 1976 112 -1627 -594 865 425 -347 -540 -232 106 793 897 -852 -1594 -121
171 -121 1439 1093 -339 -589 -624 671 -18 -364 -565 65 706 343 -540 -680 -115 195 654 254 -216 -333
191 -333 368 256 45 15 -363 -218 424 334 -286 -562 213 593 -232 -355 -464 -177 -204 102 -233 -77 452
212 452 195 57 15 -183 119 113 186 74 -66 -23 77 209 -309 22 -208 120 61 -197 -120 -225 170 179 -78
235 -78 -396 -210 190 -42 -90 -55 -113 -65 175 84 -29 -103 96 68 -41 -228 -468 10 129 -199 67 -331 -138
258 -138 174 120 31 -83 -144 -93 128 -138 76 -104 11 61 -100 -208 -158 107 -73 67 -197 -111 -79 103 -32
281 -32 163 -44 78 106 -127 -197 -296 -154 -57 135 18 -84 158 -221 264 -150 -221 123 -168 234 -158 16
303 16 -86 62 -106 -70 -127 -134 -9 14 -65 -38 75 -12 285 77 -85 22 114 60 -172 197 -59 -36 -164 -28
327 -28 62 -1 100 -91 25 -18 -154 68 134 -5 -137 -281 -1 36 49 -350 -63 -19 -224 -296 88 1 -90 -6
351 -6 28 -20 56 -125 112 -340 -5 25 -76 0 9 265 -9 -205 -54 -56 204 -85 14 -32 -269 102 -141 56 194
376 194 160 1 185 36 177 -10 0 -36 -127 -40 -61 -183 -236 -184 -32 -167 -113 173 194 -18 -11 -330 76 -136
400 -136 -89 -257 223 165 16 8 63 -85 -54 35 87 -133 -87 97 264 -19 198 -23 -202 -31 -19 47 65 -196
424 -196 -316 -380 -283 -196 134 -3 -171 -153 254 193 -152 317 -190 -27 35 -133 -12 -110 -98 -135 50 322 272 81
448 81 26 -31 95 -91 -69 54 -178 -257 -94 -2 24 94 -77 -60 -113 -118 160 144 23 31 25 82 -136 77 -229 -128
474 -128 -24 96 73 -149 -3 -106 117 -90 -41 79 -20 -111 -28 94 95 -123 136 -33 33 38 -124 -162 -1 238
498 238 -38 -60 320 -116 128 -95 40 -144 129 -149 -301 -256 227 37 -142 78 162 -117 -135 -180 -154 81
520 81 -70 416 38 79 -18 -247 2 -209 -86 32 299 122 -178 283 10 198 17 -39 -312 85 -106 52
542 52 169 72 -45 -63 74 33 -89 -5 -52 -157 -193 -107 131 134 -24 224 196 -129 178 28 27 136 -35 -78 2
567 2 -151 16 271 306 -73 -50 56 6 149 -162 -129 229 -177 36 -209 -81 -65 -25 55 89 147 -157 139 161
591 161 -166 25 -19 96 -250 19 -109 -105 -162 197 -61 44 -22 -74 315 -74 271 223 62 389 -227 -15 141
614 141 -430 -29 -114 -167 9 184 218 -36 168 -14 12 47 -51 -134 33 66 -214 -145 -64 65 -131 -30 -94 -48
638 -48 43 201 -84 -207 -9 -184 -257 -123 157 6 205 -78 150 -365 -3 -127 79 -80 -217 168 -170
659 -170 -27 127 -89 -81 -14 209 -277 38 266 53 -105 -87 -44 199 20 4 137 -130 76 -137 83 23 91
682 91 25 -167 -58 -47 -87 70 -93 -49 -74 -196 -41 42 7 -5 113 -20 113 -126 109 231 -21 190 -11
705 -11 -102 99 31 38 22 147 -219 -9 -81 182 -148 8 29 -86 189 -94 58 33 -107 58 241 110 218
728 218 -89 -317 -96 -17 -330 -121 -44 -33 -243 -53 -130 -66 -137 13 67 -43 -83 -97 -27 90 -28 -38 92 75
752 75 -63 88 -104 157 -72 -121 -22 -19 48 35 37 49 107 96 -116 -115 -150 142 16 19 44 -44 -215 257 -43 -164 -44
779 -44 -153 16 -161 -18 121 61 148 76 244 -78 -17 -11 -139 185 72 76 147 216 -236 -33 191 -219 11 -28
803 -28 -188 173 137 -251 -160 -13 -6 45 -51 90 -57 -209 179 -281 132 40 255 173 -68 187 -116 60 187
826 187 -213 -23 -364 76 -25 -57 20 -25 -137 29 248 107 -37 94 15 -64 196 58 39 -33 17 171 -181
849 -181 -72 -183 78 191 7 -26 101 -85 106 87 17 161 189 -53 97 356 81 179 -268 -168 179 -26
871 -26 5 187 -215 -143 179 -195 -185 -6 174 83 -27 -200 -36 71 11 140 -127 10 -22 -196 44 -30 -16
894 -16 -152 230 143 -46 -28 156 -33 -35 95 102 155 -59 -77 -105 -330 56 -82 -1 -38 -181 65 155 -99 -50 13
919 13 -76 252 81 81 66 -42 7 -141 -87 31 234 155 -107 179 -222 99 -54 -180 -53 46 96 -5 18 116
943 116 127 -20 -25 -24 30 130 111 13 -127 104 -134 246 219 58 -25 -77 -13 -7 -43 165 258 -61 -29 302 71 -11
969 -11 -78 -64 8 -4 3 136 120 63 -47 99 -80 -96 126 20 -218 -60 -64 -283 100 241 -141 -64 183 -148 97
994 97 93 181 36 158 110 89 49 16 138 -109 80 147 20 -210 -203 -320 98 -78 -107 64 -46 -31 26 -4 -1 -35
1020 -35 -206 -3 190 -53 -21 -103 -172 80 -10 0 61 -271 83 45 -4 55 238 183 0 38 -49 281 -92 -84 128
1045 128 -47 40 343 -108 30 -101 -35 -62 -11 10 -1 119 -113 -157 -141 12 257 27 -143 106 4 62 -77
1068 -77 -69 -321 -277 44 -25 92 56 177 221 -181 -74 -72 175 71 -93 107 1 -15 211 -1 -72 -68 146 60 -151
1093 -151 -287 366 -77 -49 -85 17 -235 141 84 112 37 19 391 179 47 -146 -69 -196 -106 -39 6 -114 97
1116 97 -33 16 -125 154 -64 55 -324 5 -51 -34 55 -50 -116 52 114 -171 -156 -79 45 -61 49 119 -253
1139 -253 49 -70 -162 -48 120 -211 43 -130 4 14 -48 238 -183 -228 209 54 74 81 -49 159 87 204 -250
1162 -250 44 -23 60 200 63 -181 -54 -2 -25 48 -83 60 -168 38 -126 -40 57 90 -175 -132 52 59 -151 -147
1186 -147 -22 -100 -2 -6 -96 48 -47 117 -21 -94 95 -270 -62 -89 -65 283 -48 -272 -261 -162 -63 21 -137 -3
1210 -3 -324 -137 266 -86 -16 236 -224 -44 14 -64 -20 114 61 -20 -184 -15 53 82 -26 21 161 -148 -24 -366
1234 -366 -82 299 147 -226 92 -29 -78 43 -217 -23 48 218 -196 -40 -90 -17 17 128 -163 30 -3 180
1256 180 -179 -105 -287 19 -271 -294 29 250 -16 -116 -90 55 147 65 -257 56 -2 -206 2 -181 -156 238
1278 238 -73 22 90 -159 -64 -100 93 -429 -134 -55 46 -45 -29 122 -171 152 279 89 78 -81 163 71 111
1301 111 -36 -175 203 -129 -37 -25 156 52 77 -145 -65 159 55 33 -184 5 8 8 23 -304 -119 210 -39
1324 -39 -45 -44 10 251 63 6 -86 -51 -30 66 114 -48 24 27 -127 -116 115 -123 164 -5 -74 -113 25 -2 -335 60
1350 60 -70 106 198 -115 153 -300 -173 76 62 -47 -15 32 -48 41 -83 -37 231 197 152 211 167 159 17 -13 91
1375 91 21 -53 357 67 13 95 -47 0 -237 -185 168 -135 -139 -110 132 42 266 -98 -24 -93 230 -100 241 -177
1399 -177 -85 284 46 -157 -24 -90 -121 290 11 144 -81 -39 88 -45 -22 292 9 29 47 70 -10 -79 -189
1422 -189 -76 236 275 -324 -47 -131 2 16 302 -127 12 -94 -94 208 -379 32 241 40 -159 108 -61 -201
1444 -201 116 -166 -38 -75 -4 -63 -136 197 205 96 125 -19 -17 123 46 335 -31 -45 82 34 96 -296 -10 133
1468 133 0 71 -80 65 95 232 109 273 -142 135 77 118 -159 36 -67 175 123 -27 200 -57 6 109
1490 109 79 137 262 217 -98 -2 -128 31 33 33 -166 27 27 -178 -185 -28 68 -82 290 -49 13 72 -128 -61 -152 -22
1516 -22 9 -217 83 -89 -181 37 -155 128 34 -1 264 -65 75 52 -117 65 61 -49 132 -300 -50 4 324
1539 324 150 120 220 91 -168 77 26 -26 61 -15 19 209 -91 -299 333 -8 -133 16 26 -49 51 287 104
1562 104 -233 179 277 207 -38 55 70 -81 -159 -250 -191 -89 5 -63 5 208 -70 258 -202 102 -9 129 203 -3
1586 -3 217 179 -151 2 28 -35 60 6 64 -129 -156 -33 64 2 -131 -53 -115 84 21 -198 -93 -242 27 -121 -8
1611 -8 -39 -67 -122 177 175 29 15 -36 -70 -107 -75 83 -95 -73 -69 167 258 2 -210 173 -7 -30 -94 -132 -120 -54 -74
1638 -74 -108 -195 -28 -49 25 -64 103 100 -69 24 114 119 10 -200 -9 -127 104 166 51 -298 -204 -249 54 -74 -115
1663 -115 -34 119 234 11 -46 -115 -57 270 -49 -64 28 -18 -84 102 121 -93 -52 -35 -223 -161 86 45 -153 252
1687 252 -331 -130 -97 -67 31 -39 -94 144 154 -283 -153 92 -2 27 -210 -7 41 118 28 -145 144 -126 155 -140
1711 -140 15 -85 72 22 -203 110 -72 -19 -177 -192 -117 26 45 16 -258 -89 -24 94 -32 -138 -54 -107 12
1734 12 -8 -225 52 -100 6 74 -25 238 -51 154 66 106 183 -37 217 312 -69 -38 -193 -4 -11 -27 0 46 -158
1759 -158 32 270 -54 13 151 142 203 208 110 -199 121 137 -54 -76 -42 170 49 -39 -101 -94 14 49 110 -125 -36 -123
1785 -123 -292 7 78 -284 -6 -97 3 -117 -109 150 -31 -222 126 108 -52 4 -148 -114 180 239 49 22 240
1808 240 95 -1 73 150 -329 -14 20 -91 -54 113 -26 -42 -398 -106 226 140 226 -36 -159 -48 36 93 -96
1831 -96 -66 -22 -166 48 -297 17 255 52 10 57 -47 -35 -3 62 39 -251 105 51 -9 264 -68 104 -245 -342
1855 -342 105 -136 -66 30 -50 -75 -173 187 307 192 122 -14 156 -33 -61 22 28 -7 -123 251 -79 -18 -137 -97
1879 -97 31 74 -11 -163 16 -38 -67 -88 -177 110 2 38 22 72 67 105 255 -62 191 178 -171 -179 16 70 186 87
1905 87 50 -46 112 -115 206 -124 -121 298 268 -74 54 -62 56 -158 -11 -178 50 101 127 -26 -118 148 38
1928 38 86 -178 -181 87 193 51 -222 -145 -219 -38 88 95 105 -117 210 -30 -103 -123 47 234 54 -2 40 204
1952 204 -102 99 216 100 4 -257 144 -97 181 -201 -73 153 104 28 -58 17 123 -36 -93 -341 -203 -146
1974 -146 121 -46 28 83 -203 -129 -173 103 -60 22 -230 -192 8 63 -170 170 -167 -13 69 -297 -172 -72 183
1997 183 -56 306 133 171 31 33 -105 93 118 196 97 -16 -163 106 -197 147 -105 92 72 23 -150 101 -32
2020 -32 -27 -105 -116 -106 -17 -4 -203 -59 -295 11 75 -131 187 -118 74 -12 77 103 -209 -113 -85 -126 246 -110 -239
2045 -239 -96 -115 -97 131 76 28 79 -145 -4 -24 -49 40 207 83 23 -298 2 125 -60 97 -13 61 -54
2068 -54 101 -179 417 215 72 -166 29 -70 -137 -114 101 2 64 -169 -7 212 130 168 129 154 -92 263 50
2091 50 -54 84 14 -248 88 -262 31 -103 -234 16 42 -65 196 40 -139 -17 -75 -70 122 67 -94 60
2113 60 -162 32 63 -141 42 31 13 38 -265 82 57 42 111 10 -84 136 86 72 109 -196 147 -32 -11 144
2137 144 48 -136 -17 -229 0 -148 -61 -88 -15 -102 -160 -58 79 5 100 23 -57 -78 129 14 -15 -61 -26 132 28
2162 28 -195 -155 129 -152 29 127 196 210 -8 75 4 15 91 -351 -81 -12 26 -30 182 107 -31 -109 145 331 53
2187 53 36 -108 189 -3 21 -106 -52 217 -141 176 160 69 -100 266 159 93 92 177 -220 0 48 -63 -184 184
2211 184 -95 187 152 96 -177 309 175 -194 14 -233 254 164 133 -139 8 281 160 -139 -244 139 75 297
2233 297 -244 124 40 -18 218 -27 83 62 -6 28 -46 51 232 -75 -189 -84 134 -43 -76 -208 44 -186 -232
2256 -232 121 -154 -65 -63 -307 -56 137 90 98 -128 -6 -261 133 98 -343 -223 -40 -108 -169 162 -213 -152 62
2279 62 -121 -78 -61 53 63 -155 -43 36 -119 126 -114 139 91 -44 101 81 -31 -211 -161 -114 -31 -76 193 0
2303 0 76 26 -17 -40 -4 124 -102 -16 -98 163 -171 47 -188 -148 67 42 192 37 -219 123 253 195 -177 145
2327 145 -57 226 -105 82 -165 16 263 -72 175 -175 -177 -104 -185 -37 -63 -17 -51 274 -43 41 64 80 62 220
2351 220 136 36 7 -149 92 -21 109 32 -51 20 134 -92 32 112 84 -44 7 -109 107 357 -28 -12 -78
2374 -78 53 129 257 10 -309 234 -67 140 75 64 210 246 -58 -94 -4 -23 359 194 98 -213 -269 74 72 -138
2398 -138 181 -72 19 -34 -138 120 177 2 -2 -27 56 215 35 161 133 -327 -210 -11 26 -29 0 -62 -12 195
2422 195 -214 -221 53 -1 246 78 126 -42 30 -22 151 113 19 -44 110 -334 172 -54 225 -3 -315 144 92
2445 92 -120 72 218 -58 61 -172 114 -149 -264 -60 -49 49 -7 -14 -9 -89 158 -11 202 -8 -188 53 64
2468 64 -87 230 44 -117 -3 95 110 28 -200 -114 -174 102 63 -100 128 47 -55 284 5 -172 -14 57 83
2491 83 -174 66 -240 -6 -33 65 -145 -1 -65 234 -18 87 172 346 -42 64 -174 -22 -230 -168 74 179
2513 179 161 -58 157 -58 131 -178 110 -182 123 41 -205 214 45 219 265 -260 -21 95 22 -119 40
2534 40 104 -250 -75 -223 -286 79 -22 -66 -225 146 -13 -50 60 -9 183 -166 61 186 67 -169 43 135
2556 135 -100 102 156 -23 148 302 -225 -34 215 159 -151 15 4 197 222 156 -160 -49 -19 25 168 188 324
2579 324 -142 7 -106 -65 71 -145 -233 -184 35 -134 17 86 26 279 61 140 -49 45 -85 -27 -24 -217 -200 160
2603 160 50 82 -352 160 -149 7 84 -157 2 10 199 63 -243 -166 -344 42 -193 209 151 -40 -145 -27
2625 -27 -215 24 259 185 -69 2 7 -87 -182 -187 94 -190 -200 -260 -80 -191 -14 -251 -32 -91 18 256 100 2
2649 2 -225 134 -93 246 -36 -76 97 7 150 269 -44 77 -3 -9 -64 73 -3 62 89 -183 -40 -50 85 27
2673 27 -47 71 -82 135 56 79 17 177 249 -142 58 -162 74 -253 -94 -173 299 168 -154 161 -165 -76 148
2696 148 -134 145 -126 -217 -202 -172 16 141 -348 81 69 33 -199 -49 311 113 35 91 -47 -104 283 186 224
2719 224 155 101 -18 -105 -147 42 -139 78 -31 -40 144 -88 51 45 -44 -151 -53 111 310 224 -276 -48 -188 276
2743 276 196 -24 4 29 -78 -229 37 362 -481 120 -39 -237 148 1 -48 95 -63 -104 -190 -156 137 167 -14
2766 -14 -237 -163 -77 -40 -55 239 77 78 190 89 8 -194 -1 128 5 -160 -92 -24 -96 -81 95 -17 -70 -40 147
2791 147 -167 -96 -142 -66 -248 -249 14 91 -62 107 73 -17 63 72 268 -222 102 211 8 277 -261 478 79 132
2815 132 24 70 -54 32 15 -132 -136 10 95 121 48 132 -7 -473 -100 -114 -162 102 -101 134 -169 -20 313 224
2839 224 12 -247 221 -28 179 101 -32 326 -19 -120 -45 184 35 -141 -8 -28 -6 35 16 262 -62 62
2861 62 137 269 183 32 127 129 97 -147 27 -163 147 155 7 -18 -42 270 187 -33 198 81 -24 -38 3 -17 60
2886 60 232 72 -33 -66 77 -81 -11 45 -38 -228 -3 -87 124 -170 -68 21 -77 -118 -7 53 -122 -140 46 -148
2910 -148 -37 -188 -25 31 100 -133 -31 -298 75 66 -293 -232 98 6 -135 384 172 237 166 0 -17 9 -140
2933 -140 -146 -95 -206 -107 24 -105 92 337 12 -348 -147 38 -27 82 129 -313 -59 83 161 -30 63 59 -142
2956 -142 145 -248 63 -116 90 -74 113 48 -220 90 -26 -50 -17 -24 46 119 80 -176 -264 102 -46 -31 2 -142
2980 -142 -32 36 -8 -42 -36 -141 -244 -111 -45 225 -197 -178 -19 154 208 246 -133 76 243 -164 220 -308 154
3003 154 -188 -174 1 67 -176 202 -116 195 122 -13 -57 -45 13 -8 215 -122 -71 -256 -305 -11 -19 -180 101 -48
3027 -48 -169 30 38 -204 118 -121 143 -158 -30 41 65 -18 145 -86 84 143 161 -2 -68 -283 -45 -86 -35 -216
3051 -216 -153 -17 150 -30 22 -206 88 -284 -42 -202 -6 16 9 -189 39 -186 -152 -210 -165 59 -194 -152 19
3074 19 226 61 -134 -164 139 -30 117 -113 84 -363 -162 -144 223 47 -112 185 -175 -139 -308 4 35 102
3096 102 33 -229 85 -130 56 56 207 -127 -129 -45 244 66 -62 48 -173 172 67 21 -47 -80 141 -56 -72
3119 -72 -16 49 -165 -84 149 89 227 288 -35 -232 -49 -61 -123 205 76 35 80 -66 -120 -124 103 -35 0 -2 69 -126
3145 -126 3 -8 126 -33 -115 -165 -120 -259 -139 -169 197 -9 -1 -1 41 -91 -204 -83 130 -44 -146 322 -221
3168 -221 205 -26 126 -41 -122 11 89 -105 255 -67 -6 -75 162 97 -45 -83 168 177 -6 294 25 121 94
3191 94 2 -23 105 5 133 -218 -32 -117 -104 121 -227 -74 88 249 -313 48 -252 29 -156 -72 316 -19
3213 -19 55 -36 8 126 63 14 59 -77 101 12 -18 73 58 22 -162 131 -95 161 -70 -96 -39 117 -146 72 -170
3238 -170 -201 158 -65 -29 91 97 221 81 53 -6 140 173 -208 27 78 78 -155 108 -104 -161 216 79 92 -92
3262 -92 197 -113 165 30 -127 -255 -146 185 -236 -71 -123 148 -195 -63 -265 122 24 120 42 -170 -62 -51
3284 -51 139 -203 112 71 89 -188 150 -14 -85 110 76 46 -80 -103 44 168 -44 -261 -15 9 -6 -105 134
3307 134 -12 -49 48 37 13 -44 -31 75 -64 -219 -119 -157 23 54 -74 138 -84 -349 -26 -320 88 2 -185
3330 -185 151 -81 100 -43 -7 -207 148 -56 -75 97 48 -314 -249 119 18 -44 -145 73 276 145 -72 -194
3352 -194 26 -17 33 -121 59 63 -339 -281 62 6 110 115 -142 -285 -16 -115 -7 -127 17 -121 -28 -296 -187
3375 -187 -63 63 -92 22 101 14 139 242 -13 -268 259 147 -83 23 194 65 -164 113 -98 67 -293
3396 -293 40 101 164 99 -156 46 -171 163 -170 -226 -110 -16 -67 121 -292 -124 23 -47 -73 89 84 228 -226
3419 -226 -138 144 116 0 -200 -5 -110 48 -84 297 -59 -207 83 -339 139 319 114 24 237 78 5
3440 5 -204 133 17 62 -116 -17 131 -119 -280 40 98 -189 -156 -2 -128 -97 72 108 -42 1 130 -68 167
3463 167 139 44 -8 -169 -77 -37 -39 -241 173 -10 -94 -86 339 -17 -85 -78 -59 -36 49 94 -309 144 140 -24 93 -313
3489 -313 -55 263 47 -163 -9 55 -169 81 183 181 206 282 38 -150 -178 192 -118 124 13 -31 -82 19 156
3512 156 157 103 -15 47 -93 -113 -95 50 176 -230 -153 32 -86 -290 133 -52 79 186 -14 206 -96 55
3534 55 28 -48 17 54 7 55 56 11 -66 139 296 27 -94 -56 -49 114 276 7 242 148 -4 -18 53 -189 -236 -94
3560 -94 124 -303 88 89 -132 -13 -107 -199 177 -138 -71 -14 65 -77 28 46 -169 134 -153 -58 -76 -67 -230 71
3584 71 -101 -154 71 36 -156 53 -141 -41 -33 -141 -218 -54 -107 -20 108 340 -136 95 146 -97 114 166 -103
3607 -103 -95 -138 24 49 36 26 24 -241 -59 -193 -210 -12 -250 -222 140 87 6 -158 -197 122 91 137 188 45 18 -15
3633 -15 24 40 -43 162 -117 -96 50 -30 290 -69 -108 -54 -4 13 63 -235 -2 75 1 239 -22 -22 33 -44 -223 86
3659 86 37 196 -41 167 -327 157 -241 -191 -30 -117 -256 -284 39 19 -158 37 73 -98 44 351 299 -46 -15
3682 -15 -62 -29 98 -71 -128 74 249 -31 146 18 233 -89 71 -250 105 2 -148 -227 43 -142 -108 61
3704 61 -67 48 -5 -94 14 186 -98 -26 -111 -3 21 -152 -129 -119 105 -156 -91 -168 163 88 -119 18 67 -43
3728 -43 -180 32 -21 -137 -48 235 105 61 136 60 -309 87 -183 19 34 24 -152 46 120 172 -95 167 -80
3751 -80 -64 242 189 -96 -129 278 214 98 -13 -130 39 18 22 -33 25 -293 59 78 35 -20 -64 -125 -33 22 -179 -50
3777 -50 -229 186 -100 -35 83 -132 10 -37 -142 -1 62 -24 -129 -207 -43 -114 33 35 -83 -29 -61 -175 149 -26
3801 -26 56 174 4 -109 183 79 -8 -6 66 72 45 -85 -110 100 -33 88 153 -197 -1 11 -64 -112 268 63 426
3826 426 -39 -74 32 -233 122 74 -128 -140 -35 -42 -85 -107 268 -144 -112 4 87 4 22 270 -177 -218 66 200
3850 200 -74 117 229 151 -138 -229 -137 -13 238 156 -120 60 6 107 23 -86 256 223 29 13 178 -257 -209
3873 -209 33 -65 -230 -157 71 175 -62 159 -197 19 -308 -19 -74 211 62 -116 -79 -47 -25 -37 -71 -48 66
3896 66 119 -12 51 17 -130 79 47 -69 1 266 47 135 -142 242 121 4 321 -43 243 -197 -143 -125 26
3919 26 -50 1 138 227 -47 -84 -100 25 -67 84 -11 126 189 183 -159 76 110 73 107 -105 254 -51 -335 -104 258
3944 258 -155 -56 -18 54 -127 2 -120 -54 -108 -172 -122 192 -27 -155 -100 -26 -102 -42 -132 154 102 66 180 -24 -136
3969 -136 -68 54 -119 108 -197 302 -107 187 -206 40 -81 -52 151 155 107 -28 -22 -75 -223 87 -101 64 -96
3992 -96 -126 -125 -18 69 -135 -15 -166 175 39 -34 -20 193 91 118 -164 -256 -22 93 -12 -253 -58 -7 48 96
4016 96 103 42 25 47 -66 -112 101 8 118 -66 28 6 -120 -127 115 -280 87 16 29 -180 -91 1 -148 14 152
4041 152 158 -222 10 -49 45 -137 185 343 -134 -59 -309 -480 -50 -100 -46 -82 116 270 93 -165 -101 57 89
4064 89 -20 68 15 10 -313 -45 -362 111 -81 219 189 219 135 0 -250 -180 121 -490 113 -75 -49 -26 -56 45
4088 45 231 142 -192 -231 -158 -205 126 -59 -259 0 -101 -134 27 -60 36 -230 219 196 2 147 -71 -154 -179 19
4112 19 -180 -96 19 18 70 202 -138 138 24 118 -58 37 79 108 99 -110 -38 23 250 1 19 -154 37 -13 -239
4137 -239 124 56 144 101 170 17 122 40 10 17 -44 190 99 205 -11 -7 -142 148 -33 -116 223 73 -128 -51 -90
4162 -90 83 -11 -115 -78 -366 -134 -275 -62 52 -41 -131 9 50 57 -10 -173 100 -66 167 -141 -50 -27 70 186
4186 186 363 54 210 -95 -39 83 -35 -88 253 -95 157 -8 112 -159 38 -275 -308 -47 -62 184 90 83
4208 83 -211 17 91 -197 -273 145 -243 -57 -148 30 -38 -257 -146 -28 -179 72 21 59 55 -42 -35 -47 137 -158
4232 -158 81 57 107 -95 105 -416 -172 -137 160 -41 16 133 -303 48 209 -7 -149 85 -13 103 134 -136
4254 -136 35 -306 89 -238 -468 8 80 354 -54 -291 -9 119 -76 245 148 135 5 -35 -60 72 -108 148
4276 148 -177 -10 -34 159 0 -124 -61 114 31 103 101 93 -130 216 16 -95 -4 -13 239 175 104 41 -140 -118 -210
4301 -210 165 -298 113 -121 78 -196 46 -29 154 -186 -262 -282 217 52 89 90 142 112 87 127 -22 248 -234
4324 -234 -82 10 -31 290 -66 -21 -7 127 247 -118 82 84 -21 79 -11 -144 -180 -175 -24 -120 70 144 -56 178
4348 178 -119 -103 -72 170 30 -90 222 -3 181 -55 -103 -57 107 145 -491 138 -80 17 109 73 205 -344 -134
4371 -134 119 -86 -81 116 223 -35 81 -79 37 153 27 213 -376 -156 27 -199 183 40 178 279 -155
4392 -155 114 60 206 -17 -10 -114 49 -8 -210 -11 33 -62 -146 79 63 65 32 61 -140 -232 26 94 -188 -156 -219
4417 -219 73 78 -175 -112 0 -10 -118 72 -145 29 83 196 237 -139 75 145 85 -112 309 104 219 95 126
4440 126 -64 -106 60 -88 75 52 80 54 370 -118 -128 -15 17 -259 147 -177 -52 -201 16 59 -280 -268 95
4463 95 297 33 -2 -4 51 193 101 -56 -156 37 -213 -7 153 52 -4 -21 -1 58 61 96 125 64 -31 286 -234
4488 -234 95 21 -78 -206 93 -44 100 326 125 -81 138 214 -52 -138 30 178 69 -242 54 251 -197
4509 -197 -211 221 0 30 -268 -117 104 -143 -67 51 9 88 -153 -329 149 122 -129 -6 -33 101 23 -47 -155
4532 -155 -105 -89 1 69 -69 -48 -10 -154 -183 -171 -82 18 -26 -120 78 -181 50 -31 -74 172 -217 -272 51 50 14 -172
4558 -172 119 -24 -65 -82 -181 -175 31 78 -36 149 -85 1 81 -104 274 -23 -152 55 -95 -98 -58 161 -45 75
4582 75 -7 87 -191 93 75 -163 75 -256 -45 -156 63 80 -83 23 111 250 26 -34 -122 74 -45 -253 57
4605 57 -55 -46 41 -60 230 -130 -228 -99 147 -2 143 -56 143 -113 34 -50 70 58 -73 30 -120 -316
4627 -316 118 -77 38 311 61 5 -288 43 299 -60 443 154 6 227 -94 -235 220 216 54 73 37 131
4649 131 -134 84 89 291 62 -72 52 -38 157 -28 -148 166 16 -33 10 299 -104 87 91 -6 -113 -104 8
4672 8 -167 52 4 -16 -117 -146 4 85 -198 -152 21 -81 167 42 89 43 62 52 -102 -10 -35 -10 -27 174 81
4697 81 45 106 32 136 -68 -90 -21 -60 -172 42 209 -210 -10 202 115 -27 94 -16 106 -138 213 69 -264
4720 -264 -77 59 18 19 179 -58 -209 -133 -133 -96 -144 -74 -39 -75 121 -158 -16 -4 -340 364 103 134 -85 -5 0
4745 0 -2 -20 5 -178 -156 83 20 7 41 -183 68 121 211 0 234 11 -189 -185 -204 -11 -28 165 20 129 93 16
4771 16 -13 34 23 51 59 32 122 211 -62 -114 63 38 -232 -2 111 -79 -25 203 -82 80 23 161 -32 53 34
4796 34 79 77 -60 -28 -32 -116 -13 10 -138 96 -206 51 105 -404 -153 144 -158 -171 65 77 30 -6 -1 115 -8
4821 -8 38 -125 -20 217 97 -43 177 -16 -18 -326 81 161 9 49 158 43 -4 -293 -175 65 -114 -52 -43 -107
4845 -107 79 141 26 75 -23 -54 -28 63 -293 -202 -65 -29 -50 16 203 -82 30 -21 39 194 -133 236 -6 159
4869 159 60 29 25 209 -162 -32 -58 72 15 -205 -205 -55 6 180 -122 -106 220 19 35 189 18 -85 128 -164
4893 -164 -15 103 31 165 185 73 -231 -143 169 -269 -26 26 47 -89 -110 -156 -83 -1 -296 108 -47 52 136 -68
4917 -68 -10 -151 -8 -103 -293 -107 -120 -34 137 33 -212 -19 -100 103 -53 -189 -17 -169 73 89 13 -127 -31
4940 -31 -99 27 -71 -100 92 17 98 36 87 -22 -55 -196 -117 185 -59 67 142 -152 -29 -125 250 -102 -149 -99 -87
4965 -87 -14 80 -55 -190 -429 -154 -264 -11 -99 81 -48 93 228 -222 -115 187 -56 155 -61 -70 -224 106
4987 106 21 -3 22 -394 -35 -70 38 -107 154 -406 82 69 -85 -59 9 -144 6 -90 -144 -149 106 -124 155 158
5011 158 -51 -111 -127 -124 -205 -130 163 73 37 -27 132 -60 8 -207 219 111 101 34 103 15 18 53 -105 -240 -34 14
5037 14 -72 109 -347 1 36 29 84 1 204 142 -93 188 -38 146 -221 -88 -38 -7 3 161 18 -167 -257 -306
5061 -306 102 21 113 101 -9 -150 -244 138 93 62 303 131 57 120 -127 -25 -88 -61 210 -64 90 438 -209
5084 -209 296 64 -290 -135 39 141 -36 -42 84 6 106 -110 80 68 83 314 -168 268 -190 284 -10 37
5106 37 -180 -106 134 362 -4 105 -145 -190 138 89 196 -97 86 -77 -52 175 242 30 -82 48 185 28
5128 28 -99 108 -67 -1 -13 -10 69 50 -19 205 79 233 43 -177 26 10 47 -301 44 157 -126 9 -198
5151 -198 -57 165 -77 -171 -108 -115 -68 202 189 78 71 62 29 -27 -112 58 -16 -174 -18 8 -116 152 -138 11 29
5176 29 -24 19 224 -83 151 -105 21 68 114 -153 -80 117 -88 171 -94 -163 -110 -207 -13 7 58 -88 42 68
5200 68 12 14 25 -99 91 -63 172 5 -112 221 75 -212 108 -53 -94 -151 -69 -20 -159 -8 152 -72 195
5223 195 -247 -16 219 169 -3 -69 -80 113 119 -7 -37 245 254 157 85 300 -25 -21 -146 -266 -24 155 -82 54
5247 54 27 7 87 -36 206 -16 145 -57 35 0 35 110 34 3 -235 -124 9 -3 -78 -47 -59 -86 -349 174 86
5272 86 -172 342 325 98 136 -73 -47 6 81 83 -57 126 136 75 123 -147 97 275 52 80 -345 -53 -111 19
5296 19 -118 -51 137 80 -274 51 98 4 100 81 -20 14 -96 104 -221 81 -82 -91 31 -116 -1 -191 227
5319 227 -71 113 -90 -101 -3 -44 87 -7 -55 -126 18 111 8 -162 198 -33 -304 -129 67 -175 -275 320
5341 320 287 130 -60 72 3 166 110 -41 -125 18 92 -338 -223 -21 -46 -34 -145 162 -102 -42 51 121 -227
5364 -227 -427 131 141 35 -67 0 362 -98 -76 199 114 -24 -65 19 -222 156 92 92 126 -76 99 201 47
5387 47 -187 44 -194 48 -11 -104 -128 308 9 -110 155 -268 -62 5 -13 -235 72 -66 -188 146 -19 -126
5409 -126 -279 -79 -126 -49 263 -297 -12 19 -143 -3 47 151 -164 25 -66 213 130 28 74 -238 -143 167 13
5432 13 105 -63 -239 -49 -49 14 122 79 76 28 124 -50 154 34 -181 -146 -3 125 51 70 -52 187 -85 277
5456 277 -47 73 8 -313 43 -84 -11 215 73 -136 191 271 144 -209 -56 112 -161 271 321 83 -175
5477 -175 213 -11 10 -30 -221 32 36 205 39 144 -30 49 -158 36 -46 183 50 61 365 30 170 -118
5499 -118 50 -64 127 209 162 22 -228 -55 -68 -11 188 -157 61 -107 -112 -166 106 222 40 29 -57 27 49 -196
5523 -196 -130 123 -106 85 -16 39 -16 229 267 -79 -102 73 -103 26 108 -49 6 -24 68 -296 89 -89 94
5546 94 -64 -224 -143 164 -141 -129 297 108 145 86 194 -58 -111 -208 -95 69 -138 101 9 46 -100 -142 46
5569 46 51 72 20 138 15 -99 241 -6 99 152 -66 -108 -8 -57 -56 -62 -185 7 17 -148 67 169 -22 -136
5593 -136 99 -114 26 217 -91 -123 25 -55 -106 359 39 104 -23 192 54 -90 -164 26 124 83 -27 19 80
5616 80 -53 1 152 1 18 77 115 61 -203 124 260 185 -28 8 -160 -44 -75 -41 -35 116 -198 86 -146 -125
5640 -125 164 -25 -56 -102 -280 -67 421 -96 42 -71 105 -169 -70 37 27 214 -20 25 -178 7 149 94
5662 94 121 78 -101 -97 282 -14 -159 -42 -106 62 178 170 -47 217 -62 -42 -153 -67 -253 46 -44 68 103 -173
5686 -173 7 -38 198 -46 40 140 44 103 77 164 -57 174 -285 -13 -53 -69 246 -65 43 -44 -3 -80 -96 154
5710 154 -100 10 172 174 69 2 154 30 -161 22 76 -78 -230 10 -240 -58 -68 75 -68 64 -12 -7 190
5733 190 4 38 -167 114 61 139 76 108 -127 -96 12 -3 72 197 55 128 -33 303 254 -104 -23 -7 113 -256
5757 -256 12 -37 -346 118 183 270 46 79 65 -51 -125 129 -58 -149 76 -103 -224 51 101 61 66 -73 -133 -171
5781 -171 -8 -92 -1 37 139 29 -189 -89 66 -147 11 59 -362 97 -29 -232 162 1 206 171 29 23
5803 23 3 40 79 69 -200 37 223 -34 -245 131 -45 143 224 24 261 -267 15 -9 -83 20 71 112 -247
5826 -247 -10 -64 -51 -174 190 75 116 232 119 151 -83 -171 21 -126 178 36 -92 188 110 86 72 -7 -80
5849 -80 -38 -153 -1 86 -143 86 110 6 -229 -297 -97 94 99 -133 133 -135 136 18 -140 -83 -49 -238 -123
5872 -123 -47 188 -123 -171 154 -75 271 31 137 -75 -233 -52 -28 -225 -156 116 -31 35 -207 -80 231 -104
5894 -104 181 42 93 220 27 -139 -212 -1 81 -172 82 228 85 8 138 -30 118 44 -115 -60 117 -46
5916 -46 -157 -185 -29 -99 87 -58 84 201 34 281 -116 -57 -113 348 -110 -107 128 -18 -30 -59 -294 -54 30
5939 30 -99 240 10 181 137 225 -81 -286 -132 30 -150 -184 24 -33 87 189 -194 151 34 -16 173 148
5961 148 83 -181 -90 33 -53 33 -60 60 42 -79 -265 38 75 217 123 133 -29 51 275 -278 212 76 110 105
5985 105 114 -231 18 158 -46 -87 -77 35 -108 -59 -218 -238 15 121 92 101 -19 193 -102 3 114 -163 -110
6008 -110 246 152 -180 -171 -117 -20 67 -182 26 -182 -38 -221 -204 125 -6 73 178 -325 -24 -234 -149 47 127
6031 127 178 -30 -12 -134 -16 17 23 101 -120 75 131 148 32 196 30 88 -102 -141 51 133 131 -81 -63 291 108
6056 108 111 -42 70 42 -196 -242 27 -54 11 122 174 125 -106 -25 68 31 25 -396 -110 99 21 -69 87 -42 58
6081 58 274 19 107 139 149 31 -59 -58 134 -186 -204 -93 4 205 65 63 -184 -12 189 -37 51 -25 167 -174
6105 -174 29 -19 -93 -222 -118 6 -25 -21 238 154 -363 104 -60 -19 166 -120 147 -88 83 114 129 125 -56 -286
6129 -286 187 -186 -28 -234 -161 -61 -77 123 3 116 -115 108 120 -29 223 168 210 -30 157 -18 185 -29
6151 -29 -109 23 -18 -27 169 42 -67 11 -262 -147 29 7 446 431 -89 -145 116 -165 -23 -33 -66 -107 -219 11
6175 11 -44 272 -104 192 128 -13 255 -115 -257 -102 -35 15 -114 -325 -244 297 -182 272 -90 58 -30 43 107
6198 107 -9 -173 129 -167 60 47 128 -155 -233 120 -61 111 40 234 12 207 -120 189 154 -38 22 -152
6220 -152 -18 -236 176 106 4 223 66 61 -67 106 25 49 102 41 13 26 132 -55 169 225 197 4 -176 -71
6244 -71 -88 -132 100 200 -77 -66 -78 167 34 9 -14 -126 113 -89 -240 174 -85 -85 54 76 -63 -126 -101 13
6268 13 48 -53 208 -115 102 241 30 74 179 -108 134 -215 -38 -172 67 -181 120 -185 81 79 53 -206
6290 -206 60 41 -86 86 -145 173 -102 -50 -63 123 33 -69 83 111 36 -226 141 -41 70 -215 -194 -27
6312 -27 -42 -64 -156 127 -22 43 199 72 -17 219 -163 -97 -405 107 178 -71 -47 -86 -147 -123 95 41 -118 301
6336 301 -101 107 1 190 152 -153 52 166 12 -9 28 157 -93 -33 203 -123 77 131 -10 16 393 23
6358 23 189 216 37 156 -270 44 -185 145 66 38 -252 96 -39 290 101 -186 60 82 171 -2 -13 223
6380 223 140 162 -196 -167 -26 -54 45 -131 -66 -216 80 154 -14 100 -87 -161 36 38 -126 -24 173 50 -48 -105
6404 -105 -43 281 -51 -196 44 -196 79 -80 -98 202 49 -167 153 13 -51 84 -218 -355 133 262 -144
6425 -144 155 379 235 -42 117 73 -186 -61 131 67 46 25 50 -70 -36 85 158 142 -103 -209 -36 -14 -189
6448 -189 -137 -54 182 -184 -66 250 25 -214 241 72 263 12 106 -100 113 13 215 209 116 103 56 -3 28
6471 28 -336 114 141 -157 -79 -46 -93 40 95 69 22 -203 -67 -115 234 -17 135 -218 116 32 -53 156 67 69 -25
6496 -25 2 -28 129 144 121 -117 -80 -168 93 -37 -98 -156 -437 79 -116 65 -43 13 -20 111 115 250 -192 -24
6520 -24 59 -56 -8 62 -41 23 118 -7 53 19 42 -100 -76 -182 -26 -219 287 71 -26 112 -140 50 -41 -16
6544 -16 73 90 33 60 72 -25 -20 -55 194 -74 -287 130 -134 87 86 -171 -203 114 -279 -82 139 43 -133 61 192
6569 192 -53 -17 170 234 123 78 -223 4 -15 -127 129 102 65 48 -29 -156 -192 -130 -11 -389 -139 58 26 0
6593 0 65 -215 186 100 -88 114 -159 129 -100 -68 231 -15 -20 -60 231 -116 167 53 90 50 -96 -66 -29 192
6617 192 -63 -35 29 -178 23 -108 -48 -291 34 46 -160 -98 -239 13 166 79 56 128 -209 -16 13 229 352
6640 352 -11 -11 -29 -97 -67 75 157 -27 112 138 -188 164 -34 39 -103 104 -43 -2 128 -102 -65 20 92 188
6664 188 140 81 43 -275 92 73 149 -43 12 -9 287 174 -109 134 17 -48 100 124 12 -119 -84 -114 -73 90
6688 90 177 -62 218 74 127 63 129 -55 -178 44 17 -91 -283 3 -2 -39 -205 60 -104 -153 20 61 108 131
6712 131 137 -263 169 -224 -280 29 189 -206 82 133 111 296 -102 -73 10 -265 162 27 -267 -1 155 -156
6734 -156 -89 119 29 101 -138 -49 92 -62 81 57 -68 219 -67 203 34 -17 115 -80 74 -175 -54 -1
6756 -1 180 126 14 161 227 -80 305 -127 -32 115 -55 54 254 -25 65 -18 -147 87 18 -167 140 120 -74
6779 -74 -63 -160 82 -9 5 -87 -3 373 26 -141 92 127 15 -25 -156 57 74 6 -100 -217 -55 -234 -140 38
6803 38 126 -66 28 104 -22 -1 115 -25 59 87 -72 -50 -24 -6 -248 37 -176 -9 7 -28 -273 109 -7 94
6827 94 -21 74 219 207 -232 134 -231 -64 33 126 -20 -119 -86 -131 156 -32 -225 -35 -88 -4 -59 -77 -44 -27 -101
6852 -101 -48 53 -116 6 90 180 63 189 -62 102 -15 69 32 -82 -167 173 -14 -95 -176 41 -52 -86 -229
6875 -229 -164 306 46 44 186 -7 117 -41 102 -277 -23 46 73 -14 -352 -62 -97 68 35 -45 -145 -162 68
6898 68 -60 1 93 46 -328 -113 217 -67 73 -179 89 -33 -57 -32 60 26 471 -71 3 216 -175 -100 -169 95
6922 95 152 193 -83 83 223 -135 189 75 26 57 -139 11 150 -142 -86 155 129 223 -25 -3 -2 313 -89 -199
6946 -199 52 -187 35 -3 -102 178 -6 -74 -82 -152 7 20 -138 -159 -146 -69 -34 56 -59 87 -39 -265 61 -83
6970 -83 124 -162 -91 -83 -150 -10 -14 124 86 -91 -148 -10 -76 42 -81 73 -53 44 107 209 217 -45 -286 162 -91
6995 -91 -92 -154 82 -95 -64 -97 -57 132 151 80 -75 -54 -98 -221 108 43 -82 -186 -70 78 -17 143 -26 131
7019 131 -34 120 -115 -58 330 -1 -138 -175 -114 81 192 114 40 -81 120 441 45 154 -200 -14 -91 -154
7041 -154 -92 32 -100 41 207 -200 -159 -33 -92 41 68 200 -198 -111 -114 -9 135 168 -52 -164 5 42 222
7064 222 -113 -124 266 328 -145 31 89 -178 -57 108 52 -42 51 -85 87 219 85 -24 -80 -228 -47 185
7086 185 -104 -236 -225 143 274 -146 260 -200 137 -213 0 33 34 -76 -232 -2 158 -94 -53 14 -84 111
7108 111 -12 83 33 -21 -43 -198 -31 197 -65 199 -242 58 -134 -59 -177 101 5 -300 260 -458 -51 151
7130 151 68 78 150 -58 9 -186 154 2 125 134 106 -91 -226 -83 -179 117 -77 -49 -82 8 1 -203 151 -107
7154 -107 82 -92 10 142 -232 -34 69 96 -53 105 152 -29 101 -191 118 24 -37 411 28 118 -24 -53
7176 -53 -124 34 13 22 242 -24 110 97 26 -201 -22 17 113 -26 197 304 19 -148 -241 -43 -103 -138 132 -295
7200 -295 -54 -109 -213 -178 -46 -4 130 143 -276 104 -13 218 96 131 158 278 -216 -6 38 -143 237 193 60
7223 60 86 185 -31 -134 222 24 -175 108 -249 -47 179 -122 -86 262 60 -74 200 -16 22 144 -85 101
7245 101 -1 -34 52 79 -22 -94 -140 151 -82 179 59 -287 174 61 78 196 43 -215 50 16 81 164 25
7268 25 66 -160 -102 35 -261 85 82 195 -2 -46 323 130 21 -131 -65 -263 88 -42 -82 27 -86 -117 93
7291 93 87 55 -48 86 104 -24 -49 -49 250 113 -15 55 8 -74 66 -323 -116 116 -58 -48 -46 129 263 8 -11
7316 -11 -20 49 247 174 -41 150 23 -38 -37 20 -63 21 -13 -181 87 -80 21 -53 85 -25 -17 -106 31 -40 -122 158
7342 158 170 50 53 -3 -163 77 161 -25 -62 -127 -71 -107 -45 -53 -95 -92 -60 -116 -98 -90 154 -116 150 60 -102 141 194
7369 194 -29 57 57 33 118 38 1 -56 -70 -254 -72 76 -330 -196 -63 -95 11 42 209 -30 56 158 152 11 2
7394 2 179 -120 42 -143 104 78 -153 -96 -52 -92 -256 140 -157 -30 -24 111 -85 -126 4 38 48 42 -191 -126 222
7419 222 -19 119 73 50 -105 233 -19 -110 57 -8 140 -4 -187 23 -229 2 91 76 -76 146 82 218
7441 218 -103 -143 -214 -67 103 27 -114 40 -57 14 120 -14 133 21 -92 -173 -162 102 -140 165 124 103 95 143
7465 143 185 52 -32 80 7 -92 20 108 211 -71 130 -216 22 -327 186 169 -152 79 31 118 46 -113 -64
7488 -64 -174 -69 -44 -2 -27 76 17 -120 -81 100 61 -37 2 -10 56 223 -84 -149 123 5 89 151 -21 73 98
7513 98 -74 -5 -66 254 163 -17 -71 32 -148 318 -106 144 107 249 251 -8 56 -50 -38 -58 30 -84 -143 70
7537 70 -50 69 -13 -193 -46 141 21 -162 -56 31 148 80 249 119 291 73 -56 115 -60 -218 -200 19
7559 19 516 129 29 -157 -30 -127 112 73 -163 -286 -122 240 109 50 25 56 -253 -78 15 191 180 80 38
7582 38 -206 248 -11 -221 -68 96 198 23 -172 -199 -26 43 -327 159 230 32 -253 111 -34 243 -91
7603 -91 -100 195 -63 174 166 -146 34 33 81 -26 -20 -52 31 57 -124 -26 -156 113 -37 230 5 -27 5 275 -141
7628 -141 -47 27 -216 -179 186 16 58 193 -76 362 105 15 91 -169 70 -43 -127 162 -47 -106 244 -93 58
7651 58 147 -58 -54 4 -81 381 53 -317 -57 -127 -276 142 -326 -76 100 178 11 33 99 141 -188 -176 -147 196
7675 196 164 27 254 18 49 11 -16 9 214 -106 1 74 -200 105 114 185 -36 -134 -50 22 229 -61 194 -36
7699 -36 138 102 -69 3 -143 -22 118 112 -75 -17 112 25 -244 -49 38 118 -245 -46 98 -115 58 78 112 -11
7723 -11 18 -150 -181 79 261 2 106 52 130 35 107 33 -93 -129 96 82 294 36 -82 -45 -57 9 -164 8
7747 8 31 144 -202 240 42 103 60 -152 -189 167 -52 54 244 -115 196 -29 90 -121 55 -14 104 37 -29
7770 -29 -218 -197 109 -57 223 8 -54 132 -77 -36 -48 -151 259 -20 -80 113 -101 161 -219 62 3 -34 179
7793 179 129 216 -209 183 -73 97 338 97 -333 -73 -132 -24 -91 -111 228 -95 -19 261 198 23 13 -115 91
7816 91 -105 -256 -36 82 -11 -147 -75 -150 70 67 5 31 -101 191 9 213 -72 66 66 -33 -105 -99 403 19 -46
7841 -46 1 242 -22 100 200 -73 -12 -305 -42 95 -28 163 154 94 51 152 -220 -54 224 49 171 -113
7863 -113 24 -72 -136 -176 96 -79 -204 -84 -219 -104 205 85 -147 90 -158 203 89 42 183 39 50 -208
7885 -208 -117 -29 56 177 -127 -24 153 31 -9 -158 21 -29 -37 184 3 83 -11 -78 16 -182 11 54 -26 -117 -23
7910 -23 -137 -120 15 -181 261 -75 -53 83 -34 272 -51 -134 5 -274 -26 67 97 -21 -101 201 -20 -75 59
7933 59 41 -8 -71 49 -152 26 181 100 -235 -172 91 108 -146 -48 66 88 21 -122 -27 235 -90 35 -213 158
7957 158 329 69 215 -208 101 24 168 120 180 -5 156 -13 135 201 -86 87 -96 4 -73 124 73 -186
7979 -186 -248 -30 219 142 -37 79 -255 -105 -367 2 -163 62 -41 -17 38 10 -16 -89 -117 -90 60 154 -27
8002 -27 -140 -151 158 68 -17 -190 -356 131 -97 -10 7 -128 58 -94 84 -11 -126 144 156 81 237 93 -50
8025 -50 -50 -49 -36 -30 174 -106 246 57 -12 -137 19 -49 58 72 -177 59 -28 184 -142 113 -137 14 5 243 22
8050 22 15 168 62 -64 -61 7 62 55 -52 286 -171 314 -152 175 -62 -22 102 -32 382 -176 -87 -199 99 181
8074 181 -214 -80 -184 -213 -19 130 264 -143 15 -154 61 107 -10 -114 -217 -154 201 -18 -118 -110 -28 -22 -239
8097 -239 -188 -117 106 13 9 -140 -405 -149 -36 -166 -123 32 43 -33 -109 -154 -80 46 -132 22 -142 -133 111 -123
8121 -123 -153 -165 -43 77 -48 135 -23 -152 200 -98 8 286 104 21 157 -114 -113 -59 81 71 -63 -71 -78 -123
8145 -123 -188 23 7 300 -337 146 105 26 253 68 49 -76 186 -14 -78 50 -38 -131 -221 -111 24 132 -142
8168 -142 -117 -120 -54 132 4 -43 96 -73 -90 162 -174 -67 -5 21 -184 152 64 -267 47 158 -117 -40 102
8191A02
$$ Imaginary data points
##PAGE= N=2
##DATA TABLE= (X++(I..I)), XYDATA
0 0 0 0 0 0 0 0 0 0 0 0 0 -7 7 -7 7 -7 14 -14 14 -21 21 -28 35 -42 49 -56 63 -76 84 -98 112 -126 146 -163
34 -163 185 -209 235 -263 293 -328 364 -405 449 -497 550 -607 670 -739 813 -897 988 -1088
52 -1088 1199 -1325 1464 -1619 1799 -2003 2242 -2521 2859 -3274 3795 -4475 5403 -6755 8905
67 8905 -12876 22641 -101214 -59457 160170 10263 -92229 11363 82547 -35489 -46273
78 -46273 48187 37236 -60219 -17232 62672 13946 -67923 -17695 43365 9793 -27309 11085
90 11085 21001 -21848 -24788 25184 21201 -26394 -20869 29665 23608 -23088 -22715 15471 15149 -8033
104 -8033 -2168 10851 -6384 -16177 6728 15863 -9029 -15239 9573 15494 -7318 -12161 3343
117 3343 5030 -2540 3661 6602 -6492 -9579 6476 10500 -4069 -8059 3432 6248 -3241 -5245
131 -5245 14 894 -981 1651 2594 -2206 -4280 939 5300 2376 -2297 -2116 952 1174 -404 -1368
147 -1368 -1287 -754 977 2010 -453 -3118 -866 2914 1957 -1209 -1415 758 667 -466 -92 247 -737 -310
165 -310 1356 498 -1623 -1470 842 1190 447 -789 -407 -124 333 305 -172 -441 27 848 356 -511 -434 49
185 49 767 387 -167 -610 -243 25 389 267 -618 -378 -229 196 -27 -478 -231 291 477 -190 -315 -572 98
206 98 230 328 -425 -470 188 -35 -69 -46 147 -76 -67 188 -23 -29 -130 241 246 -129 -126 5 210 195 137 -165 -234 74
232 74 14 -10 45 -88 100 143 -32 -393 -19 167 8 50 -75 117 41 311 73 25 -26 158 340 6 -164
255 -164 -97 -43 113 130 5 -119 213 92 -32 -240 -32 -44 -119 31 -95 -210 -96 140 24 117 -55 -65 -45
278 -45 43 1 95 187 25 -116 274 -11 -10 54 -34 -282 -29 35 118 128 89 -267 -28 -5 -165 56 14 108 150 191
304 191 46 -223 -372 -293 -49 60 -134 244 -102 68 169 -102 64 75 -86 64 -231 -39 69 188 113
325 113 -200 225 -209 81 -125 127 -80 273 -26 -248 -78 -142 238 130 -93 108 74 -146 88 -107 -13
346 -13 -29 -64 146 75 -25 -65 -27 -131 90 -86 -53 43 178 -146 241 37 107 275 -18 -90 254 162 1 129
370 129 -81 22 62 54 -236 -90 -47 -65 72 130 -83 128 9 -109 111 -106 -23 -12 49 -63 91 30 -185 138
394 138 138 -15 -84 -5 47 142 -95 -19 -115 -3 -250 -81 51 -141 58 -36 116 -53 -126 -279 113 -281 -2 -152
418 -152 0 -64 -22 139 -30 11 -8 38 -26 -240 94 -101 28 136 -85 48 182 -186 -190 166 142 -263 107
441 107 32 -187 -67 -84 -111 2 331 -110 -321 -31 -150 80 101 -55 -78 129 73 -106 31 -104 -70 -82 110
464 110 83 -18 61 -76 171 48 -210 -112 44 -45 94 -159 150 192 -103 -12 -60 95 69 307 18 -125 -280
487 -280 -55 -304 0 143 -241 -88 340 -81 -237 -52 -16 21 63 103 -135 -41 -91 -63 -139 -27 27 303 102
510 102 -148 -235 41 21 -103 397 56 57 216 -117 -157 241 197 64 -68 135 -15 162 98 53 103 -314 128
533 128 30 -14 -118 45 109 24 62 -36 34 -59 -133 -20 14 -162 177 27 61 53 46 42 220 28 -78 -127 62 80 -181
560 -181 -215 -158 135 -216 76 -171 81 -266 94 86 -40 5 -122 6 -407 -73 -15 -83 -205 -12 -219 -15 -20
583 -20 -214 103 181 49 305 173 -154 -239 41 -147 -330 37 -130 -245 160 -56 -217 -121 90 -20 -176 106
605 106 -56 -135 -9 143 39 27 18 -330 60 99 -52 -71 23 -124 36 169 107 256 -98 41 -6 -154 232
628 232 -80 50 17 7 -41 141 -116 -73 -161 150 120 -20 60 80 160 171 7 110 -166 -137 -73 54 72 60 105
653 105 80 207 -199 91 -153 -4 -11 -56 -28 201 26 -170 -305 -95 27 -35 245 70 -198 93 149 -39 -128
676 -128 43 146 -33 -172 1 -49 -134 -37 16 2 -59 -168 -87 -95 -4 -159 80 219 192 75 -95 107 182 -141
700 -141 -179 222 -27 192 -45 -124 -131 149 55 -154 17 -48 -21 245 170 141 235 285 -184 -20 389 348 -23 -79 -203
725 -203 -41 53 45 341 219 87 63 230 92 -73 -36 -39 46 36 244 52 52 -182 -159 301 70 49 -141 -92 114
750 114 144 -265 55 -206 41 -81 222 164 -160 -41 -163 84 255 47 119 -48 -41 228 140 -1 199 -172
772 -172 135 376 -229 127 -70 -213 169 -13 272 14 45 -159 33 268 348 58 171 195 142 -41 -69 9
794 9 22 103 143 27 99 -65 -113 -67 95 -80 -50 124 -67 -14 -27 -100 -285 171 57 245 83 57 -217 140 198
819 198 149 62 -72 46 -164 249 179 7 -29 67 -241 119 -103 142 -83 0 177 -200 -137 -67 122 123 -72 97
843 97 140 -71 -57 167 -49 -145 -66 9 64 64 63 215 -68 90 281 130 16 -190 300 121 -190 -166 40 -79
867 -79 13 10 33 -30 -72 -202 68 265 -226 -63 62 47 134 -78 81 106 -214 -189 33 96 0 -161 131 39 -34
892 -34 393 -142 -32 42 52 -190 -29 -135 160 200 124 -90 254 132 -31 97 -10 51 33 -77 214 -79 28
915 28 300 -107 117 64 243 -235 158 -181 68 162 175 172 27 126 -67 -146 -107 76 -265 295 -165 -196 4 -31
939 -31 11 -48 188 -104 -11 -129 27 -47 -172 -168 68 143 19 9 -119 176 9 -94 71 40 -67 -99 125 -62
963 -62 -169 21 -40 -149 -113 -52 -171 -55 200 -124 40 233 308 78 -1 -159 42 43 134 -78 22 61 -110 178
987 178 44 70 -23 -42 -76 -5 25 164 -192 -73 -108 -34 162 -34 -166 -54 47 50 213 -9 2 179 -188 67
1011 67 37 127 1 15 153 -24 -6 55 181 -94 -200 -80 143 -71 -6 146 -231 99 -18 475 103 -77
1033 -77 37 -162 38 77 -28 41 -71 -112 -157 -34 -61 -14 74 -47 -220 196 132 -127 -67 -128 263 -44 139 62
1057 62 195 -66 168 -205 -2 -69 172 -14 11 119 24 -178 -125 219 110 196 -23 -128 -35 360 -25 -7 -91
1080 -91 -24 -25 -89 -131 -92 164 199 153 0 53 -107 92 -9 -184 94 -48 -55 26 411 42 97 35 171 -7 -122
1105 -122 45 5 -38 198 -54 -99 132 50 -236 -135 -88 -142 49 220 -104 210 0 -41 -50 320 6 107 -68
1128 -68 -52 -52 -261 54 -30 -82 -99 -255 -85 -153 6 -93 94 198 -87 -209 38 28 -88 -116 -120 82 -10 306 3
1153 3 52 194 -212 49 93 -114 188 -102 -5 63 -171 32 210 -131 -57 -120 -263 -238 9 -186 -50 -82 44
1176 44 139 41 -7 30 -237 81 111 118 -40 110 39 42 -108 58 -175 -46 220 -142 2 -165 -35 -51 54 -304
1200 -304 -65 143 35 -23 26 -112 101 122 -120 -85 -52 -126 142 62 -287 -64 -47 -71 96 76 80 -91 -107 -152 -89
1225 -89 106 47 -129 -177 51 -94 -150 -227 -146 18 -4 134 180 108 94 283 -138 55 -159 136 198 -39 12 64
1249 64 6 21 193 -28 -8 -159 -26 57 3 194 -43 -19 20 -220 21 -116 -179 -246 -115 315 56 -46 -120 76
1273 76 -59 -135 164 231 -24 -8 11 58 -86 31 156 166 171 14 -180 -21 49 42 -117 49 -191 -280 138 24
1297 24 -63 -21 63 40 121 -160 129 -62 136 -46 138 -75 -130 -70 -76 143 -83 -102 133 176 140 207 -68 88 -38
1322 -38 -186 -115 255 164 95 -170 -56 149 -128 112 265 -392 -82 -43 72 205 -21 -196 37 -5 -17 -38 -113
1345 -113 56 21 -2 -90 63 -264 225 -137 76 60 66 255 45 139 -209 -105 75 110 33 -155 -57 -47 74 -62
1369 -62 27 60 -18 209 -192 116 -22 -204 -181 -80 119 31 120 44 217 150 61 133 -144 53 -30 -176 155 -102
1393 -102 -135 98 -88 -190 -6 80 -100 96 -16 -62 229 384 285 -262 128 291 26 -230 43 0 -260 -125
1415 -125 -2 161 -360 131 -162 45 142 32 307 172 52 -264 23 110 -176 -158 131 319 -305 121 149
1436 149 82 -207 -286 241 90 -91 226 -131 75 -147 397 123 21 -35 -132 -58 -287 16 -296 126 41 165
1458 165 -284 86 43 -60 269 -21 109 -124 125 -98 122 -158 18 -83 109 2 -35 -146 179 -24 145
1479 145 47 -279 -117 -10 57 250 0 -1 -371 -284 -23 -262 113 35 -17 -86 -21 229 209 -23 117 -82 -79 -120
1503 -120 99 69 -87 188 -29 -192 -85 -49 -119 42 -53 100 13 -49 347 25 -133 -45 -202 119 161 -19 21
1526 21 79 202 132 25 -109 -89 87 -112 -174 144 -20 -111 100 -80 44 -197 -198 26 115 155 -174 198 -176
1549 -176 -69 251 147 346 5 -16 24 32 -7 -225 34 310 -83 61 70 156 1 152 -77 92 40 -145 65
1572 65 -110 141 164 45 -10 -269 -41 -99 -200 -101 -3 0 -81 -177 -122 -111 91 -71 41 100 125 -35 59 144 207 -87
1598 -87 187 184 -143 87 -207 -67 62 -89 116 -201 -34 -136 10 29 -72 96 -161 103 51 -93 -220 55
1620 55 -100 81 -185 -188 131 -161 -186 -33 -8 -93 -178 46 -62 63 -91 -70 19 -28 -91 -30 156 180 -134 106
1644 106 70 18 -59 26 155 -172 77 -9 -83 -259 -35 -73 -235 11 -233 -7 -340 -47 184 147 310 194 -92
1667 -92 -345 -41 86 -117 -141 215 311 -107 232 78 -156 -37 121 119 186 152 108 115 128 126 38 226 102 7 -18
1692 -18 -100 119 -11 209 23 209 119 69 -149 -22 169 64 146 -286 320 -35 -10 189 -213 64 -172 -58
1714 -58 38 -70 112 -110 -90 27 197 -95 -127 181 -15 -140 151 18 -233 25 -112 207 -68 78 119 -151
1736 -151 -36 116 160 -54 -9 -130 124 -16 -2 59 -56 -110 2 80 -73 15 123 -134 138 -86 143 -366
1758 -366 43 91 -222 60 -264 -72 54 -200 50 -167 60 45 180 146 -188 -155 -276 7 -50 28 -159 -88
1780 -88 -73 -161 325 -11 -25 29 -76 -13 104 -110 159 -147 182 220 110 -70 62 -38 156 -24 173 164 71
1803 71 127 -42 -86 -62 34 -202 70 -27 -108 -80 146 193 -16 72 42 144 -87 -59 151 50 -126 62 -42 20
1827 20 -93 -289 22 -14 -217 -49 224 154 49 79 -158 43 62 -32 -74 23 23 -61 185 43 228 -21 -120 -24
1851 -24 -86 128 105 -127 -72 46 -173 63 93 -51 176 74 -134 472 -22 110 -367 99 54 -148 84 84 11
1874 11 -114 -137 74 55 -40 -149 324 -309 -93 29 -270 19 88 -145 154 -13 23 -106 63 -116 -8 177
1896 177 61 200 -24 34 -145 249 -104 193 -16 -19 -170 -266 60 -32 -82 49 -109 -166 -123 66 -74 -91 146
1919 146 36 -31 -83 110 119 269 40 -11 -216 51 266 -24 262 226 -34 -175 130 -100 -272 -22 257 -16
1941 -16 -42 114 -2 37 -101 -249 -171 -178 -131 -63 36 12 18 50 40 252 -132 240 -199 212 211 -81 -133 -171 48 -126
1967 -126 -43 -186 -147 79 158 87 -162 -139 119 -4 -42 -80 82 61 -200 -163 -65 47 207 14 -137 -159 77 222
1991 222 -100 16 -113 125 153 -42 74 72 -46 -93 183 139 31 267 164 61 0 -15 34 95 376 -85 -116
2014 -116 -180 227 163 127 -152 -171 136 219 -169 -251 -19 32 137 -153 310 166 3 89 -96 31 -68 48 -17
2037 -17 -150 -88 138 107 61 67 141 134 90 -261 43 80 330 291 283 -33 -118 65 58 96 17 99 -100 124 90 -52 187
2064 187 59 -74 -106 114 108 -68 79 28 -251 42 -9 -24 51 205 -38 85 43 -95 -2 -195 48 -48 27 -45
2088 -45 -110 36 -213 -92 -140 36 -74 27 -114 -16 1 -272 -79 333 151 100 235 -150 -51 -65 156 20 54
2111 54 192 97 179 -44 10 20 -212 120 -47 -150 -198 80 35 -44 -16 -239 -169 121 -164 -40 19 136 266 76
2135 76 -71 194 200 287 -29 -191 146 -177 -166 -307 199 -118 57 -126 -380 178 47 105 176 -37 -142 -109 -96
2158 -96 16 -62 -251 64 -54 -89 176 -1 346 -98 392 56 -4 66 -84 -23 -109 265 106 83 160 -22 164
2181 164 29 -139 24 44 -21 107 128 -149 -100 30 202 -261 27 85 -121 4 -334 81 209 232 54 -20
2203 -20 5 -27 114 -198 128 -58 46 -124 175 -230 124 232 -166 -53 23 178 -8 148 6 168 -266
2224 -266 -142 13 5 -114 110 264 -130 -51 51 85 -36 31 -148 78 156 -239 202 -26 309 -76 119 -117
2246 -117 -196 -86 128 -8 317 -191 -12 -320 122 -249 131 85 107 -140 138 -280 7 35 74 -64 -229 -203
2268 -203 34 134 31 -87 -47 -301 59 -208 76 -222 57 75 -379 -71 -270 189 -257 101 205 -41 52
2289 52 172 54 -141 -65 179 -57 -306 -64 153 184 -265 90 275 -294 -166 156 45 201 73 155 -85
2310 -85 53 259 87 12 -65 37 23 134 53 62 -278 108 -60 -13 -86 -56 -68 -116 26 -100 -137 -106 139 -92 28
2335 28 87 -52 16 -50 -55 -46 188 148 -168 -145 63 -243 -190 249 165 -85 -69 64 -258 -18 241 -36 -142 -56 -105
2360 -105 109 -25 -73 14 341 15 -90 -38 46 -25 -42 107 -115 138 -404 -124 -212 -152 92 -34 83 4 -45
2383 -45 96 13 -149 90 -199 -141 114 -34 -130 -5 83 122 138 -25 1 47 -65 158 71 16 150 118 -64 -60 214
2408 214 182 -182 -288 16 158 -23 92 114 -121 -214 -72 -75 74 54 32 192 111 -249 -41 -148 38 -96 162
2431 162 -109 -221 191 -123 60 142 -150 192 125 46 184 -88 -77 -172 227 72 139 37 76 57 86 107 47 -89
2455 -89 65 417 -68 135 -284 -223 172 -21 -40 -89 55 131 -64 -58 -4 163 -31 -32 171 -101 -1 -68 220 -84
2479 -84 -55 118 -187 -252 -46 9 -272 -91 144 -101 214 -72 -129 23 -34 87 -65 93 -32 -53 -78 160 5
2502 5 291 90 -191 -69 -91 -14 119 -81 142 -123 -31 198 -103 -192 274 266 94 -131 -273 -50 -152 -15 -99
2525 -99 -189 1 -61 140 -131 130 -85 -96 165 125 169 -81 86 193 -125 -39 68 -190 9 20 26 -190 -58
2548 -58 -280 -223 10 -75 168 -135 -233 -139 25 24 0 -154 -249 259 -47 -270 -121 44 59 60 144 269 -147 -49 -119
2573 -119 -29 -276 -187 129 -383 -122 104 34 -87 -38 -27 116 124 -71 -61 -251 -124 -22 -164 -78 228 -117 42
2596 42 -162 -160 28 25 -213 -46 29 135 -71 47 24 -47 105 -126 111 63 -8 -142 63 -3 52 74 -141 -281
2620 -281 131 105 193 32 134 -84 125 -40 -74 225 116 105 -64 212 149 -11 -152 248 158 -167 -330 -56
2642 -56 -361 27 226 59 -84 -150 234 -112 207 27 54 -404 290 88 121 94 61 -45 -141 -103 -78 83 62
2665 62 286 116 -133 -145 341 257 -46 -15 -189 -156 -103 -133 85 -89 27 6 -302 73 -133 -229 116 -416 -271
2688 -271 43 -193 -61 61 31 -10 100 -148 -227 -143 -66 -225 33 -16 96 62 -48 -233 -146 -70 -42 228 17
2711 17 -30 -64 -80 -165 79 -236 -44 49 246 13 -35 81 186 -93 -85 132 127 29 -18 142 19 -20 187 63 0
2736 0 -56 -113 88 -102 -36 256 11 30 -183 -92 149 -12 -202 -58 -40 -353 -110 -87 228 -61 143 -22 -154
2759 -154 21 276 264 129 -10 -159 91 49 -181 -168 124 215 116 -4 -109 -142 -53 -122 76 50 -1 -33 62 -239
2783 -239 8 -124 -17 -23 58 -45 206 224 352 -207 45 7 -75 -62 161 40 -39 74 89 102 -45 35 -210 -78
2807 -78 58 254 -183 20 -119 10 76 26 -27 -169 250 -113 -77 -20 -11 229 75 -151 124 -4 83 228 -143
2830 -143 -66 78 144 116 14 72 88 52 -208 -52 1 256 -104 -48 48 -83 0 -83 -78 36 -63 -122 -10 46 208
2855 208 -43 -129 282 -6 181 -138 -17 -42 -15 -112 134 -102 -98 -15 -54 -211 126 85 115 282 -100 9 -59 -30
2879 -30 43 -222 -86 263 -147 9 7 -172 25 362 -138 -53 -36 -102 -8 34 179 135 128 48 187 -110 183 51
2903 51 -285 124 68 25 -113 78 101 -37 -298 30 -69 -14 -66 -176 33 84 -100 106 -82 18 -196 -238 14
2926 14 102 -104 -168 -96 -231 191 -8 90 88 110 -76 -231 -208 96 -84 59 63 100 -159 -77 -117 -254 32 277 19
2951 19 -107 -193 -71 83 50 139 -2 176 -62 -92 -91 9 62 27 -56 -37 19 283 55 -133 -486 -152 248 -115
2975 -115 103 -65 5 -229 -23 78 -172 -283 -218 -31 11 48 64 128 -36 207 -149 109 -160 -136 41 211
2997 211 167 78 160 -86 -62 75 -72 69 186 27 -453 62 36 -6 147 -170 186 -106 -154 -130 -246 -164 344
3020 344 -246 -34 131 -89 -221 47 -269 83 235 -306 69 62 87 -46 -67 209 128 -87 239 117 -153 106
3042 106 29 233 99 -38 43 -182 194 74 194 213 49 92 -239 -11 306 -5 -98 -38 -55 -154 -119 -37 59 161
3066 161 156 -172 35 -98 115 -177 176 -313 138 156 10 -97 3 28 139 194 -39 19 88 -203 151 0
3088 0 60 28 41 -215 36 -83 -229 -89 -253 -75 -160 -109 -114 424 -335 20 39 -183 -35 -36 79 194 -147 44
3112 44 74 128 8 96 173 147 8 -50 14 -4 -90 -99 178 175 -170 176 188 -123 160 -46 -3 45 -70 17 20 -254 115
3139 115 80 67 -78 80 17 -3 -14 99 79 32 -34 -19 54 -151 -6 -61 -11 -27 88 -59 66 -6 -87 -30 -196
3164 -196 10 -107 -151 -89 -235 0 121 42 -281 8 -94 -64 115 65 94 -69 106 -168 71 103 9 219 157
3187 157 97 317 236 108 -139 143 12 139 107 -44 55 -210 159 148 -53 -146 210 194 12 35 88 -218 -32
3210 -32 50 -141 38 4 161 -57 -181 68 144 120 -55 166 3 30 -181 -22 -154 -45 -42 150 196 -374 -79
3233 -79 -28 -20 100 84 58 78 -80 99 66 185 14 -117 -102 121 -36 -156 37 -97 118 -81 98 107 -4 -235
3257 -235 -54 -28 -73 52 -116 10 -76 293 -81 175 225 16 -209 -59 -37 19 -5 4 2 -41 176 -250 -117 -294
3281 -294 24 -99 34 -145 80 -189 142 21 -140 9 151 -179 -178 57 -21 -48 -126 242 -112 -4 -70 -33
3303 -33 -141 366 -93 -40 82 -62 -66 -133 -148 -212 71 -136 -132 24 -229 90 231 -277 -246 62 -42 403 -73
3326 -73 -126 71 -132 -19 -200 -49 335 -101 134 217 -236 -141 87 -9 304 -236 -133 533 52 116 90 -183
3348 -183 63 -103 -97 -44 85 -112 163 -198 46 -221 249 -3 22 -84 -250 150 225 140 105 -173 176 80 -99
3371 -99 -19 66 71 187 31 13 323 -84 -220 173 94 -154 -8 179 113 -41 -159 -25 77 246 -160 -60 -91
3394 -91 -24 25 -218 -71 -100 37 -221 73 326 12 111 -119 112 -87 -17 -157 4 105 -72 71 35 105 68
3417 68 -238 -150 -89 175 244 -99 -209 36 -40 -247 42 -83 -322 -174 14 -43 -97 -34 -56 39 254 40 57 -80
3441 -80 -209 -193 179 97 -44 -74 139 -95 -66 107 -43 -229 52 147 14 122 92 -74 -371 259 19 -68 125
3464 125 98 -99 -100 238 -77 -148 189 370 -67 -30 -131 -28 -146 253 -8 -32 -90 88 124 -120 -201 -138 68
3487 68 93 50 -26 -128 136 25 -82 -145 -135 -74 361 180 118 172 59 -130 15 43 145 -323 16 93 7 -39
3511 -39 31 78 -7 -136 39 139 -128 76 167 -214 -207 49 136 20 202 -130 42 -70 13 18 5 -88 109 -59
3535 -59 -81 6 -37 73 -81 130 114 -150 -158 113 3 -87 -76 -142 265 243 -283 206 -62 111 117 69 -33 46 -183
3560 -183 -5 -206 72 -57 -178 -481 103 136 -98 182 54 -37 33 50 -57 -23 0 11 -24 -93 -43 138 -43
3583 -43 -32 -73 -19 -79 207 -89 159 206 81 80 101 -226 10 -41 178 112 -150 138 217 -45 171 -295 -30 -81
3607 -81 -55 -157 -169 138 -83 5 143 -273 163 195 24 216 -150 69 201 85 62 -50 -15 89 -4 75 -87
3630 -87 -60 -232 216 -78 -102 52 68 -171 197 115 188 144 144 175 -100 -68 -50 104 -17 209 102 1 -1 -71 -10
3655 -10 144 38 -371 -271 170 -236 -100 58 -179 194 150 31 67 186 33 -137 209 73 -112 -54 52
3676 52 -4 -91 111 -114 -196 83 -13 -121 94 142 14 67 267 -17 24 93 319 -98 -35 85 -256 4 -131
3699 -131 -27 251 -123 -156 22 22 -130 88 239 -63 40 72 114 -246 40 63 120 174 -49 -34 -10 -138 61
3722 61 223 -209 254 31 -27 -31 -169 -297 -41 -229 -219 112 -81 -35 -177 211 18 28 -51 140 2 -10 -28
3745 -28 289 -304 79 215 171 41 -122 223 -93 67 -129 193 -260 -88 -98 -52 -64 88 -42 73 271 24
3767 24 173 -50 51 91 206 -104 122 114 -68 162 53 164 24 -59 -216 -169 151 -29 104 -27 137 -132
3789 -132 195 14 90 23 332 68 74 -170 206 -28 -299 196 -149 106 -175 -32 -38 -43 67 220 -104 79 -36
3812 -36 125 13 -84 -29 -46 40 -109 77 84 82 173 -10 23 117 53 -114 -19 -107 -106 57 40 -85 -143 33 -128 50
3838 50 -308 -114 48 -102 184 98 125 -10 73 16 115 -87 54 -184 126 8 -15 -168 -251 135 -105 -39 231
3861 231 -69 71 -118 10 190 -228 -162 111 -7 52 352 -221 254 -7 34 -168 -13 -271 -170 90 -14
3882 -14 -92 181 24 -46 -31 -211 369 -210 174 37 59 108 49 33 -75 -152 -214 -170 170 146 183 105 -97 -98 121
3907 121 125 -206 123 -108 80 109 -88 -186 138 62 -67 -106 -157 106 55 308 28 -65 -36 -352 -208 -54 -62 174
3931 174 114 74 -144 -10 -145 59 23 -183 -173 -167 -52 84 28 53 -126 19 130 -61 -62 -279 -8 -347 27
3954 27 6 -199 103 310 -118 133 30 -116 -147 -36 176 -14 -12 -122 59 101 27 234 25 -205 61 110 -53
3977 -53 25 -116 -225 41 -42 -93 -91 -114 112 146 151 -188 51 -20 79 -11 -215 -66 95 -140 52 45 255 -86 -59
4002 -59 -169 -258 234 -178 -26 18 119 270 -271 -84 -201 300 57 34 139 1 111 188 -178 250 95 270
4024 270 -96 -69 -53 92 260 -263 -17 145 -98 -292 66 -186 -147 84 68 -155 -10 31 83 -144 107 23
4046 23 -297 -83 37 222 -23 15 99 153 176 -70 -73 -55 32 150 21 -90 249 21 -74 138 138 -298 24 109
4070 109 176 225 94 -73 -144 -154 -9 -91 85 -343 103 -43 -58 11 -29 205 -207 4 -150 -174 98 35 -229
4093 -229 173 -120 -24 -118 -225 -8 129 8 14 -184 -93 -288 -108 -134 -276 66 142 271 48 211 -88 16
4115 16 -70 153 -78 20 72 -123 -109 -41 -68 5 128 82 84 14 18 241 206 104 1 -4 246 -57 20 126 -42 -91
4141 -91 31 26 79 85 -183 -109 168 -19 176 157 -95 26 -25 172 86 -191 104 -137 76 22 86 -197 16 -28
4165 -28 -280 217 -79 -161 174 44 163 37 94 -187 67 -127 -242 -59 -76 -31 -78 -76 -167 -46 -114 -56 172 56
4189 56 65 -10 224 -93 151 -50 -24 -80 88 -7 85 -9 8 51 177 -144 -176 96 -31 47 -27 -78 -55 -66 90 -157
4215 -157 -70 54 -57 153 -226 -72 -1 50 -285 155 108 67 121 -101 -115 187 177 275 173 42 15 -232 -59
4238 -59 147 -288 -16 -43 184 -109 -45 -96 -208 -23 47 -106 -62 -128 149 -98 -110 -94 81 6 -13 -73 161 -184
4262 -184 -122 84 -58 57 129 6 -154 -24 -25 183 132 146 4 102 -199 61 -64 -246 -162 -379 94 84 144
4285 144 -165 302 124 38 38 -59 174 176 -112 161 106 295 232 137 -6 -130 -86 176 170 -53 111 42 164 203 0
4310 0 -11 78 -39 -38 5 -35 -281 48 -54 -226 -247 -225 -168 -57 -91 -24 123 206 428 -68 -43 122 63 171 -53
4335 -53 -36 -276 50 250 -15 -16 -26 -213 -105 287 -64 20 -10 190 -162 99 74 -162 -47 -39 68 69 -166 -30
4359 -30 248 258 -91 -188 -189 -95 34 -18 170 -208 -40 43 53 52 142 389 178 47 -9 5 60 -32 -179 -134 -104 -25
4385 -25 13 -10 82 203 134 -84 82 100 287 11 -42 -69 -126 -21 -270 -49 66 -164 -270 -56 -151 -177 147 -183
4409 -183 145 166 -93 33 -228 -166 -409 148 -38 -111 -262 -33 -253 228 -102 224 193 5 -154 214 241 318
4431 318 -207 36 33 109 -157 331 -100 -319 -415 96 152 -82 63 44 -68 -41 -157 141 11 11 -143 115 33
4454 33 90 -80 23 -255 -54 78 139 114 5 86 26 75 -225 108 -164 -50 57 -253 -210 107 104 401 157
4477 157 264 91 -191 -98 55 308 -319 55 -79 -75 -15 -126 72 88 -52 -182 -100 62 106 -71 221 132 -23
4500 -23 -102 63 -81 80 -134 170 13 5 -220 -210 -154 74 137 302 196 73 113 -103 79 -103 -179 -119 -414
4523 -414 -30 125 153 38 -248 -120 -80 -65 291 233 -57 -147 67 -156 2 29 -367 -14 125 9 -19 -264
4545 -264 31 -2 -212 -52 40 18 258 17 63 77 -159 -240 160 211 -227 -193 97 53 -82 -65 -97 20 145 24
4569 24 35 -12 -153 261 -59 -30 165 -78 136 -70 -53 -20 -212 -259 12 -57 -41 -69 98 29 144 115 157 -236
4593 -236 -131 186 55 141 -48 -39 133 -6 -217 -107 59 70 119 -148 -114 -117 -197 -255 -94 90 107 -178 7 34
4617 34 -1 245 -83 166 -77 21 17 64 -116 -149 -189 288 72 17 -141 19 -232 225 -270 235 -81 -155 121
4640 121 -198 84 129 229 78 -297 133 -94 35 128 158 311 32 -33 -26 -64 236 112 -4 -179 -72 -113 -49
4663 -49 160 119 100 -9 14 160 -14 -149 124 45 86 104 54 95 25 67 111 242 127 -36 125 -48 73 -120
4687 -120 51 177 9 63 136 1 145 -104 18 -231 -2 -60 183 73 -88 216 -116 18 233 242 -170 118
4709 118 -57 84 -218 -158 25 26 -113 -6 57 75 -29 20 -52 -57 18 71 122 106 338 -139 -1 249 72 -117
4733 -117 -90 -25 172 -162 45 -159 228 -210 -45 149 34 176 -149 -290 83 203 237 -113 -148 256 245 70
4755 70 -138 35 -117 102 -146 -124 -58 -39 0 -183 170 -18 -122 -35 -294 148 -96 3 -44 -15 -22 168 143 -343
4779 -343 -57 -109 -153 319 -6 -95 128 -312 -253 49 22 10 -11 -279 89 -78 116 -218 71 -120 50 287
4801 287 108 370 70 -105 -111 -126 72 142 169 -139 -43 -37 4 53 -158 -177 -7 149 77 268 84 37 -94 172
4825 172 59 -8 -52 107 59 236 228 -56 75 -126 376 261 17 112 162 126 158 -72 -37 1 -148 65 -57 -52
4849 -52 72 11 -1 -45 211 -162 -145 103 3 -10 -156 142 172 -230 -182 7 -183 276 -171 -77 15 -185 -284 57
4873 57 -13 -109 42 129 10 31 -60 -77 -75 290 -175 -79 118 123 -192 77 241 -97 10 79 15 -56 79 -66 -155
4898 -155 90 -232 126 11 -154 113 127 -27 -397 -77 117 -223 -163 -89 10 -218 -184 -85 -251 177 -13 -115
4920 -115 261 119 -243 -263 -188 -166 114 -10 0 -12 69 19 -164 -64 -181 -192 55 213 243 -13 30 274 -32
4943 -32 89 61 -97 -93 14 190 79 -88 -104 -17 70 -114 209 -61 -221 91 -5 -163 60 52 119 -9 -96 -46
4967 -46 -150 -38 -45 168 -224 -123 -171 -23 352 -32 19 -213 85 -15 -187 26 123 -253 -256 -24 -89 141 261
4990 261 -8 119 -180 12 -237 -102 -25 -156 138 -130 -38 74 -234 -140 140 129 -268 269 -97 55 162
5011 162 147 179 49 -33 -29 53 -233 -293 177 126 -277 -129 -92 161 -168 -12 -31 121 -164 -52 0 135 205 -43
5035 -43 -149 189 -7 -220 10 209 56 82 32 37 -27 -81 72 18 -16 -236 106 168 23 -60 30 38 150 -53 61
5060 61 -49 -129 -75 -180 135 -121 -6 207 -75 140 2 102 47 24 -14 -12 60 108 40 -230 -44 -15 261 213
5084 213 168 120 -232 -16 -137 206 159 175 -61 -78 -40 -95 238 6 -59 60 -195 -21 -38 64 10 -283 -58
5107 -58 -56 77 -70 -58 153 -158 133 113 -72 -46 -40 265 113 -164 9 109 -84 -66 -247 -107 268 -1 -25
5130 -25 -12 -57 147 -152 107 158 -49 26 -189 -73 -215 -33 64 231 100 157 -78 119 -48 -251 -107 -31 -39
5153 -39 34 -144 173 16 144 112 114 74 -438 -87 199 106 -3 77 -25 251 53 199 147 -204 -8 -50 17 -20
5177 -20 93 1 98 158 -280 280 94 54 219 108 -28 -78 -136 133 -16 -164 -30 213 -112 222 -74 -49 -101
5200 -101 -158 -33 164 103 -79 -83 152 33 -82 189 175 140 96 -108 -124 -183 61 32 -28 99 -155 294 -64 374
5224 374 -219 175 203 48 157 1 74 45 17 94 -42 126 -64 -267 87 0 4 106 -1 3 -110 -146 -148 -216 33
5249 33 89 186 -16 37 -201 5 -58 8 40 -96 70 -80 1 -82 113 24 -36 -130 20 156 -104 -69 121 0
5273 0 149 93 158 71 -105 -88 -150 334 -132 214 82 -177 -175 -31 39 -244 -19 -263 22 162 -38 -94 -227 -76
5297 -76 -150 -78 70 -303 -132 158 223 112 -291 123 -420 24 -17 -42 66 82 -94 77 112 58 -98 2 -462
5320 -462 -74 -7 84 -65 -145 71 -138 13 40 243 -171 285 -242 -151 82 -103 39 -19 -12 -227 -213 -115 89
5343 89 45 -128 236 143 -61 26 65 -180 99 -94 -179 245 -51 -38 -155 -230 -319 38 -18 207 54 1 -13 54
5367 54 -69 110 -8 129 -51 121 282 108 -74 -28 198 211 186 -148 -67 6 80 11 -164 28 60 -247 317
5390 317 132 -206 -31 -44 152 13 153 13 124 108 76 5 196 39 4 106 68 149 -165 43 -68 -95 47
5413 47 -298 -148 -23 -47 -151 -18 287 19 42 176 -160 183 -182 -133 26 -41 53 201 144 143 -64 212 80
5436 80 107 95 121 248 -205 -58 -254 -170 145 -177 44 303 -149 -25 71 280 34 -28 128 268 15 -208
5458 -208 -104 -133 1 99 98 304 280 29 0 113 21 -47 -109 -203 217 -126 -182 58 25 -1 -182 172 149 -343 -46
5483 -46 87 310 -34 67 -58 176 -190 232 316 -164 63 -181 154 -86 -58 221 -38 18 -222 -32 1 -286
5505 -286 -61 10 69 -69 120 -159 76 11 -31 -130 226 -18 52 63 233 159 -129 252 8 137 -102 -125 -20
5528 -20 -13 -88 -366 -29 -84 156 43 -360 -32 -86 94 -77 19 -6 -98 -30 -6 -36 40 -216 -242 -36 -84 134 74
5553 74 6 -139 -150 190 42 -32 -218 33 74 -86 70 235 34 -1 -108 -70 79 56 -107 -83 -246 84 -180
5576 -180 -260 94 38 -74 138 2 -129 -123 124 6 -60 -69 -202 142 91 281 -102 77 11 30 -47 86 124 111
5600 111 -42 -64 61 -64 -163 -182 -90 155 127 -90 47 370 120 -104 -240 23 21 24 74 -96 5 -49 77 116
5624 116 -179 167 -292 196 276 38 -77 -90 -145 -177 87 -164 102 -117 -141 -124 -352 -17 43 -298 128 -184
5646 -184 22 176 80 -200 23 -117 285 36 95 263 6 -49 -40 95 -3 330 140 6 238 202 30 120 230
5669 230 16 -116 173 -73 101 -166 -151 239 -14 157 -114 -70 -31 -117 -71 147 102 -157 238 -50 -269 54
5691 54 332 -164 56 -181 51 16 -110 -99 99 -62 317 140 53 129 -195 -19 -40 145 -75 -26 115 -98
5713 -98 7 16 -157 -220 -2 -71 38 231 265 -102 129 56 183 -49 312 148 -145 77 212 -52 130 -100
5735 -100 -218 200 -189 -164 93 107 0 -147 250 104 -129 -145 -194 242 115 111 -9 65 -242 240 -17 25 -30
5758 -30 62 -49 94 0 6 34 -184 117 143 95 -88 4 162 356 -45 -47 -166 189 -245 -9 92 43 14 281
5782 281 -123 45 -73 59 -174 5 148 29 -63 -330 182 -67 -173 127 279 -325 81 104 169 -5 -119
5803 -119 -16 62 -88 142 47 -23 106 104 -321 249 119 119 -90 34 -69 192 88 253 -220 -14 213 -189
5825 -189 -71 141 -126 -264 -51 132 217 -76 134 91 104 -23 -35 -47 -109 -152 -57 121 -42 43 -37 -91 -262 -91
5849 -91 137 13 47 -86 -128 -1 55 23 -295 -73 -30 -177 217 -61 -31 60 -54 -72 -274 -33 7 151 61 94
5873 94 55 -22 -44 127 144 -46 159 -242 -40 164 -100 208 -314 155 104 279 58 -93 72 -193 -75 45
5895 45 79 72 279 72 -28 -281 -225 307 -118 -29 -39 -51 -219 -55 -24 39 -62 -11 259 94 65 -95 -122 358
5919 358 -163 -74 136 37 -44 137 -87 -55 228 -118 216 109 -41 145 -49 100 65 -170 85 222 312 38
5941 38 33 41 56 -119 -153 -3 133 70 69 -157 -102 10 156 -59 -225 -200 -170 -47 79 -281 -164 73 -7 196 -47
5966 -47 121 -84 133 -37 -349 -30 -113 -6 -292 179 72 21 68 -65 217 32 128 -32 198 199 -126 -25
5988 -25 -193 -90 -160 -263 25 -244 -16 55 -66 -26 46 148 -43 114 -290 -154 -258 -103 -187 42 -45 157
6010 157 -143 -81 180 -82 -99 -66 6 -166 141 186 206 106 -63 -316 -21 -10 -58 51 -305 104 -115 -79 80
6033 80 -164 62 -116 -50 -27 -100 10 97 -122 170 42 319 0 -33 1 -209 27 -104 -110 113 91 67 -220 -117
6057 -117 -8 -11 -317 -299 186 -101 -56 45 92 -41 38 13 24 -319 -65 -93 -85 -54 -32 -36 -54 -43 143 -125 177 0
6083 0 128 148 126 181 85 60 92 -181 -37 -112 106 -101 56 285 -32 -297 -99 33 -172 62 1 191 -47
6106 -47 -30 100 109 -154 34 -135 230 -136 46 -206 -143 118 112 -189 131 -151 -11 127 42 -21 -16 83 -142 187
6130 187 -242 -35 -184 91 -101 170 47 -27 -87 -272 293 -23 76 109 -44 -204 -105 150 -135 62 55 -65
6152 -65 182 171 -167 -119 144 -255 77 -65 -124 81 220 143 -106 -232 -24 -32 -146 -130 65 -11 -172 127 -3
6175 -3 -83 -39 51 -101 110 -23 -52 -27 -137 135 239 250 -71 148 100 -75 206 -92 -86 -24 -16 99 156 173 -43
6200 -43 -23 213 -159 -14 99 -128 71 83 208 -73 -163 -163 -122 192 275 -106 -158 10 -46 -27 -56 192 235 -79
6224 -79 -352 -3 -137 -35 5 249 -383 74 138 179 44 -223 8 -40 -387 -262 -33 15 -229 69 109 14 -274
6247 -274 -185 12 -36 -88 102 6 2 421 24 -132 45 -55 -235 -26 189 -174 17 220 75 -63 -28 -229
6269 -229 101 157 -107 -105 197 24 82 62 -138 -60 299 -105 58 139 -119 95 -92 17 -200 -27 -216 -106
6291 -106 -306 -66 147 -6 16 -54 -35 -177 -10 -67 -65 -52 -210 -3 -262 121 -77 129 -192 -244 63 -20 2
6314 2 -112 -150 4 185 61 -22 0 -41 -261 95 19 -42 -308 -332 159 -56 195 -85 44 -155 14 -147 142
6337 142 -196 39 72 23 148 68 88 151 167 214 -140 -63 22 -92 -268 -39 288 32 176 43 -57 50 180
6360 180 -25 -148 -227 -98 141 -207 91 37 -366 13 61 -2 -245 -149 -79 49 171 193 -131 44 -149 -21
6382 -21 37 -49 -28 -21 -75 101 -146 129 42 -210 12 -60 -244 -72 -123 101 39 -11 79 -107 113 -7 36 26 163
6407 163 155 150 -14 -13 40 -153 -215 8 175 -46 -175 -55 221 -96 -91 -235 142 59 -133 -108 -176 -50 -61 171 -194
6432 -194 223 97 96 -43 -164 74 -33 162 -33 80 -66 -75 -31 166 -61 131 21 -62 -38 180 -62 3 309
6455 309 -24 -64 63 -122 24 -17 74 -76 97 88 190 -125 351 -4 -141 126 39 225 124 199 16 -72 -274
6478 -274 -140 39 -9 212 -25 -53 178 165 -165 144 -161 73 -41 -267 117 -60 34 -206 -11 161 96 -59
6500 -59 -132 -92 -354 -63 -25 -98 212 46 99 98 -303 69 66 84 96 122 283 -28 54 224 69 198 -51 -291 35
6525 35 18 172 -290 9 -29 -16 115 -56 -174 116 148 48 240 -64 -184 -235 190 -146 -29 99 -176 -171 74
6548 74 8 -57 55 13 24 26 -164 -74 -298 25 -107 27 97 33 -26 165 -94 5 -157 362 245 -20 34 176
6572 176 29 6 98 240 -28 174 -161 41 184 -87 130 -86 353 54 166 173 -145 51 -131 219 -154
6593 -154 -154 80 49 -10 78 10 -65 92 -86 -77 214 -1 -3 90 324 -76 -188 -70 23 190 -14 -45 184 -78 -295
6618 -295 -187 -93 9 -18 109 104 61 282 182 43 -46 43 -172 50 130 190 -316 -320 39 306 143 -27 -181 -51
6642 -51 233 -29 88 129 132 -154 -154 -26 -94 -46 -39 20 112 -76 2 12 27 -56 -208 -82 -77 -132 2 -13 150 -339 -66
6669 -66 -82 -73 -154 45 196 -25 74 45 -5 -59 -50 56 6 -46 -234 6 -39 24 17 -62 73 47 -122 69 -99 61
6695 61 51 -85 196 -10 257 124 -132 -300 -141 -84 84 28 -452 -133 128 171 151 -45 -192 -96 30 252
6717 252 31 -187 119 6 -148 -32 22 -160 155 254 25 75 25 -60 -125 27 46 -18 85 -123 82 35 -245
6740 -245 55 -87 92 -125 -72 -47 27 -83 -200 -118 -118 -175 -7 83 44 122 25 -44 -82 161 -54 -47 174 80 -3 -71
6766 -71 16 -73 -239 71 -52 49 -131 -34 13 -49 -158 -75 -52 -9 117 -59 -233 -42 -21 -53 132 0 72 -164
6790 -164 -47 -18 94 10 -44 -4 -119 7 -29 20 -147 -98 178 -135 134 36 190 -25 -1 -52 53 329 43
6813 43 -48 -17 36 -94 -150 160 -99 90 -79 -154 390 94 -108 -48 222 95 -22 -210 -50 126 -176 30
6835 30 -74 155 253 -51 -117 81 79 63 25 -18 -217 -74 376 -161 41 104 -57 29 -106 -2 242 -109 -67 122
6859 122 248 -275 147 -118 -70 24 231 74 -70 132 -46 95 -57 -61 -198 -157 -98 -74 8 177 -63 209 29
6882 29 168 12 54 -264 56 27 -210 -104 -79 106 37 -178 -3 -76 -40 -102 -414 -40 -18 -31 102 194 103 144
6906 144 -108 -107 -95 182 42 120 88 -110 -26 105 -121 -81 13 -107 -273 -73 -148 94 139 99 236 145 301 99
6930 99 -223 -106 -57 -2 -15 269 -84 261 27 -114 -56 152 -2 -167 119 -84 -308 267 12 -62 174 213
6952 213 148 130 -179 96 -158 -7 -29 -67 -129 218 349 -55 -85 -94 -92 14 -164 38 77 161 -23 272 294 210 31
6977 31 283 69 -150 -257 174 -318 -190 -128 -175 -266 140 -47 -124 336 -56 -123 -246 136 4 -134 20 245
6999 245 -12 115 -163 30 -4 2 -32 124 -75 79 246 179 -4 50 -246 213 -287 -211 -177 -121 -122 23 195 -219
7023 -219 -28 -33 122 118 -25 -248 -1 -63 -216 -248 306 -114 -152 -185 -139 -182 127 305 100 70 23 93 66 242 -31
7048 -31 217 79 -52 40 97 -241 -17 -87 -166 171 -104 -188 23 24 71 49 -54 -36 -22 162 189 20 -74 37 122
7073 122 -37 -29 52 215 -119 -118 -39 -205 12 206 -106 -342 95 116 97 204 -8 115 96 87 -69 137 -70 -78
7097 -78 210 176 -149 -185 61 81 -81 102 -129 75 23 -157 137 -185 -28 -141 -65 141 31 -138 -33 -121
7119 -121 -103 -38 -162 160 173 -147 -130 158 118 80 -298 53 16 -202 -37 -108 84 227 -48 -166 -46 -184 -164
7142 -164 47 69 -66 -82 -158 230 -134 -96 -180 -154 121 47 -268 47 29 233 -19 -157 235 -147 8 138 -305
7165 -305 -13 -8 -145 -84 5 202 359 -203 130 63 278 38 22 -163 -76 109 125 -19 20 69 -111 11 172
7188 172 -43 -126 193 246 149 21 -63 -92 58 -225 39 -142 -139 -97 80 -59 323 -73 67 -180 39 65 343
7211 343 205 81 -125 -67 132 -6 152 29 67 259 -103 134 -191 57 20 -26 209 -105 -82 75 179 89
7233 89 -34 210 -80 86 -217 -119 -68 137 -31 -20 118 -93 -100 -74 128 -88 43 -16 -18 225 -101 8 -46 -211
7257 -211 -270 105 -339 -32 -218 -151 -160 80 55 -73 -193 50 -57 -299 131 -69 197 -13 -241 182 74 133
7279 133 195 -91 110 77 109 12 -83 -278 47 53 -158 31 117 -157 41 -56 -59 -71 -99 90 32 73 80 -1 -11 117
7305 117 -200 43 -85 12 42 62 264 36 -83 117 202 -64 100 131 107 128 -27 9 8 116 -70 -28 200 -216
7329 -216 -52 142 -245 38 -232 93 -122 202 58 55 -51 -199 101 -3 -63 -8 -2 -48 1 196 -40 -135 398
7352 398 -103 -152 -55 -85 -48 -120 233 -272 -7 134 134 167 -73 20 120 12 -119 28 146 263 44 107 20 -3
7376 -3 211 -41 -82 94 184 100 165 -184 -109 -48 250 26 -80 160 191 -15 -176 -113 236 98 -38 -216 -57
7399 -57 -264 23 248 8 -4 -374 29 -99 123 -108 -123 -128 130 -56 175 33 335 -281 11 15 61 -68 41
7422 41 78 -56 224 -98 209 -120 197 165 -106 48 66 -155 124 282 16 122 -23 283 -31 15 -54 112
7444 112 158 -3 -35 -191 -63 17 -146 -127 -259 -32 -168 -35 -125 146 -73 -43 31 180 -125 -59 42 235 210
7467 210 -3 -103 82 -150 -54 5 -180 -119 -40 128 53 -37 39 -34 -59 105 -41 200 116 64 -120 98 -23 -134
7491 -134 156 150 -133 226 -95 -186 216 54 -131 3 -164 144 63 -118 -110 -9 -34 -48 42 -57 -244 286 -36
7514 -36 28 -135 -90 25 -97 -187 -152 -255 -238 245 252 -72 -87 -212 -142 273 162 260 44 -100 -45 -63 244 134
7538 134 180 20 117 -313 56 -15 31 47 413 201 175 -29 -117 126 141 -66 62 4 -91 -8 128 127 -116 -122 5
7563 5 129 -43 -35 -126 -4 -143 -108 56 -179 -249 18 31 103 206 -81 -338 10 -3 217 304 36 -128 67 -88
7587 -88 -59 78 220 -81 53 29 179 198 -65 113 -207 -13 -7 74 122 -266 -134 -71 116 -32 -122 -310 -101
7610 -101 -138 76 69 152 8 -112 24 -183 82 250 37 25 292 10 37 -69 -107 191 101 -88 86 -345 -290
7633 -290 13 176 91 62 -34 -184 156 187 -190 47 61 -193 -174 -60 114 -53 -20 -178 70 -225 -54 153
7655 153 154 -375 -110 -278 -14 -119 -75 -122 1 -39 277 15 198 87 -85 243 -76 187 48 37 -223 -80
7677 -80 -6 -40 -326 99 70 -132 116 -40 -142 -200 31 -179 175 252 88 123 -174 -265 136 -137 -120 -44 238
7700 238 137 60 268 110 32 -49 -30 92 109 -154 68 100 183 -94 -2 58 -73 20 29 -84 13 -16 -35 8 -14 -98
7726 -98 -93 268 101 -173 -39 -172 -166 134 -27 11 207 -122 -75 394 97 11 63 238 17 -293 119 -36 50
7749 50 -108 -89 110 -128 156 -12 45 -67 5 115 -8 153 91 -52 54 361 39 -10 -200 44 -45 212
7771 212 15 174 261 -134 -152 7 -233 -35 -229 -60 75 -159 102 22 36 232 -120 -20 -179 -160 169 -14
7793 -14 -65 -42 -58 0 117 74 77 124 -203 103 -170 63 -71 -129 55 -116 -16 -152 334 -76 -85 -215 -39 112
7817 112 -144 -30 -213 124 6 56 24 211 -171 -105 147 -70 137 95 207 -7 325 159 -259 30 199
7838 199 94 128 -62 -102 156 -12 135 -100 173 -28 12 -78 238 231 -169 92 -155 -213 184 -60 74 189
7860 189 -41 32 49 106 -131 253 -198 194 -26 -132 294 22 186 -172 -158 -61 166 132 -101 -46 -92 125 123
7883 123 86 -279 -190 90 83 35 -252 98 -296 -56 -3 -4 -46 187 -36 -13 -25 -185 80 -124 139 -218 17 -31
7907 -31 -21 -142 -250 172 -105 174 -138 -131 129 222 111 44 35 -170 -159 -10 -20 -88 151 -62 -206 1 -69 79
7931 79 62 58 233 226 100 45 -111 98 -133 -80 278 100 34 -3 197 9 -43 27 14 280 -150 170 -227 -216 -29
7956 -29 45 58 134 62 133 -246 196 52 53 121 21 172 109 179 109 57 -71 237 4 136 2 178 -89 -96 -8
7981 -8 82 15 -115 -61 -17 36 100 -25 137 44 -222 -4 39 -4 -243 -112 12 -53 1 -71 192 103 -102 -58 152
8006 152 202 -150 -190 -199 -73 -83 -190 231 -5 -119 30 130 247 -70 336 2 -23 61 -82 -81 256 117 -98
8029 -98 432 -194 12 -30 -5 138 160 -301 -291 -96 107 78 -29 -204 -57 -37 96 -63 -42 68 28 -43 133
8052 133 -152 71 -186 -103 -83 -54 159 -70 121 -115 154 -70 183 -93 -170 -143 103 -289 -51 -111 -105 118 125
8075 125 38 103 -19 -65 128 194 174 268 -168 -59 -116 198 220 -220 -61 42 79 134 298 135 -30 -140 31
8098 31 228 -116 -49 -115 167 -359 -155 -13 239 95 21 1 -225 -19 -17 42 261 -73 8 -165 136 -86 24
8121 24 -27 104 -107 -58 -82 223 84 -56 377 43 -202 -15 200 21 241 103 66 -121 56 212 -183 -158
8143 -158 -137 -127 25 6 -214 -199 303 -249 -101 122 111 -163 96 5 67 -248 -9 -188 -123 213 119 144 52 -9
8167 -9 87 -85 50 160 -157 127 -91 -188 38 -45 -70 -99 32 218 106 21 332 44 -355 121 81 -112 -289
8190 -289 -93
8191i3
##END NTUPLES=NMR FID
##END=
