##TITLE=1H_DE-44H_D2O
 D2O
 8 sc, 
 6.8.2024
##JCAMPDX= 6.0         $$ Bruker NMR JCAMP-DX V2.0
##DATA TYPE= NMR FID
##DATA CLASS= NTUPLES
##ORIGIN= UXNMR, Bruker Analytische Messtechnik GmbH
##OWNER= root
$$ XWIN-NMR		Version 3.5
$$ Tue Aug  6 16:36:59 2024 Russian Standard Time (UT+4h)  she@DPX200
##.OBSERVE FREQUENCY= 200.1313
##.OBSERVE NUCLEUS= ^1H
##.DELAY= (6, 6)
##.ACQUISITION MODE= SIMULTANEOUS
##.ACQUISITION SCHEME= undefined
##.AVERAGES= 8
##.DIGITISER RES= 18
##SPECTROMETER/DATA SYSTEM= spect
##.PULSE SEQUENCE= zg30
##.SOLVENT NAME= Acetone
##.SHIFT REFERENCE= (INTERNAL, Acetone, 0, 15.7039)
##AUDIT TRAIL= $$ (NUMBER, WHEN, WHO, WHERE, WHAT)
$$ ##TITLE= Audit trail, XWIN-NMR		Version 3.5
$$ ##JCAMPDX= 5.01
$$ ##ORIGIN= Bruker BioSpin GmbH
$$ ##OWNER= she
$$ F:/spectra/data/she/nmr/H-F/1/audita.txt
$$ ##AUDIT TRAIL=  $$ (NUMBER, WHEN, WHO, WHERE, WHAT)
(   1,<2024-08-06 16:36:04.39 +0400>,<she>,<DPX200>,
      <created by zg, POWCHK disabled, PULCHK disabled
       configuration hash MD5:
       00 E9 B6 7A A2 85 ED C7 34 08 36 98 17 FE 4E 26
       data hash MD5: 16K
       B3 9C D7 A6 6A 38 06 04 C3 42 26 D8 24 5A 68 36>)
$$ ##END=
$$ 
$$ hash MD5
$$ 8E 2D 0A CC 4B 71 DD 6D 00 92 12 D6 BD 56 6C 03
##$RELAX= 
##$RELAX= 
##$RELAX= 
##$RELAX= 
##$RELAX= 
##$RELAX= 
$$ Bruker specific parameters
$$ --------------------------
##$DU= <F:/spectra>
##$EXPNO= 1
##$NAME= <H-F>
##$PROCNO= 1
##$TYPE= <nmr>
##$USER= <she>
##$AMP= (0..31)
100 100 100 100 100 100 100 100 100 100 100 100 100 100 100 100 100 100 
100 100 100 100 100 100 100 100 100 100 100 100 100 100 
##$AQSEQ= 0
##$AQ_mod= 1
##$AUNM= <au_zg>
##$AUTOPOS= <>
##$BF1= 200.13
##$BF2= 200.13
##$BF3= 200.13
##$BF4= 200.13
##$BF5= 200.13
##$BF6= 200.13
##$BF7= 200.13
##$BF8= 200.13
##$BYTORDA= 1
##$CFDGTYP= 0
##$CFRGTYP= 5
##$CHEMSTR= <none>
##$CNST= (0..31)
1 1 145 1 1 1 1 1 1 1 1 1 1 1 1 1 1 1 1 1 1 1 1 1 1 1 1 1 1 1 1 1 
##$CPDPRG= <>
##$CPDPRG1= <>
##$CPDPRG2= <>
##$CPDPRG3= <>
##$CPDPRG4= <mlev>
##$CPDPRG5= <mlev>
##$CPDPRG6= <mlev>
##$CPDPRG7= <mlev>
##$CPDPRG8= <mlev>
##$CPDPRGB= <>
##$CPDPRGT= <>
##$D= (0..31)
0 1.2 0 0 0 0 0 0 0 0.06 0 0.03 0 0 0 0 0.0002 0 0 0 0 0 0 0 0 0 0 0 0 
0 0 0 
##$DATE= 1722947763
##$DBL= (0..7)
120 120 120 120 120 120 120 120 
##$DBP= (0..7)
150 150 150 150 150 150 150 150 
##$DBP07= 0
##$DBPNAM0= <>
##$DBPNAM1= <>
##$DBPNAM2= <>
##$DBPNAM3= <>
##$DBPNAM4= <>
##$DBPNAM5= <>
##$DBPNAM6= <>
##$DBPNAM7= <>
##$DBPOAL= (0..7)
0.5 0.5 0.5 0.5 0.5 0.5 0.5 0.5 
##$DBPOFFS= (0..7)
0 0 0 0 0 0 0 0 
##$DE= 6
##$DECBNUC= <off>
##$DECIM= 24
##$DECNUC= <off>
##$DECSTAT= 4
##$DIGMOD= 1
##$DIGTYP= 9
##$DL= (0..7)
0 120 120 120 120 120 120 120 
##$DP= (0..7)
150 150 150 150 150 150 150 150 
##$DP07= 0
##$DPNAME0= <>
##$DPNAME1= <>
##$DPNAME2= <>
##$DPNAME3= <>
##$DPNAME4= <>
##$DPNAME5= <>
##$DPNAME6= <>
##$DPNAME7= <>
##$DPOAL= (0..7)
0.5 0.5 0.5 0.5 0.5 0.5 0.5 0.5 
##$DPOFFS= (0..7)
0 0 0 0 0 0 0 0 
##$DQDMODE= 0
##$DR= 18
##$DS= 0
##$DSLIST= <SSSSSSSSSSSSSSS>
$$ [...]
##$SUBNAM2= <"">
##$SUBNAM3= <"">
##$SUBNAM4= <"">
##$SUBNAM5= <"">
##$SUBNAM6= <"">
##$SUBNAM7= <"">
##$SUBNAM8= <"">
##$SUBNAM9= <"">
##$SW= 24.0689771365484
##$SWIBOX= (0..15)
0 0 2 0 0 0 0 0 0 0 0 0 0 0 0 0 
##$SW_h= 4816.95568400771
##$TD= 16384
##$TD0= 1
##$TE= 0
##$TE2= 300
##$TE3= 300
##$TEG= 300
##$TL= (0..7)
0 120 120 120 120 120 120 120 
##$TP= (0..7)
150 150 150 150 150 150 150 150 
##$TP07= 0
##$TPNAME0= <>
##$TPNAME1= <>
##$TPNAME2= <>
##$TPNAME3= <>
##$TPNAME4= <>
##$TPNAME5= <>
##$TPNAME6= <>
##$TPNAME7= <>
##$TPOAL= (0..7)
0.5 0.5 0.5 0.5 0.5 0.5 0.5 0.5 
##$TPOFFS= (0..7)
0 0 0 0 0 0 0 0 
##$TUNHIN= 0
##$TUNHOUT= 0
##$TUNXOUT= 0
##$USERA1= <user>
##$USERA2= <user>
##$USERA3= <user>
##$USERA4= <user>
##$USERA5= <user>
##$V9= 5
##$VALIST= <valist>
##$VCLIST= <CCCCCCCCCCCCCCC>
##$VD= 0
##$VDLIST= <DDDDDDDDDDDDDDD>
##$VPLIST= <PPPPPPPPPPPPPPP>
##$VTLIST= <TTTTTTTTTTTTTTT>
##$WBST= 1024
##$WBSW= 4
##$XGAIN= (0..3)
0 0 0 0 
##$XL= 0
##$YL= 0
##$YMAX_a= 146425
##$YMIN_a= -153227
##$ZGOPTNS= <>
##$ZL1= 120
##$ZL2= 120
##$ZL3= 120
##$ZL4= 120
##$ABSF1= 10
##$ABSF2= 0
##$ABSG= 5
##$ABSL= 3
##$ALPHA= 0
##$AQORDER= 0
##$ASSFAC= 0
##$ASSFACI= 0
##$ASSFACX= 0
##$ASSWID= 0
##$AUNMP= <proc_1d>
##$AZFE= 0.1
##$AZFW= 0.1
##$BCFW= 1
##$BC_mod= 2
##$BYTORDP= 1
##$COROFFS= 0
##$CY= 11.3945322036743
##$DATMOD= 1
##$DC= 2
##$DFILT= <>
##$DTYPP= 0
##$F1P= 15.6554695791079
##$F2P= 12.8336369535428
##$FCOR= 0.5
##$FTSIZE= 0
##$FT_mod= 4
##$GAMMA= 1
##$GB= 0.15
##$INTBC= 1
##$INTSCL= 1
##$ISEN= 128
##$LB= 0.24
##$LEV0= 0
##$LPBIN= 0
##$MAXI= 10000
##$MC2= 0
##$MEAN= 0
##$ME_mod= 0
##$MI= 1.114404
##$NCOEF= 0
##$NC_proc= 0
##$NLEV= 6
##$NOISF1= 3.799351
##$NOISF2= 2.8
##$NSP= 1
##$NTH_PI= 0
##$NZP= 0
##$OFFSET= 15.70392
##$PC= 1
##$PHC0= -25626.14
##$PHC1= -8.012508
##$PH_mod= 1
##$PKNL= yes
##$PPARMOD= 0
##$PSCAL= 0
##$PSIGN= 0
##$REVERSE= no
##$SF= 200.130013532006
##$SI= 16384
##$SIGF1= 3
##$SIGF2= 2
##$SINO= 400
##$SIOLD= 16384
##$SREGLST= <1H.CDCl3>
##$SSB= 0
##$STSI= 0
##$STSR= 0
##$SW_p= 3612.71676300578
##$SYMM= 0
##$S_DEV= 0
##$TDeff= 0
##$TDoff= 0
##$TI= <>
##$TILT= no
##$TM1= 0
##$TM2= 0
##$TOPLEV= 0
##$USERP1= <user>
##$USERP2= <user>
##$USERP3= <user>
##$USERP4= <user>
##$USERP5= <user>
##$WDW= 1
##$XDIM= 8192
##$YMAX_p= 0
##$YMIN_p= 0
$$ End of Bruker specific parameters
$$ ---------------------------------
##NTUPLES= NMR FID
##VAR_NAME=  TIME,          FID/REAL,        FID/IMAG
##SYMBOL=    X,             R,               I
##VAR_TYPE=  INDEPENDENT,   DEPENDENT,       DEPENDENT
##VAR_FORM=  AFFN,          ASDF,            ASDF
##VAR_DIM=   8192,          8192,            8192
##UNITS=     SECONDS,       ARBITRARY UNITS, ARBITRARY UNITS
##FACTOR=    0.0002076,     1,               1
##FIRST=     0,             0,               0
##LAST=      1.7004516,     0,               0
##MIN=       0,             -153227,         0
##MAX=       1.7004516,     146425,          0
$$ Real data points
##PAGE= N=1
##DATA TABLE= (X++(R..R)), XYDATA
$$ [...]
1884a034J174J032m66j106p88R54J259j60r60p69J43J795L4j109q75j93J350N79
1902H60o26j182r3J300Q35m92j507k45R82J144k26j131o95O10J075J31n92r48
1920h00k22J365P88j016r03J93Q29Q08o69j237Q9Q84Q12l65j102l80O54J063m9
1939G42q90n22L64J155mq08j106P42P13P21j017o92kQ38P98n16j311l29J176R62
1959A014n84j018l26O36J322k82r57q98O82J223K57r95q82J60J053P04o86r49
1977e26l72Q57J092o79j149l80J127J091k60j280n35P75Q84J93j218o73M76J125
1995E48L57o05j105L59R26M92p41r15k01J165O82o85p25q16J342Q05m91o63n36
2014h07M92R02l7o70j029P05N65J024r39q80R8J193J32n38p14l24J010N88j09
$$ plain form
1884 -1034 140 1172 706 -400 -1188 -234 1025 865 -95 -864 -721 1074 1108 -1 -876 -1069 281 860
1902 860 234 -948 -1041 259 1094 602 -905 -1150 -168 976 750 -381 -1076 -466 609 740 148 -800
1920 -800 -1022 343 1131 115 -788 -595 234 1042 373 -864 -775 109 921 556 -546 -926 -272 791 742
1939 742 -148 -670 -306 849 845 37 -1069 -327 386 1107 90 -602 -604 234 1032 516 -795 -1124 52 1014
1959 1014 430 -588 -914 -278 1044 762 -195 -1093 -411 812 1069 74 -808 -648 405 1109 423 -526
1977 -526 -898 -41 1051 372 -777 -1157 -30 1061 801 -479 -1014 -239 645 838 -380 -1053 -577 548
1995 548 905 300 -805 -446 480 972 231 -684 -885 280 962 277 -448 -1264 78 883 392 -271 -807
2014 -807 -315 587 550 -120 -1149 -444 121 1145 206 -674 -576 617 749 211 -503 -827 183 771 662
2033F62j170n34R74R85n95n52n92P56N95K06q70n41R9Q97K98o75k44k36Q92N93
2053I48n56r21j07O85O52Q7j054m63M87R99k44n14p30L71P79J23m94q21N24N55
2073C06mj77o65R5O95N33m27n88q23J345L64k34q08l30N20P94j06n61l11j27Q47
2094C38K81p94m24N65L18K21m06o94J42N95O78m91o44m22Q27K57q2n37r5L35O41
2115F09mn53n09K42P68J56l84q64K95O33P4k45q69K65N27M13l55q16j96M69O89
2136C45R3n65o30N54N66L11p71l33K54L37J49l28o67L83O51K88l41l30l53N25
2156A38M27j4n28n15L43P46j10p12k34O9J002k24l24p11L33M61K09r4q71L21N42
2177B54R3l62m99n8M70O27k78o02PL24L50L60j269P0L59N58n5l13o55L10Q86m5
$$ plain form
2033 662 -508 -1042 -68 917 322 -230 -822 -66 529 735 -135 -676 -577 320 618 -57 -301 -537 355 948
2053 948 392 -529 -636 49 701 788 -266 -729 -242 757 513 -1 -731 -360 419 542 48 -773 -249 306
2073 306 302 125 -540 -445 250 783 356 -232 -1055 290 654 420 -388 -718 -198 596 490 -71 -382 -509 338
2094 338 619 -175 -599 -34 284 505 99 -595 -453 142 820 329 -315 -737 90 347 265 -272 -367 -32 609
2115 609 605 52 -457 -215 553 709 325 -539 -244 389 463 218 -651 -386 141 554 199 -617 -813 -344 345
2136 345 438 -127 -757 -203 363 674 -97 -430 -176 161 310 -18 -685 -302 349 637 296 -34 -387 138
2156 138 565 551 23 -492 -149 597 487 -225 -459 -390 612 388 64 -647 -314 147 356 262 -609 -288 254
2177 254 347 -15 -514 -572 -102 525 247 -355 -348 -24 326 686 -583 -513 -154 404 349 36 -619 -309 577 532
2199E32l81k15l03J91O72l15l17m79O49L91m8o83j76N81M23l70k54o18N26P51
2219E57r7n05n30M36L96J94m35o43J06O15K68j78m87p2N11M82n59k02l63L71N56
2240D21j41l22m53K52L29K60k39m13k0O81M2n5n85l62N92M99j39o30l34N90M75
2261D48K2o68k53M00M51R1q12k47N56M88k40M2m07R6M97k61p1l78l16P98J29l90
2283b5m06J90j5P63l46O1n10K59K12K96l41n28R0M73K62l31m40M29J10O6m1j65
2305F3m67M27L00p4j19m31L80J52j98l17P1N6L50N9m94j27pP48Q7k83n11K23K80
2328A68J83n6n34m98J106K51m50q4m44K67K30J94j88o31K67M68L19m90m83K36
2348a69L17J02l46l69K71M13M00n60l87o5L52M54j14m49q3K29Q3J55k79m94M19
$$ plain form
2199 532 151 -64 -367 -176 496 181 -136 -615 34 425 377 -306 -482 99 522 152 -102 -720 -194 557
2219 557 460 -45 -575 -139 257 451 16 -627 -521 94 362 184 -303 -375 136 618 59 -143 -506 -135 421
2240 421 280 -42 -495 -243 86 346 107 -306 -326 355 397 342 -243 -605 -13 486 347 -283 -617 -27 448
2261 448 470 -198 -451 -51 400 491 -321 -568 -12 476 236 278 -129 -33 464 203 132 -246 -562 236 365 -25
2283 -25 -431 -241 -256 507 161 222 -288 -29 183 479 138 -390 -300 173 435 104 -336 93 203 269 228 63
2305 63 -404 23 323 249 130 -301 79 231 33 -284 -213 -157 193 252 -242 -369 -376 372 459 176 -335 -112 168
2328 168 351 295 -239 -737 369 620 170 86 -358 -91 139 333 145 -486 -219 249 568 78 -405 -169
2348 -169 148 250 -96 -465 -194 219 619 59 -328 -393 -41 413 299 -150 -233 -4 79 234 -45 -539 -120
2369a20J45J73Oo90N87o4N97n0j098J67L91Q7j57m0j2L0J50J79j80j74l66O62
2391B23J01l67l16N21K03M4l02m25Q8N01j90k43j13L31K7K59l56m24j39Q49L3
2412C05j53l17K2J93P7L3l65l02J54J43M06J52o66j90O65J74Lp35K10R5M28k71
2434F1m78K33M1K15M37o77J23k99M16R1n0l18O8l6O63m27N5m29N94j69J89n05
2456b02J52O9L26k03m59Q1K05J82J67j5n90J28l3M77m13M9q6K18M1J64l23k78
2478c43L03L62m2m58j43M44M42o34k56J26oK96J74l58j38K27L26k99l1n62O25
2499E5q0J9JJ18r6J44J31j37l44p0K07J52j69O1l33L46O9L06n26n1K18j3L00l27
2523a9j29J3K15L38j30p69L69J1M49j54k12j13J42J70o1l56j9K66K3M51o84j4
$$ plain form
2369 -120 25 198 204 -486 101 37 634 584 -514 -347 44 131 -26 -66 -78 -48 102 281 101 -73 -439 223
2391 223 324 -43 -359 162 365 409 107 -318 -230 271 81 -162 -275 56 83 342 -14 -438 -577 272 305
2412 305 152 -165 -143 50 127 160 -205 -507 -353 -210 196 348 -318 -508 157 331 334 -401 -191 -96 332 61
2434 61 -417 -184 -143 72 509 -168 -45 -344 72 163 113 -205 -137 -173 490 63 118 -311 283 114 303 -202
2456 -202 -50 19 345 142 -317 -236 -31 151 318 303 -287 -159 -192 285 -128 -79 -165 53 94 258 -65 -343
2478 -343 -40 322 280 -178 -321 123 565 -69 -325 -199 -205 91 265 -93 -231 -4 322 23 -8 -570 55
2499 55 -25 -6 -5 113 17 161 292 155 -189 -259 -52 100 -69 -8 -341 5 74 380 -146 -197 21 8 308 -19
2523 -19 -148 -135 80 418 288 -481 -112 -101 348 194 -18 -131 11 181 120 -236 -255 11 34 485 -199 -213
2545b13j18O03R2n42J11P6PJ00k1l3k33L36N7o7k16j02K20P6r1J29k28L99k08
2568A34K01k41k24r9M68j09o4l48M88q4J42k72k25j50L11K07K47n07k16N70qk0
2590B01l39j03l0P40k43n65J85L2K55j42j67k30L19J20Q8j70Kk91J81M38q7l04
2612a10nJ11L17j68J20n71j7N14K8l84J61j67N12m16K39k95J89j6j1L0j65k99
2634d03J58J87j12J73q6J36mL37k47m44L0L30K85n76L0J53k3K77k45k05OL73L4
2657A64r6k9k6j17JQ0K82j96k01L31K40l28P0j75Q9J62j94P0l24J65K30L0l01
2680g3L3J21o4pj74N07k95L43p0j35j38l6k93L36j2l08L26o1J06k77o0K52J26
2703A47l05N0J96m85K50L61Jn30O62l40r7J82j28j6j59K90J15k84K00n8m18O08
$$ plain form
2545 -213 -331 272 364 -178 -67 9 16 116 95 62 -171 165 222 155 -61 -163 57 133 42 171 -57 342 134
2568 134 335 94 -130 -229 239 130 66 -282 206 122 264 -8 -233 -383 -72 135 382 -125 -341 229 221 201
2590 201 -138 -241 -271 469 226 -339 -154 -122 133 -9 -176 -406 -87 33 121 -49 -47 -338 -157 281 194 -110
2612 -110 -115 -4 313 145 265 -306 -323 191 219 -165 -4 -171 341 -75 164 -131 58 42 31 61 -104 -403
2634 -403 -245 -58 -170 3 -83 53 49 386 139 -305 -275 55 340 -236 -206 -53 -76 201 -44 -249 -243 130 164
2657 164 68 39 13 -104 -103 -23 259 63 -138 193 433 105 175 0 89 251 57 127 -197 -32 198 228 -73
2680 -73 -40 81 17 10 -164 343 48 391 321 186 48 12 -281 55 43 -265 61 0 106 -171 -231 21 147
2703 147 -158 -108 88 -397 -147 214 215 -315 347 7 -90 92 -36 -52 -211 79 194 -90 110 52 -366 242
2725B42j15Mj20K56j39o7J67k51Q7j52J71Q2P5r1k42j01j5j15rM51j5K3Q8m12
2749a98J38J6J42o0j87J9P0J42J05m32O6J85L63m03j95K98k3l5J39j24J62k38
2771e0K58K2k47l42N09l97J87m19K76M93k47j58m7M2l16N44r1l94L47p3K35M1
2793A73k52j7l6L45m2l96J24M5N4J04P8l22l7J40p4J74j73k13J79L50j95j27j30
2816b48M60j22M9j10K58k49R5j01j58J05k1k97M50J16m77J96L45Km27K84m18j6
2838b84K37K03q9q8N7K01l11M1j54M14j95r3M00r1j61k5R1l00J30R1k78L54J40
2861B90m63l4rN65j83l19P2K18k10M58k83l15L54K6j16k22j93P81m04K02j66o2
2883a3k32N69k26k55RJ42j17J65K25k31mj28q6L20KJ60l07J71j80k16N89n43m2
$$ plain form
2725 242 127 131 11 267 128 61 228 -23 64 -88 83 165 240 149 -93 -194 -209 -324 -333 118 103 126 214 -198
2749 -198 -60 -44 98 38 -149 -130 -60 82 187 -245 -179 6 369 -34 -229 69 46 11 150 26 188 -50
2771 -50 208 230 -17 -359 150 -247 -60 -479 -203 290 43 -115 -162 -120 -436 108 17 -377 -30 -103 132 173
2793 173 -79 -96 -132 213 171 -225 -101 -56 -2 102 180 -142 -179 -39 -113 61 -112 -325 -146 204 9 -118 -248
2816 -248 212 90 139 29 287 38 133 32 -126 -21 -42 -339 111 227 -250 -54 291 293 -134 150 -268 -284
2838 -284 -47 156 67 -21 36 237 -74 -33 -187 227 32 -61 339 248 87 62 153 -147 -17 74 -204 150 290
2861 290 -173 -207 -216 349 166 -153 -81 137 -73 385 102 -213 141 167 51 -171 -364 417 13 215 49 -13
2883 -13 -245 324 98 -157 -148 -6 -123 42 267 36 32 -96 -182 138 140 300 -7 164 -16 -232 357 -186 -228
2906b28K72K90l96j94L69j23R%r9l8o8L52k19o1K54m0J91j63l37L03jJ21k36Q4
2930D2l4J33l1p6j18K81L9m43K00K19k12Q8k9k20L14k50J42J82k56L38k90J7l44
2953c08L59j52O5m1J79nk07L42l53NP1K92o44K22J36J96j32J56P0n60O8L01j6
2976D4M63q37M21P9l68j22K46K27j59K00p6J5k63J60K44l11j36K55j81o1Q9J62
2998I1Q7nj43j93p6J2K30k64L15J07k62r5N78n55J00J30K7j63J05M9m8p3N6r5
3022h5P0L22j99j0j08o1J09k3k8LQ2j81q7J62k51R2j48K42K33k64K00j31K13j95
3046d3L25l02K3j34J23K55k11k0r2K03l7k26R6J72j30J70j61p9M33m45K28l46
3068a98L48m14K08M9l6Q1J3M2k06O5Q7Nk58L84j27j10L19k9k02N3j97L89k28J33
$$ plain form
2906 -228 44 334 -62 -256 113 -10 -1 -1 -100 -138 -206 146 -73 -134 120 80 271 108 -229 74 73 194 -42 42
2930 42 8 141 110 34 -84 197 236 -207 -7 212 0 88 59 -161 153 -97 45 227 -29 309 19 36 -308
2953 -308 51 -101 -36 -77 102 97 -110 232 -121 -116 -45 247 -397 -175 -39 157 25 181 251 -309 -241 60 44
2976 44 507 -330 91 170 -198 -320 -74 153 -6 194 118 133 -130 30 274 -37 -173 82 -99 -160 -71 91
2998 91 178 173 30 -163 -239 -227 3 -261 54 161 -101 -196 382 -173 -73 57 84 -79 26 75 27 -46 10 -85
3022 -85 -15 307 108 98 -10 -71 38 15 -13 -10 72 -109 -196 -34 -285 -193 -341 -99 134 -130 70 -61 152 -43
3046 -43 282 -20 3 -131 -8 247 36 16 -76 127 90 -136 -40 132 2 172 11 -68 365 -80 148 -198
3068 -198 150 -264 -56 -7 -43 38 51 93 -113 -48 39 44 -214 170 43 -67 252 223 21 74 -123 266 38 171
3092A71m05N64l19R2k71M18n81N03j14l0J79j26j60J33k13j6M14j19l1r0OK13
3114B18j34j81J99J22j85p8J45N3k8k68L08k87J98k61L4K01k68J28K87N6k10k08
3136a59M17n29L53N0j63j68R5j15J13j37J67j03L64k24j78K54PoQ9R1k80K36J9
3159A93j41P4l08K46J07j61j45j5K5O0j25K46j10K4j20J78P6M6m09K06M8j0NM3
3183C3j09j65M54j66K30l90p1N8K13o9l57M88k10R0j03Kk2j11J78P5J50l28K87
3206A57M4k73nk32L19j88J1J99n2l18N87l33K41j02k9j23n4J39m08M88p4j01P8
3229b9j81Q8P3j13O8J7L6j46N5K1K74J08k86j59L35q5o5j94J85O7k12K7p8L09
3253A15j84n4Q1o7J45M6j32m52M68K71q8l98J65J3L67l95j62K1J33O6L0n3j21
$$ plain form
3092 171 -234 330 11 103 -168 250 -331 172 58 28 207 81 -79 54 -159 -175 239 120 89 -1 5 218
3114 218 84 -97 102 224 39 -39 106 159 131 -137 171 -116 82 -179 -145 56 -212 -84 203 259 49 -159
3136 -159 258 -271 82 132 -31 -199 -104 -219 -106 -243 -76 -179 185 -39 -217 37 44 38 127 218 -62 174 193
3159 193 52 126 -182 64 171 10 -135 -150 -125 -65 -190 56 -54 -30 -150 28 104 150 -259 -53 -5 -15 -10 33
3183 33 -76 -241 213 47 277 -113 -184 -126 87 18 -339 149 -61 29 -74 -72 -94 -205 -27 48 198 -130 157
3206 157 201 -72 -77 -309 10 -178 -167 32 -20 -338 249 -84 157 55 26 -97 -151 -12 -420 68 -6 -107 -29
3229 -29 -210 -122 -49 -162 -94 -77 -41 -187 -132 -111 163 271 -15 -174 161 76 11 -183 2 69 -143 -116 -194 115
3253 115 -69 -123 -42 -109 36 82 -50 -502 -34 237 149 -249 -84 -71 296 -99 -261 -240 -107 -41 -11 -64 -185
3276a85KJ09K18q0L8J60n64L14m1J93j3r9q3M9J25j55J65j20k95M07k90O2L97
3299C14k75o5J80l74J39K96k79n6J25j31k9K05j61k41M44l05N51l02j61K6J66
3320F7QJ05n46M46k24K32k16O2L69k83k51o2K83J2l06J76k75L59j15k72M45mK67
3343B77l70r5K81J15k64K79m22L66n3k99J88K94k58j35L23k43j62lJ74M2J1p7
3365c1J29N2j01l88N50l04l7Q2o8J35O9m23M05Ok65K29j2J89N0m74j02J50J39
3388b0l6L4J87j36q4R1k11J76n1K40j41l32L90j58l06L73q7O3j94L74o4j61K27
3411A74l35L97l30J98k56p7M39l02o4K18m7L1P9j17P9k45K38K80k54M9l88K02
3433c1J22l8j36K38n2j07J52q2k3j95O1m2J21k37J39nk2Lj4O7J19J45k71K95l00
$$ plain form
3276 -185 -183 -74 144 64 102 262 -302 12 -29 164 151 52 -31 18 143 -12 153 33 -262 145 -145 -83 314
3299 314 39 -26 154 -220 -81 215 -64 -120 5 -126 -155 50 -111 -352 92 -213 338 36 -125 -99 67
3320 67 75 180 -366 80 -144 88 -128 -66 303 20 -231 -293 -10 2 -304 -128 -403 -44 -159 -431 14 10 277
3343 277 -93 -188 93 208 -56 223 -199 167 114 -185 3 297 39 -96 227 -16 -178 -181 -7 35 46 -31
3365 -31 98 150 49 -339 211 -93 -130 -48 -116 19 88 -335 70 76 -189 40 28 217 267 -207 -309 -159 -20
3388 -20 -56 -22 165 29 -55 36 -175 1 -50 190 49 -283 107 -51 -357 16 -71 -8 -202 172 108 -53 174
3411 174 -161 236 -94 104 -152 -229 210 -92 -156 62 15 46 125 8 87 -158 80 360 106 155 -233 -31
3433 -31 91 53 -83 155 103 -4 148 66 43 -152 -91 -133 -12 -249 -110 -115 -137 -134 -148 -81 38 183 -88 207 -93
3458i3J10j91L29O9l43l6J62j12J85j3R8k8o0J34j26k4q9J98j55k75J91J33N6
3481A20l81K63j49K23J33j76l44M25j47K98j61M8j76l26J83J80R7p9%j49L12j33
3503F1l1O4J98l63J00N5j00rQL78m95K47k03o0K11q8L39l41l1J66k01J29ok62
3527b34L98l81K15O4j36r9O9J23q7j09L63P7k96L5O8j00j45L53m37N23k5k46j35
3550a42q2K81KJ00m8L4j24K24j87k63L69j13r5O4J94l47L28k65J2K52k99n4K61
3573A02l31J98M20l81k27L40K14l62k49L29mK9O2r7P3k04K31p6J07Jj23k55L64
3596A61k14j24K62r2j25n6K12j26K19l48K98Pj2j78R8k76K65J56j40j1P1j42O1
3619c4r1L43J3p07L75R9K22k3k70N14m92J30Q9k5J94m18K45k58K13K2j84L52l89
$$ plain form
3458 -93 17 -174 155 224 -119 -155 7 -105 80 67 165 137 77 211 85 61 -28 170 15 -260 -69 64 120
3481 120 -261 2 -147 76 209 33 -311 114 -33 265 104 152 -24 -350 -167 13 110 31 31 -118 194 61
3503 61 30 94 292 -71 29 84 -16 -25 -17 361 -134 113 -90 -150 61 -27 312 -29 -60 106 -95 34 28 -234
3527 -234 164 -217 -2 62 -74 -173 -104 19 -68 -177 186 263 -33 2 70 -30 -175 178 -259 264 239 -7 -142
3550 -142 -224 57 59 159 111 145 21 245 58 -205 164 51 -44 20 214 -133 195 -70 -58 194 -105 -159 102
3573 102 -229 -31 389 8 -219 121 335 -27 -276 53 49 78 140 43 116 -88 143 67 174 175 52 -203 161
3596 161 -53 -177 85 -7 -132 -188 24 -102 117 -231 67 74 62 -116 -18 -294 -29 127 -13 -24 47 -95 -34
3619 -34 -125 218 231 -476 -101 -2 220 197 -73 441 -51 79 168 143 337 -81 164 -94 119 141 -43 309 -80
3642h0J25J08k35J27k9r7K70N7k51K8k99L83%j22l39M01J6k3O7m50L59j96j0J25
3666f5j34J57J39m4j04K16k19l7N4k79L70J67qp4Rj98l10K80J29j08l7J7J69j17
3690b7k7J19o6J7k28L36j26K5m9P5J36m07M00l43J06J6p0J33j05K79m32J16K45
3713A23m30mM58j80q6K72j95K9rK05nj83L0K75n96J90J4K36l07J83J84n20K84
3736c2K63j47j69j8j46L69k24J41l4J17J02j57J3mj96J11j23K6m0j13M50j0j98
3759a9R3K3L0n9j20n2J10J87k02k68L48P0k54K50l06L12l4n27O95k10j35j26K30
3782C6j90LJ23J57l52j42M88l5l58J9J57K07K18j27m78L01l8J69j30l31K53J15
3804F5J42k66J02L1k9l56J96K38j03j08J48k4M4m0R3J50k50L6R2m44Q0K31O0l18
$$ plain form
3642 -80 45 153 -82 45 16 -81 189 246 -5 23 -276 107 107 -15 -354 47 63 40 107 -343 16 -180 -190 -65
3666 -65 -199 -42 97 53 -51 165 -54 -91 -37 -316 54 221 213 139 148 -50 -360 -80 49 -59 -96 -79 90 -27
3690 -27 -54 65 -1 16 -212 124 -2 23 -26 49 185 -222 178 -165 -59 -43 -113 20 -85 194 -238 -122 123
3713 123 -307 -311 147 -33 -119 153 -42 -13 -22 183 178 -5 25 300 -296 -106 -92 144 -163 20 204 -316 -32
3736 -32 231 84 -85 -103 -249 120 -104 37 3 120 222 65 78 74 -122 -11 -134 -108 -148 -261 189 179 -19
3759 -19 74 97 127 68 -52 -104 6 193 -9 -277 71 141 -113 137 -169 143 109 -418 277 67 -68 -194 36
3782 36 -154 -151 -28 129 -223 -365 123 88 -270 -251 -94 113 331 204 -274 27 -11 158 28 -303 -50 65
3804 65 207 -59 43 74 45 -311 -115 123 20 -88 60 36 80 40 133 283 33 69 161 -283 -203 28 88 -230
3828b30K00J89r2K13j46j54L9J05Q4k40J34k06J17J65j92k07Q5K76j43JL2j1r
3851A0K99l26l3R6j85J99j20Q8m5J24j41j4K50j75j04M26l77j64K69l81L24o3
3873d3K26o19K74l3P4N08l62j45J38P4K1k87R9J91m25L41n5j06O3L90m29q8J09
3896h4l4L23J36k27m1j49J91K0j77j11J3j12L13K56m62r8M34p1jL96l72j21J32
3919A54j36J32j90k64L38j9L26l02q1J90k95r0J19R5N5k02J40j6j81L07k46J83
3941A7qn2j47M54j92j44q0l76N85J45l61L38l78K3K58K07l09N5j47j45M69m64
3963b52L15J07J3k06l16P71o31K85n8Rl03L82p4N2j18l12M08q0l1J73o5J36j37
3986F8l05K41J9j40N8K18J98k05k39M19m91J23j64K23J36q6p4J94m38K59j6QN4
$$ plain form
3828 -230 -30 159 67 280 134 -20 19 124 208 -32 102 -104 13 178 -14 -221 -136 140 -3 -2 30 19 10
3851 10 309 -17 -50 46 -139 60 -60 28 -17 107 -34 -48 202 27 -77 349 -28 -192 77 -304 20 -43
3873 -43 183 -436 -162 -195 -121 387 25 -120 18 92 113 -174 -75 116 -309 32 -23 -129 -66 324 -105 -193 -84
3896 -84 -118 205 341 114 73 -76 115 135 -42 -153 -140 -252 61 317 -145 -243 191 120 119 515 143 22 154
3919 154 18 150 -40 -304 34 15 341 39 -42 148 -147 -237 -118 -23 32 -170 -30 -46 -227 80 -166 17
3941 17 9 -43 -190 264 72 -72 -152 -528 57 202 -159 179 -199 -176 82 289 -20 35 -112 -257 212 -252
3963 -252 63 170 183 -23 -339 432 -199 86 28 37 -266 116 42 94 -24 -336 72 -8 -39 134 69 205 68
3986 68 -237 4 23 -117 -59 159 357 152 -87 332 -159 -36 -200 23 159 73 -1 193 -245 14 -2 6 60
4009F0p3k40L20LP4l18N0L86l71Q2j21J58j08L25j40J35l51J02o8K13P1k30j12
4032a53J71O9J15j56m05K99K7n8J53j64L05j53J20j17J07Q1k78K21r5j71n3K21
4054H6k57L17q1k58K94J60m17P3K21j92M01m25j3M15k15k1m9pk4K25mj37mk79
4078a91L10q4R6K03m15L69n01L31j69j03J08L82l20P4K91m22l03L0K41q9K72l27
4100b17J45P7R9J7k16L4kJ37K26n25P6p4M59k03j34J65j37P7k61K65J3o8k34J46
4124a35M78J49p04M60l64o3K55q9L42j47k2k18P7N8Mk51J59l04M62l35J79O2l27
4147b74M98J3L6l45J30j15K52l92Q4K19j6pL13n88j5N05j60J2J2j05j03L28K6
4170C08n86J20L45l79L48k26j39J95J82j11j39J25l75L15QK52J8l44L96m07R7
$$ plain form
4009 60 -13 -253 67 70 144 -174 -124 262 -109 -27 -148 10 -98 227 87 222 -129 -27 -95 118 189 -41 -153
4032 -153 18 87 202 46 -359 -60 -33 -91 62 -102 203 50 170 53 160 241 -37 184 89 -82 -135 86
4054 86 -171 146 65 -193 101 261 -156 -83 138 -54 347 -78 -91 324 109 88 39 32 8 233 229 92 88 -191
4078 -191 119 35 131 334 -81 288 -213 118 -51 -154 -46 336 16 90 381 -41 -344 -314 -73 -162 110 -217
4100 -217 -72 5 104 121 -95 -61 -63 74 300 -225 -149 -223 236 33 -101 64 -73 4 -257 8 21 -47 -281 -135
4124 -135 343 492 -212 248 -116 -179 76 -13 329 182 160 -58 19 77 81 -170 -11 -315 147 -188 -9 53 -274
4147 -274 224 237 273 -72 58 -57 195 -197 -113 106 90 83 396 -192 -207 298 138 150 162 57 -46 282 308
4170 308 -278 -158 187 -192 156 -70 -209 -14 168 57 -82 43 -332 -17 -9 243 261 -83 313 -94 3
4191Cp6l26L76k77K93K20l07m9K49q4m3K5k65J9K63l10O8K14K94m69J96m8J36
4214A02p4k96P2K64j26L20k53K52m04j84J33N4L77k46k55L64%L8Rl31o1K95Oj17
4238f1K04n16J92l3J56o0J13J69l67J07j04o1M14k53K96j65J36j59k1j11L54l69
4260a39L5J59r2K68k86J70l9N9J10m29j0K5J90K62j50j53L0K07j99l7J21k68q
4283a74M06k69n8K18l10K80m9o00L47M40j66q2J40j01L09m37K09j72J53l59L04
4304B9J80k75j09K00O2p7J0o4m21M94M45j60p2l31R8J21N2k21K37j13k16K24k71
4327a78K71J26j54J54l94K27k89K46j21oN2qK13K50k76k01j82M05J05j37P8m33
4349b52J79Q9K25m5m2j22J42j19N5J71k83J58p1J44k28qkN0j1Kj6J20j71M28p40
$$ plain form
4191 3 -73 -399 -23 -300 -7 213 -94 -143 106 22 -21 4 -261 -242 21 -289 -221 -7 287 -182 14 -34 102
4214 102 28 -268 -196 68 -58 262 9 261 -143 -327 -194 -140 237 -9 -264 100 100 138 147 -184 -245 50 56 -61
4238 -61 143 -373 -181 -214 -58 -118 -5 164 -203 -96 -200 -261 153 -100 196 31 167 8 -13 -124 230 -139
4260 -139 -104 55 -37 231 -55 115 76 135 245 -184 -194 -169 21 283 133 -20 10 217 18 -19 102 -166 -174
4283 -174 232 -37 -95 123 -187 93 44 -556 -209 231 65 -17 123 22 331 -106 103 -69 84 -275 29
4304 29 209 -66 -175 25 87 10 20 -44 -465 29 474 314 242 -89 9 130 182 -39 198 85 -131 93 -178
4327 -178 93 219 65 219 -175 52 -237 9 -112 -118 -66 -74 139 389 113 -88 -270 135 240 103 181 -252
4349 -252 -73 16 241 196 154 32 174 55 110 281 -2 156 85 229 1 -7 -9 41 30 32 16 136 -35 393 -347
4374c47m1M55l5n0o6r2L18j86K28l15j01L56j16p4k4O6q5P5K22J76n55j13K96
4397hJ82j38m3k08N54j78p1j65K19l37J00q1J08M9m39Q40n58J46L5p1Q4j89K53
4420H4K22l90L16k40j02J94j33j55M13l5J37l52J1R4J57J70m00o6j22jL4J94j37
4443a07p0K34P0k9j08l14M98j46l3K3k60L27r5lr7MJ22J08P8J3j05k65L4N2l3
4468a02k0qJ95k53J32K91r5k96J21J63k06O8K74l82J00N4l2M28l34J1N3K8k35
4491d5L0J32n9j48K6L95k64j9O8l74K55k61J93O7j87K00J39k25r2J36K38k27j22
4514a44Q1q5L28j58M8l3j12J12j09L23j41j65J42K1j53M3j04k44O87k81K29p58
4536d73M45k0L17q0m55J16K00m2K53J8k03K37l96QK48l75N4L99O3l65J32k35J74
$$ plain form
4374 -347 -388 67 32 -18 -84 -176 142 -44 184 -131 -232 124 8 -66 -90 -24 -109 -34 188 364 -191 -304 -8
4397 -8 174 36 -7 -215 339 161 90 -75 144 -193 -93 -174 -66 -17 -456 384 -174 -28 7 -64 20 -169 84
4420 84 306 -84 232 -8 -110 84 -49 -204 209 174 311 -41 -30 64 221 391 -9 -75 -197 -198 -164 30 -107
4443 -107 -177 57 127 98 -10 -324 174 28 -5 18 -242 85 -10 -13 -110 -106 16 124 202 215 110 -155 -121 -69 -102
4468 -102 -122 -130 65 -188 -56 235 140 -156 -35 128 -78 -10 264 -118 -18 36 4 432 98 109 162 190 -45
4491 -45 -15 117 58 -90 -64 331 67 48 116 -258 -3 -264 -71 -4 -191 9 148 -77 -169 -33 205 -22 -144
4514 -144 -63 -148 180 22 70 37 -75 37 -72 251 110 -55 87 108 -45 -2 -106 -350 337 56 285 -473
4536 -473 -28 -48 269 189 -266 -150 50 8 261 279 76 313 -83 -75 173 -202 -148 251 314 -51 81 -154 20
4559B0q0N6J68j72n2j7L42j28k09j10J12M05l32j04j05K10K0j14K54m62K73K54
4581B29j70k39K72j62J37K05j86k55J58J5m7j88L68j12J91O2k53j05K5J75R4m41
4603b27L44q1J20m9J41j93k07K51k25L03k44M6m5j73K47Lk68L13K99l92j05J61
4625A9q9J95M9q8k38o5N5J92J25j18j26O0K82k81Q0k93L61m07K89M1k19J08K28
4648A60k62L17l06k19K52K24Rj79r7NK51J07q0l59jK21J85j91r4L91l08jj2j68
4672a55J46q6K23j66M4P2Ol1J9j57J93n0Q7j23j69J79p3k07K13J08o1R5J96j84
4696A19J2k68J11m1K47j62m26M07n0J29N6l99M85l75K41O8k27N6K10j13j8l76
4718c14K27L83l14L9J45j35L3K66k88j18QJ54j13J61m3k68J15J21n3j3J07l79
$$ plain form
4559 20 -60 -4 164 -8 -60 -77 265 137 -72 -182 -70 335 3 -101 -206 4 24 -90 164 -298 -25 229
4581 229 59 -180 92 -70 67 272 86 -169 -11 4 -43 -231 137 25 216 278 25 -80 -55 120 214 -227
4603 -227 117 36 156 107 248 55 -152 99 -126 177 -67 -21 -66 -239 8 11 -257 56 355 -37 -142 19
4625 19 -70 125 174 86 -152 -217 -162 30 155 37 -89 -29 253 -28 52 -241 120 -287 2 43 -176 -68 160
4648 160 -102 215 -91 -310 -58 166 175 -4 -101 -96 155 262 182 -177 -178 43 228 37 -57 334 26 25 13 -155
4672 -155 -9 -95 128 -38 6 78 84 53 72 -85 108 58 145 22 -147 32 -41 -248 -35 73 12 107 303 119
4696 119 131 -137 -26 -67 180 18 -408 -1 -51 78 134 -265 220 -155 86 154 -73 -17 193 80 62 -314
4718 -314 -87 296 -18 21 166 31 64 330 42 -76 -68 86 -27 134 91 -177 -62 59 6 -7 100 -279
4740b79L08J56j90R5j87MJ22m4j06o8%j4K81k35j58J59K49j65J52n6j55Q2j2J42
4764H1m02M07j17J97l77M12o2n06M28K1m4r7P6K40j78N0j62L19k78Q3Q0o4j44
4787c7P9L14l43O2l03O6K06k6l42K07J55j38K76j62N8j89K03k8k34K18o8o0P5
4810a1M7M9j4J75k9J77n25P0O1O4Rml8r7p3j63L69jl28J53L76m84L53p6j26O4
4836bK00j05k02M7M3J20K3q6j94M23j25k1n6Q4j21K01j97J87l50M2J97l90M19
4859A37k01j31M53k44J8j16J1M92m33L54k09K31l32J49m0k94P1J64j10N9K35l97
4881a33M35l20K37n94K32k7K90J53j17l33J32K17j59qJ56j39L5j18R1p2J17Q2
4903A57n7J7Q3k0jj84M2R3j27J2k82L62j96k9k60L66j72J83q4m6O0K01r2k50J52
$$ plain form
4740 -279 29 185 -5 90 -97 -93 29 -15 -121 -189 -189 -203 78 -157 -315 -156 93 -72 80 24 -131 -49 -61 81
4764 81 -321 86 -31 166 -211 201 139 -367 61 82 38 -59 17 257 79 129 -33 286 8 91 171 107 -37
4787 -37 42 356 13 75 -228 -162 44 18 -324 -117 38 -100 176 14 72 -117 86 58 -176 42 -26 -86 -11
4810 -11 36 85 71 246 217 394 -131 -61 0 64 73 69 31 -66 -139 -302 67 66 -262 -109 267 -217 136 60 -66 -2
4836 -2 198 93 -109 -62 -19 101 124 38 -156 267 142 121 65 149 28 229 32 219 -131 -89 108 -282 137
4859 137 -64 -195 258 14 32 -84 -73 419 -14 340 131 362 30 179 139 -155 -84 80 -30 29 264 -133
4881 -133 302 -18 219 -375 -143 -170 120 273 156 -177 -45 172 13 5 161 22 57 -61 30 -42 75 157
4903 157 100 117 200 180 179 -5 37 130 3 15 -267 95 -101 -130 -390 -24 -196 -13 -97 -143 -83 118 26 -224 -72
4928g2K2J40j9m0j26J49K8l77J36J01j57L23K81l43j33k56K99K30ol23L79k79
4950d3l2KQ0l53N28j83O6j70k73L78R7K45j90j47N7j71j59K01J37k67J61J31r9
4973dj93N0L7J16j61J26j23J52O9O7j94J44K47m52K42k47M11k66M7j18J31k01
4995a20M57l77L8K12n44N73R1m94J77O9j06l64N65k59J91q8L26l09m59M62k8k73
5017b60K94M4k7j86k45N35j57N8L4k9J91j85O1l11J60N2r2M75m09m75L55J16L23
5040C22k60j24J63N8M5j60O0j16n9o5J62k86R2J0J75K72j51j2K8k46K58k95M06
5063B77l32m9L20j71l20K45K85m12K24O7k5oj95L20k89J01n3j06O0J17j74J23
5085Gj11K41k24J95oj97j7L38k02l49M34Q1k53j83K23J42k27K10j06k39K64K28
$$ plain form
4928 -72 -50 90 71 31 -95 54 82 -295 -159 -58 -215 108 389 46 -87 -343 -44 186 180 -143 236 -43
4950 -43 -75 -73 7 -346 182 -1 65 -105 -378 0 97 342 152 5 62 -109 -268 -67 70 -197 -36 95 -4
4973 -4 -197 -147 -110 6 -155 -29 -152 0 69 136 -58 86 333 -119 123 -124 287 21 68 -50 81 -120
4995 -120 337 -40 -2 210 -334 239 330 -164 13 82 -24 -388 177 -82 109 21 347 38 -421 41 13 -260
5017 -260 34 78 51 -135 -380 155 -2 56 90 61 252 67 128 -183 -23 29 -63 412 3 -472 -117 -1 322
5040 322 62 -62 101 159 204 44 104 -12 -71 -136 26 -260 -168 -158 17 289 138 126 154 -92 166 -129 277
5063 277 -55 -104 216 45 -275 -30 255 -157 67 134 109 103 -92 228 -61 40 -13 -119 -59 58 -116 7
5085 7 -104 137 -87 108 102 -95 -112 226 24 -325 109 190 -63 -246 -23 119 -108 102 -4 -243 21 249
5107B49j59J07N9L5k95l05R6L92k38J56k8L12l20k57L88k06L08j95k63J60j12
5128a16m9L14p1j86O1K82l60p4J56K39j56j85K38q1l59J39J33k1J53oK65k75l08
5151b67J53J74p0j76K08K7p5j22K71l81N21k17p7J8J79j51K63j98j33Q6o9M2j48
5174a42K42k7k50K89l4k8k56r9M59k33n1J18j62K32p5j04M43k33j4l76l1K03J2
5197a17n5K5L9J98j06j3k42J40m5J50K54m10n1M51k59j96L22m16N12l50L00%k76
5220a45J88J17k77J91j05m2K27Ll36Lj7N27k23k20K20j35K02l3l9KP6k69R8J44
5244A57J1k76j76L39k17N8qJ37j32l4j8M76o0k12M5q2J0R0O0k46%K42k18J68k58
5269a44Q5J09j45J79j3k16r0j6j30Q1L24Q1j00k0Q4O4p2j60J07K67k41k33J69
$$ plain form
5107 249 90 197 256 291 -4 -309 -213 179 -59 97 69 381 61 -196 192 -14 294 99 -164 -4 -116
5128 -116 -165 149 78 -108 -47 235 -125 -199 -43 196 40 -145 93 12 -347 -208 -75 -96 57 51 316 41 -267
5151 -267 -114 60 -10 -186 22 49 -26 -148 123 -258 263 46 -31 -13 166 15 278 80 -53 33 -36 6 -142
5174 -142 100 73 -177 112 78 50 -206 -305 154 -79 -130 -12 -174 58 -17 -121 322 89 75 -301 -332 -129 -117
5197 -117 -172 -147 -108 90 -16 -29 -271 -131 -176 -26 228 -182 -233 218 -41 -237 85 -331 181 -169 131 131 -145
5220 -145 43 160 -117 74 -31 -73 154 157 -179 -176 -193 334 111 -109 111 -24 178 145 106 108 184 -85 13 157
5244 157 168 -108 -284 55 -162 -104 -112 25 -107 -141 -159 317 257 45 90 8 18 108 168 -78 -78 164 -54 114 -144
5269 -144 -59 50 -95 84 71 -145 -235 -251 -381 -300 24 105 5 -15 69 133 61 -99 8 275 34 -199 -30
5292c0J34J31k41l3K4j10J68J56k25o0M7j96P6j0J98Mm7Q3j39R3o6J55J30k74
5316c2r2J41j90K50p6J98k2r0R0l5j08j14K08m0j93K9J22m6J23lon3J28j98%K3
5342A4K58Q8n17J41k33K75O8m34J87K84k43K56l15KJ45J59j71J39L9k89M42k24
5364G1o6J50k54m4K94Q9l93K89M7j01n7Q4k25pJ82J11l90K28K43j72N1j29O7j60
5388i2M68j75k19O4N5j24Mk48M22m17M19l25%M42k90M2lL53k30k34J53j12k05
5411b52J70K06oJ50l91J72p3j45K85k55M1L05k46K23l54J03O9K0j51j00J11k1
5433a39K73%K47o38K12n6L49j15j1k81N71k91k72J14n0j14K61j24p5l2M9K76j93
5456c9m9J09J54l91K99r4K45l26Q8m4N2M22k74p7m6L3l39L83Q1j64J14j6q2Q6
$$ plain form
5292 -30 104 235 -6 -39 -15 -125 43 199 -26 -86 -39 -235 -159 -169 29 33 -14 69 -70 23 -43 112 242 -32
5316 -32 -124 17 -173 77 1 199 177 87 177 142 34 -80 128 88 -105 -76 46 0 123 120 114 61 189 -9 -9 14
5342 14 272 360 -157 -16 -249 26 94 -340 -153 131 -112 144 -171 -169 -24 135 -36 103 142 -147 295 71
5364 71 5 155 -99 -143 151 240 -153 136 183 82 25 109 -116 -123 59 170 -220 8 251 79 130 1 68 -92
5388 -92 376 201 -18 46 101 -23 -19 -267 155 -262 157 -168 -168 274 -16 26 23 376 146 -88 65 -47 -252
5411 -252 -82 124 118 268 -123 49 -24 -169 116 -139 -98 207 -39 184 -170 -67 2 22 -129 -229 -118 -139
5433 -139 134 134 381 -257 -45 -101 248 133 122 -159 412 121 -151 -37 -87 -201 60 -64 -139 -171 -122 154 -39
5456 -39 -88 21 175 -216 83 -11 234 -92 -4 -48 4 426 152 75 29 62 -277 106 187 23 137 121 39 125
5480A25j58K3K29o12L52J00J26LP3p6k70m3N80m16QL41l84J40m38L86J57j70p8
5503br3L32n72K40j04O4QM5N40o22o8L01j80J11r6J71j18J18j3l70K18J98L9o5
5527H2j12p4K97j61O7n4J41O0j37J21m75N40l1l09k98J34O9J85L03j89k90O8J59
5550I6J9k22J24p3K76o1j03l00L77m55K96J63l22M2Q1L17j52k35N1J14l66O55
5572C22m18M4j42J86j12K11j36P6J11O0k60j27P6L79k36j18K9J21j1j69J29n4
5594c9J6j21L48k02q4L35n16O24m52j27L43k39L5J98k52J97M2k41P0J28j97K19
5616H5q6n8K84l98Q4P9j06J71l9K5J87m90J99J62j37O5Op0M12j47l58L0R2m1j34
5641a83J62k4P5k61L14R1j54j11M3k8k33L54P1j77J60K2J12j3k73K50k05j35J91
$$ plain form
5480 125 -33 -10 219 -393 -41 59 185 188 261 185 -85 -128 452 36 44 385 1 141 -297 89 246 76 -2
5503 -2 -95 237 -335 -95 -199 -135 -127 -82 458 -164 -232 69 -111 0 -96 75 -43 75 62 -308 -90 108 147 82
5527 82 -30 -104 193 32 99 45 186 246 109 230 -245 295 264 -45 -343 -209 -140 45 348 159 -131 -63 96
5550 96 115 -107 17 -56 220 159 56 -244 133 -322 -26 137 -185 -143 -62 255 103 -132 -81 33 -333 322
5572 322 -96 -52 -194 -8 -120 91 -45 31 142 202 -58 -185 -109 270 34 -84 -55 66 55 -114 15 -39
5594 -39 -23 -144 204 2 -82 253 -263 361 -91 -218 125 -114 -79 119 -133 64 106 -135 -65 63 -134 85
5616 85 -1 -59 225 -173 -89 -10 -116 55 16 41 228 -262 -63 99 -38 27 33 -37 375 228 -130 -100 -8 -49 -183
5641 -183 -21 -45 30 -231 83 174 20 -91 -48 -76 -309 45 116 -61 99 121 233 220 -53 197 -8 -143 48
5664D8K60l48M40m63r5K13o2K83l78j3L8K4Q4J70r0j45p9oo8L4J68j43K9L33k22
5689A2j4J40j58k07O0K87j8R6m93L69j03J97j51r3K89k81N0k0Q2j84K30k37M26
5712B79l97K50k13L28k75j85L74M5k55J00P5l34j02K11m6p6J32L8J68M6j1J12
5734B64l6l78K33j73K41j0k23M1r6k51L87j0k02L9L13j42j03O5J39j25j15N2Q8
5757bk79M75k93J16K30m60J25J43M7R3o0r7j13m5K4p8m0L84j01l80O8L38j45J10
5781F0k66J85O5J39pM9l41R3k7J13M7l84K48K43m49K42j27k56K09L38N7l42l8
5804a49LK13k82K16J03k31p2L1o1K13J27p0j7K9j89K62k81M3J0m4P5J67N4j93
5828d3M9j35K24P2kj67j0l6L29k08m63L13J39O1nj63Q4n7M7K7J62l69r6J01k6
$$ plain form
5664 48 308 -40 400 -63 -158 55 -7 276 -102 -115 -77 -53 31 201 111 -34 -113 -119 -187 -153 15 -128 -99 234 12
5689 12 -2 138 -20 -227 -167 120 102 198 -295 74 -29 168 17 -76 213 -68 -18 -38 44 -140 90 -147 279
5712 279 -118 132 -81 247 -28 -213 161 206 -49 51 126 -208 -310 -99 -145 -221 -89 -51 117 163 152 264
5734 264 228 -150 83 -90 151 141 -82 -41 -137 -388 -1 -11 -213 -174 139 -3 -106 -41 98 -27 -142 -90 -2
5757 -2 -281 194 -99 17 247 -213 -88 55 102 195 135 38 -75 -120 -96 -174 -214 170 69 -311 -243 95 -50 60
5781 60 -206 -21 44 183 176 225 -116 -23 -50 63 110 -274 -26 217 -232 10 -117 -373 -164 174 231 -111 -149
5804 -149 -146 67 -215 1 104 -127 -199 -168 -229 -16 111 41 24 53 -136 126 -155 -112 -102 -146 -71 96 150 -43
5828 -43 6 -129 95 167 165 -2 -12 -48 281 73 -390 -77 62 123 118 -45 39 -18 29 56 218 -151 -247 -146 -172
5853a72p7K43K12l00Q8L70m17m3j0L24l29J4l9K39j28J45j34K04m08K91r4r0M2
5876f9j47J96j7J47j13kL31k37p8K11k98P4l46M55o6K27j4k68O3p8j8l4o3Q5M5
5901a4J6l8j12J87n8o1n4j12L63M4k70M9P0J70l9k3j39Q0K00j14l13L44o2j13
5925AO5J8R0p6o6N4K5k06L77j24l0l12p4L86m1o0qJ09o3l09J55L9L3M95o93N65
5951C50N6n42R5P5o0Q2k02L99j41J22k66nJ37j99j5K82k72K68j99QJ49j45J5k23
5975b31K79n7L5j49K93k27P5j93L39l22R0J82r2j8j95K69J55m37K8L45k03p0K09
5998A05L2M7l44J81l22K71N3J0k07J19J13j64J35J07Q1j99o1j46L49m68K07j7
6020a18J56k76J09n7n6j4K4K78O6l0M7k42k50M55j02M9J52j62j89L40l23j93L98
$$ plain form
5853 -172 -249 -6 206 -94 -6 364 -53 -96 -106 218 -111 -97 -136 103 -25 120 -14 190 -218 73 -21 -111 -69
5876 -69 -216 -20 -37 110 -3 -5 326 89 11 222 -76 -2 -348 107 41 268 254 -14 49 -29 -47 -81 -144 -59 -14
5901 -14 2 -36 -148 39 -19 -80 -134 -246 117 161 -109 -60 10 180 141 118 -21 59 259 145 -168 176 114 1
5925 1 66 84 174 98 32 86 111 -95 282 158 128 -184 -258 128 87 27 19 128 65 -244 -89 -50 -17 478 -215 350
5951 350 406 -136 -41 34 -26 56 -146 253 112 234 -32 -37 100 -99 -114 168 -104 164 -35 -27 122 -23 -8 -231
5975 -231 48 -9 26 -123 170 -57 18 -175 164 -158 -68 114 22 4 -191 78 233 -204 -176 169 -34 -104 105
5998 105 137 184 -160 21 -301 -30 23 33 -174 -55 58 -106 29 136 217 18 -43 -189 160 -308 -101 -118
6020 -118 38 -238 -129 -186 -242 -256 -232 46 112 82 129 -113 -363 92 -10 39 191 29 -160 180 -143 -336 62
6043F2j60j99N92k53K4j41j7K95j83j89J65p2R8k51J95j73K90K9j62p2L41k16
6065CK44Jj01k33O9P8l15K91o4L17o27P17o28k3N06K2k28L9M5j30j1O3L4j76R
6090i8J09Q4r7j27K81o4k68J69k06L94k02J11P3m32M60j90k33M72k08R3j52j81
6112b12K80j14j4j15K42L2J07Q3j52l29J95l76N53k35K39n1k02K69l25K32J76
6133B83j27k1j53p5LM0l4J01J77k51r8P0j7kJ1R5q0L31k19R8m27M8J86P2K96j29
6159A78l26K45m05L68m6l43N14J21l97k36K47O7K63l28k8P1m5J39P6j91J12l30
6181b74K69J6j11L11j45L7j34J57Q2k42J73j44r1P7k12L18j78j56O18l70J13j4
6203A00j47l50J88K30j60K98N1j51n3J3j38o6L36q0j56L88l57j8O7K18n7m93K26
$$ plain form
6043 62 -98 -297 295 42 66 -75 -92 203 20 -169 -4 -76 22 -229 -34 -207 83 112 -50 -122 219 3
6065 3 247 248 147 -86 -17 61 -254 37 -27 290 -337 380 -248 -271 235 257 29 68 113 -17 -28 35 69 -107 -98
6090 -98 11 95 -2 -129 152 88 -180 -11 -217 177 -25 86 159 -273 187 -3 -236 236 28 121 -31 -212
6112 -212 68 -46 -60 -175 67 99 206 289 137 -192 3 -373 180 -55 184 133 -69 200 -125 107 283
6133 283 156 135 -18 -93 -90 -50 -84 17 194 -57 -155 -85 -102 -104 -93 2 -78 253 34 132 -295 -247 -61 11 307 178
6159 178 -148 97 -308 60 14 -329 185 306 -91 -327 -80 -13 250 -78 -106 -35 -80 59 135 -56 56 -274
6181 -274 -5 11 -100 211 66 103 -31 126 208 -34 139 -5 -96 -19 -231 87 -91 -247 371 1 114 100
6203 100 -47 -397 -209 21 -139 159 210 59 6 19 -119 -185 151 71 -85 303 -54 -72 -5 213 156 -337 -111
6226a11K57j59L38k22p0j18K1J18J71n6p6n8M8k06K34r2J11r9k25J08l0K54o7
6249G1k14j18K05k1K65mp0Ol91L2K21k72L64o8j93J77J15j22j8j19P7K84o6l04
6273a63K34k90N7K76k19M8j39J02m8j09N4K24j58K34j12j07K17q1M11k76k38j23
6295b06L84j0j80J54k42L6K47J6L9l02J54k2k8p7L97l58J84J00l68l0l1N3J66
6318G6j64K61j04j86j11L67J7K1O6k34K8o8j61O0J14K15k99J08J42K1J34m07j22
6341b26K4J96l0K19l04J85q8p3k7L45m23J57P5l8lJ82j75k10L28m6l13K11R6j30
6365f8m4L9Q5J61j89O9j9l0m2J67n4J57l67J20j3j38J26l51M77k1l4j59l7L40
6389A75j39J7J57k71J21N2k54J05MJ21J06k84K87k29M10l06j32J57K9J10j41k8
$$ plain form
6226 -111 146 -13 325 103 33 -85 -64 54 225 169 93 35 83 -123 111 19 130 31 -194 -86 -116 138 71
6249 71 -143 -261 -56 -77 188 184 114 120 -271 -239 -18 -290 74 6 -187 -10 105 -17 -35 -154 -77 207 141 -163
6273 -163 71 -219 -162 114 -105 -57 -196 -94 -142 -251 -197 27 -131 103 -9 -116 101 20 431 155 -83 -206
6295 -206 178 168 -12 142 -100 -64 183 199 238 -64 90 68 40 -37 360 2 186 286 -82 -112 -143 -90 76
6318 76 -88 173 69 -117 -228 139 156 177 243 9 37 -31 -192 -132 -18 197 -102 6 148 169 303 -104 -226
6341 -226 -202 -6 -36 183 -121 64 -24 -97 -124 221 -202 -45 30 -8 -11 171 -4 -214 114 68 -245 -34 62 -68
6365 -68 -112 -73 12 173 -16 53 34 4 -38 129 75 232 -135 -15 -28 -166 -40 -391 86 65 31 -128 -165 175
6389 175 36 53 210 -61 60 112 -142 -37 -33 88 194 -90 197 -32 378 72 -60 97 126 236 95 67
6411F7m6J06j57o3O1K67l14l1K11k24N7K1J50j42J42k08J1J05j40k4J60N1J0K9
6435I9Mj34K22k97J14J00n6J1l6k3o5J52r3L3r6J21J7N0m1J08r8j69M24n18L84
6460B13m82K0L42r0j56L18k35j3j0J35M3l04K39j4J20k25J71J3K21j20n8j74p8
6483a24L04j18k1m4o1K05j65O5k6j93M20j98N0N4l9j90qL5%n2K0n7P7np6K06o6
6510gK85m16K85k56J56J35o8j81jk68J85K40o5Q0k92K16l53L41K7J18Q2J4j54
6533A03l85J87J03J4R8l33K03J3r0K04l5l57J10K82K0r2j73J23p5J17j46J79r2
6556b2L33l75K0j11J45k52L29M9n5J03J18m21O3K84j30KOn3j92J28J64n6k5j90
6580a38J69J82n19L62K25l78J22n4L2K23j86k6j63L17k48%Rj24M83j22k93K5M09
$$ plain form
6411 67 21 127 -30 -93 -32 235 -79 -110 101 -123 -66 -45 105 -37 105 -103 -92 13 -127 -151 9 60 70 99
6435 99 103 -31 191 -106 8 108 52 63 27 4 -61 91 -2 31 -65 56 73 123 82 190 92 -77 347 -171 213
6460 213 -269 -249 93 3 -153 165 -70 -83 -93 42 85 -219 20 6 126 -99 72 85 306 186 128 -46 -124
6483 -124 180 62 41 -3 -64 141 -24 41 15 -178 242 44 94 148 109 -81 -89 -54 -54 -106 -86 -143 -66 -71 -147 59 -7
6510 -7 278 -138 147 -109 47 182 114 -67 -68 -336 -151 89 24 104 -188 28 -325 16 43 161 243 257 103
6533 103 -282 -95 8 22 120 -213 -10 3 -87 117 82 -275 -165 117 137 45 -128 -5 -80 37 -109 70 -22
6556 -22 311 -64 -44 -155 -10 -262 67 116 61 164 282 -139 -76 208 78 80 86 33 -159 -31 133 77 52 -138
6580 -138 31 213 -306 56 281 -97 25 -29 3 226 40 14 -149 168 -80 -80 -71 -195 288 166 -127 -102 307
6603C07k83j63M7M15m89L16q7N9l29K90k06K14Ok79K39l3O4j33J68k22n1R0j40
6626b00p7J33r5lK34j95K82j89j4K61J0k38j3K20J25k38k61L50N5p9j09l4J20
6649D5k14K49J9m14K87N1J33l09L01J29n1o2n6j56j4J4N6L1n5M1m1j10K0K13l98
6674b91K06J25j09j16P3M2K05J1q5j58P0j2j86J79M8p3qK04j67j8j40n1N28l35
6698e8p7L60k13l3Pk8j6Q5j37n4J33R4o3Q1j83Q3qJ53l14J92L2j7k67J17K47p6
6724D0J34m36J07Q7l10N45N8l02M3J2P4k16L58k79K47l07k6O9K31K0k90K10k53
6747a84N07m27O4j9m5K59j24k00K67l3k91M67k04J56l24M5K17j61J3L8Q1N6j39
6770A9K54m53O6J13r0j4q8J37m4J06K95j98J2j11k19N89p45N15o6m07J58J14L41
$$ plain form
6603 307 24 -139 -92 323 -166 150 63 122 -207 83 -123 91 97 -182 57 24 88 -45 123 -99 -150 -60 -200
6626 -200 -277 -144 -239 -242 -8 -203 79 -110 -124 137 147 -91 -104 116 241 3 -258 92 147 68 -41 -75 45
6649 45 -169 80 99 -315 -28 23 156 -153 148 277 226 164 108 -48 -62 -48 8 39 -16 25 -16 -126 -106 107 -291
6674 -291 -85 40 -69 -185 -112 -70 135 146 61 -97 -27 -39 -225 -46 2 -71 -79 125 -42 -60 -200 -251 277 -58
6698 -58 -135 225 12 -21 -14 -42 -58 27 -110 -164 -31 63 0 81 -102 -19 -27 126 -188 4 36 19 -248 -131 116 40
6724 40 174 -262 -155 -68 -378 167 225 -77 -34 -22 52 -164 194 -85 162 -145 -171 -102 129 149 -141 69 -184
6747 -184 323 -104 -40 -59 -104 155 31 -169 98 65 -226 241 37 193 -131 -86 131 -30 -17 21 102 158 19
6770 19 273 -180 -114 -1 -91 -105 -193 -56 -100 6 301 103 115 4 -215 374 -371 144 78 -329 -171 -57 284
6793B84l07o9k09J18K29k58J68QK04j58q3J53l10K18K66l42J58lk21k06K50O0
6815e0J21M7q3J29k35MK45q9l42K29J06j13R1l2k38P0J1N3N4q9K34r6K30l77j09
6840b29JL89r4Q8j70q3J01O0L29n58L19k00O6K48rj39p2j61j64P6K57J6Q4k56
6864a01rJ6r0J44J35P8M0K9j97j44J47j21L0l1L54l97j6j57L22K5j19K03J61j37
6888A65m01M81k77R2Jr0j63j59L61L21j94N9j62R6n5j7K2j05K76k83P2L2M7m9
6912G0k4k05L82k32j78p4J91k52J95M32m19J35m8K62l59J83r4J8J35j40J88k30
6934f4N5mL43o74J71K44m39M73l26M01j93k11L16mk66M4J47K3K03n82M53k2K5
6957A13k45p5L21j08J21j55q1L25J64l68J20j84k33K57qO5K40n73L44J39j06k29
$$ plain form
6793 284 -23 -92 -301 -183 46 -212 -44 -36 168 10 -73 80 -230 -12 254 -88 70 67 -154 -360 -110 -50
6815 -50 71 118 35 164 -71 -67 178 89 -253 -24 82 -31 60 28 -210 -140 -129 -76 -22 -111 123 27 257 -120 -229
6840 -229 -228 161 67 155 -15 -98 3 63 392 -166 153 -47 19 267 258 119 47 -114 -278 -202 55 71 155 -101
6864 -101 -110 -94 -184 -40 95 173 213 242 45 -99 48 -73 -43 -74 280 -117 -133 -290 32 57 -62 141 302 165
6888 165 -236 245 -32 60 61 -29 -192 -351 10 331 137 196 34 130 75 58 80 -25 251 -32 40 72 119 70
6912 70 46 -159 223 -9 -187 -261 -70 -322 -127 305 -114 21 -27 235 -124 59 -35 -17 118 -22 166 -64
6934 -64 -9 -13 330 -344 -173 71 -368 105 -221 180 -13 -224 92 88 -178 -134 13 36 239 -343 110 88 113
6957 113 -132 -207 114 6 127 -28 -109 216 380 12 132 -52 -285 -28 -36 29 269 -304 40 179 73 -156
6979a56K07j99K01p6j48J54j7k86K55L1L2J81n96M81l18K14J69j89J49K97k82
7000A04q3j87J97K34k40k53O01m34J16l79L44J63p3j12q8j04L30q3j64J91r2K69
7022B57k03m3J70j57J21l56M31n65O21m44M71m29Q3J22q1J28j63pK7K00k69J46
7044F0o4j06K73p6j52J90l22P4K80k17k90M78J58k09j68K20j49J51J05l10k25
7065b99O38l54K66k5l36O3J24O1k09J8l7O6j30L78k99M24k14j04N9k60k17L83
7087dL3J6k08J11j07J80p0P2j53p0K33On9l6K36j54J46k47k53K14M8j10L01l81
7111b56K82K7R9j52J64N2j95J29k65K22j28j53k78M26M6l29M36j65O1K04l95l6
7133b04J38J68l31K84l77M53k7j97P5k18J73K66j49J20l00J68l43J19R4J0j9J57
$$ plain form
6979 -156 51 -148 53 -23 -171 -17 -34 -320 -65 -34 -2 179 -417 64 -254 -40 129 -60 89 386 104
7000 104 21 -166 31 265 25 -228 373 -61 55 -324 20 183 110 -2 -90 -194 136 53 -111 80 -12 257
7022 257 54 11 181 24 145 -211 220 -345 276 -168 303 -126 -43 79 -2 126 -37 -44 -17 183 -86 60
7044 60 -4 -110 163 87 -65 125 -197 -123 157 -60 -350 128 286 77 -91 129 -20 131 236 -74 -299
7065 -299 339 -15 251 226 -110 -47 77 138 -71 -53 -90 -24 -154 224 -75 349 135 31 90 -170 -387 -4
7087 -4 29 45 -163 -52 -159 21 -49 23 -130 -200 33 39 -20 -56 180 26 172 -75 -328 -114 -66 -176 125 -256
7111 -256 26 53 152 0 164 216 21 150 -115 107 -21 -174 -452 -26 20 -309 127 -38 23 227 -168 -204
7133 -204 -66 102 -229 55 -322 131 104 -93 -18 -236 -63 203 54 174 -126 42 -301 -182 -88 -78 -97 60
7155F0r3r2K55L2k44L28k03k10M24k19j8J12j97J32nP9k97N7L01l9k10k01L11
7178F3j03q3J92J17l22L14p1j57J42j74j64L26k82J42p3j52K75l17L47m1K3j70
7200a68J78R0m00N97P8l80J71J17r1l46K18o6K72m45L01Nk16K14k66J20j79kj65
7223c63L46n5p9J80k2M14n43J73k0K0O5l7m06L85l4j91M10j87J06l48L53k51P0
7246a4j92J18J69N6l50m9K03K09q1p7l19L11J2j48O10k35M7j38J24j09j20k6j9
7269a8m9J56K4J43j75r0j95K01k06Q9N5J95K2j98J26q7K9K0j29j7L08k02k8m6
7293g2j2J99K9j88L62n33L62l28J66L17j45l8nk07J25J84m86M31k1K9q2l45K82
7316B4l96M47P9m79M32k03J06j89M66n60M24p8p5J11j71J72Qk1k91L42P5l38j54
$$ plain form
7155 60 -33 -125 130 162 -82 246 43 -167 257 38 20 132 -65 67 62 141 -156 -99 202 163 -47 -248 63
7178 63 -40 -123 69 186 -136 178 107 -50 92 -82 -246 80 -202 -60 -133 -285 -10 -327 20 -21 2 -168
7200 -168 10 100 -300 297 375 -5 166 283 192 -154 64 -2 270 -175 126 131 -85 129 -137 -17 -196 -198 -363
7223 -363 -17 -72 -151 29 7 421 -122 51 31 51 116 79 -327 58 24 -167 243 56 162 -186 167 -84 -14
7246 -14 -206 -88 81 137 -213 -262 -59 150 69 -8 -327 -16 -4 -152 458 223 270 132 256 147 27 1 -18
7269 -18 -67 89 113 256 81 -9 -204 -3 -209 -120 -65 130 152 -46 80 -7 22 42 -87 -104 204 2 -26 -72
7293 -72 -84 115 144 -44 318 -215 147 -181 -15 302 157 119 114 -93 32 216 -270 161 140 169 87 -258 24
7316 24 -372 75 154 -325 107 -96 10 -179 287 -273 151 73 -2 109 -62 110 118 97 -194 148 223 -115 -269
7339b69L08P9P8k20o9K11O3m25M34m01L87Q1k92R7J18l05J52Rj41J68j83K89j45
7362B4l3j82J23J59l22M11r0k1p0j6J34j82k52N44j91Q8l00J03L5Q1j28k18L65
7385F2J26j97q3P4K00n1k97K30L8k46K51l64J40K42n5k0k88K94K6J0r4O2k69L74
7409A65k58J99k46K01J39j62k10J39M5J31j35r7M5j05O4K3m7K08j45L6J12n5O5
7432A12k09Jr9jM14m5j55J30j82k67N41n3k57J62J53q4J78l79oJ55j11K6q2J43
7456H5j41o9L70j59o4o7Q0p8k54L30Ql20J67J65J20j42k9r6K04k68L54j57P4P5
7480A88j57k18K85j56L8N3j12K5P3j98K50k54K96l01L37J6j91k62J15L95j39K08
7502B91k25rK00j35m27P50n93K68n4o1M6P0k1j8j24j45M86k07o1j64K6j20J73
$$ plain form
7339 -269 39 118 196 -24 -93 118 181 -244 190 -211 176 257 -35 62 180 -125 27 36 -105 63 -120 169 24
7362 24 -9 -191 -68 91 -231 180 90 69 -1 -17 117 -65 -317 227 36 124 -176 -73 -38 43 -85 -303 62
7385 62 188 -9 -92 -18 182 131 -166 64 102 -144 107 -257 -117 125 70 50 -238 56 82 92 -2 60 -209 165
7409 165 -93 106 -140 61 200 38 -172 -33 12 143 8 -89 -44 -149 -85 -62 -109 99 -46 -10 102 47 112
7432 112 -97 -96 -195 -196 218 173 18 148 -34 -301 240 187 -70 92 245 161 339 -40 -46 109 -2 24 -58 85
7456 85 -56 -125 245 86 22 -45 35 -43 -297 33 41 -279 -112 53 173 31 2 -94 110 -158 196 39 113 188
7480 188 31 -187 98 -58 -20 33 -79 -54 19 -179 71 -183 113 -188 149 165 -26 -288 -173 222 83 291
7502 291 66 57 257 122 -305 445 -148 120 66 5 51 121 100 82 -42 -187 299 92 31 -133 -107 -227 -54
7525e4J90l20K28J67n6k96K00l77J30P7rL7n8K68l71N12k65j44M10n17M62l05
7547i1K4K01l13n1O3RP2l0L39j86O1k07K18j56j3O0k83K31K3L78n30M62k51j93
7571a63Q8P2J08l4l76N06k74L20k76K06j26j41J41o5J09j83m9K0K18l04j00K93
7593a0k31J33P1j09K14J21J30l02j73M59l49j96n6J88r0k75O63l62J77m3l8J00
7615B2j84K62jk73L36k04P8p2m1L30j42L9j23J1q0J75M7k04rj57k2K29m6n3O2
7640b0R8j2pjR0j89J59q1k74M64l88N13On94J00L35k93l5J07j14J48qp1K70j56
7665D7J1l25O7M9p2K61N5M16m55R3l27L0jJ06oQ3J97J19l35k88M26k03P8J78m51
7690b47K3K84j68P5J05k4J6m19N75l18J30p6J6j10K54n50M87j56K99k17j44P3
$$ plain form
7525 -54 136 -184 44 211 155 -141 59 -318 -188 -111 -120 -83 -141 127 -244 268 3 -141 269 -248 214 -91
7547 -91 -67 134 -179 -230 -167 -158 -86 -116 223 37 98 -109 109 -47 -60 0 -283 -52 -29 349 -181 281 30 -163
7571 -163 -75 -3 105 71 -305 201 -73 247 -29 177 51 -90 51 -14 95 -88 -137 -117 101 -203 -303 -10
7593 -10 -241 -108 -37 -146 68 189 319 17 -156 303 -46 -242 -298 -110 -200 -475 188 -174 3 -40 -78 22
7615 22 -162 100 99 -174 162 -42 36 -36 -77 253 111 150 27 38 -42 133 180 -24 -33 -190 -212 17 -29 -82 -20
7640 -20 78 66 59 58 148 -41 118 37 -237 227 -161 352 358 -236 -136 199 -94 -129 -22 -136 12 4 -67 203 47
7665 47 58 -267 -200 -151 -223 38 93 509 54 147 -180 -150 -151 -45 -51 32 229 348 13 -275 151 -52 26 204 -247
7690 -247 -224 60 -108 -33 72 48 64 -355 220 -98 32 -44 -28 -138 116 -434 53 -103 196 -21 -165 -92
7712i2K23k01j9j2N3K54p9k67L62k05K48m54P4J24n7k07L1J55k8J87K1l90L57
7735G8l01P8n5K44M4j93J80m59N15k81K35j4l08J56K86j52k96K37J30n0K5j40
7757d1m5L33l32M83l73m43N09k56L65n23K70R5k61L94k74L46j84k53k1K68r4p
7779d4j88J36K61n7j98L80k93J51k51%p8m5J71n20O93m8K8m9j59M15n45L20N7
7802A37k28J07k00O17n39j20L67R4n85J40M45m16K10M2l0k24J87O3k54R9J07k98
7824b79K71k46L66k37K73K94k38m39J06m3K70m0j02N0r5L60m51R1J82pN2L3j26
7847D5k2J4j8m28L15j81K99J73k97j22K94j16o1K54j85K28j68k42J03qJ98M4k74
7870a55Q3Q3M37k57l32J2J30j41P5L2J52l40M21r6m02K37L69k93j08Q3j8N0o1
$$ plain form
7712 -92 131 -70 -89 -101 -48 206 127 -140 222 17 265 -189 -115 9 -48 -255 -224 -69 -97 90 111 -279 78
7735 78 -223 -145 -200 44 88 -105 75 -384 131 -150 85 71 -237 -81 205 53 -243 -6 124 74 99 -41
7757 -41 -86 247 -85 398 25 -418 91 -165 200 -323 -53 42 -219 175 -99 247 63 -190 -211 57 -37 -44
7779 -44 -232 -96 165 108 -90 290 -3 148 -103 -103 -181 -226 -55 -575 118 70 98 49 -110 305 -240 80 137
7802 137 -91 16 -184 433 -106 -226 141 235 -350 -210 235 -181 29 71 41 -183 4 67 -187 -88 19 -279
7824 -279 -8 -254 112 -125 148 442 204 -235 -129 -172 98 58 -44 6 -89 271 -180 -89 93 86 138 171 45
7847 45 23 37 19 -409 -94 -275 24 197 -100 -222 72 -44 -105 149 -36 192 24 -218 -115 -123 75 119 -155
7870 -155 -72 11 448 191 -141 -129 1 -140 -65 -33 119 -221 200 104 -298 -61 308 15 -93 -10 -28 22 -39
7893c9N7N9L9r9j46k2j02O00m64L41l14J8M57n45pJ86l3K94l68R4j05N9Q2n7o3
7918g8L0Qk82M28O8j30m56J51N5K4K57p3O4j55m0o2O7K18l4K14m51J68N18m88
7942B1j9J57l08K42r3j41L03l34J15jk19K88k24K61n4n1J39mkp3J8J2m9M21k41
7967A64k81Q4j43J85k1J36K38o09K19j63K59J65l91j28L53n7p7j2nj51p6N22m67
7990b56N47k38J1k77M04j76o7J10K04L1k47j74k17K62J24J3j87J75l05K81Q7R6
8012B01p0p9j69J64m39N30r1nJ75l8j97Q3j44j9J78j03r4J63J7n2p2M1K97l78
8036a01j68l7L11k8o1M21l17k22M34l10j01J43J38j03J47m62K63L7p2L34j46J31
8058B31k47J83k86L15k14L3N7k62N04k09m7J55k45O9k02M1K48J04m67J1L61l24
$$ plain form
7893 -39 18 77 116 17 -129 -151 -253 347 -117 224 -90 -72 385 -160 -167 19 -14 280 -88 6 -99 -40 42 -15 -78
7918 -78 -48 -40 -322 106 174 44 -412 -261 -206 -182 75 2 66 -89 -129 -191 -124 94 60 274 -177 -9 509 21
7942 21 2 159 -149 93 0 -141 162 -172 -57 -58 -277 11 -213 48 -6 -57 82 78 76 3 21 33 -16 405 164
7967 164 -117 -33 -176 9 -12 124 362 -247 -28 -191 68 233 -158 -286 67 10 -67 -79 -84 -235 -311 211 -256
7990 -256 291 53 64 -213 191 15 -52 58 262 293 46 -128 -345 -83 41 54 -133 42 -263 18 105 201
8012 201 131 52 -117 47 -392 138 47 42 217 179 -18 65 -79 -98 80 -23 -117 46 63 11 -61 -20 277 -101
8036 -101 -269 -306 5 -23 -84 337 20 -202 232 -78 -179 -36 102 -1 146 -316 -53 -16 -88 246 100 231
8058 231 -16 167 -119 196 -18 15 72 -190 314 105 58 213 -32 37 -165 -124 124 228 -239 -228 133 -191
8080a91J34QJ20j5j47k9p5Q2m3P7r6J74j60K15K19k47L9K64K6l69J48k53j05K06
8104a8P3j47J80j64K38L8j88j6R0j6j00K66j01o5J2j44R6O4k92J15J16j25j6J63
8128E9j13p7l66P52l01P7j98M05l71n4M36j95p7j42L95l42L30k83j42J34L0L55
8150C12m69M46n00J04N7J53k71K46J5k55M61m83L40j43K0Om02J36K52j42J63j47
8172a01KJ09p7J46l85L36O7o0l3j01J00L2j24L88r3%k26k15L06
$$ plain form
8080 -191 -57 -49 71 56 -91 -120 -195 -113 -156 -79 -175 -1 -161 54 273 26 65 329 355 -14 134 -119 -224 -18
8104 -18 55 -92 88 -76 162 200 12 -4 86 70 -30 236 135 70 82 -62 34 98 -194 -79 37 -88 -104 59
8128 59 -54 -131 -497 255 -46 31 -167 238 -133 -187 249 54 -23 -165 230 -112 218 -65 -207 -73 -43 312
8150 312 -157 289 -211 -107 -50 103 -168 78 93 -162 299 -184 156 13 33 39 -363 -227 25 -117 46 -101
8172 -101 -99 10 -67 79 -306 30 97 37 4 -97 3 35 -89 299 206 206 -20 -235 71
8191G1
$$ Imaginary data points
##PAGE= N=2
##DATA TABLE= (X++(I..I)), XYDATA
0@%%%%%%%qJ6j6J6k4L2m0M8n6P1q0Q9j08J32j52J75k06K38k70L08l51L95m48N08
31B69n70O39p17Q00q90R94j106J225j360J507j668J847k044K265k511K788l102
48a634L461l878M367m949N658o544P684r221J1413j4816K0867l4846J25495L5827
62A38884k59403j3837J14382J23912Q393j18417j47141P0138J80994M1749j39175
73D79j19972J8959J47515R1940q6944j59391j1820J34323J11638m2755j50084
84f6112p7280J18546J55710k6830j60298p2240Q4539J34063K6989j24653j20003
95a27569N1434J48779M7902j03927j19318Q804J26809Q5521o4605j33687l3996
106a13853J14628J16532l8943j40389n4132R3073J17294N36j19170r3957O0300
$$ plain form
0 0 0 0 0 0 0 0 0 -8 8 -8 8 -16 16 -24 24 -32 39 -41 48 -60 72 -80 95 -111 127 -143 165 -186 209 -239 269
31 269 -301 338 -379 421 -469 525 -581 644 -716 791 -877 970 -1074 1191 -1320 1468 -1634
48 -1634 1827 -2051 2316 -2633 3025 -3519 4165 -5056 6357 -8459 12408 -22438 103057 138884
62 138884 -120519 -134356 -19974 103938 112331 -6086 -153227 -83089 97905 139654 479
73 479 -119493 -100534 46981 138921 51977 -107414 -119234 15089 126727 83972 -66112
84 -66112 -143392 -24846 130864 104034 -56264 -128504 -43965 90098 117087 -7566 -127569
95 -127569 -76135 72644 120546 16619 -102699 -93895 32914 118435 53830 -79857 -113853
106 -113853 775 117307 78364 -62025 -116157 -23084 94210 94746 -24424 -118381 -58081
117e8081J40878K8093j19585r9429M3295J16236N0223p2183j12938j0271J14356
128B0594Q9512n7340j23778k9222R8202R7440k4039j12903o0491O8030J14181
139H0186J2480j10412q7207N1193J19918L0929r4219r3008K3217J04498N6350
150I3925o0462j05297j5393J00283Q3795m5368j08928l1095P9222Q8733r283r8875
162b8743o5854N7239J07689J4883r7286p8007L9340J01102L5328p2227r0172P394
174f9314R7735O0481n5354r7158j4341Q5598P3995l0536r4313l9258O5310Q8280
186G1125k613r2042o1581N0103R3814J5873p8894p2230K4632R0002M1885o1578
198A8496q6398K174Q7639N7639m5606q6555j8156P0956P0410j8862q6013m3169
$$ plain form
117 -58081 82797 110890 -8695 -108124 -64829 51407 101630 29447 -83491 -93762 20594
128 20594 110106 52766 -71012 -100234 -2032 95408 71369 -41534 -102025 -33995 80186
139 80186 92666 -17746 -104953 -53760 66158 97087 2868 -90140 -66923 37575 93925
150 93925 33463 -71834 -87227 13056 96851 51483 -57445 -88540 -9318 79415 70132 -28743
162 -28743 -94597 -37358 70331 85214 -12072 -90079 -50739 50363 85691 13464 -76708 -69314
174 -69314 28421 88902 33548 -63610 -77951 7647 81642 51106 -43207 -82465 -17155 71125
186 71125 68512 -23530 -85111 -35008 58806 74679 -4215 -76445 -51813 38189 80074 18496
198 18496 -67902 -65728 21911 79550 33944 -52611 -70767 189 70599 51737 -34276 -77445
210g7445N7836Q2942m58q1145n5512L9120Q1900K1794o5611p0537J5320Q2930
222C1134M2959n3891p9363j262P5446N4133l3765p7943k4274O1464O9246j3151
234E0733p9625m1227M9708P4282M138o9107n4181K8791P5496K5744n7730o7893
246f0871J1864P4766M0476m5064p0719o506O4423N4085k5527p2956k6993N5025
258g997O5238r734p0309l9546M0285O7189R568n9570n4571K2056P1106K6973n2332
271H356o1428P475O4901L9582l5351o5428j2261N7883N3130k0671o7288k6500
283e7600M7680N9560m759o1399l9977L1987O3781J3228n4532n1828J8374O3709
295B8224K6510m3635n7476K232N8563L9598k9309o0934j5002N1456N1642j6630
$$ plain form
210 -77445 -19609 63333 62875 -18270 -73782 -34662 47238 69032 3421 -67116 -51796 31134
222 31134 74093 20202 -59161 -60423 15023 69156 35391 -42552 -66826 -5362 63884 50733
234 50733 -28892 -70119 -20411 53871 58009 -11098 -65279 -36488 39008 64752 7022 -60871
246 -60871 -49007 25759 66235 21171 -49548 -56054 8369 62454 36927 -36029 -63022 -7997
258 -7997 57241 47507 -22802 -62348 -22063 45126 54694 -4876 -59447 -37391 33715 60688 8356
271 8356 -53072 -45597 19304 58886 23535 -41893 -54154 3729 56859 36188 -31100 -57600
283 -57600 -9920 49640 44881 -16518 -56495 -24508 39273 52501 -2031 -53859 -35485 28224
295 28224 54734 11099 -46377 -44145 14418 54016 24707 -36227 -51229 227 51869 35239
307C5239o1560k6524M1165N4676k40n4073m0730K6154O0789J4954n0224m7865
319d8239J4358N6629K7128l5859n5088k504N4378L9788k6106n6499j4740M4542
331b212M7728j0679n5955k8282L5524N2573K838m9863l9875K2313N5581J6926
343D6617m4271m6199J0590N2102K7134l0631n1012o017M8605L9676k1406n3350
355b8162j6049L9915M4770o457n0044l0072K9786N1542N037m6973l7372J9411
367b4668N0224J7377l7116m4603N075M9011K8976k8255m8606o194M2668L7758
379D1647j5582m9484j9010L5421M4183l707m6794k9455K5222M8272Q140m2543
391c690l7087J5634M7308J8317l2661m2588J280M5663K9383k4989m5580p551L8364
$$ plain form
307 35239 -26321 -52845 -11680 42996 42756 -11317 -52047 -25893 34896 49850 -374 -48239
319 -48239 -33881 22748 49876 14017 -41071 -43575 10803 50591 24485 -32014 -46754 -2212
331 -2212 45516 34837 -21118 -49400 -13876 38697 41535 -8328 -48203 -25890 29691 46617
343 46617 2346 -43853 -33263 18839 45973 15342 -35670 -41687 6918 46594 25188 -28162
355 -28162 -44211 -4296 40474 34017 -16027 -46099 -16313 35229 40266 -6707 -44079 -24668
367 -24668 25556 42933 5817 -38786 -33711 15300 44276 16021 -32585 -38779 3889 41647
379 41647 26065 -23419 -42429 -7008 37175 33468 -13326 -42781 -17559 30713 38853 -3690
391 -3690 -40777 -25143 22165 40482 7821 -34767 -33487 12176 41559 16570 -29010 -36561 1803
404A803L5231j1079m4536k1708L0666M3814j313m3676k8866K2052M4183J0447
416C7018l6955l7372J1139M4874K0300k9909m1375M60M1268K8521j9845m2778
428b4654j0641L4112L6159q898m2454k1531K7386M0787J763l9801k9225J8313
440a8684M1813J2426l3574l6345Q076M2130K1583k7179l9465j549L7549K8120
452C4901j6218l9817j3368L1225L5770o315m0169k1253K3628L8261M579l5879
464d655k9643J4061M0758J4057l0664l5420N669L8428K1564k2303l7608m268L3641
477C617K9121j2831l8665j4256K8148L4228l849l5956k2579J9744L6953O574l2077
490a828l0379J1418L8134J5475k7510l3586K495L5349K2626j8398l6607p088L1183
$$ plain form
404 1803 37034 25955 -18581 -40289 -9623 34191 32878 -10798 -39664 -17612 26571 37018
416 37018 63 -37309 -26170 18704 39004 9095 -32280 -31820 9448 37969 18124 -24654
428 -24654 -35295 -1183 34976 26078 -16376 -37907 -10521 30266 32029 -7772 -36997 -18684
440 -18684 23129 35555 1981 -34364 -26288 15842 37425 10246 -29219 -30768 6781 34901
452 34901 18683 -21134 -34502 -3277 32493 26178 -13991 -35244 -11616 26645 31224 -4655
464 -4655 -34298 -20237 20521 34578 3914 -31506 -25837 12591 34155 11852 -25756 -30024 3617
477 3617 32738 19907 -18758 -33014 -4866 29362 25513 -10443 -33022 -13278 23675 30249 -1828
490 -1828 -32207 -20789 17345 32820 5310 -28276 -25781 9568 32194 13796 -22811 -29899 1284
503A284K9409j1090l5679j5110K4481L2858p73l3505k3309J6537L6010Q392k9223
516B82k9938Q708L5658J5942k2940l2942k24L2438K3809j6388l4700q513K8431
529c77K8251p629l3308j6496K1227L1977J798l0624k4272J4275L3842R556k6540
542A680k8428N758L2621J7633j9995l1632l322L0347K4197j3502l2865r854K4876
555b486K7652m388l1047j8260J8868L1194L168k8168k3655J1369L1276J1318k2828
568D013k8336K871L0715J8468j7637l0596l956K7376K3528j0152l0632j2116K1845
581d609K7679j992k9392j8656J6523K9195N084k5431k3173Q051K9654J3041k0698
594E276k7527J111K8404J8586j4705k8889o100K4702K3142o997k9212j3211J9424
$$ plain form
503 1284 30693 19603 -16076 -31186 -6705 26153 25380 -8125 -31434 -14897 21113 29505 282
516 282 -29656 -20948 14710 30652 7712 -25230 -25454 6984 30793 14405 -20295 -28808 -377
529 -377 27874 20245 -13063 -29559 -8332 23645 25443 -5181 -29453 -15178 18664 28220 1680
542 1680 -26748 -20990 11631 29264 9269 -22363 -25685 4662 28859 15357 -17508 -27362 -2486
555 -2486 25166 20778 -10269 -28529 -9661 21533 24701 -3467 -27122 -15753 15523 26841 4013
568 4013 -24323 -21452 9263 27731 10094 -20502 -24458 2918 26446 16294 -14338 -26454 -4609
581 -4609 23070 21078 -8314 -26970 -10447 18748 23832 -1599 -24772 -16721 12933 25974 5276
594 5276 -22251 -21140 7264 25850 11145 -17744 -23844 858 24000 17003 -12209 -25420 -5996
607e996K7328o03k7140j8635J3802K7631O842k2403k4156O548K8135J3435j8569
620F219k6108n45K5572J8599j1411k7153q356K1918K3503n130k7417j3763J7348
633f724K5057J815k4062j9191J0433K7040P942k0671k2640M073K5995J4308j6000
646G375k4968k448K3144J9225r590k6049q618J9665K2541l807k4173j4335J3691
659h347K4642L952k2464j9364Q378K5584R077j8585k1772J921K4013J4703j3163
672H575k4175m153K1421J8612p398k3911r716J7247K1555j124k3172j4736J1993
685h982K3308M935k0382j8346O369K3172J0388j5559k2247M61K2244J5421j1637
698I145k2666n192J8821J8568n473k2149j1053J4777K1525K95k0773j5267R809
$$ plain form
607 -5996 21332 20729 -6411 -25046 -11244 16387 23229 826 -23330 -16782 11353 24788 6219
620 6219 -19889 -20434 5138 23737 12326 -14827 -23183 -1265 22238 17108 -10309 -24072 -6724
633 -6724 18333 20148 -3914 -23105 -12672 14368 22310 1639 -21001 -16928 9067 23375 7375
646 7375 -17593 -20041 3103 22328 12738 -13311 -21929 -2264 20277 16470 -7703 -22038 -8347
659 -8347 16295 20247 -2217 -21581 -13203 12381 21458 2873 -18899 -16978 7035 21738 8575
672 8575 -15600 -19753 1668 20280 12882 -11029 -20745 -3498 18057 16933 -6239 -20975 -8982
685 -8982 14326 19261 -1121 -19467 -13098 10074 20462 4903 -17344 -16883 5361 20782 9145
698 9145 -13521 -18713 108 18676 13203 -8946 -19999 -5222 16303 16598 -4175 -19442 -9633
711i633K2668N610j8248j8358M813K1180J1511j4069k0938r47J9641J5651r218
724I663k1175o490J6330J8722l472k1034j1497J3140K0206J933j9169j5654Q645
737i852K0521O896j5787j7995K812J9890J1587j1859j9829j699J7651J4773o946
750A0163j9908p643J5118J7418j682j9421j1693J1036J9426K746j7165j5091O274
763a0422J9385Q019j3921j8009J288J8985J1522j0330j8522l211J6554J4667n898
776A0107j8595q159J3347J7663j351j7523j1901R305J8369L652j5200j5019N044
789a0261J7895Q418j2817j6314R0J7017J1683q860j7412m028J4405J4998m258
802A0556j8082p796J1578J6218K14j5995j2006P893J7290M386j4005j4206L786
$$ plain form
711 -9633 13035 18645 397 -17961 -13148 8032 19543 5474 -15464 -16411 3230 18881 9663
724 9663 -11512 -18002 -1672 17050 13578 -7456 -18953 -5813 14393 16326 -2843 -18497 -9852
737 -9852 10669 17565 1778 -16217 -13405 6485 18072 6213 -13616 -15315 2336 17109 10163
750 10163 -9745 -17388 -2270 15148 13466 -5955 -17648 -6612 12814 15560 -1605 -16696 -10422
763 -10422 8963 16982 3061 -14948 -13660 5325 16847 6517 -12005 -15216 1338 16005 10107
776 10107 -8488 -16647 -3300 14363 13012 -4511 -16412 -7107 11262 14914 -286 -15305 -10261
789 -10261 7634 16052 3235 -13079 -12989 4028 15711 6851 -10561 -14589 -184 14814 10556
802 10556 -7526 -15322 -3744 12474 12688 -3307 -15313 -7420 9870 14256 251 -13955 -10169
815a0169J7043Q286j0760j6286p97J5629J1960p112j7230m671J3137J4259k716
828A0573j6236r113J0134J5814J213j4803j1590O257J6379N487j2684j4055K326
841a0298J5377R149r197j5549k136J4618J1880o084j5965n250J1752J3803j580
854A0520j5234q977Q715J5117J996j3466j1661N120J5247N949j1201j3693J132
867a0436J4758R057q005j4549k967J3083J1981m961j4484o039R833J3747o30j3900
881c512r283P702J4023K729j1931j1942M063J4270O359r892j2947K44J3277R123
895A2283o737j4022k743J1490J0965l281j3219o800R119J3081J13j3145r108O172
909e832J3696L435j1324j1071K923J3557O452q683j2493p83J2639R209n848j3324
$$ plain form
815 -10169 6874 15160 4400 -11886 -12683 2946 14906 7794 -9436 -14107 -970 13289 10573
828 10573 -5663 -14776 -4642 11172 12385 -2418 -14008 -7751 8628 14115 1431 -12624 -10298
841 -10298 5079 14228 5031 -10518 -12654 1964 13844 7760 -8205 -13455 -1703 12100 10520
854 10520 -4714 -13691 -4976 10141 12137 -1329 -12990 -7870 7377 13326 2125 -11568 -10436
867 -10436 4322 13379 5374 -9175 -12142 941 12922 7961 -6523 -12562 -2729 11018 10388 -3512
881 -3512 -12795 -5093 8930 11659 -272 -12214 -8151 6119 12478 2586 -10361 -10117 3160 12283
895 12283 5546 -8476 -11219 271 11236 7955 -5264 -12064 -2945 10136 10249 -2896 -12004 -5832
909 -5832 7864 11299 -25 -11096 -8173 5384 11836 3153 -9340 -10123 2516 11725 5877 -7447
923g447l422J0420J0963k380j2730o867Q060J2546Q25j1876r311N249J2820L834
937A0684r672j1313J975J2710O711p366j2370j143J1498R004m565j2499m204R327
951a223J0700j634j1945o766P096J1699J532j0481r304M031J2071M417q813j0783
965i403J394J1471P138o452j1589j964J0405Q974l746j1843m755Q084J1198r41
979G971j1068p117O030J1446K050r775r354L639J1308M675q079j0235K35J0862
993B588P509n497j1275k587R540Q871k928j0850n226P655J0489k75j0403p017
1007i406M486J1145K816q757r537K647J1152M991o986j0465o6R736P630m709j0791
1022f114l014Q600Q863j950j0297n473O748R791O69r587o830L848J0439K866p843
$$ plain form
923 -7447 -10869 -449 10514 8134 -4596 -11463 -3403 9143 9968 -1908 -11219 -5970 6850 10684
937 10684 1012 -10301 -8326 4384 11095 3729 -8641 -9784 1714 10718 6153 -6346 -10550 -1223
951 -1223 9477 7843 -4102 -10868 -3772 7927 9459 -1022 -10326 -6295 5776 10193 1380 -9403
965 -9403 -8009 3462 10600 4148 -7441 -9405 1000 9974 6228 -5615 -10370 -2286 8912 7971
979 7971 -3097 -10214 -4184 7262 9312 -463 -9817 -6178 5130 9805 1726 -8509 -8274 2588
993 2588 10097 4600 -6675 -9262 278 9149 6221 -4629 -9855 -2200 8289 8014 -2389 -9406
1007 -9406 -4920 6225 9041 284 -9253 -6606 4546 9537 2551 -7914 -7980 1756 9386 4677 -6114
1022 -6114 -9128 -528 8335 6385 -3912 -9385 -2637 7154 7823 -1764 -8594 -4746 5693 8559 716
1037G16q776J722R865N287n817r878r46R001P547l875j0083k999P332Q650j071
1052F675r978n515O305R108J086q580p343L063J0143L438p224q803J364R190N538
1067H467n032r613j298Q140P544l258r527l553O750Q452m95r021n991N024R412
1082F001J439p778p439K883Q860M188o276q549J56Q494O014m391r068j934P703
1097C03P404k469r338l621N807Q318J60q268o022L892R270J725p266p016K200
1112d921Q157M348n452p902m95P997N811l735q436k336O682O994j373q485m351
1127g497N216Q154M92p699n959L378Q171K663o286o984J209Q054M331m651q145
1142e553q45P715N513l127p739k675O000O677j177p055m893M376P940Q31o846
$$ plain form
1037 716 -8060 -6338 3527 8814 2997 -6881 -7827 1174 8721 4846 -5237 -8236 -904 7746 6675
1052 6675 -3303 -8818 -2513 6595 7681 -899 -8242 -5179 4964 8402 1178 -7625 -6261 2929 8467
1067 8467 3435 -6178 -7476 664 8208 4950 -4577 -8130 -1380 7072 6577 -2444 -8435 -3411 6001
1082 6001 7440 -338 -7777 -4894 3966 8154 1878 -6671 -6515 1979 7993 3602 -5466 -7400 303
1097 303 7707 5238 -4100 -7721 -1914 6404 6564 -1704 -7726 -3834 5436 7161 -105 -7121 -4921
1112 -4921 3236 7584 2132 -5770 -6265 1732 7543 3808 -4628 -6964 -282 6712 5339 -3146 -7497
1127 -7497 -2281 5873 6365 -1334 -7293 -3915 4256 6919 633 -6351 -5142 2912 7243 2592 -5553
1142 -5553 -6398 1317 6830 3703 -4036 -6711 -711 5966 4789 -2266 -7159 -2783 5157 5988 -858
1157h58n562K584P485K838n424o832P36P129M377m003p079j390O206N900j975
1172D132p669k821N346O488l34o969m505L522O746J934o168n574J606P497K999
1187F230m775o468k41O776M333l080o907j524N381N922j953o532l248M608O462
1202D984n6o041m819L049O681J829n628n355J097O812L466m388o176n42O237M681
1218E831k594o445k077M867N629q90o459l279L727O187L91n697m478K413O452
1233C578J922n072n406R53N905L674l536o350o27N743M440k131o151k253M670
1248f41N210m71o047l405L438N528J137n275m773K178O080K116m572m707L30N454
1264A580L376l140n507r80N015M481j581n623k438L966N385l79n485l510K592
$$ plain form
1157 -858 -6420 -3836 3649 6487 1063 -5769 -5033 2096 6473 2470 -4609 -5999 207 6107 4132
1172 4132 -3537 -6358 -1012 5476 5142 -1827 -6332 -2810 3936 5870 -298 -5872 -4266 3231 6230
1187 6230 1455 -5013 -5254 1522 5855 2775 -4132 -5656 -275 5647 3694 -2838 -6086 -1478 4984
1202 4984 4928 -1113 -5932 -2883 3798 5627 -1 -5356 -4259 2553 6019 1631 -4545 -5087 1150 5831
1218 5831 3237 -3208 -5285 -418 5211 4321 -2138 -5417 -1690 4497 4888 -809 -5287 -2874 3578
1233 3578 5500 428 -4978 -4025 1880 5554 2018 -4332 -4959 784 5224 3093 -3058 -5311 -641
1248 -641 4569 4098 -1949 -5354 -1916 3612 4749 -526 -5299 -3121 2959 5075 503 -4204 -3874 1580
1264 1580 4956 1816 -3691 -4671 344 4825 3244 -2379 -4817 -851 4534 4155 -1330 -4840 -2248
1279b248N556J294m814m421J357N738K419l865n126J94N203L638k598n575j381
1294d629M771M375j505n177k310L083N274q3m860l584K398N139J364m060m251
1309d055Q63N046K909l471m659p93M926L660k105n373j213L984M236n96m864k802
1325d307L138M414N68m565l520K070M611J901l714m354M16M758K661k578m587
1340c088o49L863M348k091n031j464L582M145q82m312k875L078M468P96m355l434
1356c901J642M296J807l149m206N34M090K927k402m510n34L699L536j279m451
1371a901j855L040M313o20l983k962K346M438O67l637l354J246L788K385l141
1386G70l882r8M244K827j880m392q16L093L560j102l979k065K691M058K30m049
$$ plain form
1279 -2248 3308 4602 -212 -4633 -3276 2462 4881 1016 -4110 -3916 1287 4925 2327 -3248 -4629
1294 -4629 142 4517 3012 -2165 -4475 -1392 3882 3799 -1061 -4645 -2247 2892 4256 196 -4055
1309 -4055 -3192 1854 4763 1292 -3367 -4160 766 4426 2321 -3052 -4265 -281 3955 3359 -1505 -4307
1325 -4307 -1169 3245 3813 -752 -4272 -2202 2409 4310 596 -3758 -3342 1416 4077 1499 -3088
1340 -3088 -3737 126 4474 2383 -2648 -4112 -530 3615 2733 -1579 -4454 -1376 3092 3888 -467 -3901
1356 -3901 -2259 2037 3844 695 -3511 -2977 1113 4040 1638 -2872 -3406 293 3829 2550 -1901
1371 -1901 -3756 -716 3597 2977 -1006 -3968 -1622 2816 3483 -154 -3508 -2262 1526 3911 770
1386 770 -3112 -3210 1034 3861 1981 -2411 -3227 -134 3426 2324 -1655 -3720 -1029 3029 3259 -790
1402g90k831J588M090J562l242l782J203L774J981k364l882l07L820K613j543
1417A890m146q33L004K955l65m001k020K576L777M8l531k616J356L796J282k893
1433B79l417O02L844J999k174l823l85L577L102j740l878j332K724L614p31l279
1449a018j721J355L816L74k896l243J531L442J488k482l554K90L474K311j715
1464A452l475o24K862K512q42l724j057K098L539j28l352k502J980L282N66k747
1480a60k744J029L245J729k562l042p0L574J869j694l078n05K294K807j009l214
1496a531j249K281K652L68k992k512J614L288P31k397k976O31K823K358k350k904
1512b165K0K635K101j253k766j207K876K206m88k921j574J439L331K89k928k213
$$ plain form
1402 -790 -3621 -2033 2057 3619 377 -3405 -2202 1572 3553 1189 -2693 -3000 820 3433 1890
1417 1890 -2256 -3089 -85 2870 2505 -1496 -3516 -940 2837 2885 -646 -3262 -1906 1890 3172 279
1433 279 -3138 -2536 1308 3307 1133 -2690 -3075 502 3604 1864 -2014 -3346 -622 2992 2261 -1018
1449 -1018 -2739 -1384 2432 2806 -90 -3333 -1802 1640 3128 646 -2908 -2618 856 3167 1452
1464 1452 -2023 -2647 215 2727 1885 -1839 -2896 -798 2741 2613 -739 -3241 -1261 2021 2587 -160
1480 -160 -2904 -1875 1370 3099 537 -2505 -2575 999 2868 1174 -1904 -2409 -115 2692 1683 -1531
1496 -1531 -2780 -499 2153 2521 -471 -2983 -1369 1919 2650 253 -2723 -2092 731 3089 739 -2165
1512 -2165 -2145 490 2591 1338 -1428 -2635 241 2447 1959 -962 -2536 -1097 2234 2523 -405 -2618
1528b618R86L108J140k266k922N95K801J767j591k896n11K580K254r11k919q27
1544b230J745K529m46k507j425J577K556L47k551j818P00K959J053k299k344J16
1560b038L268J221j482k628o71K501J966o02k703j150J807K483n07k183j575J177
1576a116K601O87k218k220P47K639J233j889k223K27J957J695j076k524r01K377
1592dK307p84k656j124J749K384k33k410j305J367K114L79j907j800M00K598J252
1609B327j864k552J74K298J566p69k308o80J401K369n23k290j396J464K544q1
1625A680k044j650R93J974J039j996k123P38K093J217j248k093k56J886J848q97
1641A161k088j082J745K031n37j853j261R85K182Q04k278j481L58K259J261j891
$$ plain form
1528 -2618 -1632 1476 2616 350 -2572 -1977 824 2591 1000 -1896 -2407 173 2427 1516 -1403 -2230
1544 -2230 -485 2044 1598 -909 -2334 -757 1799 2146 -405 -2223 -1523 1436 2489 190 -2154 -2038
1560 -2038 1230 2451 969 -1659 -2330 171 2137 1535 -1168 -2318 -511 1972 1465 -718 -2293 -1116
1576 -1116 1485 2172 -46 -2266 -1519 1120 2353 464 -1759 -1532 425 2120 1044 -1480 -2381 -4
1592 -4 2303 1519 -1137 -2261 -512 1872 1639 -771 -2076 -709 1405 1784 -123 -1923 -1523 1075 2327
1609 2327 463 -2089 -1915 383 1949 1180 -1128 -1808 -407 1962 1439 -851 -2247 -783 1761 1680
1625 1680 -364 -2014 -1021 953 1992 -4 -2127 -1389 704 1921 673 -1420 -1676 210 2058 1161
1641 1161 -927 -2009 -264 1767 1230 -623 -1884 -899 1283 2087 -191 -1672 -1314 945 2206 315
1657C15k122N84J812J289j018k195k29J996J219n81k250o84J340K120l24k245
1673i73r88J121K200K80j740j425L78J992Q89j433j504k43J811J445q97j903m82
1690a472J483J762m53j845j177J758J306J20k190r93J085J805O37j795j676M94
1706a151K002P51j324j353m85J625J664j198j750l29J338J754l11j924p40Q09
1722f22J676M36j785j238M02J978N19j430j419L01J998O96j214j876L69J927R29
1739A647q81j871K25Q13J436k50j718p30R08J769J10j645j371N84K190k18q67
1756A31j523L93J388P51n70j989K2J424J508n97j789o66J370J399K5j950q95Q87
1774f81K081J59j851j417J043J776O62j584j696K51J696R07p79j536n04J708J271
$$ plain form
1657 315 -1807 -1223 589 1878 860 -1335 -1564 432 1651 1070 -1180 -1864 -524 1596 1272 -973
1673 -973 -1961 -840 1360 1640 -100 -1525 -1147 845 1734 301 -1203 -1446 365 1810 913 -990 -1472
1690 -1472 11 1773 1320 -525 -1702 56 1362 1482 -708 -1701 -616 1189 1826 31 -1645 -1151
1706 -1151 851 1602 278 -1075 -1560 65 1729 531 -1219 -1548 -210 1544 1233 -691 -1431 -622
1722 -622 1054 1490 -295 -1533 -1131 847 1366 -64 -1483 -1182 816 1512 298 -1578 -1209 718 1647
1739 1647 766 -1105 -880 -67 1369 1119 -599 -1329 -421 1348 1458 -187 -1558 -974 1216 998 131
1756 131 -1392 -999 389 1140 570 -1419 -1397 27 1535 938 -851 -1517 -147 1252 1277 -673 -1568 -681
1774 -681 1400 1559 -292 -1709 -666 1110 1772 188 -1508 -1257 439 1346 567 -969 -1473 235 1506
1791A506m70j754p15J245J132K50j472j153R16J775m03p03j362M19J758J38p43
1808C64j408j29J609J006q78j740L56R28R08l12j229q23J267J334J12j582j016
1825a233N62J587L49j424o35P7J412M44j066j240M1J268Q57j70j602k41J060R62
1843A008N5j580p03Q24J580J8j360r19N41J696M10j352j362L54J294O17p78j312
1861i69K2J255R65o12j471m18J126J054j1j503p78J136J176O7j102j309P68J281
1879F77O30r89j818P60J443O40j035q63o31J177J117m75j167n62J010J270k46
1896I38j303o84J009P93L15j116j177L53J443P07j080r85j14J177Q44p94r98l20
1914i92J097P55l02j093n70N65J416J93j653n67O26J188M01r42j339Q81L15Q62
$$ plain form
1791 1506 1036 -718 -1433 -188 944 1194 -278 -1431 -515 1260 857 154 -1208 -789 969 1107 364
1808 364 -1044 -1173 436 1442 564 -1176 -820 108 1016 704 -525 -1348 -81 1253 1365 -217 -1233
1825 -1233 -671 916 1265 -159 -794 -717 695 1139 73 -1167 -1126 142 999 829 -773 -1014 46 1008
1843 1008 1063 -517 -1220 -396 1184 1202 -158 -1077 -536 1160 1570 218 -1144 -790 504 1121 343 -969
1861 -969 -947 308 1273 661 -810 -1228 -102 952 941 -562 -1340 -204 972 1039 -63 -1372 -604 677
1879 677 1307 318 -1500 -740 703 1343 308 -555 -1186 -9 1108 633 -534 -1096 -86 1184 938
1896 938 -365 -1049 -40 753 1068 -48 -1225 -872 571 1278 198 -787 -901 276 1120 326 -672 -992
1914 -992 105 860 558 -535 -1105 -540 876 1069 -584 -1151 -525 663 1064 122 -1217 -336 -21 841
1932H41p55j275N69O64R16n07j249r0P83J142o34n52o94Q01P66k7o69j235P21
1951d84J060O01q91j180M64Q04O56n52j080k19P15J078l58j355l75N92J395R8
1969I69j510J1K22Q43M15j082n75K2J369K36r50p17M6R75N49k52j158m9Q13P65
1989I42j56j484k82Q78P88j16q35o00N30Q98l4o29p91L58J433ro18p76j48P39
2009H8O51m02r48j44N39J159l37p47p31J020N85J81j158q19Q13P36L06n35o46
2028c89j97J016K92n42p82P0Q44M95l75q77P3N48M23k49j016k89N83J000Or12
2048b78l92L57R76Q3o83n48k82J036M27l77j018K7O56J006p80p35k92O08J042
2067H33q7p29p33K52J178j74o96m15l4J088K99o90o90J25O52J15J89r27k06N54
$$ plain form
1932 841 86 -1189 -620 44 960 453 -796 -886 -103 1039 405 -147 -841 -40 726 699 30 -1205 -484
1951 -484 576 1177 286 -894 -430 374 1030 478 -602 -821 -106 972 614 -741 -1116 -524 871 969
1969 969 -541 -530 -308 535 950 -132 -707 -685 684 920 -30 -747 -701 274 823 571 -587 -636 177 942
1989 942 786 -698 -980 -102 686 570 -265 -865 -335 563 529 -100 -891 -533 900 891 273 -503 -651 88
2009 88 739 337 -611 -755 -216 943 606 -141 -872 148 733 914 -244 -1063 -250 486 792 257 -389
2028 -389 -586 430 722 180 -602 -532 312 807 432 -445 -372 176 599 350 -666 -955 -372 628 634 -278
2048 -278 -670 -313 663 746 63 -485 -767 269 696 319 -699 -672 -16 990 210 -525 -817 -209 833
2067 833 746 17 -716 -464 714 540 -156 -571 -605 483 782 92 -598 -473 179 294 483 -444 -650 -96
2087i6O36k8j012P1K75P36J42j010l80K51R77J47o33p76L07P26K08n93n17J64
2107d05N70N69n88n50m57O43P38j96n66k14J82P68j14n22n31M89N56N55j137k57
2127d67J82N79L96n25n37j38O24N83m08r10l00Q44P99k27r06k00K77N17M44p09
2147h2m93M42M74L41j111J33o2P38k1j75l73l35N58N71l22p65K6M90L89k77j96
2168e0k51o4P57K86j180K18p7P45J46m36n79M8N21L52q3o60L06L37J26j78m61
2189a77l09L96O80l02m72o01P24O35k06l69m50N1N58K39k14n02R1N92j43j16n31
2210d26K06K32L02K07q06k20O07J86k0l89l37K33J023j21o40m82K9N83J13j39
2230A41j43l78L41L72j20o47K0Q22k35K6l02k00J13O76L2n95j64K3L79K04j95
$$ plain form
2087 -96 540 512 -500 -429 -154 582 724 -286 -666 -415 562 709 76 -700 -393 333 541 -52 -569 -405
2107 -405 165 734 146 -404 -861 -218 520 324 -242 -456 -274 494 380 -142 -673 -184 372 927 -210 -467
2127 -467 -285 294 690 165 -372 -510 114 697 289 -621 -921 -77 722 495 -411 -611 -334 183 627 -82
2147 -82 -575 -133 341 682 -429 -296 -358 380 359 184 -189 -524 34 605 283 -482 -456 34 423 146 -50
2168 -50 -301 -365 392 678 -502 -284 -361 384 530 94 -485 -437 84 436 353 -307 -1 336 462 284 -177
2189 -177 -486 -90 590 288 -184 -785 -61 574 368 -1 -451 -400 158 397 183 -319 -228 364 221 105 -426
2210 -426 -220 12 314 521 -285 -505 102 288 268 -121 -458 -225 798 677 37 -445 -416 167 280 141
2230 141 -2 -380 -39 333 213 -434 -414 408 173 199 -103 -303 -190 486 518 -77 -241 -218 161 365 170
2251A70q93M91M03l4j33m40j80O90N31o63l29L3M25J89Pl94k03M26J89l01k44
2272b60l89O56R7K45j97p63L59N45p2L3n40l16M85N48k27l69j68K67L31j38m33
2293c06n16P42M40km05j51K26J35Q8l79j93Q1L93K22m88k84r5P14K92k91l90j94
2315c61J70O65j11r32j01P18L86j75o07j29L74K16J77j26l04J9K93K03o4o22M
2336c07M02M75p19j86J37M38L19l30k52o24M68M65L6m06j26J53L60j6m09k85j
2357d08O71j6N2n01k43P67l6k38j97k20L39K51J87r21P7L02L85N2n10j89L42J29
2379G5K80k71m56J65J05M56k42p00M95J61j7K71n41o15P71N06q0n55l89P39M02
2400E60l16k98q3j35M66J32q9m03k01L23J66kl32J92k39M21J44m58J2j5O07l7
$$ plain form
2251 170 -723 -232 171 137 4 -436 -616 74 605 -58 -387 -354 71 260 267 -127 -330 96 285 -16 -260
2272 -260 -649 7 104 349 152 -611 -252 293 221 254 -286 -602 -117 431 204 -165 -333 -66 265 127 -306
2293 -306 -822 -80 360 358 -47 -198 28 163 251 -128 -321 -240 153 375 -113 -397 -492 222 514 223 -167 -361
2315 -361 -191 474 363 -569 -670 48 434 259 -348 -477 -103 113 290 164 -140 -121 172 375 311 -311 -307
2336 -307 95 570 -149 -335 -198 240 559 229 -23 -647 -179 286 322 -84 -210 -57 303 287 -122 -407 -408
2357 -408 263 247 299 -202 -445 322 286 48 -149 -369 -30 221 408 -513 -436 -134 251 303 -207 -396 -54 75
2379 75 355 84 -372 -207 -102 354 112 -588 -93 68 51 322 -219 -834 -63 443 363 -192 -581 158 560
2400 560 244 -54 -137 -272 194 326 237 -166 -367 -44 122 120 -212 -20 -259 162 306 -152 -140 -155 452 415
2422D15n88J5o8M38j27m09K27j6K3L69j90J7n53O25J41m19l2k25K76K9M86o05
2444a71j45K35J47J25k80j35n6M37J46m23M1l3p2M81j01m41j8O30L1O0r68j0O34
2467A14N4k3j03l38K34K41J67k20l60N04P6j34J47m52j50L50K48l9m75J11N8R0
2489A00R7l93M0j48K98M05q16k2N09K03J94l73m0m55N42L86n94J42l49K31N37
2510D94n8n87r6L74o1q1M96n77J85L2k5q7l19j05P17K12q05J46m49P51m11L49
2532I5k32k72K52L67o9n98J80N53l00J03j0l24K58o0PJ66n50K62K99L16m33j80
2554a70j9L58n6o3k81j91L22K98J28m10j76L2L06j62r2J1J18L42j58m19j30R4
2576c18M54MJ87o77N11J34j72q2j46J87j69J06R0n0p5o5K09J12l21k75K01N05
$$ plain form
2422 415 -173 -158 -226 212 85 -324 -97 -113 -90 279 89 106 -447 178 319 -100 -132 -357 -81 -52 434 -171
2444 -171 -316 -81 66 191 -89 -224 -280 157 303 -120 -79 -112 -184 297 196 -245 -263 367 398 458 -510 -520 114
2467 114 168 145 42 -296 -62 179 346 126 -234 270 346 212 359 -93 -243 107 355 316 -159 -48 10 100
2489 100 197 -196 -156 -304 -6 399 -417 -439 70 273 467 94 54 -401 141 527 -67 75 -274 -43 494
2510 494 436 -151 -247 127 66 -15 481 -96 89 121 96 9 -310 -415 302 514 -291 -145 -594 157 -254 95
2532 95 -137 -409 -157 210 141 -457 -277 276 -24 79 69 -255 3 -57 -50 116 -434 -172 127 443 10 -170
2554 -170 -189 169 113 50 -231 -422 -100 198 326 -84 -260 -228 78 -84 -176 -165 -47 295 137 -282 -412 -318
2576 -318 136 140 327 -350 161 295 123 41 -105 82 -87 19 109 59 -16 -81 128 240 -81 -356 -155 350
2598C50k09k38l50M73J51N2j60l84L59Q2J23l1n95J70K70j97J60j31k97J15K79
2619hL9jl46K07L84l39J9j40J73q4N00k20o17K82K10J4j40j73L05J65J08l67k16
2642b45M8L25K93k26l39k8n4M69l5l15q7J47K51o6j40p4k03J02M21k47j4k46J54
2665a09K25K1m04J53K70J16M0m08k63O2J31N1L86m20O25j33k49N9j17k41J97K4
2687A6k24j39K84J5j8M33l25l1k24L90j28l78P04m31K12l14J51N4l17L53J30k58
2709d5k71J74K31K02l46k35K05J91N9J5p2k81J15j45J38k70J9J65L52P5q6n85
2731c95M28kJ23J8l21J43K6J4J45j11m94M46J93M5m09j24K10k40K41K09k19J24
2753E0j40K0K93n76J63K40L0L1r9j89J62K67k07l28J62M20p3k96J48j31j30J00
$$ plain form
2598 350 141 -97 -447 26 177 229 69 -315 44 126 249 218 -377 -207 63 -134 26 -105 -402 -287 -8
2619 -8 31 30 -316 -109 275 -64 -45 -185 -12 -96 404 184 -433 -151 59 73 -67 -240 65 230 338 -29 -245
2642 -245 -197 128 421 195 -144 -172 -226 243 208 -107 -194 -47 204 138 -2 -76 -279 -177 244 -3 -17 -263 -109
2665 -109 116 137 -267 -114 156 272 312 -96 -359 -297 -166 -115 271 -149 476 343 94 153 36 -205 -8 16
2687 16 -208 -347 -63 -48 -66 367 42 11 -213 177 49 -329 375 -56 156 -158 -7 47 -270 83 213 -45
2709 -45 -316 -142 89 291 -55 -290 -85 106 165 180 108 -173 -58 -203 -65 -335 -316 -151 201 276 190 -395
2731 -395 33 31 154 172 -149 -6 20 34 179 68 -426 20 213 258 -151 -275 -65 -305 -64 145 -74 50
2753 50 -90 -70 223 -353 -190 50 80 111 12 -177 -15 252 45 -283 -121 299 226 -70 78 -53 -183 -83
2775h3J55j98j92L96J14J80o09L18J6j65M24m51j3o6J31J38J63n34K39j64M58
2796B57%q1j85k15L64k75l3l5K65j98K16r8k77L25K9j65J12k40J00o6O37k45j5
2819A77m29J08J94l5r5k49N52k80J65r2m04J99K73R3l09J17R7R6L8Pl72k45M37
2842D3j09K20%l05l9L82k9j85l57P6L95Ok45L53j52l06N68j67j60l3K50q2L1k59
2866a04J29j77L24l36J99l3R9j58N81l41l97L67q1R2k44K53m00P7K39J43l86q7
2888b41K04J57j53N8R3j60J42P1J7J86l11j24J18j03j50J96jR4N3j93r3J40K3
2911B3l22r2L92R1n8l1j78K88N8j23j14k6j81K14r8jJ50M0j21k4K09l64M70p8
2935A24RN9l95M46k20J19j09j02j3L62l23K13L7k96k00L22J42j39J81m56k2K18
$$ plain form
2775 -83 72 -126 -318 78 192 372 -237 81 97 -68 356 -95 -108 -174 -43 95 258 -276 -37 -201 257
2796 257 257 176 -9 -224 140 -135 -168 -203 62 -136 80 -18 -295 30 59 -106 6 -234 -134 -200 437 192 177
2819 177 -252 -144 50 15 -80 -329 223 -57 108 16 -388 -189 84 177 -132 -15 82 178 216 223 -149 -394 43
2842 43 -66 154 154 -151 -190 192 163 -22 -379 -303 92 98 -147 206 54 -252 316 149 -11 -44 206 124 155 -104
2866 -104 25 -152 172 -164 35 2 101 -57 524 183 -214 153 72 164 -80 173 -227 -150 89 232 -154 -241
2888 -241 -37 120 -33 25 118 -42 100 171 188 374 63 -61 57 -46 -196 0 -1 93 146 -47 -140 0 23
2911 23 -299 -391 1 92 34 3 -175 113 171 48 -66 -92 -273 -59 -157 -158 -8 32 -89 -113 96 -268 202 124
2935 124 133 192 -203 243 23 142 33 -69 -82 280 -43 170 207 -89 -289 33 175 36 217 -239 -261 -43
2957d3k81K96N8K40l42l7K21j90N7P8M4l13J82j70J45n7K02L7QN8j11j76J48M0
2981I4J73k74K31j41j63J40k5m2o4M5j48K85K3J45Nl11N23n39j18J74K45q2k85
3004a09Q6O5J3j76J86L1L8j27J34n30M1L20M2J8kp7K92j33q4k97O72m85J81J7
3028A16J0q0l13L13k58M00k04k4K51k06q1K36j8l32M26m00j6O42m44J73m30K19
3050b0R0J77pl25j15J50M11m32q1K87k94J32j4j16j50M77l49N00m07O4L37m27
3072a12K8L3J36m28J38K32n4j38M17K2l11Q3l47K55P8j53kL83j66l17K05J18k7
3095G3k18Q0J97j44K64k71q5O9L47m24J14j70K18O5K2j86K20k09J5M0L5j65j63
3118b76M31J52Mj61k06m6J79j73j40J57J1J55j86l72O07J2N3N3k04k27N5J05j2
$$ plain form
2957 -43 -324 -28 30 270 -72 -109 112 -78 -21 57 101 -212 -30 -200 -55 -112 90 127 135 193 82 -94 54 94
2981 94 267 -7 224 83 -80 60 35 -7 -71 -26 -174 111 134 279 284 -27 496 -43 -161 13 258 176 -109
3004 -109 -23 42 55 -121 65 96 134 7 141 -389 -348 -28 14 32 30 -47 245 112 28 -269 403 -82 99 116
3028 116 126 46 -267 46 -212 188 -16 -40 211 5 -76 160 142 -190 236 -164 -180 462 18 191 -239 -20
3050 -20 70 247 240 -85 -200 -50 361 -71 -152 135 -159 -27 -41 -157 -307 170 -179 321 -86 -22 315 -112
3072 -112 -84 -51 85 -343 -205 27 -27 -165 252 274 -37 46 -301 -46 32 -121 -123 260 94 -223 -18 100 73
3095 73 -145 -65 132 -12 252 -19 -104 -35 312 -112 2 -168 50 115 137 -49 171 -38 -23 17 52 -113 -276
3118 -276 155 307 311 150 -56 -102 77 -96 -236 -79 -68 87 -99 -471 136 148 201 254 50 -177 -122 -17 -29
3141b9L21l78N8j16j22l4L33l43N07L5lk81J17L75j01j62l0l59jK60l6k45J34
3164a00L33k72j70L26K7o36O22m28N36J25l28J6j70O8K00K6j59J33r9l6m3L08
3186B79l00p0K04l4J95k30j34k28K48j38J46J11mJ17j41j15j29L1M09k72q9K9
3208a15J10R8k49L21j71J43j12Q9k87K58J40l04j07J90j26K76l29J26J26J27k55
3229e1j37L27j28m1j75J59j05R4R7m30n6O21k79L8j45Q0Q9J83N1j4l42K16J75
3252B27k50K8l38L15k79K60K43j73k44K51j15k7O0j6n9j23K65q0Q9P7q5k01L03
3275A28k87N01j92k25L7k1L29l48K12j3%l37L44J52l40L11j72j0k29K98j71K20
3297A87m1l51M25l43J97P0j19J71l38K76k68J95j52M3O2L6o5j53k1j18L30m24
$$ plain form
3141 -29 292 -86 -28 -144 -266 -300 33 -310 197 232 229 -52 65 440 339 177 147 -212 -213 47 11 -234 -100
3164 -100 233 -39 -209 117 144 -492 130 -298 238 363 35 51 -119 -51 149 175 16 149 50 14 -29 279
3186 279 -21 -91 113 79 274 44 -90 -318 -70 -208 -62 49 45 162 21 -94 -223 -192 217 -55 -144 -115
3208 -115 -5 93 -156 165 -6 137 25 114 -173 85 225 -79 -186 4 -122 154 -175 -49 77 204 -51
3229 -51 -188 139 11 -30 -205 -46 -151 -57 40 -390 -446 175 -104 -66 -211 -131 -42 141 192 178 -164 52 227
3252 227 -23 5 -333 -18 -297 -37 206 33 -211 40 -75 -102 -42 -58 -117 -240 25 -55 34 111 26 -175 128
3275 128 -159 342 150 -75 -38 -59 270 -78 134 121 121 -216 128 280 -60 251 79 69 -160 138 -33 187
3297 187 146 -205 220 -123 74 144 25 196 -142 134 -134 61 -91 -48 14 50 -15 -168 -189 -307 23 -401
3319d01L19l2J02J29m13M4K58K36k36P9k1l45J47J81l68N97l69k30M10J3j16K11
3341A95m0l82L48m66L46j0O7J07m7l5O5j13m63L64P9l0j59K74m8l3K62j79n3j13
3365f4O5J38k51r5K13lK88k82P2j58j53M39k96K39j07r7L88j24l28J48N2P1L5
3388A90N5k75q5L23l15K29k15L9L8n0M13k66J24j23l07K59j85k1K81m6J80l85
3410a42K69J50j91n1R3k23L1K40l86L37m32L05j89j83P9K50R0j84L81n21J79J82
3432H4l30M4qL21J36l32L81j40j76j24K97l73J45M34m94L14lK0k92O2j47J48P0
3455C7J71k25k93M15l83L14o5J98j19l36K23L9r3L97l07J32j77j1m1L42m36L38
3477A20l15K98J3M5k31L2L4J28m4M0N4p6J08j02q0l8K4j8l77L66o3J31k0k1L1
$$ plain form
3319 -401 -82 -114 -12 117 -296 -252 6 242 6 85 64 -281 -134 47 -321 276 -93 -323 87 100 -16 195
3341 195 155 -227 121 -345 1 -9 58 165 118 83 148 35 -428 -64 15 -15 -174 100 52 19 281 102 49 -64
3365 -64 1 139 -112 -207 6 3 291 9 81 -77 -230 209 -87 152 45 -52 336 212 -116 32 84 155 190
3388 190 245 -30 -115 208 -107 122 -93 -54 -16 -66 347 81 205 82 -225 34 -151 -172 109 63 243 -142
3410 -142 127 277 86 35 128 -95 -64 176 -210 127 -305 0 -189 -372 -293 -43 47 -137 244 -277 -98 84
3432 84 -246 -202 -210 111 247 -85 296 156 -20 -144 153 -220 -75 359 -135 179 176 196 -96 -34 -181 -33 37
3455 37 208 -17 -310 105 -278 36 -29 169 50 -286 -63 -24 -117 280 -27 105 -72 -83 -124 218 -218 120
3477 120 -195 103 116 161 -70 -38 -4 124 80 120 174 98 206 104 24 -14 10 -8 -385 -19 -82 49 29 8 39
3502C9O2k51J11L4P5k25J07Np3J15K27k76P5k78M5L87k40k7K27Kj74p2%K36j12
3527A9k08R8J23p7J34J0k26L9j19L07q0J68n3J5j85L8O6m6L4l45j75M60k61L17
3551E3K6o0k25L32j12j57K00j45LL7o7J35L28k12k14L88j59k28J17j99J40j21
3573a40L47l06O3j32RP2J76j90o4J90k29j15M24m36J98J25l10M95j32k02K28j74
3595a03k8J95k13J43M9K84k33l25L09L0k80j6J05J22q8k7L0ro8j20N10o0k96J75
3619H6J02j24l18K28J77m10L00j56J41k30J24L01l34K13k0j08j63J61J12k88k03
3640d09K52L62n56L16P6J22m1j69P5k5l65M77j88p5J39J47q0J78k30J77r6l57
3662b70K53l0P1K17k90K99J19n24L01J5K11l07K46k98K7q6M1k11j00M35q2pj38
$$ plain form
3502 39 101 -150 -39 -5 70 -155 -48 -43 -116 -1 226 -50 25 -253 -208 179 -61 -88 139 141 -33 -105 -105 131 19
3527 19 -189 -91 32 -45 89 99 -127 -88 -207 100 20 188 135 150 -35 3 69 23 57 -288 -463 -3 -264 53
3551 53 79 19 -206 126 14 -143 57 -88 -85 -48 -115 20 348 136 -78 310 151 -77 40 -159 -19 -140
3573 -140 207 -99 -36 -168 -159 -87 89 -101 -165 25 -204 -319 105 -331 -133 -8 -318 177 45 -157 71 -103
3595 -103 -131 64 -149 -6 43 327 94 -231 78 108 -172 -188 -83 39 -49 -76 -46 -55 -123 -243 267 207 -89 86
3619 86 188 64 -254 -26 151 -259 41 -115 26 -204 -80 221 -113 100 80 -28 -191 -30 82 -206 -409
3640 -409 -157 205 -351 -35 41 163 122 -47 28 3 -362 115 -73 -148 -9 138 58 236 6 183 87 -270
3662 -270 -17 -47 24 241 -49 250 369 -155 146 161 372 65 311 13 40 -46 -5 -216 -316 119 37 30 -108
3685a08J37o9K05k42K45l22k2N56m17j2m9J9J3j18K66K15n00J53L38k68k81J49
3707a12L6k7N4J49j6J2j05K30k78J78k95p5J55J0M17l13J6J37N4k36r1o3Q7K39
3731A63m28K36j22K51k98p9J09L10k95L38m93K48J05j9N3j77L28j74j6K18k27
3752C1k72K00J62k52J54j79p1j13L06J45j05j44J86J13J5m13j09M00n8J68m02
3773b38j5L87m14K10l2Jr7J72J9j45N4O7J45j37k32J64R3j86K67nj90R7m8LN7
3798cJ35l02J69l6Q4k88K31j4J01q3q2O1J81j05J35j57l32M01j07k74K81L54o36
3821b86K39O4n5j26n8L29k21L06M28n63j12Q1j20j77M83k20j75J23J3M9M2N6j03
3844cL0l15M72l6r7J76j65r5oL46l07J31k80K73N9k66K80m0m94L68N9m4k0j79
$$ plain form
3685 -108 29 -40 165 -77 168 -154 -176 380 -37 -49 -98 -79 -66 -184 82 297 -203 -50 288 20 -261 -112
3707 -112 -76 -103 -49 100 84 96 -9 221 -57 121 -174 -249 -94 -84 333 20 36 173 227 -9 -100 -163 -76 163
3731 163 -265 -29 -151 100 -198 -277 -168 142 -153 185 -308 -60 45 26 79 -98 230 56 40 258 31
3752 31 -241 -41 121 -131 23 -156 -227 -340 -34 111 6 -138 48 161 176 -237 -346 54 -4 164 -238
3773 -238 -253 134 -280 -70 -102 -101 -198 -26 -7 -152 -98 -31 114 -23 -255 -91 2 -184 83 78 -112 -15 -63 -60 -3
3798 -3 132 -170 -1 -37 47 -241 -10 -24 77 -6 -88 -27 154 49 184 27 -305 96 -11 -285 -4 350 -286
3821 -286 -47 17 -38 -164 -222 107 -114 192 620 57 -55 26 -94 -271 212 -8 -183 -60 -47 2 44 100 -3
3844 -3 27 -288 184 148 51 227 62 -33 -39 307 0 131 -149 124 183 -83 197 157 -337 31 90 46 26 -153
3868a53K17j47J60j33l1K18l18K01l6m4k71M90k75L16l9k38K5j14L08j47j22L30
3890A97j94j90j42L50K7Q0l80J02J15K31L2k01K39k47J50j3k31R8j00n0K13q7
3912aK9P4O1j48J92Q1r2l20j1J39J71k66K65k41J35L02n75J19L8k25K89j12Pq1
3936a70K53k75K76J75m94K71j85K88J14l91m4J20J22j62q3J78q7K50N0l88K59
3957G7J32k52pq7L97n32J23Q0J5J65k78L97l08j34J74m9L2K58j50l58L03j34L13
3980A77j45J05j54J7M9j4N0k92N28m22K58k11L3k63K39J7N7l8P0j47%J7L3K3K0
4005Gj9K31j83m16L81K37P2j79j11k1k80J77L54l91K67J32l80K59k45J1o2J13
4027d6o6J66j24Q3j68J15j44L12m45J23P7lJ47K1R5k38Q8L0k87J21L23q1k26K15
$$ plain form
3868 -153 64 -83 77 -56 -87 131 -187 14 -22 -66 -337 153 -122 194 155 -83 -58 -172 136 -11 -133 197
3890 197 3 -187 -329 21 48 128 -252 -150 -35 196 228 27 266 19 169 156 -75 23 -77 -127 86 -1
3912 -1 28 102 163 15 207 288 196 -124 -135 4 175 -91 174 -67 68 370 -205 -86 -48 -273 16 -96 -89 -170
3936 -170 83 -192 84 259 -235 36 -149 139 253 -138 -182 -62 60 -102 -185 -7 -94 156 206 -182 77
3957 77 209 -43 -50 -137 260 -272 -149 -69 -54 111 -167 230 -78 -212 -38 -87 -55 203 53 -305 -2 -136 177
3980 177 32 137 -17 0 49 35 85 -207 321 -101 157 -54 -21 -284 -45 -28 29 -9 61 -86 -86 -69 -36 -13 7
4005 7 -12 219 36 -380 1 238 310 131 20 -1 -281 -104 250 -141 126 258 -122 137 -108 -97 -159 -46
4027 -46 -112 54 -70 13 -155 -40 -184 128 -317 -194 -117 -120 27 48 143 -95 -7 23 -264 -143 180 99 -127 88
4051H8k68J68k0q7J12K2n9K51k18j66K0J39K38k79K01K53l62J99l43P8pj4L9J21
4075A06l53K46K74k63j53p0J31RL52k07L3j66m4Q7J45j2k63l9l0K34K30k66j58
4098a77J83j38K89l41N3M13j45l33L56j09K67l39L6k9k8k8J61J84l53j30M05j76
4120B1j31K6p0O5O3j19K87K9m29J81P9K6L41m39n9J83j49K29k92j31K17n4O2K7
4144c7J88J4k29O6j0J37k03J03j68J34j83K32k56L32j85J36q0K20N6q4l40K82
4166A25k31j19K37J78l71J94P6o9j09j9K19J08l89J40j90K94O3k26p2R5L34j84
4188H4j03L73k49l28P9K49j3p0j15M9K75j64M5k62K32k20L37O3k42j03Q1K76k95
4211b1L4m4K03n7p7j34N1O6K34l70k01J72R1M10l32J16r8j29J28J73l28K24j90
$$ plain form
4051 88 -180 -12 -32 -119 -7 15 -44 207 -11 -177 -157 -18 220 -59 142 395 33 232 -111 -33 -40 -54 -15 106
4075 106 -247 -1 273 10 -143 -213 -82 -73 279 72 105 -61 -105 -18 127 115 -148 -187 -217 17 247 -19 -177
4098 -177 6 -132 157 -184 -131 282 137 -196 160 51 318 -21 15 -14 -42 -70 91 275 -78 -208 197 21
4120 21 -110 -84 -154 -89 -26 -145 142 171 -258 -77 2 28 369 -70 -129 54 -95 134 -158 -289 -72 -126 -64 -37
4144 -37 151 165 -64 2 -8 129 -74 29 -139 -5 -188 44 -212 120 -65 71 -9 211 267 183 -157 125
4166 125 -106 -225 12 190 -181 13 89 20 -89 -108 111 219 -170 -30 -220 74 137 -89 -161 -66 268 84
4188 84 -19 354 105 -223 -144 105 92 22 -93 -44 231 67 112 -150 82 -138 199 262 20 -83 -2 274 -21
4211 -21 13 -31 172 115 38 -96 -45 21 255 -115 -316 -144 -53 357 25 141 43 -86 42 215 -113 111 -79
4234g9j18K17J25j19j0J56k63L1qJ55N3k45K28k16m03K86L11p1k33P9K5J20K67
4257B88k81K3l17O26k28k50K34l60J29P3n7p1K38%j99J46mj23J83k10J04k35K63
4280b8K31j69k7j54K67l63K06R1l1l05O39l62k01K70k38r0k3N95k12k36q0J82
4302c8M6J47k27J60J39l59K82k26L13k29l12L92p5l79K81K97k98K02j80j16L16
4323A36k66o8M92J69n27l4K69m7j53k01J90o2K54j62k34N62J24l00j04k1j45J48
4345B0o6R3j19K30q6J00k18j6j43K37J97j04l17j0L02o8k2j16m2Q1K41k40JQ6
4369B1n3J91j99P2J5j28L16L6L3j68j85l1r1J81j92J85l6L83om45J58K2m4Q7J13
4394B35m47L40j60J67j61J3j68N8O1L39l94P5J12j61j20L2J27J30j28O8J70m42
$$ plain form
4234 -79 -197 20 145 26 16 172 -91 -60 -68 87 140 -105 123 -93 -496 -210 101 30 -203 -124 -99 21 288
4257 288 7 30 -287 339 111 -139 95 -265 -136 -63 -120 -191 47 47 -152 -6 -10 -133 50 -160 -56 -291 -28
4280 -28 203 34 7 -147 120 -243 -37 54 23 -282 357 -5 -206 64 -174 -264 -287 308 96 -140 -220 -38
4302 -38 8 155 -72 88 227 -132 150 -76 237 8 -304 88 13 -366 -85 212 -86 116 -64 -180 136
4323 136 -130 -198 294 463 -64 -98 171 124 -29 -230 -40 -102 152 -10 -244 318 442 142 38 17 -128 20
4345 20 -46 47 -72 158 72 172 -46 -62 -205 32 229 125 -192 -202 100 32 10 -106 -148 -67 174 -66 -65 21
4369 21 -32 159 -40 32 47 -81 235 271 304 136 -49 -80 -171 10 -182 3 -33 350 344 -101 57 79 35 122 235
4394 235 -212 128 -32 135 -26 -13 -181 -123 -62 277 -117 -42 70 -91 -211 -179 -52 78 -50 18 188 -254
4416b54O43l33K0Rn1n3N2J40l9l66J57K19j17K47p00N66l49O1L02l26rJ08J18
4439D5j8j21k4P0o0P5j56o1L62N5j89p3o2j9L34q2k11K04k11P7K00o23M01n1L8
4464a00K17k35M0K74j1j39R6k74n2L2J72j25K33J72k93k17L37j64K2j48n0K92
4486G9J44m52K97K5q2J77k94r3L03j81J96k25J6M55m93K64j39j8P5k8K66k89J51
4509A54k33K29j38j32K03j00j89J95Q1L4k72L46j88k4J87o1j83o0N98o37O7J06
4531a7J67L2k48k14K88J3N2m0N2k21m9J65J97J3k46N5m2J12k4k70j48M03j45P5
4555d0K5J32jj01q0p9J81R1l06L09p7k8o8J91j35j29l00L35J53N7j22J41n00L96
4579D5k2O9q0J57K7j52j83Q8J49J8j15J6k22M33r6j66K97m10k8J25L56k91J3j85
$$ plain form
4416 -254 389 56 76 85 34 -19 33 173 134 -232 -75 144 27 274 -426 140 -209 -148 154 -172 -181 -73 45
4439 45 27 -94 -118 -48 -108 -33 -189 -250 112 167 -22 -95 -157 -176 158 76 -135 69 -142 -65 135 -488 -87 -138 -100
4464 -100 117 -118 -78 196 185 46 142 -132 -184 -152 20 -105 128 300 7 -210 127 -37 -15 -163 -213 79
4486 79 223 -229 68 93 11 188 -106 -199 104 -77 119 -106 -90 365 -128 136 -3 -21 54 26 292 3 154
4509 154 -79 150 12 -120 83 -17 -206 -11 70 104 -168 178 -10 -34 153 92 -91 -151 447 -190 -123 -17
4531 -17 150 182 -66 -280 8 21 73 33 85 -136 -185 -20 177 190 -56 -1 -43 69 45 -225 -373 30 -115 -40
4555 -40 -15 117 116 15 -65 -144 37 128 -178 131 54 26 -42 149 14 -115 -415 -80 73 130 8 149 -351 45
4579 45 23 92 12 169 196 44 -139 -51 98 116 1 17 -205 228 132 -34 263 -147 -175 -50 306 15 28 -157
4603a57J55P2j53oj80NN49o6k20j97Q2L21k72M96o76J2K38R9J6j91j53M1N4J58
4627B7m3Mj00N6K83m79J60Q1K13k73O0j4k2J03m5Q8J01j22j47J1K12K4m35K75
4651A8M6n9K91j45l43n5J73K89j62J3j09K46m09m9J19J83j13J94l89K33j56J1
4673a73N4R8lJ66k91J20J26j07n2K06K14p6k39J74m16L91L9m22n8M83j26l78N47
4696B77n24L10m0J23m8l1K15J03J7j87n9l18J76M6N5l62J93J2p4K71o7k86j46
4719c44L73kK7J60m09L49J20m43K98l39M65m66L45j35j30J46p8l6J13l9l7k66
4741c28N38k50m3j08K54J5k35o4J32J28k80M96m00Q9j22L28q4j53j33J94l5k3
4763h4j00O0K03k02N7j19M50q7l4j45O4r1K35j36Lj6KM0j73K9J46k53N96l46n0
$$ plain form
4603 -157 -2 70 -83 -89 -269 -264 285 219 -1 -198 -116 205 -67 429 -247 -235 3 102 118 -73 -226 -185 -131 27
4627 27 -16 -12 -112 -56 227 -252 -92 -11 202 -71 -11 -25 -47 56 11 99 200 78 -69 -58 154 178 -257 18
4651 18 64 5 296 151 -192 -247 -74 215 53 66 -43 203 -206 -255 -136 47 -66 128 -261 -28 -184 -173
4673 -173 -119 -21 -24 142 -149 -29 97 -10 -62 144 358 282 43 217 -199 192 231 -191 -249 234 108 -270 277
4696 277 -247 63 23 146 98 67 282 385 402 215 156 -162 14 60 115 -247 -54 -42 -116 155 88 -198 -344
4719 -344 29 27 54 214 -195 154 274 -169 129 -210 255 -211 134 -1 -131 15 -63 -99 14 -25 -62 -328
4741 -328 210 -40 -83 -191 63 78 -157 -221 -89 39 -241 255 -145 -56 -178 150 66 -87 -220 -26 -61 -84
4763 -84 -184 -124 79 -123 -66 -185 265 178 144 -1 63 -28 207 71 74 58 60 100 -73 -44 102 -151 445 99 49
4788D9Q9K0k32R0L59k77n2k63J44J36L9j80N8k69N45j09k51M7q1l8j95N22k43
4811i2J22j70M16k26j2l24L02M3p9K01l64qJ72L29n38R7m3J08J77N4l13L14n9
4834A07o3L1k10j37K61P4mj2m12J15M81j83j82l2J93l76N41O9k82L18l19K02j26
4857E4J53k13p1qN7J39k66J53L7K74N0m55J93J20j66K06k71K68j32l5j93m5O0
4880i1M70j53k2l05R3J42k58L39kk75P1J15p2j73M86m26k28L72j36K46j89l32
4902c28K92P8k79J75J19n2J01j70k0R4K01k85K10k98J12K12j5L3k46m1q6J60k68
4925c01M94j97j96J25K46m7j37o5O5j89K84j41k42L95j89K28J2N9j67J05l25P0
4947a13n5L30r6J94k12J79Nk65r4j71M18%L4R4m1k79QL00k26J99k77Q4j40mK8
$$ plain form
4788 49 138 158 -74 16 375 98 46 -217 -73 63 102 -78 -20 -289 256 147 -104 -57 -138 -176 -371 151 -92
4811 -92 30 -140 276 50 38 -286 16 59 -20 181 -183 -191 -19 310 -228 -131 -174 -66 111 165 -148 166 107
4834 107 44 75 -135 -272 -11 63 59 47 -365 -250 231 48 -134 -166 27 -349 192 261 -21 297 -22 180 54
4857 54 207 -6 -77 -85 -28 111 -155 -2 35 309 359 -96 97 217 51 257 -14 254 122 87 -106 -151 -91
4880 -91 379 226 204 -101 -8 134 -124 215 213 -62 9 124 52 -121 365 -61 -289 83 -53 193 4 -328
4902 -328 -36 42 -237 -62 57 5 106 -64 -84 10 211 -74 136 -162 -50 162 147 180 -66 -107 -193 -33 -301
4925 -301 193 -4 -200 -75 171 124 -13 -78 -13 -202 82 -59 -301 94 -95 133 145 204 37 142 -183 -113
4947 -113 -168 162 66 260 48 227 232 -33 -127 -298 120 120 154 248 207 -72 -64 236 10 209 -68 16 -124 -128 -100
4972a00o4J41r0N2l7nM6J76j70L75m10M01n02L44j22l24K5L02k43j04K96pJ4j68
4996a74J95P4K21l99J17K5k1k67J48K03k22J0Q0L4J29j27l5K66l95k72N33L30
5018D53l74MP8k56L5K1Q2m7J30j62J82O3l24J28j00nK93j23k85J56K10N2k32r3
5042a14K45o7Rl8r8L1K54l90K22q5lQ1r9R0J60l18J47k3o2j07J61K53o9k58M3
5067c5J19l20L04k41K63nr3K06j53j85OJ00L31k14k35k7J54J53J93m10J50MJ97
5090B62J36n65K47k07J17J53J02q2l04L3J34J66k54j57Q9k37O16j61j98o0K45
5111G5J19l87J45k13M94l8j34j24K04k73r2J61Q7P6l16L64k98J26j77J80k04J25
5133a00p6L35j78j29M8K38k54M5L18O6j78o2j67j68K37j03k0K6M86m29L8k1k95
$$ plain form
4972 -100 -164 -23 -113 -61 -98 -103 -57 119 -51 324 -86 315 -187 157 35 -289 -264 38 -205 -309 -13 -20 -6 -174
4996 -174 21 95 316 -83 34 59 38 -229 -81 122 -100 -90 -10 24 153 26 -9 257 -138 -410 123 453
5018 453 79 83 161 -95 -60 -39 43 -4 126 -36 146 209 -115 13 -87 -92 201 78 -207 -51 159 211 -21 -114
5042 -114 131 64 73 35 -63 -32 222 -168 54 -31 -34 47 -52 38 198 -120 27 4 -58 -165 -4 249 180 -78 -35
5067 -35 84 -236 68 -173 90 85 -8 198 45 -140 -134 -34 297 83 -152 -179 -25 128 321 -89 61 65 262
5090 262 398 -167 80 -127 -10 143 245 163 -141 -108 26 192 -62 -219 -130 -367 249 88 -110 -170 75
5111 75 194 -193 -48 -261 233 195 61 -63 141 -132 -224 -63 24 100 -216 148 -150 -24 -201 -21 -225 -100
5133 -100 -176 159 -19 -148 -100 138 -116 -71 247 313 135 73 -94 -262 -25 -128 -148 -122 364 -65 -27 -48 -343
5156c43N3K74J30Q2k67Q1K07o13N59Mj87M4j95K12m4j67o2K84j93K36k07J04M3
5179C5M8p4M71m32J84J43m42nj57K01r4M44j45O3k65j14j34J27j29N11l62J68
5201D2j34O1J15k36K31q5o1ok71J25L95l42J65q9L00j47o02L65J33J74k53K99
5223A79r9Oj08l99M37l05NJ71J85k43M31m30M27j69j80J96m11L54o6Nj13J10Q0
5246F3K9J47j50m8J90j47K3k27K55O7j0j09Rj65K78l88MJ74j18k09L92K0%n7N5
5271G8J14k95o6n8L59p0M2Kr5K43l06J21p2J99j13j29K19Q5l46J20J26j12K45
5294B91l58K19k06N9p8l32K86J3L22O8L4o5l12K84j41k52J88J5j9j70P3Q1L28
5317C28p2j85O0l70J01M7O8o9J69L12n94P8K04k9l9j42L10l04K81k84J66l4K80
$$ plain form
5156 -343 -290 -16 114 196 -71 10 217 -396 163 167 -20 24 -171 41 -3 -170 -232 52 -141 95 -112 -8 35
5179 35 83 9 480 48 232 375 -67 -72 -229 -28 -122 322 177 240 -25 -139 -273 -146 -275 236 -126 42
5201 42 -92 -31 84 -152 79 -6 -67 -73 -344 -219 176 -166 -1 -90 210 63 -539 -174 -41 133 -120 179
5223 179 80 86 -22 -421 16 -289 -284 -113 72 -171 260 -170 257 88 -92 104 -307 47 -19 -14 -127 -17 63
5246 63 92 239 89 41 231 84 107 -120 135 202 192 83 92 -73 205 -183 -179 -5 -123 -332 60 80 80 23 78
5271 78 192 -103 -169 -227 132 62 104 106 11 254 -52 69 -3 196 83 -46 173 258 -88 32 158 46 291
5294 291 -67 152 -54 5 -73 -405 -119 -106 216 284 318 253 -59 225 84 -168 20 35 16 -154 -81 0 328
5317 328 256 71 131 -239 -138 -91 -23 -92 77 389 -205 -127 77 48 9 -133 177 -127 154 -130 36 2 282
5340B82j53k33j58J03J30m0j00J1J55j03J93J1lj32J55oK0k00K03J94l75J51l62
$$ plain form
5340 282 129 -104 -262 -159 -29 -69 -169 -158 -3 -106 87 98 95 -37 118 112 132 -68 135 329 -46 105 -257
$$ [...]
8191A8
##END NTUPLES=NMR FID
##END=
