##TITLE=1H_DE-44EA_W
 D2O
 8 sc, 
 5.4.2024
##JCAMPDX= 6.0         $$ Bruker NMR JCAMP-DX V2.0
##DATA TYPE= NMR FID
##DATA CLASS= NTUPLES
##ORIGIN= UXNMR, Bruker Analytische Messtechnik GmbH
##OWNER= root
$$ XWIN-NMR		Version 3.5
$$ Fri Apr  5 13:44:05 2024 Russian Standard Time (UT+4h)  she@DPX200
##.OBSERVE FREQUENCY= 200.1309
##.OBSERVE NUCLEUS= ^1H
##.DELAY= (6, 6)
##.ACQUISITION MODE= SIMULTANEOUS
##.ACQUISITION SCHEME= undefined
##.AVERAGES= 8
##.DIGITISER RES= 18
##SPECTROMETER/DATA SYSTEM= spect
##.PULSE SEQUENCE= zg30
##.SOLVENT NAME= MeOD
##.SHIFT REFERENCE= (INTERNAL, MeOD, 0, 15.7039)
##AUDIT TRAIL= $$ (NUMBER, WHEN, WHO, WHERE, WHAT)
$$ ##TITLE= Audit trail, XWIN-NMR		Version 3.5
$$ ##JCAMPDX= 5.01
$$ ##ORIGIN= Bruker BioSpin GmbH
$$ ##OWNER= she
$$ F:/spectra/data/she/nmr/H-F/1/audita.txt
$$ ##AUDIT TRAIL=  $$ (NUMBER, WHEN, WHO, WHERE, WHAT)
(   1,<2024-04-05 13:42:51.48 +0400>,<she>,<DPX200>,
      <created by zg, POWCHK disabled, PULCHK disabled
       configuration hash MD5:
       00 E9 B6 7A A2 85 ED C7 34 08 36 98 17 FE 4E 26
       data hash MD5: 16K
       82 71 67 75 D0 03 F3 F1 2C FB 74 E0 E6 E6 35 FB>)
$$ ##END=
$$ 
$$ hash MD5
$$ 92 49 B5 EC 1D 1D E2 94 EA 8C A5 E7 F8 7F 91 BC
##$RELAX= 
##$RELAX= 
##$RELAX= 
##$RELAX= 
##$RELAX= 
##$RELAX= 
$$ Bruker specific parameters
$$ --------------------------
##$DU= <F:/spectra>
##$EXPNO= 1
##$NAME= <H-F>
##$PROCNO= 1
##$TYPE= <nmr>
##$USER= <she>
##$AMP= (0..31)
100 100 100 100 100 100 100 100 100 100 100 100 100 100 100 100 100 100 
100 100 100 100 100 100 100 100 100 100 100 100 100 100 
##$AQSEQ= 0
##$AQ_mod= 1
##$AUNM= <au_zg>
##$AUTOPOS= <>
##$BF1= 200.13
##$BF2= 200.13
##$BF3= 200.13
##$BF4= 200.13
##$BF5= 200.13
##$BF6= 200.13
##$BF7= 200.13
##$BF8= 200.13
##$BYTORDA= 1
##$CFDGTYP= 0
##$CFRGTYP= 5
##$CHEMSTR= <none>
##$CNST= (0..31)
1 1 145 1 1 1 1 1 1 1 1 1 1 1 1 1 1 1 1 1 1 1 1 1 1 1 1 1 1 1 1 1 
##$CPDPRG= <>
##$CPDPRG1= <>
##$CPDPRG2= <>
##$CPDPRG3= <>
##$CPDPRG4= <mlev>
##$CPDPRG5= <mlev>
##$CPDPRG6= <mlev>
##$CPDPRG7= <mlev>
##$CPDPRG8= <mlev>
##$CPDPRGB= <>
##$CPDPRGT= <>
##$D= (0..31)
0 1.2 0 0 0 0 0 0 0 0.06 0 0.03 0 0 0 0 0.0002 0 0 0 0 0 0 0 0 0 0 0 0 
0 0 0 
##$DATE= 1712310171
##$DBL= (0..7)
120 120 120 120 120 120 120 120 
##$DBP= (0..7)
150 150 150 150 150 150 150 150 
##$DBP07= 0
##$DBPNAM0= <>
##$DBPNAM1= <>
##$DBPNAM2= <>
##$DBPNAM3= <>
##$DBPNAM4= <>
##$DBPNAM5= <>
##$DBPNAM6= <>
##$DBPNAM7= <>
##$DBPOAL= (0..7)
0.5 0.5 0.5 0.5 0.5 0.5 0.5 0.5 
##$DBPOFFS= (0..7)
0 0 0 0 0 0 0 0 
##$DE= 6
##$DECBNUC= <off>
##$DECIM= 32
##$DECNUC= <off>
##$DECSTAT= 4
##$DIGMOD= 1
##$DIGTYP= 9
##$DL= (0..7)
0 120 120 120 120 120 120 120 
##$DP= (0..7)
150 150 150 150 150 150 150 150 
##$DP07= 0
##$DPNAME0= <>
##$DPNAME1= <>
##$DPNAME2= <>
##$DPNAME3= <>
##$DPNAME4= <>
##$DPNAME5= <>
##$DPNAME6= <>
##$DPNAME7= <>
##$DPOAL= (0..7)
0.5 0.5 0.5 0.5 0.5 0.5 0.5 0.5 
##$DPOFFS= (0..7)
0 0 0 0 0 0 0 0 
##$DQDMODE= 0
##$DR= 18
##$DS= 0
##$DSLIST= <SSSSSSSSSSSSSSS>
##$DSPFIRM= 0
$$ [...]
##$SUBNAM2= <"">
##$SUBNAM3= <"">
##$SUBNAM4= <"">
##$SUBNAM5= <"">
##$SUBNAM6= <"">
##$SUBNAM7= <"">
##$SUBNAM8= <"">
##$SUBNAM9= <"">
##$SW= 18.0517689322627
##$SWIBOX= (0..15)
0 0 2 0 0 0 0 0 0 0 0 0 0 0 0 0 
##$SW_h= 3612.71676300578
##$TD= 16384
##$TD0= 1
##$TE= 0
##$TE2= 300
##$TE3= 300
##$TEG= 300
##$TL= (0..7)
0 120 120 120 120 120 120 120 
##$TP= (0..7)
150 150 150 150 150 150 150 150 
##$TP07= 0
##$TPNAME0= <>
##$TPNAME1= <>
##$TPNAME2= <>
##$TPNAME3= <>
##$TPNAME4= <>
##$TPNAME5= <>
##$TPNAME6= <>
##$TPNAME7= <>
##$TPOAL= (0..7)
0.5 0.5 0.5 0.5 0.5 0.5 0.5 0.5 
##$TPOFFS= (0..7)
0 0 0 0 0 0 0 0 
##$TUNHIN= 0
##$TUNHOUT= 0
##$TUNXOUT= 0
##$USERA1= <user>
##$USERA2= <user>
##$USERA3= <user>
##$USERA4= <user>
##$USERA5= <user>
##$V9= 5
##$VALIST= <valist>
##$VCLIST= <CCCCCCCCCCCCCCC>
##$VD= 0
##$VDLIST= <DDDDDDDDDDDDDDD>
##$VPLIST= <PPPPPPPPPPPPPPP>
##$VTLIST= <TTTTTTTTTTTTTTT>
##$WBST= 1024
##$WBSW= 4
##$XGAIN= (0..3)
0 0 0 0 
##$XL= 0
##$YL= 0
##$YMAX_a= 258246
##$YMIN_a= -264381
##$ZGOPTNS= <>
##$ZL1= 120
##$ZL2= 120
##$ZL3= 120
##$ZL4= 120
##$ABSF1= 10
##$ABSF2= 0
##$ABSG= 5
##$ABSL= 3
##$ALPHA= 0
##$AQORDER= 0
##$ASSFAC= 0
##$ASSFACI= 0
##$ASSFACX= 0
##$ASSWID= 0
##$AUNMP= <proc_1d>
##$AZFE= 0.1
##$AZFW= 0.1
##$BCFW= 1
##$BC_mod= 2
##$BYTORDP= 1
##$COROFFS= 0
##$CY= 11.3945322036743
##$DATMOD= 1
##$DC= 2
##$DFILT= <>
##$DTYPP= 0
##$F1P= 15.7292609196834
##$F2P= 12.9074282941183
##$FCOR= 0.5
##$FTSIZE= 0
##$FT_mod= 4
##$GAMMA= 1
##$GB= 0.15
##$INTBC= 1
##$INTSCL= 1
##$ISEN= 128
##$LB= 0.24
##$LEV0= 0
##$LPBIN= 0
##$MAXI= 10000
##$MC2= 0
##$MEAN= 0
##$ME_mod= 0
##$MI= 1.114404
##$NCOEF= 0
##$NC_proc= 0
##$NLEV= 6
##$NOISF1= 3.799351
##$NOISF2= 2.8
##$NSP= 1
##$NTH_PI= 0
##$NZP= 0
##$OFFSET= 15.70392
##$PC= 1
##$PHC0= -25302.15
##$PHC1= 10.98731
##$PH_mod= 1
##$PKNL= yes
##$PPARMOD= 0
##$PSCAL= 0
##$PSIGN= 0
##$REVERSE= no
##$SF= 200.130013532006
##$SI= 16384
##$SIGF1= 3
##$SIGF2= 2
##$SINO= 400
##$SIOLD= 16384
##$SREGLST= <1H.CDCl3>
##$SSB= 0
##$STSI= 0
##$STSR= 0
##$SW_p= 3612.71676300578
##$SYMM= 0
##$S_DEV= 0
##$TDeff= 0
##$TDoff= 0
##$TI= <>
##$TILT= no
##$TM1= 0
##$TM2= 0
##$TOPLEV= 0
##$USERP1= <user>
##$USERP2= <user>
##$USERP3= <user>
##$USERP4= <user>
##$USERP5= <user>
##$WDW= 1
##$XDIM= 8192
##$YMAX_p= 0
##$YMIN_p= 0
$$ End of Bruker specific parameters
$$ ---------------------------------
##NTUPLES= NMR FID
##VAR_NAME=  TIME,          FID/REAL,        FID/IMAG
##SYMBOL=    X,             R,               I
##VAR_TYPE=  INDEPENDENT,   DEPENDENT,       DEPENDENT
##VAR_FORM=  AFFN,          ASDF,            ASDF
##VAR_DIM=   8192,          8192,            8192
##UNITS=     SECONDS,       ARBITRARY UNITS, ARBITRARY UNITS
##FACTOR=    0.0002768,     1,               1
##FIRST=     0,             0,               0
##LAST=      2.2672688,     0,               0
##MIN=       0,             -264381,         0
##MAX=       2.2672688,     258246,          0
$$ Real data points
##PAGE= N=1
##DATA TABLE= (X++(R..R)), XYDATA
$$ [...]
2802c741K986L197K270P28j618k338l278k513q72Q10K435L406K811R23q80k514
2818A812l064k447j486M86K458K594K982J532n6j934k742l063j812n64K026K783
2834d95L179K186N26j754k646k870k580o36J101K811L084K060R71p29k611k740
2850a143k847j053Q96J995L077K608J318k62k227k784k789j653M28J366L118K678
2866B726J874L90k000k403l065k075m99J400K599L177K202N16p64k614l336k128
2882d000q68Q28K099L077K966R40n18k127l215k793j330K89K133K519K962J888
2898D850r7j869k763k758k082j25J699K823K582K134M89j471k234k983k446n46
2914d797R85K457K720K658J031j074k288k788k199j397K83K435K668K602J253
$$ y = [-3741, -755, 2442, 4712, 5440, 3822, 1484, -1794, -4307, -5179, -4369, -1934, 1472, 4283, 5206, 4326, 1812, -1252, -3699, -5185, -4699, -2241, 353, 3335, 4867, 4811, 2877, 135, -2928, -4740, -5304, -3278, -495, 2684, 4870, 5396, 3642, 996, -1874, -4454, -5090, -3989, -1178, 1906, 3966, 4937, 4208, 1597, -1143, -3990, -5043, -4147, -2152, 925, 3533, 4851, 4589, 2362, -422, -3211, -4864, -4436, -3070, 48, 2726, 4600, 4990, 2990, 587, -2478, -4553, -5052, -3652, -1053, 2124, 4326, 4842, 4078, 1464, -1872, -4000, -4868, -4040, -1941, 1136, 4102, 5042, 4524, 2397, -818, -3611, -4941, -4652, -2519, 0, 2962, 4850, 4753, 2884, 121, -2637, -4719, -4844, -3145, -322, 2260, 4394, 4883, 3412, 1178, -1805, -4251, -4797, -3812, -1355, 1365, 4023, 5054, 3980, 1692, -1096, -3295, -4692, -4409, -1974, 694, 3296, 4549]
2929D549N2k199k523k602j918o0J682K747K864J945K04j531k625k664j996q74
2945d949J503K183K914K443M25p21k238l346j878j170P69K358K502K927R60n41
2961D141j929k435l003j544M19J876K862K472J445J01j519k779k248k244k76J416
2977c245K530K841J706Q25j330k299l003j969n86P67K310K579K366J079n75k058
2993A938k855k404j296J92K132K762K700J083J04j702k853k435j707k29J712K562
3009b96K772J756M73j524k383l030j896n36J346K280K333K531Q62j063k043k859
3025a277k487j009R91J784K733K347J502n51j693k708k512j724P04J397K455K685
3041B637J595J73j717k034k820j775j99J076K329K817J691P87r62k206k880j842
$$ y = [4549, 4601, 2402, -121, -2723, -4641, -4701, -3019, -272, 2592, 4537, 4741, 3210, 585, -2079, -4075, -4949, -3446, -1263, 1651, 4094, 4519, 3798, 1560, -1786, -3664, -4834, -4065, -1707, 795, 3722, 4682, 4141, 2212, -223, -3226, -4770, -4351, -2475, 387, 2859, 4304, 4405, 2886, 107, -2141, -4385, -4661, -3245, -715, 2126, 3832, 4657, 3327, 1028, -1975, -3944, -4530, -3763, -1453, 1126, 3492, 4571, 3996, 1938, -917, -3321, -4617, -4425, -2293, 469, 3169, 4252, 4356, 2654, -199, -2634, -4341, -4570, -2858, -296, 2476, 4232, 4705, 3181, 798, -2232, -4128, -4664, -3318, -1038, 1295, 3826, 4688, 3625, 1582, -1277, -3764, -4773, -3782, -1998, 735, 3082, 4584, 4033, 2340, -368, -2880, -4604, -3900, -2503, -48, 2637, 4232, 4405, 2688, 654, -2166, -3941, -4140, -3064, -735, 2082, 3773, 4560, 3598, 1392, -1488, -3330]
3057c330j239Q13K224K606K491J012o82j662k878k487j215L04J786K645K482J207
3073D077J72j657k462k349j934k31J510K281K726J668L76j036k070k945k021m46
3089d341P13K320K864K155P48r64j951k543k244j105L76K224K382K130J387K6
3105D177j664k785k002j716j34J681K435K221K063M5j432k391k623j714p33J363
3121c209K001K849J780Q70p40k277k678j958r01O73J898K473K312J237m97j844
3137A989k290k668j384L73J727K451K565J129J79j300k496k405j718k61J178K109
3153h22K500K098L02q25k573k520j793p71J059K340K426J680R22m72j875k370
3169f94k192j016M63J473K398K283J354l54j469k419k119j389q8J182K263K436
$$ y = [-3330, -4569, -3756, -1532, 1074, 3565, 4577, 3895, 2233, -645, -3132, -4347, -4043, -2257, 388, 2870, 4077, 4249, 2592, 130, -2219, -4153, -4384, -2874, -593, 2133, 3801, 4177, 3141, 1071, -1874, -3895, -4341, -3628, -1308, 1556, 3711, 4459, 3495, 1544, -999, -3243, -4348, -3972, -1748, 634, 2764, 4151, 4177, 2513, -272, -2274, -3990, -4124, -2443, -8, 2213, 4276, 4321, 2889, 498, -2125, -3839, -4572, -3209, -1208, 1641, 3421, 4291, 3551, 1274, -1404, -3362, -4263, -3590, -1692, 781, 3093, 4330, 3833, 1989, -301, -2969, -4353, -3980, -2253, 198, 2763, 3892, 4071, 2771, 275, -2130, -3848, -4109, -2931, -822, 1678, 3776, 4078, 3253, 680, -1840, -3633, -4404, -3345, -1005, 1421, 3101, 4023, 3551, 1676, -694, -2886, -3902, -3439, -1966, 432, 2715, 4069, 3715, 2246, -173, -2292, -3681, -3769, -2587, -324, 2112]
3185B112J689J87j093k117k539k078l95J024K146K549J773J196j243j816k405
3200a010k013j126P86J514K710J967R31k66j305k247k597j403K04J641J941K434
3216B161J618Qj235k203k341j500m24J095J952K406J683P70j087j711k571j674
3232c053r55R35J593K326K174J149o13j686k484k107j321N12J328K195K452J244
3248C689Q5j629j822k397j189p23J182K667J856J613Q14j112k199k415j708o86
3264c974R47J964K412J566P63l78j755k395j957q78M09J230K559K029J041J7j696
3281A904j896k264j555k4J800J782K220J817j39j098j980k175j514n72O79K235
3297g80K106J878L25l68k052k302j894j006P77J894K185K068O69j43j886j870
$$ y = [2112, 3801, 3988, 2895, 778, -1761, -3839, -4234, -3210, -1064, 1485, 3258, 4454, 3211, 1395, -1010, -3023, -4149, -3363, -1849, 861, 2828, 3759, 3493, 2188, -59, -2656, -4059, -3855, -2214, -273, 2161, 3779, 3787, 2552, 349, -1992, -3492, -3916, -2821, -869, 1537, 3220, 3990, 2903, 1192, -1379, -3053, -4008, -3073, -1480, 846, 3020, 4169, 3556, 1870, -614, -2721, -4042, -3530, -2202, -7, 2445, 3689, 3774, 2145, 323, -2074, -3263, -3986, -2804, -137, 1719, 3332, 4146, 3034, 835, -1580, -3288, -3974, -3027, -1063, 1349, 2915, 3678, 3300, 1545, -850, -2807, -3685, -3276, -2046, 513, 2542, 3583, 3600, 1904, 8, -2256, -3811, -3835, -2035, -253, 1967, 3784, 3645, 2547, 567, -1608, -3122, -3694, -3015, -780, 1326, 3204, 3529, 3161, 1109, -1193, -3087, -4093, -3316, -1422, 763, 2831, 3500, 3357, 1471, -399]
3313c99k054j274L85J197K168K177J191K93j348k244k001j596j40J023J880K320
3329A578J871J54p18j950k218j764q46R39J877K079J872Q84n84j657k245j797
3345b525j103K31J641J672K502J235j75j505j876k075j321k04J309J991K019J371
3361C187M52j201j606k377j581m10O32K079J847J872P35o59j671k078k114o90
3377c583L08J815K289J749Q92j92j478k249j647j439K97R78K227K250J090K37
3393C544j336j735k142j535n46R95K280K209J241K24k68j690k505j785o39O53
3409c035J834J759J929J327o55j501k097j997j014L84J094J997J828J715j42j442
3425A984j653k160j226k05R56J719K193J584K5n89j782k101j606m21N37J589K215
$$ y = [-399, -2453, -3727, -3342, -2145, 23, 2200, 3391, 3684, 2336, 92, -1909, -3505, -3645, -2622, -742, 1578, 3449, 3603, 2885, 935, -1283, -3047, -3893, -2954, -1077, 1002, 2874, 3758, 3174, 1517, -728, -2525, -3628, -3397, -1756, -84, 2418, 3653, 3478, 1973, 97, -1978, -3299, -3503, -2194, -203, 1816, 3187, 3639, 2438, 832, -1545, -3126, -3536, -2904, -825, 1022, 2894, 3629, 2970, 1299, -779, -2893, -3583, -3275, -1460, 829, 2578, 3470, 3278, 1800, -449, -2096, -3535, -3238, -2260, -33, 2217, 3307, 3544, 2208, 473, -1669, -3204, -3750, -2755, -475, 1734, 2975, 3199, 2931, 1241, -1264, -3049, -3688, -3035, -1201, 558, 2487, 3814, 3159, 1658, -439, -2436, -3450, -3066, -1972, 25, 1853, 3568, 3426, 1984, 331, -1829, -3055, -3260, -2304, -585, 1608, 3192, 3217, 2628, 846, -1255, -2861, -3282, -2745, -1156, 1059]
3442A059J853N49p60j505j691k016j279Q05J550J942J674R89p8j381j535j950
3458a774j325j95J484J489K141J117N63j335j602k047j641k00P56J630K186J786
3474C033L69q69j426j900j662j021M18J570K109J858J023n53j077k119k094r52
3490c293J04R96K272K081Q64K09j113j975j665j634l13J228J760J730J756O9o54
3507B422j390j939j793m04J21J944J942J659N57k90j357k114j669q18p6J573K085
3524D53J622P38L41j185k255j491j096k61P59J950J968J401L04r15j688k049j334
3541b738o36R90J363K110J568M55l82j575j731j830p52L58J324J872J777P05K35
3558C113j402j646k227o93l2R04J783K122R76Rp78j526k068j278o49O64J918K038
$$ y = [1059, 2912, 3461, 2701, 1196, -495, -2511, -3790, -2985, -1435, 507, 2181, 3170, 3092, 1711, 176, -1774, -3099, -3294, -1810, -321, 1820, 2937, 3500, 2165, 563, -1484, -3125, -3325, -2569, -939, 1247, 3033, 3402, 2533, 1107, -793, -2455, -3476, -3058, -1488, 621, 2479, 3502, 2949, 1872, -247, -2341, -3293, -3189, -2193, 79, 2160, 3024, 3233, 2120, 145, -1520, -3154, -3467, -2239, -479, 1251, 3007, 3076, 2422, 1032, -907, -2700, -3104, -2983, -1039, 903, 2562, 3119, 2829, 1472, -642, -2311, -3129, -3205, -1632, 453, 2075, 2813, 3154, 1969, -286, -1777, -2873, -3134, -2375, -425, 1543, 2944, 3248, 2333, 645, -1404, -2738, -3374, -2384, -1021, 1089, 2657, 3112, 2730, 1155, -576, -2406, -3158, -2800, -1476, 396, 2173, 2878, 3113, 1711, 65, -2162, -2855, -2887, -1983, -200, 1922, 2898, 2907, 2129, 603, -1465, -2743, -3392, -2728, -810, 1228]
3576A228J260O58p41j624j682j505o02K77J623J553J708J010k28j697j576j792
3592b130r49J41J250J791J636J261j9j126j684j712j253k97J215J405J647J772
3608B948O2p54j397j750j465o80M02J939J437J597P12k59j768j677j227r47l7
3625b864J388J752J799J070j51j239j779j796j049Q2Q00J861J838J152mp07j453
3642G00j933j380l95O96J515J724J409L69k79j466j614j593m80J70J224J692J451
3659A810J177k33j060j861j680r65j58J239J666J700R57L82p12j944j737j034
3675b453n27Q51J842J277J621M04o77j392j960r60r94M55J667J543J450P82j66
3692B763j275j509j769j006J2J140J771J474J191N2r51j810j281j478l22Q34J937
$$ y = [1228, 2488, 3146, 2405, 781, -901, -2406, -3008, -2731, -1108, 445, 2153, 3163, 2935, 1238, -338, -2130, -3079, -2938, -1688, 103, 1739, 3000, 2981, 1855, 171, -1541, -2794, -3091, -1876, -471, 1176, 2948, 3010, 2256, 859, -891, -2356, -3036, -2634, -695, 742, 2339, 3051, 2792, 1024, -653, -1880, -2827, -2864, -1476, 276, 2075, 3145, 2994, 1755, -24, -1820, -2869, -2787, -1987, -126, 1712, 2864, 2860, 2153, 700, -1233, -2613, -3008, -2312, -797, 927, 2336, 2705, 2426, 960, -654, -2247, -2727, -2557, -1333, 359, 1810, 2987, 2754, 1694, -167, -1847, -2812, -2970, -1731, -65, 1635, 2592, 2974, 2262, 318, -1419, -2453, -2980, -2129, -287, 990, 2611, 3015, 2338, 946, -1014, -1974, -2968, -2513, -846, 697, 2147, 2929, 2763, 1488, -21, -1790, -2796, -2784, -1644, 127, 1601, 2792, 2844, 1893, 83, -1198, -2676, -2998, -2164, -227]
3709b27J601J220O7n30j506j649j346l17N08J268J906J325L52j98j248k126j017
3726a917r74L63J149J513J746O28K93j261j624j485r28k1P18J835J309J139K36
3743B719o67j524j838j251l80Q04J394J884J234M91o37j513j199j742m07K68J036
3760a328J918J350Q32p1j366j521j614j038K18R67J967J231J047R0q60j727j370
3777a275j286l20J165R76J904J224L66n59j223j775j541l38L79J609J181J754
3793B241O89n33j202j816j430q10N10R82J447J586R38lj212j530j399j152j6R84
3811a726J549J064J217P31j011j312j582j011m52K90R83K266J115N65k85j195
3827A206j810j381o78K07J252J478J519Q27j42p82j853j510r30K50O64J032K198
$$ y = [-227, 1374, 2594, 2661, 2131, 625, -1024, -2370, -2687, -2179, -911, 995, 2320, 2672, 2474, 1226, -900, -1917, -2891, -2528, -1379, 134, 1880, 2508, 2801, 1540, -84, -1569, -2497, -2518, -1800, 35, 1344, 2483, 2719, 2052, 528, -1310, -2561, -2941, -2137, -743, 1141, 2375, 2866, 2229, 716, -483, -2225, -2632, -2364, -1328, 590, 1940, 2772, 2701, 1335, -186, -1800, -2838, -2620, -1653, 314, 1545, 2592, 2682, 1822, 95, -1275, -2561, -2881, -1716, -740, 1164, 2388, 2754, 2195, 972, -803, -2344, -2682, -2303, -694, 487, 2241, 2930, 2397, 1195, -621, -2051, -2861, -2351, -1369, 78, 1664, 2602, 2599, 1387, -143, -1542, -2694, -2710, -1726, -177, 887, 2104, 2835, 1824, 512, -1070, -2081, -2533, -2243, -1260, 1006, 2121, 2686, 2401, 1206, -604, -1985, -2663, -2456, -1204, 274, 1793, 2620, 2478, 1696, -157, -1667, -2597, -2347, -1683, -651, 1547]
3844A547J099k07o31j317j646j324j92N94J109K219J148K66m23j571j298j541
3860b168l48Q1J396J740J330O78j89j131j641j336p86k03R99J613J500P17K06
3877B458r37j589j197j284j16O36J711J356J024L85o49j243j366j177p02L72J615
3894g03J411J246M64j28j287j343j286p35lJ071J652J156J233k36j126j319j615
3911a548j128M22P70J054J842J014r2n67j232j278j436k73N21R81J642J485K96
3928B473l54j113j586j445n82M54J156J193J686P78m76r10j460j442o20l24Q40
3945a732J463J613Q92M20q99j528j438j026m07O02J381J408J258M88p27j113j289
3962f34j187r24O82J020J540J328Q07l74j030j581j272p32j88J350J313J363Q09
$$ y = [1547, 2646, 2439, 1808, 491, -1155, -2479, -2671, -2077, -968, 1251, 2399, 2665, 2242, 671, -627, -2168, -2516, -2435, -1039, 701, 2031, 2709, 2520, 1389, -252, -1588, -2374, -2577, -1578, 35, 1535, 2252, 2458, 1521, -68, -1265, -2549, -2665, -2029, -318, 1038, 2062, 2447, 1798, 555, -811, -1988, -2690, -2318, -703, 708, 1954, 2418, 2290, 1003, -340, -1626, -2361, -2364, -1293, 359, 1515, 2748, 2512, 1386, 67, -1548, -2676, -2254, -1484, -430, 1412, 2426, 2334, 1767, 535, -743, -2179, -2452, -1931, -950, 692, 2177, 2473, 2119, 1006, -580, -2025, -2607, -2153, -997, 196, 1882, 2660, 2184, 1274, -186, -1628, -2248, -2572, -1732, -269, 1344, 2236, 2656, 1757, 229, -1209, -2235, -2642, -2040, -659, 749, 2007, 2495, 1768, 655, -634, -1821, -2745, -2063, -1043, 497, 1825, 2632, 2258, 1228, -353, -1625, -2357, -2545, -1195, 118, 1481, 2290]
3979B290M3o88j461j431r92j94O62J541J277J339j7o61j058j495j209k58O07Q78
3997h27J622Q69N67l03r41j450j388n42K37J201J154J380Q86j83q69j365j172
4014a124j224OR60Q55J823P90M16q02j045j706j232j69N08J335J483J108L83m66
4032A899j051j237j297m66m9R74J593J055J080n09p35j563j162q29R0P01J328
4049a78J528Q48N4p09j327j190j077m30O89J295J425J022L61o56q30j550j064
4066a789m67K82Q89J614R65Q19l34q50j139j422r23j10J110J113J603R44k40o92
4084A373j087j522q00l98Q24J541J062Q89J10k21j273j334r79m32L83J040J533
4101G09J034P67o23j075j074j256p02J47O67J517J305Q51%r59j257j586n87p6
$$ y = [2290, 2333, 1645, 184, -1247, -2239, -2433, -1771, -230, 1047, 2386, 2369, 1708, 650, -845, -2054, -2312, -1705, -827, 795, 1664, 2231, 1928, 987, -463, -1851, -2393, -2156, -955, 199, 1579, 2465, 2282, 1413, 48, -1124, -2348, -2342, -1382, -527, 1296, 2086, 2502, 1700, 655, -1051, -2283, -2452, -1944, -609, 874, 1982, 2365, 1899, 848, -389, -1686, -2152, -2201, -1227, 366, 1421, 2501, 1992, 1257, -306, -1468, -2297, -2207, -1506, -178, 1350, 2198, 2252, 1543, 216, -974, -2051, -2481, -1792, -497, 928, 1950, 2311, 1655, 825, -725, -1789, -2256, -1974, -1085, 529, 1494, 2313, 1979, 1129, -10, -1432, -2355, -2465, -1355, -242, 1361, 2305, 2065, 1373, 286, -1236, -2036, -2434, -1610, -69, 993, 1882, 1992, 1771, 498, -836, -1815, -2247, -1864, -824, 709, 1743, 2510, 1887, 812, -262, -1518, -2220, -2073, -1406, 111, 1416, 2267, 2267, 1308, 51, -1535, -2122, -2198]
4119b198N78J484J312P12M00q27j087j349q76l18L58J132J314J156M22k13j170
4136H30j339j237p24M22R77J369J212P28l63p51j431j290o02j82J145J322R38
4153A024J142J0o93j408j067o68n15P14R47J242J061L75n60j007j299q69o49K48
4171a972J022J274J334O39m84j025j138j192m88q1Q68J315J580L87J19r80r90
4188A88j181q79l01N72J183J227J043Q6n12p03j454j240n0M93J034J031J403K36
4206B176m77r37j042j239o30J69J095J123J358N51n01l35j410j177o34n9N73R71
4224d25J517Q87k66k86j246j153r94j93O19P85J600P05M66k14j151j319j031l70
4242b069M91O71J142J012Q00k53m87j211j441n16NM87J545J056N57L67p60j062
$$ y = [-2198, -1620, -136, 1176, 1888, 2288, 1461, 374, -975, -1851, -2169, -1811, -679, 635, 1791, 2213, 2000, 830, -509, -1746, -2470, -2048, -1071, 298, 1510, 2238, 1875, 1124, -307, -1597, -2199, -2381, -1236, 86, 1024, 2166, 2176, 1483, 75, -992, -1660, -2175, -1461, -514, 728, 1789, 2164, 1604, 597, -702, -1571, -2220, -1972, -950, 324, 1658, 2297, 1813, 788, -350, -1542, -2030, -2111, -1243, 72, 1652, 2039, 2158, 1178, 188, -993, -1872, -2173, -1601, -418, 809, 1852, 1938, 1426, 723, -731, -1971, -2021, -1528, -494, 537, 1940, 2176, 1699, 762, -280, -1519, -2149, -1980, -885, 238, 1596, 2147, 1646, 1311, -99, -1276, -1910, -1969, -1396, -425, 1092, 1979, 1713, 1427, 181, -972, -1966, -2159, -1540, -755, 845, 1550, 2016, 1802, 651, -668, -1699, -2069, -1578, -907, 235, 1247, 2047, 1794, 1307, 96, -1345, -1861, -1856, -1369, 176, 1232, 1789, 2156, 1396, 334]
4260C34j244j108J17O45O04J576Q56L87o13j044j165j034l47M17J066J033R43
4277A423N93Mq94j420j126m85J95P19Q22J479N03K71r34q36j304r52q1N59R33
4296e31J268R74O4n62j301q76q73n5K30P63J527P23P66m46r09j254r89l65J39
4315a707P45J035J214O20Mj109p49j239n64j53O50J325Q73N84L09o00j034j055
4333h51p38o51Q92Q63J150J131N9n13p06j114j008m65L97P61J423P10N32n4q99
4352I19r65j292n25q2Q77J126J130N73K43q53r61r94q19k64N00R83J155J021K
4371A774j68r87r66j143l88p9J394J009J014M58j64j041j089r51o14L87M78J290
4389B14Q81Q19k08o26j141r43o09l16N64R86J378N89O0l22q60j200o97l07L09
$$ y = [334, -910, -2018, -1901, -1256, -652, 924, 1780, 2167, 1554, 510, -655, -1689, -2036, -1619, -553, 480, 1423, 2016, 2020, 1126, -294, -1420, -1905, -1710, -991, -169, 1310, 1813, 2084, 1150, 314, -990, -1942, -2023, -1464, -531, 737, 1711, 1775, 1213, -88, -964, -1837, -1892, -1662, -899, 628, 1351, 2117, 1671, 762, -492, -1481, -1846, -1707, -962, 73, 1287, 1907, 1911, 802, 53, -1186, -1750, -1903, -1253, 72, 945, 1529, 1838, 1238, 204, -851, -1589, -2240, -1348, -485, 665, 1796, 1855, 1342, 636, -478, -1486, -1951, -1554, -793, 630, 1340, 1872, 1818, 919, -46, -1338, -1863, -1945, -1068, 58, 1188, 1761, 2004, 1151, 190, -804, -1623, -1887, -1387, -404, 751, 1772, 1774, 1606, 619, -347, -1490, -1878, -1957, -563, 446, 1460, 1918, 1754, 713, -376, -1327, -1941, -1554, -1076, 214, 1095, 1914, 1706, 1080, -61, -1004, -1613, -1929, -1365, -379, 999, 1588, 1648, 1326, 466, -734, -1431, -1738, -1429]
4408a429R22Q81J212L82l31p02j061j319p46N67P73J228R68L01j7o03j107j169
4426a250l53k06P10J054R87P72N8o10q46j083j240J39M09J052Q62J159N78q81
4444A311o13j096j125m47L54J018R29J012O13k70j037r11r04n62K24L60J096Q60
4462H12R78k20l90j030j222o40l56P35J103P64R39J35l12p81j123r55k0J8Q82
4481f83J007R84Q23n06p93j391o94n34J29R89R64O08O55J84q16j064j019l32k52
4500a741O95J120Q41R06K37p88p71j056j013l48P02R79P74Q67P08o41j119q62
4518e10o73o34K10P32J131J054M13k48n79j070q51n26R0L35J015J117N38L33q08
4537A069p25j200p68m0L79J069Q19Q10J56j70r73j030n84m62Q8Q14J302N72N60
$$ y = [-1429, -507, 374, 1586, 1968, 1637, 935, -126, -1445, -2191, -1624, -851, 377, 1345, 1646, 1629, 1026, -81, -1250, -1603, -1809, -1099, -45, 942, 1714, 1772, 1162, 316, -767, -2007, -1868, -1459, -407, 455, 1614, 2192, 1311, 698, -398, -1523, -1970, -1616, -598, 331, 1343, 1956, 1686, 649, -262, -1166, -1728, -1504, -1144, -48, 812, 1790, 1570, 1180, 150, -1072, -1712, -2068, -1333, -230, 534, 1473, 1608, 1296, 515, -608, -1563, -1583, -1565, -683, 324, 1308, 2131, 1625, 832, -559, -1253, -1787, -1658, -669, 295, 903, 1558, 1742, 926, -138, -1157, -1489, -1741, -1046, 74, 915, 1821, 2058, 1270, 499, -557, -1570, -1918, -1216, -237, 537, 1404, 2112, 1471, 352, -510, -1183, -1817, -1607, -875, 256, 1310, 1723, 1475, 896, -174, -1025, -1551, -1461, -1126, -111, 1006, 1544, 1877, 1069, 344, -856, -1624, -1664, -1285, -216, 603, 1413, 1569, 1399, 426, -604, -1188, -1650, -1562, -748, 554, 1126, 1686]
4556A686j37r80r44o45q31O14L01Q63R59Q09Q6r92q43r20n01m9M21Q89R44O94
4576A424M25n54q42q95j013m11L00Q22J270O92K02J8o19j151j025m06K60O22R27
4595D6Q95O73l45j34j432o10r60L39L15J233J167L33R1l93j025r83o10n90P20
4614a270R29J122P21L39l62q98j025j067j05L21O82R71N95N64j61m57r32j344
4632a377Q5k62L74J308N43J036j43p45p45n94r33q1K51J091J136L07K84k81r25
4651C29n10r78m38K03P08Q45J003N33L5p56j124j167l42J50N57P10J389M69j60
4670A456k94j101p54n54n06O86Q65R50O93Q5l06r40r19o72l33K92O98J127Q23
4689A296K38j08q41j130o78l29K59M39J006Q67N28J21r28p97r56o61M5N56Q92
$$ y = [1686, 1549, 569, -375, -1020, -1851, -1237, -936, -73, 886, 1695, 1781, 789, -54, -974, -1475, -1524, -1103, -214, 730, 1424, 1849, 1295, 453, -442, -1455, -1866, -1566, -744, 526, 1218, 1420, 1438, 819, -332, -1357, -1763, -1503, -881, 46, 941, 1614, 1269, 1135, -297, -907, -1867, -1528, -1213, 20, 1187, 1520, 1611, 1218, 193, -790, -1400, -1990, -1270, -341, 781, 1502, 1841, 1479, 581, -444, -1511, -1616, -1295, -613, 358, 953, 1517, 1356, 899, -33, -1377, -1292, -1554, -1180, 128, 671, 1707, 1564, 819, 74, -520, -1453, -1534, -1283, -192, 944, 1251, 1535, 1254, 329, -181, -1159, -1597, -1394, -686, 159, 1162, 1695, 1730, 974, -150, -1317, -1659, -1509, -952, -242, 1147, 1616, 1456, 1162, 61, -693, -1247, -1753, -1067, -202, 748, 1441, 1526, 1220, 280, -639, -1311, -1644, -1352, -654, 473, 1296, 1534, 1426, 585, -545, -1223, -1552, -1293, -854, 152, 1019, 1547, 1668, 740, -57, -1013, -1674, -1629, -1073, -181]
4708a81R72P17k0m75q03q90o17j76J42Q92J091O62M03n01o17r81q65k45J85O33
4728f74P44J091L87l26n40p90r25n82J10O00R89O17Q55j08n91o03q82q38J04N41
4748h21L67J159N24K11j08r66q60p48m2QN35J175O10K51J5o91q86q00m24J49O54
4769f88N88R68O12m2m60p68q79p26o9K23J112O42R42K40n60p45j148q64J48K25
4789a249N68J099N54O95m53n93r62p97k37l11Q55Q35J075M35J03q82o12o70o73
4808a220k70N48P52J134M34M9k30r31r27o90r0L94P34Q28P06L33n12p39o76o85
4828a058k84j8N79Q70R83M56m8o07p11j115n18N3N84P87J013M59J42n82n26j226
4848g67m59l98O70O52P94P84K5r4r31n77j033l50M39M60J267O34J77Nq10p80r27
$$ y = [-181, 791, 1508, 1488, 1013, 210, -680, -1297, -1473, -1331, -439, 652, 1314, 1717, 1216, 599, -382, -1247, -1492, -1307, -674, 70, 1161, 1548, 1222, 682, -108, -1033, -1615, -1505, -905, 84, 701, 1556, 1448, 857, 254, -628, -1466, -1362, -821, -454, 705, 1229, 1440, 1332, 366, -494, -1242, -1284, -1276, -741, 434, 1044, 1295, 1310, 619, -267, -1067, -1491, -1342, -688, -100, 868, 1480, 1438, 978, 210, -669, -1395, -1464, -1241, -129, 513, 1455, 1695, 1135, 390, -758, -1622, -1474, -1249, -681, 418, 972, 1667, 1214, 621, -341, -1138, -1375, -1686, -831, 4, 1079, 1514, 1617, 735, 123, -547, -1220, -1490, -942, -190, 944, 1378, 1427, 1197, 266, -661, -1351, -1441, -1047, -313, 515, 1221, 1554, 1042, 303, -373, -1058, -1342, -1360, -781, 89, 1072, 1528, 1480, 873, 162, -953, -1471, -1418, -834, -47, 966, 1425, 1567, 985, 459, -767, -1226, -1624, -954, -302, 492, 1276, 1301, 1207, 276, -301, -1334, -1684, -1245, -785, 482, 1116, 1293, 1298, 488, -292, -1219]
4869a219p4k51R40Q18R28L76j5o39p29p36p23k50N47P18R69Q89k40l95m74j017
4889e77r76m1N15N92R57P00M60o04l62j011r32j32Q0Q62O54R89K93n3n66r34o44
4910g30n09n5L37J171M75O37K29o52n48j135p30K05K43Q27J014M48J82l20l91
4929F98j254o79n21M41L66J270Q12L24l15o40p02o61n87P6O10P69Q54K62K24m69
4949H78m67j165n31k66N87P83O51Q54J26k97q57q65o41l20L27O82Q56Q34P5jo22
4970F21q38p05n50P9O87R03P92J06K93p27n34r52l63j85L49R07P51N42K09m62
4990I23m73r90m91l90M37P11P59O57M52m93o75o56q10l39L50K05J071Q30K79P4
5010A431o64r10p63j53j23K49Q70Q57K18L84o20m86r37n37j39J61Q46P24N73L57
$$ y = [-1219, -1293, -1544, -604, 214, 1142, 1518, 1503, 864, 135, -601, -1324, -1574, -1027, -309, 660, 1549, 1309, 914, 440, -577, -1553, -1594, -1079, -487, 470, 1170, 1630, 1026, 664, -347, -1279, -1411, -1331, -469, 185, 1174, 1467, 1414, 848, -86, -730, -1239, -1294, -957, 214, 689, 1326, 1555, 903, 355, -780, -1510, -1305, -1062, -235, 779, 1227, 1409, 1089, 698, -556, -1235, -1756, -1315, -949, 321, 1133, 1457, 1142, 502, -200, -861, -1448, -1372, -762, 7, 861, 1123, 1347, 878, 411, -754, -1285, -1551, -964, -181, 470, 1324, 1450, 1153, 296, -569, -1210, -1530, -1203, -521, 335, 1169, 1244, 1243, 621, -217, -922, -1472, -1393, -706, 197, 989, 1095, 1388, 661, 127, -825, -1188, -1373, -1024, -117, 634, 1176, 1385, 923, 450, -540, -1031, -1421, -984, -273, 486, 1143, 1595, 1102, 427, -229, -1039, -1378, -1028, -823, 248, 1078, 1357, 1431, 767, -143, -906, -1059, -1182, -933, -63, 794, 1012, 1396, 776, 290, -647, -1184, -1323, -1162, -316, 408, 981, 1338]
5030A338l36p47p00n35k17J80M81Q91O74L13p1k80j026r53j94J04M19O04Q32P86
5050A563M2p41r93o37n86J6M08P87Q39O02j05k45o84n48q01j84K62L60J180M60
5070I95M32j39n36q33n89q37K37N06Q36N65M80J33n44q01m61m65k57L81Q26Q06
5090G35M40J54n70l16r09p88J27LR35O91P80k35R8o21p10q83l64N91L08O33J040
5111A139K98k08p03p81n44k97Q9K95P20O73L73N0k16o98o25p47k9O26L84O92O79
5132A170Qk39o70p48l69n34Q9P95Q40O06N82n21m10p88o08n81J56N94P82P00L49
5153A203R7p74l75p78q40J69N68P39L52P91P5j71n50r38j020K16K96M26J022N43
5173A051M44n21j83r75p52k51J80M27M49P65M47ml21p70p30n26K05K27O76P62
$$ y = [1338, 1002, 255, -445, -980, -1197, -1017, -536, 355, 1029, 1342, 1271, 991, -35, -988, -1182, -1078, -659, -55, 777, 1563, 1605, 864, -129, -766, -1352, -1336, -928, -141, 698, 1300, 1195, 950, 266, -282, -1083, -1267, -1005, -645, 535, 995, 1427, 1288, 752, -81, -670, -1507, -1270, -764, 72, 637, 1117, 1250, 706, -95, -556, -1021, -1278, -897, -71, 735, 1175, 1329, 759, 443, -466, -1254, -1127, -1124, -189, 502, 1282, 1047, 1145, 524, -186, -1069, -1433, -842, -534, 99, 1139, 1437, 1229, 526, -255, -799, -1096, -1007, -712, 8, 681, 1054, 1104, 888, 190, -435, -1182, -1211, -585, -201, 491, 1170, 1178, 939, 269, -479, -848, -1382, -1293, -498, 342, 948, 1530, 1009, 599, -189, -797, -1378, -1222, -628, 154, 854, 1203, 1300, 526, 151, -627, -1467, -1298, -730, 9, 361, 1152, 1227, 1056, 506, -432, -1452, -1236, -940, -514, 508, 1051, 1495, 974, 791, -184, -936, -1187, -1007, -580, -131, 634, 1081, 1077, 756, -14, -744, -1270, -1065, -838, -162, 600]
5193F00K89M21k41r08o23q09k08K04P16P52Q47Q6k82n90n58p97k99K75N34N56
5213c5P66N60k89l49r05n93l04M2M35P47O50O03j1p22m67o59n72j24N45L49P84
5234D51N12J47j71n31q41n52l15N22M52P11L80N40P4p75o82o68k77P3O5J107P64
5255I86O9J00n58n43n79m27N3J72L89O72N60J14n9n12r09m95k90L24L31J192L22
5276I12K91k26m74p26p57M1J6J89Q63N95K14p5k03q78m93k60j53K79P24P80L18
5297I77J17k27q73m09m98m53N64M60P48P45L8l88m75n01n41r0k97N75P02P88Q9
5318A051j1n80o50m61l06n7L08O95N25L17L35m64m83p32n16PK29O01R38K66J74
5339A186m64o72l10p23j7N9O90N06P85K0L5o15o54p46m85L01M38Q65M65L99j23
$$ y = [600, 889, 1310, 1069, 161, -462, -1271, -1479, -1275, -559, 193, 1040, 1126, 844, 254, -304, -1101, -1400, -1125, -591, -35, 731, 1291, 1002, 653, -252, -845, -1149, -1107, -672, 75, 725, 1328, 1317, 595, 128, -531, -1103, -1227, -682, -333, 451, 963, 1110, 939, 408, -433, -985, -1300, -778, -326, 385, 765, 1305, 1379, 604, -78, -746, -1023, -950, -885, 222, 986, 1055, 1155, 597, 54, -525, -952, -899, -727, -338, 334, 894, 1008, 949, 437, -472, -967, -1257, -933, -602, 590, 912, 1203, 977, 503, -223, -980, -939, -923, -734, 129, 724, 938, 863, 660, -218, -711, -971, -1124, -845, -121, 659, 977, 1094, 867, -6, -415, -913, -1366, -802, -342, 406, 1151, 1189, 801, 326, -175, -716, -806, -1103, -528, 174, 962, 1051, 1040, 460, -190, -651, -957, -1014, -706, -11, 514, 831, 1166, 702, 219, -513, -1029, -1022, -793, -192, 746, 1012, 1186, 722, 50, -260, -983, -1000, -941, -251, 255, 1040, 1060, 1095, 480, -174, -920, -1405, -1104, -666, 199, 664, 1063, 940]
5360I40m86n48m22m18q2L74N84O87O32l9m75m63m81o82j48K06N35O43K74N30q5
5381A076n38p15o82j01j9M52O70M82M15k5m06o17o62l71K6M23M55J057L5K13j12
5402A056j011l71n95k7K33N10N55P18N3r4o47r48j46l43J23O93P49L51K45l3o21
5423D50m16q53k59K23O16M10L61M56n8k21n75n76m41M5k48Q31R97L78J3k64o07
5444B62o59n90N5o1O66M36P50J42k19k70p24m47m27R5M69P24L93M08j11j88o62
5465D2p27o29L84N15M53K17N92M03m51o69o22l79j58K98L30M95Q66K7j01n63o78
5486c55n02p1K20L94L41Q58l4Kj07r41l20k65j46J12R85M26Q7K18j72o00o79p08
5508a257M74q8O25O21M65PJ3o72n66k77j60j09O32M02O26L18j10p36j80q39j1
$$ y = [940, 454, -94, -516, -934, -1016, -642, -58, 629, 1261, 1222, 747, 284, -197, -879, -1027, -821, -286, 357, 631, 1161, 1076, 538, -177, -859, -960, -979, -527, 143, 625, 1040, 1015, 609, -8, -670, -1041, -1015, -592, -137, 920, 955, 1168, 1056, 45, -326, -921, -948, -715, -205, 350, 1068, 1121, 1027, 380, -568, -714, -1057, -934, -241, 508, 859, 1104, 1071, 450, 34, -819, -1078, -855, -239, 171, 532, 988, 930, 709, 134, -442, -883, -838, -1086, -255, 742, 1120, 1133, 869, 262, -397, -987, -932, -993, -327, 109, 859, 1001, 782, 512, -212, -659, -1086, -991, -522, 202, 595, 1003, 892, 704, 42, -685, -1314, -930, -415, 38, 255, 847, 1250, 799, 130, -492, -871, -1029, -731, -401, 94, 960, 987, 886, 323, -355, -857, -928, -708, -314, 27, 885, 851, 853, 746, -195, -515, -780, -926, -814, 171, 597, 684, 902, 730, 130, -549, -1257, -783, -871, -246, 375, 840, 847, 860, 188, -378, -655, -815, -924, -292, 110, 736, 1054, 944, 208, 28, -811, -822]
5529h22j73P45L58L83L65o1l34m02o49m94K64M63K43M82M47L08l36o37m19o37
5549i06k30M33N48L99M89L09l84j49m99o43l87L07L05K67R58J2j8m16m50n00l60
5570i15J05K08O68N17J89J07l21m57m51o29K54O6J69O66Q77o6k05l68q10n18K80
5591f34j53L02N86N31K90j39j65p71m29m24K60J34M45O71L62R0l59p35k94m23
5611h55j85J73R48L85N86j7o77j0r20n2m42L69M94L73P06K44l03m70l21r37J05
5632h06j61O33O25N63L98m83j63p02l28l07r6L71O18L70N13j04l2j043k50l43
5652g27j38J27K91P46K08M45m98j67p59j29l23K55M10J92P80J24mn15l07o20k15
5673h24j58M80O94L05K41M71o22n57p99j54R5K91J37N17M83L70m74j38p16n09
$$ y = [-822, -995, -250, 108, 491, 856, 795, 461, 59, -590, -1084, -820, -357, -114, 368, 815, 1123, 787, 150, -269, -906, -1136, -703, -155, 244, 733, 1042, 658, 509, 10, -633, -1020, -713, -408, -141, 817, 829, 811, 395, -55, -555, -915, -810, -602, 66, 583, 772, 879, 558, 101, -350, -979, -725, -659, -490, 176, 1053, 987, 782, 414, -396, -914, -634, -787, -485, 101, 632, 922, 783, 618, -153, -582, -1006, -746, -612, -167, 504, 866, 956, 597, -138, -432, -855, -1040, -867, 81, 466, 1052, 1035, 358, 348, -572, -624, -1066, -697, -203, 170, 876, 1120, 817, 347, 26, -911, -806, -967, -334, 291, 854, 1252, 769, 606, -96, -424, -731, -827, -456, 162, 532, 1045, 941, 909, -134, -384, -727, -865, -738, -447, 299, 507, 952, 454, 287, -472, -601, -924, -669, -259, -67, 713, 837, 833, 318, 11, -609, -824, -982, -502, 192, 497, 738, 1209, 587, 30, -769, -923, -828, -537, -400, 117, 600, 970, 496, 358, -358, -867]
5693h67r7K19L72M82O75K50k62j70n57o61Rj83J69O94L85M93j05l48l21p45j69
5714g37k66K84N04Q66J8K78J24q26o48k36O5j55N42M33O94J13m26l83n20Rp06
5735i73j92N85L78R35n4L6j94n95l54k98k49M22M70M66N08k16k24m47k52l61j38
5756g47J41L92P59O2L26p00M4m31l42l41j86N63P40O46Qk85l21n38l19j89l09
5777a027N07N07P11K3j90Jm95n56k07r3K96L67N37L98J40l23m80l68n38m3Q5L60
5799c88L30P29j8l4l14n29k23j39k77N13L77N51J51n5l85m5q81k10M8L73N26M53
5821E53K09J1j25o00n75l24n0M5O80M71K16L92k52m52m63l01j59j45M02O16J65
5842C14M77Nm18o38m38k11J75J15O00O17J63K10o42k69n04k30k34L11M62N13J24
$$ y = [-867, -964, -745, -373, 109, 784, 1034, 772, 602, 45, -616, -607, -790, -621, 73, 458, 951, 846, 498, 177, -568, -737, -1003, -719, -215, 651, 669, 947, 1071, 245, -403, -639, -574, -729, -187, 246, 940, 1053, 627, 244, -276, -267, -973, -1165, -580, -202, 733, 679, 715, 521, -74, -428, -726, -975, -553, -83, 383, 891, 675, 451, 4, -248, -609, -747, -606, -214, 545, 607, 933, 233, 277, -154, -496, -837, -1023, -460, 280, 926, 934, 649, 328, -210, -529, -718, -1027, -520, -13, 698, 721, 531, 532, 37, -519, -726, -819, -523, -156, 381, 779, 919, 596, 116, -252, -790, -833, -748, -388, -58, 671, 653, 619, 305, -224, -447, -586, -863, -350, 27, 578, 729, 674, 289, 244, -637, -847, -799, -426, 100, 553, 762, 773, 648, 48, -527, -851, -901, -856, -176, 295, 511, 903, 651, 199, -264, -565, -724, -869, -467, 149, 314, 791, 796, 378, -260, -698, -909, -734, -619, -19, 598, 761, 971, 329, 60, -444, -674, -908, -597, -135, 378, 502]
5863E02K37j37l54m68n62K4J93K31P14J57J21j76l44m44q2m29P4L51L76N48J83
5884G15J23k55m89k71m98q3M93K6P79L69j89r2m22n31k88R9K08Q5K45O38K13m70
5906D05r8m75p03lM04J00N43N86JK7j90q24m10mJ04K76K67M5O41J92l56o04j18
5929a94l37k86L37J38R04M9n9K32n59k55k75m54M70J11K16M19L95j71k34n57l37
5950d47l08J18K23J53M66O00k80P8q81j84k39j75L47L67N30o8J45J46k99n75l17
5971f00k29O2P54J75L89L49k54m06k98o23k87N21q8P75Q9L42j96k76k09l01m30
5992g41O4J72K17P36L20k93K3k55m64k57m00J92N02L57L61N12p40j88m44l97J79
6013e44O7N9L00N08J43k7j6p41L3l05k07J34O24L56O3J3o9m21or39L12K64K91
$$ y = [502, 739, 602, 248, -220, -782, -758, -565, -334, 380, 537, 658, 482, 138, -306, -388, -817, -743, -392, -16, 532, 715, 838, 583, 94, -177, -675, -758, -265, -239, 540, 909, 720, 628, 206, -325, -613, -514, -306, -221, 24, 662, 875, 405, 307, -168, -871, -874, -470, -370, 173, 759, 760, 787, 597, -227, -637, -641, -537, -261, 6, 51, 692, 884, 528, -76, -194, -531, -817, -480, -342, 562, 611, 552, 784, 225, -30, -305, -759, -289, -178, 38, 457, 852, 681, 447, -110, -447, -755, -637, -414, -261, 205, 805, 525, 603, -278, -462, -701, -876, -529, -162, 368, 300, 445, 591, 292, -283, -600, -829, -767, -13, 162, 551, 900, 646, 240, -58, -681, -968, -447, -535, 240, 329, 671, 475, 199, -10, -311, -741, -677, -505, -288, 448, 768, 475, 498, 243, -221, -478, -878, -686, -184, 173, 534, 1046, 306, 118, -326, -723, -544, -477, -418, -118, 390, 533, 506, 490, -251, -218, -523, -730, -596, 28, 384, 447, 460, 391, -30, -36, -975, -663, -399, -108]
6036a08O53R9P9k18n47J4m81l11K31M95L59J76K3K12k34k06n65l52N7M13M83K08
6058D80M1J13m04l38k09j73l42J93P77Q1L60L02l32m20j94o22j79Q9Q11K33K86
6079E53J14j77m06l76j27j19QL71J00M90K92j16k97k84m49j85NJ82J06N99K14
6100D98O5k3l11m31r6k94K72R4O06P8J08J03n41j79k07l08j39M67N01J82L69m16
6122C98j50n16l13O9p1K61K18M82N4L6q0l92m89r7k8L44M91K32K76k62n5k05m03
6145b00k28O0M8M89q0L24L41j29k51o82j03k79K20J94J19M84K0M2j56l34k76m68
6167h45L97M0L24N18J0J19l27R3q77K63j65N0L79M38r3J78P7n55j63l19m3J4K03
6190b84N99L41q8m7k08l7p45p1M7j86M86K88J86L08j26q10J30m33Q4K58J40L08
$$ y = [-108, 545, 644, 723, 505, -42, -28, -509, -820, -589, -94, 265, 441, 464, 676, 442, 236, -329, -681, -624, -211, 272, 480, 521, 634, 230, -108, -317, -490, -832, -639, 138, 219, 579, 881, 549, 129, -65, -687, -866, -777, 34, 267, 553, 667, 490, 84, -292, -419, -538, -530, -159, -59, 431, 723, 607, 310, 26, -423, -608, -603, -421, -315, 284, 498, 563, 540, 229, -202, -298, -592, -320, -226, 380, 458, 566, 669, 128, -51, -258, -566, -705, -238, 263, 445, 814, 398, 248, -268, -581, -512, -583, -322, -104, 378, 432, 468, 388, -4, -493, -590, -618, -274, 217, 449, 725, 463, 408, 203, -200, -428, -368, -320, 169, 89, 413, 754, 625, 374, -308, -411, -690, -470, -276, -157, 327, 347, 389, 233, -101, -377, -845, -448, -408, -84, 434, 444, 563, 236, 329, -548, -285, -450, -400, -21, 417, 324, 502, 579, 24, -139, -458, -501, -487, -284, 315, 656, 568, 521, 313, 276, -469, -540, -493, -679, -193, 95, 281, 589, 463, -347, -217, -650, -566, -308, -168, 140]
6212A40N17n5k88j19l83l64J36k54N08J73K05L67o0k96m23k57k29Q4L00K94N51
6233E47p7q4j87r3n63J7k06L82K33M18O8J01Ro21j01j41l42K85J40L51K97j06
6255C27R0k59j98n71Q0k05M99K85J68J94J56k90k04n37j0J15J68j54Q03k6L8k06
6277B63k37l57ll95J68M89J75K96K50k94m00l42J57k16KL38R7J44J77J91l67l57
6299b21j10k07j51L67K5N27N70k94j85n29j36j61O7J79K33L77J45P4k43k6l84
6320h3n73P3K14K06P1M80j23K07l41l43rl52K44K05K84Q3L77J06k46p18j57J64
6342b31m25N66K66P9J82L46k41m17m4m48PJ30L19K53R2o1P0j05l43j70k88O2M50
6365D9K15J45J63m9k50k07l91l98K75J24K98L80j36K25k19l90j62k03L71l25K51
$$ y = [140, 657, 602, 314, 195, -188, -552, -416, -670, -162, 11, 216, 583, 523, 227, -196, -453, -682, -598, -298, -4, 547, 470, 386, 199, 106, -457, -440, -646, -264, -31, 387, 455, 556, 565, -56, -157, -298, -640, -355, -215, 136, 433, 327, 417, 158, -40, -611, -531, -736, -237, 48, 216, 410, 566, 276, 72, -465, -475, -360, -192, -346, 457, 431, 469, 263, 26, -331, -334, -729, -561, -72, 103, 399, 649, 355, -45, -387, -230, -446, -444, -106, -9, 135, 312, 503, 136, -221, -331, -538, -689, -322, -297, 230, 800, 506, 321, -208, -344, -505, -438, -259, -26, 351, 496, 570, 327, 301, -83, -656, -583, -369, -163, -92, 388, 265, 472, 131, -212, -221, -573, -329, -124, 160, 243, 620, 726, 480, -238, -395, -231, -656, -90, 176, 255, 437, 783, 542, 125, 81, -367, -360, -230, 89, 342, 434, 373, 443, 338, -5, -175, -463, -401, 49, 264, 409, 572, 523, 273, 66, -325, -723, -448, -324, -26, 354, 218, 443, 224, -166, -328, -531, -160, -485, -234]
6386b34N03j6J83J54m33m30m5P2k25K62O81p5N3k9k10l12m05P8o0L09m9N74K6
6409C72J37j13n35j74j59j79L67J61L49R8n7k1j35k52N5n37K04J68K22M54O9J3
6431E07n23jj44l62j27M97K65K48r8J41j28k43m32or9L60k4J71L91k2m2k00n4
6454G5o09L1J23K48L48p6M29k6l94n14J25m46K90J38M79p3K62j15j89L5m05m9
6476c13j06N3M15L54Q9k93K70j29n85l5k23J48L17J74OM25l17k97l7p5k38K73
6498a24P5J25L09J40k19j52l78j12j41k51L94L40J37K71j6l16j57m11m1K91K50
6519A4j65M22K43j57j47k40r3q0m31O82k12L78p7L85l58J53n04l60K53k2J57M02
6541B43J08k3k67J20M0m1l35k3PL02K62r5M83m63m84J27l51j23L27J45K95j16
$$ y = [-234, 269, 253, 436, 590, 157, -273, -318, -246, -471, -209, 472, 397, 450, 421, 211, -101, -506, -428, -488, -179, -228, 346, 372, 509, 396, -139, -313, -472, -651, -284, -123, 226, 324, 267, 246, 111, -141, -86, -623, -419, -251, -29, 425, 494, 507, -16, -17, -161, -523, -650, -153, 112, 360, 262, 403, 275, 32, -400, -406, -505, -145, -169, 2, 393, 371, 329, 129, 75, -534, -503, -380, -132, 216, 140, 569, 543, 149, -365, -240, -686, -396, -258, 221, 148, 410, 295, 106, 141, -264, -313, -419, -366, 49, 403, 492, 199, 469, 340, -245, -280, -503, -355, -38, 136, 142, 567, 250, -47, -84, -159, -397, -124, -49, 76, 385, 525, 306, 154, -224, -336, -477, -728, -334, 6, 143, 414, 398, 82, -75, -486, -527, -236, 14, -151, 271, 514, 357, 210, -30, -123, -203, -634, 48, -164, 214, 137, 522, 164, 317, -187, -547, -294, -316, -159, 243, 351, 328, 61, 181, 221, 180, -155, -178, -171, 131, 393, 298, 781, 318, -166, -39, -390, -513, -186, -41, 254, 138]
6563A38O7K65k32l67n2n4k63J48J98N19j90o4Q4j56k06j54J29j12L04J76L24J29
6585F31o28L44n16j59j30M9L01nL83K6J77m29k72m8m6J10j2K94Q2L98j59k07k95
6608a11k99K83m19K36L57K19L76M0m49k00q4j50m64K63M67J34J98O9q3l45l21
6629b83J5N4J36J06J68R4N8k27m0o0l93M1O4K24K88O6K16k9j96m40k50l7K73q3
6653b35K73Q5L26J37k28l32k11J9k52K22L29K04j24P3O6j54l18Rk18k93N01K19
6675I8K67j33N7l40j74q6M0j12J7N54k2ll3K18l76J65m36l0L58k76N69L2j56J71
6699C69k35j89k34j3J23K52L9P9L7n5J73n74J51p2k31J14J38K84J40j32k5o1l95
6722c17k05K02j06N41q0Q3J91n4k13j76j70K83l17L15M1J86J50l09R3k3m18Q7
$$ y = [138, 205, 470, 238, -129, -181, -235, -498, -350, -152, 367, 177, 113, 197, 41, -165, -319, -190, -302, 2, 178, 502, 631, 3, 347, -169, -328, -458, -409, -108, -113, 270, 296, 473, 44, -228, -276, -322, -212, -224, 70, 152, 550, 391, 184, -111, -410, -127, -546, -310, 47, 266, 642, 682, 233, 33, -51, -201, -665, -402, 65, 199, 397, 466, 383, 38, -283, -268, -214, -78, 28, 196, 290, 348, 121, 81, 21, -372, -331, -267, -43, 245, 311, 527, 498, 302, -138, -388, -425, -152, -235, 38, 123, 449, 586, 358, 26, -185, -166, -418, -196, 133, 337, 213, 286, 352, 198, -120, -111, -329, -622, -121, 98, 365, 232, 289, -51, -225, -311, -271, -383, -366, 188, 166, 163, 130, 348, -28, 137, -299, -329, 29, -247, 322, 354, 198, 369, 134, -55, -289, -302, -179, 73, 112, 191, 228, 173, 346, -228, -77, -149, -380, -266, -128, 156, 296, 164, 139, 78, -317, -522, -320, -426, 115, 35, 118, 309, 255, 42, -134, -304, -21, -338, -23, 18, 204, 354, 45, 138, 115, -303, -216]
6744b16k01l5M94K52L29m01j58k3j77j14J66j88M30J7K60j32j07j15j86k67O6
6765c06j04O21j49L63p5m6k23m00M2R2o5L06n9K79J22j34R6m82j23k8M6j0K55
6788A8J59NK91k89j82k15j4J3J51N0J31L4j02L78k51m75j54K04N4O5L09K27j62
6811B45l23j41K47k70l0N3N7K56L3O5K45l31j89j06j02K23Q4L14k15P7O7j98n4
6834Gk65k33K25J23n1M95j25j76J05n7j25l04J85k08M73k7jJ76j1k2m8k48l10
6857d22K81q9M66J78k1l87j55J47k81J06q3K14J17K08p8n1R4j53k13l9j35k21
6879e17L93L09K21l66K01j27n27N05l74J1P0N15k54L0M1j48J45l35o8o7J10L18
6901H6R4K3K46K7l53l22l45J59j25O61n7J61n8J93k36j61k35j06J16K20M0K43
$$ y = [-216, -417, -452, 42, 294, 623, 222, 64, 41, -136, -250, -84, -272, 158, 175, 435, 303, 196, 81, -105, -372, -306, -410, 211, 62, 425, 350, 304, 81, -319, -277, -185, -250, 56, -3, 276, 398, 264, 360, -122, -245, -273, -227, -237, 18, 177, 182, 473, 184, 2, -213, -227, -214, -63, -13, 118, 152, 50, 428, 177, -298, -452, -248, -194, -129, 180, 407, 245, -78, -219, 28, -242, -272, -219, -162, 94, 127, 192, 437, 106, -83, -189, -291, -68, 16, 330, 115, 192, 259, 61, 7, -258, -491, -266, -143, -194, 301, 176, 0, 105, 48, -77, -381, -196, -404, 69, 42, 41, 217, 206, 184, 136, -112, -422, -141, -230, 236, 414, 393, 6, -149, -2, -283, -177, -260, -46, 71, 279, 201, 150, 244, 91, -122, -161, -296, -517, -124, 185, 406, 40, 241, 114, -413, 92, -282, -271, -201, 314, 60, 90, 131, -17, 128, -207, -275, -342, -232, 86, 180, 203, 449, 476, 123, -199, -544, -385, -510, 151, 94, 255, 197, 390, 154, -7, -242, -348, -232, -12, 28, 271]
6923B71j97J84k10j20n5K7k09L64M5j39L51K97l91n75K99k77j5L43j85P5L46O8
6945B97l4n98M24j91k84P8K32J20L20j24Q4l76k6J50k13m48N51j60K47K97j30
6966B16j21j27j25p0L1r8O09k51K41K32m02j80p2k07JN7JM88q0M1j40j12k12k8
6990c08J25j49L86j78L47K83j64k71l14j28L33l13J57J46L02j52R7J90k93j19
7010b3j94m5J99K99l17L04L20l80k06k05j53P9j07M45M5R6J49j82K8k55j07l4
7032b44o9K29Q0K97N7K84j35o45Po1K17j06K17o1J13K03k67L7l29j11M5K21j55
7055a76J27K29J23j7j31k39q0j05j45J67QN41j15j1k99J95l9m80K76J15J18q8
7077b6L41l15K95m24J38n24N84l91J81L80K3j01n0L1k80k73J08m3J36K74rj25
$$ y = [271, 74, 258, 48, -72, -127, -100, -309, 55, 100, -39, 312, 609, 218, -357, -58, -335, -350, -7, -192, -117, 229, 297, 263, -335, 89, -102, -386, -308, -76, 44, 364, 240, 324, -52, -78, 72, -141, -589, -38, -198, 49, 346, 216, 95, -32, -157, -227, -196, -294, 315, 64, 305, 537, 135, -45, -117, -324, -323, -266, -265, 223, 143, 184, 44, -68, -280, -308, -183, -332, 54, -124, 223, 506, 342, 71, -243, -371, -38, -351, -194, -48, 254, 102, 199, 389, 96, -23, -217, -262, -63, 236, -81, 223, 543, 163, -43, -248, -401, -322, -429, 16, 61, 157, 306, 124, 152, -103, -210, -244, -313, -84, -4, 293, 350, 634, 499, -146, -139, -200, 17, -89, 128, 67, 180, 383, 116, 153, -176, -287, -242, -21, -176, -49, 180, 303, 286, 155, -84, -164, -269, -414, -247, -239, 302, 187, 176, -123, 72, 33, -447, -171, -56, 62, -26, 315, 0, 295, -129, 9, -515, 69, -322, -141, 239, 262, 161, 111, 142, -138, -411, -303, -346, -210, 64, 55, -70]
7099g0M07k51n2k17k45K78K95j73L47j14M7j14j18j02j86P2q9J55J18K22k29J39
7121A20j98M4j00l2l39O1Q62j20N0k89j6j87J44j76j51L96L5J7J38j11l83J45
7143i0k8P5L8k74J70M19K8l29J47j94m3j59L45k79K7J77K16P6j13l13M28m29l62
7166d67K20J81Q4J74J77l95J15p7j75j20J70J13K48j61J79j48Q9p9Nl89R1L15
7188A50j78lJ29k9lL88m13j55J3lN0K12O5k54L01j93J45j24%k21K7p4L11J63Q5
7213C89m14j25Pk3l8o8R6L73l48K85j97j64Kk20J49j57K34J71K74K30Q1k43k30
7236F4p6J67n13N10l59O21j96O9k50j6j39k28J63j09L49Q5L0K19j49l92L16m71
7258c05j9K19K51j67K81r8j21j95J6K08l64J26J93k42M33J37k03k6j40j92j65
$$ y = [-70, 337, 86, 34, -183, -428, -150, 145, -28, 319, 205, 252, 138, 20, -82, -268, -196, -285, -130, -12, 210, -19, 120, -78, -34, -134, -166, -505, -444, 418, 298, 348, 59, 43, -144, 0, -176, -327, 69, 104, 121, 259, 148, -235, -90, -118, -43, -5, -279, -109, 310, 338, 9, 156, -38, -81, -240, 105, -174, -147, 30, 246, 322, 209, -104, 324, -105, -467, -247, -66, 18, 192, 369, -26, 89, 12, -163, -283, -113, 0, 248, 87, 266, 118, 207, 128, 133, -256, -165, 150, -28, -31, 98, 69, 66, 454, 41, -114, -101, -104, -54, 158, 223, -31, 270, 77, 222, 98, 98, -123, -96, -170, 141, 304, 389, -25, -150, -143, -166, -204, -272, -176, 197, -151, 134, -63, -227, -225, -445, -296, -453, -219, -48, 226, 456, 537, 294, 64, -12, 155, -358, 152, -207, 414, 218, 287, 37, 21, -118, -346, -183, -292, 57, 142, 172, 391, 242, -150, 166, -305, -324, -105, 146, -21, 260, 162, 41, -154, -138, 70, -294, -168, 25, -217, 216, 353, 150, 124, -16, -208, -373]
7279c73K11o7K37Oj13N74k92j64j51k6k53L37K12r2K81l2M2l14L23k94k43M5O
7302a40K96J7L27l01j78QN1j06j12J95K8M52l64j15K45l66P0m61N97k1j00K62
7324B84j15Q1k06K9j89J8j84M52j30L14qk33r2J85m73K15l1K55k21k68N12J51
7346C46j55m60M41j35l19M7R5p3L31Pk26R6n7N8Kk63m1K10K51L3j87M32l94l45
7370c06Q8n2K47j30M17%n2oJ48m04p3K60L5j25j6J55k26K64K56p32M62n55l2K51
7394a26J36K50n8m1j68j06Lk49K10J8K01p6L51j22K29n51K90k13j12O8M1m37N92
7417A30P4j12r2k75L07l81J23M7K46K02k50L51n1l07j08j90m3M66L9l55J47K49
7439B17l4m6k72k69J30L8L48k0J39j6M4j63j63Qk21J27L7K70k01R1N2j68J19l86
$$ y = [-373, -162, -229, 8, 14, -99, 475, 183, 19, -132, -158, -411, -74, 138, 46, 327, 295, 337, 23, 346, 52, -191, -146, -140, 156, 173, 500, 199, 21, 29, 80, -26, -138, 57, 85, 537, 173, 58, 303, -63, 7, -454, 143, 122, 22, 284, 169, 250, 44, 73, -116, -98, -282, 170, 40, 354, 346, 113, 21, 206, -267, -52, -83, 172, -49, -317, 195, 346, 191, -269, 172, 37, -282, -235, -140, -213, 118, 125, -101, -5, -62, -4, -2, -265, -306, -96, 155, 188, 1, 433, 39, -306, -218, -270, -23, -153, 264, 264, 212, 206, 354, -50, -123, 137, 172, 47, 31, 186, -40, 224, 480, -252, 210, -345, -377, -126, 10, 260, 202, 161, -7, -113, -110, -359, -149, -131, 70, -6, 345, 223, 452, -99, 191, -22, -134, -66, -25, -462, 130, 204, 92, 0, -275, 32, -349, -226, -179, 67, 269, 19, 370, 319, 12, -96, -286, -329, 137, 176, -179, -32, 217, 183, 137, -135, -404, -274, -236, 112, 92, 231, 215, 259, 96, -67, -59, -280, -153, -116, 154, -47, 44, 96, -72, 47, -339]
7463c39J33k9r5M95j13K17L9m38J60L00m27q0k24J4M27J6j6K11n29L79j05j77
7485a81J22K06Q4K0K2l4l56k07J01JO6K34j74M56K24m11N8j31k07J01k27K76k21
7508a78J61K31k9M3m42J99j6J59k64L10J39k45K63k22j13j17ko0j86K14Q7K31
7530A63l29L51j77M5j6j23K14r7k42M19J41k25J48m09J39k06J05J76k62O37l10
7551A42j92L22j93ok62J05QK44l34K11n5J63J14m19K35o0j77J74Jn8J82PK30l54
7575B8j06J35k25J35k37M44j27J86q7j03j06J8j31J45K28j07J17J94m16Lj57J3
7597a56O1q3J44M3J52L36l40l51k8J51q7k23L72R0O5l1P0j68K86j49j24l29K66
7620c3J55Qq0j17J50m4r0N0j32M6j61k1L35R8k91K03m3J52j27k5q2K92j13J35
$$ y = [-339, -206, -235, -330, 165, 52, 269, 308, -130, 30, 330, -97, -177, -401, -387, 40, 56, 40, 251, -278, 101, -4, -181, -59, 147, 231, 251, 273, 239, -117, -324, -223, -222, -156, 78, -96, 360, 584, 173, 231, 100, -107, -6, -233, 43, -178, -17, 214, 185, 228, -214, -15, -31, 128, -136, 174, 313, 68, 331, 109, -4, -121, -123, -183, -369, -155, -68, 163, -166, 185, 8, 53, 37, -86, 128, 31, -211, 208, 349, 124, 272, -137, 2, -204, -99, 77, -185, 452, 142, -50, 272, 79, 73, -189, -84, -76, 168, -166, 45, -10, 153, 267, -152, 83, 23, -154, 20, 21, -37, 145, 152, 382, 28, -78, 57, -168, -33, -270, 174, 47, 233, 146, 43, -63, -45, -176, -31, 197, 90, 207, 401, -15, -12, -169, -156, -95, -178, -34, 9, 161, 497, 157, -194, -222, -71, -158, -381, -9, 81, 146, 115, 185, 17, 303, 154, 30, -299, -33, 122, 130, 50, -67, 83, 39, -51, -1, -133, -87, -248, -269, 66, 164, -127, 76, 33, 185, 58, 33, -49, 243, 130, 265]
7644B65j89N1k97J50l4n7R2P1J45k92L05j72l8r4k25J27m5J74R4J50K38n2k41
7667A26q0j91qj7K8K26J38j13o4m9J59l94Q7l0J81jR4P5q7K29j29k7j60l68L02
7692g3J72m2m8j15p9M43k83%j08k00M63j55J97K9j41j32q5K13m4j99K33j13L13
7715B46k82N1J0J29l87J98K3k9r7L82k83P5J15l14k79J91J74J76q4J61j01Q8l36
7738a73n3J66k36Q2K87J44m16M69k00L06j75j60k47j21K8l1J82K07K47J3l59k36
7760b76j29M26N2l28L71J71j72K85j70j61j50oj99q2J49L06K2m9m6J4k3k89J85
7783i9K7k5o4L02M4j08m3J35k16K30l26K74r8j65K06O6j39J42K0j17J87n02J25
7806a44Q9M7K64j42r3J67l91N8M40o67N96j63K9Q3k73N6j06K37O9j12M2K01j08
$$ y = [265, 76, 127, -170, -20, -54, -111, -19, 52, 197, -95, 210, 38, 0, -94, -319, -192, -237, -63, 31, 181, 419, 367, 126, 46, -145, -153, -170, -142, 84, 222, 109, 45, -4, 155, -239, -152, -182, -1, -2, 92, 167, 80, 309, 180, 153, -7, -375, -73, 99, 57, 9, -106, -185, 258, -25, -25, -133, -333, 130, -25, 172, 201, 60, -72, -157, 56, 12, -187, 46, -67, 246, -36, 15, 25, 154, -233, -35, -12, -41, -138, 244, -39, 36, 151, -163, -442, -251, -77, 99, 15, 176, 75, 163, -173, -226, -60, -296, -214, 73, 217, -199, 270, 70, 376, 201, 41, -206, -327, -299, -330, -148, 59, 306, 319, -40, -276, -405, 21, 73, -255, 116, 287, 115, 400, 230, 69, -81, -87, -286, -368, -219, 87, 109, 60, 14, 28, 5, -284, -99, -72, -97, -161, 141, 185, 77, 34, 169, -47, 183, -143, 131, 33, -132, 74, 140, 1, 143, 163, 46, 233, -269, -144, -55, -8, 256, 114, 21, 188, -203, -145, 295, -372, 224, 61, 90, 173, -100, -44, -150, 87, 156, 44, 86, 287, 179]
7829A79j22j23Q0j26J43j83J23J32r4j51j8J71l5j12q9J05R5q3P4QK46j58p5l11
7853c24J89L6K3O0O1P8j51M8j8j68J2O5l10O51j73p5M0L64k35k38J39l12j28Q9
7877b77M44J12j13J7l12K16k48J69k63L05K3o2J65K45l55K66k96m19J81j4K25
7898Im8o8K40j62n0N9k30K93k95J07L72l31M22l32L24m34J2Ok86J30P1J31L34
7921B74j69l5M7j71Q8k03j42L40m8j00L58J55l48L9n31J47J71k1L65j70Nm7j68
7944a64J00O1l5l06M14q1K6lK92l45L01k30l22P8J51k02L51L1k5j96J07k5q8N0
7968f0p5j23K33O3%J5kn0j18J28J68n10M30P0r7P6j69J11l11K15J13p5j15M1J60
7993A18L1O8k35M1Mj35o5K10k10L01j65P8j10J27k05j47K55l2K93j36j63J34j29
$$ y = [179, 57, -66, 14, -112, 31, -152, -29, 103, 9, -142, -160, 11, -24, -136, -225, -120, -25, -108, -34, -26, 220, 62, -13, -324, -135, -99, -76, -16, 45, 123, -28, 20, 2, -166, -154, -89, -399, 252, 79, 4, 44, 408, 173, -65, 74, -238, -366, -277, 167, 279, 166, 183, -129, 87, -161, 8, -255, 50, 73, 11, 176, 421, 66, 332, 36, -383, -202, -216, 9, -39, -107, 133, -29, -79, -20, -250, 43, -252, -145, 227, -104, 318, -14, 310, -124, -112, -106, -392, -262, -191, -60, 274, 105, 70, 117, -54, 34, -169, -311, 29, -19, -119, 239, 394, 46, 85, -446, -299, -128, -149, 216, 46, 51, 4, -164, -64, -3, -38, -344, 70, -11, 15, 12, 304, -41, 260, 30, -292, -214, -63, -265, 86, 117, 92, -104, 3, -22, -110, -60, -135, -258, -25, 38, 38, 53, 51, 1, -117, 11, 179, -331, 99, 169, 72, 148, -21, 90, -221, -6, 107, 32, -83, -42, 118, 149, 217, -18, 23, 27, -108, -173, 37, -173, 128, -37, 41, -69, 58, -147, -294, -39, -71, 222, 86, -77, 57, -72]
8016g2J26J2l54K85k23M41k69j36K19K2j22J04j31K10r8j17O0k2M1K58k53k16
8038b35K5N7J58RO4n0PN6q4k54J70K26m26L27p1K5N7k18K07k71nL14q9k02J49
8063e4J18K55m34L22m11j54N5J29O0L33j33j44j82L30n3K9K9j15q1O9k3L15k57
8086Cj40L29m10K50k3j51K45J33l01J58l5k4k74K48r0K54j20J84K1l24Q6L6l85
8109c30N68j12Q1j36j12K64l00o1K68k50jJ04j36J2K14K9j89L89l81K74l18p7
8131b00j15M18K8l7k19K25p0K34l40k55N36m48O01m00J01n7J90j79k48K8J51j42
8153a98J37K34j39K94l43o7j06JO5K01m9j1n0J74m5L3l4j48J14l9j8J81O6j45
8177A08k07J87k32n1r5J87m0K27J60K30m40j47J64k29
$$ y = [-72, 54, 66, -288, -3, -226, 215, -54, -190, 29, 51, -71, 33, -98, 112, 14, -103, -43, -65, -24, 234, -19, -235, -210, -153, 5, 14, 78, 28, 35, 91, 7, -247, -77, 149, -277, 50, -21, 4, 61, -157, 50, -221, -226, 88, -1, -203, -54, 64, 319, -115, 207, -204, -358, -303, -174, -114, 219, 86, -58, -240, 90, 37, 66, 95, -20, -101, -32, -55, 260, 3, -137, 192, -218, 32, 9, -142, 103, 236, -65, 93, 58, 34, -240, 8, -82, 172, 52, 236, 257, -67, 19, 55, -330, 238, 126, 207, 71, -41, 223, -77, -138, 130, -120, -121, -17, -153, -141, 73, 102, -87, 302, -79, 195, -123, -200, -315, 103, 131, 94, -125, 100, 30, 264, -76, -331, 205, -243, 358, -42, 59, 2, 192, 13, -235, -207, -56, -198, -61, 173, 34, 328, -15, -82, -188, -187, -122, 79, 30, 19, -31, 143, 98, 131, 97, -51, 63, 24, 6, 187, 253, 108, -99, 88, -144, -195, -290, -103, -143, 84, 244, 474, 34, -113, 51, -178]
8191a78
$$ Imaginary data points
##PAGE= N=2
##DATA TABLE= (X++(I..I)), XYDATA
0@%%%%%%%%%%%qJ6j6J6j6K4l2L2m0M8n6P2q8J04j19J36j55J79k08K36k71L08l48
34a86L95m45N01n60O27p00P80q69R62j065J179j303J440j589J751j929K124k340
52a227K578k845L144l477L857m293M794n379O079o933Q000r374J1224j3865J7972
67A0255k5318M2565j65075j14224J90741J31998J42757M4547k2811j30362j50376
78d5303j41484o3689R031J04176J50964J53472Q1395l926r2877j41417j52523
89a42181r4189n886Q2639J28118J39215J02585L1580o0789j24625j41930j09619
100a95082m3639M4939J16612J44265J14772M7577l4432j02312j34059j16726n8273
111b16358J7128Q4769J27536J25678P4982o090q0482j23559j24291q0960o229
$$ y = [0, 0, 0, 0, 0, 0, 0, 0, 0, 0, 0, 0, -8, 8, -8, 8, -8, 16, -16, 16, -24, 24, -32, 40, -48, 56, -63, 73, -82, 97, -111, 125, -146, 162, -186, 209, -236, 265, -295, 332, -368, 412, -457, 505, -560, 619, -684, 756, -833, 918, -1011, 1113, -1227, 1351, -1494, 1650, -1827, 2030, -2263, 2531, -2848, 3231, -3702, 4298, -5076, 6148, -7717, 10255, -15063, 27502, -137573, -251797, -61056, 70942, 213699, 258246, 235435, 105073, -45303, -186787, -250476, -241445, -137269, 13695, 167167, 248562, 244636, 151759, 10342, -142181, -236370, -242256, -159617, -31499, 107716, 210301, 241881, 181092, 56467, -85463, -195082, -238721, -193782, -77170, 67095, 181867, 229444, 195012, 92700, -41359, -158085, -216358, -199230, -114461, 13075, 138753, 213735, 207645, 127163, 3604, -120687, -201647, -207876]
122b07876O9907J17452J21131Q3711J8697n2625j06297j20969r3437l3632L9519
133a64419J01582J25404R8979L6752l4023q9601j15551j01592m8536K1007P9776
144i0222J09880J04002O0888o742p2986j09558j06828o5403j054O4104J05078
155h841J03786O7862J1342m9046r5402j06992p7305k0039M1274Q8221J06162Q4313
167A45335K9365l5444q4519j01392q4436l7103K4132P5245R7864Q6856M7260j1481
179A51682o8257r9567r0662n0527M747N9419R4111R3977N6112P43n1358q5603
191A4817r2218o4832j2161M3194Q2656R2959P0596K0684l7450p9998r0982p0732
203a23467k7572K6472P2482R0705P4801L3626j6972o3476q9993q1465m1323J2332
$$ y = [-207876, -137969, -20517, 100614, 184325, 203022, 150397, 44100, -76869, -170306, -203938, -164419, -62837, 62567, 161546, 198298, 164275, 74674, -40877, -142469, -191005, -169998, -90222, 19658, 123660, 184548, 177806, 104820, -4738, -111566, -176969, -178023, -113919, -8841, 94945, 162807, 174149, 125103, 29701, -77291, -154596, -174635, -133361, -45140, 61022, 145335, 174700, 139256, 54737, -46655, -131091, -168194, -144062, -68817, 29047, 115903, 163163, 151682, 83425, -16142, -106804, -157331, -152584, -93165, 946, 94923, 151035, 151778, 100420, 14817, -77401, -142233, -154394, -111200, -28544, 64415, 135011, 155695, 118245, 38247, -52735, -123467, -151039, -124567, -52085, 38620, 113421, 147047, 130075, 66599, -23394, -104859, -146182, -133850]
215a33850N9404Q6230Q1353M7106m849n2508q0612q1453n4556o023M5787P9513
227a4458Q3082N8104J3378l7499p6148q4768o1370j8275L0400O8598Q3093O6715
239A10852K5776k2676o3443q1693p1603l3048J6627N9277P9560P2632L9833q858
251A23236n4343p7975p2816m3480KM5290P5575P6991M9524N400l9149p2478p8082
264f2305n4464j1055L4880O6444P6194N8993J9236k7715o2899p5211o2481k7227
276a27610K0007O0302P6194O4505L0491j3164n3488p4085o7342l5675O494M6626
288f6745P1130P0694M2454m83m2658o8158p0862m8321n986L7351O5878O9827N1194
301A05315J3771k9708o2374p1238n4547j9696K2688N8317P1591N8154K4516j7006
$$ y = [-133850, -74446, 11784, 93137, 140243, 135394, 82886, 2274, -79179, -133735, -139758, -93971, -14458, 68624, 126728, 140106, 102607, 26459, -58309, -119679, -137954, -107554, -38956, 44137, 110852, 136628, 113952, 50509, -31184, -102787, -135835, -119208, -59931, 19629, 92261, 132094, 123236, 68893, -9082, -81898, -125378, -125376, -80086, -4511, 72480, 122004, 127404, 88255, 15777, -62305, -116769, -127824, -92944, -26500, 49694, 108687, 127923, 100208, 37309, -37902, -100383, -127610, -107603, -47301, 28893, 93398, 123889, 110725, 57237, -16848, -84190, -119865, -113371, -66745, 4385, 75079, 117533, 117050, 74392, 6234, -64628, -112949, -118935, -81584, -15706, 54121, 105315, 119086, 89378, 27004, -44234, -98781, -118477, -95789, -37472, 34119, 92273, 116789, 99783]
313I9783n2511p0252o2032k9888J1869M7481O6999O3219L7318m849m3221o5912
325a996o3956m1521k925L8574O3897O5519M4202Q098l0648o0640o6746m8234j3446
338a09822K5110N5586O6886N3558J8934k1125n1971o5003n5581k5475J4943M8259
350d5701O3747N7087L0943p805m3837o3521n8977l3734J506L7976O1123O1345
362F0152L8791K694l3115n7231o2065m3552q530K8898N4249O1182M6948J4647
374A03068k3331n1526o0809m8827k0911J6779M8572O1271N1431K3839j1086m3400
386D5070o0001n3823k8548O839L7874N7131N6387L3949j409l4426n4872n7309
398e3138l8011m306L0488N3449N6019M0421J0670k4351n0184n7638m3312j5455
$$ y = [99783, 47272, -22980, -85012, -114900, -103031, -55550, 11449, 74668, 111986, 107137, 63916, -1996, -65952, -107473, -110398, -71824, -7927, 57592, 101794, 109892, 79244, 18604, -48142, -96376, -109822, -84712, -29126, 37760, 91318, 110252, 89127, 37156, -27847, -83428, -108903, -93960, -45701, 18046, 75133, 106076, 98271, 54434, -9087, -68064, -101798, -100292, -62316, -1193, 60152, 98943, 101637, 68522, 11291, -50774, -94326, -102856, -73958, -19709, 41473, 88421, 103068, 79737, 28211, -32598, -81425, -102336, -85557, -36985, 24286, 75717, 99556, 88470, 45070, -14931, -68754, -97302, -90463, -52589, 4542, 60929, 94878, 93469, 59043, 4171, -53138, -91149, -95455, -64967, -11518, 44501, 84922, 95592, 71241, 21057, -36581, -79893, -95348]
410i5348J9133M6681N7831M6832J9177j4450m2784n6573m9184k3536J0083L8274
422d3864N3754N0799K9278l540l5455n3225n1572l3030j469L0845N2356N2854
434D7731L4733N460k5645m8117n3360l8587j0221K0510M4735N4477M2495J4957
446H9168j8152m2361n2771m3816j9617J2741M0069N1002M4779K3794o251l5285
458D3300n1600m7514k7375K721L1585N0050M9246K9660O57k7559m6364m9169l4111
471g6473n552K3572M3918M9100L7337J1878k0005m3195m9669l8683j4466J5294
483f6944L9903M8969M0242J7729r539l4976m8513m4127k2464O477L2174M7356
495F287M5397K6294l041k9616m5555m4139k9256k467K4841M3022M5850L2698P712
$$ y = [-95348, -76215, -29534, 28297, 75129, 94306, 79856, 37072, -19501, -68685, -92221, -82138, -43864, 9890, 60689, 89967, 86427, 50972, -2253, -53825, -86855, -88324, -57479, -5123, 47731, 82464, 87924, 62279, 14162, -39198, -77785, -88006, -67496, -22761, 31716, 74211, 89168, 71016, 28655, -24116, -67932, -87549, -74808, -34739, 16263, 61042, 84836, 78585, 43300, -8300, -55814, -83189, -80468, -48883, 1167, 50413, 80073, 80730, 53171, 6807, -42362, -76473, -82025, -58453, -14535, 34565, 71902, 83780, 63775, 20580, -29089, -67772, -82238, -66944, -27041, 21928, 62170, 79899, 70360, 35384, -13129, -57256, -79720, -73243, -41069, 6287, 51684, 77978, 74937, 45321, -234, -44373, -73629, -76096, -51255, -8233, 37617, 70315, 78027]
508G8027k0674m2589m7412l4575r959J7054L9106M7013L6898J3218j3150l4845
520B8112m5133m0073j9071R025L3211M5015M1453K2310n581l0559m3964m1301
532d6556k4416L59K6411M1907M2778K7820L622k1692m0503m4935l1416o269J9700
545e3190L8516M3499L3043J0347j5752l5202m2624l5466j5258J1291L3516M2755
557A5475L7166J8656p677l0894m3277l7769k0039L904K6524M0405L9869K3847
569F6190L03k3400l8913m0895k7985l711K1466L7457M1038K9192P528j7832l5806
582A4632l9793l0868j1362J2090L3182M1390L4260J4221r989l0842m0542l5625
594d9246j6608P045K7337L8410L6292K1010k523k4879l7567l7540k3867j786K2716
$$ y = [78027, 57353, 14764, -32648, -67223, -77182, -60128, -21022, 25991, 62889, 76107, 62957, 28112, -17021, -57094, -76165, -67140, -33929, 11086, 52539, 74849, 69268, 38709, -5255, -46556, -70972, -70613, -44202, -2295, 40483, 68303, 71925, 50233, 9730, -35205, -66621, -72890, -53190, -14674, 28825, 61868, 72215, 56463, 21261, -21363, -56829, -72087, -60796, -27280, 15475, 52641, 71297, 63620, 32726, -10551, -48320, -68359, -64455, -37931, 2474, 42343, 66190, 66493, 43093, 4180, -36715, -64700, -68411, -46945, -9488, 31550, 60742, 68270, 50438, 14632, -25161, -56029, -67391, -55301, -22119, 19271, 53531, 67752, 57763, 26921, -13621, -49246, -65854, -58809, -31472, 6938, 43230, 64240, 61717, 36838, -729, -38269, -62136, -63922, -41206]
607d1206L7470L7790K4997M454j8483l4721l8727k7375p539J4617L2045L8590
619B1912L0998J1334j2339l0713l8034l2585j4060R576K8649L6708L2421J7159
631F1026m381k5235l6832l4492j9932R68K2857L6213L5986K1768J038j9868l4003
644E113l5779k4295m538J6611L1224L6161K8010Q407j4246l0883l6305k8700j1144
657f0364J1417K8769L5902K9079J3271o524k5631l5347l1857j6628M035K3196
669c0682L4807L3790J9190k209k1465l2592l3304k1654j820J8562L1546L3132
681B7301K3766N866j4947l1123l4212k5715p762J2305K8783L4437K7349R751r247
694D6552k5460l3739k8842j4581P002K3733L2917L0587J7130l832k2564l2768
$$ y = [-41206, -3736, 34054, 59051, 63505, 45022, 10301, -28426, -55801, -63340, -48723, -16678, 21912, 52910, 64244, 51905, 21192, -16842, -49427, -63487, -53911, -25262, 11446, 43867, 61026, 56645, 31410, -5422, -39914, -59846, -58878, -36021, 192, 36178, 57946, 58984, 39116, 5113, -30666, -54961, -59499, -42888, -11664, 24497, 52507, 60914, 46668, 15785, -20520, -49220, -60364, -48947, -20178, 15724, 44803, 58074, 51550, 25919, -9428, -41285, -57913, -53878, -30682, 4125, 37915, 57105, 54896, 33431, 839, -32465, -54119, -55939, -37377, -5831, 27301, 51067, 56933, 41986, 10863, -23349, -49064, -56826, -44521, -15738, 18699, 46048, 55799, 46552, 21092, -12647, -41489, -56070, -49068, -25335, 7582, 38169, 55299, 51467, 28903, -3865]
706c865l0089j8388L57J9116L0914L1273K0676L273j6004k9983l2653k3235m816
719e3424J3839K7918L2807K4588P637j1733k5876l1410k6164j1149P963K4542
731b0462L1364K7818J3913n359k2694l1694k8428j5189K763J9664K9680K9846
743C1222J7620K75j6828k8909l0502k0576k983J5389K7926L0412K2305N516j3155
756C7712k6354k9657k3582q509R549K4453L0442K4773J1338o911k2626l0306k6963
769c6641j2297M987K0222K8889K7468J5035j838j8777k7248k7811j8293j135J6538
782c0901K7400K8443J9242L990j4428k6408k8335k0587n918J1079K4197K8718
794A6492K2902Q176r017k2270k8405k4566j0654O671K1238K7480K5020J3030l906
$$ y = [-3865, -33954, -52342, -51985, -32869, -1955, 29318, 49994, 53267, 37263, 7280, -25373, -48608, -53424, -39585, -11667, 21140, 45728, 53365, 41632, 15756, -15654, -41818, -52967, -45004, -20462, 10902, 38720, 52633, 47274, 24580, -7114, -35542, -50731, -47968, -28304, 1376, 31222, 48842, 49117, 32289, 3380, -27122, -47698, -50681, -35292, -7366, 23046, 45351, 50867, 37712, 11358, -18299, -41881, -50390, -40841, -16388, 14054, 38827, 50165, 43254, 20628, -9678, -36641, -48938, -43951, -23729, 5160, 32628, 47663, 45825, 27048, -200, -28011, -46304, -47439, -30901, -3501, 24942, 44184, 48174, 33746, 7338, -20997, -41584, -47502, -36423, -12226, 16492, 39394, 47570, 38553, 16283, -12122, -36688, -47342, -40671, -19433, 8047, 33067, 46097, 42191]
807D2191j8972k7310k5508j5015O88J6899K6898K6656J6789J208j4653k5680k7073
820b2882j8531l348J2642K3835K6857K0624O390j0734k2462k7064k1964q957Q286
833c7308K1822K6923K2075J0713n343j9611k6614k3669j1759K610J7352K5707
845B898K4906J4666j153j5513k4781k5462j6278j505J3810K3927K4862J8223M273
858D2873j1667k3022k5535j9045o366R222K1412K5895K0469P747o701j9366k5685
871i769k2030r870M816J7882K4951K2659J2506k804j6559k3997k3201j4412J67
884c9661J4439K3717K3732J5771K341j2477k2858k4241j7067m017J0198K1157
896h966K4594J8602O135q315j9823k4061k0188q263O287J8817K3762K0602J0461
$$ y = [42191, 23219, -4091, -29599, -44614, -43926, -27027, -129, 26527, 43316, 44524, 29871, 4191, -22882, -41413, -44761, -32119, -8284, 18573, 39197, 45587, 34853, 12391, -14673, -36637, -45594, -37308, -15486, 11437, 33512, 44225, 38882, 19271, -7343, -31012, -42771, -40161, -22809, 2898, 27804, 42470, 41317, 25804, 1023, -24439, -40717, -42222, -28412, -4485, 20377, 38600, 42873, 31206, 8184, -17351, -36396, -42762, -33540, -12128, 13767, 34236, 41983, 35282, 15916, -9769, -31799, -41669, -36853, -18971, 5980, 28639, 41145, 38341, 21782, -2215, -25416, -39828, -39661, -25222, -1505, 22227, 37998, 40339, 27862, 5004, -19237, -36304, -40321, -30123, -8966, 15628, 34230, 40365, 32050, 12227, -11834, -32022, -40285, -33998, -15181, 8581, 29183, 39644]
909C9644l933j7163k3410k1639j1910J478J5418K2722K2769J3395r2j3188k1946
922B145k3136j5277j476J1426K0703K2855J6916M386r775k0001k2905j7895o618
935c8652P377J9384K3072J8952P810n229j7360k2858k0207r365L206J5538K2197
948C865K0997J2154j949j4439k1496k1227j3411j65J2495K0805K1226J4772K778
961C6405j0982j9596k1873j5845m750Q666J8912K2322J7201N891p092j7280k1545
974i566j8650q092N202J6292K0846J9446J0294l305j4846k1192j9450j1474J029
987c3466J3227K0630J9960J2835R90j1279k0033k0698j4166k939R911J8790K1169
1000A4931J5716M305q554j7530k0692j6558o142O059J6891K0030J7548Q312m009
$$ y = [39644, 35711, 18548, -4862, -26501, -38411, -36933, -21515, 1207, 23976, 37371, 37279, 24091, 2145, -20991, -36268, -37744, -26318, -5615, 17240, 34156, 38542, 28767, 8766, -14139, -32034, -38652, -31275, -11891, 11181, 30133, 37943, 32714, 15354, -7504, -27711, -37076, -33870, -18332, 3865, 24862, 37016, 35067, 20628, -868, -22095, -35506, -35671, -23176, -2371, 18855, 33627, 36405, 25423, 5827, -16046, -31891, -36641, -27975, -9063, 13259, 30460, 36351, 29259, 11979, -9566, -28216, -36308, -31106, -14814, 6032, 25478, 35772, 32467, 17621, -3571, -23021, -34495, -33466, -20239, 391, 20351, 33186, 34176, 22897, 2864, -17834, -32000, -34939, -25028, -6238, 14931, 30647, 34952, 26398, 8868, -11824, -28382, -34524, -28465, -11574, 8456, 26004, 34316, 30307]
1013C0307j5597k0701j8324r251K435J3935K0464J8313J0910p38j1917j9730j9083
1026a8977j2704r21J0685J8638J9729J3951K728r491j7695j9534j4766m527P412
1039b5472J6428J9582J6001O292n225j5538k0090j7086p623M136J4468J9168J7531
1052B2572R069k181j2697j8546j7965j1208P4J1640J8335J8849J2153J226j0028
1065B1293j7856j9165j2650k671Q159J6215J9186J4733M353o507j5522j9235j5796
1078b5463o431N515J4924J8518J6207P954m038j3428j8037j6533r019J106J1931
1091a6794J8472J7535J0224J5j0868j7659j8020j1184j067R440J6113J7380J3504
1104B7091K718p565j5311j8302j4179m856O427J5244J8112J4485N780m447j3999
$$ y = [30307, 14710, -5991, -24315, -33566, -31131, -17196, 3268, 21581, 32491, 31753, 19836, 106, -18977, -31681, -32602, -21917, -3279, 16450, 30401, 33129, 23638, 5943, -13591, -28357, -32884, -25472, -9044, 10538, 26539, 32831, 27606, 12068, -8022, -25108, -32731, -28595, -14127, 5041, 22572, 31641, 29460, 16763, -1783, -19748, -30956, -30882, -19242, -907, 17942, 30095, 31321, 21293, 3437, -15728, -28378, -31049, -22890, -6675, 12511, 27244, 31597, 25090, 9568, -9667, -25463, -31894, -26379, -11455, 7063, 23270, 31224, 27186, 13758, -4279, -20812, -29831, -28725, -16794, 1678, 19213, 29437, 29452, 18584, 925, -17095, -28279, -29346, -19906, -3793, 13587, 27091, 29809, 22244, 6933, -11369, -25548, -30404, -23977, -8733, 9379, 23864, 29644, 25197, 11198]
1117A1198j7630j5226p510K744J2588J7320J6844Q859j673j1670j7155j6981j0117
1130b8409N43J0631J5860J6675J0949K034q608j5496j7082j2805l375P402J5030
1143f651J7621J3547M220n900j4145j6930j4240n899M355J2602J6769J5241P833
1156B8423k981j1870j7034j5639q392J200J1239J6280J5614R542L58r190j5795
1169A755j6180j1002j968P988J5389J6578J1932L238p169j4306j6374j2683m715
1182b7517N707J3088J6358J3429O058l611j2303j6478j4737o991K410J1459J6722
1195C594J4210Q190j317r784j5464j5267r364n94Q866J4608J5896J1351J632q190
1209A8367j4291j5579j1744k897O218J3540J5717J2299M669m586j2800j6166j3359
$$ y = [11198, -6432, -21658, -29168, -26424, -13836, 3484, 20328, 29187, 27514, 15844, -1311, -18292, -28409, -27866, -17235, -1375, 15300, 26249, 28283, 19675, 4179, -12903, -25708, -29083, -21681, -6651, 10970, 24517, 28737, 22837, 8692, -8238, -22478, -28377, -24022, -11420, 5349, 20590, 28423, 25442, 13572, -3462, -19101, -27493, -26293, -15054, 1226, 16840, 26382, 26740, 17550, 1755, -14425, -25427, -27395, -19407, -4018, 12560, 24492, 27730, 20561, 6255, -10119, -22802, -27517, -21810, -8722, 7636, 21065, 27123, 23512, 11209, -5269, -20006, -26997, -24587, -13128, 3594, 17804, 25994, 24677, 14893, -571, -15838, -25202, -25796, -16930, -2322, 13574, 24925, 26557, 18367, 4076, -11503, -23247, -26144, -19926, -6386, 9331, 21630, 26299, 21713, 8913, -7253, -20612]
1222b0612n725L710J1721J5574J4373O709k538j0657j4941j4197q676Q46R880
1235a4533J4806J4705R634M45q510j4680j5084j0303j745P172J3965J4791J1526
1248B2189L004n774j2535j5332j2237m887N020J1861J5080J2859O008l503j1471
1261A0282j4565j3043p307K047R769J4957J3951P833k56r087j4544j4397r227
1274b3587n13Q097J3619J4428J0106K074p025j2505j4688j1336l177N532J2718
1287f257J4395J1766M486m319j1734j4533j2010n789K826J0455J4462J2840P199
1300B3787j845r579j3777j3745q092L11R000J3241J3650R117R63p495j2894j3900
1314a1258j0021k365O516J2621J3907J0596L285m668j1749j4310j1341m610L957
$$ y = [-20612, -26337, -22627, -10906, 4668, 19041, 25750, 23212, 12555, -2386, -16583, -25259, -24413, -14533, 273, 14978, 24612, 25057, 16547, 1867, -13217, -23520, -25265, -18093, -4128, 10663, 22189, 25193, 19419, 6884, -8448, -20685, -25572, -20552, -8691, 6389, 19248, 25256, 21753, 10282, -4283, -17326, -24633, -22586, -12817, 2140, 16091, 23924, 23668, 14581, 37, -14360, -23587, -24100, -16003, -2384, 12044, 22150, 24224, 17199, 4694, -9994, -21330, -24507, -18975, -6257, 8138, 19904, 24390, 20071, 8337, -6196, -18206, -23995, -21169, -10714, 3748, 16588, 23787, 21942, 12363, -1414, -15159, -23251, -22940, -13940, -699, 12951, 22068, 23031, 15536, 2642, -11258, -21279, -23644, -17128, -4507, 9400, 19996, 23281, 18613, 6864, -7446, -18787, -23397, -19440]
1327a9440J0689J3626J2370N993k804r936j3782j2352p128J428R159J3228J2946
1340A3997P813J63q057j3132j3194q611j163O523J2617J3435J0040J878n598j1776
1354D935j3495j0468l651M837J1371J3129J1120M906l634j0631j2989j1680n883
1367b2133K099R788J3220J2072O392r68q690j2588j2684p344N8P130J2485J2892
1381A1729Q602R94o379j1942j3015r489k390N834J1072J3115R988L568m294j0449
1395F944j3260j0719m475L116R654J2955J1507N222j847r030j2328j1971o508
1408b0740J001Q157J2046J2134P750K07p282j1888j2355q379j454O022J1713J2526
1422I458R199K092m730j0990j2051q205l271M113Q700J0913R210L795k769q322
$$ y = [-19440, -8751, 4875, 17245, 23238, 20434, 10498, -3284, -15636, -22764, -21336, -12177, 1051, 13997, 21810, 21973, 13916, 784, -12410, -21021, -22184, -15661, -3044, 10391, 20431, 22309, 16711, 4935, -8560, -19028, -22679, -17842, -6471, 6658, 17778, 22684, 19050, 8419, -4570, -16250, -22133, -20034, -10246, 2974, 15046, 21438, 20470, 11780, -808, -13492, -20836, -20778, -13648, -1163, 11729, 20331, 21325, 14946, 3004, -10011, -19500, -21890, -16056, -4984, 8131, 18119, 21687, 17393, 6944, -6316, -17035, -21510, -18394, -8740, 4215, 15722, 20944, 19097, 10067, -2261, -14232, -20740, -19739, -11582, 464, 12598, 20348, 20555, 13273, 1385, -10970, -19349, -20803, -14781, -3068, 9458, 18657, 20749, 16019, 5029, -7022, -15227, -18498, -14385, -5685, 5228, 14438, 18233, 15464, 7142]
1436G142j0746r604n016J809P763J1084R351N665m84o972j0424j0486o237O7N854
1451a1234R870J0625P188J375n529r552j0768p868j941M289R251J0840Q305K928
1465A7779l175q795j0863q718l926K331Q379J0422R293M510j396p234j0255r958
1479a1606n342N59O325R970J0130O561M41n699r798j0414p015j142M701R446J0094
1494G211P583K271l539q807j0538q317l169L043Q112J0508R027L668k214p597
1508G242j0189r037m951J309O840R943R333O151m20o290r513r941o277p07N237
1523a1270R586R961O695J529m564q657j0135p339k620L401Q337J0405P973L436
1537A6738k834p940r805q300m178J627P056J0182Q852M876q21o573r678r293n859
$$ y = [7142, -3604, -13208, -18224, -16415, -8652, 2432, 11783, 17448, 16964, 9992, -432, -10918, -17155, -17088, -11234, -1364, 9261, 16449, 17824, 12295, 2743, -8025, -15893, -17834, -13545, -4294, 6546, 14851, 17779, 14604, 5809, -5054, -13772, -17698, -15367, -6988, 3434, 12727, 17237, 15841, 8607, -1648, -11606, -16948, -16389, -10064, -94, 10036, 16597, 17038, 11339, 1541, -8873, -15888, -17030, -12329, -2883, 7211, 14794, 17065, 13526, 4719, -5819, -14136, -17305, -14262, -6150, 4358, 13385, 17053, 14839, 7242, -2947, -11984, -16935, -15626, -8786, 1157, 10490, 16641, 16221, 9931, 418, -9523, -15800, -16507, -11270, -1684, 8277, 14972, 16501, 11937, 3280, -6855, -14194, -16814, -13413, -5076, 5329, 13302, 16738, 13904, 5964, -3841, -12141, -16319, -14692, -7636, 2546, 11398, 16274, 15453, 8880, -798, -10091, -15950]
1552a5950M26N510R614R367O372M57n001q921r679o551j820M290Q340R989P549
1567A3992K292l698q064r708p551l127K594P211R613Q074M121j542o791r415q891
1582a0890m718M99O600R384Q467N679L4n244r036q979n971j345M695Q594R211
1597F980O892J790l712q525r271p361k437L116P674R029P946L471k379o856r202
1612b845q196m521J696O238R174Q707M686l20o106r065q391n336j93M640Q522
1627a310R326N731J401m588p871r251o656j982L678P743R035P324K385k728o898
1642E339r418p327l646K228O335R336Q066L866j244n923q776q392m906M62N668
1657h332Q189Q609N854m4m619q268q842n869j225L720Q111Q800O638J982l492
$$ y = [-15950, -15524, -10014, -400, 8967, 15339, 15796, 10795, 1874, -7805, -14356, -16176, -11886, -3546, 6443, 13992, 16284, 12586, 4522, -5186, -12737, -15864, -13270, -6059, 3554, 11628, 15749, 14207, 7416, -1999, -10890, -15608, -15109, -8509, 875, 9342, 15021, 15055, 9811, 775, -8204, -14175, -15520, -10825, -2231, 6980, 13872, 15662, 11950, 3425, -5846, -13207, -15644, -12528, -4854, 4175, 12121, 15592, 13213, 6357, -2845, -11041, -15562, -13866, -7628, 1546, 10253, 14939, 14619, 8513, -552, -8943, -14279, -14472, -9832, -1310, 8016, 13747, 15148, 10560, 2689, -6562, -13218, -15200, -11522, -3779, 5256, 12580, 14965, 12237, 5339, -4079, -11406, -15052, -12824, -6489, 2847, 10913, 14779, 13535, 7612, -1164, -9556, -14462, -14000, -8332, -143, 8466, 14320, 14276, 9657, 1389, -7453, -13322, -14547, -10827, -2716, 6084, 12722, 14704, 11212]
1672A1212p220q742o982l069K493P063Q706P534L582j868o162q659p948m191J127
1687a3124N521Q478P995N053j48n069q025q429n626p60M440Q073Q464N711J483
1702A4037l576p508q344o752k075L053O956Q340P220L079k359o460q682p176l682
1717a3929J617N925Q044P527M546k87n495q322q096m896p7M742P867Q198N276
1732A2640Q42m344p082q168o185j285L165P121Q166O508K382k777o701q248o638
1747a0604k927J874O167P994P282L640q75n986p988p180m662N33N098P942P735
1762H043M413J81m356p184q006n344p97L403P327Q082N542J833k822o860q121
1777d666o367k583L009N853Q038O656L079j561o099p637o876l646P01N692P504
$$ y = [11212, 3992, -4750, -11732, -14801, -12308, -5245, 3461, 10995, 14577, 12709, 6547, -2112, -10060, -14251, -13124, -7603, 875, 8870, 13923, 13775, 8706, 681, -7748, -13374, -14134, -9694, -1621, 6843, 12554, 14037, 10461, 2953, -5391, -12143, -14218, -11165, -4209, 4131, 11351, 14430, 12071, 5611, -3071, -10247, -13929, -12312, -6387, 1657, 9184, 13730, 13443, 7948, -374, -8470, -13366, -13443, -8701, -834, 7364, 12640, 13482, 9138, 2056, -6112, -12297, -13582, -10417, -3296, 4870, 11378, 13760, 10983, 4282, -3966, -10604, -13531, -11657, -5490, 2504, 9786, 13426, 12551, 6565, -1423, -8603, -13265, -12732, -7634, 308, 8043, 12456, 12637, 8281, 1097, -6909, -12253, -13050, -9647, -2320, 5762, 11304, 13137, 10315, 3455, -4666, -11033, -13616, -10607, -4754, 3284, 9940, 13019, 11458, 5359, -2278, -9154, -12800, -12099, -6407, 1097]
1792A097P298M076j27n019p301p458m721m21M025P383P294N502R53l294o830p694
1808e237n813j786L072O309P699O256J999j849o030p565o484l103J325N623P556
1823A972O908L561q43m894p812o769m149PM709O900P377M790N27l854o870p353
1839e793n323j030L074O628P369N469J697k224o247p472n468k891J872N886P296
1854B843O093L117j162n199p198o901l228M42M680P112O560M622j77m557o405
1869F42o998m557j075L675P029O762N005J331k658o452p059n459j944K207N656
1884c895P192N788K916j674n613o908o263l459J330N044O648O525L431J3m380
1899F695o981o629m108l05L720O732O881M578P83l197o385o932m893j305K700
$$ y = [1097, 8395, 12471, 12344, 7325, 24, -7434, -12155, -12576, -8551, -1168, 6126, 11628, 12581, 9287, 2457, -5237, -11050, -12836, -9764, -3455, 4244, 10500, 12499, 10650, 4620, -2945, -9429, -12532, -11207, -5584, 1972, 8880, 12441, 11598, 6704, -1108, -7877, -12026, -12019, -7310, -410, 6967, 11757, 12284, 8430, 1560, -5793, -11116, -12146, -9072, -2444, 4925, 10394, 12091, 9867, 3620, -3852, -9320, -12211, -10339, -4453, 2843, 8936, 12053, 10891, 5692, -1506, -8407, -11635, -11193, -6513, 599, 7159, 11781, 11604, 7047, 642, -6356, -10913, -11988, -8313, -1284, 5478, 10483, 11814, 9156, 2704, -4355, -9814, -11758, -9551, -3895, 3297, 9085, 12001, 10327, 4714, -2194, -8457, -11916, -10586, -5542, 1106, 7631, 11062, 11075, 6695, -286, -6915, -11023, -11328, -7608, -876, 6005, 10583, 11366, 8169, 1784, -5148, -10041, -11346, -8646]
1914h646N537P007N529J984k069n686o609o126k140J546N166O706N965L151j034
1929A0281m752o332o403l912O71L837O667O005M664Ll484o253o688m323q63K789
1945h093N833P078M841J576k651n704o633n067k085J787N426O456N498K423r51
1960I734n044o643n756l147Q05M236O578N947L636m59l695n902o012m375m15L537
1976f975O071O167M421J100l041n613o262n023j628K668N091O445N283K137k044
1991H797m958o377n418k446Q31M918N855O155L026o36m243o253n485l600j19L529
2007f424N970O240L907L60k861o088n836m493j112K855N130O128M698K056k593
2022G937m818o346m966k019J689M565O325N204K486j056m286o069n447l166P30
$$ y = [-8646, -3109, 3898, 9427, 11411, 9342, 3656, -2953, -9079, -11219, -9673, -4507, 2199, 8164, 11315, 10281, 5529, -803, -7206, -11118, -10447, -6610, 57, 6062, 10726, 10729, 7245, 992, -5696, -10019, -10882, -8093, -2260, 4818, 9659, 11235, 8584, 2880, -3753, -8820, -10905, -9118, -3692, 2764, 8262, 10685, 9734, 4690, -1953, -7709, -10856, -10051, -5815, 763, 6710, 10346, 9887, 6192, 290, -5722, -10097, -10512, -6975, -904, 5263, 9684, 10784, 7743, 2130, -4132, -9155, -10783, -8115, -3024, 3421, 8704, 10841, 8797, 3839, -2538, -7956, -10402, -9571, -4653, 1202, 7357, 10383, 9747, 5504, -749, -6234, -9834, -9953, -6424, -454, 5786, 9693, 10053, 7192, 1104, -4732, -9225, -10337, -7482, -2352, 3776, 8474, 10530, 7937, 3119, -3227, -8193, -10212, -8523, -3958, 2367, 7571, 10057, 9001, 4715, -1354, -6801, -9967, -9237]
2037i237L732N988N585L666K21l877n615n813m103k92K924N363N788M293J114
2052I737k378n001n949m653k180K544M577O359M887K136j670m612n671n213k561
2067i648R98L898N681N315L173n59l609n406n478l512k79L074N579N843L935M38
2083I443k803m923o097m197j090K632M571N783M612J686j733n007n452m478k491
2098i544J214M465N561N187K583o36m079n572n324l072O56L009N640N260L664
2113I012J39l030n114n473l797p92K445M964N526M159J308k008m729n868m327
2128g585j724J533M790N403M695K199j228m040n478n322k087M50L998M865N295
2143E764K923J32l468n272n305l140n07K821N111N202M083P56k356m924n552m010
$$ y = [-9237, -5505, 483, 6068, 9734, 9955, 6078, 463, -5350, -9453, -9745, -6821, -1458, 4330, 8623, 9737, 7359, 2358, -3591, -8244, -10424, -7880, -3303, 3056, 7943, 10079, 8409, 3797, -1874, -7087, -9648, -8650, -4752, 929, 6244, 9417, 8858, 5249, -157, -5635, -9147, -9426, -6352, -773, 5070, 9005, 9443, 6640, 1717, -4380, -8577, -9667, -7035, -2464, 3319, 7931, 9617, 7884, 2877, -2575, -7053, -9544, -8330, -3865, 1696, 6883, 9466, 8830, 4751, -821, -6145, -9217, -8561, -5552, 88, 5348, 9012, 9151, 6121, 1007, -4466, -8263, -9055, -6610, -1646, 3880, 8039, 9347, 7339, 2610, -3258, -7585, -9309, -7776, -2986, 2417, 7112, 9311, 8083, 4043, -1435, -6757, -8844, -8394, -4396, 469, 5764, 8687, 8819, 5351, 79, -5226, -8366, -8873, -6052, -941, 4261, 8344, 9100, 6744, 1820, -3732, -7742]
2159g742j326J935M361N743M217J863j478m311n310m737j958P18M265M910M872
2174F022K421k79l494n029n248k750l30L242N115N141L458K45k604m971n052l660
2190g773o64J970M271N298M082J508j625m374n357m481j355R67M395N017M587
2205F466J986r84l492n145m472k601R8L555M767N071L010O4l173m704n159l151
2221g864l15K421M539N093L484O74j857m244n187l819j274J534L863N177M416
2236F641J998j504l791n154m364k230J093L322M777M428K845k93l369m398n017
2251e016k637l71L017M408M792L325L46j761m386n134l505j061J749M317M806
2266B889L898J549j595m264m496m220j966J134L739M889M199K340p13l276m841
$$ y = [-7742, -9068, -7133, -2772, 2971, 7188, 9051, 7573, 3262, -2048, -6785, -8743, -8025, -3760, 1150, 6022, 8443, 8164, 4670, -359, -5607, -8357, -8687, -5445, -330, 4811, 8269, 8514, 5910, 939, -4113, -7773, -8437, -6467, -2196, 3102, 7184, 8692, 7067, 2693, -2664, -7145, -8500, -7533, -3138, 1879, 6466, 8452, 7468, 3976, -1169, -5641, -8242, -8144, -4589, 178, 5249, 8259, 8323, 5150, 446, -4713, -7864, -8179, -5758, -1219, 3874, 7358, 8032, 6175, 1931, -3256, -7075, -8349, -6815, -2952, 2225, 6641, 8639, 7135, 3344, -1810, -6174, -8404, -7311, -3989, 788, 5216, 8061, 7768, 4399, 1, -5016, -7653, -8024, -5007, -599, 4193, 7518, 7864, 6103, 1717, -3417, -6922, -7983, -6234, -1917, 2889, 6787, 8336, 6741, 2477, -2019, -6239, -8205, -7071, -3332, 1557, 5756, 8096, 7383, 4107, -734]
2281g34m541k367n4L276M226M974K950j23k516m386m825l064p03K419L972M863
2297C367L461J017j820l851m785l811j280J286L713M976L601J765o94l736m497
2312a288m457j935R71K953M546M204K224N4k788m666m066k991m9K252M214M732
2328C910L064R23k387l951m804l192j025J681L625M496L895J319j517l185m450
2343a598m079j934R06L187M559M179K508r43k934m560l781k902L27K518M396M564
2359D413K547M59k602l653m790l041o50K247L566M573L416Q92j641l428m230m048
2375e970j558J241L633M404L867J429l53l256m440l839k386N02K743M379M093
2390D489K456Nk635l957m467k640j80K048M266L942K988R64k027l719m250l246
$$ y = [-734, -5275, -7642, -7696, -4420, -194, 4780, 7730, 7607, 5091, 705, -4120, -7184, -7887, -5468, -1496, 3367, 6828, 7845, 6025, 2174, -2611, -6422, -7702, -6416, -2703, 2273, 5874, 7639, 6945, 3209, -1288, -5745, -7680, -6709, -3756, 790, 4994, 7218, 7272, 4484, -182, -4248, -7239, -7288, -5036, -822, 3910, 6974, 7897, 5510, 1559, -3245, -6437, -7462, -5781, -2156, 2340, 6235, 7554, 6037, 2852, -1598, -5677, -7611, -6705, -3518, 1041, 5220, 7728, 6785, 3851, -709, -4490, -7392, -7065, -4547, -151, 4413, 6960, 7419, 4817, 1164, -3626, -6667, -7317, -5070, -1504, 3069, 6485, 7377, 5736, 2308, -1922, -5970, -7528, -6287, -2654, 1750, 5617, 7046, 6693, 3437, -1003, -4842, -7228, -6726, -3983, 396, 4489, 6945, 6950, 4315, 358, -4109, -6749, -6929, -4881, -615, 3327, 6315, 7279, 5252, 1533, -2717, -5963]
2406e963j334J625L568M157L559J635j287l345m197l763j657O54K907M488L657
2421D704K421m59k972m133m081k387M49J906M096M092K791N61k084l792m278k949
2437f115r14J758L635M039L585J079j419l554l998l671j274Q03L034M200L957
2452E145J597r4l369l758l880k292L6K697M054L720K547M48k320m099l713k905
2468f186o33K146L459L972K935J135j542l712l685l412j570J137L639M088L006
2483D777J799o50k857l958l816j947O49K540L894L641K350j99k345l567m048k618
2499f355rJ789L824M106K359Q85j765l707l879l091q60J650L236M156L204Q67
2515F410q27l260m062l267j617J155K744L733L441K087m69k792l642l840j953
$$ y = [-5963, -7297, -5672, -2104, 2053, 5612, 7247, 5960, 2615, -1582, -5345, -7002, -6348, -3441, 1047, 4704, 7125, 6666, 3694, -439, -4520, -6907, -6458, -4552, -456, 3636, 6427, 6988, 4904, 1112, -3166, -6115, -7029, -5271, -1636, 2403, 5988, 7067, 5648, 2094, -1904, -5575, -6849, -6046, -3012, 1188, 5145, 6742, 6648, 3279, -479, -4359, -6651, -6615, -3918, 136, 3856, 6403, 6851, 4531, 432, -3281, -6186, -6819, -4673, -1214, 2758, 5693, 6828, 5286, 1574, -2111, -5523, -7093, -5956, -2317, 1771, 4777, 6576, 5926, 3069, -889, -4705, -6652, -6003, -3463, 431, 4072, 6422, 6223, 3878, 311, -3737, -6355, -6364, -4575, -751, 3355, 5714, 6599, 4834, 1127, -2752, -5843, -6703, -5053, -1817, 2339, 5543, 6410, 5583, 2323, -1739, -5006, -6623, -5468, -2724, 1009, 4450, 6537, 6068, 3276, -366, -4206, -6159]
2530f159K96K192L784L539K284M07k103l792l321k926n93J686L348L809L014R03
2546F368j583k931l912k977j682J236K935L910L578J256o89k783l652l495j520
2561e941K17J955M027L533K067K49k176l522l716k461l46J897L542L512K706O95
2577F238j631l273l931k524r59J195K998L833K804J397m94l360l346l558j433
2592f044O60K478L684L258J699j41k244l646l409j938j23J696L747L437K510N10
2608F134j783l594l621k580n30J209L230L764K716J089j255k807l346l353j238
2623e965Q99K792L273L199J707l40k825l232l392j764O1K162L519L664J817M8
2639E623j832l474l300k503l13J649L070L674K359R58j482k917l592k759r96P93
$$ y = [-6159, -5863, -3671, 113, 3652, 5936, 6343, 4240, 448, -2873, -5799, -6392, -4706, -1358, 2451, 5465, 6368, 4785, 1854, -2058, -5035, -6717, -5481, -2546, 1364, 4942, 6198, 5509, 2726, -926, -4421, -5941, -5724, -3769, 258, 3791, 5858, 6107, 3931, 409, -3307, -5768, -6114, -4217, -675, 2837, 5543, 6238, 4607, 1334, -2597, -5121, -6080, -4885, -1887, 1946, 4750, 6147, 5653, 2293, -1053, -4611, -6044, -5384, -2906, 778, 4036, 5735, 5594, 3350, -296, -3705, -5643, -5766, -4070, -323, 3114, 5624, 6134, 4351, 757, -2864, -5444, -5974, -4765, -1535, 2229, 4945, 6034, 4779, 1972, -1374, -4727, -5965, -5066, -2274, 999, 4198, 5905, 5565, 2740, -492, -3884, -5648, -5587, -3425, 94, 3758, 5575, 5623, 3791, 317, -2983, -5486, -5799, -4150, -1080, 2594, 4953, 5911, 4429, 1512, -2080, -4839, -5835, -5042]
2655e042L400L097K954J431q29k323l585l123j458K26K290L484L335J606j22j865
2671C476l383l335k137m65J959L540L211K457M90j742l164l436k491o84J131L201
2687a372L357K582Q58o40k936l201l022j215Q66K148L289K955J858m30k195l300
2703c98l220j714J6J716L751L024K060K09j540l221l524k281l35J290K907L503
2719B243K653O20j245k774l440k564j218J042K755L072L137J235n83k375l303
2734g45l207j425L20K231L140L052K087j85j936k947l412k099m19J861K934L323
2750B573K473N22j579k806l336k558q14J095K684L385K757R22o65k697l379k488
2766c911j616Q52K149L251K938J602l55k157k915k921j856k57J680K982L338K222
$$ y = [-5042, -1642, 1455, 4409, 5840, 5011, 2688, -897, -4020, -5478, -5252, -2962, 522, 3857, 5463, 5341, 3476, 93, -3242, -5379, -5844, -3885, -345, 2866, 5323, 5813, 4071, 907, -2529, -5020, -5704, -4573, -1372, 1985, 4567, 5425, 4785, 1849, -1352, -4374, -5589, -4723, -2575, 714, 3669, 5527, 5097, 2902, -398, -3618, -5332, -5316, -3600, 151, 3175, 5235, 5444, 3904, 683, -2841, -5122, -5457, -4167, -1260, 2243, 4896, 5516, 4271, 1497, -1943, -4507, -5725, -4683, -1928, 1144, 4281, 5516, 4933, 2558, -745, -3952, -5377, -5057, -2826, 314, 3366, 5453, 5268, 3332, 385, -3027, -5126, -5545, -3684, -750, 2573, 5046, 5568, 3989, 1183, -2153, -4711, -5525, -4430, -1746, 1639, 4396, 5318, 4653, 1956, -1423, -3911, -5527, -4675, -2526, 725, 3663, 5265, 4910, 2753, -162, -3083, -4939, -5196, -3516, -534, 2804, 5026]
2782E026K43j591k726l274k175r24J588K519L389K409Q38r74k505l134l071r46
2798e308Q38K193L207K854J583n38k432k955k895j253j11J633L204L151K024M5
2814E240j947l162k831k009m06J567K529L471K002N21j023k553l180k558r07Q98
2830d348K716L289K456J291r54j992l374k764j362M93J873L125K582K006j74j966
2846B897k658l003j904k25J634L099K827K080K77j440k683l186j739q94Q37K678
2862a403L167K405P60p43k623k726k817p91O64J968K788L145J124q3k039l065
2878b69l007j465Q0J616L048K796K074k2j468k845l201j672n74J122K800K986
2894A999K424P08j217k982k370k696o61N56K406L016K532J225n05k298k704k613
$$ y = [5026, 5269, 3678, 952, -2322, -4497, -5421, -3833, -1314, 2075, 4484, 5322, 4348, 1843, -1291, -4362, -5308, -4470, -2277, 930, 3784, 5367, 4829, 2397, -558, -3453, -4706, -4817, -3184, 20, 3171, 5195, 5240, 3293, 131, -2700, -4709, -5115, -3548, -1019, 2452, 4454, 4975, 3952, 1399, -1781, -4339, -5246, -4348, -1632, 1657, 4113, 5404, 4450, 2458, -916, -3680, -5042, -4549, -2676, 449, 3031, 5037, 4863, 2897, 239, -2764, -4668, -4893, -3259, -160, 2667, 4747, 5024, 3584, 901, -2285, -4024, -4918, -4081, -1403, 1764, 4169, 4929, 4186, 1563, -1163, -3980, -4771, -4107, -2139, 649, 3794, 4918, 4835, 2796, -269, -3276, -4741, -4661, -3045, 3, 2799, 4873, 4851, 3383, 538, -2663, -4335, -4909, -3787, -987, 1999, 4423, 5131, 3914, 932, -1438, -4134, -4795, -4239, -1833, 1183, 3715, 4940, 4435, 2137, -567, -3180]
2910c180j494L8J924K968K834J521p0j636k781k963j819j91J503K788K792K178
2926D412K37j089k668k665k272q16J020K313K955K458J067p35k353k795k819j046
2942d796N05J805K959K788J400k51j717k837k730j759L65J456K453K774J787M57
2958D659j157k618l130j868n20R20K646K789K566M79r11k194l042k108j228N51
2974d166K451K707K496J278p26j652l025k597j303J83J706K593K917J720k45j462
2990B875k744k316k186j75J004K837L037J872M66j017k681k486k345q59J017K114
3006a587K999J993J222o96k094k471k978j121M99J946K648K682J509l33j522k764
3022f8k732j408m16J532K701K792J708L01j136k524k845j848o35J220K399K349
$$ y = [-3180, -4674, -4636, -2712, 256, 3090, 4611, 4541, 2905, 124, -2839, -4658, -4849, -3346, -558, 2234, 4412, 4649, 3560, 892, -1773, -4045, -4861, -3841, -1528, 1427, 3885, 4952, 4217, 1864, -931, -3750, -4796, -4291, -2486, 473, 3261, 4661, 4410, 2693, -144, -2874, -4633, -4268, -2812, -359, 2415, 4202, 4659, 3502, 884, -2246, -4114, -4634, -3714, -1068, 1721, 4287, 4766, 3855, 1661, -1381, -3489, -4717, -4166, -1715, 992, 3488, 4766, 4040, 2388, -637, -3234, -4537, -4354, -2648, -55, 2862, 4582, 4337, 2875, 131, -2185, -4371, -4546, -3542, -705, 2332, 4204, 4670, 3653, 972, -1514, -3859, -4718, -3701, -1587, 1412, 3405, 4627, 3931, 1837, -634, -3612, -4733, -4234, -2288, 360, 3042, 4551, 4218, 2696, -68, -2800, -4208, -4624, -3092, -391, 2401, 4109, 4410, 3274, 750, -2095, -3943, -4578, -3358, -959, 1390]
3038A390K375N38n15j890k904k316j312O80K161K541K545J211q8k026k505k857
3054b972j276kJ537K722K499J520L88j270k930k374j994l40J395K336K481K040
3070C760N24m74k676k493k187p89O47K220K521K155J254n33j998k463k590j265
3086d387K4J928K604K668J500l26j275k617k479j621k68J273K447K378K045K84
3102D178r40k676k291j829o88Q32K026K780K175P74n93k132k500k262j174L51
3118c969K062K502K270J236k61j475k621k391j646L76J339K180K715J514K12j105
3134B938k198k509j960m29Q94K372K667J784Q59j102j764k515k233j029Q66J602
3150a757K662K115R80j50k064k069k385j256J14J184K828K073J668o2j217k090
$$ y = [1390, 3765, 4303, 3788, 1898, -1006, -3322, -4634, -3954, -1793, 748, 3293, 4504, 4416, 2390, -115, -2972, -4248, -4250, -2713, 9, 2508, 4028, 4416, 3146, 216, -2158, -4152, -4492, -3097, -761, 1720, 3760, 4284, 3810, 1134, -1359, -3546, -4335, -3688, -1468, 1053, 3208, 4462, 3929, 1931, -532, -3122, -4387, -4363, -2435, 169, 2837, 4337, 4011, 2736, 119, -2360, -3981, -4249, -2976, -529, 1849, 3894, 4178, 3238, 562, -1729, -3558, -4246, -3414, -1388, 1392, 3567, 4341, 3748, 1616, -884, -3146, -4320, -3969, -1907, 595, 2865, 4101, 3840, 2365, -256, -2647, -4293, -3917, -2578, -398, 2317, 3831, 4043, 2938, 740, -1769, -3729, -4158, -3264, -892, 1775, 3559, 4418, 3316, 1552, -963, -3196, -4225, -3359, -1757, 905, 3020, 4000, 3850, 1786, -283, -2668, -3924, -3810, -2626, 202, 2275, 3943, 3881, 2664, 574]
3166E74k488j866k12J112K287K498J513Q84j277j795k631j910r67J043J704K659
3182A128J978Q51m04j977k370j991j331O33J414K466K317J204j31j407k553k060
3198b233j534M7J381K115K121J737K63j063j661l304j011q99R96J783K510K097
3214C345Q66p33k027k303k205q57K05K118K130K396J179l41j878k187k068j195
3230c555m9J343K380K100J290M24j512k043k161j727m00R36K051K675J519P43
3246D014r77j727k456k037o32N19K018K299J961R74l90j931k100k102j274L74
3262c467J481K379J942J383n5q90k423k413j695k54J619K047K183J672L08q64
3278B953k236k026j937n00P95J762K284J951Q27o63j699k078k332p64M5J774K178
$$ y = [574, -1914, -3780, -3992, -2880, -593, 1905, 3418, 4302, 3025, 1230, -1401, -3311, -4278, -3235, -1531, 1128, 3106, 3957, 3553, 1576, -794, -2785, -4116, -3483, -2069, 397, 2714, 3918, 3787, 2380, -173, -2233, -3767, -3720, -2339, -224, 1897, 3634, 3897, 2834, 1173, -2131, -3142, -4041, -3045, -1262, 1248, 3345, 4211, 3478, 1451, -852, -3057, -3914, -3709, -1591, 539, 2935, 4114, 3773, 1895, -292, -2360, -3555, -3604, -2261, 119, 2219, 3509, 3933, 2421, 378, -1783, -3510, -3910, -2974, -923, 1752, 3271, 4014, 3037, 1310, -1146, -3183, -3815, -3296, -1278, 1021, 2982, 3956, 3566, 1635, -465, -2567, -3841, -3467, -1986, 393, 2335, 3718, 3663, 2773, 350, -2063, -3758, -4012, -2393, -346, 1837, 3509, 3817, 2953, 717, -1309, -3246, -3746, -2951, -1189, 1095, 3046, 3873, 3210, 1511, -567, -2899, -3663, -3618, -1844, 334]
3295C34K158J034j22j148k287j934j646n1J409K219J835J766P0j087j753k263
3311a466j837m35J016J697K391J920P14r17j728k328j941p78O34J460K236K087
3327B725J105m31j640j980k147j421K66J581J934K225J435j07j221k122k044j301
3343c143o80J276J747K470J207Q29o41j791k481j629q08O15J940J962J682P58
3359C313k30j453k097k147j159N37J609J793K372R50j47j163k248k113j340P6
3375c447J188J860K113J670J29p97k077k382j389p13J235J623K159J563Q38n71
3391C002j746k278j644r22L48J710K230J871O94Lj610j897k290r40K35J038K195
3408aJ982J330P8q23k217k004j315m89P88J943K145J506N62n60j773j844k005
$$ y = [334, 2492, 3526, 3404, 2256, -31, -1965, -3611, -3662, -2253, -34, 1801, 3567, 3637, 2550, 797, -1466, -3303, -3738, -2722, -1025, 1366, 3286, 4000, 3083, 1355, -973, -2914, -3692, -3058, -1598, 638, 2725, 3830, 3399, 1759, -221, -2368, -3789, -3523, -1942, -8, 2217, 3652, 3545, 2324, 202, -1842, -3143, -3823, -2547, -800, 1670, 2877, 3706, 3065, 1274, -1207, -2836, -3644, -3029, -1089, 873, 2555, 3313, 3083, 1630, -467, -2614, -3773, -3236, -1627, 166, 2538, 3488, 3341, 2178, -70, -2183, -3523, -3447, -2259, -399, 1714, 3384, 3513, 2716, 639, -1743, -3132, -3845, -2610, -987, 1172, 2735, 3573, 3002, 1256, -1022, -2666, -3588, -3240, -1530, 700, 2571, 3265, 3268, 1658, -239, -2529, -3469, -3234, -2196, -1, 1981, 3311, 3389, 2566, 349, -1655, -2970, -3459, -2671, -728, 1417, 2923, 3485, 2925, 1152, -692, -2697]
3425b697q06N32J757J922J999P46l30j593j954j771j135L66J097J987J630J460
3441C210P5j178j972j912j436j42J059J858J894J281P91r42j639j998j950k93
3457c294M74J961J749J683Q95p85j268k160k089p18N12J253K077K009J104j47
3473C256j268j789k238j098m6J070J938K024J402M4j068j667j753j331n66N82
3489b508J574K291J270O49o49j564j744j694q94L26J414K048J664J286m97j492
3505A480j711j985p37l96J543J817J600J192N09j157j964j852j126m60Q06J723
3521g18K263J191M70q50j240k119j561o17L61J570J943J672M59J96j763j668j768
3538b179r64M72P88K096J983R66L8j480j644j801r52o38J241J556K056J415K10
$$ y = [-2697, -3503, -2971, -1214, 708, 2707, 3453, 3123, 1530, -424, -2195, -3330, -2964, -1867, 120, 1750, 3210, 3285, 2107, 135, -1777, -3213, -3355, -2296, -438, 1456, 2737, 3528, 2586, 947, -1051, -3001, -3294, -2820, -859, 890, 2573, 3468, 2683, 1415, -745, -2834, -3552, -3040, -1787, 290, 2299, 3403, 3256, 1988, 199, -2039, -3137, -3183, -2113, -175, 1849, 3251, 3295, 2227, 560, -1193, -2524, -3090, -2508, -934, 1357, 2627, 3276, 2627, 1063, -681, -2375, -3269, -2943, -1529, 519, 2183, 3469, 2972, 1480, -231, -2216, -2953, -3349, -1806, 11, 1611, 2803, 3312, 2155, 191, -1661, -2787, -3247, -2441, -718, 1545, 2736, 3206, 2356, 1116, -1003, -2564, -3181, -2820, -1250, 693, 2365, 2824, 3020, 1257, -411, -2179, -3143, -2671, -1883, 213, 2196, 3162, 3200, 1720, 76, -1725, -2677, -3315, -2074, -518, 1538, 2953, 3163]
3555C163q22j528k092j262m80N61J393K140J440O13l50j809j732j298j096L16
3571b843J542J672J941N11j06r85j800j669j517J74J159J712J930J230j97o97
3587B057j594j806j506l11O27J937J649J596M11o51j420j696j712o50M05J380
3603a284J978J545O75J0j508j663j579j078m0J038J995J639J118N9j172j528j438
3620a233j527k68R72J814J528J389K67m58j692j871j591l44O77J209J643J636
3636B151P99o50j114j637j550o70j4J293J586J862Q24o2j169j549j911j144MR86
3654a965J705J624J330L03j016j322j739j443l97M49J698J606J623K95o79o25
3670A447k315j549m68K60J380J620J461J260l36j115j648j941p18L9J012J445
$$ y = [3163, 2341, 813, -1279, -2541, -3021, -2460, -1067, 1073, 2513, 3126, 2776, 967, -765, -2063, -3159, -2843, -1301, 371, 2312, 2823, 2717, 1732, -68, -1737, -3254, -3080, -1921, -209, 1721, 2951, 2754, 2057, 463, -1343, -2849, -3160, -2533, -596, 1053, 2649, 3060, 2409, 989, -707, -2419, -3069, -2664, -1284, 694, 2239, 2914, 2924, 1416, -247, -1826, -2904, -2944, -1906, 89, 1728, 2846, 2905, 1733, 205, -1233, -2760, -3028, -2056, -242, 1286, 2675, 2942, 2484, 792, -1079, -2670, -3014, -2337, -1128, 515, 2151, 2950, 2300, 1186, -451, -2001, -2671, -2685, -1392, 194, 2056, 2880, 2818, 1649, 100, -1811, -2955, -2951, -1965, -260, 1364, 2694, 2997, 1981, 659, -1080, -2523, -2920, -2471, -773, 833, 2456, 2751, 2072, 1447, -868, -2417, -2885, -2625, -1245, 375, 1836, 3096, 2760, 1645, -3, -1944, -2662, -2623, -1611, -166]
3686a66J885Q88K05o37j814j552j183l32P97J256K019J045L07l92j228j993j413
3703b308o84K22J531J585J523R97k01j328j725j509j010K83J089J733J535J017
3719B750m8q85j599j830r87kP59J089K060J023N64r63j247j539j490k84M81J226
3737i22J817J397M96k15j307j852j299o31P6J096J895J277J051j54j314j344j799
3754a732p37l68J121J481J640J104K77q72j374j773j444K8J01J705J896J234L02
3771B589l37j337j629j449n51Q8J316K045J072Q19k99q84j822j433r23K15P45
3788a775J713J540J072K84j274j414j627q40m32P70J513J530J300O99r11j425
3804G23j353j672m29N33R17J838J380Q30q6j743j480j214p96NJ199J608J151J288
$$ y = [-166, 1719, 2607, 2812, 2175, 361, -1191, -2374, -2706, -1909, -653, 1366, 2411, 2718, 2326, 1098, -895, -2308, -2992, -2770, -1239, 346, 1869, 2866, 2665, 1337, -388, -1897, -2907, -2624, -1535, 198, 1733, 2750, 2702, 1817, 218, -1612, -2599, -2601, -1842, -753, 1307, 2330, 2894, 1931, 684, -855, -2345, -2629, -2148, -922, 895, 2292, 2788, 2573, 1266, -586, -1885, -2516, -2440, -1344, 551, 1828, 2879, 2725, 1411, 67, -1732, -2469, -2837, -1716, -235, 1405, 2509, 2786, 1914, 540, -1233, -2677, -2649, -2548, -843, 1053, 2287, 2589, 2252, 915, -714, -2163, -2714, -2626, -1310, 735, 1807, 2626, 2327, 1443, -379, -1812, -2735, -2520, -1775, -62, 1478, 2550, 2834, 1560, 146, -1481, -2321, -2753, -1983, -470, 1060, 2360, 3059, 2148, 723, -630, -2302, -2731, -2198, -1281, 557, 1937, 2767, 2681, 938, -542, -1756, -2552, -2547, -1348, 260, 1411, 2699]
3822B699k36o10j651j828q38k95P20J743J749R46L17n33j352j756j323n49M71
3839b326J628J584J383N18m17j232j570j588m61P5J179J577J402R18k81q03j362
3856B24j700r91j38J073J136J510J532j0p47j034j875j390k40N33J204J853J284
3873B224M62o92j025j677j248o28K78J235J800J135P96l31r60j392j628j061K38
3890b474J091J285J448J034J42q21j428j462j046l14R89J254J556J209m7n06j221
3907F89j465j267m91M03J098J338J749M43j25j210j575j337q05J28R64J644J422
3924A603Q28j86p85j603r86j110l44Q47J363J660J036K09o35j358j271j283o77
3941b692P59J187J375J289N13j13j405j317j429o13K27J126J426J592J20J05p87
$$ y = [2699, 2463, 1853, 202, -1626, -2464, -2759, -2039, -296, 1453, 2399, 2716, 2183, 831, -925, -2248, -2797, -2326, -698, 886, 2269, 2787, 2370, 1138, -432, -2020, -2481, -2406, -1227, 350, 1752, 2670, 2389, 1586, 224, -1476, -2467, -2605, -1532, -396, 1114, 2646, 2636, 1889, 855, -1020, -2410, -2650, -2117, -913, 940, 2224, 2686, 1994, 969, -708, -1956, -2584, -2306, -1071, 729, 1864, 2660, 2329, 1369, -23, -1651, -2712, -2474, -1383, -98, 1350, 2384, 2526, 1705, 277, -1185, -2231, -2545, -1556, -302, 1254, 2463, 2416, 1910, 689, -776, -2043, -2534, -2131, -1033, 305, 2054, 2497, 2372, 1162, -413, -1750, -2555, -2427, -1463, 181, 1603, 2431, 2245, 1460, -143, -1129, -2239, -2583, -1736, -373, 1287, 2323, 2532, 1897, 539, -732, -2015, -2692, -1933, -746, 629, 1918, 2431, 2318, 913, -404, -1833, -2446, -2219, -1093, 333, 1925, 2045, 2150, 1363]
3958A363j314j632o34j22J152J109J496Q28M39j051j105j751q00k85M60J350J347
3975H50J226L95l80j377j453j213o03K29J195J714J215N32k76j045j485j215n99
3992b290m9J107J235J305R22L09r35j397j529p94k85O91J282J079J475M03o21
4009A908j288j268j430l82K90J422J332J123J068p68o01j886j328n63J98R98J279
4026A04J483M20M00p95j526j433j117J28Q58J141J498R22K16n26j171j666r42
4043b006kO1J267J439J201L56l27j147j329j239o63K97J055J227J723K20r8o88
4061A347j550j107r38j73J115J342R30J179Q0r15j038j369o93m00N44J044J366
4078G64J034P82o80j366j249j032m78K99R66J425J391L47m77m72j567j204q35
$$ y = [1363, 49, -1583, -2217, -2339, -1187, -78, 1418, 2246, 2685, 1634, 529, -1222, -2022, -2307, -1847, -497, 850, 2076, 2471, 2091, 714, -739, -1952, -2555, -2326, -1131, 583, 1798, 2330, 2054, 1009, -476, -1691, -2290, -2339, -1232, 3, 1308, 2230, 2539, 1604, 207, -1322, -2116, -2401, -1710, -428, 651, 2126, 2529, 1908, 620, -648, -2078, -2460, -2170, -748, 584, 1707, 2775, 2007, 1406, -480, -1808, -2371, -2173, -1175, 104, 1587, 2007, 2407, 1612, 86, -1347, -2464, -2336, -1478, -337, 1161, 2083, 2299, 1773, 602, -1064, -2006, -2008, -1947, -680, 759, 1960, 2316, 1989, 842, -487, -1726, -2389, -2092, -1037, 190, 1913, 2133, 2035, 1347, -203, -1310, -2248, -2421, -1306, 36, 966, 2145, 2225, 1310, 272, -1097, -1790, -2190, -1646, -602, 764, 1798, 2580, 1900, 534, -715, -1747, -2225, -1926, -960, 465, 1856, 2203, 1726, 1254, -313, -1517, -2352]
4095b352J08J015J256J263P09K90j017r91j214j004j27K75J421J282Q93N30n03
4112A834j212j311j095m89N61P66J727J136J28j69j099j193j137o25K1J176J430
4129D49J038O97J05r74j437j207q89k2Q49J249J242P12N10o62j108j333j245o1
4147b087J95J579J095J185K93o80q39j377j016n97K06R98J140J272Q05k46n89
4164A337j436j358o88J67P40R84J479R66L5q55j230j295m51l51K14J452J137J052
4182A899R4l20j005j210j272l48M10J110J126J094M99l27o09j345j136n73k12
4199b125R57J190R72R82O6n07j407j344o09l06J019Q00J071J009L50n47r84j689
4217a102q63M8K2R87J236J591J50n9j027j406r25p23R3J164P66J176P54M12r46
$$ y = [-2352, -2244, -1229, 27, 1290, 1999, 2289, 1272, 281, -933, -1937, -2064, -1789, -368, 914, 1807, 2337, 1834, 622, -689, -1784, -2273, -1712, -946, 781, 1917, 2045, 1876, 777, -416, -1553, -2178, -2157, -981, 449, 1487, 2184, 2289, 1315, -122, -1329, -2218, -2240, -1391, -142, 1100, 1812, 2322, 1660, 552, -781, -2026, -2087, -1892, -313, 782, 1967, 2260, 1580, 741, -636, -1652, -2249, -2043, -1045, 95, 1367, 2172, 1926, 1337, -99, -1457, -2145, -1978, -1238, -254, 1225, 2191, 2226, 1371, 141, -1154, -1605, -1956, -1742, -290, 847, 1899, 1993, 1673, 668, -542, -1814, -2162, -1752, -642, 484, 1578, 2077, 1750, 1141, -204, -1340, -1913, -2125, -1168, 22, 994, 1976, 2042, 1535, 128, -1216, -1825, -2131, -1112, -312, 759, 1768, 2118, 1571, 587, -1102, -1965, -1917, -1895, -908, 328, 1919, 2069, 2010, 983, -423, -1348, -2071, -1978, -814, -48, 1128, 1882, 2294, 1348]
4236A348j269j176p78j90Q43J061J358R46j15n30j099j401p84o6K05J164J260
4253G77Q86M33k45j006j253j062n88J5J130J114J072O77m3p06j386j049j022K41
4271b015P27R00J517N07N02q33n75j931o36j13O79O87J558J115j53l58q47j460
$$ y = [1348, 79, -1097, -1875, -2065, -1222, -161, 1197, 2143, 2028, 1498, 399, -1002, -1786, -1852, -1647, -483, 777, 1663, 2096, 1851, 845, -408, -1470, -2058, -2043, -913, 201, 1273, 1950, 1907, 1201, -185, -1234, -2256, -2015, -1288, -388, 1129, 1636, 2138, 1305, 730, -1201, -1837, -1950, -1271, -584, 974, 2089, 1936, 1578, 731, -729]
$$ [...]
8191b38
##END NTUPLES=NMR FID
##END=
