##TITLE=1H_DE-44EA3_D2O_b
 D2O
 24 sc, 
 15.7.2024
##JCAMPDX= 6.0         $$ Bruker NMR JCAMP-DX V2.0
##DATA TYPE= NMR FID
##DATA CLASS= NTUPLES
##ORIGIN= UXNMR, Bruker Analytische Messtechnik GmbH
##OWNER= root
$$ XWIN-NMR		Version 3.5
$$ Mon Jul 15 14:29:43 2024 Russian Standard Time (UT+4h)  she@DPX200
##.OBSERVE FREQUENCY= 200.1314
##.OBSERVE NUCLEUS= ^1H
##.DELAY= (6, 6)
##.ACQUISITION MODE= SIMULTANEOUS
##.ACQUISITION SCHEME= undefined
##.AVERAGES= 24
##.DIGITISER RES= 18
##SPECTROMETER/DATA SYSTEM= spect
##.PULSE SEQUENCE= zg30
##.SOLVENT NAME= D2O
##.SHIFT REFERENCE= (INTERNAL, D2O, 0, 15.7039)
##AUDIT TRAIL= $$ (NUMBER, WHEN, WHO, WHERE, WHAT)
$$ ##TITLE= Audit trail, XWIN-NMR		Version 3.5
$$ ##JCAMPDX= 5.01
$$ ##ORIGIN= Bruker BioSpin GmbH
$$ ##OWNER= she
$$ F:/spectra/data/she/nmr/H-F/1/audita.txt
$$ ##AUDIT TRAIL=  $$ (NUMBER, WHEN, WHO, WHERE, WHAT)
(   1,<2024-07-15 14:28:05.76 +0400>,<she>,<DPX200>,
      <continue with go, POWCHK disabled, PULCHK disabled
       configuration hash MD5:
       00 E9 B6 7A A2 85 ED C7 34 08 36 98 17 FE 4E 26
       data hash MD5: 16K
       B6 B4 57 3F 53 B1 B2 BE 0B C3 06 C8 BF 16 1A 28>)
$$ ##END=
$$ 
$$ hash MD5
$$ F2 83 17 36 77 4C 29 2B EF 77 65 83 F4 E8 4D B8
##$RELAX= 
##$RELAX= 
##$RELAX= 
##$RELAX= 
##$RELAX= 
##$RELAX= 
$$ Bruker specific parameters
$$ --------------------------
##$DU= <F:/spectra>
##$EXPNO= 1
##$NAME= <H-F>
##$PROCNO= 1
##$TYPE= <nmr>
##$USER= <she>
##$AMP= (0..31)
100 100 100 100 100 100 100 100 100 100 100 100 100 100 100 100 100 100 
100 100 100 100 100 100 100 100 100 100 100 100 100 100 
##$AQSEQ= 0
##$AQ_mod= 1
##$AUNM= <au_zg>
##$AUTOPOS= <>
##$BF1= 200.13
##$BF2= 200.13
##$BF3= 200.13
##$BF4= 200.13
##$BF5= 200.13
##$BF6= 200.13
##$BF7= 200.13
##$BF8= 200.13
##$BYTORDA= 1
##$CFDGTYP= 0
##$CFRGTYP= 5
##$CHEMSTR= <none>
##$CNST= (0..31)
1 1 145 1 1 1 1 1 1 1 1 1 1 1 1 1 1 1 1 1 1 1 1 1 1 1 1 1 1 1 1 1 
##$CPDPRG= <>
##$CPDPRG1= <>
##$CPDPRG2= <>
##$CPDPRG3= <>
##$CPDPRG4= <mlev>
##$CPDPRG5= <mlev>
##$CPDPRG6= <mlev>
##$CPDPRG7= <mlev>
##$CPDPRG8= <mlev>
##$CPDPRGB= <>
##$CPDPRGT= <>
##$D= (0..31)
0 1.2 0 0 0 0 0 0 0 0.06 0 0.03 0 0 0 0 0.0002 0 0 0 0 0 0 0 0 0 0 0 0 
0 0 0 
##$DATE= 1721039156
##$DBL= (0..7)
120 120 120 120 120 120 120 120 
##$DBP= (0..7)
150 150 150 150 150 150 150 150 
##$DBP07= 0
##$DBPNAM0= <>
##$DBPNAM1= <>
##$DBPNAM2= <>
##$DBPNAM3= <>
##$DBPNAM4= <>
##$DBPNAM5= <>
##$DBPNAM6= <>
##$DBPNAM7= <>
##$DBPOAL= (0..7)
0.5 0.5 0.5 0.5 0.5 0.5 0.5 0.5 
##$DBPOFFS= (0..7)
0 0 0 0 0 0 0 0 
##$DE= 6
##$DECBNUC= <off>
##$DECIM= 24
##$DECNUC= <off>
##$DECSTAT= 4
##$DIGMOD= 1
##$DIGTYP= 9
##$DL= (0..7)
0 120 120 120 120 120 120 120 
##$DP= (0..7)
150 150 150 150 150 150 150 150 
##$DP07= 0
##$DPNAME0= <>
##$DPNAME1= <>
##$DPNAME2= <>
##$DPNAME3= <>
##$DPNAME4= <>
##$DPNAME5= <>
##$DPNAME6= <>
##$DPNAME7= <>
##$DPOAL= (0..7)
0.5 0.5 0.5 0.5 0.5 0.5 0.5 0.5 
##$DPOFFS= (0..7)
0 0 0 0 0 0 0 0 
##$DQDMODE= 0
##$DR= 18
##$DS= 0
##$DSLIST= <SSSSSSSSSSSSSSS>
$$ [...]
##$SUBNAM2= <"">
##$SUBNAM3= <"">
##$SUBNAM4= <"">
##$SUBNAM5= <"">
##$SUBNAM6= <"">
##$SUBNAM7= <"">
##$SUBNAM8= <"">
##$SUBNAM9= <"">
##$SW= 24.0689651099613
##$SWIBOX= (0..15)
0 0 2 0 0 0 0 0 0 0 0 0 0 0 0 0 
##$SW_h= 4816.95568400771
##$TD= 16384
##$TD0= 1
##$TE= 0
##$TE2= 300
##$TE3= 300
##$TEG= 300
##$TL= (0..7)
0 120 120 120 120 120 120 120 
##$TP= (0..7)
150 150 150 150 150 150 150 150 
##$TP07= 0
##$TPNAME0= <>
##$TPNAME1= <>
##$TPNAME2= <>
##$TPNAME3= <>
##$TPNAME4= <>
##$TPNAME5= <>
##$TPNAME6= <>
##$TPNAME7= <>
##$TPOAL= (0..7)
0.5 0.5 0.5 0.5 0.5 0.5 0.5 0.5 
##$TPOFFS= (0..7)
0 0 0 0 0 0 0 0 
##$TUNHIN= 0
##$TUNHOUT= 0
##$TUNXOUT= 0
##$USERA1= <user>
##$USERA2= <user>
##$USERA3= <user>
##$USERA4= <user>
##$USERA5= <user>
##$V9= 5
##$VALIST= <valist>
##$VCLIST= <CCCCCCCCCCCCCCC>
##$VD= 0
##$VDLIST= <DDDDDDDDDDDDDDD>
##$VPLIST= <PPPPPPPPPPPPPPP>
##$VTLIST= <TTTTTTTTTTTTTTT>
##$WBST= 1024
##$WBSW= 4
##$XGAIN= (0..3)
0 0 0 0 
##$XL= 0
##$YL= 0
##$YMAX_a= 363564
##$YMIN_a= -271519
##$ZGOPTNS= <>
##$ZL1= 120
##$ZL2= 120
##$ZL3= 120
##$ZL4= 120
##$ABSF1= 10
##$ABSF2= 0
##$ABSG= 5
##$ABSL= 3
##$ALPHA= 0
##$AQORDER= 0
##$ASSFAC= 0
##$ASSFACI= 0
##$ASSFACX= 0
##$ASSWID= 0
##$AUNMP= <proc_1d>
##$AZFE= 0.1
##$AZFW= 0.1
##$BCFW= 1
##$BC_mod= 2
##$BYTORDP= 1
##$COROFFS= 0
##$CY= 11.3945322036743
##$DATMOD= 1
##$DC= 2
##$DFILT= <>
##$DTYPP= 0
##$F1P= 15.6554695791079
##$F2P= 12.8336369535428
##$FCOR= 0.5
##$FTSIZE= 0
##$FT_mod= 4
##$GAMMA= 1
##$GB= 0.15
##$INTBC= 1
##$INTSCL= 1
##$ISEN= 128
##$LB= 0.24
##$LEV0= 0
##$LPBIN= 0
##$MAXI= 10000
##$MC2= 0
##$MEAN= 0
##$ME_mod= 0
##$MI= 1.114404
##$NCOEF= 0
##$NC_proc= 0
##$NLEV= 6
##$NOISF1= 3.799351
##$NOISF2= 2.8
##$NSP= 1
##$NTH_PI= 0
##$NZP= 0
##$OFFSET= 15.70392
##$PC= 1
##$PHC0= -25646.92
##$PHC1= 26.58747
##$PH_mod= 1
##$PKNL= yes
##$PPARMOD= 0
##$PSCAL= 0
##$PSIGN= 0
##$REVERSE= no
##$SF= 200.130013532006
##$SI= 16384
##$SIGF1= 3
##$SIGF2= 2
##$SINO= 400
##$SIOLD= 16384
##$SREGLST= <1H.CDCl3>
##$SSB= 0
##$STSI= 0
##$STSR= 0
##$SW_p= 3612.71676300578
##$SYMM= 0
##$S_DEV= 0
##$TDeff= 0
##$TDoff= 0
##$TI= <>
##$TILT= no
##$TM1= 0
##$TM2= 0
##$TOPLEV= 0
##$USERP1= <user>
##$USERP2= <user>
##$USERP3= <user>
##$USERP4= <user>
##$USERP5= <user>
##$WDW= 1
##$XDIM= 8192
##$YMAX_p= 0
##$YMIN_p= 0
$$ End of Bruker specific parameters
$$ ---------------------------------
##NTUPLES= NMR FID
##VAR_NAME=  TIME,          FID/REAL,        FID/IMAG
##SYMBOL=    X,             R,               I
##VAR_TYPE=  INDEPENDENT,   DEPENDENT,       DEPENDENT
##VAR_FORM=  AFFN,          ASDF,            ASDF
##VAR_DIM=   8192,          8192,            8192
##UNITS=     SECONDS,       ARBITRARY UNITS, ARBITRARY UNITS
##FACTOR=    0.0002076,     1,               1
##FIRST=     0,             0,               0
##LAST=      1.7004516,     0,               0
##MIN=       0,             -271519,         0
##MAX=       1.7004516,     363564,          0
$$ Real data points
##PAGE= N=1
##DATA TABLE= (X++(R..R)), XYDATA
0 0 0 0 0 0 0 0 0 0 0 0 0 0 -6 19 -24 24 -24 24 -26 48 -48 50 -71 72 -92 97 -117 125 -144 168 -184 209 -235
33 -235 262 -294 325 -364 401 -448 497 -546 612 -674 745 -827 917 -1017 1131 -1264 1417
50 1417 -1593 1809 -2066 2392 -2809 3372 -4177 5420 -7643 12839 -59559 80156 261189 252172
64 252172 209228 126925 15754 -149420 -262411 -271519 -167389 -21996 123239 218710 248985
75 248985 199309 85779 -72728 -210820 -269016 -216688 -99180 35439 155436 240953 247764
86 247764 156195 -3696 -153575 -231970 -225915 -159836 -53376 80103 205729 260871 206079
97 206079 71861 -69480 -176967 -234094 -221436 -122118 28974 162683 230195 221824 143408
108 143408 13016 -124398 -211750 -222484 -163505 -50340 82504 186349 222095 188082 97306
119 97306 -34586 -168649 -236848 -205293 -104605 12851 121937 204713 224232 153977 22866
130 22866 -108489 -194570 -216976 -167725 -60427 67360 170944 215252 184780 91518 -30883
141 -30883 -140865 -206631 -206575 -131139 -2369 126512 202034 202422 136784 30871 -82871 -171108
153 -171108 -206813 -172497 -72618 55807 160861 200851 173302 96598 -13360 -127919 -200327
164 -200327 -194883 -120200 -12780 97359 179929 201929 147675 39347 -76611 -162368 -192277
175 -192277 -159012 -73245 35336 133330 191272 183284 103443 -14353 -117405 -173441 -177345 -128849
187 -128849 -30939 86625 172099 189953 141223 49664 -56186 -143926 -182778 -158712 -79037
198 -79037 27623 123120 174880 166516 105537 8826 -95305 -169139 -180238 -123843 -27569 71669
210 71669 144062 172049 144123 66455 -40251 -134747 -177825 -154051 -78677 14983 101359 158682
222 158682 167127 111804 13008 -86118 -149677 -164367 -128426 -46546 56426 138658 167922 137853
234 137853 63319 -29978 -113603 -158268 -151253 -92925 693 95841 154346 154406 102037 23020 -62086
247 -62086 -132559 -161934 -131128 -49583 47143 122219 154004 136896 74257 -16642 -102712 -151622
259 -151622 -144915 -88835 -6178 77626 136495 151106 112445 31082 -58858 -124693 -146036 -120416
271 -120416 -56476 28060 105899 148861 137617 76386 -11567 -91228 -135716 -135382 -93295 -19601
283 -19601 65827 129527 143762 106473 36603 -42225 -109383 -142632 -124227 -60550 23641 95904
295 95904 133487 128653 80592 3111 -76648 -130163 -137125 -93917 -19616 57455 111338 130658
307 130658 108348 48231 -31339 -102277 -133993 -117680 -62497 10307 81265 125484 127651 83548
319 83548 8496 -66800 -116907 -126686 -95496 -32057 44787 106173 129040 104758 46976 -23221
331 -23221 -86427 -121382 -117236 -70398 2474 74866 119396 120066 81328 16575 -51886 -104843 -123597
344 -123597 -97073 -34395 37924 94061 117915 104357 56564 -12734 -79416 -116735 -111058 -68589
356 -68589 -4320 59345 106414 118436 87442 24051 -47754 -99731 -115345 -91784 -39855 24101
368 24101 82246 114984 105024 56245 -10134 -69263 -104754 -106391 -73676 -14216 53131 101262
380 101262 111407 82469 27331 -34843 -87195 -110227 -96118 -45073 21101 77316 104627 96923
392 96923 59702 2106 -58963 -100730 -106365 -73274 -14850 45816 89263 104123 84532 34763
404 34763 -29252 -82363 -105007 -89311 -45897 10866 64983 98924 98933 61819 3499 -53291 -90073
417 -90073 -97451 -73941 -24745 36013 85066 103235 82384 34861 -22390 -69848 -95870 -90091
429 -90091 -52078 5723 61317 93414 91854 60873 11155 -42600 -84466 -97171 -73692 -23948
441 -23948 31768 73593 92382 81388 42419 -13954 -66458 -94068 -86127 -49231 346 49749
453 49749 83257 90688 65700 15395 -39069 -78384 -89574 -71521 -30509 20958 68217 90851
465 90851 81446 41402 -11267 -56523 -83646 -84007 -55734 -6361 46793 81217 85163 61380 18868
478 18868 -28943 -68819 -87042 -74390 -33123 19343 62589 82622 76275 44678 -1055 -49588
490 -49588 -81734 -82634 -53446 -7684 37797 71321 81957 65287 24085 -26361 -66353 -81172
502 -81172 -68416 -35367 9914 53220 81057 78415 45485 -2044 -45614 -72690 -76369 -56194
514 -56194 -15443 32224 68662 79365 61980 24426 -20148 -57474 -77162 -70730 -38311 7535
526 7535 50369 74396 71904 47004 6631 -37781 -70587 -77280 -54712 -14078 28094 59420 73065
539 73065 63162 30434 -14562 -55430 -74458 -67004 -37144 2299 41502 68897 72756 49630 7561
552 7561 -34628 -63302 -71190 -54920 -20371 21954 57291 72051 60256 28943 -10959 -46252
564 -46252 -67001 -66270 -42565 -1707 40483 66539 67542 46190 12260 -25924 -57761 -70552 -56123
577 -56123 -21418 18546 51274 65997 59434 33647 -5097 -42826 -65525 -63618 -40417 -4306
589 -4306 31405 59175 67181 50823 14509 -25678 -55030 -63903 -52714 -24573 11175 45493 64934
602 64934 59945 33715 -4201 -38475 -59208 -60876 -42919 -9257 29272 57259 63992 47688 16693
615 16693 -18517 -49276 -63186 -54456 -26419 10138 41989 58642 56234 35784 1961 -33445
627 -33445 -57829 -61099 -42164 -9473 25341 50255 60310 49211 20757 -16347 -46115 -59669
639 -59669 -52235 -27608 5489 36678 56234 56540 36594 3565 -29845 -52133 -56460 -42778 -14869
652 -14869 20312 49482 58602 47155 20465 -10809 -39380 -56116 -53023 -30204 3123 34867
664 34867 52620 53438 36312 7148 -24221 -48294 -56663 -43996 -15024 18080 43474 53957 47703
677 47703 24429 -8059 -37965 -53362 -49953 -29994 -912 28668 48726 52862 38551 9362
689 9362 -22138 -45617 -52167 -41576 -18598 12312 39201 54295 47340 24727 -5817 -33106 -49180
702 -49180 -49563 -32227 -4460 25794 46860 51494 37989 10937 -17683 -40901 -51085 -43677 -19579
715 -19579 11026 35605 48996 46010 27673 -1102 -30001 -47746 -49188 -32440 -5263 22664
727 22664 42680 48678 38712 15025 -14288 -38778 -48518 -42247 -21704 5846 32268 48161 46198
740 46198 27620 386 -25753 -43820 -46475 -34004 -9229 19395 40755 47188 37885 15344 -11210
753 -11210 -33976 -46552 -42607 -23785 4215 29935 44367 43813 28737 3842 -22388 -41531 -46183
766 -46183 -34119 -11385 16498 36971 44853 38678 18415 -8398 -32707 -44682 -40755 -23654 688
779 688 24811 41962 44385 30630 5255 -20512 -38594 -43405 -34162 -13465 11747 33998 44144
792 44144 38671 19358 -6158 -27998 -41747 -40401 -26006 -2199 22869 39183 41723 30214 8951
805 8951 -15695 -35508 -43242 -35601 -14729 10540 32034 41735 36896 21408 -2122 -25250 -40378
818 -40378 -40446 -25900 -3541 19637 36441 41254 31439 10274 -13522 -32640 -40872 -34713 -16394
831 -16394 6553 27821 39379 38312 22458 -796 -22826 -36154 -38258 -27681 -7584 16984
843 16984 35044 40348 31421 11740 -10357 -29117 -39216 -35558 -18928 4211 26264 37510 36265
856 36265 22926 2678 -19799 -35083 -38348 -27914 -7750 13554 31129 38647 32342 15117 -8129
869 -8129 -28219 -38288 -33936 -19093 1459 21673 35175 36895 24947 4274 -17750 -32692 -35649
882 -35649 -28325 -10959 10689 29279 36882 31929 15245 -5865 -24267 -35168 -34061 -21626 -708
895 -708 20663 33680 34482 25175 7005 -13424 -29541 -35699 -29516 -12012 9168 26863 34570 31245
909 31245 18137 -2175 -22701 -34715 -34187 -21483 -2524 16596 30116 33963 26192 8574 -11991
922 -11991 -28113 -33986 -28129 -14332 5111 23619 34146 32171 18521 -1022 -19870 -31153 -32691
935 -32691 -22958 -5506 14536 29976 33792 25687 10034 -8857 -25145 -33105 -29534 -15294 3863
948 3863 21201 31240 30946 20460 2211 -17120 -30428 -32556 -23568 -6685 12039 25790 32001
961 32001 26847 12689 -6565 -23150 -31469 -28866 -16419 922 17849 30156 31154 21079 3613
974 3613 -14957 -27387 -30775 -24474 -9370 9305 24679 31159 26088 13147 -4447 -19556 -29620
987 -29620 -29557 -18624 -816 16912 28144 29355 21273 5984 -11438 -25411 -30820 -24929 -10405
1000 -10405 7568 21577 28944 26538 15461 -1768 -18574 -28439 -28006 -18067 -3193 13284 25737
1013 25737 30101 23140 7335 -9807 -23215 -28584 -24499 -11913 4403 20195 27895 27305 15996
1026 15996 -678 -15232 -25939 -28183 -20014 -5068 11694 24575 28291 22322 9158 -6764 -21281
1039 -21281 -28171 -25122 -13219 3268 17733 25859 25690 17356 3020 -13739 -24973 -26505 -20271
1052 -20271 -5856 9077 22062 27109 23581 11357 -5418 -19301 -26494 -24787 -14550 -377 15404
1065 15404 25164 25713 18074 3047 -11615 -22614 -26192 -21171 -8633 7448 20437 26277 22425
1078 22425 11910 -3108 -16363 -25117 -25044 -15670 -1186 13897 23035 24687 17854 5750 -9133
1091 -9133 -21113 -26101 -21515 -9265 5392 18224 25029 23300 13525 -844 -15575 -24000 -23704 -16092
1105 -16092 -3797 10681 21877 25047 19560 6400 -7617 -19115 -24255 -21806 -11436 2923 16325
1118 16325 24454 22737 14134 591 -12724 -21712 -23937 -17602 -4635 9582 19834 23709 19211
1131 19211 8948 -5253 -17001 -23771 -21450 -11707 1530 14552 21946 22160 16180 2903 -11269
1144 -11269 -21313 -23538 -17083 -6058 7174 18304 23172 20190 10254 -3583 -15535 -21975 -21158
1157 -21158 -13158 -599 11647 20890 22178 15719 3688 -8720 -18756 -22300 -18453 -7926 5644
1170 5644 16548 21890 19598 10858 -862 -13105 -20544 -21507 -14538 -2270 10196 18787 21147 16161
1184 16161 6237 -6490 -17566 -22056 -18105 -9288 3679 14475 20828 20005 12246 168 -11630
1197 -11630 -19500 -20755 -14830 -3679 8244 18253 21317 17401 6829 -5660 -15187 -20461 -18495
1210 -18495 -11005 1508 13091 19426 20307 12854 1851 -9799 -18403 -20560 -15584 -5411 6990
1223 6990 16407 19817 17677 8637 -3479 -14110 -19915 -19046 -11088 287 11475 18337 19540 13281
1237 13281 3439 -8013 -17465 -19961 -15770 -6299 5050 14232 19262 17574 9261 -1867 -12056 -18986
1251 -18986 -18655 -12152 -1853 9717 17295 19157 13979 5184 -6419 -15513 -18890 -16666 -7773 3337
1265 3337 13477 19353 17591 10444 325 -10427 -17974 -18562 -12915 -2966 7747 16181 18550 14562
1279 14562 6076 -4750 -13889 -18320 -16179 -8704 1568 11332 17162 17713 11546 1620 -9393 -16537
1293 -16537 -17807 -13715 -4273 6174 14579 18180 15316 7294 -3031 -12435 -16605 -16133 -10035 -213
1307 -213 10112 16588 17778 11760 2699 -7441 -14737 -17773 -13856 -5793 4608 13370 17416 15090
1321 15090 7929 -1886 -11122 -16553 -16982 -10557 -1117 8557 15187 17329 12300 4770 -6043 -14079 -17064
1336 -17064 -14361 -6453 2581 12162 16255 15724 9606 -617 -9720 -15355 -16288 -11951 -2512 6893 13983
1351 13983 16603 13448 4990 -4480 -12609 -16347 -14884 -7740 1627 10808 15680 14940 9913 883 -7988
1366 -7988 -14448 -16257 -11689 -2809 5480 13187 15495 14102 6334 -2820 -11714 -15755 -14596 -9002 230
1381 230 8624 14339 15862 10392 2165 -7209 -13950 -15843 -12373 -4958 4237 12045 15871 13636 7233
1396 7233 -1789 -9998 -14371 -14247 -9294 -1044 8372 14297 15477 11236 3541 -5121 -12400 -15343 -13476
1411 -13476 -5774 3585 10463 14698 14018 8296 -314 -8855 -14257 -14797 -9744 -1289 7281 12212 14022
1426 14022 11557 4775 -4604 -11501 -14586 -12617 -6808 1517 8937 14207 13984 8865 673 -7879 -12705
1441 -12705 -14450 -10455 -3049 4771 12124 14719 11705 5283 -2616 -10166 -13930 -13560 -7725 688 8514
1456 8514 13179 13754 9826 1628 -6115 -12339 -14734 -10959 -4030 3414 10760 14056 12286 6236 -1788
1471 -1788 -9029 -14185 -12923 -8263 -729 6731 12699 13749 10014 2761 -5220 -11500 -13935 -11568 -5482
1486 -5482 3016 9824 13079 12092 7372 -747 -7737 -12150 -12930 -9297 -2026 6016 11754 13961 10288
1501 10288 4161 -3763 -10122 -12905 -11755 -6333 1379 8567 12760 12226 7918 821 -7582 -11967 -12685
1516 -12685 -9297 -3485 4389 10665 13019 11067 4760 -2738 -8956 -12529 -11737 -6891 588 6758 12484
1531 12484 12627 8307 1826 -5527 -10891 -12762 -10103 -4298 3183 9440 12486 11036 5531 -1337 -8386
1546 -8386 -12012 -11941 -7639 -565 6281 11001 12280 9116 3636 -4617 -9734 -12500 -10412 -4649 1905
1561 1905 8733 12240 11436 6257 175 -7010 -11184 -12198 -8433 -2085 4464 10047 11992 9797 3600
1576 3600 -3695 -9182 -12073 -10227 -5719 1428 7895 11521 11077 7676 745 -5286 -11111 -11985 -8652
1591 -8652 -2309 4600 9762 11489 9376 4503 -2296 -8530 -11613 -10753 -6842 14 6682 10995 11236
1606 11236 7833 1469 -5424 -10101 -11683 -9014 -3895 2898 9010 11407 10553 5418 -1823 -7523 -10913
1621 -10913 -10897 -7022 -638 5791 10449 11031 8588 2665 -3798 -8468 -10904 -9486 -4342 1760 8177
1636 8177 10965 9929 5913 -361 -5823 -10210 -10870 -7025 -1403 4833 8829 10574 9018 3589 -2956
1651 -2956 -8571 -11254 -9666 -5169 761 6874 10256 10315 6999 916 -5409 -10152 -10722 -7399 -2271 3459
1667 3459 8875 10928 9250 4816 -2528 -7354 -10487 -9748 -5899 568 6000 10005 10059 6225 1343 -4291
1683 -4291 -8812 -10264 -7799 -3560 2993 8136 10901 9167 4567 -725 -6168 -9596 -10094 -6613 -363
1698 -363 5610 8822 10128 7526 1941 -4052 -8423 -10100 -8240 -3792 2044 7352 9704 9446 5252
1713 5252 -361 -6191 -9146 -9503 -7329 -1196 4156 8580 10851 7465 3360 -2354 -7449 -9130 -8688
1728 -8688 -4364 945 6525 9468 9281 5584 1176 -5150 -8596 -9715 -7311 -1925 3623 7849 9494
1743 9494 8467 3858 -2006 -7252 -9389 -8480 -5207 1133 5368 9016 9267 6776 1039 -4257 -8272
1758 -8272 -9152 -6916 -2633 2694 6790 9717 8298 4355 -990 -6014 -9067 -8271 -5648 -128 4916
1773 4916 8737 9490 6171 1988 -3280 -7316 -8936 -7759 -3329 1902 7034 8951 8797 5116 122
1788 122 -4855 -8450 -8755 -5556 -1370 4033 7306 8976 7552 2835 -2151 -7130 -8846 -7725 -3762
1803 -3762 972 6419 9025 8976 5769 412 -4899 -8033 -8535 -7022 -1516 2997 7840 8900 7514 3113
1819 3113 -1746 -6191 -8770 -8323 -4645 364 5509 8720 8354 5582 1254 -3526 -8114 -9103 -6988 -2441
1835 -2441 2385 6645 8450 7481 3895 -1131 -5789 -8537 -8020 -4729 -321 4521 7649 8557 5582 1369
1851 1369 -3948 -7214 -8723 -7419 -3530 1390 6301 8821 7806 4204 -636 -4959 -7882 -8237 -5458
1866 -5458 -1356 4046 7398 8466 6564 2333 -2479 -6578 -8474 -7570 -3517 1293 5524 8266 7490
1881 7490 5086 498 -4649 -7866 -7898 -6223 -1006 3386 6534 8439 6648 3040 -2027 -6041 -7872
1896 -7872 -6942 -4540 526 4790 7924 7900 5381 393 -3817 -6546 -7768 -6411 -2670 2625 6764 8343
1912 8343 7225 3771 -847 -6094 -8073 -8074 -4095 -21 4772 7592 8104 6046 2337 -3477 -7253 -8420
1928 -8420 -6508 -2677 1954 5177 7389 7162 3491 -828 -5269 -7951 -7227 -5139 -787 3542 7144
1943 7144 8224 6291 1971 -2297 -6290 -7705 -6116 -3132 1018 4838 7480 7058 4161 -165 -4614
1958 -4614 -7474 -7606 -5356 -1091 3045 6551 8028 6273 2671 -1484 -5803 -7555 -6818 -3385 552
1973 552 4858 6907 7625 4568 442 -3805 -6964 -6961 -5485 -1724 2662 6300 7981 6285 3096 -1776
1989 -1776 -5247 -7052 -7597 -4259 -30 3991 6631 7456 4620 801 -3307 -6418 -7163 -6231 -2086 1980
2005 1980 5520 6781 6468 3945 -475 -4848 -7160 -7250 -3924 -312 3629 6838 7819 5104 1394 -2501
2021 -2501 -6537 -6894 -6021 -2469 1914 5273 7212 6756 3973 -279 -4717 -6876 -7209 -4641 -1388 3618
2037 3618 6610 7377 5688 1839 -1931 -5498 -7059 -6226 -3391 976 4970 7545 6366 3932 729
2052 729 -3788 -6354 -7309 -5041 -1563 2750 5943 7268 6100 2216 -1833 -5566 -7279 -6010 -3261
2067 -3261 363 3928 6817 6621 4745 488 -3604 -6117 -7151 -5205 -1876 2567 5772 7399 5973
2082 5973 2805 -998 -4601 -6851 -6427 -4437 -750 3841 6410 7343 4148 1013 -2834 -6296 -6472 -5421
2098 -5421 -2172 1036 4536 7063 5976 3151 302 -4175 -6455 -6462 -4466 -1062 3540 5746 6500 5117
2114 5117 1700 -2391 -5401 -6861 -5530 -2726 1409 4413 6626 5974 3918 -17 -3847 -6032 -6528
2129 -6528 -4163 -853 2191 5814 6526 5281 2402 -1719 -4963 -6527 -5773 -3368 609 4695 6430
2144 6430 5866 3580 -59 -3510 -5520 -6653 -4995 -1369 2343 5073 6592 5483 2672 -1431 -4900
2159 -4900 -6473 -6345 -3956 342 4325 6287 7095 4313 500 -3497 -5758 -6195 -4833 -1918 2162 5319
2175 5319 6347 5989 2516 -1132 -4471 -6025 -5626 -3868 -524 3687 5715 7080 4449 827 -2602
2190 -2602 -5081 -6334 -5181 -2461 1502 4807 6022 5376 3159 -382 -3017 -6075 -6106 -3879 -465 3685
2206 3685 5905 6238 4915 1993 -2149 -5597 -6493 -5332 -2311 1385 4137 5902 6158 3760 139 -3744
2222 -3744 -5999 -6711 -4213 -697 2120 6161 6487 4865 2231 -1982 -4706 -6348 -5711 -3507 176 4114
2238 4114 6532 5810 3548 252 -3067 -5313 -6650 -4278 -1454 2309 4906 5859 4798 3048 -863
2253 -863 -4555 -6089 -5344 -3083 166 3485 5732 6353 4776 388 -2778 -5418 -6188 -4676 -1831 1678
2269 1678 4528 6271 4950 2472 -1125 -4599 -5857 -6112 -4292 -745 2810 4994 5374 4166 675
2284 675 -1790 -4700 -5712 -5133 -2295 1410 4448 5789 5369 2927 -343 -3982 -5659 -5984 -3646 51
2300 51 3124 5103 6089 4143 1623 -1501 -4739 -5887 -5311 -2258 928 3939 5777 6042 3397 94
2316 94 -3164 -5342 -5630 -4233 -773 2898 4960 6142 4131 1626 -1501 -4074 -5945 -5369 -2765 566
2332 566 3380 5401 5658 3557 972 -2905 -5195 -5864 -4330 -1196 1940 5020 5323 4920 2375 -1229
2348 -1229 -4624 -5378 -5492 -2732 -182 2568 5471 5462 3844 792 -2426 -4896 -5092 -4614 -2016 1441 4241
2365 4241 5133 5387 2590 -924 -3554 -5108 -5235 -3948 -502 3631 5031 6039 4170 1174 -1876 -4978
2381 -4978 -5887 -4618 -1935 1293 4044 5270 5051 2741 -582 -3351 -5702 -5292 -3782 -896 2387 4984
2397 4984 5566 4561 1489 -2219 -4403 -5324 -5014 -2410 764 3652 5554 5113 2901 227 -3006 -5015
2413 -5015 -5455 -4135 -999 2164 4437 5731 4169 1750 -1343 -3804 -5615 -5180 -3203 -105 3335
2428 3335 5158 5344 3663 865 -2705 -4668 -6156 -4542 -1573 1538 4317 5456 4832 2811 -1044
2443 -1044 -3667 -5559 -5579 -2752 -133 3032 4587 5430 4298 1214 -2022 -4343 -5067 -4830 -1919 1485
2459 1485 4395 5403 4656 2253 -353 -2849 -4959 -5232 -3407 -464 2584 4576 4959 3567 1227 -1659
2475 -1659 -4245 -5014 -4373 -2080 1145 4418 4875 5224 2533 -231 -3462 -4881 -5289 -3441 -548 2154
2491 2154 4189 5133 4400 1543 -1324 -3871 -5423 -5156 -2642 303 3209 4858 5000 3113 215 -2018
2507 -2018 -4901 -5168 -3465 -1503 2274 4470 4936 4443 1784 -965 -4255 -5568 -4335 -2957 254 3000
2523 3000 4416 4874 3056 995 -2135 -4698 -5437 -4056 -1114 1421 3855 5325 4496 2312 -1068 -3368
2539 -3368 -4983 -4353 -2878 -137 3095 4479 4502 3351 504 -2110 -4409 -5449 -4566 -1649 1210 4001
2555 4001 4454 3992 2443 -400 -2922 -4501 -4991 -3527 -596 2425 4721 4846 3522 1502 -1184 -3628
2571 -3628 -4580 -3845 -1944 426 3120 4296 4334 2251 -120 -2899 -4699 -4820 -2856 -1008 1914 3999
2587 3999 4747 4281 1386 -1267 -3724 -5455 -4001 -2723 203 3072 4532 4310 2838 684 -2659 -4351
2603 -4351 -4735 -3263 -1233 1217 3782 4740 3891 1981 -926 -3508 -4423 -4353 -2539 -94 2729 4620
2619 4620 4941 3575 1030 -1656 -4003 -4383 -3523 -1398 788 3421 4619 4090 2482 -582 -3500 -4451
2635 -4451 -3940 -3055 -536 2056 3986 4103 3421 1120 -1734 -3112 -4671 -3888 -1921 753 3131 4652
2651 4652 4090 2845 -54 -3324 -4010 -4985 -3055 -394 1914 4267 4700 3639 1396 -1613 -3499 -5107
2667 -5107 -3908 -2252 522 2872 4154 4027 3194 -19 -2139 -4489 -4311 -3212 -1342 1557 3685 4132
2683 4132 3823 1313 -1065 -3124 -4436 -3664 -2514 186 2374 4275 4406 2947 591 -1561 -3610 -4379
2699 -4379 -3919 -1225 956 3796 4682 3596 1263 -344 -2648 -4008 -4051 -2407 -34 1837 3521 3984
2715 3984 3254 727 -1363 -3641 -3798 -3938 -1337 484 3175 4448 3680 2395 -732 -2551 -3962 -4383
2731 -4383 -2320 -938 2098 4019 4075 3343 748 -763 -3068 -4177 -3534 -1993 697 2563 3932 3238
2747 3238 2807 363 -1738 -3965 -4558 -2733 -744 1711 3464 4179 3335 1164 -1361 -2886 -4280 -3242
2763 -3242 -2296 44 2488 3353 3632 2566 772 -1956 -3690 -4388 -2982 -1438 1346 3197 3374 3843
2779 3843 1560 -735 -2991 -3999 -3618 -2240 317 1855 3996 4138 2577 1158 -2356 -3349 -4223 -3195
2795 -3195 -1290 807 2597 4416 3484 1853 -420 -2385 -3811 -3422 -2440 -232 2350 3301 4135 2815
2811 2815 1161 -1290 -2808 -3677 -3460 -1796 495 2688 3692 3917 1743 45 -1649 -3406 -4016 -2469
2827 -2469 -1031 1773 3184 3543 3033 1414 -773 -3507 -3389 -3377 -1506 468 2544 3784 3688 2321 389
2844 389 -1952 -3302 -3895 -3053 -834 1319 2591 4191 3335 1623 -788 -2822 -3672 -3996 -1784 -369
2860 -369 1611 3048 3721 2564 878 -1589 -2739 -3295 -3498 -1478 827 2919 3237 3593 1248 -361
2876 -361 -2314 -3536 -3499 -2231 -156 1712 3411 3941 2732 1085 -582 -2680 -3210 -3216 -1277 404 2304
2893 2304 3410 3151 2086 -366 -1948 -3179 -3449 -2092 -919 1183 2937 3713 3245 1212 -1446 -2398
2909 -2398 -3340 -2866 -1726 65 1908 3248 3296 1848 463 -1916 -3612 -3854 -2489 -164 786 3183
2925 3183 3465 2768 1526 -1392 -2140 -3799 -2815 -1712 92 1587 3357 2978 2172 603 -921 -3131
2941 -3131 -2848 -2170 -821 731 2855 3721 2955 1701 -410 -2127 -3243 -3348 -2151 -226 1667 2931
2957 2931 3010 2627 778 -1227 -3109 -3442 -3169 -1336 865 3077 3409 2847 1885 58 -2360 -3239 -3023
2974 -3023 -2384 -654 1409 3231 2774 2209 1034 -717 -2397 -2633 -2699 -1171 304 1867 3535 2690 1695
2991 1695 321 -1804 -2694 -3241 -2060 -464 650 2694 3000 2217 1177 -520 -2128 -3111 -2878 -1772
3007 -1772 435 1993 3228 3274 2098 493 -1608 -2526 -2812 -2418 -865 1295 2383 3129 2909 1576 -464
3024 -464 -1402 -2775 -2923 -2239 -479 1713 2729 2557 2244 881 -985 -2498 -3005 -2394 -1350 653 2257
3041 2257 2975 2438 1226 361 -1647 -2477 -2406 -2125 -751 1453 2453 3068 2456 916 -1123 -2046 -2964 -2147
3059 -2147 -973 601 1499 2660 2667 1738 421 -1703 -1956 -2898 -1934 -734 930 2618 2945 1925 1133
3076 1133 -408 -1790 -2805 -2468 -1248 356 1518 2562 2665 1504 837 -1216 -2731 -2947 -1954 -665
3092 -665 1333 2506 3045 2136 1583 -346 -2150 -2790 -2558 -970 -328 1135 2375 2184 1714 530 -940
3109 -940 -1795 -2280 -2300 -1107 854 2236 2788 2294 1175 -288 -1697 -2702 -2253 -2202 -78 797 2638 2601
3127 2601 1770 850 -1308 -2461 -2605 -1765 -913 191 2195 2781 2560 1181 -96 -1527 -2547 -2678 -1669
3144 -1669 -576 661 2561 2617 2277 431 -1267 -2329 -2222 -2060 -1008 540 1836 1986 2994 1592
3160 1592 -61 -1405 -2695 -2559 -2199 -82 799 2226 2670 1955 939 15 -2041 -2465 -2507 -1270 250
3177 250 939 2558 2165 1341 381 -1044 -2659 -2338 -1963 -829 742 1636 2476 2078 1198 -739 -1688 -2442
3195 -2442 -1928 -1332 -428 1096 2404 2097 1709 934 -777 -1728 -2324 -2157 -1027 42 1696 2331 1652 1148
3213 1148 328 -1107 -2553 -2324 -1361 -301 942 2103 2151 2094 412 -542 -2612 -2274 -1950 -1117 111 1733
3231 1733 2345 1601 1715 243 -1552 -2113 -2258 -1803 -325 918 1920 2534 2402 1188 -871 -1404 -2168
3248 -2168 -2235 -1228 -205 1025 2565 2115 1337 -141 -1186 -2004 -2415 -1778 -1249 951 2096 2385 1813
3265 1813 951 -405 -1443 -2430 -2436 -906 -550 1099 1854 1939 1646 272 -883 -2020 -1725 -1930 -691 -128
3283 -128 1815 2180 2093 1232 142 -1121 -2347 -2263 -1347 -373 1125 1929 1572 1217 651 -673 -2058 -1925
3301 -1925 -1751 -829 393 1645 2220 1874 1515 869 -1711 -2495 -2223 -1410 -219 1163 1677 2090 2228 680
3319 680 -380 -2336 -1898 -1360 -1377 -219 1271 2236 2607 1439 20 -1182 -1777 -2117 -1629 -326 984
3336 984 1808 1948 1340 602 -346 -1544 -1927 -2318 -1247 58 1700 2399 2116 1738 616 -1485 -1560 -1970
3354 -1970 -1785 -846 823 1192 1819 1555 1283 -266 -1174 -1538 -1987 -892 -68 761 1874 2103 1476 303
3372 303 -472 -1510 -2110 -1758 -640 532 1447 1556 1358 834 385 -1490 -1437 -1881 -1539 -381 540 1812
3390 1812 1839 1417 784 -583 -1739 -1889 -1910 -906 775 1340 1918 1795 1114 -136 -963 -1577 -1930 -831
3408 -831 61 -300 1635 1953 1432 712 -454 -1316 -1823 -1953 -1586 57 662 1783 1813 1192 -111 -1084 -1679
3427 -1679 -2233 -1662 -478 775 1624 2021 1437 459 -56 -1164 -1972 -1913 -1061 -333 1249 1987 2087 981
3445 981 236 -872 -1537 -1792 -1330 -361 243 1668 1904 1809 770 -238 -1162 -2005 -2288 -818 206 860
3463 860 1501 2210 1499 617 -754 -1545 -1839 -1343 -952 732 1119 1700 1601 1089 -168 -1253 -1685 -2119 -1462
3482 -1462 -328 970 1567 2050 1091 927 -512 -1233 -2150 -1790 -1377 300 1375 1430 1675 800 36 -1285
3500 -1285 -1823 -1985 -1200 -643 964 1319 2011 1585 830 -800 -1307 -1815 -1483 -769 26 1203 2001 1793 1021
3519 1021 -3 -714 -1712 -1528 -1634 -612 465 1429 1924 1381 860 -368 -978 -1555 -1691 -1237 101 1237
3537 1237 2043 1869 916 388 -349 -1058 -1455 -1920 -531 795 1171 1805 1400 603 -120 -1324 -1571 -2124 -1231
3556 -1231 45 978 1352 2084 1203 297 -709 -1355 -1782 -1559 -809 -240 1597 1315 1969 1316 -95 -724
3574 -724 -1697 -2011 -1361 203 337 2089 1599 1545 626 -720 -1462 -1419 -2215 -1177 255 1191 2150 1256 1032
3593 1032 309 -660 -1308 -1837 -1201 72 864 997 1132 1382 533 -472 -1225 -1721 -1736 -1217 -355 1220 1590
3612 1590 2089 544 115 -975 -1634 -1629 -1140 -268 221 1046 1697 1211 471 26 -1136 -1580 -1678 -833 -352 1167
3632 1167 1592 1604 1072 171 -822 -1525 -1628 -1636 -572 -22 1116 1231 1323 741 244 -938 -1412 -1711 -1005 -283
3652 -283 1233 1676 1586 1126 420 -388 -1183 -1613 -1834 -882 179 811 784 1637 1068 -396 -1223 -1383 -1461 -1238
3672 -1238 345 299 1394 1420 1381 68 -476 -855 -1268 -1128 -849 408 1010 1030 1519 1341 307 -647 -1937
3691 -1937 -1318 -1199 -627 892 1464 1611 1465 1193 -503 -963 -2071 -1579 -972 21 565 1161 1737 925 449
3710 449 -653 -1071 -1908 -1784 -110 363 1697 1334 1130 304 277 -1294 -1487 -1848 -1124 -297 442 985 1524
3729 1524 1106 535 -231 -962 -1185 -1118 -262 541 1261 1119 1258 756 62 -984 -1572 -1410 -766 -505 302 1588
3749 1588 1559 817 343 -496 -612 -1395 -1851 -75 -128 727 1478 1687 731 210 -932 -1310 -1790 -1281 -292 775
3769 775 1254 1551 1106 751 -240 -1133 -946 -1083 -536 -168 818 1582 1537 878 380 -392 -1509 -1625 -908 -654
3789 -654 448 1360 1484 1449 751 305 -989 -1991 -1322 -916 -833 527 1386 1584 1127 1 -49 -1576 -1269
3808 -1269 -1216 -663 321 1031 1668 1134 1053 310 -1211 -1717 -1404 -1514 -239 1113 1492 1807 1239 291 -161
3827 -161 -1831 -1481 -1218 -301 227 536 1287 973 967 -191 -708 -860 -1498 -1038 -548 444 1425 1011 853 745
3847 745 -543 -1103 -1266 -1454 -801 -333 347 1332 1186 1098 171 -763 -1366 -825 -992 -464 458 1258 1341 1529
3867 1529 686 -499 -1196 -1593 -1470 -602 228 598 1098 1451 647 224 -756 -1078 -688 -1263 -408 652 1107
3886 1107 1232 1626 1087 181 -544 -1439 -1649 -1035 -70 592 1657 1244 878 425 -350 -693 -1316 -1295 -598 -1
3906 -1 898 1171 1190 408 68 -423 -1614 -1669 -891 -163 529 1536 1117 288 598 -634 -1080 -1641 -1014 -701
3926 -701 -288 862 1517 1483 1155 21 -1547 -1193 -1268 -711 54 507 812 1704 1266 297 -707 -1089 -1558
3945 -1558 -1284 -880 294 278 965 1165 504 512 -532 -1038 -1283 -1504 -670 269 1478 1322 718 612 -491
3964 -491 -737 -1167 -1119 -754 -240 512 1234 1199 970 178 -311 -1308 -1334 -945 -553 176 998 1543 1261 550 -152
3985 -152 -1156 -1193 -1076 -705 -180 487 1248 1673 781 487 -180 -813 -1493 -1060 -188 -355 810 1283 1111 638
4005 638 139 -468 -1632 -1347 -784 -93 551 1260 1553 1200 740 -119 -711 -1502 -1195 -404 -144 170 1639
4024 1639 1130 455 378 -198 -877 -1549 -1363 -278 492 974 1346 859 518 -35 -874 -1318 -1070 -651 -84 915
4044 915 1229 1214 560 308 -467 -882 -1451 -1188 -729 442 1048 1485 1394 716 91 -627 -1264 -1214 -1104 -252 218
4065 218 601 1477 636 452 -146 -900 -1206 -1288 -623 345 1111 1248 1091 655 -107 -1222 -1214 -562 -903 -71 327
4086 327 1025 1307 774 55 -124 -645 -859 -1346 -488 -275 828 879 979 1280 60 -732 -1233 -865 -702 -107
4106 -107 755 1143 1416 1457 220 191 -722 -1263 -1059 -942 51 786 1216 1267 379 225 -586 -1054 -1172 -1003 -291
4127 -291 147 1190 1043 1328 -73 38 -646 -1553 -923 -660 72 619 1290 1544 1004 443 -607 -994 -1023
4146 -1023 -1086 -1014 428 618 1236 1439 236 -56 -642 -938 -866 -510 -332 249 1254 1062 1152 397 -539 -1005
4166 -1005 -1242 -1128 -556 497 -78 867 997 537 -134 -119 -1178 -1415 -481 -395 240 888 1352 755 -114 -331
4186 -331 -1119 -902 -1090 -414 16 784 1123 1299 751 621 -186 -1356 -1309 -1028 -175 231 881 1176 1153 174
4206 174 -86 -1052 -1006 -811 -1037 -178 405 1401 903 436 179 -1125 -264 -1670 -712 -368 751 743 410 1008
4226 1008 698 -204 -667 -931 -816 -1049 -173 349 853 1212 998 425 -237 -290 -1383 -1361 -535 -157 661 964
4246 964 1308 824 -175 -405 -940 -1223 -769 -134 501 1266 1897 1254 514 -512 -843 -817 -916 -455 -537 617
4266 617 682 908 957 262 -152 -953 -641 -713 104 949 1234 1058 930 473 -275 -518 -751 -1261 -311 236 139
4287 139 960 878 748 90 -371 -678 -1410 -1158 -15 241 655 972 852 255 84 -762 -1388 -696 -942 166
4307 166 656 1082 872 756 548 49 -1163 -1139 -829 -715 28 322 1001 756 7 339 -728 -1143 -445 -1027
4327 -1027 -368 922 804 1088 713 639 -421 -989 -911 -664 -640 274 935 1272 755 349 259 -816 -927 -1258
4347 -1258 -845 -207 293 886 963 1072 395 -197 -851 -433 -947 -530 -326 947 1015 1024 801 -425 554 -476
4367 -476 -941 -884 -439 60 564 837 920 95 239 -889 -1018 -426 -417 -33 1161 740 1008 558 331 -798
4387 -798 -864 -907 -878 -211 59 925 1323 813 493 -179 -518 -1300 -877 -337 164 690 756 1233 928 44 -105
4408 -105 -611 -711 -132 -728 548 706 904 1136 590 350 -674 -763 -992 -751 -171 601 360 560 1005 305
4428 305 -150 -655 -667 -906 -271 -346 454 918 931 440 410 153 -434 -1013 -726 -212 260 1000 996 1157 340 267
4450 267 -842 -313 -480 -104 -111 622 1247 885 900 337 -212 -1370 -464 -328 -277 351 633 955 483 506 5
4471 5 -315 -802 -748 -589 -107 -31 609 956 400 252 -236 -986 -375 -939 -487 321 363 859 627 575 52 -63
4493 -63 -803 -734 -266 -30 411 644 750 626 -98 -321 -429 -587 -984 -395 -152 243 1209 1381 349 109
4513 109 -161 -1298 -800 -865 -113 479 267 935 819 202 214 -174 -859 -602 -1056 -524 454 715 837 673
4533 673 -116 -717 -945 -715 -865 -654 249 784 613 574 588 -184 -611 -376 -1111 -541 -542 488 99 632 686
4554 686 100 -157 -510 -1168 -534 -18 -6 512 861 771 391 -135 -397 -571 -587 -9 521 463 439 1076 258 230
4576 230 -107 -1432 -647 -510 174 47 141 266 1115 396 -34 -374 -65 -866 -705 -205 285 683 790 1007
4596 1007 614 -249 -793 -394 -142 -23 -2 497 703 725 714 -191 -619 -755 -487 -571 -179 289 285 754 1154 483
4618 483 -478 -751 -934 -896 -543 -444 107 717 517 219 -175 -291 -871 -540 -462 -330 576 289 932 1035 159
4639 159 -10 180 -610 -600 -561 -336 396 -150 925 495 265 -130 -346 -421 -514 -229 -203 31 702 652 1146 77
4661 77 -516 -170 -260 -496 -425 372 351 551 599 74 -442 -765 -1215 -119 -379 42 327 655 280 289 -321 -496
4683 -496 -536 -563 -787 -512 88 353 565 534 99 130 190 -535 -600 -545 -210 357 197 415 178 69 -322 -598
4705 -598 -887 -435 -589 -345 988 523 449 724 32 -143 -713 -497 -561 -112 -203 511 797 195 257 -271 -57
4726 -57 -822 -716 -351 -31 296 1281 33 252 -141 -213 -840 -699 -875 99 75 248 322 220 781 -72 -430
4747 -430 -568 -557 -432 282 335 477 829 638 253 144 -555 -568 -225 -157 -186 203 1152 388 391 -29 -389 -251
4769 -251 -261 -572 250 230 248 669 672 358 316 -873 -378 -466 112 360 231 529 466 231 89 237 -866 -730
4791 -730 257 30 -59 635 -117 537 114 -921 -402 -438 -466 131 190 304 316 208 451 147 15 -888 -777
4812 -777 9 -325 283 529 612 331 368 -72 -269 -402 -750 -551 4 -107 492 392 102 -122 -76 -115 -482
4833 -482 -383 -316 566 354 469 661 488 -88 -247 -598 -487 -678 446 -414 151 592 320 169 -171 -347
4853 -347 -462 -498 -379 23 459 916 300 70 -297 -346 -696 -16 -959 -106 618 779 981 343 46 181 -523
4874 -523 -271 -490 -35 385 237 266 508 796 -445 -185 -263 -671 -142 215 496 479 261 358 -86 259 -218
4895 -218 -47 -400 -479 20 759 333 380 151 -92 -225 -552 -547 -445 -381 -73 614 221 338 19 -93 275 -199
4917 -199 -220 -348 314 709 766 564 -376 -123 15 -109 -527 -188 114 342 395 -1 78 473 -516 -452 -440 -380
4939 -380 -426 -645 -355 265 934 474 447 234 -486 -348 -454 -374 154 660 515 13 281 267 -105 -64 -202 -251
4961 -251 -82 707 1099 806 309 1 72 -358 -685 -520 59 224 180 614 467 -60 -164 -683 -338 -305 -259
4982 -259 481 -342 -111 -268 517 -309 -136 -247 -1248 -281 28 -352 -11 420 1 340 324 -430 162 -66
5002 -66 -8 213 -169 560 814 801 76 -87 -401 -685 79 227 269 -14 760 311 -99 249 -540 -837 -704
5023 -704 -186 -422 362 193 779 501 297 -510 -85 134 -316 24 -287 -80 815 271 1014 384 -267 174
5043 174 47 -519 165 93 333 771 445 442 -411 49 -664 -303 9 -355 -384 39 604 101 -69 -516 -390
5064 -390 -179 -96 -241 195 390 379 572 -9 8 -150 -865 -423 -600 12 -424 327 198 361 -247 46 114
5085 114 -125 -661 -397 25 213 714 280 228 -538 -167 -51 12 -459 -144 234 418 874 390 137 105 -141
5106 -141 -502 -34 327 -293 504 600 357 57 284 -191 -550 -375 -261 -308 -483 761 637 277 -158 407
5126 407 -828 -327 -341 -273 -268 634 615 795 331 -323 -333 -300 -256 -290 -67 233 509 198 -43 160 -279 -358 19
5149 19 -550 139 491 477 297 385 -84 577 -82 -423 -292 -396 -343 -180 456 576 613 232 -79 -336 -728 -205
5171 -205 -503 -6 163 732 544 132 182 -110 -405 -704 -186 -112 12 144 179 208 -99 497 -352 -55 -466
5192 -466 -752 -20 34 336 193 529 812 230 -88 -813 -350 -275 -442 379 578 111 137 187 -47 -660 -443
5213 -443 -538 -841 230 151 384 206 330 809 -154 -511 -462 -366 -338 840 634 425 161 81 84 -357 -155 -23
5235 -23 -336 -202 780 901 324 461 -127 71 -444 -727 -1113 -212 204 -162 478 319 117 -236 -148 -200 333
5256 333 39 444 62 157 586 -20 -115 -913 -423 -345 -638 143 2 291 -159 161 378 -274 -587 -513 -701
5277 -701 -84 -90 436 -190 490 239 411 77 -311 -91 -232 -335 331 194 1173 -177 174 -15 -67 151 -943
5298 -943 -178 -19 92 339 916 912 191 18 -266 -11 -566 -394 -67 28 285 195 166 -360 -626 -307 -877 -149
5320 -149 -43 -234 53 791 469 365 -797 -214 -451 -439 -348 -118 182 550 663 167 -231 -291 -374 -247 -50
5341 -50 -198 451 -183 406 103 -128 -2 -543 4 -513 -27 -114 349 305 679 434 398 -102 -604 -830 -587
5362 -587 -661 -520 517 387 214 234 100 -52 -185 -619 -38 -528 466 474 -66 467 151 278 -483 -650 40
5383 40 -356 83 127 553 555 216 -379 15 38 -361 -386 -51 593 240 402 150 98 30 312 -277 -266 -173 -295
5406 -295 57 449 117 -45 86 -512 -717 -512 -196 54 200 -167 453 195 -221 -45 -541 -297 -447 -253
5426 -253 472 656 216 54 -274 -16 -94 -466 -63 -307 -340 -191 -102 534 427 122 -434 42 -182 -982 -663
5447 -663 -457 25 390 69 59 303 84 -935 -380 -307 -466 -377 403 140 340 718 -259 -334 9 -231 18
5468 18 -208 17 604 614 -17 82 536 -112 -336 -856 -108 119 48 397 717 50 -292 187 -141 -417 -600
5489 -600 -254 392 85 113 -61 -512 -491 -410 -192 -171 343 150 156 492 303 504 41 47 19 -655 -91 -93 -17 587
5513 587 226 641 338 -287 -151 -523 -362 354 -241 122 145 518 538 -200 -96 -362 -660 -263 -558 -94 -40
5534 -40 329 309 297 -429 -361 -634 -335 -241 269 117 -230 359 291 -337 -631 9 -395 -518 75 -54 172 145
5556 145 -28 165 363 -100 -769 -621 -707 -151 204 46 470 822 35 -283 -94 -111 -213 -116 -325 705 84
5577 84 688 577 20 -209 -218 -424 -236 66 248 -443 445 156 65 215 -422 -594 -417 -549 -105 224 618
5598 618 -65 171 76 -562 -523 -302 -378 -451 233 169 778 423 551 5 -337 -239 -384 45 78 510 374 58
5620 58 395 276 -501 -424 19 -503 -593 -165 274 179 195 230 -566 -9 130 -854 -25 -107 -91 -56 770 391 -183
5643 -183 -798 -133 17 -251 92 -39 472 580 701 72 -15 25 -756 -827 -156 -236 66 391 547 696 425
5664 425 43 -2 -80 -319 -205 214 519 607 385 519 -162 -179 -201 -183 -280 135 161 16 605 407 -51 242 352
5687 352 -244 -376 -295 76 511 108 137 186 -264 -406 -20 -661 -311 -104 432 -98 118 232 -337 284 -219
5708 -219 38 198 -260 254 572 215 127 146 -130 -313 -388 -224 -151 -263 44 -61 471 -65 125 279 -295
5729 -295 -7 -248 -137 -317 400 354 207 -34 286 -89 -586 -626 -221 -184 -321 779 574 762 71 -110 65
5750 65 -80 -560 -439 -79 -187 201 328 293 157 92 -304 -870 -135 -626 -219 -574 194 19 183 553 -254
5771 -254 -444 -841 -128 58 341 -75 657 282 -136 -58 285 -915 -678 206 -388 745 621 833 14 -92
5791 -92 -544 -360 -162 -190 -328 -164 150 531 14 173 -270 -523 -25 -158 -154 -246 89 274 -103 -115 499 -15
5813 -15 -486 -490 194 1 -475 -226 398 48 127 -177 -198 -448 -658 -402 235 130 248 289 362 64 24 -63 -485
5836 -485 -81 -721 -154 -117 814 693 -104 98 94 -347 -56 -311 164 374 104 1097 559 556 152 -40 -108 -640
5858 -640 -227 -216 446 188 307 402 305 -201 -310 -393 110 -32 180 -150 338 443 -103 513 -416 177 -238
5879 -238 -331 -8 182 344 664 78 134 -463 -140 202 46 -201 -272 290 29 208 344 150 -42 138 -62
5900 -62 -89 172 365 492 12 78 302 138 5 -89 -207 -32 -102 350 583 451 -124 -21 -116 -828 -295 -695
5922 -695 -358 123 -492 4 141 294 -8 118 -299 -870 -238 379 402 305 341 551 245 -603 -486 -27 -663
5943 -663 295 -43 -58 406 -94 -528 319 -282 -472 -498 -843 -102 -441 548 -42 919 422 -613 -500 -334
5963 -334 -59 16 130 -596 -281 363 -46 -10 -401 -137 -361 -492 79 29 86 474 -312 517 -250 40 -285
5984 -285 -598 285 -211 -91 504 5 139 352 -185 -263 -555 -31 260 103 -99 432 9 347 101 -86
6004 -86 43 -195 -238 73 1 356 555 270 155 531 -323 -320 -185 -123 -483 304 532 81 34 -31 -271 -502 -606
6027 -606 -367 339 326 237 -86 302 187 -68 -149 -357 -549 54 11 -187 -77 -306 173 -289 144 -248 -512
6048 -512 251 222 -171 134 451 107 334 362 -136 -200 -65 129 5 207 164 14 -346 129 149 -63 -738 154
6070 154 -38 43 168 424 347 252 -173 120 189 -138 -741 96 394 344 -45 357 236 -394 21 -386 -141 205
6092 205 340 373 -129 147 -95 524 -144 -160 -310 241 224 -337 506 126 325 180 -245 48 -377 -217 39
6113 39 203 -321 183 576 138 -406 217 -84 109 -472 155 -180 -45 328 10 619 176 -249 -373 -694
6133 -694 494 33 144 341 372 700 357 313 -542 -58 -478 -182 232 -57 708 360 485 358 106 -418
6153 -418 -208 1 -32 544 383 171 102 289 236 30 -110 -249 -390 363 2 368 382 -189 9 -298 -696
6174 -696 -278 225 312 -44 50 364 350 538 259 -652 -617 -65 -762 505 -68 -265 137 118 45 57 -124 -734
6196 -734 6 141 177 173 122 534 191 -21 -338 -505 16 -102 -247 314 196 333 728 152 427 -59 107
6217 107 350 177 438 -142 380 168 -54 152 -333 -413 -163 138 -227 -213 607 391 326 277 5 -120 -529
6238 -529 -80 -184 88 -177 482 287 75 392 -446 -105 -441 171 -375 -63 546 -277 100 82 -52 -313
6258 -313 -208 -80 55 -93 183 192 403 291 264 -126 -449 -585 -52 123 408 -55 44 87 133 -244 46 -785
6280 -785 -44 260 -314 -4 -150 508 619 224 -235 -533 -189 -91 -490 0 720 114 566 -368 349 -87
6300 -87 -431 -210 347 508 190 736 342 119 35 287 -66 10 -195 196 155 729 319 340 163 -323 -31 537
6322 537 -297 -375 -219 -437 -24 417 67 64 206 -469 -199 -328 -111 15 111 701 35 137 122 -451 -420 -230
6344 -230 -354 173 6 -42 240 170 255 -399 14 -180 -210 -560 154 494 677 200 610 433 403 -471 -202 163
6366 163 -77 63 -176 -38 -274 338 144 197 -102 403 -248 -574 -399 182 200 523 117 -618 247 22 -209
6387 -209 -45 529 149 -228 138 108 -296 -127 105 -132 -176 -86 175 57 59 217 -80 -459 36 -659 45 73
6409 73 -203 560 172 116 540 -94 245 -265 137 -212 87 171 -153 260 5 762 -378 -524 -85 -527 653
6430 653 354 -272 268 101 -300 -317 -42 -105 -424 77 -297 31 1 588 97 264 -146 -355 -661 -51 -270
6451 -270 416 484 774 139 1 349 -49 -267 -218 45 38 227 107 772 236 337 -692 -385 -152 -467 -454
6472 -454 -204 132 47 276 317 -252 -174 -168 -120 44 -282 -428 173 367 685 221 255 -81 -85 261 46 44 147 174
6496 174 496 345 342 -31 -204 -62 -45 -423 319 74 329 272 231 137 303 194 -694 -346 -123 -44 324 -44
6518 -44 -171 36 203 -476 -529 -332 338 -61 149 -11 439 227 -365 151 -77 224 -674 -112 332 -142 -161
6539 -161 -131 -109 -65 -95 -149 -73 -679 -165 -201 222 203 472 159 319 -81 -113 -257 -211 -1 -37 302 41 -148 -121
6563 -121 -158 110 -417 -612 128 -129 20 31 -251 -347 11 -231 156 -556 -602 189 15 211 313 190 -6
6584 -6 14 -763 -402 -555 -64 19 1 -263 -35 311 -20 -82 -398 386 -159 -248 -10 150 407 255 297 -131 83
6607 83 -617 -202 -126 181 -280 480 727 66 38 -84 -73 -348 24 107 254 332 -104 139 -253 -411 -528 -108
6629 -108 -241 165 -152 210 262 347 233 55 -212 -131 -436 -292 -301 -388 106 177 2 222 223 -38 221 -319 157
6652 157 -118 34 61 355 74 301 179 -440 80 -90 118 595 -219 -490 457 -322 -196 -371 -44 24 -393
6673 -393 359 323 -568 -222 -219 -196 140 200 9 -728 -153 499 48 -186 187 408 -60 -5 -65 -184 93 -112
6695 -112 -376 489 495 -61 342 -456 41 -447 -560 41 -282 256 553 -5 220 -129 -66 152 409 138 -297
6716 -297 93 235 619 -20 -70 -255 -469 -154 -494 -109 -38 -254 562 522 419 117 -190 -17 -534 -77 241
6737 241 -213 557 237 398 123 123 -818 505 -389 -166 19 233 411 118 358 -310 284 -136 -66 -147 -192
6758 -192 -434 -31 119 571 -347 -9 -130 -81 9 -235 247 122 -115 -37 173 132 -72 -792 -205 -142 307 163
6780 163 626 59 -82 72 249 -71 -255 -118 -184 -324 289 -186 430 66 217 -297 -322 -297 -379 235 -20
6801 -20 1094 617 107 -200 -301 194 -745 -320 -1 289 -10 524 277 -35 167 225 -247 -461 -527 296 -43
6822 -43 427 374 426 142 -124 -307 -501 -15 -179 -274 275 613 671 -14 399 75 -4 43 -644 -312 -591 -120
6844 -120 394 81 -127 251 74 -332 -336 117 -326 460 275 -93 426 57 -62 390 -233 -381 437 -309 111
6865 111 -177 -118 -217 -357 43 -134 216 -12 -58 -134 12 444 162 -177 230 -343 26 -322 -261 -277 193 49
6887 49 -299 21 466 98 371 42 -93 -465 -217 79 677 185 -437 29 -128 -368 -627 -355 298 470
6907 470 191 524 -33 19 392 96 -564 214 -229 232 -70 -145 62 219 5 -403 -244 -260 -43 -209 53
6928 53 114 391 197 243 97 -229 15 -113 -33 609 207 55 -188 -262 -363 -422 -122 -96 314 120 0 322
6950 322 -174 141 -216 403 -47 -259 -118 -356 492 153 220 528 162 -263 -332 -204 -60 -208 119 706 -32
6971 -32 864 356 250 384 -96 -135 -545 -457 504 -389 117 40 99 374 -429 -507 54 -251 237 100 -269 31
6993 31 238 540 51 -114 -255 -75 -97 -176 108 60 386 -116 348 -76 77 -277 -298 -379 -969 299 146 -221
7015 -221 439 7 -300 113 -302 379 -50 -596 -14 209 370 272 145 315 -774 -165 54 332 682 148
7035 148 229 -124 -31 221 225 -316 -236 63 479 550 363 145 169 -4 -593 167 -415 -181 162 174 222 240 196 -117
7059 -117 -432 -493 -17 30 64 303 240 332 -55 88 83 -77 -395 -342 132 -262 417 -250 -7 147 64 -530 -155
7082 -155 211 -325 -51 -96 50 163 765 311 -133 -825 -135 -176 -157 221 -361 -403 -256 -75 409 -356 -255
7103 -255 -504 -238 -188 -110 -350 44 348 -14 275 -252 140 -418 48 164 895 460 474 33 54 32 88 -210
7125 -210 -229 -478 195 76 -262 588 -112 -219 -15 -632 -539 -378 230 86 -174 247 92 649 -234 -163 -680
7146 -680 -566 -205 50 -21 229 -243 625 -53 -190 302 65 -434 -525 424 232 163 -80 -116 388 -872 -847
7167 -847 -352 195 230 260 224 435 292 70 -15 -473 -343 -173 -198 -175 -58 253 28 322 -438 -134 -8 -721
7189 -721 -764 337 448 -110 601 267 -375 -312 447 -164 -44 346 -472 45 331 53 -215 -414 -39 95
7209 95 -429 -398 -84 343 371 -204 112 -100 7 -583 59 105 -135 279 -195 -61 327 365 159 -103 -842 -436
7231 -436 -427 -21 538 647 491 108 233 696 51 -416 -143 -187 38 162 302 -306 -209 38 -151 -381 267
7252 267 224 -1 -164 -418 707 86 98 -49 -365 -343 -517 209 -244 468 115 195 -131 108 -210 -208 -396 -355
7274 -355 24 246 -20 41 424 209 -168 218 -604 7 -84 -163 -39 81 295 244 258 -293 -156 -140 297 -352
7296 -352 770 135 238 168 43 -432 -296 6 -155 283 584 338 606 -16 76 74 -252 86 277 -97 -246
7317 -246 -211 181 337 129 -565 547 -176 -232 53 -74 147 327 319 204 -203 113 -72 -238 -290 -47 -542
7338 -542 115 233 254 389 -320 175 -412 -247 345 -94 60 -205 228 550 17 334 -75 594 -261 -551
7358 -551 -207 -226 399 787 304 358 93 -83 -87 -261 -189 -453 -244 432 675 -310 172 -160 -303 -237 -352 90
7380 90 -38 -400 -36 -61 11 46 -71 -192 -380 -140 226 -120 -122 -134 9 157 111 -511 -53 -462 -321 97 -293
7403 -293 532 -258 199 477 -587 71 -232 -113 241 -63 -542 504 -104 176 -22 -416 33 123 -13 -138
7423 -138 -108 -8 -36 -137 152 325 86 -654 274 -220 150 171 -65 44 -181 -81 -94 -195 -143 196 -231 323
7445 323 -174 195 -34 365 -306 -250 -276 224 -41 186 -120 259 770 204 136 73 -146 141 -114 -186 -223 -35
7467 -35 -444 488 99 304 -472 -368 581 674 -264 -218 266 -291 -353 285 290 -245 -39 -207 157 -26 -12 449
7489 449 -422 47 353 -219 204 -639 462 189 -187 -63 -175 136 491 54 100 58 -361 -314 346 284 287 171
7511 171 301 -74 -179 -389 -370 -377 -338 -39 29 -275 150 166 304 -219 -184 86 -370 -302 -205 -9 -183 -103 248
7534 248 -383 -312 17 96 -86 271 -4 351 -15 198 -50 205 -824 -287 -98 13 -67 199 116 -270 -202
7555 -202 -294 -597 -431 -176 -243 166 -19 505 581 -172 -400 353 166 -695 334 -321 20 349 599 211 396
7576 396 150 -292 -585 -434 405 -354 -588 0 354 -80 -134 -131 87 -452 -368 199 9 524 612 529 -309 -225
7598 -225 -266 532 -138 -28 261 576 726 -326 2 247 15 403 109 418 179 115 -64 -252 194 -110
7618 -110 -402 -292 -362 -520 128 433 248 184 176 -189 -251 209 -394 -262 2 -522 -468 305 924 -99 -514 288
7640 288 -766 -313 211 156 -47 495 -126 -45 296 60 241 -230 -91 -411 101 221 -26 -63 314 263 220
7661 220 -127 -265 -58 181 108 -17 -271 -178 275 -56 -150 87 281 286 183 172 110 97 477 604 -522 -664
7683 -664 -346 271 -390 132 11 -47 132 17 -85 171 113 -251 -13 -538 293 110 46 518 -284 -26 -324
7704 -324 -524 352 98 143 -190 248 85 513 680 -366 -73 -512 249 -256 -234 80 -361 269 -102 199
7724 199 -45 -251 75 274 407 213 -181 284 157 175 100 14 -21 -202 -179 685 -284 380 -31 97 185 -687
7746 -687 -171 -123 82 -34 -31 224 -268 -22 630 239 254 -195 -582 438 174 647 211 78 4 48 -212 -297
7768 -297 228 458 -359 1 372 888 245 -155 -155 -103 211 -110 -225 373 21 28 326 122 -693 -19 105 -528
7790 -528 -471 -4 -4 460 318 102 228 249 -153 -578 -411 -90 16 295 208 273 -75 198 -311 -209 -153 196
7812 196 613 67 -152 97 -290 -6 171 -226 -337 -260 397 190 302 90 -208 90 -55 -469 309 -197
7832 -197 206 18 -314 -167 46 161 -246 -130 536 -221 290 -174 -220 378 318 219 810 414 -579 170 -274
7853 -274 75 -4 603 -24 296 -231 515 -508 -2 286 77 -135 -148 310 365 -51 41 127 -225 -145 141 -288
7875 -288 10 146 94 119 -450 511 28 -234 -436 -255 -170 284 84 600 248 82 -426 235 138 -444 -111
7896 -111 105 -131 -191 189 247 478 -326 -74 503 -549 91 219 -18 -61 8 285 142 -316 -515 346 -44
7917 -44 1 -31 333 -152 224 -99 6 16 -591 -377 -196 58 -625 -204 -168 240 91 117 26 -82 531 -173
7939 -173 -141 104 -61 272 266 341 -244 -372 -282 133 -415 37 230 112 170 301 -85 159 62 -361 608 205
7961 205 -107 -305 178 -39 182 219 -166 -255 -164 475 -55 -71 153 -125 237 -72 -348 -54 -169 -222 63 -157
7983 -157 358 418 -190 -262 -184 -487 -405 -212 -319 212 -26 -103 -127 349 59 194 -223 71 -115 -398 75 -47
8005 -47 105 362 229 280 -162 -262 576 228 -397 -265 399 -28 67 138 -175 -71 -203 -188 280 338 -5 -172
8027 -172 442 70 -1 -75 91 -493 -81 -45 -122 745 -132 -104 20 -560 317 464 -182 281 28 615 137 8
8049 8 -320 -208 -18 -226 62 -213 -205 -170 445 -232 198 -308 7 231 -144 22 132 -225 361 -462 -204 46
8071 46 732 -136 169 308 -202 22 -256 -336 239 277 -420 -72 404 93 137 391 -197 -350 -103 -127 22 -394
8093 -394 -685 -394 -446 64 -463 253 1 387 438 -537 -102 30 -92 -30 -722 -220 348 128 529 -155 212
8114 212 -157 499 -441 111 -122 -420 47 229 -258 102 192 -351 -42 -241 -304 237 306 154 255 150 699
8135 699 -246 -42 -66 201 445 -95 -51 382 161 159 -147 105 -217 -196 -360 -199 -103 257 -12 -241 -135 -166
8157 -166 179 -482 107 -105 -33 65 -9 64 67 212 148 -459 -205 -82 228 -528 -52 -204 -87 -440 -290 399
8179 399 -429 -138 -749 -177 251 -273 -28 -16 208 -17 35 195
8191A95
$$ Imaginary data points
##PAGE= N=2
##DATA TABLE= (X++(I..I)), XYDATA
0 0 0 0 0 0 0 0 0 0 0 -24 24 -24 24 -24 48 -48 48 -72 72 -96 113 -126 144 -168 194 -224 262 -289 334 -377
30 -377 424 -476 532 -594 666 -741 823 -914 1013 -1127 1247 -1380 1524 -1691 1872 -2077
46 -2077 2310 -2571 2875 -3229 3645 -4141 4758 -5536 6551 -7947 10001 -13328 19648 -36105
60 -36105 178022 363564 147566 11930 -123290 -187246 -260933 -225766 -104870 81085 208327
71 208327 263320 219971 121084 -21357 -150290 -246130 -254868 -170402 -10338 138317 227871
82 227871 236562 185968 71945 -80737 -218085 -264901 -206168 -78286 56479 163016 224891
93 224891 228150 147844 -2904 -157909 -239737 -229515 -153128 -36352 103255 217241 247892
104 247892 181791 57507 -77012 -187378 -237129 -200589 -92317 40495 154755 220162 211432
115 211432 127334 3409 -115887 -203663 -231236 -171065 -35627 107125 193383 212041 176372
126 176372 84880 -49764 -173602 -228031 -195578 -100261 23063 140250 210561 208178 133486
137 133486 14283 -108550 -192303 -209462 -157765 -55270 71143 179578 223760 180962 72661
148 72661 -52186 -151607 -200091 -184382 -109573 2749 120100 199517 204462 131156 17405
159 17405 -92964 -171209 -201617 -163013 -58962 66206 160725 196163 172056 89582 -30150
170 -30150 -140361 -197232 -181671 -106947 -323 105913 174938 186192 136981 40179 -78103
181 -78103 -170506 -195259 -147177 -58008 42144 134943 189648 175516 92355 -22726 -122154 -176996
193 -176996 -174820 -113321 -12663 92324 165337 180131 132937 40970 -61411 -142733 -179715
204 -179715 -155101 -73351 37473 132001 174581 157545 92193 -829 -96780 -164748 -174086 -120007
216 -120007 -20673 82995 151332 165138 131004 55577 -44490 -134518 -173587 -147452 -72938
227 -72938 19996 106935 163953 161359 98914 1792 -90838 -149230 -159893 -116424 -34086 60147
239 60147 135286 165145 135016 54355 -42256 -117345 -151157 -141133 -86214 3799 97928 155450
251 155450 152483 97484 14476 -72528 -137893 -156247 -119452 -39624 51974 122956 150202 128551
263 128551 64975 -23274 -105614 -150474 -139330 -80139 1617 81077 134920 144916 105178 26818
275 26818 -62526 -130195 -147718 -112902 -42731 37565 106424 142775 130720 69415 -17715 -92709
287 -92709 -133983 -131982 -88240 -11886 72243 129355 139083 100707 30492 -48353 -112273 -138928
299 -138928 -117230 -52866 30338 102012 134795 119753 68154 -3866 -75864 -125623 -131700 -90762
311 -90762 -15899 61381 115079 129390 102775 39952 -38285 -104524 -132543 -112610 -55134 18591
323 18591 85037 124780 121954 74532 -22 -71106 -115239 -120841 -88707 -27165 46141 105952
335 105952 127538 102787 41891 -31744 -92548 -120423 -109786 -62585 7808 77682 118288 115281
347 115281 73592 9842 -55854 -105959 -119829 -91203 -28991 41632 95121 117183 99808 50041
359 50041 -18281 -82323 -118096 -109155 -61081 4997 66149 105125 110743 79870 18279 -50353
371 -50353 -100639 -112589 -86391 -33784 28841 83984 112943 101727 51911 -14980 -74279 -105933
383 -105933 -102263 -67452 -7362 58049 102063 108732 75581 19330 -39304 -86633 -106328 -90318
395 -90318 -41208 23998 79069 105872 94102 52938 -4998 -63137 -101175 -103457 -67575 -8391
407 -8391 50633 90549 100454 78529 28885 -32798 -83387 -102454 -85144 -40698 14555 66182
419 66182 97617 96458 58355 -752 -58287 -92962 -95265 -66263 -17417 39880 84548 100116
431 100116 77736 28927 -26924 -72229 -93436 -85177 -47293 9460 63178 93585 89040 56143
443 56143 6388 -45971 -84361 -95123 -69824 -18358 36791 77328 90215 75311 36811 -17491
455 -17491 -66648 -92645 -83314 -45999 5026 53513 83844 87150 61208 11089 -43074 -80301
467 -80301 -88145 -66782 -24608 25478 69203 90052 76714 35687 -15317 -58641 -81921 -79868
479 -79868 -51183 -3609 47671 81592 84803 58115 13441 -33600 -70262 -84843 -69853 -28040
491 -28040 23297 64914 82161 72168 40029 -6553 -52045 -80901 -80337 -49400 -3784 40617 71299
504 71299 79641 61903 20915 -29582 -69350 -81359 -64307 -28453 15158 54775 78311 73766
516 73766 42312 -4532 -47762 -73115 -74131 -51141 -10788 34555 68778 78217 59392 20063
528 20063 -24191 -58801 -75191 -68126 -34654 12526 53510 74193 67835 41705 2080 -38832
540 -38832 -69078 -75453 -52896 -11682 32024 61757 71766 58987 26134 -17575 -57049 -73992
552 -73992 -63927 -33319 7703 44510 69103 69402 44260 4409 -36523 -64018 -68531 -51016 -17294
565 -17294 22775 57379 72573 59893 25189 -15799 -49011 -66452 -62978 -38203 1382 41959
577 41959 66136 65768 43321 7863 -29872 -58613 -67340 -53074 -18796 21595 52634 65410 56821
590 56821 29766 -8314 -45933 -66504 -61315 -35980 1174 35451 58848 63193 46436 12425
602 12425 -26921 -56058 -64166 -50591 -20422 14749 46498 63826 58401 30669 -7586 -40421
614 -40421 -59068 -59631 -39666 -4403 31933 57439 60961 43940 13581 -20968 -49103 -61371 -52569
627 -52569 -24651 13208 45162 58971 53877 31178 -1180 -34882 -57946 -59755 -38816 -6335
639 -6335 27328 52069 58450 45974 16943 -17308 -46432 -59230 -50459 -23963 8385 37931 56253
652 56253 55863 34278 -413 -33378 -52824 -54618 -39888 -11280 22563 48675 57660 44985 17664
665 17664 -14749 -41768 -54257 -49734 -28511 4185 36303 54716 52732 32864 3894 -26686
677 -26686 -49845 -54876 -40454 -11535 19999 44620 52927 44458 20817 -9774 -38078 -53826 -49802
690 -49802 -26895 2927 30345 48475 51266 36437 7038 -25042 -47028 -51685 -40206 -15144
702 -15144 15250 39934 51899 44717 23165 -7278 -34711 -50044 -48076 -29950 -1663 28278
714 28278 47525 50256 34688 9238 -19689 -41598 -50409 -41628 -16916 12939 37440 49316 43511
727 43511 23235 -3110 -29941 -46917 -47595 -30516 -3362 24518 43128 48441 36349 12227 -17392
740 -17392 -40118 -47735 -40411 -19226 8864 33744 47013 43871 25398 -836 -27989 -44240 -44981
753 -44981 -31280 -7493 20168 41312 47854 36436 13329 -13849 -35875 -45943 -40384 -20462
765 -20462 5937 31150 45414 42354 26519 1067 -23155 -41114 -45316 -32841 -7993 18535
777 18535 37542 44106 36787 16742 -10427 -33865 -44558 -39889 -20991 3312 26498 41627 41689
790 41689 28244 4698 -21566 -39661 -42336 -32448 -10942 13831 34777 43102 37096 17206 -8448
803 -8448 -29214 -41415 -39382 -23843 108 24935 40696 41034 27265 5475 -17332 -35103 -42037
816 -42037 -33911 -13132 12364 32284 41177 36412 18694 -4270 -26982 -40265 -38669 -24565 -1588
829 -1588 21725 36812 39425 29383 9085 -14918 -34404 -40332 -32470 -13944 7477 28203 40296
842 40296 37289 20692 -3122 -24541 -37146 -37884 -25526 -4627 18067 34828 39579 29781 9819
855 9819 -12102 -30031 -38234 -33638 -16972 6026 26447 37310 34972 21465 679 -20888 -35507
868 -35507 -38019 -26723 -5666 16247 31757 36817 29281 13134 -9216 -28832 -38008 -33283 -16931
881 -16931 3069 22559 34815 35464 23127 2038 -18890 -33826 -36072 -26792 -8968 12011 29997
894 29997 36950 30426 13490 -7320 -25168 -34203 -32538 -20166 242 20765 34331 34486 23135
907 23135 4284 -15549 -30350 -35378 -27991 -10612 10571 28298 34516 29772 15536 -3911 -23104
920 -23104 -34062 -32541 -19778 -1202 17907 30623 33681 25152 7517 -13520 -29259 -33620 -27712
933 -27712 -11680 7247 23936 33748 30779 16795 -3000 -21181 -31508 -31631 -21087 -3945 15775
946 15775 29461 33011 24767 8565 -10328 -25486 -32808 -28444 -13543 6097 23281 31632 28494
959 28494 17410 624 -16793 -29297 -31928 -22285 -4689 12984 26165 30861 25650 11117 -7942
972 -7942 -23954 -31439 -27785 -14698 2778 19403 30230 30347 19155 1764 -15862 -27284 -29661
985 -29661 -22230 -8400 9978 24797 30501 26253 11520 -6057 -20693 -29112 -28796 -17226 938
998 938 17959 27990 28564 19520 4647 -12222 -25248 -29973 -23453 -9363 8362 21993 28580 25750
1012 25750 14428 -2910 -19363 -29042 -27783 -17001 -1191 14732 26076 29278 21382 6325 -11682
1025 -11682 -24200 -28082 -22956 -10685 5730 20554 28368 26076 15168 -1531 -17094 -26190 -27429
1038 -27429 -18592 -3932 13513 25176 27495 20943 7564 -7705 -21276 -27009 -24512 -12138 4339
1051 4339 18323 25701 25168 15952 1825 -14294 -25396 -27380 -18903 -4468 10871 22239 26249
1064 26249 22208 9931 -6145 -20054 -25642 -23700 -13620 1357 15060 25094 25759 16922 2320
1077 2320 -12234 -23003 -25806 -20208 -7853 8021 20946 26195 21861 10286 -4242 -16932 -24100
1090 -24100 -23946 -14538 -147 14284 23513 24206 17771 4795 -10068 -21172 -25650 -20081 -8034 6507
1104 6507 18874 24068 22289 12886 -2115 -16190 -24070 -23139 -15072 -2243 11210 21457 24409 18479
1118 18479 6620 -8417 -20075 -23793 -20305 -9769 3961 17261 23720 22260 12650 -594 -13838
1131 -13838 -21891 -22939 -16148 -3730 10217 20088 23612 18620 7881 -5941 -16730 -23492 -21021
1144 -21021 -11447 2826 15252 22084 21280 14237 1664 -11685 -20857 -22633 -16879 -4845 7674
1157 7674 18193 22746 19324 8761 -4381 -16059 -22060 -20745 -12263 288 12545 21300 21779 14576
1171 14576 3020 -9828 -18492 -21053 -17237 -7144 5726 17395 22048 19295 10044 -2344 -14050
1184 -14050 -20917 -21151 -13553 -977 11187 19565 21464 16061 4535 -7886 -17948 -20942 -17647 -7581
1198 -7581 4340 14941 20371 19237 11128 -569 -12970 -20309 -20105 -13575 -3238 8799 17422 20733
1212 20733 16553 6207 -6000 -16266 -20523 -17228 -9056 2617 13469 19541 19521 12159 850 -10600
1226 -10600 -18424 -19734 -15319 -4323 7440 16633 20151 15816 7182 -4192 -14102 -19087 -18301 -10530
1240 -10530 1368 11590 18381 18675 13254 2833 -9004 -17369 -19991 -15021 -5232 5916 15181 19132
1254 19132 17160 8634 -2784 -12941 -18765 -18164 -11189 -726 10229 17983 18876 13347 3731 -7432
1268 -7432 -15703 -18699 -15707 -7520 3801 13817 18283 16989 9162 -1415 -10738 -16817 -17944 -12670
1282 -12670 -2221 8809 16374 18285 14097 5023 -5452 -14151 -18732 -16181 -7718 2549 11903 17540
1296 17540 16803 10221 854 -9853 -16554 -17666 -12264 -3044 6130 14553 17941 15187 6648 -4445
1310 -4445 -13125 -17662 -15760 -9184 516 10048 16800 17378 11425 1061 -7744 -15385 -17030 -13975 -4890
1325 -4890 6044 13866 17189 14081 7020 -1901 -11596 -17009 -15728 -9994 293 9657 15045 16371
1339 16371 11997 3250 -6836 -14064 -16302 -13086 -5622 3879 11893 16662 15649 9115 -1321 -10449
1353 -10449 -15477 -15824 -10329 -2354 7719 14843 16547 12434 3822 -5301 -12826 -15610 -13899 -7138 2212
1368 2212 11327 16092 14990 9137 593 -8690 -15159 -15772 -11087 -2832 6170 13513 15345 12977 5524
1383 5524 -3820 -11748 -15918 -13721 -8065 817 9454 14653 14812 10165 1965 -7727 -14147 -15070 -11359
1398 -11359 -4061 4774 12123 15566 13312 6369 -3175 -10482 -14691 -14062 -9212 321 8634 13901 14078
1413 14078 10724 3339 -6038 -12464 -13987 -12204 -5334 3563 11637 14293 13458 7595 -909 -8653 -14359
1428 -14359 -14666 -9865 -1289 7079 12695 14246 11170 4272 -4331 -11686 -14518 -12214 -5957 2158 9275
1443 9275 13894 13669 8682 69 -8131 -12349 -14503 -10735 -2960 6045 12011 14374 11119 5101 -3681
1458 -3681 -9830 -13781 -12656 -7366 929 9284 13404 13446 9000 1296 -6507 -12345 -14166 -10765 -3203
1473 -3203 4676 10802 13172 11809 6134 -2024 -9490 -13192 -12853 -7936 164 7350 12594 13101 10104
1488 10104 2168 -5866 -11738 -13432 -10394 -4513 3356 10209 12944 11926 6982 -833 -7840 -12532 -13007
1503 -13007 -8678 -1753 5941 11643 12666 10054 3567 -4138 -9982 -12876 -11478 -5917 2207 8843 12385
1518 12385 12141 7479 112 -7075 -12421 -12959 -9002 -2186 5245 10765 12963 10766 4663 -3335 -9652
1533 -9652 -12148 -11131 -6288 731 7958 11487 12812 8792 1622 -5388 -10609 -12596 -9445 -3341 3570
1548 3570 10575 12819 10247 5197 -2208 -8339 -12260 -11652 -7801 -29 7165 11268 12105 8532 1998
1563 1998 -4528 -10616 -12626 -10324 -4568 3002 8581 12213 10804 6061 -1205 -7460 -10937 -11394 -7451
1578 -7451 -750 5468 10355 12216 9323 3324 -3395 -9415 -12068 -10266 -5127 1689 8055 11813 11434
1593 11434 6719 -112 -5733 -10699 -11438 -8180 -1970 3953 9562 11248 9309 4040 -2122 -8408 -11804
1608 -11804 -10513 -5447 601 7388 10938 11338 7299 1468 -5128 -9993 -11077 -8179 -2956 3371 8596
1623 8596 11468 9575 5122 -1950 -7635 -11025 -10171 -6595 -618 6497 10483 11342 8096 2168 -4312
1638 -4312 -9384 -11310 -8886 -3815 2732 8133 10884 9609 5850 -788 -6724 -10662 -10145 -7136 -976
1653 -976 5260 9280 11129 7960 2854 -3009 -8653 -10928 -9931 -4500 1950 7157 10021 10222 6207 86
1669 86 -6007 -10223 -10567 -7336 -2094 4168 9139 10664 8854 3824 -2407 -7978 -10151 -9579 -5594 581
1685 581 6227 9912 9434 6814 1046 -5065 -8593 -10442 -8172 -2640 2747 8222 10017 9382 4279 -1727
1701 -1727 -7348 -9794 -9144 -5718 89 5965 9458 9908 6830 2510 -4114 -9016 -10466 -7723 -3464
1716 -3464 2516 7067 10153 9095 5085 -1009 -6023 -9951 -9329 -6193 -1245 4184 9035 10372 7326
1731 7326 2483 -3151 -7843 -10177 -8500 -4318 1749 6677 9326 8827 5403 -138 -5519 -9113 -9727
1746 -9727 -6442 -2054 3688 8320 9472 7586 3302 -2224 -6792 -9628 -8015 -4392 969 5650 9387
1761 9387 9417 6095 844 -4786 -8494 -9947 -6948 -2124 3087 7487 9920 8488 4020 -1811 -6560
1776 -6560 -8973 -8414 -5478 -268 5050 8887 8672 6340 1382 -3372 -7450 -9506 -7766 -3459 2395
1791 2395 7569 8950 8340 4558 -502 -5755 -9121 -8328 -5336 -1262 4651 8359 8990 7479 2930 -3260
1807 -3260 -7629 -9059 -7782 -3878 1144 6202 8320 8700 4936 261 -4898 -8136 -8713 -6146 -2159
1822 -2159 3340 7926 8771 6771 2967 -2276 -6739 -8448 -7850 -4506 542 5908 8438 8484 5542 1051
1838 1051 -3757 -7730 -9481 -5925 -1974 3080 6740 8727 6710 3853 -1247 -6409 -8787 -7863 -4683
1853 -4683 179 4946 8122 8241 6021 1707 -3861 -7205 -9093 -7309 -2776 1646 6516 8707 8093
1868 8093 4395 -1224 -5514 -7908 -7650 -5780 -141 4041 7173 8205 5897 1624 -2845 -6630 -8391
1883 -8391 -6747 -3428 1784 6157 8153 7710 4645 61 -4728 -7938 -7865 -5461 -1220 3440 6667 8592
1899 8592 6686 2301 -2738 -6322 -8108 -7112 -3489 856 5065 7771 7702 4816 137 -4194 -7103 -7825
1915 -7825 -6073 -2163 2519 6620 7673 6322 3148 -1473 -5485 -7894 -7788 -4437 134 4618 7496
1930 7496 7506 4769 1188 -3356 -7364 -8391 -6089 -2340 2000 6015 7386 6985 3622 -954 -5026 -7281
1946 -7281 -7603 -4538 -756 3718 7516 6974 5455 1762 -3062 -6365 -7444 -6751 -3343 1454 5585 7754
1962 7754 6963 4278 -84 -4720 -7094 -7675 -4763 -783 3846 6734 7259 5689 2240 -2144 -5719 -7220
1978 -7220 -6521 -3609 1065 4928 7438 7103 4597 224 -4224 -7048 -7312 -5095 -2014 2355 6010 7204
1994 7204 6287 2610 -1731 -5206 -6872 -6538 -3790 72 4712 7097 7295 4975 412 -3311 -6372 -7298
2010 -7298 -6047 -1861 2326 6419 7002 6236 3258 -926 -5762 -6924 -6782 -3791 -60 3896 6747 7086
2026 7086 5182 1618 -2774 -5979 -7165 -5913 -1801 2287 6034 7404 6757 3729 -895 -4618 -6788
2041 -6788 -6759 -5010 -414 3527 6486 7490 5468 2013 -2470 -5783 -7111 -6317 -2994 1448 5122 7219
2057 7219 6373 3942 -164 -4197 -6722 -7168 -5683 -1296 3116 5970 7081 5434 2294 -1864 -5496
2072 -5496 -7121 -6345 -3085 787 4302 6697 6406 4592 440 -3570 -5748 -6422 -5054 -1367 2161 5822
2088 5822 7386 5953 2641 -1438 -4889 -7076 -6239 -4113 470 3734 6484 7073 4327 860 -2940
2103 -2940 -5636 -6892 -5649 -1796 2045 4920 6590 6457 3160 -594 -4690 -6106 -6458 -4201 14
2118 14 3775 6133 6957 4658 1488 -2327 -5381 -6702 -5661 -2005 1588 4574 6192 6034 3271 -223
2134 -223 -3853 -6711 -6026 -4280 -1052 3409 6016 6640 4977 1696 -2063 -5260 -6554 -5662 -3351 1377
2150 1377 4124 6431 6304 3442 -24 -3546 -6224 -6720 -4619 -1783 2907 5901 6572 5487 1841 -1643
2166 -1643 -5070 -6452 -5830 -2864 427 4283 6016 6413 3819 476 -2981 -6368 -6631 -4551 -1589 2217
2182 2217 5394 6301 5346 2585 -1390 -5054 -6094 -5906 -3687 279 4494 6456 6372 4457 942 -3057
2198 -3057 -5007 -6065 -4846 -1903 1899 4844 6895 5957 3024 -694 -4116 -6374 -6099 -4126 -277
2213 -277 3222 5874 6020 4960 1688 -2289 -5602 -6283 -5014 -2858 1566 4084 6754 6354 3418 -551
2229 -551 -4032 -6201 -6130 -4188 -709 2708 5008 6525 4769 1419 -2067 -4634 -6614 -5217 -2480 506
2245 506 4739 6060 5501 3940 66 -2885 -5515 -6154 -4208 -1103 2584 5002 5975 5269 1969 -1619
2261 -1619 -4529 -6621 -5097 -3012 224 4003 5878 5458 3949 935 -3241 -5916 -5967 -4700 -1387 1640
2277 1640 4761 6292 5209 2905 -1683 -4156 -5570 -5224 -3435 18 3860 6112 5955 3840 1022
2292 1022 -2876 -5379 -6079 -4833 -2210 1637 4639 5858 4781 2367 -443 -3715 -5740 -5776 -4016 -18
2308 -18 3503 5310 5820 4665 1475 -2068 -4922 -5894 -4540 -2018 815 4190 5387 5310 3333 -163
2324 -163 -3453 -5271 -5145 -4259 -1170 1975 5083 5377 4720 1689 -1770 -4088 -6012 -5218 -2972 783
2340 783 3780 5696 5526 3534 138 -2704 -5252 -5943 -4549 -741 2142 4478 6276 4902 2367 -1387
2356 -1387 -4117 -5746 -5104 -2515 104 3756 4992 5545 3689 204 -2870 -4626 -5421 -4375 -1407 1522
2372 1522 4518 5737 4813 2448 -1156 -3823 -5760 -4718 -3343 148 3529 5177 5558 3509 687
2387 687 -2286 -4412 -4985 -4537 -2074 1167 4410 6070 4614 3101 -428 -3689 -5206 -5242 -3546 -505
2403 -505 3182 4947 5354 3965 1133 -1988 -4660 -5745 -4192 -2204 760 3880 5097 5288 3068 -214
2419 -214 -3100 -4719 -5222 -3539 -435 2330 4783 5892 3963 1585 -1207 -4225 -5300 -4792 -2129 543
2435 543 3658 5311 5130 3277 657 -3340 -5181 -5038 -4014 -882 2486 4159 5238 5076 2118 -1190
2451 -1190 -3959 -5218 -4911 -3235 918 3244 5179 4942 3537 649 -2548 -4480 -5654 -4081 -1767
2466 -1767 1314 4139 5438 4568 2418 -1105 -3746 -4533 -4825 -3188 -95 2800 4281 5417 3798 1284
2482 1284 -2200 -4989 -5336 -4191 -1858 902 3525 5543 4686 2417 -494 -3165 -4844 -4864 -2708 -450
2498 -450 1658 4630 5307 4342 1764 -1792 -3902 -5525 -4498 -1671 1105 3252 4830 4768 3431 109
2514 109 -2886 -4680 -5159 -3719 -1044 1469 4404 5212 4594 1643 -1941 -3681 -5302 -4312 -2613 938
2530 938 3308 4771 4810 3225 588 -2641 -4741 -4995 -3416 -1693 1948 3982 5135 4770 1831 -913
2546 -913 -3512 -5261 -4865 -2715 304 2685 4532 5399 3900 752 -1996 -4252 -5189 -4393 -1611 1004
2562 1004 3946 5022 4009 2438 -536 -2682 -4649 -4467 -2928 -975 2380 4617 4821 3384 1066
2577 1066 -1960 -4097 -4841 -3964 -1576 972 3252 4588 4618 2901 -62 -3002 -5032 -5124 -3413 -568
2593 -568 1993 4323 4673 3837 1657 -1204 -3614 -4676 -3994 -1946 586 3097 4913 4371 3301 462
2609 462 -2833 -4584 -4933 -3091 -1420 1716 3816 4921 3903 1749 -845 -2821 -4459 -4484 -3215 415
2625 415 2938 5060 4647 2695 664 -2113 -3948 -4485 -3933 -1401 1178 4201 5143 4260 1904 -782
2641 -782 -3166 -4195 -3873 -2907 -245 2413 4513 4636 2814 501 -1873 -3848 -4278 -3722 -1579 974
2657 974 3533 4305 4007 1832 -269 -2693 -4319 -4369 -2785 -425 2334 4311 4181 3441 1245 -2197 -3495
2674 -3495 -4706 -4240 -2006 809 3050 4188 4164 2113 445 -2557 -4159 -4001 -3269 -690 1326 3536
2690 3536 4246 3603 1534 -1357 -3039 -4222 -3825 -2351 20 2734 4029 4087 2620 701 -2322 -4125
2706 -4125 -4615 -3002 -769 1609 3191 3839 3435 1475 -905 -2852 -4112 -3888 -2747 112 2410 3877
2722 3877 4160 2831 750 -1558 -3763 -4175 -3912 -1112 1010 2801 3726 3900 1587 -5 -2684 -4103
2738 -4103 -3931 -2634 -620 1802 4206 3810 3127 1246 -1666 -3445 -4003 -3055 -1319 634 2913 4184
2754 4184 3637 2200 77 -2438 -3610 -3718 -3388 -882 1892 3846 3932 2969 1014 -1316 -3061 -4283
2770 -4283 -3645 -1926 1086 2188 4018 3748 2890 -128 -2004 -3651 -3569 -2673 -1018 1533 3010 3917 3274
2787 3274 1565 -766 -2623 -3592 -3827 -2572 82 3086 3526 3817 2614 167 -2256 -3229 -4049 -3855 -1305
2804 -1305 853 2990 3739 3377 1773 -575 -2526 -3306 -3861 -2387 -446 2272 3596 3694 2794 495 -1725
2821 -1725 -3059 -3926 -3399 -1317 657 2790 3698 4026 1858 -2 -2365 -3660 -3549 -2598 -675 1468
2837 1468 3861 3794 2905 1119 -1330 -2865 -3644 -3485 -1495 20 3059 3791 3656 2139 40 -1422 -3509
2854 -3509 -3464 -2608 -346 1746 3367 3500 3247 1544 -877 -2870 -3699 -3328 -1836 149 1723 3859 3321
2871 3321 2325 -324 -1649 -2899 -3821 -3185 -1233 849 2899 3698 3327 1537 -545 -2507 -3297 -3249 -1729
2888 -1729 -799 2058 3207 3383 2613 339 -761 -2929 -3443 -2809 -1647 546 2844 3529 3028 2145 -480
2905 -480 -1766 -3652 -3608 -2354 -565 1244 2473 3214 2723 849 -1102 -2463 -3477 -3301 -1366 572
2921 572 2361 3244 2857 1920 134 -1659 -3250 -3456 -2670 -156 1406 2934 3533 2435 1070 -306 -2525
2938 -2525 -3455 -3232 -1643 -143 2687 2986 3024 2438 516 -1276 -2476 -3336 -2395 -774 752 2658 2950
2955 2950 3481 1612 -557 -1720 -3457 -2738 -2141 -144 1137 3072 3573 2134 818 -1593 -2912 -3106
2971 -3106 -2984 -1325 969 2375 2786 3055 1266 -385 -2234 -3120 -2867 -1893 -258 1526 3132 2821 2320
2988 2320 1128 -949 -2486 -3049 -2549 -1346 189 2182 2716 3128 1888 -300 -1589 -3409 -3096 -1948
3004 -1948 58 1321 2255 2970 3002 1405 -1267 -2589 -2719 -2980 -1277 208 1334 3017 2872 2009 165
3021 165 -1195 -2638 -2620 -2231 -572 794 2276 2886 2656 568 -228 -2509 -3090 -2948 -2167 -87 1749
3038 1749 3200 2841 2025 528 -1276 -2521 -2543 -2680 -989 120 2447 3324 2314 1668 -46 -2066 -2296
3055 -2296 -3433 -1956 -881 1672 2733 3573 2453 183 -1398 -2263 -2974 -2435 -1036 855 2065 2374
3071 2374 2435 1642 298 -1220 -2575 -2718 -1727 -1126 1245 2447 2839 1574 923 -855 -2167 -3079 -2422
3088 -2422 -1406 501 1843 2250 2629 1678 413 -1292 -2896 -3156 -1881 -1102 1023 2444 2642 2129 857
3105 857 -789 -2329 -2976 -2418 -1222 265 1528 2364 2325 1560 238 -1246 -2379 -2810 -2192 -872 347
3122 347 1675 2668 2219 1499 77 -2095 -2652 -2694 -1494 203 1051 2408 2866 2434 915 -547 -2192
3139 -2192 -2792 -2015 -594 672 1997 2698 2398 1853 -112 -2288 -2137 -2605 -2011 -163 666 2428 3088
3156 3088 2217 945 -965 -2007 -2626 -2453 -785 316 1508 2923 2513 1445 152 -1035 -2339 -2438
3172 -2438 -2070 -487 1239 1680 2448 2129 859 -511 -2044 -2548 -2604 -1375 134 1653 2202 2002 1168
3189 1168 105 -1767 -1928 -2144 -1901 -240 170 1522 2412 1969 809 -235 -1990 -2540 -2138 -1171 126
3206 126 1847 2062 2360 1778 530 -1097 -2025 -2470 -2527 -366 335 1539 2311 1336 198 106 -1952 -1992 -2221
3225 -2221 -1771 -2 753 2088 2711 1698 254 -1032 -1760 -2167 -1987 -904 789 1790 2215 2230 1270
3242 1270 98 -1480 -2781 -1736 -1481 -199 876 2030 2619 1605 422 -681 -1678 -2065 -1633 -1113
3258 -1113 321 1749 2187 2197 897 -207 -1733 -1970 -2392 -1890 -846 1014 1409 2931 2542 931 -376
3275 -376 -1266 -2147 -1931 -1516 257 1150 1700 2224 1320 181 -967 -2156 -2254 -1779 -457 727 1748 2511
3293 2511 2266 687 12 -1310 -1805 -2483 -1512 142 1183 1731 2025 1666 613 -633 -1958 -2217 -1731
3310 -1731 -680 918 1442 2129 2585 1315 -36 -1436 -2237 -2329 -1465 -55 660 1733 2266 1166 643
3327 643 -475 -2356 -2111 -1307 -818 486 1477 1960 1750 1114 136 -919 -1794 -2120 -1696 38 496 1887
3345 1887 2125 1458 385 -322 -1045 -1948 -1904 -1100 68 1403 2112 1748 1066 110 -1357 -2313 -2237 -2118 -460
3364 -460 939 1558 2158 2321 958 -263 -1401 -1826 -1930 -1210 213 1216 1828 2137 1115 -16 -1092
3381 -1092 -1148 -1812 -1875 -259 654 1465 2241 1812 862 373 -1378 -2338 -1990 -1042 -425 1040 1749 2064 820
3400 820 414 -549 -1275 -2109 -835 -1199 173 1755 2349 2102 1114 99 -1267 -1682 -1764 -1314 -39 1041
3418 1041 1631 1933 1791 613 -502 -1135 -2263 -1610 -421 363 1157 2054 1970 1227 -185 -828 -1400 -1781
3436 -1781 -1384 -512 384 2147 1845 1680 828 -1125 -1124 -1707 -1554 -1098 214 952 1358 1858 1312 170 -1098
3455 -1098 -1811 -1924 -1573 -241 65 1349 1833 1699 988 -670 -1409 -1546 -1772 -1496 13 914 1868 1485
3473 1485 1180 669 -915 -1508 -1601 -1559 -806 770 1171 1766 2017 724 -259 -989 -1476 -1913 -1845 0 1107
3492 1107 1522 2128 1548 178 -574 -1221 -2239 -1266 -535 483 1056 2290 1818 1460 -498 -604 -1303 -1859
3510 -1859 -1330 -859 1191 1981 1778 1289 348 -903 -1202 -1816 -1358 -361 620 1290 1937 1858 1471 -331 -1214
3529 -1214 -1430 -1008 -993 -124 467 1441 1905 1655 1261 -444 -1230 -1390 -2135 -936 -344 1089 1602 1407 1385
3548 1385 234 -786 -1227 -1229 -1113 -440 350 1138 1321 1918 824 -153 -619 -2000 -1998 -1203 -44 991 1075
3567 1075 1642 1092 621 -793 -1658 -1875 -1740 -792 10 1695 1764 1489 659 64 -964 -1650 -1783 -1303 -285
3586 -285 988 1915 1561 1910 269 -739 -1318 -1720 -1602 -920 533 900 1653 914 752 -94 -711 -1510 -2014
3605 -2014 -1416 -38 602 936 1393 1534 144 -692 -1889 -2153 -1950 -1371 395 1368 1780 1169 1278 745
3623 745 -985 -1223 -1109 -861 -641 1183 1249 1622 1518 295 -258 -354 -1053 -1609 -1189 8 544 1909 1531
3642 1531 1176 284 -836 -1328 -1796 -867 -823 134 1138 2067 1723 597 -256 -1469 -1257 -918 -584 -493 1081
3661 1081 1223 1306 1155 90 -777 -1559 -1196 -1106 -604 365 1119 1778 1691 903 111 -1083 -1249 -1820 -834 -524
3681 -524 710 1677 1119 1034 499 9 -1287 -1295 -1100 -793 221 1149 1744 1373 1060 -61 -1372 -1131 -1876
3700 -1876 -1165 -372 436 1290 975 1255 716 -397 -1352 -1234 -1118 -550 330 881 1338 1911 1425 -115 -507
3719 -507 -1199 -2029 -1547 20 735 1304 2135 1013 478 -121 -1617 -1891 -1657 -1145 -153 784 1797 1244 1248
3738 1248 255 -199 -797 -1680 -1456 -338 243 1690 1614 2028 449 -227 -408 -1646 -1786 -603 -34 114
3756 114 1456 1606 810 382 -795 -933 -1419 -1237 -594 308 906 784 1642 760 329 -247 -1204 -1279 -802 -584
3776 -584 826 1256 1932 1841 325 -574 -1445 -1745 -2026 -395 86 994 1060 1491 871 177 -690 -846 -1369 -1326
3796 -1326 -352 328 1274 1440 1481 862 -229 -1126 -1298 -1627 -330 -48 1206 1393 1377 1049 485 -232 -1189
3815 -1189 -1013 -1260 -372 558 1235 1557 1299 171 -397 -721 -1362 -1797 -678 -175 627 876 1356 712 32
3834 32 -688 -1095 -1518 -1477 -260 111 859 1668 1325 89 -193 -900 -1146 -1332 -711 -391 443 1137 1519 1343
3854 1343 758 -308 -776 -1600 -1288 -981 605 710 1488 833 647 -222 -679 -904 -1226 -600 -489 647 1103
3873 1103 996 1321 47 -468 -1212 -1280 -1123 -1191 -19 580 967 934 1616 496 -445 -1654 -1717 -812 -145 734
3893 734 1060 1335 1133 377 -495 -781 -1565 -1242 -1351 163 275 1682 1485 1007 635 74 -927 -1092 -744
3912 -744 -569 198 849 1764 1656 405 127 -1058 -1531 -1295 -900 -354 317 1207 1183 983 904 -146 -1127 -1356
3932 -1356 -952 -1085 517 709 1126 889 748 265 -841 -1311 -1688 -865 -148 802 1180 1582 1016 413 -387
3951 -387 -702 -1264 -851 -1087 106 677 1258 1653 963 448 -1156 -1640 -1774 -848 -163 415 1293 1054 1039 261
3971 261 -287 -739 -938 -727 -774 -145 559 789 1507 733 -265 -764 -1198 -1633 -694 -641 -248 1516 1248 1195 779
3992 779 -749 -1021 -911 -965 -409 -563 110 1088 1408 1341 460 -252 -950 -1467 -1087 -447 189 516 1174 1017
4012 1017 798 -128 -924 -1304 -920 -1191 -468 315 1054 1480 1019 651 -270 -909 -1558 -565 -1039 421 1083
4031 1083 1573 782 731 -277 -1089 -1259 -1655 -1016 -43 113 924 1637 1120 512 -424 -296 -1007 -1187 -947 -558
4051 -558 941 725 973 984 221 -563 -1235 -1424 -1009 -484 483 1050 816 642 725 258 -1033 -1550 -1120 -997
4071 -997 -391 359 996 660 575 156 -570 -941 -1473 -950 -727 116 835 1520 939 368 203 -740 -1022 -1365
4091 -1365 -676 129 465 1033 983 1012 177 -461 -618 -1494 -1076 -543 195 1544 1509 1200 1157 159 -1161 -1454
4111 -1454 -1170 -994 -330 514 1074 1354 1224 511 283 -934 -875 -633 -880 110 773 1277 1842 801 254
4130 254 -115 -1057 -922 -759 -295 336 1071 1639 1024 78 -194 -1010 -1310 -1115 -1022 -65 411 806 1262 703
4150 703 374 106 -1160 -1058 -676 -485 261 1032 937 1167 243 14 -707 -914 -1190 -697 -471 261 939 900
4170 900 1094 -8 -279 -882 -1392 -1334 -577 156 873 1049 1893 1090 -707 -681 -1434 -1110 -1162 -476 47 635
4190 635 1070 977 413 34 -627 -854 -935 -461 392 734 1253 940 325 -205 -591 -918 -819 -605 -414 300 1002
4211 1002 1370 898 36 -301 -607 -629 -608 -603 -275 791 1118 988 652 -139 -579 -1199 -977 -779 -237 85 1350
4232 1350 847 767 591 -520 -594 -1348 -808 -379 -93 453 397 1754 765 300 -40 -1028 -1295 -965 -274 717
4252 717 768 895 1073 415 339 -711 -1231 -882 -824 156 979 621 1055 791 284 -512 -808 -834 -994 -341 411
4273 411 879 1314 850 958 110 -493 -794 -772 -372 -706 -298 825 897 1027 158 -450 -647 -909 -753 -585
4293 -585 -194 578 1203 827 358 141 -710 -626 -776 -950 -30 18 739 849 938 619 -880 -668 -567 -1025 -1151
4314 -1151 129 323 475 874 909 192 -473 -1088 -958 -143 49 -271 330 1036 643 355 -106 -1077 -1264 -1119
4334 -1119 -1167 -434 307 1077 887 1045 38 -454 -959 -846 -840 -730 569 551 1003 644 603 36 -124 -998 -1253
4355 -1253 -468 -46 348 736 1016 655 464 69 -332 -859 -798 -581 42 458 428 724 754 59 -772 -1018 -1725
4376 -1725 -1023 341 117 440 948 1187 442 116 -338 -506 -1279 -707 93 438 800 826 537 28 -225 -963
4396 -963 -991 -895 -88 277 650 743 1231 694 -207 -266 -446 -1223 -1067 76 296 737 558 735 517 48 -1023
4417 -1023 -1018 -876 173 202 271 325 1007 471 140 -409 -823 -895 -618 -432 561 698 572 442 142 -6 -923
4438 -923 -1236 -562 -721 -154 175 587 656 844 117 -742 -595 -307 -508 -241 650 564 1024 508 -81 -839 -220
4459 -220 -1183 -1084 -688 -173 116 414 232 709 -66 -612 -658 -963 -637 -677 52 761 438 801 429 297 -686
4480 -686 -1288 -694 -384 -151 363 524 868 319 207 -343 -783 -433 -644 212 -132 1020 732 787 -34 -317
4500 -317 -584 -688 -312 -118 -169 569 806 807 597 734 -350 -386 -392 -1209 204 -35 946 977 759 640 602 -311
4522 -311 -480 -768 -322 -33 872 539 669 364 298 -55 -546 -428 -652 -100 160 580 289 640 624 94 -356
4543 -356 132 -722 -742 -267 103 482 852 757 475 21 -307 -637 -913 -5 113 411 877 510 448 -38 261
4564 261 -985 -229 -281 -482 123 525 692 413 859 -156 -162 -443 -398 -266 105 834 855 541 598 283 -400
4585 -400 -747 -683 -642 -43 103 847 258 803 678 30 -671 -509 -777 -423 -179 252 642 596 321 802 -85
4606 -85 -282 -81 -649 -1 710 427 772 590 464 -350 -428 -1027 -748 -549 14 719 511 977 1083 737 38
4627 38 -585 -895 181 -96 -169 504 667 1152 242 -150 -858 -992 -545 -1094 -209 -191 469 896 529 648 -436
4648 -436 -265 -1090 -504 -549 -179 438 440 933 -121 449 212 -271 -742 -566 -328 508 436 946 1046 465 -319
4669 -319 -320 -186 -531 -174 160 582 487 833 258 444 138 -186 -484 -481 -310 266 525 336 -63 410 -1 -722
4691 -722 -1005 -559 -334 -827 421 735 637 441 807 53 -519 -970 -1034 -106 41 530 749 369 388 49 -347
4712 -347 -587 -809 -388 -612 315 508 901 880 -95 -497 -389 -719 -130 -884 111 702 434 121 670 347
4732 347 -598 3 -407 -415 -442 -139 385 201 661 608 -12 -410 -607 -911 -488 -608 19 311 625 464 -100
4753 -100 -484 -813 -312 -353 -28 -21 163 1001 557 193 -52 -419 -846 -529 -114 198 167 544 673 661 -141 290
4775 290 -618 -164 -186 -527 529 144 748 133 29 -314 -615 -232 -316 147 -89 -258 199 307 -95 313
4795 313 -12 -379 -616 -764 -229 233 273 260 442 346 -96 -797 -405 -747 -544 -64 -321 519 451 307 25
4816 25 -211 -688 -629 -692 -422 -867 474 415 813 377 0 45 -287 -498 -519 -547 184 372 696 169 -144 -379
4838 -379 226 -402 -1101 -298 -444 610 335 352 159 -214 -441 -237 -550 -473 73 -216 187 532 -30 -327
4858 -327 94 -279 -321 -451 -954 -510 107 45 1045 96 950 9 187 -409 -869 -509 -256 -68 496 -77
4878 -77 179 -6 -101 106 -705 -176 241 324 335 425 340 -26 -357 -280 -261 -193 -457 264 683 806 816 766 211 -491
4902 -491 -561 -742 -443 208 475 508 442 505 -56 75 -711 -841 -310 -412 -5 56 651 1119 247 -155 74 -549
4924 -549 -521 -871 -158 -562 483 494 436 34 -196 10 -725 -135 -432 -270 -113 602 70 -241 -9 117 -700
4945 -700 -121 -796 162 138 399 459 632 -168 383 -36 -529 -480 -559 -389 114 533 497 503 406 186 -170 -665 3
4968 3 -309 -52 -30 396 333 -21 50 -282 -929 -583 -792 -161 -101 316 620 198 442 -224 -297 -1087 -625 388
4990 388 -174 374 -67 718 242 166 88 143 -541 141 -44 -133 633 156 476 450 195 -627 67 -585 -201 381
5012 381 575 617 397 354 103 -563 -504 -359 -273 -459 554 586 554 321 178 -51 -121 -1121 -58 -208 171
5033 171 249 354 367 592 475 -85 -469 -517 0 -320 270 258 10 24 188 -400 -462 -203 -701 -436 -576 -142
5055 -142 374 578 199 254 -233 -521 -136 -815 -567 141 -93 151 191 520 65 86 -636 285 -180 -351 378
5076 378 -100 351 166 132 391 93 -247 -437 -588 5 320 305 200 642 51 -602 -618 -221 -156 -168 425 23
5098 23 423 666 34 -369 -159 -271 -642 -924 -29 -70 171 383 -57 -107 -549 -205 -534 -586 -159 -93 -252 20
5120 20 482 680 267 -74 -802 -328 -746 -155 -343 65 112 781 480 -415 -220 -301 -554 -280 -158 -361 -47
5141 -47 467 -180 -99 -477 -277 -790 -265 -187 169 141 204 878 205 390 -196 -66 -403 -592 102 -215 583 478
5163 478 523 280 -126 -281 -432 -779 -174 476 449 498 653 336 -764 -313 -470 -192 0 48 -77 427 452
5184 452 -124 80 -80 -306 -261 -595 74 411 220 240 448 98 215 -375 -201 -407 -72 -479 -412 261 462
5205 462 566 18 -451 244 -543 -216 -166 -268 -334 889 102 262 -9 -502 -61 -1166 -572 -4 94 757
5225 757 248 631 127 121 -708 -345 -381 -211 -171 322 515 693 805 95 -744 -538 -355 49 -19 -83 120 579
5247 579 645 426 641 -559 -595 -293 -456 374 495 434 504 -53 231 -305 -201 -664 -132 -187 -144 140 182 250
5269 250 -296 -675 -99 -498 -498 -370 -520 -19 -93 665 -111 235 -69 -513 -428 -595 61 271 233 -326 622 -224
5291 -224 304 -342 -285 -159 -122 -385 -22 186 598 249 703 40 -292 -376 202 26 -473 370 935 865 -80
5312 -80 -67 199 -35 5 -564 -250 -334 -299 27 -187 72 -274 -432 -589 381 -438 -89 -77 978 292 320 269
5334 269 305 -370 -135 -456 -64 225 526 441 459 363 624 -91 -329 -177 144 229 73 -112 129 224 24 73
5356 73 -237 -88 -372 -553 551 -295 378 542 405 239 -137 -288 -223 -125 -548 151 156 -144 470 -194 -523
5377 -523 -803 118 -122 -1032 -609 -170 676 43 141 282 -790 -551 128 -164 -426 -316 222 832 -278 32
5397 32 537 -771 -446 73 -39 480 78 273 3 57 178 -6 -470 -513 209 113 -329 -169 701 214 42
5418 42 -275 81 -125 -241 70 -306 433 916 677 613 347 -156 -388 -615 -557 -283 192 127 187 291 64 174
5440 174 -70 -642 -393 122 -1 -328 103 808 -8 473 -483 -338 -345 -328 -429 23 -272 418 415 598 -199 -499
5462 -499 -1212 138 -248 -278 185 531 651 1016 479 -279 -370 -451 -394 -358 -236 388 139 139 281 284 -188 -407 -81
5485 -81 -568 -381 -174 502 262 808 -168 -36 -254 -163 -430 21 504 397 290 304 -80 93 -276 -487 -493 -566
5507 -566 -444 -135 -33 -254 25 -269 -179 -506 -357 -161 -659 -187 -57 524 843 626 116 219 -345 -368 -196
5528 -196 -21 -199 209 431 91 553 291 -215 -126 -774 -486 -208 457 58 633 112 95 -341 295 -855
5548 -855 -368 -88 -211 724 -123 532 169 -321 278 149 -316 -647 140 -614 365 780 9 524 -257 139
5568 139 -375 -279 -87 131 180 839 478 237 293 203 -356 -720 -436 -198 156 352 20 116 684 226 -429 -28
5590 -28 -902 -272 -355 -41 533 524 201 346 279 -178 -482 -374 17 65 2 -7 545 542 460 105 -342 -356 -603 -30
5614 -30 118 266 196 361 -184 -358 -379 -182 -306 -157 105 284 260 231 706 289 -128 -58 -223 -241 -831 264
5636 264 -12 153 647 180 -204 -389 -141 -219 -469 197 -57 196 798 216 -435 295 -117 -298 -542 47
5656 47 71 515 726 651 413 67 -257 -258 -793 -347 419 306 386 441 357 706 -246 -1043 -207 -377 173 -57 -339
5679 -339 247 -224 75 228 72 -379 -424 -387 -126 -157 58 784 550 162 -35 -124 -255 -105 -6 30 494 128
5701 128 623 721 -272 -46 -65 -859 -486 -604 303 318 777 560 17 315 432 -547 -942 -57 -215 48 349
5722 349 533 434 143 -259 -642 -521 73 306 -403 114 -367 991 266 -50 -176 -291 -456 -840 94 -121
5742 -121 205 637 -132 -56 -124 -568 -562 -250 147 169 32 761 249 149 54 177 -205 -337 -78 -573 -172 639
5764 639 371 584 348 231 31 -419 -590 -57 -268 443 444 29 148 230 -113 -170 -308 66 411 -39 173
5785 173 549 474 228 -91 -123 -505 -447 -677 -76 498 346 412 307 214 199 -540 -7 -239 183 -35 231 524
5807 524 615 1009 -373 -471 -360 -37 7 -88 65 421 507 390 96 576 -26 -589 -399 -22 342 287 427 249
5829 249 113 125 296 -491 -72 -222 354 411 329 248 505 444 460 -721 21 -402 44 133 -105 225 334 274
5851 274 -60 44 -501 -123 -610 -186 -9 -278 304 39 -64 -406 -359 -356 211 155 -13 639 299 238 268 329
5873 329 -264 -347 -611 -185 -336 204 547 210 -98 410 -410 40 -241 -222 3 -161 -315 447 542 433 175
5894 175 -438 -53 -17 -269 -46 13 280 337 404 391 -277 68 2 -131 479 147 195 627 350 -293 194 152 -493
5917 -493 -253 -649 -130 30 259 603 11 204 -184 134 -395 -403 -53 -156 631 -131 -249 232 525 187 84
5938 84 -184 143 -376 -153 -132 357 396 232 -2 148 -547 -806 -214 4 -25 -131 450 446 345 274 -151 -113 45
5961 45 -843 -250 -358 33 226 136 89 -342 377 -173 -287 -134 -1 125 454 132 71 -283 356 -838 -260
5982 -260 -584 359 42 -70 584 205 -424 -416 -253 -28 -386 -128 209 56 425 494 -248 -288 -67 -201 -313
6003 -313 -317 296 -16 182 417 -494 115 349 -270 -536 -308 -209 -473 287 -170 585 621 -173 -104 -152 185 -26
6025 -26 -56 108 -37 -194 445 6 175 -367 -198 103 166 274 394 -44 35 248 436 -175 -69 25 -278 124
6047 124 -4 775 412 631 394 263 -145 -608 -117 -224 44 248 -73 320 38 201 307 -52 -394 74
6067 74 -478 -326 437 563 717 121 97 -217 83 -247 -366 -555 -274 319 389 -63 -4 -261 -444 -79 -516
6088 -516 0 288 80 763 105 28 -224 -291 -70 -127 -412 116 128 81 258 327 245 -137 191 -329 -492 -84
6110 -84 -147 63 133 422 95 -431 -27 -264 -697 -406 -369 -28 35 -192 128 -4 -119 -180 232 -585 -138 -135 152
6133 152 226 -46 -409 182 -281 -383 -81 -5 138 -191 479 -128 696 -167 -137 -725 -226 21 -332 -63 -84
6154 -84 697 -117 589 139 -196 -561 -105 256 -103 -175 -5 21 -60 7 489 -109 -95 143 203 -349 194 258 -3
6177 -3 506 109 268 112 -217 -212 -450 -57 -58 281 189 -51 299 -189 130 -547 -434 -418 263 -28 393 139 82
6200 82 71 -62 -235 251 -703 -197 289 -136 558 386 387 70 -323 -144 -56 -146 106 191 392 186 160 176 136
6223 136 -659 -169 92 -373 487 429 383 -51 -159 -212 -279 -127 -123 -118 241 205 765 63 -69 227 -433 -412 -296
6246 -296 -744 -404 -41 -10 306 67 108 -258 -196 -157 -531 -284 400 279 30 69 97 -463 -66 -460 -354 -81
6268 -81 -245 151 1005 88 814 105 -47 -298 -631 -490 -19 -269 20 238 -315 -132 -228 -92 -204 -128 -380
6289 -380 225 -156 69 456 259 40 -4 -245 64 -433 -62 -118 48 -13 435 -11 -194 -141 -400 -26 -200
6310 -200 70 -293 22 625 492 207 352 -148 -33 -216 -72 144 543 60 469 407 -37 -404 277 -39
6330 -39 -332 -212 -2 -12 774 291 477 70 64 -417 -256 -164 91 -13 171 265 192 669 -55 -165 -320 -362 -57
6353 -57 -106 -100 180 72 -27 219 -136 -485 247 -237 187 214 270 24 193 -273 50 -210 104 334 -184 -217 261
6376 261 379 -26 158 518 197 -163 -18 310 -220 -361 159 535 -102 404 -332 -404 -407 22 -318 -93 190
6397 190 506 118 224 166 -187 -178 247 205 -75 67 72 439 202 360 241 222 177 -55 -562 94 466 223 478
6420 478 34 19 21 -168 -480 42 -50 123 50 589 242 168 -433 -55 -223 -237 -93 -165 57 118 -39 471 -257
6443 -257 131 -67 -262 -12 -642 113 492 268 259 -189 208 -39 -197 158 -603 176 -208 -278 235 -145 -55
6464 -55 -438 125 -353 122 -52 -607 -13 568 -90 -163 -349 -286 -370 -611 -512 -229 -135 119 200 -239 40 -427
6486 -427 4 330 54 -683 304 103 214 -55 506 160 -6 78 -442 -491 -120 -249 -348 238 95 -99 -152
6507 -152 -159 297 -288 -342 373 -46 479 49 62 250 126 -312 -357 -466 259 -174 651 247 316 -58 -194 -152
6529 -152 -414 -110 -310 251 492 168 -47 494 235 383 -262 -143 -411 118 19 -251 -206 114 230 160 -402
6550 -402 -393 -322 67 -245 -254 465 587 844 -50 299 -184 -321 -12 -572 -41 -67 70 291 90 373 217 62
6572 62 195 -636 -190 232 -319 683 -282 -265 22 -119 -227 -283 128 -196 -369 578 -305 300 278 -415 -13
6593 -13 -234 -65 -587 -201 190 -49 179 -650 330 449 -37 -212 -88 168 11 134 -272 425 323 209
6613 209 50 -493 -402 -427 -138 536 367 179 359 227 -2 -123 -206 145 -288 -319 407 279 95 52 -254 105
6635 105 -234 -667 -295 -233 -104 -76 31 -265 -147 -226 279 -370 132 213 191 148 25 -82 495 -25 -288 40
6657 40 -201 171 82 50 -250 791 243 -18 178 33 -58 -285 -775 124 147 609 814 247 -448 -291 259
6678 259 189 -190 -117 423 397 365 -260 -10 27 -353 -388 71 -134 47 196 -111 267 -215 -28 -107 -430 334
6700 334 430 274 -196 324 158 585 -577 -717 -640 -416 -420 42 173 -145 141 -257 353 120 16 -406 -402 -266
6722 -266 231 303 322 31 -203 240 206 -418 -437 242 289 -177 -205 170 583 180 173 58 -214 -606 21 -584 24
6745 24 82 135 -53 490 -304 -80 278 297 176 190 432 5 526 206 282 -188 408 -27 -150 -247 41 -70
6767 -70 -224 -158 -559 54 -109 411 -415 -371 -130 -44 93 107 663 -25 434 -57 -311 -276 87 -393 96 185
6789 185 661 209 57 -119 -222 -243 186 3 223 260 -73 696 676 -30 -128 -566 -336 -86 111 372 110
6810 110 465 -104 306 -476 -112 -349 21 139 60 10 438 240 38 157 -163 -380 51 -125 -460 319 600
6831 600 35 379 346 380 431 225 162 -415 70 375 258 417 193 -322 -99 -243 -499 -451 -338 698 303
6852 303 -104 446 -361 341 -185 -358 -173 73 269 677 -10 519 789 -55 -47 -418 -373 78 -323 -238 -300 595
6874 595 -276 233 156 12 -392 -103 -321 202 242 218 237 -24 -185 36 -104 -543 -766 185 278 247 111 -96
6896 -96 410 -94 161 -146 -109 291 -536 -6 161 18 139 132 280 -403 -97 -120 -300 235 31 551 -329 180
6918 180 -268 -10 0 -185 144 -197 -107 -6 762 246 -86 -19 -623 -654 -250 247 -365 996 2 0 -15 -153
6940 -153 108 -68 -753 -311 209 108 256 82 275 -113 80 -234 -608 22 -517 343 -59 -156 361 384 -88
6961 -88 37 -864 -235 -21 -215 188 127 264 208 -133 -183 -46 101 26 -170 69 -2 279 -123 183 146 -214
6983 -214 -134 324 245 -316 283 -232 280 448 272 207 25 -291 -9 -312 -227 892 -38 -59 -496 111 3
7004 3 36 -235 -52 -265 303 140 121 333 344 -334 -270 -28 -297 -324 -434 151 -271 107 -121 -26 -4 8 -131
7027 -131 -336 -32 413 259 181 -137 -31 24 382 -234 -436 61 40 235 -71 76 613 265 232 -274 -512
7048 -512 55 -477 -122 -302 40 161 -134 515 -262 -439 10 314 -781 -84 268 181 -306 337 -76 -382
7068 -382 234 -406 37 -285 -276 -314 721 -244 -499 -90 -51 -111 -370 -146 325 174 51 -54 270 -126 291
7089 291 34 -408 -408 -164 217 401 -188 163 252 -624 -197 -235 -89 -792 173 124 133 68 157 -158 -236 109 -88
7112 -88 -652 179 294 -363 -110 -3 114 -310 -489 -497 -467 -247 -27 -102 -360 313 147 -168 262 -449 132 -190
7134 -190 364 -376 -31 456 -57 610 -620 72 335 -13 -438 -213 56 253 -330 550 502 140 -513 -749
7154 -749 -148 -351 465 387 -169 138 -237 -143 123 -653 59 -44 315 75 160 433 203 135 -78 -173 281 57
7176 57 -633 -26 38 282 281 618 211 -276 -183 -61 175 -308 -358 -230 72 -7 -27 -260 37 20 -68 -237 -89
7199 -89 -435 200 -541 255 78 103 -308 -525 -466 -334 450 156 617 -101 473 -182 -235 -337 -553 -191 83
7220 83 351 143 321 515 63 -6 -125 -105 237 -203 258 -20 -154 -129 467 -392 -218 -120 186 -362 247 544
7242 544 -42 -74 391 -16 -151 -701 -326 -497 537 569 299 80 102 -256 -188 -245 373 141 -478 21 448
7263 448 523 -213 -231 -218 -356 -92 -482 30 211 -2 -2 243 -115 -178 -254 -89 -219 209 -401 -492 -61 -471 404
7286 404 104 286 -11 -124 -327 -418 61 -71 162 -102 124 402 -60 290 -93 -38 -158 -221 -193 -481 -218
7307 -218 106 65 294 -387 -154 -283 -144 112 -235 126 610 -75 60 -58 -83 -406 -55 -27 -173 103 566
7328 566 450 -214 -150 141 28 -140 -170 -280 185 -303 29 -304 216 316 17 -417 8 -382 -44 56 490
7349 490 135 -412 150 -12 233 -242 81 -86 259 -6 148 -371 -101 -76 -22 -270 -353 268 -778 -241 130
7370 130 248 -151 14 230 -157 -4 8 69 -330 128 316 223 172 -555 326 84 -190 -70 536 412 -47
7391 -47 688 429 64 142 -81 -251 -181 25 37 341 42 -85 289 317 -437 -268 -471 -39 299 -375 -188 -68
7413 -68 230 433 43 -287 -448 -22 -197 298 492 -54 197 493 209 -232 -520 -477 -360 121 -114 167 654
7434 654 -163 65 32 1 -288 75 -114 102 304 248 89 88 389 -80 47 -282 -231 240 -299 -33 553 187
7456 187 -107 372 -105 -76 23 -130 112 92 35 566 241 -167 -358 -24 -290 -274 -60 -135 -358 306 32 -639
7478 -639 183 -69 -485 -229 -36 -19 -116 -194 66 271 -156 -544 -43 34 -358 424 157 -274 -191 -19 35 489
7500 489 -390 -652 55 -166 -10 -48 625 -235 76 547 329 -213 -67 68 572 64 426 -116 84 154 -79
7521 -79 90 418 1 495 -48 231 -163 116 211 -55 -25 147 326 -170 -180 -74 642 475 -188 -8 -333
7542 -333 161 157 -250 216 19 314 203 588 576 688 -93 126 325 -54 65 -111 -99 491 7 199 -566
7563 -566 -381 498 257 133 -20 -433 543 281 -49 299 -22 -270 -457 70 72 263 205 -89 589 115 -35
7584 -35 262 -192 -342 -190 182 62 526 695 868 48 361 -242 50 -336 -48 -72 188 83 -22 311 332
7605 332 4 7 -348 -366 155 430 -74 25 165 -211 46 -417 -285 -391 -268 -131 344 90 -155 113 48 68
7627 68 -165 -45 112 -34 248 128 503 -23 -665 178 -18 -512 335 -205 276 -76 284 15 -204 502
7647 502 392 60 26 144 183 316 244 157 -60 -165 283 50 -157 -94 -515 209 121 -98 -192 140 -119 -110 -416
7670 -416 378 -338 -544 98 12 154 501 185 469 -291 72 -214 -145 268 274 105 -120 71 176 540 -287
7691 -287 -29 -352 -274 -83 328 171 -485 -162 146 -61 -116 20 490 52 -144 133 108 226 71 -188 -84
7712 -84 -7 -310 344 -90 -129 88 545 -338 41 -342 19 -10 410 -407 41 524 255 60 259 201 291 -205
7734 -205 -44 -1 -349 550 -49 229 10 -193 -411 86 250 -483 -156 -112 -614 -300 81 -115 432 134 -640
7755 -640 237 68 427 -138 -51 195 169 210 403 155 -244 -69 79 -155 80 226 253 407 -162 269 192 2
7777 2 28 -75 173 -23 301 613 50 -135 58 -20 -392 -242 -69 84 -601 313 78 90 -441 -219 -204 186
7799 186 76 105 -35 89 -184 -176 148 -87 116 47 20 -58 326 416 58 3 -184 -151 110 -321 -216 -322 -590
7822 -590 111 -240 267 331 -376 -358 -449 10 -131 -380 246 -230 102 335 -504 63 -171 -127 508 -419 115
7843 115 74 -498 95 75 343 -89 -426 -339 118 -633 152 485 362 26 161 42 -548 -21 -156 374 -516
7864 -516 -151 -114 -167 3 417 -67 -39 -250 -476 -501 318 44 292 -4 -163 164 86 -178 -333 54 -496 383
7886 383 -101 -410 187 104 -202 -81 269 -298 574 319 102 -70 591 520 -278 342 -48 -151 13 -337 329
7907 329 -188 -5 234 -412 -419 -114 -234 -499 -792 20 251 38 150 401 210 -223 -363 -130 53 121 -120
7928 -120 -163 -120 -100 262 -57 -267 -221 -274 -255 110 403 105 436 724 26 -222 -76 52 -532 -55 267 336
7950 336 369 30 -508 -287 -407 -502 -73 312 595 238 -225 81 262 664 -296 50 -441 57 114 -283 314
7971 314 -523 237 221 -352 -152 -443 524 246 37 -223 71 -214 565 253 -554 -235 -43 -341 -141 118
7991 118 334 47 -399 481 -291 -205 -482 210 -410 50 301 -592 -281 -421 -439 -384 -356 -261 -631 -106 186 300
8013 300 -225 315 -323 277 -349 -479 -585 -270 -5 481 201 25 -152 -210 -138 -231 -29 25 -405 -65 -474
8034 -474 -413 -243 112 326 83 -208 -280 638 -151 67 149 -33 366 -479 -142 269 -269 -192 277 -150 502
8055 502 422 -92 399 169 441 -124 -245 -205 140 713 231 -225 37 60 226 -42 52 16 262 -148 -108 -290
8077 -290 180 303 -277 -236 -166 21 -45 -158 -415 -279 41 689 142 -376 -245 -89 115 -101 -66 31 391 -20
8099 -20 60 357 95 -542 -95 -443 -157 41 244 203 110 -53 -372 200 -408 431 17 -658 86 128 261 150
8121 150 -286 335 -278 -708 -635 163 9 182 485 -188 346 -110 -52 2 378 6 -309 216 9 242 -471
8142 -471 136 417 -422 -135 -233 165 114 210 -53 439 -378 46 53 157 -152 -203 -89 195 169 155 -83 309 201
8165 201 4 -155 159 179 -49 -45 -343 57 376 -336 457 418 -193 495 374 -360 449 421 73 -181 -420 -494
8187 -494 321 -2 465 -24
8191b4
##END NTUPLES=NMR FID
##END=
