##TITLE=1H_DE-44EA3_D2O
 D2O
 8 sc, 
 12.7.2024
##JCAMPDX= 6.0         $$ Bruker NMR JCAMP-DX V2.0
##DATA TYPE= NMR FID
##DATA CLASS= NTUPLES
##ORIGIN= UXNMR, Bruker Analytische Messtechnik GmbH
##OWNER= root
$$ XWIN-NMR		Version 3.5
$$ Fri Jul 12 14:25:58 2024 Russian Standard Time (UT+4h)  she@DPX200
##.OBSERVE FREQUENCY= 200.1314
##.OBSERVE NUCLEUS= ^1H
##.DELAY= (6, 6)
##.ACQUISITION MODE= SIMULTANEOUS
##.ACQUISITION SCHEME= undefined
##.AVERAGES= 8
##.DIGITISER RES= 18
##SPECTROMETER/DATA SYSTEM= spect
##.PULSE SEQUENCE= zg30
##.SOLVENT NAME= CDCl3
##.SHIFT REFERENCE= (INTERNAL, CDCl3, 0, 15.7039)
##AUDIT TRAIL= $$ (NUMBER, WHEN, WHO, WHERE, WHAT)
$$ ##TITLE= Audit trail, XWIN-NMR		Version 3.5
$$ ##JCAMPDX= 5.01
$$ ##ORIGIN= Bruker BioSpin GmbH
$$ ##OWNER= she
$$ F:/spectra/data/she/nmr/H-F/1/audita.txt
$$ ##AUDIT TRAIL=  $$ (NUMBER, WHEN, WHO, WHERE, WHAT)
(   1,<2024-07-12 14:24:48.23 +0400>,<she>,<DPX200>,
      <created by zg, POWCHK disabled, PULCHK disabled
       configuration hash MD5:
       00 E9 B6 7A A2 85 ED C7 34 08 36 98 17 FE 4E 26
       data hash MD5: 16K
       49 61 8D D3 CE 82 0B 2C EA 81 75 C3 70 68 51 3D>)
$$ ##END=
$$ 
$$ hash MD5
$$ B2 20 80 97 34 96 C4 1F 47 0F F1 A3 B4 18 94 DE
##$RELAX= 
##$RELAX= 
##$RELAX= 
##$RELAX= 
##$RELAX= 
##$RELAX= 
$$ Bruker specific parameters
$$ --------------------------
##$DU= <F:/spectra>
##$EXPNO= 1
##$NAME= <H-F>
##$PROCNO= 1
##$TYPE= <nmr>
##$USER= <she>
##$AMP= (0..31)
100 100 100 100 100 100 100 100 100 100 100 100 100 100 100 100 100 100 
100 100 100 100 100 100 100 100 100 100 100 100 100 100 
##$AQSEQ= 0
##$AQ_mod= 1
##$AUNM= <au_zg>
##$AUTOPOS= <>
##$BF1= 200.13
##$BF2= 200.13
##$BF3= 200.13
##$BF4= 200.13
##$BF5= 200.13
##$BF6= 200.13
##$BF7= 200.13
##$BF8= 200.13
##$BYTORDA= 1
##$CFDGTYP= 0
##$CFRGTYP= 5
##$CHEMSTR= <none>
##$CNST= (0..31)
1 1 145 1 1 1 1 1 1 1 1 1 1 1 1 1 1 1 1 1 1 1 1 1 1 1 1 1 1 1 1 1 
##$CPDPRG= <>
##$CPDPRG1= <>
##$CPDPRG2= <>
##$CPDPRG3= <>
##$CPDPRG4= <mlev>
##$CPDPRG5= <mlev>
##$CPDPRG6= <mlev>
##$CPDPRG7= <mlev>
##$CPDPRG8= <mlev>
##$CPDPRGB= <>
##$CPDPRGT= <>
##$D= (0..31)
0 1.2 0 0 0 0 0 0 0 0.06 0 0.03 0 0 0 0 0.0002 0 0 0 0 0 0 0 0 0 0 0 0 
0 0 0 
##$DATE= 1720779887
##$DBL= (0..7)
120 120 120 120 120 120 120 120 
##$DBP= (0..7)
150 150 150 150 150 150 150 150 
##$DBP07= 0
##$DBPNAM0= <>
##$DBPNAM1= <>
##$DBPNAM2= <>
##$DBPNAM3= <>
##$DBPNAM4= <>
##$DBPNAM5= <>
##$DBPNAM6= <>
##$DBPNAM7= <>
##$DBPOAL= (0..7)
0.5 0.5 0.5 0.5 0.5 0.5 0.5 0.5 
##$DBPOFFS= (0..7)
0 0 0 0 0 0 0 0 
##$DE= 6
##$DECBNUC= <off>
##$DECIM= 24
##$DECNUC= <off>
##$DECSTAT= 4
##$DIGMOD= 1
##$DIGTYP= 9
##$DL= (0..7)
0 120 120 120 120 120 120 120 
##$DP= (0..7)
150 150 150 150 150 150 150 150 
##$DP07= 0
##$DPNAME0= <>
##$DPNAME1= <>
##$DPNAME2= <>
##$DPNAME3= <>
##$DPNAME4= <>
##$DPNAME5= <>
##$DPNAME6= <>
##$DPNAME7= <>
##$DPOAL= (0..7)
0.5 0.5 0.5 0.5 0.5 0.5 0.5 0.5 
##$DPOFFS= (0..7)
0 0 0 0 0 0 0 0 
##$DQDMODE= 0
##$DR= 18
##$DS= 0
##$DSLIST= <SSSSSSSSSSSSSSS>
$$ [...]
##$SUBNAM2= <"">
##$SUBNAM3= <"">
##$SUBNAM4= <"">
##$SUBNAM5= <"">
##$SUBNAM6= <"">
##$SUBNAM7= <"">
##$SUBNAM8= <"">
##$SUBNAM9= <"">
##$SW= 24.0689651099613
##$SWIBOX= (0..15)
0 0 2 0 0 0 0 0 0 0 0 0 0 0 0 0 
##$SW_h= 4816.95568400771
##$TD= 16384
##$TD0= 1
##$TE= 0
##$TE2= 300
##$TE3= 300
##$TEG= 300
##$TL= (0..7)
0 120 120 120 120 120 120 120 
##$TP= (0..7)
150 150 150 150 150 150 150 150 
##$TP07= 0
##$TPNAME0= <>
##$TPNAME1= <>
##$TPNAME2= <>
##$TPNAME3= <>
##$TPNAME4= <>
##$TPNAME5= <>
##$TPNAME6= <>
##$TPNAME7= <>
##$TPOAL= (0..7)
0.5 0.5 0.5 0.5 0.5 0.5 0.5 0.5 
##$TPOFFS= (0..7)
0 0 0 0 0 0 0 0 
##$TUNHIN= 0
##$TUNHOUT= 0
##$TUNXOUT= 0
##$USERA1= <user>
##$USERA2= <user>
##$USERA3= <user>
##$USERA4= <user>
##$USERA5= <user>
##$V9= 5
##$VALIST= <valist>
##$VCLIST= <CCCCCCCCCCCCCCC>
##$VD= 0
##$VDLIST= <DDDDDDDDDDDDDDD>
##$VPLIST= <PPPPPPPPPPPPPPP>
##$VTLIST= <TTTTTTTTTTTTTTT>
##$WBST= 1024
##$WBSW= 4
##$XGAIN= (0..3)
0 0 0 0 
##$XL= 0
##$YL= 0
##$YMAX_a= 119416
##$YMIN_a= -117128
##$ZGOPTNS= <>
##$ZL1= 120
##$ZL2= 120
##$ZL3= 120
##$ZL4= 120
##$ABSF1= 10
##$ABSF2= 0
##$ABSG= 5
##$ABSL= 3
##$ALPHA= 0
##$AQORDER= 0
##$ASSFAC= 0
##$ASSFACI= 0
##$ASSFACX= 0
##$ASSWID= 0
##$AUNMP= <proc_1d>
##$AZFE= 0.1
##$AZFW= 0.1
##$BCFW= 1
##$BC_mod= 2
##$BYTORDP= 1
##$COROFFS= 0
##$CY= 11.3945322036743
##$DATMOD= 1
##$DC= 2
##$DFILT= <>
##$DTYPP= 0
##$F1P= 15.6554695791079
##$F2P= 12.8336369535428
##$FCOR= 0.5
##$FTSIZE= 0
##$FT_mod= 4
##$GAMMA= 1
##$GB= 0.15
##$INTBC= 1
##$INTSCL= 1
##$ISEN= 128
##$LB= 0.24
##$LEV0= 0
##$LPBIN= 0
##$MAXI= 10000
##$MC2= 0
##$MEAN= 0
##$ME_mod= 0
##$MI= 1.114404
##$NCOEF= 0
##$NC_proc= 0
##$NLEV= 6
##$NOISF1= 3.799351
##$NOISF2= 2.8
##$NSP= 1
##$NTH_PI= 0
##$NZP= 0
##$OFFSET= 15.70392
##$PC= 1
##$PHC0= -25652.7
##$PHC1= 18.78747
##$PH_mod= 1
##$PKNL= yes
##$PPARMOD= 0
##$PSCAL= 0
##$PSIGN= 0
##$REVERSE= no
##$SF= 200.130013532006
##$SI= 16384
##$SIGF1= 3
##$SIGF2= 2
##$SINO= 400
##$SIOLD= 16384
##$SREGLST= <1H.CDCl3>
##$SSB= 0
##$STSI= 0
##$STSR= 0
##$SW_p= 3612.71676300578
##$SYMM= 0
##$S_DEV= 0
##$TDeff= 0
##$TDoff= 0
##$TI= <>
##$TILT= no
##$TM1= 0
##$TM2= 0
##$TOPLEV= 0
##$USERP1= <user>
##$USERP2= <user>
##$USERP3= <user>
##$USERP4= <user>
##$USERP5= <user>
##$WDW= 1
##$XDIM= 8192
##$YMAX_p= 0
##$YMIN_p= 0
$$ End of Bruker specific parameters
$$ ---------------------------------
##NTUPLES= NMR FID
##VAR_NAME=  TIME,          FID/REAL,        FID/IMAG
##SYMBOL=    X,             R,               I
##VAR_TYPE=  INDEPENDENT,   DEPENDENT,       DEPENDENT
##VAR_FORM=  AFFN,          ASDF,            ASDF
##VAR_DIM=   8192,          8192,            8192
##UNITS=     SECONDS,       ARBITRARY UNITS, ARBITRARY UNITS
##FACTOR=    0.0002076,     1,               1
##FIRST=     0,             0,               0
##LAST=      1.7004516,     0,               0
##MIN=       0,             -117128,         0
##MAX=       1.7004516,     119416,          0
$$ Real data points
##PAGE= N=1
##DATA TABLE= (X++(R..R)), XYDATA
$$ [...]
2276F34K235r96l372j439J659L184J000k450k899l28L109K253q80l216j477J758
2292a225L092R97k530k790K5K895K613j214k839j657J182L163J550k527l263K31
2308b297K747K369p67l086k100J823L460O27k180k849j98K562K533o65k915k057
2324b993J561L029J597k281k981l51K585K385k69k988k046J277K912J396k188
2339F45k941k70K558K817q06k735k146J349L092J008j809k858m20K707K337m09
2355B119k827k132J258K850J013j705k575l88J995K965m50k778j985R29K935J512
2371B736j873k845k98K195K040K13k924j967R80L037J333j783k809o85K184L008
2387B542l50k780k016P14L093J411j438l016l20K006K639k70k467k410J065K680
$$ plain form
2276 634 2869 1873 -1499 -2938 -1279 1905 2905 455 -2444 -2772 337 2590 1710 -1506 -2983 -1225
2292 -1225 1867 2864 334 -2456 -2431 464 3077 1863 -976 -2633 -1451 1712 3262 735 -2528 -2297
2308 -2297 450 2819 2052 -1034 -3134 -1311 2149 2776 596 -2253 -2451 111 2644 1979 -936 -2993
2324 -2993 -1432 1597 3194 913 -2068 -2419 166 2551 2282 -706 -2752 -1475 1437 2833 645
2339 645 -2296 -2566 -8 2809 2003 -732 -2878 -1529 1563 2571 762 -2096 -2516 191 2528 2119
2355 2119 -708 -2840 -1582 1268 2281 576 -1999 -2387 -392 2573 2123 -655 -2640 -1711 1224 2736
2371 2736 863 -1982 -2280 -85 1955 2168 -756 -2723 -1743 1294 2627 844 -1965 -2650 -466 2542
2387 2542 2192 -588 -2604 -1890 1203 2614 1176 -1840 -2160 -154 2485 2215 -252 -2662 -1597 1083
2403A083J523j625k632r55K354K243J53k700k017R21K662J819k149k269q37K106
2419c20K363p4k236k039M25L007J717j603l119k82J808K352L23k394k377Q75K367
2436G93J749j489k436j077K062K569k3k535k101Q85K545J518j344k540j038K144
2452c18K493j36k284j793L64K588J477r54k951p66J698K563P5k282j802PK849
2469H28J374j184k450q22J370K519L56j894k336N85K335J717j279k376j077J565
2485g69K210O73k131k097J70K742J330q13k344j203J764K486j49j785j782l41
2501b039K646J612j177k148j263J961J849N75j975k032K33K235J734q89k234j352
2517b264J221K495O90k024k329P55J961J538m85k561j207J636K131O13k111k052
$$ plain form
2403 1083 2606 981 -1651 -2606 -252 1991 2144 -556 -2573 -1652 1010 2829 680 -1589 -2426 -320
2419 -320 2043 1969 -267 -2306 -1881 1126 2843 1240 -1879 -2161 -353 1999 2322 -72 -2449 -1574 793
2436 793 2542 1053 -1383 -2460 -398 2171 2148 -387 -2488 -1603 942 2460 1116 -1424 -2462 -318
2452 -318 2175 2039 -245 -2038 -1674 914 2391 1437 -1514 -2280 -582 1981 2056 -226 -2028 -2021 828
2469 828 2202 1018 -1432 -2254 -884 1635 1991 97 -2239 -1654 681 2398 1119 -1257 -2334 -769
2485 -769 1441 2114 -17 -2114 -1944 798 2128 1315 -1029 -2232 -468 2018 1869 84 -1698 -2039
2501 -2039 607 2219 1042 -1106 -2369 -408 1441 2016 41 -1991 -1758 477 2211 1322 -912 -2264
2517 -2264 -1043 1452 2142 118 -2211 -1456 505 2043 1558 -1003 -2210 -574 1557 2170 59 -1993
2533a993N59J677J886r13k341j207J546K259M06j485k024j2J882J887n30k460
2549h63j449J469K143O94j554k191J00K230J516p98k340j152J202K273Q45j850
2565B75k230N2K237J786r19k190j165J309K286M71j378k126m04K554J474o36k028
2582f32j512J223K095J088j914j995j10J906J541j79k199j264R16K452O98j731
2598C83j782n00K180J625p99k118p92R84J965O91j354k003k65K014J550k91j975
2615d87j476R89K398M16j284j996p06J919J919l01j789j666J022K393O46j597
2631D00j806m59J997J429q9k297j290J102J763J238j339k378j00J931J556k60
2647A398j825j651Q85K363P18j028k742q1K101J441K0k227j150N60K129J145j689
$$ plain form
2533 -1993 -1434 243 2129 1216 -1125 -2332 -786 1473 1879 394 -1630 -1642 240 2127 1597 -863
2549 -863 -2312 -843 1300 1994 440 -1751 -1651 579 2095 1297 -1043 -2195 -993 1280 2125 275
2565 275 -1955 -1903 334 2120 1201 -989 -2154 -845 1441 1912 534 -1592 -1996 558 2032 1396 -632
2582 -632 -2144 -921 1174 2262 348 -1647 -1757 149 1690 1511 -688 -1952 -1036 1416 2114 383
2598 383 -1399 -1899 281 1906 1107 -1011 -1803 -819 1146 1837 483 -1520 -1785 229 1779 1488 -487
2615 -487 -1963 -974 1424 1840 556 -1440 -2146 -227 1692 1391 -398 -2064 -1042 1351 1997 400
2631 400 -1406 -1865 132 1561 1472 -825 -2115 -1013 750 1988 649 -1729 -1829 102 1658 1398
2647 1398 -427 -2078 -1193 1170 1888 860 -1882 -1963 138 1579 1599 -628 -1778 -1218 911 2056 367
2664C67j508k59J287J676O7j957j683O76K014J223j508j475n28J442J902j05j868
2681b37j497N12J900R71q09k050o71K010J609m11j534j792O48K015J063j056j893
2698a222n60J605J802l17j526j447N52J861P30p09j965l38J169J870J12j588j664
2715a635N73J671Q98n40k001o15J046J981J7j383j504J83K012J231r65k083n83
2732a697J428J632M93j918j399J70J904R86o26j998o50J322J864j36j583j193
2748a401J17J862J127q77j748q21J255J586N88j558j941M76J815Q85o08j542j139
2765a924J578J472L79j093j887J62J714R50k25k001q07J290J430O90j725j346
2781a343J2K060J034r45j702q41J084J897J4j210j522J98J782J241o67j889o27
$$ plain form
2664 367 -1141 -1400 -113 1563 1630 -327 -2010 -1334 680 1903 395 -1080 -1608 -166 1736 1631 -237
2681 -237 -1734 -1222 678 1649 840 -1210 -1881 129 1738 1327 -207 -1999 -1351 664 1727 671 -1222
2698 -1222 -1782 -177 1625 1308 -218 -1665 -1113 748 1478 769 -1196 -1534 -365 1505 1617 29 -1635
2715 -1635 -1062 609 1507 967 -1034 -1649 -603 1378 1395 12 -1492 -1309 703 1934 969 -1114 -1697
2732 -1697 -269 1363 1856 -62 -1461 -1291 613 1599 973 -1025 -1675 -353 1511 1375 -208 -1401
2748 -1401 -1284 578 1705 828 -920 -1741 -486 1100 1688 130 -1811 -1335 480 1365 757 -785 -1924
2765 -1924 -346 1126 1505 412 -1475 -1313 401 1351 1126 -875 -1682 -392 1038 1728 3 -1343
2781 -1343 -1331 729 1763 818 -884 -1725 -641 1256 1270 60 -1462 -1264 518 1759 1092 -797 -1424
2798a424Q00J896L74j723j262K45J544R47l12k186l53J037J513L78j180j714M6
2815a374J709J183l30j756r06J085J422q2q41j576M2J623J073p2j417j064Q29
2832d52R92P20r03j439k74J686J243p83j328j015R25J567M84j388j099k47J438
2849A27J182j34j996n07R45J283J87j112j620L17J705J114o76j249j127Q83J259
2866E81J070j536j406J6J542R91j56j551q56N03J321J045j309j308j38J343R72
2883A124k81j327q57O72J638L96j188j184l13J187J495m66j426p67O55J380M67
2900A205p76j684K3J292J420k23j665r58P55J438O38j085j144q90J638J090M9
2917A123j384j294P48J460P56j115j507J54O59J576k32j280j268O52J717M60r57
$$ plain form
2798 -1424 -624 1272 1646 -77 -1339 -1094 450 1397 1085 -1101 -1454 -417 1096 1474 294 -1420 -1374
2815 -1374 335 1518 1188 -568 -1474 -389 1033 951 110 -1466 -1424 199 1272 1200 -217 -1281 -452
2832 -452 540 1260 357 -1082 -1356 330 1573 790 -538 -1553 -628 939 1423 35 -1064 -1311 127
2849 127 1309 1175 -821 -1328 -383 900 1087 -25 -1645 -1328 377 1491 815 -434 -1561 -678 581
2866 581 1651 115 -1291 -1275 267 1258 1102 -449 -1305 -802 519 1564 255 -1053 -1191 152 1124
2883 1124 843 -484 -1341 -669 969 1365 177 -1007 -1320 -133 1362 896 -530 -1297 -642 738 1205
2900 1205 429 -1255 -1232 60 1480 1257 -408 -1366 -611 827 1465 380 -764 -1654 -16 1074 1123
2917 1123 -261 -1555 -807 653 1409 294 -1213 -1059 -400 1176 944 -336 -1604 -952 765 1225 268
2934B68j093k82J193J204j56j314j195N19J248Q90j026j026o16J406J318k18j545
2951d25q90Q25J294L40o09j311o40J215J194J44j414q44p5J741O08p15j215j63
2969i40M55J716j83j324j218O54J206R63n61j596l83Q71J343Q9j240j349O64J407
2987E74M82l38j548n46J115J504k68j038j064J22J730O23p72j281n53O69J431
3004H42N43j240j301L45J005R97o12j092p36J138J058K43j242j255L16J366J065
3021A440q03j035o07R61P44L83j276j005L96R05J072o11r51p25O25J528J45j101
3039H5j419O05Q65J083n86j111o18Q08J233L7r53j353N24J364O59n69j510l43
3057a199O60J423L71j244j022n9J299Q45m22j360k23M95J010N39j394p98J61J001
$$ plain form
2934 268 -825 -1107 86 1290 1134 -180 -1375 -856 392 1282 256 -770 -1386 20 1338 1120 -425
2951 -425 -1315 -490 804 1144 535 -776 -1416 -201 993 1137 -277 -1121 -1196 545 1153 438 -777 -940
2969 -940 -485 1231 1048 -276 -1494 -840 366 1329 768 -828 -1211 -340 1003 1092 -148 -1497 -833 574
2987 574 1056 718 -830 -1376 -261 1243 975 -63 -1127 -1005 725 1348 576 -705 -1258 -589 842
3004 842 1385 145 -1156 -811 194 1191 579 -513 -1249 -111 947 1190 -52 -1307 -991 375 1440
3021 1440 637 -398 -1005 -44 700 1083 -193 -1198 -802 103 1175 564 -387 -1112 -487 1041 1186 85
3039 85 -1334 -729 136 1219 633 -478 -1096 -288 945 982 29 -1324 -800 564 1223 654 -856 -1199
3057 -1199 -539 884 1255 11 -1011 -1070 229 1074 652 -708 -931 -436 574 1113 -281 -1079 -918 83
3075H3P65j01j433p27J011J343J64j180q77K10O90J212m05j387m14J75J947m08
3093F68n95j111J23J016Q21k68r33p72O45J041M66r34j083L90P02J081n39r84
3111b66m55K71J134N42j059j041j6R61P52O3j149r67P88J407j49o65j148NQ96
3130i6J247j36j267m99L37J201K86j004q91P6P18Q57j43j035o11L65J132N15p06
3149C46j371oR57R66J41j602m14J44J352K56m59j332J91J155N75oj000r13N49
3168d71Q19P24o24j163k64Q81J020k36j083m36K82P21O36n13j258K5J087R76j56
3187I67j048r59M40R69Q44j021j191k13J220P92l29q76l29K20J157L57o11j527
3205a138K09Q94Q20p0j163o10N70J014L52p25p76j56O14J093p3j131r39R08J131
$$ plain form
3075 83 848 747 -686 -1413 -402 941 1105 -75 -952 -742 -52 1160 755 -632 -1046 -871 1076 668
3093 668 73 -1038 -915 101 922 654 -279 -1051 -406 635 1101 167 -916 -526 176 1257 718 -266
3111 -266 -721 -450 684 1226 167 -874 -890 71 823 886 -263 -1230 -442 965 816 151 -997 -992 -96
3130 -96 1151 1015 -252 -751 -414 787 1073 69 -822 -746 -28 829 686 -349 -960 -595 537 1052 346
3149 346 -1025 -1031 -74 892 1033 -569 -983 -839 513 769 310 -1022 -831 324 899 893 -107 -1020 -471
3168 -471 348 1072 448 -715 -979 -98 922 686 -397 -833 -551 170 806 293 -965 -940 147 1123 967
3187 967 -81 -1040 -600 369 1213 192 -999 -1212 8 800 471 -405 -734 -514 643 1000 389 -1138
3205 -1138 -929 -35 785 715 -448 -1058 -488 526 878 153 -623 -779 -165 928 855 -276 -1215 -307 824
3224H24j1m16j039j79Q89R05Nj453k75J48R60N10m29q08r18J306Q37K56j208p04
3244h00K47J111L34n26j138K6P59P09J71q31r14J85J057M71m59j141j05P60J010
3263I26l4j222n59J26J099P27o33j089l04R20Q83J6r64n04k22J383M46n76j025
3282f06j97P42P08R8q03r67O1J270P34r36n12k10R25N92j64p61o59K86P04O99
3302A004o21p80o65R80Q31p8q06o28J71P66N72k77q31o11J015M25Q0n03j089O20
3322d25Q07L19Q3j056m48N30R44J83r66n60j24R69O12n02q99k99M35J175m23n71
3342b16n62J87J092J14m13p35l08L97R39L41o64p24j39O87Q31k60r37o63R51N04
3362D22L38q67o61J35J127Q8r8p27o61Q23M04R0n14q00K69R32N32o26l51p83O97
$$ plain form
3224 824 813 397 -642 -821 68 973 978 -475 -750 -602 358 868 439 -369 -1287 19 856 1112 -96 -800
3244 -800 -553 558 892 366 -772 -746 13 722 893 62 -852 -667 390 861 402 -739 -844 -84 926
3263 926 892 -330 -889 -763 336 1063 430 -659 -963 -43 840 856 -108 -612 -834 549 995 419 -606
3282 -606 -803 -61 647 745 -58 -1025 -964 306 1040 104 -408 -618 307 899 735 -26 -685 -399 305 1004
3302 1004 383 -397 -1062 -82 749 671 -135 -763 -592 174 746 469 -362 -973 42 467 547 44 -1045 -425
3322 -425 382 701 784 -272 -720 -190 754 937 -29 -589 -713 256 868 366 -533 -832 -397 778 355 -216
3342 -216 -778 -591 501 615 202 -533 -841 -444 495 836 172 -552 -691 -4 827 567 -370 -1033 -82 422
3362 422 760 -107 -768 -633 494 582 484 -243 -904 -81 323 413 -101 -901 -632 300 832 206 -145 -928 -231
3383b31O55L37r04p74M8J016M85k18n77l86K13N24M00n39q40L7Q08O06j61r16
3403d17m62M85Q02K39n87p90K21O75O49j65q70n76M98P57M28p70q37k53R46Q82
3423H55m14p02o32M35R25N4m84p87J78O39N66P5p82n71L26Q26J92n56p16p8O25
3444b6M54P4o81q33R17K64N81o80q34J35O91L99r7p80k10K87R12k3l01o75O1L69
3466DP75l67q87m42M37Q63K69p55j64j25P16K36j10p25k72K06O12N09p99n42n3
3487f14N09P10k4q98o30M30P59L46l47q51J30P06K12r1q71j96J78Q74K78l18o31
3508c39m25P13N27M41j019p43M63Q25J82m00q07N3L95P31n0q80k42R8J068K7l61
3529B57r31J86O00K95J30o42l54p7O30O97m94j101M54K84M43j54n34m01K97O17
$$ plain form
3383 -231 424 761 -143 -917 -869 147 632 414 -163 -549 -336 188 588 49 -791 -754 54 660 499 -417
3403 -417 -879 -394 408 647 60 -730 -509 166 815 650 -220 -796 -298 459 887 117 -720 -973 -27 855
3423 855 441 -261 -893 -458 467 521 37 -750 -572 67 633 708 -74 -645 -319 507 699 143 -573 -651 -26
3444 -26 428 502 -179 -1012 -95 169 750 70 -764 -629 62 461 364 -416 -626 -339 573 550 249 -426 -365 4
3466 4 779 412 -475 -917 -480 383 652 -103 -267 -392 324 560 450 -275 -547 -341 271 780 -19 -561 -614
3487 -614 -105 605 581 -317 -947 -517 242 588 241 -610 -480 226 438 347 -524 -720 -542 332 610 292 -339
3508 -339 -764 -51 476 917 -102 -845 -382 443 625 225 -582 -529 -134 597 547 -333 -575 -477 591 618 257
3529 257 -674 -488 112 407 537 -105 -459 -536 94 791 297 -804 -350 -66 377 223 -311 -712 -415 202
3549B02M54n50k51n25L63J125j46r61m90K31Q52N38q28m36J45K65N92L3q88l61
3569f36J74P25L71n21o71l0M41O37Ro74n48L93M84K99j33o18k77L82P13j52m91
3590a23n36L84O57L27o15n33o5K17R02M6m63r83J59R00N44m80k76n22M81L65M51
3611H37q92p36L41L63R15n57p65J18L09L04K18m36m82P7J80R37l89n66m50O02
3631g2K95M30o03n70K90O83K19o37m01l87N31M55K65m99m16q6O30M50k14j131
3651g68N34K00O99k92l08p28K07O90O20n35p94M4J20R26M5n98n65M0L05O18n7
3672D03p44j94L25M54J8l12n03j07J232Jl32p93K93R8L18L91m06m64J59J87L14
3693C38j25k57n57K85N95J64k74n52j69P93N68p01q07J22M20L93J57n11l90J29
$$ plain form
3549 202 656 106 -145 -670 -307 818 672 -289 -779 -548 304 842 14 -422 -277 -12 580 613 -275 -636
3569 -636 -462 263 634 113 -558 -588 -147 490 499 -175 -723 -330 154 453 320 -298 -575 -193 520 368 -123
3590 -123 -659 -275 382 709 94 -439 -504 -287 615 661 198 -785 -626 274 818 338 62 -460 21 386 837
3611 837 -55 -791 -450 -87 828 271 -494 -376 -67 237 455 19 -463 -386 -206 731 342 -224 -674 -72
3631 -72 223 653 50 -520 -230 453 672 35 -366 -753 -222 233 498 -1 -417 -503 127 577 363 -768
3651 -768 -234 -34 665 373 65 -663 -456 234 854 319 -475 -431 -311 615 660 62 -503 -463 -158 460 403
3672 403 -341 -535 -210 244 262 -50 -553 -660 572 573 241 -552 -259 -161 157 548 142 -322 -163 24 338
3693 338 213 -44 -601 -316 279 443 169 -383 -552 241 809 108 -699 -577 -157 236 393 -118 -508 -379
3713c79M36L76j98m50j30K91L59J92m37n03k58N26Q61n60l43k99M28J38M74m78
3733D6n09k22O13O55k56n67j78pP90L61o69l52j97M42O74j60q57q2j95J142J90
3754F62o42o34L48N25k21N95q97l27M60O65k2n44j80j72J89O67j41l73l96K1P88
3775C71j97J16p53l05R32K68pm72k96K73L13M00q26j49Q1N87P9L4o18l22K03L22
3797C4N72m35p99M09K98K73J34n04l99Q1N06K25l23m36m10Q07N05J7q03l16M23
3818a41K13M14n22k65j80O10K26j67l31l65N43L72L07o28j95l59M41N55l20l57
3838a49n24L01R19K34l45o30l77M79O58k76k90k81j92Q07r6J55n77m02P21M72
3858F07l2m66p08O51M36k53j36m87k0M91O18j58q37J33k96P30J33p1q31n5N26
$$ plain form
3713 -379 57 433 235 -215 -345 -54 305 497 60 -443 -701 -175 686 126 -217 -516 -88 50 524 46
3733 46 -463 -685 -72 583 327 -240 -418 -425 365 726 57 -295 -492 -50 624 464 -393 -475 -670 472 662
3754 662 20 -614 -266 259 38 633 -264 -591 -131 534 512 -32 -212 -384 -195 472 331 -42 -438 -417 371
3775 371 174 290 -463 -768 164 432 425 -47 -343 -70 243 643 -183 -332 -251 336 415 449 -169 -491 -288 34
3797 34 606 171 -628 -219 79 352 486 -18 -417 -336 170 395 72 -364 -774 33 538 555 -248 -564 -141
3818 -141 72 486 -36 -301 -481 129 355 188 -143 -508 35 407 714 86 -109 -468 -27 528 208 -149
3838 -149 -673 -372 547 781 436 -194 -571 -92 566 290 0 -281 -473 334 238 393 -184 -586 135 607
3858 607 575 109 -599 52 488 235 99 -388 -408 83 701 543 -294 -161 -457 273 406 335 -496 -551 -25
3879b5L39J43p90k79J46Q37J27l19n65m5K91N17j45l42n60L27N19N93l18p00l06
3900e55K95N53J23n63l41J02N57K30l40l23m5K27L30J43l43l32M7M87L88l78p10
3921d48L9L58N82j77m72j34J63J17J76J24n31r6L83K22j51k18m04J56K83M60l86
3942D6m99J50J97P49j56k62r80R6N69N93m88J2m76K09O53r5m59n06M20P01O6p5
3964D65o80o02R32J78L6k94m15J67J00M13j94J6p36M70L01L33n58j45p1J91O20
3985E27m36k44m00L87M44K37n19l94m5O19K75m54l0k82R6O39L9o98k41q3O19M50
4007E06M0j145Q3J94O68J15m28l61J57K75L99m63j5p71M84L43K45j88q54M07L80
4028G1K84J31o50n36P99J62q0o8m01k65O64K71l02k15l06J28N08M46n18o70L14
$$ plain form
3879 -25 314 457 -333 -612 -466 371 498 179 -386 -431 -140 377 232 -110 -670 -343 176 769 451 -249 -555
3900 -555 -260 293 416 -147 -488 -386 171 401 61 -262 -307 -80 250 393 50 -282 -235 252 640 262 -448
3921 -448 -409 -51 531 354 -118 -252 -89 28 204 328 -203 -299 84 306 155 -63 -467 -311 -28 432 46
3942 46 -453 -303 -106 643 487 225 -755 -659 -90 503 15 27 -449 -240 413 318 -141 -647 -227 474 540 465
3964 465 -215 -817 115 293 329 35 -380 -213 -113 300 106 122 -614 -144 157 490 -68 -213 -284 -93 527
3985 527 91 -153 -553 -166 278 515 -4 -398 -443 176 451 -3 -33 -315 -219 420 459 -239 -480 -563 56 506
4007 506 546 -599 -516 -322 346 461 33 -328 -171 104 503 40 25 -746 -262 81 326 138 -716 -309 71
4028 71 355 486 -164 -700 99 261 181 113 -288 -553 111 382 80 -135 -441 -313 195 641 123 -547 -233
4049b33K51L2J20k76jk19O02M05m81m23j61L47M55k30l14k95J90O21m9j61m40
4070b60J42L66k7K8m89r4q9O11K15k61m53K44O32J8k36j70o37K5M22L22j75l73
4092b39q5J51K80L50l75m38J07L4Q35l87n54l6K18O47r5o30o00O91M46k02O3l84
4114b03l17J73N61K76p80j77J7O99q4k91k05l7K63N34L47q69j07l2L84J68k37
4135H3j69l6O0M43l08k5l93Q5M76J82k91q15K08N98O45l33l22l47J42J54L21m14
4157e6j91l42O77K62p4o70k59O68k5O31m13m03j87J44O45N4m34k14n4M90j58J26
4179B17n58O7L4N56J45n86k6k8K73K03J39o85j58J35N94J8m23l10K73K58J90j60
4201A68l93l43N30K79p6L6n46l9N31K4N5l55l2J60L54J34n09k86k7M97J09p3k70
$$ plain form
4049 -233 18 50 170 -106 -107 -326 276 681 200 -223 -384 -37 418 188 -126 -421 -231 390 341 180 -260
4070 -260 -118 248 221 249 -240 -334 -423 188 403 142 -311 -67 565 583 347 177 -460 -435 -13 309 134 -239
4092 -239 -324 -173 107 457 82 -356 -249 -215 620 233 -321 -357 -139 508 413 -217 -817 -126 320 118 181 -203
4114 -203 -520 -347 214 490 -290 -467 -450 249 165 -126 -331 -368 -105 429 776 -93 -200 -232 152 320 83
4135 83 -86 -122 -62 381 73 48 -345 -260 216 398 107 -708 -500 98 743 410 88 -259 -117 37 358 -56
4157 -56 -247 -589 88 350 276 -394 -653 15 -10 621 208 -195 -382 -238 407 461 27 -187 -241 249 91 217
4179 217 -341 -274 -240 316 461 -125 -151 -179 94 297 436 -249 -407 -272 322 340 -83 -393 -120 138 328 168
4201 168 -225 -568 -38 241 165 201 -345 -384 147 171 226 -129 -161 -1 353 487 -22 -308 -335 162 271 198 -72
4224g2l32N89J92k01m27l12L36J24N20l37n03O8J38L38M67n03k74r1J12O07l24
4245A15r9l33L87L07j98j47j51r0M65n7j33q0k77j23P26k0k43k79J12J00O01p06
4267a23p9j76M83J05K18m55J02k03L69K04l80j24j13j77K72P8Jk04k00N43K32
4288C73j47m79j09M8N48K83k99o27j36M61M99mo62K08k93N87J88n96j38O4K89
4309E8N06k16n53L2kL54J78m23k6k93L63O04l21m30q6P4J87qm0o0l89M36L45J7
4333C07n72j18O4O02j00k5p11N15L8K64J42o64r5Q4M05K41n57j22K06J28M7J51
4355B30m71J96jK48P6k27k72j18K41L50l5j34k85pL54j22K18l17j71J41L35k39
4377a0j04j38q6J04L76l05j22m5N31p2j39K83o40K51q9P06n23p4N4K4K24k66N
$$ plain form
4224 -72 -404 185 377 176 -251 -563 -227 -103 417 80 -423 -355 -217 121 588 85 -189 -280 -168 439 115
4245 115 16 -317 70 377 179 32 -119 -209 256 199 66 -14 -291 -414 312 292 49 -230 -118 -18 583 -123
4267 -123 -202 -378 105 210 428 -27 75 -128 241 445 65 -59 -172 -349 -77 1 2 -202 -402 141 373
4288 373 226 -253 -362 -314 234 517 218 -409 -545 -84 415 411 -251 -43 -336 251 439 -157 -295 -231 58
4309 58 564 348 -205 -173 -175 179 357 -66 -92 -385 -22 582 261 -169 -255 -181 6 -2 -42 -102 -491 -55 290 307
4333 307 -265 -383 -319 283 183 158 -553 -38 0 264 406 -258 -353 -269 136 377 -180 -302 -96 32 79 230
4355 230 -241 -45 -46 202 278 51 -221 -339 -98 252 217 83 -202 -209 145 23 241 -76 -247 -106 229 -10
4377 -10 -114 -252 -338 -234 142 -163 -285 -330 201 129 -10 273 -367 -116 -205 501 -22 -96 -42 -18 206 -60 -55
4400e5k27Q4J53N46m50k87L80m9k2O0n76L60k01J74N79m6o69K06q6M71l43j04
4422a02l00j00O58J52p1l68J59j34M07m06K8j34O2J4K10l34K48j68J92K83J1j70
4444A37k89k97O56k08L05l25l59L07L12ok23m90J54N47L7K57p10pM66MJ10o33
4466b55K94k14M99j4l35Qj35Q2K86p0q9m84K37M93k92o6pm79O29k3K80m62P9j79
4490b17K42M29l72l14K1qM36J72l67Mm12L32M61l93l49J44j74O93o5j56l95Q3
4512b05L35J16m35K07j65O1K58O3j65k73RL93L02l70k94m52L78K91J90k98l32
4533c86L48O1L36j68m09K06j45J20J75K70o89j15K46L19q5l91N0K88L50j16L4
4554B99k39J2J43j1K8l03j57M21j9L04m09n62J97M30K65k05m08k15L52K33j12
$$ plain form
4400 -55 -282 -198 -45 501 51 -236 144 95 73 133 -443 -83 -284 -110 469 423 -246 -40 -126 345 2 -102
4422 -102 -402 -502 156 308 237 -131 28 -106 301 -105 -77 -211 -149 -135 75 -259 -11 -179 13 296 307 137
4444 137 -152 -449 207 -1 304 -21 -380 -73 239 233 10 -480 -326 221 258 515 -195 -202 264 268 378 -255
4466 -255 39 -175 324 310 -25 -17 -152 -70 216 146 57 -427 -190 303 11 -55 -62 -541 88 65 345 -117 -38 -217
4490 -217 25 454 82 -232 -211 -219 217 389 22 26 -386 -54 407 14 -335 -191 -365 328 263 107 -288 -205
4512 -205 130 246 -189 18 -147 -86 172 235 70 -203 -194 199 501 131 -163 -615 -237 54 244 -54 -386
4533 -386 -38 23 359 191 -218 -12 -157 -37 138 408 -281 -396 -150 169 84 -307 -257 31 381 265 299
4554 299 60 72 215 204 232 -71 -228 193 174 478 69 -493 -296 134 399 194 -214 -429 -77 156 44
4575D4j31n46M73L20j7J10l02m61O10m0J91l31l05L46R2J08j49j20j08J06L11
4596B01m6m45p9J66q9N84m22L3j12n5N83j61j98n6jJ54j39L08n14q1K17M45K65
4619E58p77ok27O63J88l81m47p0M16K7L86k07j43k47K38L33j69p30N92J44j91
4640e0L37k75j97j17M74m3j21l21J67J5M11N1m1m30j4j36N11J27n19QJ05P3J29
4663A44J11k35j53o6L71n2R7m42K48K01K5m09K9K46l31K1M74k28R8k0p7j07O3
4686HK3l63M93K74l55k89n3k7K52K22l76k53K67k40P40o07L12k34K9J98O4l26
4708b41k6nj63O51k5Ol50l0L92J91m44rj19K99J4L7j42j76P6j06K66Q6j79l23
4732c20J77J44J10j63k70K30L02oq7m94J55n4M97K71q82J39PJ94L41k96j1l12
$$ plain form
4575 44 -87 -633 -160 160 143 253 -49 -510 100 60 251 -80 -385 -39 53 161 12 -108 -216 -110 201
4596 201 155 -290 -369 -203 -292 292 -130 -97 -209 -264 319 158 -40 -96 -97 57 -82 226 -288 -369 -152 293 558
4619 558 -219 -225 -452 211 399 18 -429 -499 -83 -56 330 123 -20 -267 -29 304 135 -595 -3 141 -50
4640 -50 287 12 -185 -302 172 129 8 -313 -146 -131 280 331 290 -140 -154 -290 221 348 -171 -163 -58 15 144
4663 144 255 20 -133 -199 172 120 217 -225 23 224 249 -160 -131 115 -216 -195 279 51 149 129 52 -55 8
4686 8 31 -332 161 435 80 -209 -262 -289 -37 185 -191 -444 -177 -417 323 -284 28 -206 -177 21 85 -241
4708 -241 -267 -272 -435 216 191 197 -153 -183 209 400 -44 -53 -172 127 141 178 36 -140 -64 -170 96 182 3 -320
4732 -320 -143 1 111 -52 -322 -92 210 204 117 -377 -222 -276 221 492 -390 -251 -244 -50 291 -5 -16 -328
4754c28M41J61nn30j04L25RL36k07k94l45N07O8L39l77J15k90L81J69n5l44J5
4776a3QJ82J13n01%m7K70K36k37n4M4p5K61L4k24k00r7L02l24N20j73k58J02M42
4800C11k76L79m79j60L6M80k16j93l11N61k9k06j5J06k02J13p7P4L1K6J00K65
4822C18k64l4l09j64L84J04o3r9J27L47J4j97M3l07m8L09j08K25l40k48LM50K5
4845A68l06KL01mJ67l79O0l58L61J03j34J05J36k59P4j91M27m04K7P2M3J94k96
4868i1L54j56l31M12j01j3j63K1M2L36r6j44j22J24j66K45k03j73P8L45J88o79
4890b93J13J92J18l3J78l50k43L16n1L48j72j70j30oO55l99j07k33J76R8J46l60
4912b07l0L90k39L66j28q0m6k03J21L52k71j72N7L0J6K21k04n1nJ59J03k02m0
$$ plain form
4754 -328 113 274 269 -261 -365 -40 -31 305 98 -196 -541 -34 34 373 -4 111 -179 202 371 316 -28 -13
4776 -13 -5 177 290 -211 -211 -258 12 248 11 -43 1 -74 187 221 -3 -203 -300 2 -322 198 25 -233 -131 311
4800 311 35 414 -65 -225 -189 291 75 -118 -429 132 103 -103 -118 -12 -214 -101 -178 -104 -73 -47 53 318
4822 318 54 20 -289 -453 -69 35 -28 -127 0 347 361 164 207 -100 -148 161 53 278 -62 -310 -307 143 168
4845 168 -138 -136 165 161 328 -51 9 -349 12 115 -19 86 222 -37 37 -154 273 -131 -104 -32 11 205 -91
4868 -91 263 107 -224 188 87 74 -89 -68 -26 310 214 70 -52 72 -94 151 -52 -225 -147 198 386 -293
4890 -293 -180 12 130 97 275 -75 -318 -2 -53 295 123 -47 -177 -183 472 73 -34 -267 -91 7 153 -207
4912 -207 -237 153 -86 280 152 72 26 -177 -56 296 25 -147 -90 -60 -44 177 -27 -78 -83 76 179 -23 -63
4935f3k1J06Q3l32N66l84l7K33J25J8l13l89K41M27j17j47n44K94M74l99K17r7
4957e9o5q8O34m84n8L5m2Q7r1Rj32N6n7K26K52k95R7j6r4J39k20J8J23P9q1J5
4983a2j84J24j52M96k92j50K37Lk26K57K12k90J80m69L12P5L3l66p0M88M3k15
5005C4l40M09j59K90n7j02k27J73nM1k55M56p07K13L53K79l44j30r4J0L45k51
5027f8Pk56J07K64L22j42k26r9J06M55N8m70m3M6k34L17P8j93O0j0l53M95m77
5050b56n9j7L15K47j22l19L53k8K17j5k45j38k46N11l19J72k68J09j67J26J1l
5072a41K0K34l15M85j62m67qJ64M63m27R7l9m9L44o6j32J29j98J34M5P4j35k38
5095a88l6n5L70k4j43j30J05N27m88K0l10J20K92k73N46j85l72J20K50k74m7M1
$$ plain form
4935 -63 -84 22 105 -227 339 -45 -82 151 276 294 -19 -408 -167 260 143 -4 -548 -254 220 -179 38 -59
4957 -59 -124 -212 422 -62 -120 -85 -127 -40 -131 -122 -254 -198 -255 -29 223 -72 25 9 -85 54 -166 -148 -25 54 -27 -12
4983 -12 -196 -72 -224 272 -20 -170 67 70 -156 101 313 23 203 -266 46 121 154 -212 -282 206 249 34
5005 34 -306 103 -56 234 177 75 -152 21 16 57 -198 258 -449 -236 117 396 52 -78 -172 -162 183 -68
5027 -68 -61 -317 -210 54 376 234 8 -91 15 470 528 58 15 61 -173 144 222 29 89 79 -274 221 -256
5050 -256 -315 -332 -17 230 108 -211 142 114 331 316 71 -67 -313 198 -121 51 -217 -108 -275 -149 -138 -141
5072 -141 -121 113 -202 283 121 -346 -354 -190 273 -154 -57 -96 -145 199 133 1 130 -68 66 111 185 50 -188
5095 -188 -224 -279 91 67 -76 -206 -101 426 -62 -42 -352 -232 60 -213 333 148 -224 -104 146 -128 -175 -134
5117a34k3K97j51J71k44j56K30rJ17j05k94P7M97j37J20p02N31q7j82N12m55j2
5139a39k80N19m5M8k29M5k1J61K68k21R6l16j51M62K18m33J99j20Q8R3j06k49
5161a13J08j0Q3J02j01j93j7O1K57k06l96L38K00N7r5J73m01J26j05J76K2p5j8
5184b7K23Q1k35o1J4K55P6K18o68K64m90L32J27l47j7n5L11k14J71q2K90j81K28
5207B13k70J23k23j33J08M47k89K51K1l31K60l3l98L07k73L55L1L43m66l44L04
5228Cj75L15r7r9k44K97O8j40P6j15N1K02j82N7K98o46L14J1M0p0J79mk65J22
5252dJ41k10q7J54k2l9P1Q6l37J96J76J16k58j08j5J44r4K35J09k43k44L27Q4
5275A78r3j6m45M62J4O3q2k90O0j01L12j75O5j66K27J30r1j32j94J10L01k2j24
$$ plain form
5117 -134 -157 140 -11 160 -84 -240 -10 -19 98 -7 -301 -224 273 136 256 -446 85 -2 -184 328 -127 -139
5139 -139 -419 100 55 103 -126 -81 -102 59 327 106 202 -114 -265 197 415 -18 181 61 149 242 136 -113
5161 -113 -5 -15 68 170 69 -124 -141 -80 177 -29 -425 -87 113 170 75 248 -153 -27 -132 44 66 -9 -27
5184 -27 196 277 42 -19 -5 250 326 544 -124 140 -350 -18 109 -238 -255 -310 1 -213 -42 -124 166 -15 213
5207 213 -57 66 -157 -290 -182 265 -24 227 248 -83 177 144 -254 53 -220 135 166 509 43 -301 3
5228 3 -172 143 46 -53 -297 0 68 -72 4 -111 -60 142 -40 17 315 -331 -17 -6 34 -36 143 139 -126 -4
5252 -4 137 -73 -160 -6 -28 -67 4 90 -247 -51 125 241 -17 -125 -140 4 -90 145 254 11 -233 94 178
5275 178 85 69 -376 86 100 163 81 -209 -149 -250 62 -113 -48 -214 13 143 52 -80 -274 -164 137 115 -9
5298ik61K4J56K15r8J1k32J11J13o2j00j26J93J54M2l56K29J20j48L3K5k70K48
5321A2Q7L4Q8j59j90mK40J52n2j27j79P2K06j81N6k70j02J66J81J29j45j71j41
5344b98J19K70q3K83m26L44P6k27j43n1K27M17m37jK6l84qK31K98n39M2L60j30
5367c4K29J8m98M85j95M7L93o07k15K46j87K19K37Q7l77L62q5J42k09k9M9J08
5389A86N8j86k56L0J38j2k23L92j8j85L36K4j09l27M7J67l7J3j2mR3k00K99m17
5413b03J12K6q8K02M7j84K73n64M14O6p0j65l31O40q3k26J34k62K70j5J5J52l04
5436a44j42M61M0N6l93j90J91L01j70k72J81M32m42J29j26k51%K37L93l30q5J7
5458a07K33k44K14K85l39k26K21J3N1R8k97L8l6L76J1k29r1QK97l31K28j90R6
$$ plain form
5298 -9 -270 -246 -90 125 27 38 -194 -83 30 -32 -132 -258 -65 89 131 -225 4 124 -24 9 34 -236 12
5321 12 99 133 221 62 -128 -132 108 260 208 81 -98 -26 180 -1 55 -215 -317 -151 30 159 14 -157 -298
5344 -298 -179 91 8 291 -135 209 285 58 -85 -136 91 508 71 70 96 -288 -296 -65 233 -306 -264 96 -34
5367 -34 195 213 -285 200 5 52 445 -162 -377 -131 -318 -99 138 225 -152 210 125 267 58 29 78 186
5389 186 244 58 -198 -168 -30 -42 -265 127 109 -76 260 284 175 -152 -105 62 25 38 26 22 115 -85 214 -203
5413 -203 -91 -65 -153 49 96 -88 185 -379 35 101 31 -134 -465 175 92 -134 0 -262 8 -7 8 160 -144
5436 -144 -286 175 215 271 -122 -312 -121 180 10 -262 -81 351 -91 38 -88 -339 -339 -102 291 -39 -124 -107
5458 -107 126 -118 96 381 42 -184 37 50 101 199 -98 -60 -96 280 291 62 -29 -21 276 -55 173 -17 79
5481G9l2K68j57r5m2m24N04K1k28l4M5J07Pj44K59k3K4k59K17J81j10m00K53J51
5505A68k5k54J55j35J93r5j24R3j12j69K02L65l86M17l92o1R1K51k74m4J73L7
5527G4J73j2R4k32k42P5Q4k63M28k38J9J23j62j74K66l3J88j92N2Q6r9r7M35j96
5551A57l4o0J9Q2j52k22J74N3p6K30l58K5K35L7J91j59j39j64O0M6J1K19k72o9
5575a66K49k20Q4R4k9o0qj64j7q0M06q1O5r5j92mq4J59L54j23l29N5j68K22M03
5600B71j35j64l2k01L98p7k29L35J57m28L14j0j78j61M2p5K78j1p0R9j57j10P1
5623g3o9m6J61J77l64M60k4l19J47kj92L18m14K39L97k33j55n4k5L05k81k85M47
5646A15OP5J53n3l20L35n37M42j14l07qK64K76o8l07k19K61j81M99k27k6j10j33
$$ plain form
5481 79 47 315 158 63 21 -403 101 122 -106 -140 -95 12 19 -125 134 111 135 -124 93 274 164 -236 17 168
5505 168 143 -111 44 -91 102 7 -117 -24 -136 -305 -103 262 -124 293 -99 -160 -69 182 -92 -136 37 74
5527 74 247 235 329 97 -145 -70 14 -249 179 -59 -40 83 -79 -253 13 -20 168 -24 28 114 15 -82 353 157
5551 157 123 63 82 164 12 -210 -36 17 -59 171 -187 -162 73 110 301 142 3 -161 -101 -55 -44 175 -97 -166
5575 -166 83 -137 -53 41 12 -48 -56 -220 -237 -317 89 8 73 -22 -214 -218 -302 -143 211 88 -241 -186 -354 -132 271
5600 271 136 -28 -60 -261 137 60 -169 166 323 -105 209 199 21 -140 -98 -173 105 94 24 123 -34 -144 -73
5623 -73 -142 -188 -27 150 -214 246 222 -97 50 48 -144 174 -240 -1 396 163 8 -46 -71 234 -47 -332 115
5646 115 121 196 349 296 -24 311 -226 216 102 -205 -213 51 327 259 -48 -267 -6 -187 312 85 59 -51 -184
5669a84kM78j46l83K62N7j95L23j90k45j03mN55k04k58J38J93Q7k17p9J75q1J23
5692A00l54M7K02n6R6n6o7L66l03r2K33Oj54K12l68J73K38l37R7L3j03K92p2J97
5716C30m79N68m36j16K65k79KK01K21l77J46n6q3o8J66Q5n7Q1J5k09R6J1r0k61
5740c24K90r2M50m44k26J77J91J26m7p4l57M84k83J97J15m57K34K8J27j81L44
5761B78j04j89R4M0p3L8j28K65j81j26Jk06J38J26J68l91M01j62l5O16n99J21
5783I2K5o3j83M23j77N0n8R2j91j06J14J36l3J70l87j6J24J52l87K25pJ62j22
5806C5l18K08r7J97k26J54L22j00o2j93K7r0K64p9J6j27k3o2M80j70k01L01j26
5829A30K08l67o7j14o4n3K37J19K06l97M12k32J69p06L72M41r7l10J50k06K39
$$ plain form
5669 -184 -186 292 146 -237 25 82 -113 210 20 -225 -328 -332 223 19 -239 -101 92 179 -38 -117 58 -23 100
5692 100 -254 -207 -5 -61 35 -21 -88 278 -25 -117 116 122 -32 180 -188 -15 223 -114 -17 16 -87 205 133 330
5716 330 -149 419 -17 -133 132 -147 -145 56 277 -100 46 -10 -93 -161 5 90 33 114 129 -80 16 27 -63 -324
5740 -324 -34 -126 324 -120 -346 -169 22 148 101 27 -330 154 -129 68 183 -274 -40 -12 115 -66 278
5761 278 174 -15 79 119 46 84 -44 221 40 -86 -85 -291 -153 -27 141 -250 151 -11 -46 570 -29 92
5783 92 117 54 -129 294 117 167 109 201 10 -96 18 154 121 291 -96 -112 12 164 -223 2 -5 157 35
5806 35 -283 -75 -172 25 -201 -47 275 175 113 -80 -53 -143 121 42 58 -69 -92 -154 326 156 -45 256 130
5829 130 338 -29 -96 -210 -274 -327 -90 29 235 -162 250 18 187 -519 -147 294 197 -113 37 -169 70
5850G0m50J12R5J74j15K6K58j22l7l4k2J02J0j4JJ84j61j44J4J91J08m84J20J89
5874G1k88N4j35J81l8K62l1j15j42n7K69R0lj24j93L47k67J56J24l64L87l87J68
5897c5K70M5m68N9J66J93j77K49m28J85j14K37k87%Q4k27L62J31l28k48K16P0
5919d5p6j25J56K69o3m6Kj48J85o6j77J0j14K84J18l00L46J3l45L30K4k25J58
5942A65k52K18j08K11j38m71K44K9j0L79k54k37pJ5L65K36l06K9N6k30M5J30q2
5965B7j32m9L22j22j27N6q9K05j54L5J45k09o4K50j21l9n7J32n9J57k28j59M51
5988A71j59Q4N3n4l01M34p0k03O3j49J88O0J1k46j35L46p4J33j70q5R9j85m7K56
6012B0k1j54n5J27L74j13m6j95j46p4M10j42J36l14J72j08M29j90k94K21k17M44
$$ plain form
5850 70 -380 -268 -173 1 -114 -88 170 48 11 -23 -45 57 67 53 54 238 77 -67 -53 138 246 -238 -118 71
5874 71 -217 -163 -298 -117 -155 107 76 -39 -181 -238 31 121 118 -6 -199 148 -119 37 161 -203 184 -203 -35
5897 -35 235 280 -188 -129 37 230 53 302 -126 59 -55 182 -105 -105 -21 -248 114 245 -83 -331 -115 -45
5919 -45 -121 -246 -90 179 116 70 72 -76 109 43 -134 -124 -238 46 164 -136 210 223 -122 208 232 7 165
5942 165 -87 131 23 234 96 -375 -131 -102 -112 267 13 -224 -231 -216 149 385 79 108 164 -66 -21 109 27
5965 27 -105 -154 168 46 -81 -25 -114 91 -63 -28 117 -92 -156 94 -27 -66 -123 9 -50 107 -121 -280 171
5988 171 12 96 149 95 -206 228 158 -45 18 -131 57 117 128 -118 -253 93 19 152 -18 -103 -4 -189 -236 20
6012 20 -1 -155 -210 -83 291 178 132 -63 -209 -283 127 -15 121 -193 -21 -129 300 110 -184 37 -180 264
6034B64k56L1l12R0J04J56j99p6p9L96J61o9j89J4MlNj15K26k55m6L97r3k79O
6059a17L42n21K36%R6k1K65m10J19j05nk95J24L70K45k3l40J01r1O6Q0q7m7l1
6083d9J09RJ0j83MK51p6q0J53l47M35j32P6k17k75M86k09l11K00M56k19j31j10
6106a50J72J0J01P9j11j42P9J43k41j98J76R3l7m4R4J44Q5k63O2k23L97k87M5
6129a6J14k37J51j21N0m0J79j42J85k82L1P7j82K68p7J54l03J04J57j33J96j51
6151a8l38L55q0L62k28p6Q3j50J1L0M6l1j14j81L25K3l6n0M0k36J24K2L37k0Q7
6176B87k88Q1r1J79m07L85N7k67k9K81k38Q4j73K95k9k64J67r2K58n74K76m5M84
6199C37n21K68l54O73l43k01J4n0R3J37k82K94j14j40L79k72p2L2j23J37R3J61
$$ plain form
6034 264 8 39 -273 -183 -79 77 -122 -198 -277 119 280 211 22 36 40 37 42 -73 153 -102 -148 249 156 -123 -117
6059 -117 225 -296 -60 -60 36 15 280 -130 -11 -116 -121 -416 -292 78 323 300 -40 61 -30 36 116 29 -18 -49
6083 -49 60 69 79 -104 -100 151 75 -5 148 -199 236 104 180 -37 -312 174 -35 -346 -146 310 91 -40 -150
6106 -150 22 32 133 212 101 -41 38 181 -60 -258 -82 11 -26 -70 24 168 253 -10 52 -171 226 -61 -16
6129 -16 98 -139 12 -109 -59 -99 80 -62 123 -159 -128 -51 -233 35 -42 112 -191 -87 70 -63 133 -18
6151 -18 -356 -1 -81 281 53 -23 60 -90 -79 -49 -3 -34 -148 -329 -4 19 -17 -67 -27 -263 -139 -117 220 200 287
6176 287 -1 80 -11 168 -239 146 203 -64 -93 188 -50 34 -139 156 127 -137 30 -62 196 -378 -102 -147 337
6199 337 -184 84 -270 403 60 -141 -127 -177 -84 53 -229 65 -49 -189 190 -82 -154 -122 -245 -108 -15 146
6221A46m7m33K29L2K18J76j89k14N5J86k86J24K08j98p0P3L22k47o1k45J37k8
6243a12R3K2j38L75j32k47J28R9j09j87J38j21M31l2k16J1M8j40M47j61p5R2k67
6266e3P8M0k0n3j70L68p2j08j48K69k14K37k14n6J43j34j02L9L58k33L44r2l55
6289a48L6j68J19J69j77K9j14K04q9J35MJ55J68l45J47jo6q5j64J75J33p6J03
6312A44J35j96k27M24k57o2p1O9L08j33j52j43L20j69j08K00j96O6L10l25j13
6333a76K55l87Q5K91Q7k81j03j83N35p5k4m8K1j3K66j9l2l21J10K22lL2n46N37
6357B30o2l59K69J72l32K24l83K88j4O3P1k84K2M0R6j78J97J68q7j53K55l20m9
6380a26J1J83M6Lj43l6j16J71k06M15j05rk9k02J88k2J78q5k75p3K84m5J0L84
$$ plain form
6221 146 99 -334 -105 -73 145 321 132 -82 -27 159 -127 -3 205 7 -63 10 332 85 24 -221 -84 -112
6243 -112 -19 3 -135 240 108 -139 -11 88 -21 -208 -70 -191 240 208 -8 3 51 -89 358 197 122 214 -53
6266 -53 25 65 45 -8 -178 190 118 10 -138 131 -83 154 -60 -116 27 -107 -209 -170 188 -45 299 207 -148
6289 -148 -112 -280 -161 8 -169 -140 -254 -50 -139 -4 0 155 323 -22 125 124 58 -27 -191 -16 117 41 144
6312 144 279 83 -144 280 23 -39 -110 -41 267 134 -18 -161 159 -10 -118 82 -114 -48 262 -63 -176
6333 -176 79 -308 -223 68 155 -126 -229 -412 123 48 24 -24 -3 -16 250 231 199 -122 -12 210 207 239 -307 230
6357 230 168 -191 78 250 -82 142 -241 47 33 96 167 -117 -95 -55 41 -137 60 228 141 -12 243 -77 -126
6380 -126 -115 68 114 117 -26 -62 -178 -7 -213 202 97 88 59 -143 45 23 201 116 -159 -232 52 7 17 401
6404D01k75k31K63rk74K07n4LJ44j57j81L19l71j7J64J78n3j32J58k1j13J53l43
6427b41J02n7L50j38j30j17J83K36j51l6L39m29J07J20k07K73k56J16l17L19j48
6448h2O4l36M30l42M23j21l36L13K5O1n9k48P6M3J82k3J12k37J32l61K48l41M05
6471B8j8q1J92j45J96r7J38N8j24j20N9j18j09M02j31j85K14k52K94m31J58K60
6493A88j29k64L02j25J3J72k8j4j96J53L05n70K31M0j5l7j37k13M25k43L71k16
6515A3J08j39p7N34o94N42m61o9L41r2L2m08L57L13J72p04L82m23L55L6M0j05
6537E3j55J76k36N96k85j14J3j22j03L23j80M4J67l38K88j48J76l89J3k5P1k6
6559b01L65k88q0M72l57O1lL6m2O8M3n9j11L04k62L21n23L43m59M53J14j65l91
$$ plain form
6404 401 126 -105 158 149 -125 82 28 31 175 18 -163 156 -215 -232 -68 110 57 -75 83 62 -51 102 -241
6427 -241 -139 -196 154 16 -114 -231 -48 188 37 1 340 -89 18 138 -69 204 -52 64 -253 66 -82
6448 -82 -18 -354 76 -266 157 36 -300 13 38 99 40 -208 -132 -89 93 70 182 -55 77 -284 -36 -377 28
6471 28 10 -71 121 -24 172 75 213 271 147 27 86 -32 -141 261 130 -55 159 -93 201 -230 -72 188
6493 188 59 -205 97 -28 -15 157 129 115 -81 72 377 -193 38 78 63 26 -111 -324 101 -142 229 13
6515 13 121 -18 -95 439 -255 287 -174 -243 98 6 38 -370 -13 300 472 -232 150 -273 82 118 158 53
6537 53 -102 74 -162 434 149 35 48 -74 -177 146 -34 10 177 -161 127 -21 155 -234 -221 -246 -175 -201
6559 -201 164 -124 -204 268 -89 -28 -31 5 -37 31 74 15 -96 208 -54 267 -256 87 -372 81 195 30 -361
6582c61L91R9O7p17O25J31o10J67K97Q9k83L63l23J0O7J21l41K0K78L1k01Q4j54
6605a50J22k04l2L56j85P0M8J04j19J23J38j76J30l34p5N1J16o6M1j19K68j78
6627g1J52O7r9k76jL4P0J56m2j66Q1N5R5j37J14j56j4j44K46K9l7q0L6K00n1R0
6653A51k58k0J70k82J44L03l15K06m16O19l73j13L77k39mj43J74k74L94J91K6
6674C18m83J39k38O5oJ57M3RJ30j42mK40j58k59Q2L6L29l86mK93j43J99j64J49
6698B02k67J88j42j07R0K62k97j0j04O0M15l42n9R7K25pk25J5o9nj9K27j14J46
6722A60j47J98k62N8o8J87r9J3p8l5K98k60l1Q1j15N2K63n3k14R3j08k59O36j79
6746A31n4j85K77p0p1M9J67m21J51k0K9l1o5Q9k65L08N4m37M79L01n32J65p7P0
$$ plain form
6582 -361 30 129 196 -521 104 235 -375 -208 89 178 -105 258 -65 -55 12 133 -208 -188 90 121 -80 4 -150
6605 -150 -28 -232 -264 92 -93 -23 25 129 10 133 271 95 225 -109 -184 -133 -17 -83 -42 -161 107 -71
6627 -71 81 148 49 -227 -228 -194 -124 32 -10 -176 -95 -40 55 -82 32 -124 -138 -282 -36 -7 -44 -124 -88 112 61 151
6653 151 -107 -127 43 -239 -95 208 -107 99 -317 302 -71 -184 193 -46 -50 -193 -19 -293 101 292 318
6674 318 -165 -26 -264 -199 -205 -48 -5 4 134 -8 -12 228 70 -189 -107 -71 258 -128 -132 161 18 217 53 202
6698 202 -65 123 -19 -126 -36 226 -71 -81 -185 -125 290 -52 -111 -14 211 204 -21 -6 -75 -80 -99 128 14 160
6722 160 13 211 -51 7 -61 126 27 40 -38 -73 225 -35 -66 15 -100 -48 215 162 -52 41 -67 -326 310 131
6746 131 77 -108 169 99 28 77 244 -177 -26 -46 -17 -48 -113 -24 -289 19 73 -364 115 416 -116 49 -28 42
6770D2j66J96rk6l2J58l01P5k8N9j49J9L19o9k20j17jK63m8Ln4m0j25K31q6K49
6796A43l38J13j9m0J98p3J4j09Q6q4K28j52j6p8N39n63M1L85k34m8J51J53l41
6819d4N9j29l2k5M21m46m8L30k70K58j02q1k34N03j22j14j79k1N76l21j2K2P0
6842E9L4j84K76L0l21L2k5R2j3N5p7k1J83j10l35K45J12Q8k55J74n9pJ37j39p8
6867a07J53J6j04M60p8j51m87K77K0k09K11qK12J11k03j56q1PQ6K49k40p2J07
6890A3L9m4J76r7l37O08m07q1K56p6k28K20j98L17J0j54Pl24O82m01j12k07L59
6913B1K08m28L94m64O00m19K12J4n10L31p0K9M3j14M36m90L83k75Q6j16jK8m2
6936a44J3J32J4l3J0J22K88k35o0M9L56m51M2m7j31J19K27l13j35M4P3J20j85
$$ plain form
6770 42 -124 72 63 37 5 163 -138 -63 -91 -32 -181 -162 157 88 -132 -249 -250 13 -35 -32 -86 -126 -251 -20 -106 143
6796 143 -195 -82 -101 -141 57 -16 -2 -111 -25 -109 119 -33 -49 -127 412 -151 -110 275 41 -7 144 297 -44
6819 -44 15 -114 -146 -171 250 -196 -244 86 -184 74 -28 -109 -343 160 38 -76 -255 -276 300 -21 -33 -11 59
6842 59 93 -91 185 215 -106 -74 -99 -7 -20 35 -42 -63 120 10 -325 -80 32 120 -135 39 -20 -27 110 -29 -107
6867 -107 46 62 -42 418 340 189 -298 -21 -1 -210 1 -7 205 316 113 -43 -124 -117 -31 218 -22 -94 13
6890 13 52 8 184 87 -250 358 -49 -130 126 50 -178 42 -156 161 171 17 24 -300 382 -19 -131 -338 21
6913 21 229 -199 195 -269 331 -88 124 138 -372 -41 -111 -82 -39 -153 283 -207 176 -99 -13 -129 -130 -102 -144
6936 -144 -131 1 15 -18 -8 114 402 167 107 156 512 61 103 56 -75 44 271 -42 -177 -133 -60 60 -125
6959a25j87K50J70n9q8J09r5J65k18J7J82k08K74n20M31j50J26j45J01p3J54p0
6981D1J92k84O8J02J82j31r3j84r0J26J65P6m62J69J05L15k12J14l10K39l99J81
7003i0J72o6Q8j83J43l13N87o0k22j27m8K1J86l4r1q2K44l23K7K77P6j11J64l14
7027g9o3K00m8k1J98k34R7J74k82J35Nl10J25J13N2m0m8j0j53L29j37K72j41J61
7051B95l30J57J24k72j32M9L59q5j87M1K6o6J59j35Q8l3q9q2J94r6O4J91L0l00
7075c0p1J11K36l21K96l32L7J55N3J37j04j55l5L7R7k95J02p4K12K67l89K12l00
7098a54J28j76K18l43O00m56j1K10j20j3J75J90j85n0l13J61J55R7j5l4l02K72
7120C4J09j6r1k32L0P2J86k07N6RJ09J51j76p6J15J07j51R4m97M40K53m12J27
$$ plain form
6959 -125 -312 -62 108 49 -39 70 -25 140 -78 -61 121 -87 187 -333 98 -52 74 -71 30 -43 111 41
6981 41 233 -51 17 119 301 170 77 -107 -197 -71 94 170 -292 -123 -18 297 85 199 -111 128 -271 -90
7003 -90 82 16 104 -79 64 -249 338 278 56 -71 -119 -98 88 54 -37 -119 125 -198 -171 106 182 71 235 -79
7027 -79 -142 58 10 -11 187 -47 50 224 -58 77 82 -228 -103 10 62 22 -26 -36 -189 140 3 275 134 295
7051 295 -35 122 246 -26 -158 -109 250 165 -22 19 45 -21 138 3 91 58 -31 -113 81 -15 49 240 270 -30
7075 -30 -101 10 246 -75 221 -111 -74 81 134 271 167 12 -23 14 111 -184 -82 -156 56 323 -66 146 -154
7098 -154 -26 -202 16 -327 273 -183 -194 16 -104 -117 58 248 63 13 -300 -139 16 113 98 64 -238 34
7120 34 143 127 36 -196 -166 -94 92 -115 -59 -50 59 210 34 -42 73 180 29 123 -374 66 319 -93 34
7143C4J65q3j84k1n0L18P5m99R4L7K39J43k58Q3l27L32k14K21j07R3k2j97K25
7166I7K9j83N3j03j01m9J46K41M6rj46J23j43K62j12L2k17Kj32J65J09p2j60J00
7190b2o7L41l55K58k31K85n52L86l35M94m23J80N9K62k52l46L15j73L28k2j29
7211Am7O4m34N67j94r1j38K70J64l60RJ08P3j19j6J35l81K28k43L99mJ13N1j01
7235E4M54l70M5p1k55L43k02k53P4K47K0j7pK05j91k55K42k43Q4k91O35j28J22
7258B42n92N23n7k94J50M6J03l14J53K0K24J5j83K2J12k37l9K76l60J03K56j33
7280C6l43M11j13N7r2L2K4r8L0K63m43M76k00k45L17j91n5OM36l71K47M0l28J16
7304A2kk32L67k14L07j76o6J7k34L21m1l09J17J21l09L93j16l75M75j38k2K76
$$ plain form
7143 34 199 116 -68 -89 -139 179 254 -245 -151 -114 125 268 10 93 -234 98 -116 105 -2 91 69 -128 97
7166 97 126 -57 -4 -107 -208 -257 -111 130 176 167 21 144 1 263 151 183 -34 -32 -164 1 110 38 -122 -22
7190 -22 -89 252 -103 155 -76 209 -343 43 -292 202 -221 -41 18 280 28 -318 -3 -176 152 130 1
7211 1 -46 18 -416 151 -43 -134 -272 -2 162 -198 -189 -81 -8 -127 -143 -8 -389 -161 -404 -5 -9 104 155 54
7235 54 508 138 183 112 -143 200 -2 -255 -181 66 86 69 62 267 76 -179 63 -180 -96 -387 248 120 242
7258 242 -350 173 116 -178 -28 18 121 -193 -40 -20 204 219 36 58 170 -67 -106 170 -190 -87 169 36
7280 36 -307 104 -9 48 -44 -12 12 -86 -56 207 -236 240 40 -205 112 -79 -134 -128 308 -63 184 224 -104 12
7304 12 10 -222 145 -69 238 62 -4 13 -221 100 59 -250 -133 -12 -321 72 -44 -419 56 -82 -104 172
7326A72j66p0L6K66k32R7k29K41J14j47p2pN5L1k97K9R4O3K89j41j08J8k9K2j87
7351a58R8o9q5J74J97P3k42J6J68J62k76j39L90k02M7j15l1O1L8J3j46m7M1J42
7375A10k42m3J28j87J28j57Q4K54q2J45j92j68q0L51R9l6N2k90j09J31k6j2J86
7398D4ko1K20j73K03j34j35o8J03j40r0J54m4J07k23J69P7j99N11o50M10Nk5k2
7422C7j6jj12K21l44K58m34J52L26o9qK45l36J07o7p3R4m0oK73j10l58L62q5j44
7447a28L88l71P0J07j50J24jq2j01l5N98k93j11j18J47r8l9J2K64j55J41l11K15
7470G3n7l09L06r1K73j92k88L61j75J39J82o3j72R9j35j81N27l78j38N43n05J91
7492A0K7L3q7k21J62kK17k77K47j47J12j00J8J34n6k67O4K58k0L53o68K91j21
$$ plain form
7326 172 6 -64 -28 238 6 103 -126 115 229 82 10 3 58 89 -208 -179 -85 -22 267 126 18 36 7 29 -158
7351 -158 -60 -129 -214 -40 157 230 -12 4 172 334 58 -81 309 107 154 39 8 69 107 120 -26 -73 -32 110
7375 110 -132 -175 -47 -234 -106 -263 -179 75 -7 138 -54 -222 -302 49 148 112 164 -126 -235 -104 -130 -142 44
7398 44 42 -19 201 28 231 97 -38 -106 -3 -143 -233 -79 -123 -16 -239 -70 7 -192 319 -331 79 84 59 37
7422 37 21 20 -92 129 -215 43 -391 -239 87 18 10 255 -81 26 -41 -114 -20 -60 -66 207 97 -261 101 16 -128
7447 -128 260 -111 -41 66 -84 40 39 -43 -144 -179 419 126 15 -103 44 -54 -93 -81 183 28 169 -142 73
7470 73 16 -293 13 -78 195 3 -285 76 -99 40 222 159 -13 86 -49 -230 297 -81 -219 324 -181 10
7492 10 37 70 -17 -238 -76 -78 139 -138 109 -38 74 -26 -8 126 70 -197 -133 125 105 458 -210 81 -40
7515d0N5K34m40L19j86J75j8J6k09K77j72n7M2j33L97m56O7J75J49l3j45K38j99
7538E6O3j05K57l72O5J54k93K52L19l25l54r1L51K39o0j88j25J76J39l3J7r6r3
7561d7K2K79j80j92R7j2j04M6K27l02M44k63J13j04l06J00J7m7L80k67J23J5J22
7584A61k65K49j28l02M67Q7j54pK11q9j57p6j9k44j13M29J01l19j22K11j40J57
7606f2j2K65J01p07M28J85l03K11j94K45J66m85R6J98J4pj59j10J59J38k74k48
7628c55K55K42l62L09o3n2K72k23k9j16J93l58L92l23L48l3j35p4l0P6K39j46
7650B7k03k23J22K79L02j00m60K56J0O7j7J26m65N68l82K03l28K51j58M05l70
7671i0K33n9J46k72j86L0L89N0j91K6lL43k75K01o8n64J46K33j56J66n7K55j05
$$ plain form
7515 -40 15 249 -191 128 -58 117 99 115 -94 183 11 -46 -4 -137 260 -196 -129 46 195 162 17 255 56
7538 56 119 14 271 -101 -36 118 -175 77 396 71 -283 -374 -23 216 156 -32 -157 19 158 125 142 46 -47
7561 -47 -25 254 74 -118 -21 -33 -137 -91 136 -166 278 15 128 24 -282 -182 -165 -212 168 -99 24 39 161
7584 161 -104 145 17 -285 182 269 115 108 319 230 73 -3 -22 -266 -379 50 151 -168 -290 -79 -219 -62
7606 -62 -74 191 292 -415 13 198 -105 106 -88 157 323 -162 -66 132 146 139 -20 -130 29 167 -107 -355
7628 -355 -100 142 -220 89 26 -26 246 23 -6 -122 71 -287 105 -218 130 97 -38 -112 -142 -66 173 27
7650 27 -176 -399 -277 2 304 204 -256 0 10 77 60 186 -279 289 -93 110 -218 33 -125 280 -90
7671 -90 143 84 230 -42 -228 -198 191 241 50 76 73 416 141 342 274 -290 -144 89 -67 99 42 297 192
7694A92j56kj40K23k37j9J26k20M21l7q2j06k22L40m91N01j26J99l24Q6J81j25
7716a8n1J46J03J3j3K49l55j58K26j66K37j32k6k7K13k19j29K81j29l58N01k76
7738h8m1j4K0k21N92k36j72J87k40K05o7m5RK52k10k2P9K4J41j71k42L09J2r3
7762c2o8J7J74R5j2j94K06k41j7N16l37Kl6q7q1L4P7L7k02R3r5M28m04J06J22
7787A01Ql10L84j55J35l04J88Nj76M07l85J03j3K27k15L3m8j31L05O5k47m2J50
7810H5L7l9j22l1k37N63k10l30M27k20L03l48k06O24m56P4N6o6j25K02J20p1q0
7833e0M2J2j26J62r4J89k56P4O3k03J50k23J60K36N3k71o4q4K38j17J73j48j19
7856b03K61k49R4j9J35n7K21k47rq4J29J6m6L11l58K28m7l8q0j55J23j05L97o3
$$ plain form
7694 192 36 34 -106 117 -120 -139 -13 -233 188 151 69 -37 -259 81 -410 91 -35 164 -160 -74 107 -18
7716 -18 -69 77 180 193 180 429 74 -84 142 -24 213 81 55 28 241 22 -107 174 45 -313 188 -88
7738 -88 -129 -143 -123 -344 248 12 -160 27 -213 -8 -75 -120 -111 141 -69 -91 -12 12 153 -18 -260 49 61 -32
7762 -32 -100 -83 91 186 174 -20 186 -55 -72 444 107 109 73 -14 -95 -61 16 53 -149 -56 -151 277 -127 -21 101
7787 101 109 -201 183 28 163 -141 47 52 -124 283 -102 1 -12 215 0 33 -15 -146 159 224 -23 -65 85
7810 85 122 83 -39 -70 -307 256 46 -284 143 -77 226 -122 -328 296 -160 -86 -30 -96 -221 -19 101 30 -50
7833 -50 -8 4 -122 40 -54 135 -121 -47 16 -187 -37 -260 -100 136 189 -82 -146 -230 8 -109 64 -84 -203
7856 -203 58 -191 -97 -116 19 -38 183 -64 -73 -157 -28 -12 -58 253 -105 123 76 38 -42 -197 -74 -179 218 155
7880A55l89L27j28K37l26r5p6K36K25j23l29K68j81J97k89K57k1Q1J29l50M01
7901B06k8l0j65J44J05l31L1m0k9K38jJ49n32M59k7j65n7Q6j61r4N44o79M70K26
7925C19l28k66K80J14l31J18Q0J97n78L45J88l37K14k63N6N4M01n20M91O0K4k31
7947H7n5M7l36K03K49k16J43Q0k7j15k50J39K00qj77PL0K08K8n8o8k00K42K71
7971D24n88K79j69J26k37L23l44M0K50j43k20J91J40J28l7l08J48J06j41rJ69
7992A28n2M40k12j1m33J68l1N0j83L65m83K33l0j61M75k84k97O93j07l70J47k30
8014a85M13j47r3j39J37o1J03J87K06m85M7j91K93L0k56L46l23M28l51n2R4j50
8036a49J06Rj28K71o2K50j27l12p2J9J03j53mJ47kK64k9j65j7O8o0M5k2k8q1j16
$$ plain form
7880 155 -234 93 -35 202 -124 -219 -295 -59 166 43 -286 -18 -199 -2 -291 -34 -55 26 155 -195 206
7901 206 178 148 -17 127 232 -99 -68 -108 -137 101 100 249 -283 176 149 -16 -73 13 -148 -242 302 -377 93 319
7925 319 -9 -275 5 119 -212 -94 -14 183 -395 -50 138 -199 15 -248 -192 -138 263 -257 234 294 318 87
7947 87 32 79 -257 -54 195 -21 122 202 175 60 -190 -51 149 141 -36 -29 1 209 237 179 111 -89 153 424
7971 424 -164 115 -54 72 -165 158 -186 -146 104 -39 -259 -68 72 200 163 -145 3 109 -32 -41 128
7992 128 76 516 304 293 -140 28 -3 47 -136 229 -254 -21 -51 -212 263 -21 -318 375 268 -102 45 -185
8014 -185 228 81 -12 -151 -14 -75 28 215 421 -64 -17 -208 85 115 -141 205 -118 310 -41 -93 1 -149
8036 -149 -43 -34 -162 109 47 297 170 -142 -214 -195 -92 -245 -249 -102 -104 160 131 -34 -51 17 -43 2 -20 -48 -129 -245
8062b45J84m5J50K86l08P9j83j94M51j65K97l45jM0j70K85k23J52K00j59p8n2
8084d4J40O9O3l91M3K00k70m2M35l24J95j34O1K62j72m9k85L92j11o1r3J30J01
8107A15J7j14J57Pk43L8j47L28L2k32J09j96J38J35rj87M63l23k06nk5J84j9M6
8131F3k8L9K24m96K31k53J80J7j06J13j7J55j83K68j15K4j68L06l01l8J10P2Q2
8154A79r0j61j80M10k64J53m01N02n6O7N5k85K74l54P8p7j07K88K6no7J77r2j78
8178a08P9M43m87O2K47n29K35o8J76Q1j01j14J46
$$ plain form
8062 -245 -61 -106 44 330 22 101 -82 -276 175 10 307 -38 -39 1 -169 116 -107 45 245 86 8 -44
8084 -44 96 165 228 -163 -120 80 -190 -232 203 -121 74 -60 1 263 91 42 -243 149 38 -23 -116 14 115
8107 115 132 18 175 182 -61 -23 -170 158 190 -42 67 -129 9 144 135 -52 411 88 -118 -123 -148 36 17 63
8131 63 35 74 298 -198 33 -220 -40 -23 -129 -16 -33 122 -61 207 92 116 -52 254 -47 -85 25 97 179
8154 179 89 -72 -252 158 -106 47 -354 148 92 159 214 -71 203 -151 -73 -150 -257 31 57 52 -15 162 70 -108
8178 -108 -29 414 -73 -11 236 -293 -58 -126 50 131 30 -84 62
8191F2
$$ Imaginary data points
##PAGE= N=2
##DATA TABLE= (X++(I..I)), XYDATA
0@%%%%%%%qJ6j6J6j6K4l2L2m0N6o4P2q8J04j20J37j61J85k09K41k74L11l53L98
31B11m48N04n65O28p00P81q68R64j069J186j312J451j607J780j976K195k441K723
49A437l049L432l889M444n135O028p226Q928j1566J6242k7029R9170K0275j86050
63h3988k3239O4903J14199L8333q2801j33266M926J17511R6509l8661j17615p0697
75a13886O2401J18250M8231r0429j20433l828J12964Q8077k3404j11604p8403
86a12064N2927J28382M1022q9659j06488m346R1741R2251j0463j13651q0936N6441
98e4843J16889L9164p1942j06842k0412R9029R6345k0842j06237p1698M4926J12631
110E6168M3602p3588j00024j5760Q7496R1011j5688r6851o7835L2316J04911N5589
$$ plain form
0 0 0 0 0 0 0 0 0 -8 8 -8 8 -8 16 -16 16 -24 32 -32 40 -48 56 -64 73 -88 97 -112 129 -145 166 -187 211
31 211 -237 267 -298 330 -370 411 -457 507 -562 624 -688 763 -844 936 -1040 1155 -1286 1437
49 1437 -1612 1820 -2069 2375 -2760 3268 -3958 4970 -6596 9646 -17383 81787 102062 -83988
63 -83988 -107227 -42324 71875 110208 27407 -105859 -100933 16578 113087 74426 -43189 -113886
75 -113886 -51485 66765 114996 24567 -95866 -99694 13270 101347 77943 -33661 -112064
86 -112064 -59137 69245 110267 20608 -85880 -90226 1515 93766 83303 -30348 -111284 -54843
98 -54843 62046 101210 29268 -77574 -97986 1043 97388 76546 -29691 -101389 -56463 56168
110 56168 99770 26182 -73842 -89602 -2106 88905 73217 -23634 -91469 -59153 45758 101347
122A01347p1181j03487j1185P9224Q4310j252r6372p5874L9188J00932M6036n8652
134C3034r7623k2147P9559Q6307o163r0397o8914L1687R3229M9328n0565r6159
146e8824k8319P7568Q7539o714q8180o6060K9507Q8790M8900m7312r3214k6872
158h3191P3694Q1195l945p8045o7784K0822R1067M9663m9870q4734k6285O1714
170a5699Q3467L072q1571o5872K3541Q4265M7358m4582q1929k6190N7576P9327
182F2763O883p8252o5131K3458P7383M6335l5440q2777l0812N9959P6444L908
194F4721p0312o3754J7095P7678M8029l7883p8931k7035N5159P0610P403o4893
206b113o4586J3325P7264M7186l7208p4372k6710N0243O9446J0236o3063o4255
$$ plain form
122 101347 30166 -73321 -84506 -5282 79028 77776 -18596 -94470 -55282 45650 91686 33034
134 33034 -64589 -86736 -7177 79130 72967 -17430 -86344 -54657 38572 87900 37335 -58824
146 -58824 -87143 -9575 77964 71250 -16930 -82990 -53483 35307 84207 36895 -56319 -83191
158 -83191 -9497 71698 67753 -10292 -78076 -57254 33813 83476 33606 -51128 -77413 -15699
170 -15699 67768 70840 -10731 -76603 -53062 31203 78561 33979 -47950 -74140 -16564 62763
182 62763 69646 -8606 -73737 -50279 27104 73439 37999 -44778 -75590 -15631 60813 64721
194 64721 -5591 -69345 -52250 25428 73457 35574 -43357 -70392 -15233 55377 62780 -2113
206 -2113 -66699 -53374 23890 71076 33868 -40504 -67214 -16971 52475 62711 -352 -64607
218f4607J2836P4841M4358l3980p0111k9295M6430P1734Q944o3097n7904J0397
230d9454O6872M8376k9263p3213k8973M7461O7426R784n8819n7840Q817O4970
242A6144M7905k7092p2172k8852M7190O2964R898n3423n8095O129O5017M6392
254F2005k6738o6855k9325M0511O4679J3028n4278n8194P588O2191M4285k3774
266C5123o4247l1522L9942O4971J1480n3226n4729N911N9385M3122k0333o3187
278b7310l2230L8475O3409J2040n0753n3183K905N7348M6284k1921o3114k8385
290e6435L5889N9019J5002m7514n5349L253N6983M3339j9509n9391l0308L2927
302b2094N8739J6974m6350n5860K475N6636M2150j8716n7089l1318L2168N8987
$$ plain form
218 -64607 -51771 23070 67428 33448 -36663 -65958 -19528 52206 61150 -1947 -59851 -49454
230 -49454 17418 65794 36531 -36682 -65655 -18194 49232 59016 197 -57643 -48826 16144
242 16144 64049 36957 -35215 -64067 -16877 46087 55985 2562 -55533 -49404 15613 62005
254 62005 35267 -31588 -60913 -20402 44277 57305 3027 -55167 -47579 14612 58897 35123
266 35123 -29124 -60646 -20704 44267 55747 2521 -52208 -46297 13088 56210 35877 -27310
278 -27310 -59540 -21065 42344 54384 3631 -49552 -46647 10701 56985 35064 -28050 -56435
290 -56435 -20546 38473 53475 5961 -49388 -46135 10848 54187 34678 -24713 -55021 -22094
302 -22094 36645 53619 7269 -48591 -46116 10520 52670 33954 -23135 -54453 -22285 36702
314C6702J5439m5741n2084J153N1860M3908j5613n7873l1653L1892N6768J5696
326E0454m1934n2468k154N2643M4837j6182n7107l0011K9970N4947J6667m0240
338I422n1611k798N0917M4108j5579n4336l0434K6533N4974J9186m0289n2598
350d2505j496M9015M1891j1702n3050l2884K6525N5205J7703l8966m9382l296
362d2942M5784M2872r532n2527l3683K5643N3898J8301l6610m9313n669M5359
374A581M3997r777n2264l1522K4193N1067J9760l4347m9984o363M5278M2266r578
387C4307m8345l2197K0416N1316K1754l4558m9259n687M3191M1231p457m7295
399a2583l3537K0424N0774K0949l3657m6548o821L9338M2340m429m8050l4009
$$ plain form
314 36702 52141 6400 -45684 -44531 7329 51237 35624 -22249 -53902 -22010 34758 50454
326 50454 8520 -43948 -46102 6541 51378 35196 -21911 -51922 -21952 32995 49662 9422
338 9422 -42189 -44987 5930 50038 34459 -19877 -50311 -23778 31196 50382 10093 -42505
350 -42505 -44001 5014 46905 35203 -17847 -50731 -24206 30999 48702 9736 -39646 -42942
362 -42942 2842 45714 36182 -16345 -50028 -24385 29513 47814 11204 -38109 -43778 1581
374 1581 45578 35801 -16463 -47985 -23792 27275 47035 12688 -37296 -43659 1619 43885 34307
387 34307 -14038 -46235 -25819 25497 47251 12693 -36566 -42253 938 42169 34712 -12583
399 -12583 -46120 -25696 25078 46027 12370 -34178 -40999 -1661 40679 36250 -11800 -45809
411d5809K0779M8677K0793l0369m6653r896M0438M3032o105m7044l1240J8536
423b4861M6460K1915k8175m6977r941L9339M1527n145m3540l2596J5431M7019
435B0456K3710k8302m7186q797L7200L9818k262m2266l4897J5797M7542K1394
447D2207k7491m3002j1179L4197M1177l33m2890l3814J4966M4680K2523k4762
459A6279m4123j2114L4583M1098j241m1550l1816J2716M2848K3838k3110m4716
471b7308j1973L4034L8961k73l8093l3124J0050M3913K4870k4244m3070j1672
483c7929L1673L8359K237l8106l4323J1075M2864K3422k2321m0956j3607K9463
495h149L9786K839l8716l2826J0656M0291K3634j8955m1290j5648L0430L9853
$$ plain form
411 -45809 -25030 23647 44440 14071 -32582 -42478 -2040 40992 34887 -12157 -43397 -24861
423 -24861 21599 43514 15339 -31638 -41579 -2240 39287 34142 -9398 -41994 -26563 20456
435 20456 44166 15864 -31322 -40119 -2919 36899 34637 -7629 -42526 -26729 20813 42207
447 42207 14716 -28286 -39465 -5268 35909 35576 -7314 -41128 -26162 18518 41041 16279
459 16279 -27844 -39958 -5375 35723 34482 -7068 -38884 -26168 16680 40518 17408 -27308
471 -27308 -39281 -5247 33714 33441 -4652 -37776 -27726 16187 41057 16813 -26257 -37929
483 -37929 -6256 32103 34340 -3766 -38089 -27014 15850 39272 16951 -24005 -37612 -8149
495 -8149 31637 34476 -4240 -37066 -26410 13881 37515 18560 -22730 -38378 -7948 31905
507C1905J028l6720l1211Q809L8373K5616j8715m1564j4630K8936L7954K945l3967
520a241l3010O798L9776K5408j9276m0392j3913K7214L6730N295l4262l3635P335
533b7173L9074K3690j7414l7544j6238K5230L8458N291l4295l2860P030L7410
545A0659K4416j5271l8844j6342K5301L7381M511l1902l1100M499L5830K5930
557C5068j5524l8175j5895K4726L4968O288k9699l2839L111L6755K5948j5875
569A8857l6782j5414K2563L4878Q298l0476l2672M163L5070K4129j3021l5762
581a6169j7489K1623L5907P903l0174l1140L294L2606K5862j1437l6194j8439
593c3847K2532L5054O432k7286l0384N95L2533K6253j1271l5954j7121K0616L3755
$$ plain form
507 31905 32933 -3787 -34998 -26189 12184 37800 19085 -22479 -37109 -8173 29781 32726 -1241
520 -1241 -34251 -27453 12323 37731 18455 -21937 -35850 -8636 28094 33389 -873 -34508 -27173
533 -27173 11901 35591 18177 -19367 -35605 -10375 28083 33374 -921 -33781 -26751 10659
545 10659 35075 19804 -19040 -35382 -10081 27300 31811 -91 -31191 -26692 9138 35068
557 35068 19544 -18631 -34526 -9800 25168 31456 1757 -31082 -27971 8784 34732 18857
569 18857 -17925 -33339 -10776 24102 32400 1924 -30748 -26585 8485 32614 19593 -16169
581 -16169 -33658 -12035 23872 31775 1601 -29539 -26245 6361 32223 20786 -15408 -33847
593 -33847 -11315 23739 30171 2885 -27499 -26904 5629 31882 20611 -15343 -32464 -11848 21907
606B1907Q342k5856l1712N1L2933K5920j1462l4056j7630J8137L4469J0126k7186
619C983l1097R95L0896K4829r138l2742j9195J7636L4281J0164k6215l0401N2
632b5952K9497K5420p624l3544j9147J7876L3022R797k4098l0132j465K9118K6167
645B8935p907l2535j8618J6448L2140J0794k2560l1002k307K9627K5417q355l0330
658a0253j8638J4374L2018J1621k2667l0386j929K8042K4915o622k9931j9474
670b8930J3771L2255J2033k2767k9316k566K6342K6313n436l1106j9122J4514
682a4015L0475J1341k0457k9069l938K6101K5813n190l0294j8688J3745K9097
694A4921J2476j9448k9256m577K6265K5271n031k8038j9961J2416K9696J2312
$$ plain form
606 21907 30249 4393 -27319 -27268 5665 31585 20123 -13933 -31563 -13426 21043 31169 3983
619 3983 -27114 -26119 4777 29606 20468 -12274 -31469 -13833 20448 30612 4397 -26004 -25952
632 -25952 3545 28965 21341 -12203 -31350 -13474 19548 29345 5247 -24885 -26350 2768 28935
645 28935 21028 -11507 -30125 -13677 18463 29257 6697 -24305 -26612 3015 28432 20077 -10253
658 -10253 -28891 -14517 17501 29122 6455 -23931 -25860 2182 27097 20475 -9456 -28930
670 -28930 -15159 17096 29129 6362 -22954 -25520 822 27135 21699 -9407 -28529 -14015
682 -14015 16460 27801 7344 -21725 -25663 438 26251 21061 -9233 -27921 -14176 14921
694 14921 27397 7949 -21307 -25884 381 25652 20621 -7417 -27378 -14962 14734 27046
706B7046j9028k8497m865K5246K4274l333k7499k0802J2006K9956J2453j9008
718G949k7359n355K3415K5427k606k7868j9984J1179K8883J2699j7676k7320n851
731b4467K2439K5379k341k7026j9564J0171K7350J4238j6732k7939n976K2567
743a901K4332j988k5750j9696R199K7687J3730j5985k7597n817K1935K2835j83
756B0801k4801k0972Q885K7459J3829j5268k6875o824K0926K4218r16k4524k0072
769b4134Q438K6631J3438j4046k6378p766K0260K4514m86k3995j9308O669K5776
782I613J4849j3955k6489p531J9880K4033K0k3579j9382O817K4719J4984j3424
795A0555k5922p435J8344K3679J252k2901k0268O670K4976J4269j2492k5102q260
$$ plain form
706 27046 8018 -20479 -25344 -98 24176 20843 -6656 -27458 -15452 14504 26957 7949
718 7949 -19410 -24765 -1350 24077 21471 -6397 -26381 -15202 13681 26380 8704 -18616 -24467
731 -24467 -2028 23351 21010 -6016 -25580 -15409 11941 26179 9447 -18492 -24468 -1901
743 -1901 22431 20443 -5307 -25003 -15804 11883 25613 9628 -17969 -23786 -1851 20984 20801
756 20801 -4000 -24972 -16087 11372 25201 9933 -16942 -23766 -2840 21378 20462 -4062 -24134
769 -24134 -15696 10935 24373 10327 -16051 -23817 -3557 20957 20471 -3524 -22832 -16163 9613
782 9613 24462 10507 -15982 -23513 -3633 20400 20420 -3159 -22541 -15724 8995 23979 10555
795 10555 -15367 -22802 -4458 19221 20473 -2428 -22696 -16026 8950 23219 10727 -14375 -22635
808b2635J8026K3420K059k2890k0155O386K4233J4134j1507k4591r061J7887K3480
821A8786J050k1595j9388N041K3489J5146j1533k4383r069J7456K3173J511k0612
834i28j9574M133K3590J5241j1281k4197q496J6263K2331K822k0309k0193L916
847a6682K3769J4950j0839k3365r274J5383K2570L632k0413j9875M199K2180J4763
860B0998r447k3128r992J5788K1844L451j9526j9220L222K1349J5453q709k3570
873a1487r918J4861K2270L304j8207j9214J674K1507J6556r507k2459r746J3748
886f618K1534M376j7650k0406K328K1254J5840q712k1751j0504J3208K1433N013
899A9345j8265j9184K158K0082J5145o867k1809j0869J2636K2044M790j7714j8565
$$ plain form
808 -22635 -4609 18811 20870 -2020 -22175 -15789 8444 22578 11071 -13520 -22581 -4694 18786
821 18786 19836 -1759 -21147 -16106 7383 22529 10996 -13387 -22456 -5000 18173 19684 -928
834 -928 -20502 -16369 7221 22462 11181 -13016 -21512 -5249 17082 19904 -405 -20598 -16682
847 -16682 7087 22037 11198 -12167 -21441 -6058 16512 20144 -269 -20144 -15945 6235 20998
860 20998 11551 -11577 -21569 -5781 16063 19514 -12 -19232 -16010 5339 20792 12083 -11487
873 -11487 -21405 -6544 15726 19030 823 -18391 -16717 4790 21346 11839 -10620 -20366 -6618
886 -6618 14916 19292 1642 -18764 -16436 4818 20658 11946 -9805 -20309 -7101 14332 19345
899 19345 1080 -18104 -15946 4136 19281 12414 -9395 -20264 -7628 14416 19206 1492 -17073
912a7073Q59J9747J5873o801k1882j1003J2921K0992M966j6073j9486M72J9918
925C430J5985p379k0706j0656J1340K0694N833j5884j9376M29J9337J5548o603
938A1992j9809j1233J0893K0916N788j6029j8840L54J8598J5179m930k0424j1882
951a9427J1409K0143N974j4962j8350q36J7677J6088m555k0511j1413J0730J9385
964A1352O335j4045j8645j382J8222J5830m980j9516j1107R626J8866P292j3972
977C876j8856o56J7078J5292l786j9052j1992R096J9986O869j4442j7567j373
990a5527J6729J5340l617j9081j1651R219J9074O655j3132j7391k533J6235J5936
1003A6256l549j8051j2021Q606J8367P429j2195j8067k526J6043J5635l300j7610
$$ plain form
912 -17073 -16214 3533 19406 12605 -9277 -20280 -7359 13633 18599 2526 -16960 -16488 3430
925 3430 19415 12036 -8670 -19326 -7986 12708 18541 2657 -16719 -16290 3047 18595 11992
938 11992 -7817 -19050 -8157 12759 18547 2518 -16322 -15968 2630 17809 12879 -7545 -19427
951 -19427 -8018 12125 18099 3137 -15213 -16049 1628 17716 13161 -7350 -18763 -8033 11352
964 11352 17687 3642 -15003 -16385 1837 17667 12687 -6829 -17936 -8310 10556 17848 3876
977 3876 -14980 -15636 1442 16734 12948 -6104 -18096 -9000 10986 17855 3413 -14154 -15527
990 -15527 1202 16542 12925 -6156 -17807 -8588 10486 17141 4009 -13382 -15915 320 16256
1003 16256 12707 -5344 -17365 -8759 9608 17037 4842 -13225 -15751 292 15927 12627 -4983
1016d983j1630P233J8146Q346j2338j7940k252J5311J4781j705j7182j2521P289
1029i445J8754P526j2094j7032k844J4642J5033j408j7591j1915P041J7850P454
1042A5971j0813j6813l598J4461J5322j673j7099j1604O486J7211Q005j0381j7229
1055a1754l370J4235J4980j817j5709j1862N634J7194Q282j0393j6537l199J3122
1068a194J4847p13j5845j2451N624J7538P796j0159j5971l932J2754J5218l61
1081A3151j6138j1989N805J5826Q452r104j6154m356J2598J4956j03j5254j2510
1094a4820N071J6267Q793r159j6160m390J2565J4556o65j4677j1383L952J6314
1107F264Q564q750j5881m313J1966J4522K16j4136j2509M028J6327Q734q936j5602
$$ plain form
1016 -4983 -16613 -9380 8766 17112 4774 -13166 -15418 -107 14674 12969 -4213 -16734 -9445
1029 -9445 9309 16835 4741 -12291 -15135 -493 14540 13132 -4459 -16374 -9333 8517 15971
1042 15971 5158 -11655 -15253 -792 14530 12857 -4242 -15846 -9360 7851 15856 5475 -11754
1055 -11754 -15124 -889 14091 12274 -3435 -15297 -9663 7531 15813 5420 -11117 -14316 -1194
1068 -1194 13653 12940 -2905 -15356 -9732 7806 15602 5443 -10528 -14460 -1706 13512 13151
1081 13151 -2987 -14976 -9171 6655 15107 6003 -10151 -14507 -1909 13047 12944 -2310 -14820
1094 -14820 -9749 6518 15311 6152 -10008 -14398 -1833 12723 12058 -2619 -14002 -10050 6264
1107 6264 14828 6078 -9803 -14116 -2150 12372 12588 -1548 -14057 -10029 6298 15032 6096 -9506
1121i506m314J1342J4528L10j3949j2122L975J5222R001p872j5339n279J1377
1134b626J4493L50j3388j1843L292J5064Q579p084j5546n138J1051J3903J315
1147A2422j3106j2575L500J4590R093p162j5204m990J0530J3695J508j2891j2196
1160a2786L126J4249Q981o688j4611n795J0222J4266J182j2835j2008L002J4002
1173D307Q755o075j4638n697R954J3773J616j2386j1691K194J3945R152o048j4691
1187g530n132R116J3508J883j1626j2209J706J4158Q708n611j3865n869Q739J3497
1201I473K799j1667j2328J727J3544R440n854j3702n936Q430J3342K442j1086
1214F24j2070J753J2938R523n473j3654o342Q239J3489K538j0858j1791J169J2689
$$ plain form
1121 -9506 -13820 -2478 12050 12360 -1589 -13711 -9736 5486 14487 6615 -8724 -14003 -2626
1134 -2626 11867 12217 -1171 -13014 -9722 5342 13921 6837 -8709 -13847 -2796 11107 12422
1147 12422 -684 -13259 -9759 4831 13924 6762 -8442 -13432 -2902 10793 12301 -590 -12786
1160 -12786 -9660 4589 13570 6882 -7729 -13524 -3302 10964 12146 -689 -12697 -9695 4307
1173 4307 13062 6987 -7651 -13348 -3394 10379 11995 -391 -12082 -9888 4057 13209 7161 -7530
1187 -7530 -12662 -3546 9962 11845 219 -11990 -10284 3874 12582 6971 -6894 -12763 -4024 9473
1201 9473 12272 605 -11723 -9996 3548 12988 7134 -6568 -12504 -4074 9268 11710 624
1214 624 -11446 -9693 3245 12768 7295 -6359 -12701 -4462 9027 11565 707 -11084 -9915 2774
1228B774R836n039j3644o169P909J3151K625j0741j1379N80J2447R837m629j3482
1242e924o099P540J2827L295j0207j2354Q71J2131R539m127j2912o831P424J3383
1256H556L058j0437j1414P02J1565R429l947j2191p402P130J2976K993r701j1304
1270i987j63J1720R779l493j2785p054O977J3075K922r220j1470k28J1396R797
1284A1266l665j2257o585O179J2045M113r067j1616j07J0908R707l195j2047o826
1298a1147O053J2157L823q755j1268o27J1021R100k743j1308p439O094J1931M237
1312A1129q787j1405n11J0202R740k500j1454p135N298J1881M127q060j1015j256
1326i746J0340R662k719j1175o620N010J1108M644p663j1449j029R982R308j959
$$ plain form
1228 2774 12610 7571 -6073 -12242 -4333 8818 11443 702 -10677 -10097 2350 12187 7558 -5924
1242 -5924 -12023 -4483 8344 11639 1432 -10922 -10051 2080 11619 7492 -5420 -12251 -4827 8556
1256 8556 11614 1177 -10237 -9535 2030 11459 7512 -4679 -12081 -4951 8025 11018 1317 -9987
1270 -9987 -10150 1570 11349 7856 -4929 -11983 -5006 8069 10991 1771 -9699 -9927 1469 11266
1284 11266 7601 -4656 -11241 -5062 6983 11096 2029 -9587 -9694 1214 10921 7726 -4321 -11147
1298 -11147 -5094 7063 10886 2131 -9137 -9764 1257 10357 7614 -3694 -11133 -5039 6892 11129
1312 11129 2342 -9063 -9574 628 10368 7868 -3586 -10721 -5423 6458 10585 2525 -8490 -9746
1326 -9746 594 10256 7537 -3638 -10258 -5248 5860 10504 2841 -8608 -9637 345 9653 7694
1340G694j0907p494N113J1513M787q152j0669j161R500R256j432j0862p662N000
1354e476J1386M247p253j0684j537Q897R869j543j1023p083M667J1127M336o659
1368C271j0742k057R322R441j567j0105p588M302J1037M489o445j0740j911Q726
1382e67R474j568r645p381L590J1010N378p055j0628j724Q677Q951n52r885p767
1397i692L895J0807M643o418j0002k624Q295R699n63j0172p131L378J0039N300
1411I454n741j0442k549Q409R453q96r614p129L204R927N416n620j0599k388Q296
1426h19Q972m98q995p646K555J0518N561o105r624k520P177R209P7r085p773K947
1442f049R657N587n460r328l350P391R251K38r132p404K564R348N848n228r687
$$ plain form
1340 7694 -3213 -10707 -5594 5919 10706 2554 -8115 -9276 224 9480 8048 -2814 -10476 -5476
1354 -5476 5910 10157 2904 -7780 -9317 -420 9449 7906 -3117 -10200 -5533 5594 9930 3271
1368 3271 -7471 -9528 -206 9235 7668 -2437 -10025 -5723 5314 9803 3358 -7382 -9293 -567
1382 -567 8907 7339 -2306 -9687 -6097 4913 10291 3236 -7392 -9116 -439 8512 7960 -1925 -9692
1397 -9692 -5797 5010 9653 3235 -6767 -9391 -1096 8603 8040 -2132 -9263 -5885 4154 9454
1411 9454 3713 -6729 -9278 -869 8584 7688 -1926 -9055 -5851 4076 9492 3872 -6727 -9115 -819
1426 -819 8153 7655 -1340 -8986 -6431 4087 9648 3543 -6081 -8601 -1424 7785 7862 -1223 -8996 -6049
1442 -6049 3608 9195 3735 -5593 -8943 -1552 7699 7937 -1195 -8599 -6035 3313 9161 3933 -5754
1457e754l030P368Q715J67q280p757K282R640N582m703j0222k770P351Q449Q37
1472G875q639p646K062R650N441m923r334k959O411Q689J065q285p371J957R214
1487C207M998l978r234l656O684Q638Q70q067p261J662Q740N732l798r354l396
1502h213O277Q642P71p541p595J421Q627O028m136q798l644N831Q551J553p574
1517B00p932J627Q684N615l911q419m161N692Q954J348p447p623J405Q012N730
1532G774l124q995l952N636Q776J354p123p474N00Q505O098l183q807l798N255
1547b558Q257J288o280p910Q41Q225N796l190q330l819M999Q026K326p316p439
1562g084P32P939O218l115q173m038M472Q600J780o673p053K44P406N680k263
$$ plain form
1457 -5754 -8784 -1416 7299 7466 -814 -8571 -6289 3351 8933 4230 -5992 -8762 -1411 7038 7875
1472 7875 -764 -8410 -6348 3302 8743 3820 -5514 -8473 -2062 6627 7692 -593 -7964 -6007 3207
1487 3207 8205 4227 -5007 -8663 -1979 6659 7529 -538 -7799 -6137 2603 8335 4537 -4817 -8213
1502 -8213 -1936 6706 7477 -64 -7659 -6238 2389 8417 4281 -4517 -8161 -2330 6221 7774 200
1517 200 -7732 -6105 2579 8194 4283 -4136 -8297 -2605 6349 7697 250 -7373 -5968 2044 7774
1532 7774 4650 -4345 -8297 -2661 6115 7469 346 -7128 -6628 1877 7975 4792 -4015 -7813 -2558
1547 -2558 5699 6987 707 -7203 -6362 1863 7659 4469 -3861 -7680 -2681 5345 7671 355 -7084
1562 -7084 -6352 1587 7805 4690 -3483 -7521 -3049 5551 7331 658 -6395 -6151 1255 6935 4672
1577D672q274m123M791Q146J972o277p257M37P006O305k592p909m726M832P921
1592D924K201o012p430K15P103O104k560p524m516M498P803K421o223p164K32
1607e928O940O169k153q149l846L941P597K485n836p107k79P108N718j569q113
1622c022m337L925P780K551n329p336k55O934N350j384p287m583L660P498K686
1637F851n334p114o46O291O551j627p505m277L362P493K728n199o832r59O499
1652B82O100j258p382m759L583P328K661n006p076m46N926O279j304o952m407
1667f431K774P531K841n110o755p45N968O189j463o945m560L190P016K864m506
1682A858o658j092N842O036j028o758m625L015O923K974m552o538j388O072N825
$$ plain form
1577 4672 -3602 -7725 -2934 5212 7184 907 -6350 -5913 1093 7398 4806 -3103 -7829 -2997 4924
1592 4924 7125 1113 -6317 -6102 1001 7105 4545 -2979 -7495 -2997 4806 7227 1004 -6160 -5928
1607 -5928 1012 7181 5028 -3121 -6967 -3026 4571 7056 1220 -5887 -6166 942 6660 5091 -3022
1622 -3022 -7359 -3434 4346 6897 1568 -5768 -6023 911 6261 4877 -2410 -6993 -3333 4165 6851
1637 6851 1517 -5597 -6243 48 6599 4972 -2533 -6810 -3448 4045 6773 1574 -5258 -6217 282
1652 282 6382 5124 -2258 -7017 -3434 3894 6555 1549 -5527 -5973 -47 6232 4928 -2024 -6431
1667 -6431 -3657 3874 6715 1605 -5150 -5895 73 6262 4799 -2146 -6706 -3516 3500 6364 1858
1682 1858 -4800 -5892 -50 5986 4958 -1800 -6425 -3410 3513 6487 1935 -4603 -5991 81 5906
1697E906o41o930m235K397O567L259m429o515j122N352N709l5o848m765K567O981
1713C218L233m164o977j280N328O135o53n908m861K325O778L053m072o263j913
1728f021N401N778o9o386m569K082O561L292m060o081j601N116N669j49o094m580
1744e711J883O449L363l452o420j823N207N475O3n878m948J817O928K911l321
1759B543o320j886M671N913k20n529m631J859O116L257l185o235j953M614O000
1774E014k61n401m964J484O451L368l174o249k052M805N694L1n035n025J278O303
1790B267L452l127o066j968M046N963M63n305n134J445N781L873l244n992j869
1805e415L932N532R32n283m497J091N419L684k271o205k438L982O045N11n191
$$ plain form
1697 5906 5265 -1665 -5900 -3503 3064 6323 1894 -4621 -5743 -391 5318 5283 -1565 -6330 -3763 3218
1713 3218 6451 2287 -4690 -5970 -642 5493 4840 -1068 -5929 -3604 3174 6227 2155 -4108 -6021
1728 -6021 -620 5158 5089 -1297 -5866 -3784 2777 6069 2009 -4072 -5673 -557 5112 4963 -1131 -5711
1744 -5711 -3828 2621 5984 2532 -3888 -5711 -504 4971 5034 -844 -5792 -3975 2953 5864 2543
1759 2543 -3777 -5663 -992 4921 4701 -828 -5459 -3600 2516 5773 2588 -3647 -5600 -986 5014
1774 5014 4753 -648 -5612 -4128 2323 5691 2517 -3732 -5784 -979 4715 4746 -289 -5314 -4036 2267
1790 2267 5719 2592 -3474 -5442 -1396 4567 5030 -275 -5409 -3964 1817 5690 2446 -3546 -5415
1805 -5415 -1483 4049 4981 -302 -4799 -3708 1711 5395 3124 -3081 -5519 -1537 4508 5019 -172
1820a72m609R38N657L504k282o067k285L663O074K77m676m752P81N697L653k428
1836B973n753k541L455N712J144m925n069J091N447L766k388n579k666L708N257
1851C632J160m665m539N70M820L973j632o107k470L809N121P83l956n038L71N306
1867A138L904k079n563k272L255N188J467m523m983K99N021M071k014n113k528
1882d732K840N628J178m496m811N13M965L532j378m966l241L010N179J543m367
1897C97m563K8M811M110j691n244k622K971M831J728l718m926J3M572M191j628
1913C260n217k971L183M684J584l814m619m2M707L719j484m674k972K400N316
1928C060J680l806m674k3M370L687j406m568l110K378N163J747l666m416o17M699
$$ plain form
1820 -172 -4781 -3843 1814 5318 3036 -3031 -5316 -1653 4421 4698 22 -4730 -3949 1748 5401 2973
1836 2973 -2780 -5321 -1866 3846 4990 65 -5004 -3913 1534 5300 2912 -2667 -5333 -1625 3632
1851 3632 4792 127 -4412 -3842 978 4951 3319 -2788 -5258 -1449 3672 4455 499 -4539 -4168 1138
1867 1138 5042 2963 -2600 -4872 -1617 3571 5038 515 -4468 -4169 852 4923 2909 -2204 -4732
1882 -4732 -1892 3736 4914 418 -4393 -3880 1085 4617 3239 -1727 -4968 -1958 3221 4764 397
1897 397 -4166 -4138 673 4783 3092 -2152 -4774 -1803 3028 4756 1038 -3888 -3875 697 4888 3260
1913 3260 -1957 -4928 -1745 2939 4523 709 -3910 -3952 755 4474 2990 -1684 -4656 -2256 3060
1928 3060 4740 934 -3740 -3763 607 4294 2888 -1680 -4790 -2412 2751 4498 832 -3584 -4201 498
1944D98L550o44n102k837K464M630J851l429m709l59M360M016j212m954k708K405
1960b180M865J784l526m494r8L917L644p77m488l306K422M835J975l603m506k91
1976c827M038L821q63m375l270K243M618K046l205m532p62L981L990p36m313l161
1992d307J587N363J526k765m677n00L934L541l14m783k812J465N105K077l483
2007I57l956p87L378L688k19l913l380J687M645K125l070m135r52L724M072n87
2023C277l879l632J628M576K009k644m207j134L465M352n80m123k936J264M482
2038A918K399k636m568j116L690M041o12l934l140J471M512K127k553m471p44
2053c616L073M060N5m195k977J076M096K557k588l949j403L185L854K57l870l471
$$ plain form
1944 498 4048 3404 -1698 -4535 -2071 2559 4410 981 -3728 -4087 273 4289 3077 -1877 -4585 -2180
1960 -2180 2685 4469 943 -3551 -3649 268 3912 3135 -1353 -4659 -2237 2598 4573 970 -3536 -3827
1976 -3827 211 4032 3169 -1206 -4476 -2233 2385 4431 1226 -3306 -4068 -87 3903 3167 -1146 -4307
1992 -4307 -2720 2643 4169 1404 -3273 -3773 161 3702 3388 -1395 -4207 -2742 2363 4440 957
2007 957 -2999 -3786 -408 3280 3061 -852 -4232 -2545 2100 4225 1155 -2980 -3932 -208 3864 3277
2023 3277 -602 -4234 -2606 1970 3979 1335 -2872 -4006 -541 3811 3231 -892 -3828 -2564 1918
2038 1918 4317 1681 -2887 -4003 -313 3728 3116 -818 -3958 -2487 2025 4152 1599 -2872 -3616
2053 -3616 -543 3517 3572 -623 -3600 -2524 1572 4129 1541 -2408 -3811 -626 3228 3485 -385 -3856
2069c856J236M551J969k173l933j460L252L923Q5l945l360R66M276K301j929m394
2085b491j159K993L646L19l476l627R47M401K463k561l742j525L224L600K32l471
2101b27l153Q57L690K657k092l910j380K640L762N77l581l415P29L960K555j800
2117A869l797j573K355M058N22l552l202M63L731K704j869l743j684K997L288
2132B567J000l381l474P12L603K641j996l510j713K733L283O93l169l245Q89L372
2148A005K519j596l644j650K509L406J64k810l146J32M392J940j117l561k446
2163c903K785L532Q75k958l451L31L545K635j388l613k091K479L623Q35l043k997
2179b804P0L517K864j788l427j854J985L695R76k878l139j28L497K855j427l231
$$ plain form
2069 -3856 -2620 1931 3900 1727 -2206 -3666 -414 3509 3594 -351 -3711 -2745 1531 3832 1903 -2491
2085 -2491 -3650 -657 2989 3308 -168 -3795 -2848 1553 4016 1455 -2287 -3812 -588 3012 3244 -227
2101 -227 -3380 -2523 1167 3824 1732 -2178 -3558 -918 2844 3421 -160 -3575 -2846 1114 3669 1869
2117 1869 -1928 -3501 -1146 2912 3434 -118 -3320 -2857 874 3578 1709 -2034 -3718 -721 2567
2132 2567 3567 186 -3288 -2576 1027 3668 1672 -1838 -3551 -818 2465 3158 -11 -3256 -2367 1005
2148 1005 3524 1928 -1716 -3366 -857 2549 2713 -97 -3243 -3111 1281 3221 2104 -1457 -3903
2163 -3903 -1118 2414 3289 331 -3120 -2789 756 3391 2003 -1610 -3701 -1222 2401 3236 193 -2804
2179 -2804 -2734 783 3647 1859 -1568 -3422 -1437 2258 3234 356 -2783 -2911 586 3441 2014 -1217
2195a217k182J922L840Q98k786l280j72L520K765j265l311k139J993L744R34k825
2211D39l309n0L151K693l97l728k207J939L472J069k525l394NL005K875o32l602
2228a196k136J879L629Q69k418l123m10L130K688j020l316j556J271L675J376
2243C342l091k844j69K999K888r71l262j897J476L124J495k443l102j39K846K922
2259C174q63l516j982J401L501J201k261l176k37K781K644n01l197k019J599L297
2275A846J181k253l145m87K846L082q94l148j739P33L453J642k194l278l13K734
2291F6K481m37l060k243J231L698J213k596k515n24K329K940l57k764k252Q44
2307a946L250J523j623l528l80K699K455j23l122j783Q82L119J236j676k982o74
$$ plain form
2195 -1217 -3399 -1477 2363 3261 475 -2805 -2977 543 3308 2043 -1268 -3407 -1414 2330 3264 439
2211 439 -2870 -2920 231 2924 2527 -1201 -3408 -1469 2003 3072 547 -2847 -2842 163 3038 2406 -1196
2228 -1196 -3332 -1453 2176 3045 627 -2496 -2906 224 2912 1892 -1424 -2980 -1709 1966 3342
2243 3342 251 -2593 -2762 237 3125 2154 -1108 -3005 -1529 1595 3090 647 -2455 -2594 252 3174
2259 3174 2311 -1205 -3187 -1786 1715 2916 655 -2521 -2758 23 2667 2166 -1031 -3050 -1451 1846
2275 1846 3027 774 -2371 -2858 -12 3070 2176 -972 -2711 -1978 1475 3117 923 -2355 -2668 66
2291 66 2547 2110 -950 -3193 -1962 1736 2949 353 -2162 -2686 -357 2583 2226 -538 -2790 -1946
2307 -1946 1304 2827 1204 -2324 -2704 -5 2450 2327 -795 -2578 -1696 1423 2659 983 -1999 -2673
2323b673K458K805Ql198k189R78L182J448j609l215p29K250K768l1k767j894P63
2340a645K892J497j671k629j143K385K688J64l048k308J405K383J589j667k592
2355a700j300K725K578J85k804k336R35K663J676j163l004j031J961K696K79k490
2371a30k742O03L565J167j427k842p09K170K240N37k530k797R60K981J440j200
2387A286k767j165J816L239k5k535k223M28K718J930j359k954j352K241K693L0
2403B001k079k482N30K370K246j052k936j119J673K679M75k482j783j12K687J821
2419B437j127k630j185J782K454M98k190k080K05K404J922j252k790q20J558K653
2435A839L30k104k076Q6K535J293m15k853j220J844K238P46k167k460O57K590
$$ plain form
2323 -2673 -215 2590 2598 -600 -2789 -1811 1371 2819 1210 -2005 -2734 -484 2284 2253 -514 -2408 -1645
2340 -1645 1247 2744 1073 -1556 -2699 -314 2374 2538 -510 -2818 -1413 970 2559 892 -1700
2355 -1700 -3000 -275 2303 2488 -316 -2652 -1717 946 2622 1459 -1545 -2576 -615 2081 2360 -130
2371 -130 -2872 -2269 1296 2463 1036 -1806 -2515 -345 1895 2432 -98 -2895 -1935 1046 2486 1286
2387 1286 -1481 -2646 -830 2409 2384 -151 -2374 -1946 772 2702 1343 -1611 -2963 -722 1971 2001
2403 2001 -78 -2560 -2030 340 2586 1534 -1402 -2521 -848 1831 2306 -176 -1959 -2071 616 2437
2419 2437 1310 -1320 -2505 -723 1731 2229 39 -2041 -1836 568 2490 1238 -1552 -2372 -814 1839
2435 1839 2169 65 -2011 -1925 610 1903 1488 -1365 -2585 -741 1497 2243 76 -2384 -1727 863
2451H63J334n43k731j064J361K245Q52j970k554J31K554K206j136k923o10J191
2467g94K495O01k396k238K87K309K080q79k672j525J685K543Q53k186k169k27
2483b233K325K027l40k987j117J316K562L85j817k284L84K026J769m25k401j277
2499b087J163K365O16j272k833L94J766K188o59k556j511J189K752O14j568k273
2515a712k95K269J736l99k386j679J600J882R30j248k558k46K371J869n49k213
2531f28j364Q46K411R16j684k167o4J940J864m04k263j590J204K617M02j439k114
2548a517j95J676K125o09k498j117R71K338P34j507j930k77J932J863m21k022
2564d54j719J258K188R64j901j872r6J902J579l10k166j181O29K358O68r38k335
$$ plain form
2451 863 2197 1654 -1077 -2141 -780 1465 2317 347 -2207 -2076 478 2684 1548 -1375 -1985 -794
2467 -794 1701 2302 -94 -2332 -2045 264 2344 1465 -1207 -2732 -1047 1496 2349 163 -2006 -2233
2483 -2233 92 2119 1779 -1208 -2325 -1009 1553 1938 121 -2163 -1779 247 2016 1591 -810 -2087
2499 -2087 -924 1441 2057 785 -2048 -1654 112 2300 1641 -915 -2426 -1237 1515 2129 561 -1712
2515 -1712 -2007 262 1998 1599 -787 -2466 -866 1016 1946 698 -1860 -2106 265 2134 1585 -628
2531 -628 -1992 -1146 1265 2181 497 -1670 -1734 206 2070 1666 -597 -2187 -983 1634 2036 597 -1517
2548 -1517 -1712 -36 2089 1480 -1018 -2135 -1164 1174 1908 401 -1529 -1806 126 1989 1568 -454
2564 -454 -2173 -915 1273 2237 336 -1536 -1632 270 1849 1539 -627 -1808 -1179 1179 1847 909 -1426
2581a426o04J988J623r2k044j459R57K001J095j402k220l94J810K077r8j958j799
2598a945N53K219R03r71k297n30K073J690J09k319j224M39K028J394j368k349
2614a595J14J325J929j85j943j606Q92K013R51j184k012o65J834J809M5j964j700
2631a942N06K470J007j275j915q43J843J532J23j742j738M07K312J012p37k296
2647a276o60J811J823j89j692j338L94J907J084j098j835o73J073K263J66j844
2663h4k088O03K241J295j129k079n72J309K156l0j935j473P73J673J152j113j894
2680a195o91J276K042L31k068j356J25K170J098q96j841n61J299J634N52j884
2696C5j707L44J477J682q92j695q83Q77K021M50j752j555K74K021O92m30k059
$$ plain form
2581 -1426 -2030 -42 1581 1489 -555 -2014 -1057 944 2039 637 -1583 -1977 -167 1910 1812 -146 -1945
2598 -1945 -1392 827 1730 759 -1538 -2068 5 1695 1804 -515 -1739 -1300 728 2122 754 -1595
2614 -1595 -1481 -156 1773 1588 -355 -1961 -1069 944 1895 711 -1301 -1966 -132 1677 1722 -242 -1942
2631 -1942 -1436 1034 2041 766 -1149 -1992 -149 1383 1506 -236 -1974 -1567 745 1757 1020 -1276
2647 -1276 -1936 -125 1698 1509 -183 -1521 -1127 780 1864 766 -1069 -1742 -669 1594 1760 -84
2663 -84 -2172 -1569 672 1967 838 -1241 -1813 -504 1652 1622 -313 -1786 -1013 660 1812 699 -1195
2680 -1195 -1886 -610 1432 1763 -305 -1661 -1536 634 1732 836 -1005 -1566 -267 1367 1919 35
2696 35 -1672 -1328 149 1831 939 -756 -1639 -762 1259 1709 -43 -1598 -1324 697 1389 959 -1100
2713a100q08J238K079L32j537j515J42J568J145n99j609j001J268J864J88j439
2729B16j589j48J629J819q92j628j291J403J471N16j318j943M52J714J224n79
2745A056j953o90Q80J920M29j607j514L11J564J249j170j300r26R97J753L48j101
2762B46j623N5J501J196j78j926j144J369J605K61j001j635j20J571J172j14j928
2779f93r08P34J752P32j213j770k17J542J789o72j603j362J444J408L32p54j885
2796a344J93J398J376l38k040p92R58J496P76j639j012l53J525J030l72j390q38
2813a366L20J839M37j091j301m3J296J391k42j661j110R48J878N0q80j590j36
2830a261J355J281o8j601j253P80J265J049j179j518j51J465J345k61j714r81
$$ plain form
2713 -1100 -1908 -670 1409 1741 204 -1311 -1169 399 1544 945 -664 -1665 -397 1467 1655 216
2729 216 -1373 -1521 108 1927 1035 -593 -1884 -481 990 1506 188 -1755 -1303 411 1635 1056
2745 1056 -897 -1587 -707 1213 1642 35 -1479 -1168 396 1645 475 -825 -1751 -754 999 1347 246
2762 246 -1377 -1322 179 1375 1197 -729 -1873 -504 1101 1362 361 -1274 -1394 177 1349 1235 -693
2779 -693 -1601 -867 885 1617 404 -1366 -1583 -41 1748 1076 -527 -1889 -445 963 1295 541 -1344
2796 -1344 -1151 247 1623 1285 -755 -1547 -589 907 1683 44 -968 -1321 204 1234 862 -528 -1366
2813 -1366 -1046 793 1230 139 -1162 -1205 91 1482 1240 -421 -1531 -583 1295 1345 465 -1125 -1261
2830 -1261 94 1375 1307 -294 -1547 -767 498 1547 368 -1150 -1301 164 1509 1248 -466 -1447
2846a447M57J476M83j91k011j35J385J166J6j731p34M78J664O81j114j343p18
2863a618J458J439J5j612r42L15J615R43j330j255l82J299J328j40j527j123O51
2880h66J417R38j100j622k33J083J645O5j424j159J73K157L26j065j211n93J257
2897b12J252K29j617q88N51J391J025j066j519k89R14J316j22j253j090L65J229
2914B16J272q94j360n27J161R52O28k006p90M50J562O82j070j377j25J059J012
2931H45K12j256j042K30J609Q64p85j641n69J220J031J97j407o90J44J405P87
2948A154n89j354n99J054J204M50j259j182L91J331Q86r56j383m65Q26J633k46
2965H96n58j370j48J875O88m64j592n29P81J636k07j339q47J56J560P48n04j163
$$ plain form
2846 -1447 -990 486 969 778 -1233 -1368 17 1183 1199 -532 -1266 -788 876 1557 443 -900 -1618
2863 -1618 -160 1279 1294 -318 -1260 -945 670 1613 283 -972 -1354 -55 1273 1133 -394 -1517 -866
2880 -866 551 1489 389 -1233 -1466 -383 1262 1327 -97 -1256 -1083 1074 1400 335 -876 -1469 -212
2897 -212 1040 1269 -348 -1236 -685 706 1731 665 -854 -1143 -229 1087 965 -288 -1378 -1013 216
2914 216 1488 594 -766 -1293 -132 820 1448 -558 -1348 -898 664 1346 276 -1101 -1226 -167 845
2931 845 1057 -199 -1241 -1011 598 1462 677 -964 -1533 -313 718 915 -492 -1182 -1038 367 1154
2948 1154 565 -789 -1388 -334 870 1320 61 -1121 -730 601 1487 531 -852 -1317 -491 1142 896
2965 896 338 -1032 -1180 695 1383 919 -673 -1202 -421 1215 1008 -331 -1178 -1022 538 1286 782 -381
2983c81q15P40J436l5q06r53j95J077J283p56j468l88R69J141M8m80j537L66J207
3002D53M80m22r56j087J039J436J29q24j042o6J248R69p13j083o63P49J198J14
3020I59r17q71j16J241R01m41j102o84M56J610p3p33j159j19J170Q84k18j494
3038g06o63Q55J223L71q43j171J7J040Q55j41j012j075Q33J199K21r02j055l0
3056i84J266P59k46j025q26P17J305J77r83j215j85J392J133n84q27j106R63J175
3074I06R1o30j204k42J058R93r8j236p28L89J407K75q25q97k34P87J387n69j025
3093c95q31N51J170Q05j297j239K05J089Q26j97j057o41L45J159N63r80j006j29
3111a059J052J092j53j445n09P44J026J08l8j783k70J291Q94l27q98r63N15J276
$$ plain form
2983 -381 -1196 -456 980 945 139 -814 -1009 68 1351 595 -873 -1261 -292 849 897 417 -1120 -754 453
3002 453 933 511 -445 -1532 -493 943 1072 248 -794 -860 388 1357 644 -439 -1102 -353 845 959
3020 959 42 -829 -945 296 1197 756 -346 -1030 -574 1036 963 230 -929 -1048 122 1006 788 -706
3038 -706 -1369 -514 709 1080 237 -934 -917 123 978 837 -175 -1250 -417 782 1003 101 -954 -984
3056 -984 282 1041 795 -230 -1056 -339 966 1143 160 -1055 -1240 152 1285 701 -126 -1232 -269 906
3074 906 997 367 -837 -1079 -21 972 874 -362 -1090 -701 706 981 156 -741 -975 -188 1199 630 -395
3093 -395 -1226 -675 495 1300 3 -1236 -1031 58 884 687 -370 -1011 -666 493 1056 76 -930 -1059
3111 -1059 -7 1085 932 -513 -1022 -278 748 856 818 -965 -1235 56 950 623 -275 -1238 -723 553
3129E53K83m72j359p3J236L82P1r05n81L56R86O15n50j482l88J503Q35m0j172
3148b02o94J65J398N89j172p59j90Q91R22J11j189r53M01J428K42n37j124m02
3166a075J034J117k12j170r88M63J233L95j60j102n12J032J001q3j068r22L28
3183f89J032O90m77j351k37P81J348j4j337p74L81J104N64o58o17o52P15J013
3201H22l1q69r45O71J036N86q20j017m99J008N07M44r64r87O44Q27K49p0j212
3220f20k45J173J66J28n88j017K12J242O58n73j254q8R73N63j06n44q74LJ345
3239E54K61k52j272l33R40Q21J70p74j009K81Q11N86q8j057l29M43P69L80j092
3258a90p35N65M24Q22l65r61n85P27R22J9o93o59Q9P81P29m94p24n34M46J313
$$ plain form
3129 553 836 364 -995 -1068 168 550 621 -284 -865 -509 477 1092 542 -940 -1328 175 1010 970 -202
3148 -202 -896 -731 667 1256 84 -675 -865 26 948 1059 -130 -1083 -682 746 988 451 -673 -1075
3166 -1075 -41 1076 864 -306 -1294 -831 402 797 637 -465 -977 55 1056 973 -95 -1017 -689
3183 -689 343 1033 556 -795 -1032 -251 1097 1083 -254 -1028 -647 457 1021 363 -254 -906 -191 822
3201 822 791 -78 -1023 -352 684 1270 450 -567 -1066 -58 449 893 -71 -1058 -414 413 662 592 -620
3220 -620 -865 308 474 602 14 -1003 -791 451 1109 536 -718 -806 167 730 624 80 -794 -791 554
3239 554 815 563 -709 -1042 -102 719 889 115 -894 -613 198 784 696 -361 -690 -247 522 902 -190
3258 -190 -925 -360 64 886 521 -440 -1025 -298 624 643 -50 -709 -620 161 890 396 -328 -862 -416 897
3278H97K57r86p95k0J123M05l83q16p44Q95J035k47n07q25J43P10N83l78p79m39
3298h71N05J043J46r68o86K47R68M71n93p16l21M25J043N62j186j127L21J244
3316E07M61n00q98k30O2J457J07r35q74R0P49Q57n95n34m53K32J057J20n40o20
3336d80Q4L47Q61l92o80p23Q16J033q6p27r87Q5R06P74l48j090%M19N71L75m97
3357B61j200L39P79M55q2q30o57M48O46O30o97o06q7N03J047m94m00q86L34P38
3377B41M43n03o51l80J128M65o3r37k34J15Q48M76q17r69J17Q61O72j35q48n42
3397g13J59P19M00l02q25k2P10N59q5r93j72n8J080K81l60j038o5P51P86m86l85
3418e9n83J89O41M08o39m78k35J041L94J37j106n57M20R56L40q01p84J16P89N95
$$ plain form
3278 897 1154 168 -627 -647 476 881 498 -318 -1062 -167 868 621 114 -711 -568 142 725 347 -432 -871
3298 -871 -366 677 823 -145 -831 -584 384 855 262 -454 -775 -350 693 1255 69 -1058 -737 507
3316 507 968 468 -430 -660 -598 859 966 31 -843 -753 -4 853 258 -276 -729 -497 560 680 140 -480
3336 -480 -396 -49 812 420 -260 -983 -167 866 780 53 -934 -849 57 831 483 -607 -607 -188 383 758 261
3357 261 -939 -600 179 634 552 -278 -935 -487 159 789 92 -514 -601 -98 949 455 55 -831 -497 241
3377 241 684 181 -470 -850 278 743 680 -257 -491 -376 472 948 131 -838 -721 140 812 677 -171 -713
3397 -713 -554 165 565 263 -562 -584 126 685 600 -393 -565 -623 457 738 378 -660 -725 26 812 326 -59
3418 -59 -642 -453 188 596 -43 -521 -756 285 679 816 -290 -847 -427 529 869 68 -716 -600 189 784
3438G84j27j106k50L66M73N10m04r52J96M52R70j7j128m04L03N39Q42p95r34K6
3458f56O09P57q1r97m02L18P69O66r11n89k08N03Q97j37n87n11L02P35p6k38q02
3479f39l71N94R66J13r34l15J47O00N29k72p20l63N27J047l79p48n54O09K06P04
3499G47l45r91j0N60N47J45r70k82k69R72L45j45p05k87O64O95J35q41n12J91
3519c56O80M77l63n08o78Q30N95Jq18m44lQ27Q09j109n00j89M20P13K21n90n70
3540e55M4N55N82l53n62m22O89Q61j68o06o00k22R69L85k74p93k44O31M03K50
3560E70o03n22r1J002N39l56p68k6k9N47M02p09p12K98O80K73j43n82o76J022
3580A16L74K26p32m71j85O32M50J36o25n39P21N57p4p12n54J99O77L73j21r19
$$ plain form
3438 784 657 -449 -699 -333 140 650 246 -706 -510 -58 912 895 -233 -637 -334 205 1047 252 -682 -656
3458 -656 -47 710 629 -368 -770 -452 317 983 72 -517 -725 -222 675 538 -49 -560 -258 477 401 163 -639
3479 -639 -1010 -416 550 663 -271 -586 -439 161 690 418 -302 -665 -138 909 530 -218 -772 -163 43 747
3499 747 402 -589 -599 -39 508 653 -317 -599 -868 104 449 304 -401 -688 -24 671 806 -35 -547 -356
3519 -356 324 801 438 -70 -748 82 677 678 -140 -584 -587 240 1049 -60 -560 -749 -329 384 605 15 -555
3540 -555 -511 44 626 273 -289 -711 -22 839 671 65 -535 -757 212 597 323 -470 -714 -83 320 570
3560 570 -33 -555 -646 356 895 539 -229 -255 -284 263 665 -44 -756 -458 222 495 352 -230 -906 116
3580 116 490 716 -16 -487 -672 -40 410 546 -79 -618 103 660 586 -126 -680 -481 196 569 448 -471
3600d71R7k2Q25J14j041j95K32O91N51l28n31p20M61Q68p8j14p83MM97M51j89
3621C19m88l93J91O73K75l18n88k57O81O21k84m53o62Q9R10L6k08m87j40O30K72
3642D19m4m65n24M19M60L25m67k68l87M22M87l76k87n14P93J54O43q99m94j0R42
3663C29J98l69l25l80L29N80n9k59n66J0O13M99l32m25m22M75O35j50l40k36k20
3684d15O23L36p0o36m56K83Q10j40m56m10O2P20L32l56k31p95M48Q19J62m60m65
3705b95k05L96L48O6m54j02Q8Q05j64l37m18r5O30K6K20m21m56J06N79K20m69
3726F8m20r0L79L59K78p08m91N16L73k0j27n84PO57J20O9n07m98L96O00J48l34
3748A91n00m57O31P04k32m24m43J28O42J64j89m62l82N45M99K28r10n86M36P22
$$ plain form
3600 -471 -374 -396 429 543 -498 -693 -461 230 781 453 -78 -798 -337 531 453 339 -444 -440 57 508 319
3621 319 -169 -562 -371 302 577 259 -329 -586 95 716 432 -21 -683 -594 316 352 144 -343 -483 147 419
3642 419 375 -90 -614 -195 265 590 123 -145 -532 -110 377 1 -286 -800 -7 147 790 -109 -603 -613 329
3663 329 527 158 -167 -547 -218 362 303 44 -522 -512 101 600 268 -157 -579 -104 531 381 41 -195 -415
3684 -415 208 544 474 -162 -618 -335 475 335 -121 -531 -469 251 583 227 -4 -799 -351 468 630 170 -295
3705 -295 -500 -104 244 310 -144 -246 -158 647 483 146 -272 -367 263 289 509 88 -368 -262 317 537 68
3726 68 -352 -442 -63 296 574 -134 -625 -109 264 244 117 -467 -460 197 317 386 -121 -619 -223 377 525 191
3748 191 -309 -766 -135 569 337 -87 -530 -402 240 404 215 -247 -629 -84 415 643 -267 -853 -417 305
3768C05J67l96o22L8K99P63J33r08k69O9P10J88j23q34k34O54M90l7n56k19j37
3789e19Q98K89n29k45m99O30L33K35q95k83M38M25L64k34p13m8L13M54Q3n63l98
3810d64J54M37M07k35m87l16N06P08j21l60j033O29N61J93l06n78J31QM35K70
3830E39r24l65K42M71P08m99m60j02L94Q5M55m45l94k35Q27j58K06o09R9M4L45
3851B24L11o61k81k56J002K23k99m50k50M78K71k22k09k69J7O37J79k31l68q3
3871b37L0N95N5m06m57k2L17O00j26n30r3KN17M65p50o38M69K22M21k23l60l28
3893d77K29P45k4m54m89J07K18N88k40l47m21L40O10j84J12n86l4K73M26L5m50
3914b3j72R5O20p0k25n02o0L76N07o3r04j8K51M70J68l37m91N02M3K29j60n22
$$ plain form
3768 305 472 76 -546 -508 -209 554 687 -221 -490 -421 289 477 354 -480 -714 -60 430 393 -163 -382 -519
3789 -519 379 668 139 -106 -605 25 358 593 -302 -585 -147 278 642 408 -305 -353 -40 414 497 -66 -464
3810 -464 -310 127 534 299 -188 -504 2 710 589 229 -804 -175 386 579 273 -305 -174 -166 269 539
3830 539 -385 -750 -508 -37 671 172 -288 -390 4 89 544 99 -295 -530 297 139 345 -264 -165 -121 224
3851 224 535 -126 -407 -663 339 562 263 -187 -437 41 312 90 -119 -388 -371 266 445 214 -154 -237
3871 -237 -207 388 443 37 -420 -442 -125 475 349 -181 -274 -272 245 710 -40 -678 -209 13 434 211 -149 -477
3893 -477 -248 497 473 19 -470 -363 -145 443 203 -144 -565 -225 385 201 313 -273 -307 -34 392 427 -23
3914 -23 -195 -100 520 450 225 -277 -337 39 546 483 -421 -439 -188 282 450 113 -378 124 167 396 236 -286
3936b86r0k9P82m1j92o01j41O72J26J9n70l15M13L86j13Q3m50k58P64M72l11k51
3958F9m23N81M0J01l68j22j61mO65m01N4m66N10L31J77l38m18l33P93p7M1l51
3980a00m66O12J6L23k19m03j9L48L10k00m38l35K71L58J55k01r7l47O75p8J70
4001C35m84l96J31O92K50m46q1n89M01P28P5p69m04J94N79J97k10p40m9Q81J50
4022D45R4l66p43M64M00j05l53P3q34P91N15M2n47n21L45K32O95k38o86j42N08
4043F9J88M3j25n71K81N28K00l10o02nM64j06K34j95n42O26p9M88n31l46k71L56
4065b06L89J83m78m38M73K24J80k73m14qJ85O56j17m88l59LO35L50l32j96n75
4086f06M70N74j35m80j82J28J68M46j12m32J19n6K88J86p58K83j57L40K18P1o48
$$ plain form
3936 -286 -376 -405 377 336 144 -457 -598 74 200 219 -351 -666 -253 133 20 103 -347 -605 159 631 320 69
3958 69 -354 227 267 368 0 -122 -283 -287 378 -23 31 -435 75 406 583 245 -173 -506 287 210 251 -100
3980 -100 -566 46 62 385 166 -237 -256 92 402 202 -236 -571 -300 58 213 12 -85 -432 243 165 335
4001 335 -149 -545 -414 278 528 82 1 -588 -187 541 616 -153 -557 -363 216 413 203 -537 -586 295 445
4022 445 539 173 -570 -106 294 189 -164 -91 -925 -134 381 423 -124 -645 -300 -68 627 389 -297 -439 69
4043 69 257 300 175 -396 -115 413 613 303 -299 -304 160 54 288 93 -449 177 98 586 55 -291 -562 -206
4065 -206 183 366 -112 -550 -77 147 327 54 -360 -368 -183 473 356 -132 -491 -488 147 497 165 -31 -606
4086 -606 -136 438 303 -177 -359 -231 -63 383 271 -161 -42 -98 190 376 -382 -99 -256 84 302 373 -275
4107b75j20M96L04Km45n64K17N58M22n49k76mO2L19J23l23k72L78k81R55m34o85
4129c92l4N66J43J59l55m64J71N56J56m61m13l69L38P23J28m83j99K77R3M46l77
4150B09k23n15N39K98j14l97k12q1N00K22J93o74J23J37L12M5o46J90k33L83M2
4171I8J41m35l06K01O48J5j66m01j28K93L06k08j55l33J59P64j28j58l84k04N84
4192B03L6K8o28j47K23L57M06n34l11N1N17M20l65n01l3J14L63K01j89o61QL13
4214a29L21l9j91k94j66Q67K04n0q59l3L40N44p58mJ24p0L95J80k51m65k6M39
4236G9J42P0j78l62o9M86M25m19j00j89J97N72m47m32o7J96O44l51k47j37j00
4257b87M24j2K90n88l50J23N29J36j65l01j97M33K47j97m20l8O0O11J22l35n13
$$ plain form
4107 -275 -395 101 405 407 -38 -602 -385 173 595 46 -230 -234 -172 147 270 -53 -325 53 -228 727 293 -392
4129 -392 -426 140 283 442 87 -377 -206 350 506 45 -368 -737 -399 324 452 -31 -230 47 140 586 209
4150 209 -14 -529 10 308 194 -203 -415 -496 4 226 419 -255 -132 5 317 362 -284 -94 -327 56 98
4171 98 239 -196 -502 -301 347 362 196 -205 -333 -40 266 58 -97 -430 -271 493 365 207 -177 -381 203
4192 203 239 267 -361 -508 -285 72 478 -56 -367 -316 201 621 256 -245 -278 -164 199 400 211 -450 -442 -129
4214 -129 192 153 -38 -332 -498 369 573 523 -336 -369 -29 515 -243 -247 -123 -193 202 382 131 -334 -360 79
4236 79 221 291 113 -249 -318 168 593 174 74 -115 82 654 207 -225 -292 -96 548 197 -50 -187 -287
4257 -287 137 125 415 -173 -523 -400 129 265 100 -201 -398 35 282 85 -335 -373 -313 298 420 85 -428
4278d28q7P14k78K45n81j85J05P97j25j35l29p2N60K45j19k06n11K22L11K59j06
4299B96o26l6K46N65j50j88l58J49K50L40l70l40j37L93J30Lk1l40L9L88L25j66
4321C92o56n7M59j9O1m07k41L37L04K08j61o02J28M62K58Op15k78K52P05J39n91
4343a6j16l72P25N7J09n64k3Q5K56J59k06l06j29L91K12j54k29J4K14J14J33n27
4365a73R0M9Q6Q6M09k87o48J86L15lK13n00J21L8P1K78o34k7R6N94ml38l00j23
4389d05L75j6M25j29o27J33L21M18n51m0q9r0L95K39n26k40K02J62K54J01m73
4410a61k97M62QK92l76j69p3N66k79j67N0j74L69J84J88m83j52r6l7Q05k81m08
4432b29P1r3N19r1l05p7J80K27J01m08k6p5Q9M40j73Q5l89J6J22L53j23l59L7
$$ plain form
4278 -428 -515 199 -79 166 -415 -600 -495 302 177 42 -287 -359 201 446 327 121 -390 -168 143 402 296
4299 296 -330 -366 -120 445 295 107 -251 -102 148 488 118 -222 -359 34 164 167 146 -194 -155 233 558 392
4321 392 -264 -321 138 119 180 -227 -468 -131 173 381 220 -382 -254 208 466 472 -243 -521 -269 436 575 -16
4343 -16 -132 -504 221 278 387 -177 -200 -115 141 300 94 -212 -341 50 262 108 -121 -107 107 221 354 -173
4365 -173 -83 -34 52 138 547 260 -388 -202 113 110 323 -177 -56 -18 53 331 -303 -330 -234 360 356 18 -282 -405
4389 -405 -30 -46 379 250 -377 -244 77 495 -56 -96 -185 -275 120 359 -167 -407 -205 -43 211 312 -161
4410 -161 -458 4 12 304 -72 -241 -314 252 -27 -194 -144 -318 51 235 423 -60 -212 -308 -345 460 179 -229
4432 -229 -158 -251 268 177 -128 -205 -25 202 303 -105 -131 -206 -117 323 150 235 -154 -138 -16 337 214 -145 -108
4455a08P8%L09l93l78J15N10j30K5l18j8M19J56p7p7k13j10K11L61j46n59L40
4477cJ01N2Q3k25l89M15J43K04N3o82n5Q7M48j32J10p89M77P8K92L26q70m1J46
4500a71M90p2j61j25k6Q4MK30j90k67j76N62L0l99MJ5L71J78n29pK02j34K64o7
4524A10q3n30J95M24J39K03m40j77O2Q1K55m77K2P9J11K45Q7o65L04j40J86K11
4546B02J82m80r8K02J45J35j85o74N35J62nJ35n75K55L6K29J6k83j68L92%L24
4568D82j003N73Q1n09N18j09j71n3j02N12J95j26l99J75J48R8J73n21j93L6K42
4589D7Q9n1k35n0J01K19K80N3o11l5J78J83K13m83L45l45N30j54l92j01L85l0
4611A36J25k43j22j8O6L75l58k0j19K74j00R0Q5l32j38M42J75l27R1m21L64K67
$$ plain form
4455 -108 -30 -30 279 -114 -492 -377 133 3 28 -290 -308 111 267 190 113 -100 -210 1 362 216 -343 -3
4477 -3 98 150 233 8 -381 34 177 381 434 -248 -303 -216 232 100 210 -579 -102 -24 268 594 -276 -317 -171
4500 -171 319 247 86 -39 -65 19 23 253 63 -204 -380 182 212 -187 -183 -168 203 381 -148 -155 47 -87 177 110
4524 110 27 -503 -308 116 255 458 18 -159 -97 -16 239 -238 -216 -137 -26 219 306 -359 -55 -195 -9 202
4546 202 384 -96 -194 8 153 288 103 -571 -36 126 121 256 -319 -64 -28 201 217 -66 -234 158 158 482
4568 482 -521 52 133 -376 142 33 -138 -191 -293 219 414 288 -111 64 212 310 483 -38 -231 -195 47
4589 47 136 85 -150 -200 -99 120 400 453 -158 -193 -15 168 381 -102 243 -102 428 274 -118 -219 166 136
4611 136 261 18 -104 -122 -56 319 -39 -59 -178 96 -4 86 171 -161 -299 143 318 -9 82 -339 25 292
4633B92Kj98l35m5L49J99j42L16o51K67J60P4o3l65j43K69J61M6j2l08j53J91
4655h9K03K56m65k31K42K14L13l58Lj24J38J37l35n5j12K07N22k40m24p4m7P24
4677D05k53k6l17m5J69L08j81l2j7k30L30j5J4l95K04k0J41j05J07j99m6N40o1
4700B76j48o63J96N12k76L54j87m38L87m9L84j89n38K45L63J97j21o35M02m1j40
$$ plain form
4633 292 294 96 -239 -284 65 264 122 438 -213 54 214 288 225 -140 -283 -14 147 193 181 -127 -280 -89
4655 -89 114 370 -95 -326 -84 130 443 85 88 -36 102 239 -96 -151 -263 -56 466 226 -198 -272 -319 405
4677 405 152 126 -191 -236 -67 241 60 28 11 -219 111 96 110 -285 -81 -101 40 -65 42 -157 -203 337 276
4700 276 128 -535 -339 173 -103 251 64 -374 13 -36 348 159 -379 -134 229 426 305 -330 72 31 -109
$$ [...]
8191e7
##END NTUPLES=NMR FID
##END=
