##TITLE=1H_DE-43_EA_W
 D2O
 8 sc, 
 4.4.2024
##JCAMPDX= 6.0         $$ Bruker NMR JCAMP-DX V2.0
##DATA TYPE= NMR FID
##DATA CLASS= NTUPLES
##ORIGIN= UXNMR, Bruker Analytische Messtechnik GmbH
##OWNER= root
$$ XWIN-NMR		Version 3.5
$$ Thu Apr  4 13:53:56 2024 Russian Standard Time (UT+4h)  she@DPX200
##.OBSERVE FREQUENCY= 200.1309
##.OBSERVE NUCLEUS= ^1H
##.DELAY= (6, 6)
##.ACQUISITION MODE= SIMULTANEOUS
##.ACQUISITION SCHEME= undefined
##.AVERAGES= 8
##.DIGITISER RES= 18
##SPECTROMETER/DATA SYSTEM= spect
##.PULSE SEQUENCE= zg30
##.SOLVENT NAME= MeOD
##.SHIFT REFERENCE= (INTERNAL, MeOD, 0, 15.7039)
##AUDIT TRAIL= $$ (NUMBER, WHEN, WHO, WHERE, WHAT)
$$ ##TITLE= Audit trail, XWIN-NMR		Version 3.5
$$ ##JCAMPDX= 5.01
$$ ##ORIGIN= Bruker BioSpin GmbH
$$ ##OWNER= she
$$ F:/spectra/data/she/nmr/H-F/1/audita.txt
$$ ##AUDIT TRAIL=  $$ (NUMBER, WHEN, WHO, WHERE, WHAT)
(   1,<2024-04-04 13:52:47.92 +0400>,<she>,<DPX200>,
      <created by zg, POWCHK disabled, PULCHK disabled
       configuration hash MD5:
       00 E9 B6 7A A2 85 ED C7 34 08 36 98 17 FE 4E 26
       data hash MD5: 16K
       EE C1 A3 E1 15 0C E7 6A 4A 21 95 73 2F E1 21 00>)
$$ ##END=
$$ 
$$ hash MD5
$$ 76 BF AA BC 95 FA DB 08 E0 14 E1 0F 6C FC 24 B8
##$RELAX= 
##$RELAX= 
##$RELAX= 
##$RELAX= 
##$RELAX= 
##$RELAX= 
$$ Bruker specific parameters
$$ --------------------------
##$DU= <F:/spectra>
##$EXPNO= 1
##$NAME= <H-F>
##$PROCNO= 1
##$TYPE= <nmr>
##$USER= <she>
##$AMP= (0..31)
100 100 100 100 100 100 100 100 100 100 100 100 100 100 100 100 100 100 
100 100 100 100 100 100 100 100 100 100 100 100 100 100 
##$AQSEQ= 0
##$AQ_mod= 1
##$AUNM= <au_zg>
##$AUTOPOS= <>
##$BF1= 200.13
##$BF2= 200.13
##$BF3= 200.13
##$BF4= 200.13
##$BF5= 200.13
##$BF6= 200.13
##$BF7= 200.13
##$BF8= 200.13
##$BYTORDA= 1
##$CFDGTYP= 0
##$CFRGTYP= 5
##$CHEMSTR= <none>
##$CNST= (0..31)
1 1 145 1 1 1 1 1 1 1 1 1 1 1 1 1 1 1 1 1 1 1 1 1 1 1 1 1 1 1 1 1 
##$CPDPRG= <>
##$CPDPRG1= <>
##$CPDPRG2= <>
##$CPDPRG3= <>
##$CPDPRG4= <mlev>
##$CPDPRG5= <mlev>
##$CPDPRG6= <mlev>
##$CPDPRG7= <mlev>
##$CPDPRG8= <mlev>
##$CPDPRGB= <>
##$CPDPRGT= <>
##$D= (0..31)
0 1.2 0 0 0 0 0 0 0 0.06 0 0.03 0 0 0 0 0.0002 0 0 0 0 0 0 0 0 0 0 0 0 
0 0 0 
##$DATE= 1712224367
##$DBL= (0..7)
120 120 120 120 120 120 120 120 
##$DBP= (0..7)
150 150 150 150 150 150 150 150 
##$DBP07= 0
##$DBPNAM0= <>
##$DBPNAM1= <>
##$DBPNAM2= <>
##$DBPNAM3= <>
##$DBPNAM4= <>
##$DBPNAM5= <>
##$DBPNAM6= <>
##$DBPNAM7= <>
##$DBPOAL= (0..7)
0.5 0.5 0.5 0.5 0.5 0.5 0.5 0.5 
##$DBPOFFS= (0..7)
0 0 0 0 0 0 0 0 
##$DE= 6
##$DECBNUC= <off>
##$DECIM= 32
##$DECNUC= <off>
##$DECSTAT= 4
##$DIGMOD= 1
##$DIGTYP= 9
##$DL= (0..7)
0 120 120 120 120 120 120 120 
##$DP= (0..7)
150 150 150 150 150 150 150 150 
##$DP07= 0
##$DPNAME0= <>
##$DPNAME1= <>
##$DPNAME2= <>
##$DPNAME3= <>
##$DPNAME4= <>
##$DPNAME5= <>
##$DPNAME6= <>
##$DPNAME7= <>
##$DPOAL= (0..7)
0.5 0.5 0.5 0.5 0.5 0.5 0.5 0.5 
##$DPOFFS= (0..7)
0 0 0 0 0 0 0 0 
##$DQDMODE= 0
##$DR= 18
##$DS= 0
##$DSLIST= <SSSSSSSSSSSSSSS>
$$ [...]
##$SUBNAM2= <"">
##$SUBNAM3= <"">
##$SUBNAM4= <"">
##$SUBNAM5= <"">
##$SUBNAM6= <"">
##$SUBNAM7= <"">
##$SUBNAM8= <"">
##$SUBNAM9= <"">
##$SW= 18.0517689322627
##$SWIBOX= (0..15)
0 0 2 0 0 0 0 0 0 0 0 0 0 0 0 0 
##$SW_h= 3612.71676300578
##$TD= 16384
##$TD0= 1
##$TE= 0
##$TE2= 300
##$TE3= 300
##$TEG= 300
##$TL= (0..7)
0 120 120 120 120 120 120 120 
##$TP= (0..7)
150 150 150 150 150 150 150 150 
##$TP07= 0
##$TPNAME0= <>
##$TPNAME1= <>
##$TPNAME2= <>
##$TPNAME3= <>
##$TPNAME4= <>
##$TPNAME5= <>
##$TPNAME6= <>
##$TPNAME7= <>
##$TPOAL= (0..7)
0.5 0.5 0.5 0.5 0.5 0.5 0.5 0.5 
##$TPOFFS= (0..7)
0 0 0 0 0 0 0 0 
##$TUNHIN= 0
##$TUNHOUT= 0
##$TUNXOUT= 0
##$USERA1= <user>
##$USERA2= <user>
##$USERA3= <user>
##$USERA4= <user>
##$USERA5= <user>
##$V9= 5
##$VALIST= <valist>
##$VCLIST= <CCCCCCCCCCCCCCC>
##$VD= 0
##$VDLIST= <DDDDDDDDDDDDDDD>
##$VPLIST= <PPPPPPPPPPPPPPP>
##$VTLIST= <TTTTTTTTTTTTTTT>
##$WBST= 1024
##$WBSW= 4
##$XGAIN= (0..3)
0 0 0 0 
##$XL= 0
##$YL= 0
##$YMAX_a= 110292
##$YMIN_a= -110454
##$ZGOPTNS= <>
##$ZL1= 120
##$ZL2= 120
##$ZL3= 120
##$ZL4= 120
##$ABSF1= 10
##$ABSF2= 0
##$ABSG= 5
##$ABSL= 3
##$ALPHA= 0
##$AQORDER= 0
##$ASSFAC= 0
##$ASSFACI= 0
##$ASSFACX= 0
##$ASSWID= 0
##$AUNMP= <proc_1d>
##$AZFE= 0.1
##$AZFW= 0.1
##$BCFW= 1
##$BC_mod= 2
##$BYTORDP= 1
##$COROFFS= 0
##$CY= 11.3945322036743
##$DATMOD= 1
##$DC= 2
##$DFILT= <>
##$DTYPP= 0
##$F1P= 15.7292609196834
##$F2P= 12.9074282941183
##$FCOR= 0.5
##$FTSIZE= 0
##$FT_mod= 4
##$GAMMA= 1
##$GB= 0.15
##$INTBC= 1
##$INTSCL= 1
##$ISEN= 128
##$LB= 0.24
##$LEV0= 0
##$LPBIN= 0
##$MAXI= 10000
##$MC2= 0
##$MEAN= 0
##$ME_mod= 0
##$MI= 1.114404
##$NCOEF= 0
##$NC_proc= 0
##$NLEV= 6
##$NOISF1= 3.799351
##$NOISF2= 2.8
##$NSP= 1
##$NTH_PI= 0
##$NZP= 0
##$OFFSET= 15.70392
##$PC= 1
##$PHC0= -25301.37
##$PHC1= 9.387309
##$PH_mod= 1
##$PKNL= yes
##$PPARMOD= 0
##$PSCAL= 0
##$PSIGN= 0
##$REVERSE= no
##$SF= 200.130013532006
##$SI= 16384
##$SIGF1= 3
##$SIGF2= 2
##$SINO= 400
##$SIOLD= 16384
##$SREGLST= <1H.CDCl3>
##$SSB= 0
##$STSI= 0
##$STSR= 0
##$SW_p= 3612.71676300578
##$SYMM= 0
##$S_DEV= 0
##$TDeff= 0
##$TDoff= 0
##$TI= <>
##$TILT= no
##$TM1= 0
##$TM2= 0
##$TOPLEV= 0
##$USERP1= <user>
##$USERP2= <user>
##$USERP3= <user>
##$USERP4= <user>
##$USERP5= <user>
##$WDW= 1
##$XDIM= 8192
##$YMAX_p= 0
##$YMIN_p= 0
$$ End of Bruker specific parameters
$$ ---------------------------------
##NTUPLES= NMR FID
##VAR_NAME=  TIME,          FID/REAL,        FID/IMAG
##SYMBOL=    X,             R,               I
##VAR_TYPE=  INDEPENDENT,   DEPENDENT,       DEPENDENT
##VAR_FORM=  AFFN,          ASDF,            ASDF
##VAR_DIM=   8192,          8192,            8192
##UNITS=     SECONDS,       ARBITRARY UNITS, ARBITRARY UNITS
##FACTOR=    0.0002768,     1,               1
##FIRST=     0,             0,               0
##LAST=      2.2672688,     0,               0
##MIN=       0,             -110454,         0
##MAX=       2.2672688,     110292,          0
$$ Real data points
##PAGE= N=1
##DATA TABLE= (X++(R..R)), XYDATA
$$ [...]
2290C71j577q52l11N53J108J667J116J93j89j325j561j167l45K90J243J208J378
$$ 371 -1206 -2058 -2369 -1816 -708 959 2075 2268 2079 754 -807 -1974 -2319 -2029 -786 422 1800
2307A800O93l90j318j244j219o28P3J304J105J376Q04L5j086j439j413p58J09
$$ 1800 2493 2103 785 -459 -1678 -2306 -2233 -929 176 1552 2356 2391 1305 -134 -1547 -2305 -2196
2324b196Q14J824J039P79J45r74j405j098j065j86R66J097J398R65L97p82j294
$$ -2196 -1382 442 1481 2260 2405 1431 26 -1072 -2137 -2323 -1357 -260 1138 2103 2500 1718 424
2341D24j639r19j66P61J102J552J004L01n32j289j545j080m40Q07P29J500J166
$$ 424 -1215 -2134 -2300 -1539 -437 1115 2119 2420 1888 599 -946 -2026 -2466 -1659 -930 570 1736
2358A736O31m56j226j011j515l30kJ242J537J204L40k3q97j492j310n98N4P55
$$ 1736 2367 1911 685 -326 -1841 -2171 -2173 -931 606 1810 2150 2127 1230 -262 -1572 -2170 -2116 -1361
2376a361J612J279N11K30p83j730j140p70j95J037J441R29R12J99q53j367r83
$$ -1361 251 1530 2041 2271 1488 -242 -1382 -2152 -2347 -1310 131 1060 1972 2171 1318 -49 -1032
2393a032r05l69L44J373J590J064J79n30j146j492r11o26M99J211J424J135O27
$$ -1032 -1937 -2306 -1962 -589 1001 2065 2244 1714 568 -924 -1835 -2461 -1962 -751 673 1808 2435
2410B435o15j187j205r84o72o0J304J437J332N35k34j029j344j384m98k77J397
$$ 2435 1820 633 -572 -1556 -2228 -2288 -984 453 1785 2320 2086 1057 -287 -1671 -2169 -2446 -1049
2427a049R30J491J123l89m00j495j593m68k40O53J114J466Q84K28o61j120j515
$$ -1049 -119 1372 2495 2106 1706 211 -1382 -1850 -2090 -1437 -323 1143 2027 2255 1594 474 -1041
2444a041p57l32K59J341J174J276K91m26j089j421j083k60K76R44J658J093N55
$$ -1041 -1798 -2130 -1871 -530 644 1920 2211 1785 696 -725 -1808 -2068 -1792 -848 810 1903 2458
2461B458n47j148j304j249n33M75R71J103J249O64j90q50j387r05p88m2O87J264
$$ 2458 1911 763 -541 -1790 -2323 -1848 -877 226 1475 2139 1949 1099 -288 -1193 -1981 -2023 -1336 -72
2479g2R95J256j39n30j320j573o61K5Q98P37J191R80L04o58j113j235o29l41l9
$$ -72 923 2179 2040 1510 190 -1383 -2044 -2019 -1121 -384 807 1787 2091 1433 320 -915 -1544 -1885 -1924
2498a924J582J281R25N92p17j089j542r61l12N14O56J499J283M45n46o65j425
$$ -1924 -342 939 1864 2456 1739 650 -892 -1853 -2165 -1651 -995 504 1787 2232 1686 1021 -404
2515d04q18p25j50J456R55J072P73Jj032j059j246p29o4Q79J113J192L96K69p32
$$ -404 -1222 -1947 -2097 -641 314 1386 2159 2160 1128 69 -1177 -1906 -1970 -1091 22 1214 1610 1879 1147
2534A147r08j546o92p6P25J034J216J046M1l03j346j133j135j28N56J156Q76J333
$$ 1147 239 -1307 -1999 -2075 -1350 -316 900 1946 1987 1684 338 -795 -1930 -2058 -1502 -346 530 1863
2552A863j1m8j240j173r67k77M28N38J393R65O70m72r11j227q28n48K30Q40J167
$$ 1863 1852 1804 564 -609 -1576 -1853 -1425 -887 506 1471 2141 1669 758 -469 -1297 -1845 -1615 -775 392
2571C92J039N68j02j095j093n66p96p9N52J111J126P02J30p01r88j267o48MM10
$$ 392 1431 1999 1897 802 -291 -857 -1653 -1732 -1180 -69 1057 1759 1889 1188 200 -1067 -1715 -1711 -1301
2590a301J318Q02Q55Q5o86q00j027q05k67K62J076J114P85O2j18q64j154p19l07
$$ -1301 17 819 1674 1759 1073 273 -754 -1559 -1826 -1564 -488 626 1411 1473 1355 491 -663 -1382 -1689
2609a689L48O37P79J107O02l42p13r84q46o96J47P72Q84J150O50j24p01j149j014
$$ -1689 -1341 -704 75 1182 1784 1442 729 -255 -1101 -1797 -1650 -878 6 1156 1806 1682 981 -168 -1182
2628a182n04r6O46J313J016M27o2l95j029r77o49q8O25Q19R84N68J50p39o93o95
$$ -1182 -1686 -1782 -1136 177 1193 1620 1558 1163 134 -843 -1492 -1580 -955 -136 848 1416 1566 827 134 -561
2648e61p38l44N65Q44R33Q22r5k0r59r77n36l84M00O05P79R10M95n73p70j126
$$ -561 -1299 -1643 -1078 -234 699 1521 1426 1406 447 -530 -1066 -1450 -1050 -445 334 1244 1739 1166 396 -730
2668g30m83j03J03N69J021P85J29P2p52o87r19n82K71L61J139Q11M13j1n15o44
$$ -730 -1213 -1316 -1213 -644 377 1162 1291 1363 611 -76 -995 -1577 -1306 -945 194 1005 1418 1407 892 248
2688B48j109o51J75M75O66O27Q18J60m19o52r40o82j60M55P82Q03M21L97k95r10
$$ 248 -861 -1512 -1337 -862 -196 431 1249 1409 990 338 -602 -1284 -1444 -989 -207 596 1017 1414 1119 209
2708B09q40n99j48K2J104P89L47L64j79o01j128r9o65m2Q46R32P62K82k3q40n18
$$ 209 -631 -1230 -1378 -1356 -252 537 884 1248 1069 468 -660 -759 -1424 -1466 -620 312 1074 1356 1333 493 -25
2729b5j192l9m1O38O57R53J29M0n19o28q83n13J18M12R17Q61L19J61n29q46n47
$$ -25 -1217 -1256 -1297 -659 -2 951 1080 1120 601 -27 -910 -1423 -1305 -893 24 885 1204 1365 836 -10 -557
2750e57q29J29K99Q68O84O00J90m39q80n68n28n83Q74M50P28R81j55k77n10q48
$$ -557 -1386 -1257 -958 -90 594 1194 1384 945 65 -503 -1031 -1614 -740 -290 438 1419 1264 987 477 -371
2770c71p26m70M99N37Q57Q70L5%q09o98n25o00O8O43Q34P17L81q2l44j062l47
$$ -371 -1097 -1567 -1068 -531 326 1196 1231 1231 422 -276 -801 -1401 -1333 -690 144 861 1242 1160 816 -246 -593
2791e93o08L0N11N07R12N06k35m65p94n40p21K42M64R01N51N04Rj75p84r15m62
$$ -593 -1201 -1171 -660 -153 759 1265 1030 565 -229 -769 -1490 -1248 -784 117 668 1172 1181 1006 222 -693 -1155
2812a155J30K63N06P55N78J46m44o54o20p14k87O60N03P83M04M62k39p16o68m89
$$ -1155 -1025 -762 -256 499 1077 1223 779 125 -495 -1209 -1496 -836 -333 450 854 1316 1077 361 -307 -796
2832g96k47k4O02P44P52J82k39n85n24q68J7k19M97P25R01O2O6n92l17q70n75
$$ -796 -1043 -1067 -465 279 1031 1213 974 389 -135 -1003 -986 -1205 -708 17 918 980 1046 454 137 -733 -1308
2853a308R7L52R23M28N80J4k22r02n81l85p9J03P51Q29K25M87m93o97o94l76k10
$$ -1308 -1211 -859 64 492 1072 1086 864 -38 -619 -1004 -1083 -980 -229 600 825 1312 819 122 -572 -948 -1158
2874a158L83K35Q92P24M7J13q16r56k56m03K61L28Q12N35L18m7n35o80o77r6j12
$$ -1158 -775 -540 352 1076 1123 1236 420 -536 -792 -1195 -934 -606 206 741 1059 1012 477 -203 -880 -976 -1088
2895a088N67Q12N29J15K17l79p36q00m44J29N22O17N13L57q0j36l62j035l66r9
$$ -1088 -521 291 820 935 1152 773 37 -763 -1207 -1078 -556 61 574 931 851 715 353 -682 -1048 -1147
2915a147M29O66N92N31P0m41o06n01n19k09L92K92P43M39K36l5o48p37l1o09M74
$$ -1147 -718 -52 540 1071 1141 700 94 -407 -926 -1135 -743 -451 292 731 967 932 284 -453 -484 -1093 -619
2936f19L90M69O20K22l84k31n50q94M7J33L12L99O63M47j24k62p58k10l51j59
$$ -619 -229 240 860 1082 698 467 -83 -977 -930 -797 -485 -86 577 1024 900 638 -120 -330 -681 -840
2956h40M05N04O41K12K90o02o62l05k71l99M29N65L41P27k32l47j83o95m46pQ7
$$ -840 -435 69 710 922 1212 610 -52 -357 -628 -1027 -598 -33 308 1035 803 456 273 -422 -868 -875 -788
2977g88N87M66L08K63l8n13m70l69l98K6O63L64N92K11qn85n00k80k25r7l6Q46
$$ -788 -201 265 573 836 798 285 -185 -554 -952 -926 -263 101 693 904 896 311 -189 -469 -694 -791 -827 19
2999A9O23K32r4l79m97l62j88o5M72L89L12L63j6k54m38n56j11j20L3N05L15M01
$$ 19 642 874 780 401 -96 -458 -646 -711 -239 150 462 825 809 555 117 -439 -550 -670 -637 -132 183 584
3021E84J54l55j96m18l97r3J56L53J26O91K8K67q80m29k06k0K25K44M62M46J68
$$ 584 738 383 187 -231 -628 -721 -565 -212 -86 605 633 900 20 -409 -615 -635 -410 -166 296 742 910
3042I10l98l15m59l13k84K29L64N30K78N01j84o01l32k86J2j98K01O29L32l5q4
$$ 910 512 197 -262 -575 -859 -630 -266 264 542 1043 859 258 -74 -360 -348 -546 -345 284 616 581 497
3063D97j43k18o37j9m5J13M72L78KJ29j53m56j48j88k91N36j8M39L07L8k21k65
$$ 497 354 136 -501 -520 -565 -452 20 398 400 529 376 -80 -228 -416 -707 -171 -189 250 557 595 374 109
3085A09m03m33K72L6J48L98L54K06k44j69o21r4j1n3M91M04qM15m50j93l49l02
$$ 109 -294 -727 -455 -419 -271 127 481 687 443 274 -347 -441 -452 -505 -14 390 382 797 347 154 -195 -497
3107d97j28Q4O6Q88j51K28j16k02j46n23m3K79l8O77J92P6k08k13n26n3m01J89
$$ -497 -625 -541 -475 413 262 490 374 172 26 -497 -540 -261 -299 378 570 646 438 225 -301 -354 -755 -566
3129e66M00K28J60L21r7j20j29l18j93q9q4O14L13R3p0j98m46J66n50k0L95K50
$$ -566 -166 62 222 543 446 326 197 -121 -314 -403 -487 127 440 533 463 265 -181 -15 -565 -585 -190 60
3151F0J77K85j49j62j97k23k39L3J9L50K29q6J92K77m56m02J21k41J6M19K72j27
$$ 60 237 522 373 211 14 -209 -448 -415 -396 -46 183 97 289 566 110 -292 -171 -412 -396 23 295 168
3173A68J21l9j89k69l0J80l42K41n2O62l15L89n55j54k84K90J3j85K80J82K48
$$ 168 289 250 61 -208 -238 -58 -400 -159 -211 451 136 525 -30 -184 -468 -178 -165 -350 -70 112 360
3194C60o7l81q1J41n32PmN77K57nn6K69n75j39l70M23j14M89J2r5J62r6rp11K12
$$ 360 293 -88 -169 -28 -560 -553 -557 20 277 272 216 485 -90 -229 -599 -176 -290 199 211 116 278 182 173 -538 -326
3219c26o0K20N14l41M23o4l6j68n02l49M43k15M10L84Km5j26j6j54j57l10%J81
$$ -326 -386 -166 348 7 430 366 330 162 -340 -689 -246 -461 -51 333 335 290 164 148 -6 -163 -473 -473 -292
3242b92K64N20P8k58n59o0l24k6L82K96L22J08N1j37k28p4m73J95j01L05J04L20
$$ -292 -28 492 570 312 -247 -307 -631 -657 -275 21 343 451 502 365 137 63 -410 -215 -316 -11 93 413
3264D13o1P0k19m13k9q3j09K34K68J00L40k33M7m58j72k17p7K88L46K58K78j15
$$ 413 352 422 203 -210 -239 -322 -431 -197 71 171 511 278 325 -133 -305 -522 -599 -311 35 293 571 456
3286D56l16l17J73l27j00K72r2L49M68k08n6k45k97l76K09L78J01K45j9j89O1
$$ 456 140 -177 -4 -331 -431 -159 -251 98 566 358 302 57 -240 -616 -407 -29 72 317 298 109 170
3307A70o8n00p6K45q9N88K24qN5j49o67j07o8j26L01J34M09J30P8l23k34k0l74
$$ 170 102 -398 -474 -229 -318 270 494 486 541 392 -275 -382 -450 -576 -275 -141 268 398 476 153 -81 -101 -475
3330d75J15K6P12m90O32J49m10k01l90l41j11J90M41J12K00J80j3Qn66o1m24L66
$$ -475 -360 -334 378 -112 520 669 259 58 -332 -673 -784 -594 -153 -41 159 339 326 334 -232 -293 -717 -351
3352c51J96L58M54J61k52k89l25m41M7k5rJ84Q31j1k48j16k00l70l29N1M68L54
$$ -351 -155 203 657 818 566 277 -48 -489 -442 -467 -476 -292 539 528 280 164 -36 -406 -735 -684 -216 138
3374A38J44K31R4m80k0m67m26K60J69J39O09J91l33J94l38k85l47j71L6M24K75
$$ 138 282 513 607 127 107 -360 -786 -526 -357 -218 391 582 249 443 105 -180 -527 -698 -662 -238 37
3395C7M47l16n1k7o64j20k08K17K59P15q3Q0J60l78k46l03n5j36K15N06L56P2
$$ 37 484 168 117 90 -574 -694 -902 -685 -426 289 206 286 446 68 -178 -481 -536 -672 -457 49 405 477
3417D77m2j19n09j46m55J83L21m1N17J38m1j29r9l16l32j19N22J22K17L27L01
$$ 477 435 316 -193 -339 -794 -611 -290 -331 186 324 283 154 55 -261 -593 -712 -190 -68 149 476 777
3438G77l93m24l3k89k84M14L61K48K45j16j0k44k18m33N3J29J46J22M72n5n0l47
$$ 777 384 -40 -73 -362 -646 -232 129 377 622 506 496 252 34 -399 -346 -217 -71 51 523 468 418 71
3460G1k94l85l71M21L54K41m3L40p0k77l52l55K40j48N65J70O74j70J04o74j44
$$ 71 -223 -608 -979 -558 -204 37 -6 334 264 -13 -365 -720 -480 -628 -63 107 781 611 715 41 -103
3481a03j52l87K25M14O2J62M33k18ko69k94k44l4L16L54L52M27n1n5l91l17r3
$$ -103 -255 -642 -417 -3 59 221 654 436 434 -235 -529 -773 -807 -491 -137 215 642 591 536 145 -172 -265
3503b65oJ6N36L44j4L98n80m56k95n14j39J70P24L32K8L28j04m59l12l82K02L4
$$ -265 -271 -255 281 625 611 1009 429 -27 -322 -836 -975 -805 -81 251 279 607 503 44 -268 -650 -448 -414
3525d14L72M52J93K42l34k37o92l3n38L98K52L30K57M87j64j54n51k28l54J94
$$ -414 -42 410 603 845 511 274 -418 -451 -989 -591 -339 -9 248 735 571 417 -134 -362 -716 -522
3545e22N16N7L84K62N9k17p02m72j3j83K93P14K69K98O8k15m0q60m00j45N93n8
$$ -522 -6 51 435 697 756 539 -163 -635 -648 -831 -538 176 445 743 811 596 556 -304 -704 -849 -256 -314
3567c14Q32j23K53k06n38n25J3n7J04M29P42OL7n5l89k44m02l51J22L89L20P62
$$ -314 518 395 648 442 -96 -621 -608 -665 -561 -132 610 616 653 598 209 -35 -437 -788 -666 -277 43 805
3589H05k83J6j59o13r2j68j48M20M38J92J78k21O0n50m57j97J17L43M95M47L18
$$ 805 522 538 379 -234 -326 -494 -642 -222 216 408 586 365 425 -125 -582 -779 -662 -319 176 623 941
3610I41j14j34q49k13k49p6J15M44O21N8M97o74j12o02k28k85M68L65K58K26l9
$$ 941 827 693 -156 -369 -618 -694 -579 -135 486 544 1041 367 255 -347 -575 -860 -392 -27 231 457 418
3631D18K8l62n72o71J96L35O12M28N49J65l92n07o36l14l45L1N91O91L22J58j47
$$ 418 446 84 -488 -1159 -963 -628 -16 412 961 1126 734 227 -409 -723 -1068 -1037 -446 245 567 725 578
3652E78j63k70p44Ll80M69N06K15M80N9j01o09n47J37k24K63L49L67L62P3l64
$$ 578 415 145 -599 -596 -976 -507 -1 214 694 753 652 43 -504 -367 -591 -328 21 388 750 823 459
3673D59m71o09l7r3M28L77M86M92k47k33n13n62o40K29M44L13M15M52K80r7n65
$$ 459 -12 -621 -658 -751 -323 54 540 1032 785 552 39 -523 -1163 -934 -490 -177 238 690 970 873 308
3694C08n19o19J05l07N47M82O29K06j13m07l84o05m31M69K11J92O36N92m12j25
$$ 308 -211 -830 -725 -1032 -485 -3 626 832 719 312 -72 -677 -1108 -639 -428 -236 400 992 580 455
3714D55o16j45r0l98M80N45j4N39l3l76k19q07k61P6K36O75M54L81j61m26l45
$$ 455 -161 -306 -396 -794 -314 231 217 756 723 347 128 -679 -940 -864 -628 47 501 882 721 295 -50
3735e0n52o2l70N2J009M43L72M90p21l55p07l39k90K73O33L94Q20j02j40j87m94
$$ -50 -602 -664 -1034 -982 27 470 842 1332 611 256 -451 -790 -1080 -807 -174 220 1040 938 798 611 117
3756A17o28j40o08N24P36N22M79q9m31l41o45k22K9j48P22P33M03k23m80j38m90
$$ 117 -511 -651 -1259 -735 1 523 1002 913 482 141 -504 -726 -697 -845 -123 610 1013 790 310 172 -318
3777c18l06k18K59M94M65K50L28l74n35n53l08rMR74P6M83J90r0m95o81k18k84
$$ -318 -624 -842 -583 -89 376 626 954 580 45 -508 -816 -825 -821 153 229 712 902 812 317 -364 -582 -866
3799h66K42O69M64K35L65m22n27n15n79k8J07O68M56O67n6K91n88j244j02k40
$$ -866 -624 45 509 744 1109 687 160 -355 -934 -962 -855 -187 269 936 880 1171 583 -661 -763 -1003
3819a003q5N17P09O53L30j58l62n61m36p78l8M67N69N97N98L1m57l12p84l40l42
$$ -1003 -1088 -571 138 791 1121 963 601 40 -396 -1174 -1212 -745 -176 421 1019 1050 593 281 -503 -843 -1185
3840a185N52K86N68M99M33l06n95o59k52m47K0P27O54M14K23J23m39q31p62R5
$$ -1185 -633 -347 221 720 1153 847 252 -407 -659 -1106 -1086 -359 295 709 932 1055 616 -215 -977 -882
3860h82PL18N89N18K46L2l18l32r07q4n20Q18L33N08N26P6l91l83n77k64l74N31
$$ -882 -875 -557 32 550 796 828 510 178 -729 -813 -1333 -515 -182 326 852 928 537 154 -423 -687 -1061 -530
3882e30N56K22M54qO4o94k95o61J78j43N33O67K28K75j55m65l29o24j08K1N27
$$ -530 26 248 702 694 758 64 -231 -892 -714 -857 -324 343 571 846 691 226 -103 -727 -835 -814 -287
3903b87N46L69Q5k92k16o34oq19N24K09N70Q25q0j41k57m49m83l33Q7O42L96L96
$$ -287 259 628 713 421 205 -429 -435 -1254 -730 -521 49 874 794 653 396 -53 -536 -869 -782 -140 256 652
3925F52K29r9n03m06m08j89m1K25O05N89K39l65N5p01n81k18q1P62K34L22N00
$$ 652 881 782 279 -127 -535 -724 -765 -540 65 654 893 528 583 -118 -699 -917 -998 -236 -2 320 820
3946H20K34m01l71q10n24j72M32P11N53O28k72m4n50o64m16l82L42O42K88R00
$$ 820 1054 653 282 -528 -1052 -1224 -792 -81 472 1100 828 784 234 -430 -846 -1228 -886 -244 44 944
3966I44nj30m28o44o88j93K41J89R92L96L51k2l90r70m02m75L02K75N89P31K58
$$ 944 939 809 381 -263 -951 -1144 -903 -714 278 674 1025 1003 613 -357 -759 -1234 -932 -657 -68 663 921
3987I21l1k79m86m93n86N5J14Q81N3R02K6k57m19q40l04l09J33N66M22N46K84
$$ 921 890 611 125 -368 -954 -899 -785 96 149 1051 1077 820 401 -439 -743 -1052 -919 -353 69 615 899
4008H99j05m49l14p56k41L9M02P81O53n8O4m27n05n35k13j68L72O28M14O11K4
$$ 899 794 345 31 -725 -966 -927 -525 256 909 851 915 488 -17 -552 -765 -933 -561 67 481 1092 1116
4029A116m69o91n12l72k5J81N56O56M52m5l13l10o61m71j40O26M25L41N99o4k06
$$ 1116 647 -44 -556 -928 -953 -772 -216 440 892 847 534 224 -437 -908 -1048 -422 3 344 943 879 673
4050F73m26o66m98o1oP03Q13K47L49k32n63n75m75l3j09M53O34J74N63m44K3n99
$$ 673 247 -419 -917 -978 -984 -281 532 779 1128 896 333 -242 -717 -750 -859 -406 228 402 965 521 544 -55
4072e5n82j83N7K81M12O71L16j42j05p93k78k11l93M23P11K57O77j30l13n45m11
$$ -55 -637 -820 -763 -482 -70 601 917 775 670 -123 -401 -612 -1005 -582 129 386 1063 933 620 75 -336
4093c36n70J36J72L98M68N08J48j86n08m36p53K06J71J68P46L67J63k58k19n94
$$ -336 -906 -770 -598 -200 268 776 924 738 230 -206 -959 -753 -582 -414 332 699 862 604 385 -209
4113b09m41KO1M1O80L52K24Ll20m53l78n34K98K76M67L71O04j92m09m81o13m22
$$ -209 -650 -648 -587 -546 134 486 710 713 393 -60 -438 -972 -674 -398 69 440 1044 852 443 -38 -651 -1073
4135a073L87J9J104j53N15j42k51k53o99k19j43K07O20J45O06J34k71m16n87k31
$$ -1073 -686 -667 437 284 799 657 406 153 -546 -765 -908 -701 -81 64 670 804 533 117 -470 -701
4155g01j16M24L89K68k6O38j87m60m49p25L56q1J40J043K15M0L0m71o63k74k44
$$ -701 -817 -393 -4 264 238 876 689 229 -220 -945 -589 -670 -530 513 728 768 798 327 -336 -610 -854
4176h54L92%R56J34L31k54l51l80n13j41j7O80p1P34K96j99l19l65p26k78J91
$$ -854 -462 -462 494 628 959 705 354 -26 -539 -680 -697 -17 -88 646 942 743 424 59 -667 -945 -754
4197g54j1O13O12K57N3m71l42j36n28r0J04O77L63M91j10O3p12m91k36k92M70
$$ -754 -765 -152 460 717 770 299 -43 -179 -707 -797 -693 -16 347 838 728 791 79 -412 -648 -940 -470
4218d70K72M77K67K06N0o72l60l24m16L25L71P61K51N0n1k38q19j69m05O0M36
$$ -470 -198 279 546 752 802 130 -230 -554 -970 -645 -274 487 738 788 737 499 -320 -489 -894 -834 -398
4239c98M09N52K62J19n57l84n42l63K07K25M40N55K98K41m05o21n62l30k45K31
$$ -398 11 563 825 944 387 3 -539 -902 -695 -470 -30 525 823 1064 659 38 -524 -854 -1099 -868
4259h68N85O65M31J07m54l46o62jm94K48M45O76N45j62k20j53o72j76m80L01Q5
$$ -868 -283 382 813 920 466 120 -542 -543 -1037 -789 -344 332 877 715 495 342 -330 -506 -986 -685 -600
4280f00R07L73K10J32p23n51m45J76k73O05K36N34R7J42k92o46m75n10K12N96
$$ -600 307 680 890 1022 299 -252 -697 -521 -794 -189 47 581 678 820 528 -118 -593 -1103 -891 -295
4300b95L86K95M03j87k87m10l41j74k21K13P10L71M24o2k19l66o87P0m56P0M74
$$ -295 91 386 789 602 315 -95 -436 -610 -831 -618 92 463 887 825 606 240 -447 -377 -833 -763 -289
4321b89O84K66R4k3p31k56m20j01J72N22M22M40J61j37m13q94j23k05J15M19L08
$$ -289 395 661 755 732 1 -255 -675 -776 -604 -82 340 780 941 804 391 -503 -626 -831 -716 -297 11
4342A1O24K33k21j08n89n20pM1J55M41M31M80N6l64o51m01r9n09O94L55K40K52
$$ 11 635 868 647 539 -50 -570 -577 -536 -381 60 491 971 1027 663 12 -389 -488 -997 -303 52 292 544
4364E44K66j92m64m47n43J27O0N74N28J86J81k41l87k93o23n3K71L32L82M54j08
$$ 544 810 618 154 -293 -836 -709 -649 -75 453 639 820 579 192 -101 -724 -777 -506 -174 208 662 554
4385E54J3L4o16m73l98L06M05M07J42L52K31n51o32m78M4O7O4N08O01J87m10R6
$$ 554 567 601 -15 -488 -886 -580 -175 232 374 726 957 406 -226 -704 -660 -593 -529 -21 580 767 357 453
4407D53m97k69m63PN74N7P77K8l4j59m48j66k88k58J38K76M79O52O8n34k49o0
$$ 453 -44 -313 -776 -769 -195 -138 639 667 633 474 26 -140 -428 -686 -548 -272 207 859 927 393 144 84
4429H4l82o30N33K17L86K88M52j48o07n39j01m66M69K53L74K03J52R7j99n78l92
$$ 84 -298 -928 -395 -178 208 496 948 800 193 -346 -447 -913 -444 -191 183 386 538 635 436 -142 -534
4450e34j94N2K82L23M57K79j16p9m76n42k87M9L37K69L95N07o7j87k67n87l12
$$ -534 -728 -676 -394 -71 386 665 549 470 -6 -548 -835 -786 -449 -180 215 722 655 468 201 -386 -698
4471f98k52M68M60M92J71R1p6m30j55o76r2L23L37L88J35K93l07k37l93l65m2
$$ -698 -950 -482 -22 470 641 732 656 226 71 -605 -697 -374 -37 351 486 779 472 235 -158 -523 -565
4492e65L0K81K51N63R3o8l39n21l93op8K79M15N41J93M2k52o37m07j35Q5M36J96
$$ -565 -535 -254 -3 560 653 585 246 -275 -668 -674 -752 -473 -58 483 676 718 466 -171 -578 -713 -628 -192 4
4515DN00J29J82k65p67k61j94j26L66J39N37R9K74j48k48k35m87j71M7M98N15
$$ 4 504 633 815 550 -217 -478 -672 -798 -432 -293 244 343 617 469 221 -14 -501 -672 -625 -127 388
4536C88L71Qj61m26m40K9j40m43K59P30J04N94j0n18n15m11j69J39K77L01K74
$$ 388 759 767 606 180 -260 -231 -371 -814 -555 175 279 873 863 345 -170 -581 -750 -611 -334 -33 241
4557B41M49k56O0n51k09n85J15N76K49M10K61Mj3p33m26j95j20L62J38M17M9L11
$$ 241 690 434 494 -57 -266 -851 -736 -160 89 499 760 764 751 18 -408 -603 -723 -361 -223 194 243 554
4579E54q2k68o17O7m78K14L58M86J80J87k3l83j00p67p4O9L21L66M22K17Rk74
$$ 554 472 204 -413 -346 -824 -610 -252 234 414 601 578 195 95 -672 -746 -677 -356 10 432 649 658 384
4601C84n96n46J74l24M11Q99J80L8P8l2o90m87j18k7K12M59J22N96K84m93n23
$$ 384 -212 -758 -584 -908 -497 402 582 620 698 666 -24 -511 -629 -656 -444 15 137 733 1017 524 1
4622An64j17J72R5K58O43J53K13l66l44l66l77J17L0O3O08q5O17j63m38l67k23
$$ 1 -563 -680 -508 -413 -155 488 641 854 488 144 -222 -599 -482 -452 -389 219 134 751 588 150 -217 -440
4644d40R4k77M81L46L84j2q5m01m44j16k60j0L55M00L52K96Mk08o16k66k47j84
$$ -440 -346 -623 -142 204 588 576 491 90 -354 -470 -730 -740 -385 15 367 663 667 459 -157 -423 -670 -854
4666h54O86r5P00O5J73k53n20n3n44j23L22M42L43N11k4n12j40m45k59k56M87
$$ -854 -168 -263 437 502 675 422 -98 -151 -695 -818 -496 -54 289 800 776 264 124 -321 -580 -836 -349
4687c49K13N99J84R5j38l92n38l79j63M07J97K97N30J20o6k39k74m75l37K07Q
$$ -349 -136 463 647 742 604 212 -326 -705 -868 -461 -264 33 563 683 617 378 104 -371 -708 -501 -493
4708d93M11M91L56j33l50m18l19l54L7N36M22K21L00l93J32o29j94j66j96L47
$$ -493 -82 409 765 632 282 -136 -455 -809 -772 -236 186 407 707 314 446 -183 -377 -543 -739 -392
4728c92N78J88K87j84J20j22q33J44n67P3M02N27P6M22k43j36o97j60j70M21K1
$$ -392 186 374 661 477 597 475 -358 -214 -781 -708 -306 221 297 719 476 340 -357 -517 -687 -266 -245
4749b45N53Q9L64l90j12k32m68j44M0K36K43M91K42j38N9o37m70K76l46J60L33
$$ -245 308 397 761 371 259 27 -441 -585 -545 -309 -66 425 667 529 588 -49 -519 -243 -589 -429 -96
4770i6O94j5Q8l15j32n22j87k01K67L50O7N72j31j8k09n96L1k26j93O33K09K77
$$ -96 598 583 671 356 224 -298 -485 -686 -419 -69 -2 570 439 421 212 -384 -353 -579 -772 -139 70 347
4792C47K49j62j28n16k29l53j06O86K75J28N76j71n0p06l64l15K96M37K00K34
$$ 347 596 434 306 -210 -439 -792 -898 -212 63 191 767 596 546 -160 -524 -839 -543 -106 94 328
4812C28M63k43j84l67m60r4m2L56M03J52J12N2r2m07O2n15l05K05L59M84j0K18
$$ 328 791 548 364 -3 -463 -557 -599 -243 160 312 424 476 384 -23 39 -476 -781 -576 -217 267 257 475
4834D75l0n98j57l34L52Pj68N95O63P0k58l80m73k62q4L1L05L24M5N56k37p6m84
$$ 475 445 -153 -310 -644 -292 -285 -453 142 805 875 617 237 -236 -498 -582 -551 -246 78 123 679 442 366 -118
4857a18k99j71k9L46L41M87j72J57k47k64m23J38m37M01K12L99L25j84j23n37
$$ -118 -417 -588 -617 -271 70 557 385 542 295 31 -392 -254 -691 -290 -78 321 646 462 339 -198
4877a98m4j56j79N5L91K47J93N68l25n24N7o79j06L36P2M60K80k4J10l03m63k78
$$ -198 -242 -398 -577 -522 -131 116 309 877 552 28 85 -594 -700 -364 -292 168 448 424 534 231 -232 -510
4899e10P3j9K36o7M53L37P9k84m62k07k93J90J73K67L84R3k6j64k51l73k33N3
$$ -510 -437 -456 -220 -287 166 503 582 298 -164 -371 -664 -474 -301 -34 350 443 417 253 2 -371 -604 -551
4921e51L46L87j33L10J44P7p71o8m66L84l37P45n7M47J15l33k01l3n12j44J99
$$ -551 -205 182 49 359 503 580 -191 -259 -725 -341 -678 67 10 457 572 239 38 5 -507 -651 -452
4942d52M11K68M23K5l39k5n15k52po1M4N74K53L6j04qj32n48j70J41P8N59K66
$$ -452 -41 227 650 675 336 311 -204 -456 -463 -524 -480 94 347 383 279 271 139 -409 -579 -438 -360 199 465
4965D65N2j25m34O3l09j64j20j6M09O36k1L0k60m36Kl23r8N23K62K28j9K42k95
$$ 465 517 392 -42 21 -288 -452 -572 -588 -179 457 436 466 206 -230 -228 -551 -649 -126 136 364 345 587 292
4988B92k24l82R2k55R6J52N13J43j12j94J35l83k42n4p4M97O7M74j43p8l36J58
$$ 292 68 -314 -222 -477 -381 -229 284 427 315 121 256 -127 -369 -423 -497 0 67 541 398 320 -16 142
5010A42n81l72L02J95J48J05K63M12m33j94k92j10K7J25O7M63K00p2k84k64p3
$$ 142 -439 -811 -509 -314 -166 -61 202 614 181 -13 -305 -415 -388 -263 -196 267 467 395 111 -153 -226
5031b26r3k07L95J41J82J84P5k65k17k42J04k91L02R0N39p7O1j48l33l56n7J19
$$ -226 -319 -526 -131 10 192 376 451 186 -31 -273 -169 -460 -158 -68 471 394 455 307 -26 -382 -439 -320
5053c20k66L53N6M70L86l47k21o3n26J83j73M68J30L29J27k52k63M7m74k65K75
$$ -320 -586 -233 -177 293 679 332 111 48 -478 -295 -468 0 130 459 586 334 71 118 -356 -621 -346
5074c46m4M44L84Q3M9m28j55l74j39K19m1J56L03N28m05l7j98l19j11k96O10J75
$$ -346 -390 54 438 521 570 142 -13 -387 -526 -307 -348 -192 111 639 234 197 -1 -320 -431 -727 -117 58
5096E8J86K06K13m84j38l37Rj97K62L10j09M53r8L0m00k13p9r2P9J09M21L72j16
$$ 58 244 450 663 179 41 -296 -287 -484 -222 88 -21 432 334 364 -36 -249 -328 -420 -341 -232 189 561 445
5119D45j51j65m81M1n5k1L27J53K69J28n4k10l51k82L46m00N0K88L31K33K20l25
$$ 445 294 129 -352 -311 -366 -387 -60 93 362 490 436 226 -125 -407 -61 -461 -411 -123 208 441 661 336
5141C36j6l27m65Q5L01j84L90M82j23m17Lk95j35J25j48L70Q4K78pM4l20O4l72
$$ 336 320 -7 -472 -387 -86 -270 120 602 479 62 65 -230 -365 -240 -388 -18 66 344 337 381 61 125 -247
5164b47k98P1J95K49K30L16o8j83n27j20j26J17R6K37M73L38m18j31j28l87j95
$$ -247 -545 -474 -279 -30 200 516 448 265 -262 -382 -508 -391 -295 -58 415 753 335 204 76 -311 -506
5185e06Q7L4L99L27Q6k87L09j75j97o24P7K64J38M44JJ03l32k91J47k10k56K9
$$ -506 -419 -385 14 341 427 140 449 274 77 -547 -470 -206 -68 376 377 480 148 -143 4 -206 -462 -433
5207d33K87M73l3Q2k28k32J5l76J61p9M38k07O11j53O0k23k33k12l1k05N37J0
$$ -433 -146 327 294 376 148 -84 -69 -445 -284 -363 75 -132 479 326 386 163 -70 -282 -313 -518 19 29
5229B9L33L9m2n33J24k77j50J86n7L84K38J61l3j18l52k91j24J95K87n7o2M76
$$ 29 362 401 359 -174 -50 -327 -477 -291 -348 36 274 435 402 284 -68 -359 -483 -288 -1 -58 -120 356
5251C56J15l28J7l16L2k98J10J65M63j6kj39Nl82n0j29R9K75l9M29o5J51l10m78
$$ 356 471 143 160 -156 -124 -422 -312 -147 316 300 298 159 164 -218 -268 -397 -298 -23 -62 367 302 453 143 -335
5275c35K23q9M6K51j71N58rj53K9l89j13l19L53j2K88L09k19L08m53k26j3j9k13
$$ -335 -112 -201 -155 96 -75 483 474 321 350 -39 -152 -471 -118 -130 158 467 248 556 103 -123 -136 -155 -368
5298c68K82M6K74L08l03K7l70Qj57R4j81J40N01M1J38m07N6l91l87L92N5J31K73
$$ -368 -86 -40 234 542 239 266 -104 -96 -253 -159 -340 -200 301 342 480 73 129 -262 -649 -257 -202 -71 202
5321B02j55K81l4n5l28o5nJ28k77O10op9J71l48j44K3j78r3P6K83K96R3o3j81
$$ 202 47 328 294 239 -89 -154 -159 -31 -308 302 296 217 388 40 -104 -81 -259 -352 -276 7 303 396 333 152
5345A52k17l01J76o0o0L25J40K53m0k94l5ok67n9J70k50O85n8J8p4ll43k79K41
$$ 152 -65 -366 -190 -250 -310 15 155 408 368 74 39 33 -234 -293 -123 -373 312 254 272 198 195 -148 -427 -186
5369a86J25J00J95J93j33P2k41l58J4j06J38K83N4J83J4j65j83j65j44j68J62
$$ -186 -61 39 234 427 294 366 125 -233 -219 -325 -187 96 150 333 347 182 -1 -166 -310 -478 -316
5390c16J44N3L51K32r8m7l66j13l06J35K84j85K37P3J36J17j64p07N7J04J77J89
$$ -316 -172 -119 232 464 366 319 -47 -160 -466 -331 -47 -232 5 78 214 331 167 -540 -483 -379 -202 -13
5412a3l43O57j75m7K14n34j68J17J09j40O66m3J32q8l75R0m05m9n9M01q1L40P2
$$ -13 -356 301 126 79 293 -241 -409 -292 -183 -323 343 300 432 344 -31 59 -346 -395 -454 -53 -134 206 278
5435B78K8j54l84o6k09P8J94R3L35j62L23l38j04l95R7J40J01K13L76k56l7K74
$$ 278 306 152 -232 -298 -507 -429 -235 -142 193 31 354 16 -88 -483 -386 -246 -145 68 444 188 151 425
5457D25o25J35k81J35m5jL72L23m8k05j33j75k50J39K78P8J66k2Q2J61n11m49
$$ 425 -200 -65 -346 -211 -256 -257 115 438 390 185 52 -123 -373 -234 44 122 288 266 348 509 -2 -451
5479d51J39j99L73J74P0K46k6o7l21Q4j71j66J65J19L43K53m7l91J28k37q3m69
$$ -451 -312 -511 -138 36 106 352 326 259 -62 22 -149 -315 -150 -31 312 565 518 127 255 18 -65 -534
5501e34M11j08J73L86l42K41q0k47J29m26J02l1K92J49O8N2l42K96j97j18q0J26
$$ -534 -123 -231 -58 328 -14 227 147 -100 29 -397 -295 -326 -34 115 183 235 -107 189 -8 -126 -206 -80
5523h0j54N32l1j29j76J51j79K9j59k53K34K54J90K14l29j03o6k38j17P3J65M35
$$ -80 -234 298 267 138 -38 113 -66 -37 -196 -449 -215 39 229 443 114 11 -55 -293 -410 -337 -172 263
5545B63J1p5O8j42j89j64K1k47J54L99J05J29l13K84j83m40O9n9J73J70N8J23
$$ 263 274 199 267 125 -64 -228 -207 -454 -300 99 204 333 20 304 121 -319 -250 -309 -136 34 92 215
5567B15l9n9p7j11l66K8L15q1J28N13l48o8n8j13j04pJ52J95L01m06r9K07l51
$$ 215 176 117 40 -71 -437 -409 -94 -175 -47 466 118 50 -8 -121 -225 -232 -80 115 416 10 -89 118 -233
5590b33j80j7L51l64L85k1M54J24m27N3l75k3J07L9J5J15Q3J24N8j84Rj68k59
$$ -233 -413 -430 -79 -443 -58 -79 375 499 72 125 -250 -273 -166 -127 -112 3 86 210 268 84 93 -75 -334
5613c34P1J05J7K90K15m67L9j25k01j1K53J58O0K8Po7Lk55k10M07j79J06J2Q0
$$ -334 -263 -158 -141 149 364 -103 -64 -189 -390 -401 -148 10 70 98 105 38 41 -214 -424 -17 -196 -90 -78 2
5637BJ76n1J05l23k86q0Q6Q8M09J18J46k41P7n6k65P8l39K38L31r4Q5J41k45j18
$$ 2 178 127 232 -91 -377 -457 -371 -283 126 244 390 149 226 170 -95 -17 -356 -118 213 119 204 345 100 -18
5661a8l2k53J92k61M02J48J58K51k96k09j5q8k29p9K21N7M47j24j35k47j95J00
$$ -18 -50 -303 -111 -372 30 178 336 587 291 82 67 -21 -250 -329 -108 -51 396 272 137 -110 -305 -205
5683b05k82M57j81M20k8K35l37j93j83J36l07L41o1N5M15o5mL9k09k67J1j83M08
$$ -205 -487 -30 -211 209 181 416 79 -114 -297 -161 -468 -127 -188 -133 282 217 213 252 43 -224 -213 -396 12
5706A2qK71o1J26k78j52ok3j56J03K35l4L26j87O2p8j24j44n6l5L6L51P6J39k7
$$ 12 4 275 214 340 62 -90 -96 -119 -275 -172 63 29 355 168 230 152 28 -116 -172 -207 -171 180 256 395 368
5731C68j68q2m04j88L91J87l16M68k27K33j65j90j63J83k16L01o0K94O1P1k05
$$ 368 200 118 -286 -474 -83 104 -212 256 29 262 97 -93 -256 -73 -289 12 -48 246 307 378 173
5752A73k94N4j93MP9K06J74P1j2j08K13p21n6j7L01J19J99J69j52k59K69j69n52
$$ 173 -121 -67 -260 -256 -177 29 203 274 262 154 367 -354 -410 -427 -126 -7 192 361 209 -50 219 50 -502
5775e02P0L4L48J35k1J66j01p4o4j96k53M5M03o7K76J6k18K06l86J07m01L79k55
$$ -502 -432 -398 -50 85 64 230 129 55 -9 -205 -458 -413 -10 -77 199 215 -3 203 -183 -76 -477 -98 -353
5798c53N14J90j97M3J19m37J45l20M6j9M05l1l3J06k66O8j97p0Q1j4M22j7k08
$$ -353 161 351 154 197 316 -121 24 -296 -250 -269 136 105 72 178 -88 -20 -217 -287 -206 -220 202 185 -23
5821b3N18j99m35n1j14K26j76K03J83k5M21l92K12m02k60K11P6j51n6L13K83j58
$$ -23 495 296 -139 -190 -304 -78 -254 -51 132 107 528 136 348 -54 -314 -103 -27 -178 -234 79 362 204
5843B04j16M6k2o3m03L66j92L10L3N4m92Q3J1o0J23L2L05k11j0J98J8k53l08J5
$$ 204 88 134 112 49 -354 12 -180 130 163 217 -275 -192 -181 -241 -118 -86 219 8 -2 196 214 -39 -347 -332
5867c32K04j44J01L29j49K11P0l75q6n6K19j17j62L68K66m4j92j0j40k02j55J78
$$ -332 -128 -272 -171 158 9 220 290 -85 -171 -227 -8 -125 -287 81 347 303 111 101 -39 -241 -396 -218
5889b18J90n7K02J73j38k92J85j08k22L74j19j82K10J68P7j81M3k90O4j46j79
$$ -218 -28 -85 117 290 152 -140 45 -63 -285 89 -30 -212 -2 166 243 62 105 -185 -121 -267 -446
5910d46J97M00K9M5K3n57o7m8K02o4J56L82R9j6k33k57o4K44k27j45M59J6J6J61
$$ -446 -249 151 180 225 248 -309 -376 -424 -222 -286 -130 252 351 335 102 -155 -219 25 -202 -347 112 128 144 305
5934C05k64j44m3L4j81L0K66J65J83k27oj91j03j08k56K32J27M22j39K90l18K4
$$ 305 41 -103 -146 -112 -293 -263 3 168 351 124 118 -73 -176 -284 -540 -308 -181 241 102 392 74 98
5956I8j12r7j54K04j42J43J45J54k2l2r8l16K8j28K33J27J38J7J02l38j05R5l30
$$ 98 -14 -111 -265 -61 -203 -60 85 239 217 185 87 -229 -201 -329 -96 31 169 186 288 -50 -155 -60 -390
5979c90K51kJ33QM9J15k94J62k0k2l24J03M09r3J80P3O7n51J95m42L33l0J54O4
$$ -390 -139 -141 -8 0 49 164 -130 32 12 -10 -334 -231 178 85 265 338 405 -146 49 -393 -60 -90 64 128
6003A28k02K55J0J68n75k07J44J14Q5J17J37P1j56q1k29M4j47J39mL65L3j60L27
$$ 128 -74 181 191 359 -216 -423 -279 -165 -80 37 174 245 89 8 -221 -177 -324 -185 -189 176 209 49 376
6026C76j07j55o20J00N2K11K10n2J74k8R0k19k70Q3L4j5J31j8N21m95L5j23j31
$$ 376 269 114 -506 -406 -354 -143 67 15 189 161 251 32 -238 -155 -121 -136 -5 -23 498 3 38 -85 -216
6049b16J98k3k06J00L05N2K36l34J22m76J20j55L56k44K20M10k38J45n82K87l30
$$ -216 -18 -41 -247 -147 158 210 446 112 234 -242 -122 -277 79 -165 55 465 227 372 -210 77 -253
6070b53nj94K39J79L67R8k90o9l6m99L38j33J31m2L15K64k19j39J9j36l66P1q6
$$ -253 -258 -452 -213 -34 333 431 141 72 36 -463 -125 -258 -127 -169 146 410 191 52 71 -65 -431 -360 -446
6093d46N56J89j9j57l7j74k4k00O0O5k15M79L00k59L13k34m11r2j14J5N07k5l9
$$ -446 110 299 280 123 86 -88 -112 -312 -252 -187 -402 77 377 118 431 197 -214 -306 -420 -405 102 77 38
6116C8K90j06j25k60L9l12K54K36K5n0L27l31m1k26J03j63J43o4N00n1l6J70j00
$$ 38 328 222 97 -163 -124 -436 -182 54 79 29 356 25 -16 -242 -139 -302 -159 -223 277 226 190 360 260
6139B60l45M5k21k05M29r9K48K46J05l54r3j08k35K2J08M78l42K53j45J05j39
$$ 260 -85 -40 -261 -466 -37 -136 112 358 463 109 16 -92 -327 -305 -197 281 -61 192 47 152 13
6160A3J4m27P3Q2J14K17j14L22N2j29l29j9j61M2L7Q0M23K44k32l74j59k7K31
$$ 13 27 -400 -327 -245 -131 86 -28 294 346 217 -112 -131 -292 -250 -213 -133 290 534 302 -72 -231 -258 -27
6183b7j12J22J57J27O7nm05N9k38j07K40J6J98L5n7p1M10n47J26j20j26J22N7
$$ -27 -139 -17 140 267 334 329 -76 -17 -255 -362 -122 -106 92 127 70 -1 409 -138 -12 -132 -258 -136 -79
6206g9o7K88k5J12r7m10J30O4j36rM40J5j84K12k03j45j20J1k28M25Q7K0M24l57
$$ -79 -146 142 117 229 132 -278 -148 -84 -220 -229 211 226 42 254 51 -94 -214 -203 -431 -6 81 101 525 168
6230A68j19j78L7n8k21N4N85j07k35K31nk82J04k99R1L46k85L11k8K05j34l34
$$ 168 49 -129 -92 -150 -371 -317 268 161 -74 157 152 -130 -26 -325 -234 112 -173 138 110 315 181 -153
6252a53j19j8K10j48L41Q8m4o7K75l02j04l27K0K06L17j93M40j94K34l11m13Q4
$$ -153 -272 -290 -80 -228 113 201 157 90 365 63 -41 -368 -348 -142 175 -18 422 228 462 151 -262 -178
6274a78j43K05J42k04J49L17r4j13k07j11k07O6J24O2M98j48J80Jm09K16l34j87
$$ -178 -321 -116 26 -178 -29 288 194 81 -126 -237 -444 -378 -254 -192 306 158 338 339 -70 146 -188 -375
6296c75J54K23J43J25r2j79J53j17j05j79M97k40J24j8J48j25R5l89k01j24L07
$$ -375 -221 2 145 270 178 -1 152 35 -70 -249 248 8 132 114 262 137 232 -157 -358 -482 -175
6317a75L29p6lL08q7m16Q8j33J9P1o7N7M24K01k90p1m62J10J18j39q5J05K86K47
$$ -175 154 78 75 383 296 -120 -32 -165 -146 -75 -142 -85 339 540 250 179 -283 -173 -55 -194 -279 -174 112 359
6341C59k36K7l26o1J99m47L27J14Q1K00K14n27J22k83j40J68P1J15L35L12n53
$$ 359 123 150 -176 -237 -38 -485 -158 -44 37 237 451 -76 46 -237 -377 -209 -138 -23 312 624 71
6362G1J42k83o0k85J02R6J90K77j26j33K52m73J95m69K55k77N51J27j6L80l73
$$ 71 213 -70 -130 -415 -313 -217 -27 250 124 -9 243 -230 -35 -504 -249 -526 25 152 136 516 143
6383A43M0k08k66o8Q5O6K41N6L00o9r1k01l54j8N8K09L40k04P6M5j96k20J34j90
$$ 143 183 -25 -291 -359 -274 -208 33 89 389 320 229 28 -326 -344 -286 -77 263 59 135 180 -16 -236 -102 -292
6407b92l4K52R2J38J46j24n7k62n9p2q5J39J81K52K22l06J94l35j37j96j37K38
$$ -292 -326 -74 18 156 302 178 121 -141 -200 -272 -357 -218 -37 215 437 131 325 -10 -147 -343 -480 -242
6429b42K62N4L25n05J48J19j75l85n8K61j8J36M29l84K68l13j75Q8j45R5K38K94
$$ -242 20 74 399 -106 42 161 -14 -399 -457 -196 -214 -78 351 -33 235 -78 -253 -165 -310 -215 23 317
6451C17j94Q2J2o6p6l71k10M12m0K33R1J81j2k03l98J04j93O4J50L47o5K03k64
$$ 317 123 205 217 151 75 -296 -506 -94 -134 99 190 371 359 156 -242 -138 -331 -267 -117 230 165 368 104
6474A04J13l28j51k35K64K50l7J03J60O4j70k68O1j92q4L18J19lJ95j56L5j1j50
$$ 104 217 -111 -262 -497 -233 17 -20 83 243 307 137 -131 -70 -262 -346 -28 91 88 283 127 162 151 1
6497Am25L10k20K21J58K18N9r5K1k15k74k49L92j80L35J34j02k0Q8r2k52j76L84
$$ 1 -424 -114 -334 -113 45 263 322 227 248 33 -241 -490 -98 -278 57 191 89 69 157 65 -187 -363 21
6520B1k20L39M0K47j56J56o38J52k42Q3J98R4J76j52J10n9j53k35r0j45L12J06
$$ 21 -199 140 180 427 271 427 -211 -59 -301 -218 -20 74 250 98 208 149 -4 -239 -329 -474 -162 -56
6542e6J37qj4J87q1m24j09K41qJ71l5Q5J48q4q5L1m8l41k28N54k49L43L25l11
$$ -56 81 73 59 246 165 -259 -368 -127 -135 36 1 86 234 150 65 96 48 -293 -521 33 -216 127 452 141
6566A41K27l40l65O1J71k37N03R2j09m5p9Ol7j49m1j52K48K08K16r8Nj23l84J93
$$ 141 368 28 -337 -276 -105 -342 161 253 144 99 20 26 -11 -160 -201 -353 -105 103 319 221 226 103 -281 -88
6590h8j72m6L88j01K54j90J94o4m10J82j46J33L7K33l32K85J74k84ol25K97l98
$$ -88 -260 -306 82 -19 235 45 239 175 -235 -53 -199 -66 -29 204 -128 157 331 47 41 -284 13 -385
6612c85L47K4K05q4n7J59k59k39n1L43LJ51j71J67j3N5M3l75o2K17k93J74N27
$$ -385 -38 -14 191 107 50 209 -50 -289 -340 3 6 157 -14 153 140 195 238 -137 -199 18 -275 -101 426
6635D26k3k46L02k41m86o3K41r5J96J59j20M10m6k99k33j76j53K87J74L50j61
$$ 426 403 157 459 218 -268 -331 -90 -185 11 170 50 460 414 115 -118 -294 -447 -160 14 364 203
6656B03J8l63J98k31L0k01j82L11L58K7r7Q4K20m75l74J51R2m4R2L83j1O2j24
$$ 203 221 -142 56 -175 -145 -346 -528 -217 141 168 71 155 375 -100 -474 -323 -231 -275 -183 200 189 251 127
6679A27j47l14J65J15m0R3P8K47j25j52j25J37k64j33P4J59L34j03k78L88k47
$$ 127 -20 -334 -169 -54 -94 -1 77 324 199 47 -78 59 -205 -338 -264 -105 229 126 -152 236 -11
6700a1k7j33N5j79J12R5L19L85n78j5O2k53O5p1J90p2K68K5m3r9m8l75L7Q4m2
$$ -11 -38 -171 -116 -295 -183 -88 231 616 38 23 85 -168 -103 -174 16 -56 212 237 194 95 47 -328 -291 -207 -249
6725b49M55k03O04j95l80P7m91J15j35K52K94PJ04j84J79j04j53j95o7J88j18
$$ -249 206 3 607 412 32 109 -382 -267 -402 -150 144 151 255 71 250 146 -7 -202 -269 -81 -199
6746a99Q6K65K18l40j90K39j97j80J39J25K51J05N0p6l15J59l22o0R8N0K07K70
$$ -199 -113 152 370 30 -160 79 -118 -298 -159 -34 217 322 372 296 -19 140 -182 -242 -144 -94 113 383
6768C83o1j38j13j25j74l2j42K81L05J5RO5j21j23l2k65J03o9K24K6N8J69j97
$$ 383 322 184 71 -54 -228 -260 -402 -121 184 199 208 273 152 29 -3 -268 -165 -234 -10 16 74 243 46
6791D6p8n4k16J19j0O7K18%j6M00m24k13J03ll09R8M44R8j42J94K5n52l8K38j8
$$ 46 -32 -86 -302 -183 -193 -126 92 92 76 476 52 -161 -58 -61 -370 -272 172 270 128 322 347 -205 -243 -5 -23
6816b3j37K36K11j1n3O8k26k02n4k0J9L06k30L74j31j34j00J40j79j66L22Q9m9
$$ -23 -160 76 287 276 223 291 65 -137 -191 -211 -192 114 -116 258 127 -7 -107 33 -146 -312 10 99 50
6839E0J50PQ4l91k37L69k40K04j77L32k1K57m47mJ08l28K2J22P0L2K86Qk16Q2
$$ 50 200 207 291 -100 -337 32 -208 -4 -181 151 130 387 -60 -64 44 -284 -262 -140 -70 -38 248 256 40 122
6863A22k19R3l32L20J69r9M2j18K68l32k1P1m0k34K08J68j42J87L29k98k66n7
$$ 122 -97 -4 -336 -16 153 54 96 -22 246 -86 -107 -36 -76 -310 -102 66 -76 111 440 142 -124 -181
6885a81K28k90K28l2K6J99K02q1l52R0l16J37j05L01k01K16P1Kk66mj45J8J51
$$ -181 47 -243 -15 -47 -21 178 380 299 -53 37 -279 -142 -247 54 -147 69 140 142 -124 -128 -273 -255 -104
6908a04J15J27l1l8L41l53j26k4k69J40J00L29k06K39jl5j78j4j28J4L08k46L78
$$ -104 11 138 107 69 410 57 -69 -93 -362 -222 -122 207 1 240 239 204 26 12 -116 -102 206 -40 338
6931C38j34J93l41k45L2q3J63k5L1L8Q4J83k27K84l11l57J48JJ91K00k10L60l17
$$ 338 204 397 56 -189 -157 -240 -77 -102 -71 -33 51 234 7 291 -20 -377 -229 -228 -37 163 -47 313 -4
6954dJ02Q0j79j31J73j8J82k02J28n6j75J17j50oJ20j32J93J70n7j91K6j25j14
$$ -4 98 178 -1 -132 41 23 205 3 131 75 -100 17 -133 -139 -19 -151 42 212 155 -36 -10 -135 -249
6977b49o7L08J82j06Q1J12p7J18n03j78M29k43%J13J74J04j40Oo7l75N09k86R9
$$ -249 -316 -8 174 68 149 261 184 302 -201 -379 50 -193 -193 -80 94 198 58 64 -3 -378 131 -155 -56
7000e6O2n7J26l0r6J04k34p0q1K65l4J62j42K14L38l83p8j35O5k68J48K04K47
$$ -56 6 -51 75 45 -51 53 -181 -251 -332 -67 -101 61 -81 133 471 88 10 -125 -60 -328 -180 24 271
7023B71J60j28m50J08l68L83m9n5L36j7j27R7m22J77q0m9R1J04K46k11J43J59
$$ 271 431 303 -147 -39 -407 -24 -73 -128 208 191 64 161 -261 -84 -164 -213 -122 -18 228 17 160 319
7045C19k75Jk40Jr6J59J88K6L92k29m90L36k53j05J5J85Q5J32K62l21j63Po4R8
$$ 319 44 45 -195 -194 -290 -131 57 83 475 246 -244 92 -161 -266 -251 -66 19 151 413 92 -71 -64 -128 -30
7069c0j03J19N4k7J40p5L22l36j8m46L22J52j45J30K63m23L63m0j58k97L2J10
$$ -30 -133 -14 40 13 153 78 400 64 46 -400 -78 74 -71 59 322 -101 262 222 64 -233 -201 -91
7091i1N0J45m5J92j14l6j32l6k67J40R4K19j7p5K92l23o6j39J58n4j5J15Q3l7
$$ -91 -41 104 59 251 137 101 -31 -67 -334 -194 -100 119 102 27 319 -4 -70 -209 -51 -105 -120 -5 78 41
7115D1L09j16l23J08j65k68M35M8j67M07J3j80k4m30L67k00n5J78P9k2O3K72m05
$$ 41 350 234 -89 19 -146 -414 21 69 -98 309 322 142 118 -312 55 -145 -200 -22 57 35 98 370 -35
7138c5j49J63j56o3P0M0K43R7O1m0m42J53j36K16O0qo0K24o6j18k19k76K18j69
$$ -35 -184 -21 -177 -240 -170 -130 113 210 271 231 -211 -58 -194 22 82 74 14 238 172 54 -165 -441 -223 -392
7162c92K3K84K18K3K19j81q7j61j89K9L21o4r0J33M24m22Mj26m7k28N1L3M21M5
$$ -392 -369 -85 133 156 375 194 107 -54 -243 -214 107 43 -47 86 510 88 92 -34 -81 -309 -258 -225 196 241
7186B41j52O1j16p2j78J60l88L09J74k1K62j70jl28K02j91r6K38J54O5j42L59
$$ 241 89 150 34 -38 -216 -56 -444 -135 39 18 280 110 109 -219 -17 -208 -304 -66 88 153 11 370
7208C70j72l38K85n04J62O1J09M3K96l9j12j21p2k66J31r0N3L17j6K36K00l71
$$ 370 198 -140 145 -359 -197 -136 -27 16 312 273 161 40 -32 -298 -167 -257 -204 113 97 333 533 162
7230A62j30k46j81M53j39P2K07j26M9k75J84k93P8J09K44l24L67L03m71Rj20j73
$$ 162 32 -214 -395 58 -81 -9 198 72 121 -154 30 -263 -185 -76 168 -156 211 514 43 52 -68 -241
7252b41K93J50j90o2P8J50K7j21J2j89k29j14L12J99r5J38o8J50j21r8p8j75J88
$$ -241 52 202 12 -50 28 178 205 84 96 -93 -322 -436 -124 75 -20 118 50 200 79 -19 -97 -272 -84
7275h4Q0j12N04l87L94k66n7l7r3j26j38J16K69N5K15m22J95j60j95p6L85r7J85
$$ -84 -4 -116 388 1 395 129 72 35 -58 -184 -322 -206 63 118 333 -89 106 -54 -249 -325 60 -37 148
7298A48j47J15p9j28j47Q1J39l6J83j09k5j49K00k42noQ9J41j04J22q8N0J23M6
$$ 148 1 116 37 -91 -238 -157 -18 -54 129 20 -5 -154 46 -196 -201 -207 -118 23 -81 41 -47 3 126 172
7322A72k76J2M09l66J25m17K78K03nj3p8m0l21L95R5K4j05J89k74j8O6j72k8k04
$$ 172 -104 -92 317 -49 76 -341 -63 140 135 122 44 4 -317 78 173 197 92 281 7 -11 55 -117 -145 -349
7346c49L62K29j17N2qk42K36k32k24J9L24J36J00j92P7J5j70K4j51K7j69O6K68
$$ -349 13 242 125 177 169 -73 163 -69 -293 -274 50 186 286 94 171 186 16 40 -111 -84 -253 -187 81
7369H1K49j42P0l63J13j79R0K28l6j56L6NK27j46j92N4m39M42j03R0K96m1j81
$$ 81 330 188 258 -105 8 -171 -81 147 111 -45 -9 -4 223 77 -115 -61 -500 -58 -161 -71 225 184 3
7392Cp3P2J73k30J86m7K8O8l14R2K5j18k5K10j58j1J26L24p0q8m01M04m20j3K44
$$ 3 -70 2 175 -55 131 84 112 180 -134 -42 -17 -135 -160 50 -108 -119 7 331 261 173 -228 176 -244 -257 -13
7417a3ln6J24R3M3K2n40K56l7j19J54K53j52J5K14l33R6l53L28O6N6l0J88j14
$$ -13 -16 -72 52 145 188 210 -330 -74 -111 -230 -76 177 25 40 254 -79 17 -336 -8 58 114 84 272 158
7441A58J04J15k81k66Q9P5j39J99P1l4K2o4q2k60K9K95k51J76P3p0L01p7r4R1
$$ 158 262 377 96 -170 -81 -6 -145 54 125 91 113 49 -33 -293 -264 31 -220 -44 29 -41 260 183 89 180
7465A80k90R8l03M09j10J31K28m28O1k88L56j41J6j5J88P4k46m9P5K7J8L0j56
$$ 180 -110 -12 -315 94 -16 115 343 -85 -24 -312 44 -97 -81 -96 92 166 -80 -129 -54 -27 -9 21 -135
7488a35J45J65j23L8j77K31O8j48j97O2K50k0j16K00J09j33n05K61j1j60J08Q6
$$ -135 10 175 52 90 -87 144 212 64 -133 -71 179 159 43 243 352 219 -286 -25 -36 -196 -88 -2
7510bl04P27l73K9Kl35K59p4p5J50J34l8q6l3J03lj4P0L7j40M8J05L02j88l65
$$ -2 -306 421 48 77 79 -256 3 -71 -146 4 138 100 14 -19 84 81 67 137 174 34 82 187 489 301 -64
7535f4k73Q8j7J32K57K10j82Q9j6o3k80K2j33J74J83j15K31j39O1l8k69Q5J21
$$ -64 -337 -249 -266 -134 123 333 151 240 224 161 -119 -97 -230 -56 127 12 243 104 165 127 -142 -57 64
7558F4o9L1J32j69n4J4R0M56n27j76J04k09J25J49Q1K35j44k23J90j02r9q9L47
$$ 64 -5 26 158 -11 -65 -51 39 495 -32 -208 -104 -313 -188 -39 42 277 133 -90 100 -2 -101 -190 157
7581A57l4mj26k9k2M1J3j23j9Q9Q2K2o9K86l37o4o4J41L75l43O3M4P6j07j08J86
$$ 157 123 119 -7 -36 -58 -17 -4 -127 -146 -57 25 47 -22 264 -73 -137 -201 -60 315 -28 35 79 155 48 -60 126
7607A26k05J34j57mL3J11J30j45P6N8j55j79K98J28j58j3P9k10j25J06p4J4O1
$$ 126 -79 55 -102 -106 -73 38 168 23 99 157 2 -177 121 249 91 78 157 -53 -178 -72 -146 -132 -71
7630g1P2k2n2P5p5o2L30k62l9L8j18J17L3L66k64M8k22On2J16j12J00K28k22K83
$$ -71 1 -21 -73 2 -73 -135 195 -67 -106 -68 -186 -69 -36 330 66 114 -108 -102 -154 -38 -150 -50 178 -44 239
7655B39j42j25K3j72M35l34Jp0K38j7l1O3k23K4L0j40J43k0J53Q0N8k20%J10j00
$$ 239 97 -28 -5 -177 258 -76 -75 -145 93 76 45 108 -115 -91 -61 -201 -58 -78 75 155 213 -7 -7 103 3
7680CJ34k61p9Q9L21j68K35l80K12r7j88J35M28l53n0R0%l27L04J4n6l7k47L77
$$ 3 137 -124 -203 -114 207 39 274 -106 106 9 -179 -44 384 31 -19 71 71 -256 48 62 6 -31 -278 99
7704I9J34j42m6J70l50L2j90L69q6J35k5j85P7J70k86L2j35K11J6J21N5j63R2
$$ 99 233 91 45 215 -135 -103 -293 76 -10 125 100 -85 -8 162 -124 -92 -227 -16 0 121 176 13 105
7727A05l9n2n8k23K20O0k1P2J16k91K91k38K2oJ32j11J11j63K00l9j41K03j96
$$ 105 66 14 -44 -267 -47 13 -8 64 180 -111 180 -58 -36 -42 90 -21 90 -73 127 88 -53 150 -46
7750d6l53J36N04k49R7P4k12L16j28o00N27j20j41K40k33L01r6j2l8j07J91k20
$$ -46 -399 -263 241 -8 89 163 -49 267 139 -461 66 -54 -195 45 -188 113 17 5 -33 -140 51 -169
7772a69K29l21K43L21l32j4j17J9J33k26J29J32Nj53K02Qk06J29J00j61k26L92
$$ -169 60 -261 -18 303 -29 -43 -160 -141 -8 -234 -105 27 32 -121 81 89 -117 12 112 -49 -275 117
7794A17M6r2J64j94P9k68J21k6J35o8j8%K25j52L0k01J95l98J49O1j39K74l05
$$ 117 163 71 235 41 120 -148 -27 -53 82 14 -4 -4 221 69 99 -102 93 -305 -156 -95 -234 40 -265
7817b65L52k2p6J42k36J01q4J59J39k96J92k40n4M80k61m7l0j4L68l32o5K06p6
$$ -265 87 65 -11 131 -105 -4 -88 71 210 -86 106 -134 -188 292 31 -16 -46 -60 308 -24 -89 117 41
7840D1P3l34K9J33N8L1J4J34j08l0J87n17K58j27L36l41L62k19J33M6j85j78j
$$ 41 114 -220 -191 -58 0 31 45 179 71 41 228 -289 -31 -158 178 -163 199 -20 113 159 -26 -204 -205
7863b05p4K35L12o7J16k10j59j20L39m03K04j62J71q8K7L44k25j17J85j34J80
$$ -205 -279 -44 268 201 317 107 -52 -172 167 -236 -32 -194 -23 -111 -84 260 35 -82 103 -31 149
7884A49K8m16J92P2j0j15Om7K2J49j4k92K94N4j58J09n4%J59l26K61r3o4J32p7
$$ 149 177 -239 -47 25 15 -100 -94 -141 -119 30 16 -276 18 72 -86 23 -31 -31 128 -198 63 -30 -94 38 -39
7909c9J99k46O8k0l6R4k5o7O6J77j33l6K25l91J09O2j5q0j6J92Q7k75O1N9J10
$$ -39 160 -86 -18 -38 -74 20 -5 -72 -6 171 38 2 227 -164 -55 7 -8 -88 -104 88 175 -100 -39 20 130
7934A30q7N8Q8l63M10j3k88K8O7r4K49l36O0J47j25J87J9m1R5j83K7j72K04k09
$$ 130 43 101 189 -174 236 223 -65 -37 30 -64 185 -151 -91 56 -69 118 137 96 191 8 35 -137 67 -142
7958a42K84j09N5p5j45K87l1j15M5j51j64K28K24J44k94j2n5j47J69K25r0p8J91
$$ -142 142 33 88 13 -132 155 124 9 54 -97 -261 -33 191 335 41 29 -26 -173 -4 221 131 53 244
7981B44k74J43m9j84K57Ml57K17J98J08l37J91j36J1P2j06j20O7J13m2M6J2j29
$$ 244 -30 113 64 -120 137 141 -216 1 199 307 -30 161 25 36 108 2 -118 -51 62 20 66 78 -51
8004e1n3K94j00j9l4l1l6M8J72n5k15k60L40j44J84r8K2L51j78l12p1l4L41q6
$$ -51 -104 190 90 71 37 6 -30 18 190 135 -80 -340 0 -144 40 -58 -36 315 137 -175 -246 -280 61 -25
8028b5J31L73m09j62R8j30k6l5l4j8L15m3K4k19J67J21j53J41l02R0J41j49O7
$$ -25 106 479 70 -92 6 -124 -150 -185 -219 -237 78 35 59 -160 7 128 -25 116 -186 -96 45 -104 -37
8051c7J57q8m4K11k04k93J39J42j50JJ46J40j47p2O8k31J75k21L21J01J59l28
$$ -37 120 32 -12 199 -5 -298 -159 -17 -167 -166 -20 120 -27 -99 -31 -262 -87 -308 13 114 273 -55
8073e5j81L60o3k42R8K33j03r1o2L20k06r2K94l64J52k76K20R9K36l23J20R5j08
$$ -55 -236 124 61 -181 -83 150 47 -44 -106 214 8 -84 210 -154 -2 -278 -58 41 277 -46 74 169 61
8096F1k43J35jJ88L3k09M7J41j2l63K88N4m49J02M21q1K9q6l3j81o0J98k5J1R1
$$ 61 -182 -47 -48 140 173 -36 11 152 140 -223 65 119 -330 -228 193 112 141 55 22 -159 -219 -21 -46 -35 56
8121E6j7J05l3j68K29j95J02j80p0J86J13l86K63j09Q9J49k41J13N6K9j68K74
$$ 56 39 144 111 -57 172 -23 79 -101 -171 15 128 -258 5 -104 -15 134 -107 6 62 91 -77 197
8143A97n29M40R6k59J3j0k28K37j52K86J53K7l59O4m9P4q3J08k4k0J34j05m6j60
$$ 197 -332 108 204 -55 -42 -52 -280 -43 -195 91 244 271 -88 -24 -73 1 -82 26 2 -18 116 11 -35 -195
8167a95L64j11m26O2K17kJ95M0j28q7j83K82ml11M61J17m34M46k96r2l08N01l87
$$ -195 169 58 -368 -306 -89 -91 104 144 16 -71 -254 28 24 -287 174 291 -143 303 7 -85 -393 108 -279
8190b79M5
$$ -279 -234
8191b34
$$ Imaginary data points
##PAGE= N=2
##DATA TABLE= (X++(I..I)), XYDATA
0@%%%%%%%%%%%%%lJ0j4J4j4J7k4K8l5M2m8N6o4P7q9J01j17J34j51J70j93K18k45
$$ 0 0 0 0 0 0 0 0 0 0 0 0 0 0 -3 7 -7 7 -7 10 -14 14 -21 21 -27 29 -35 42 -47 54 -63 71 -80 90 -103 115 -130
36a30K79l14L50l92M36m85N39n96O60p30Q08q92R79j079J191j312J445j594J761
$$ -130 149 -165 185 -207 229 -256 283 -313 347 -383 425 -467 512 -567 624 -688 757 -837 924
55I24j948K160k401K683l015L406l882M475n241O271p733J0004j4041K3397q9337
$$ 924 -1024 1136 -1265 1418 -1597 1809 -2073 2402 -2839 3432 -4301 5703 -8338 15059 -74278
70g4278l6176J04285J6422M3642M5389Q206o4196n4498m0403k0862l939L2638
$$ -74278 -110454 -6169 10253 53895 99284 107490 43294 -11204 -51607 -72469 -76408 -43770
82d3770M8408N7193K5212j2881k8884k9047n7086n1121M427M0536K4988L1944
$$ -43770 4638 61831 87043 74162 45278 16231 -40855 -91976 -87549 -47013 -22025 9919
94I919M7805J9232k9373l3045k9689l4072j4028K3214L1519K9797L3822J7195
$$ 9919 57724 76956 47583 14538 -15151 -49223 -63251 -40037 -8518 21279 55101 72296
106G2296j7861l3234l6522l6441j6385J1651K2165L1836M1477K0378j2102k0617
$$ 72296 54435 21201 -15321 -51762 -68147 -56496 -34331 -2495 38982 59360 47258 26641
118B6641k4965l8674k4023J3180K4967K2839L5466L1453l576k8949k8915l0786
$$ 26641 1676 -36998 -61021 -47841 -22874 -35 35431 66884 63308 34359 5444 -25342
130b5342k7489p125J5996K9019L5122K3712R56j1708k0268l3917k8641K479J7139
$$ -25342 -52831 -59956 -43960 -14941 20181 43893 44849 33141 12873 -21044 -49685 -47206 -30067
143c0067J7557K9965L4251N736k0573k0653k2914l0124j4403J1877K3879K4295
$$ -30067 -12510 17455 51706 57442 36869 16216 -6698 -36822 -51225 -39348 -15469 8826
155H826K2094R451p075j9634k8868k5230n086R882J5672K8341L3230J0523j2515
$$ 8826 30920 40371 33296 13662 -15206 -40436 -45522 -35640 -19968 8373 41603 52126 39611
168C9611j4495k0802l2581j9361Q475J8755J8388K4091K0072j846j8878k4163
$$ 39611 25116 4314 -28267 -47628 -39153 -20398 -2010 22081 42153 40307 21429 -2734
180b734k3465j6846j558J2925K5347K9950J7015Q37o782j7834l0351k2148M22
$$ -2734 -26199 -43045 -44603 -31678 -6331 23619 40634 41471 34689 16855 -13496 -35644 -35222
193c5222R500J1868K3885K4240L184j2989j5827j9891k2198q909R568J9187K1937
$$ -35222 -25722 -13854 10031 34271 37455 24466 8639 -11252 -33450 -42359 -32791 -13604 8333
206H333J9204R084k480j5473k4253j9206n496L475J0500K2686K3204N668p905
$$ 8333 27537 36621 34141 18668 -5585 -24791 -30287 -26812 -16312 6374 29578 35246 27341
219B7341j1293j9113k5480j2922O687J4372J7776K1658J6397K42j3628j9256j8605
$$ 27341 16048 -3065 -28545 -41467 -34780 -20408 -2632 19026 35423 35665 22037 2781 -15824
232a5824j2939l229R816K1046K1563J0569J229o043j7977k5598j5584k73O314
$$ -15824 -28763 -31992 -22176 -1130 20433 31002 32231 26188 8211 -17387 -32971 -33244 -26930
245b6930J2551K1992J8831M147q028j2289j6388j6113o682O216J5556J7404J3335
$$ -26930 -14379 7613 26444 30591 22563 10274 -6114 -22227 -28909 -22693 -7137 10267 23602
258B3602O409l024j4203k0662j4751n030J289J0185J8781J7290N637m060q949
$$ 23602 30011 26987 12784 -7878 -22629 -27659 -26370 -16185 2596 19886 25523 21463 12514
271A2514j5804j6864p981M543J1616J5674J6187J0553j027j2357j7283j5401j0412
$$ 12514 -3290 -20154 -28135 -23592 -11976 3698 19885 30438 29411 17054 -229 -15630 -26042
284b6042k756Q697J7891J6114Q299K202n442j5894j8573r984K19O240J2454J8073
$$ -26042 -28798 -20101 -2210 13904 22203 24405 18963 3069 -15504 -25488 -25269 -19029 -6575 11498
298A1498J4479K220p492j1789j4333j3952p248N666J4052J2960J0066O365k260
$$ 11498 25977 28197 20705 8916 -5417 -19369 -26617 -20951 -6899 6061 16127 22492 20232
311B0232j3344j6308r993l364K044J0058J6984J3867L621k998q633j3891j4367
$$ 20232 6888 -9420 -19413 -22777 -20733 -10675 6309 20176 23797 20799 12166 -1725 -16092
324a6092o939L561J0132J2070J2346Q047j955j1910j3715j1511p929l90J0075
$$ -16092 -23031 -19470 -9338 2732 15078 23125 21170 9260 -4455 -15966 -23895 -24285 -14210
337a4210J5574J3034P480J975o915j4597j4249q034m53N165J1830J4798J0368
$$ -14210 1364 14398 21878 23853 16938 2341 -11908 -19942 -20395 -15230 -3400 11398 21766
350B1766K09p512j0710j2504j2305l813P337J2295J1132J0452O155m437j2278
$$ 21766 21975 14463 3753 -8751 -21056 -24869 -17532 -5237 5895 16347 22502 18065 5787
363E787j2211q038m148K577R689J4319R507K200l612q472j2623j2498m641M827
$$ 5787 -6424 -14462 -18610 -16033 -6344 7975 17482 19682 16070 7598 -5025 -17523 -22164 -17337
377a7337R133J0363J1093P374k960j0497j0820q922o902J006J0213J3205J0341
$$ -17337 -8204 2159 13252 20626 17666 7169 -3651 -12573 -19475 -18469 -8256 4949 15290
390A5290N203n11p679j3143j3459o698J186O395J0442J3163R382p26p640r096
$$ 15290 20493 19982 12303 -840 -14299 -20997 -19811 -13416 -2974 10189 19571 18845 11205 2109
404B109j0850j0165j491Q420J0942J0098R160L449n721j1484j1595q712l048K972
$$ 2109 -8741 -18906 -20397 -11977 -1035 9063 18223 21672 15951 4467 -7128 -15840 -18888 -15916
418a5916R586J2026R213J914l916p534j1245j0452k843N921Q122R877J0833N598
$$ -15916 -6330 5696 14909 16823 12907 5373 -5872 -16324 -19167 -13246 -5124 4753 15586 21184
432B1184m665r775r708r408o625K000R645J0719R134M757j247p652j1685j1235
$$ 21184 16519 6744 -2964 -12372 -18997 -16997 -7352 3367 12501 17258 16011 8359 -3326 -14561
446a4561n089K453O490J0653J2627P883k233p050q202j1066r867j76P762Q711
$$ -14561 -19650 -17197 -10707 -54 12573 20456 18223 11173 2971 -8095 -17962 -18138 -10376 -1665
460a665R240Q527K196o209j0657j0176p317k166M260R048J1974Q420J509l718
$$ -1665 7575 16102 18298 12089 1432 -8744 -16061 -18227 -13967 -4919 7055 15475 16984 13266
474A3266o523j0608j0800j779N313O682Q487J0014L982n286q544q707r067n190
$$ 13266 6743 -3865 -14665 -16444 -11131 -4449 4038 14052 18034 12748 4204 -4503 -13570 -18760
488a8760L058Q894J0243Q988M255j416o500j0758j0433l786K742N251R267J1911
$$ -18760 -15702 -6808 3435 12423 16678 15262 8762 -1996 -12429 -16215 -13473 -8222 1045 12956
502A2956N849l375o942p851j1123q858J049P721Q681R299Q319J452n565r591r431
$$ 12956 18805 15430 8488 637 -10486 -19344 -18295 -10574 -1893 7406 15725 17177 11612 2021 -7410
517g410o658j279L542Q788J1199P816k58l836o089j1394r995p31M387N848Q339
$$ -7410 -14068 -15347 -11805 -3017 8182 15998 15740 11904 5815 -5579 -15574 -16305 -11918 -6070 2269
532B269J0433L323n108o751p622q579l895L411P708R417Q030L564k057o324j0298
$$ 2269 12702 16025 10917 4166 -3456 -12035 -15930 -12519 -4811 4606 12636 16200 14143 7819 -2479
547b479r792l476K089M813Q983J0796M768k903m901p199j0750o796J886O605P618
$$ -2479 -12271 -15747 -13658 -8845 138 10934 15702 12799 7898 699 -10051 -16847 -14961 -8356 -738
562g38R392P160J146n411q879r807o267j338K988P537J0388O488O40k977n953
$$ -738 8654 15814 16960 11549 2670 -7137 -13404 -14742 -11754 -4217 6171 12659 13299 10322 4369
577D369r889q309p45M105N395Q867R188K630l807n918q383p808l447J945O264
$$ 4369 -5520 -13829 -14574 -10469 -5074 3793 12981 15611 11804 5886 -2497 -10305 -13752 -11807 -5543
592e543Q243P703K474j771n184r093q436k636K146M653Q151J0041L754k254m395
$$ -5543 2700 10403 12877 11106 5922 -3171 -11607 -14243 -12097 -7444 707 10748 14502 12248 7853
607G853o586r333n683J230M887P097Q321N377L29m829p817q300n481j172K720
$$ 7853 1267 -8066 -13749 -12519 -7632 -535 7786 13163 13492 8663 846 -7454 -12935 -14107 -11387
622a1387Q114R733N542M77j800n215r401p268n97K460M959P823P403K152l162
$$ -11387 -3273 6460 12002 12479 10679 5464 -3937 -11205 -11802 -9342 -4383 3440 10843 12995 9833
637I833n596o959p345l122J599N817Q025O314K518l06m224q504o873k077J220
$$ 9833 4237 -2722 -10067 -13189 -11590 -5773 2252 8566 11084 10778 6554 -1950 -8823 -10900 -9680
652i680L388P586Q019L011j719l691o744p814n374J044M354O595P009M797Q33
$$ -9680 -6292 1294 9313 12324 10605 6914 170 -7644 -13018 -11974 -7620 -1025 5984 10781 11614
667A1614l652o998p364l449j161K468O777P972M250P84j779n461q635n436r07
$$ 11614 7962 964 -6400 -9849 -11010 -8542 -1765 6207 10457 11241 9462 4001 -4634 -10070 -10977
682a0977J662M575P182O162K229k112n107o027n459k713J369N222O652N151K449
$$ -10977 -9315 -4740 2442 8604 10833 8721 3614 -2413 -7872 -10585 -9216 -3994 2658 7809 10258
697A0258j63m528p299n678j894p4L466O492O289K525j015l134n778o311l461O85
$$ 10258 10095 5567 -1732 -7410 -9304 -9378 -5912 580 6869 9394 8379 5245 -533 -6844 -10305 -9620
713i620M144N708N739L996N18l319o360n964l336j650K678O085O451K906R58j517
$$ -9620 -5476 232 5971 9967 10485 7166 806 -5158 -8494 -10144 -7466 -1381 5070 7976 8934 7417
729G417n211o857m164p73J906M633O111N061J897k108m240n453m909k524J452
$$ 7417 2206 -4651 -8815 -9588 -7682 -3049 3062 8123 10020 7912 3672 -1781 -6690 -9214 -7762
744g762M612N253M036K277p56m103n864m531j324J15L412N666N267J938l46l164
$$ -7762 -3150 2103 6139 8416 7660 3557 -2307 -6838 -8162 -8047 -4635 1031 6298 8236 7890 4726
760D726m692n302k776M97L356M705M538L228O7l369n227m458l303q18K638N621
$$ 4726 34 -5268 -8044 -7547 -4191 514 5052 8280 8347 4978 -249 -4707 -8010 -8828 -6190 -569
776e69M521L290O69j595m723n488k940p92J748L721N213M084J020k015l968m361
$$ -569 3952 7242 7911 6316 1593 -3895 -6835 -7627 -5879 -2158 3055 7139 8159 6144 2176 -2185
792b185m097k102J584L919M240L648K270p40l902m409l232j646L65K901N157L879
$$ -2185 -6282 -8384 -6800 -2881 1359 5007 7277 6537 2635 -1774 -5006 -6652 -6287 -3386 1771 5650
808E650J209q38k663m140m020k268J032K586L494L774K726j91k973m255l432k130
$$ 5650 6859 6021 3358 -782 -4802 -7070 -6038 -3452 42 3816 6542 6351 3378 -877 -4309 -6439
824f439j19K578M366L933J966M7j636m113l983k910k04K051L343L997L172Q2j902
$$ -6439 -6558 -3980 386 4319 6285 6332 4696 583 -3400 -6310 -6514 -4463 -1120 2877 6049 6131 4229
841D229l363l546l152q09K090L315L621K742J201j316k957m146k427j031P09K995
$$ 4229 866 -2680 -5832 -6641 -4551 -1236 2385 5127 6328 5012 2055 -2091 -4518 -5549 -4840 -1845
857a845L775K635J014j201k487l577k907j597J483K730L301L229J285p07k932
$$ -1845 1930 4565 5579 4378 1891 -1686 -4593 -6190 -4707 -1977 1324 4553 5838 5131 2199
872B199l276k873j172P0K508L729K889J389n08j911l782l398j837M51K276L243
$$ 2199 -1077 -3950 -5122 -5052 -2544 1185 4074 5463 4955 3044 -738 -4136 -5973 -5522 -3246 -3
888cL778J754q2k158k934l578k245l0K481L002L014K086L78j762l428l401j933
$$ -3 3775 5529 5447 3289 355 -3223 -5468 -5498 -3017 -15 2999 5085 5463 3701 273 -3128 -5061
905e061j81J140K957L671K100K32j198k450l601k483j50J382K847K785K882L82
$$ -5061 -5242 -4102 -1145 2526 4626 4858 3660 1210 -2391 -4874 -5024 -3642 -795 1990 4872 5254
921E254j195l132k689k341j372J188K823L218K428R43j081k223l455l070p63J129
$$ 5254 4059 927 -1762 -4103 -5475 -4287 -1464 1754 4182 5125 4044 1821 -1634 -4704 -5467 -4338
937d338K172L653L341J189j175k499l022l088j897O98K313L162L142J558l13k095
$$ -4338 -2166 1487 4828 6017 4842 2343 -679 -3767 -5664 -4966 -2653 509 3651 5209 4896 2801
953B801l311l200j463K34J546L004M137J414J17j952k686l500k436M65J448K914
$$ 2801 -510 -3710 -5173 -4939 -3393 -389 3748 5162 5279 3327 641 -2859 -5295 -4830 -3382 -468
969d68L105K197K66k027k723k838k137m93J322L083L298K210L23r49k647l650
$$ -468 2637 4834 5100 3073 350 -2488 -4625 -5118 -3796 -713 2585 4795 5118 4169 1522 -2128
985b128k653m62J378K584K925L064R77j579k501l390k678j463R46L014K949K952
$$ -2128 -4781 -5243 -3865 -1281 1644 4708 5685 4106 1605 -1785 -4463 -5926 -4980 -1966 983 3935
1001C935J690m27k369l700k743j427M79J832K995L616J285m81j939k625l590j827
$$ 3935 5625 5198 2829 -871 -3614 -5041 -4562 -2730 265 3881 5166 4685 2746 121 -3469 -5296
1017e296M22J725K654K910K563K86j917k661l254j689o85J607K924L184K138j82
$$ -5296 -4874 -3149 -495 2415 4978 5264 3347 686 -2568 -4257 -4942 -3335 -411 2773 4911 4729
1033D729j098k404l769k113k9Q61K281L240K690P14j324k413k922k535j092J188
$$ 4729 3631 1227 -2542 -4655 -4684 -3823 -1542 1698 4388 5102 3778 1365 -1557 -4092 -5184 -3996
1049c996K416L112K687R50m08k430l306l099p50J33J537L456L113J439q00j335
$$ -3996 -1580 1532 4219 5169 4761 2331 -975 -4074 -4824 -4691 -3154 302 3415 4854 4054 2719
1065B719k916l049j511L95J402L093K766J715J66j736k801k573k046p8J181K755
$$ 2719 -197 -3246 -4757 -4362 -2960 133 2899 4614 4780 3044 243 -2330 -4376 -4454 -3273 -518
1081e18K859J603L26j352k191l226j930J23J085K388K954K449J83j306k224k632
$$ -518 2341 3944 4270 2918 727 -2499 -4429 -4306 -3221 -833 2121 4570 4753 3447 1223 -1409
1097a409k255q24R58K233K814J846J099o97k224l141k178p28N26K002L116K371
$$ -1409 -3664 -4488 -3530 -1297 1517 3363 4462 3765 1541 -1600 -3778 -4506 -3980 -1978 1138 3509
1113C509R95m08j445k724k985j061K06J743K445K230J417K60j843k738k069j596
$$ 3509 4504 4096 2651 -73 -3058 -4119 -3913 -2170 275 2505 3922 4182 2339 -399 -2468 -4064
1129d064j69J516K752K329J433R6j006k758k292j578N4J078K352K339J911p4j302
$$ -4064 -4233 -2717 35 2364 3797 3893 2887 129 -2163 -3741 -3687 -2609 -257 2082 3993 3919 2617
1146B617k324k455j813l77J189K300K507J872N23o13k619k426j635o61P78J831
$$ 2617 293 -2162 -3975 -4352 -3163 -863 1644 3516 4039 3426 807 -1619 -3254 -3915 -3137 -1306
1162a306K900J893O86p47j907k629k371p65O25J921K060K218J165j85j766k420
$$ -1306 1594 3487 4173 3426 1519 -1110 -3481 -4246 -3621 -1700 360 2578 3743 3558 1792 -628
1178f28j968j230L24J547K539J963J221j86j216k544k429j117J29J234K018K403
$$ -628 -2596 -3826 -3502 -1955 584 2547 3768 3582 2366 -178 -2607 -3724 -3595 -2361 -343 2060
1194B060J570j67j250k145k230j364k82J533K259K075J601K65j325j653l004j224
$$ 2060 3630 3463 2213 68 -2162 -3526 -3808 -2275 -16 2059 3660 3925 2600 947 -2057 -3281
1210c281l85N01K267K766J412N46r62k055k314j830n39J098J493K300K016J011
$$ -3281 -3666 -3165 -898 1868 3280 3826 2864 809 -1505 -3335 -3874 -2776 -1283 1017 3033 4044
1226D044o74j834k575j328j141L35J673K172K191P04p08j216k497k120q69N45
$$ 4044 3370 1536 -1039 -2367 -3508 -3173 -1500 672 2863 3567 2859 1643 -854 -2974 -3843 -3298
1242c298J368K227K202J195j80j313k324k238j001O9J257K197K215J034K25j445
$$ -3298 -1930 297 2499 3694 3514 2201 -123 -2361 -3362 -3293 -2036 161 2376 3410 3635 2190
1258B190k410k180j351j41J689J802K375J467l2p05k080k390j477k31J059J920
$$ 2190 -220 -2400 -3751 -3892 -2203 -401 1974 3441 3409 2704 624 -1766 -3243 -3474 -2415 -495
1274d95K071J645N62j110j992k096j647p78N77K091K193J910M55m08j358k535
$$ -495 1576 3221 3783 2673 681 -1415 -3062 -3840 -3263 -1172 1021 2931 3386 2978 1620 -915
1290i15j863p42N25J824K240J792R24o51j650k261j747j145N12J464K078J718
$$ -915 -2778 -3520 -2995 -1171 1069 2861 3785 3134 1484 -777 -2524 -3669 -3157 -1693 385 2103
1306B103J203k49j618j816k310p00K90J033K364K183J253k35j225k381k115j509
$$ 2103 3306 3057 1439 -377 -2687 -3387 -3097 -2064 300 2483 3736 3501 2276 -105 -2220 -3729
1322c729K23J296J940J972J684L40j310j876k158j623m08J025K247K200J356Q12
$$ -3729 -3506 -2210 -270 1702 3386 3726 2416 540 -1618 -3241 -3649 -2624 -377 1823 3179 3991
1338C991j077k000k105j690l46J97K178J689J929N60q20j449k353j578p65R79
$$ 3991 2914 914 -1191 -2881 -3227 -3030 -852 837 2766 3326 2506 1057 -1296 -2874 -3639 -2660
1354b660J505K228J452R66l25j795k244j513p58K02J263K240K002P38k81j554
$$ -2660 -1155 1073 2525 3491 3166 1371 -873 -2386 -3144 -2942 -1679 561 2563 3301 3020 1466
1370A466j722k115j312K14J689J691K177J423qj308k149k000j246l61J533J965
$$ 1466 -256 -2371 -3683 -3469 -1780 -89 2088 3511 3503 2195 46 -1954 -3200 -3561 -2028 -63
1386f3K044J123O10j190k127k030j839j79N86J922K652J590K50l31j931k242j602
$$ -63 1981 3104 3714 2524 397 -1633 -3472 -3651 -3065 -1143 1509 3099 3349 3018 1087 -1155 -2757
1403b757o56O47J919K163J580P03p13j501k458j602p88K40J675K351J856Q34o03
$$ -2757 -3413 -2766 -847 1316 2896 3599 2886 1385 -1073 -2675 -3463 -3223 -1548 803 2659 3493 2890
1420B890j189k283j829j276Q92J235J898K285J120k66j608j929k319j036j69J465
$$ 2890 1701 -582 -2411 -3687 -2795 -1560 338 2623 3743 3477 1869 -60 -2379 -3415 -3584 -2119
1436b119J859K295J326L44j158k250k287j538P6P39K309K136J855K48j108j892
$$ -2119 -260 2035 3361 3705 2547 297 -1990 -3528 -3452 -2713 -404 1732 3587 3835 2727 835
1452H35k262j622o84R95J577K000J723R45o74j698k297j587m94K49J618K222J929
$$ 835 -1427 -3049 -3733 -2738 -1161 839 2562 3507 2833 1135 -1162 -2749 -3243 -2994 -1376 846 2775
1469B775Q05p00j036k393j902q88J14J565K165J697J102k2j716j905j849j301
$$ 2775 3580 2880 1844 -549 -2451 -3339 -3225 -1660 505 2202 3304 3282 1566 -339 -2188 -3489
1485c489P8J419J892K084J019O90j269k380j690j688n7J152J780J833J875K50
$$ -3489 -3411 -1992 -100 1984 3003 3693 2424 44 -1646 -3334 -3391 -2239 -459 1374 3249 3499
1501C499j350j694j855j553p62R30J961J929J686P44q80j498k303j295q73P21
$$ 3499 2149 455 -1400 -2953 -3715 -2785 -824 1105 2791 3535 2655 1157 -1146 -2441 -3314 -2593
1517b593J313K381J686N72p29j403k048j823p76O73J620J766J769R94m55j422
$$ -2593 -1280 1101 2787 3359 2630 1227 -821 -2644 -3420 -2747 -1127 639 2408 3402 2947 1525
1533A525j938j731j317L62J484K031J914P53J07j131k026k074j256R8R49J812
$$ 1525 -413 -2144 -3461 -3099 -1615 416 2330 3083 3190 2059 33 -2041 -3297 -3199 -2250 -438
1549d38K265J240J15q60j625k178j362k10R21J695K130J125L98o07j651j991j434
$$ -438 1827 3067 3182 2322 697 -1481 -2843 -3053 -2132 -437 1693 2818 3216 2609 958 -1033 -2467
1566b467o97O00J685J792J825K10n82j356k051j425n72N94J500J808J563Q64m21
$$ -2467 -3164 -2564 -879 913 2738 2948 2366 1010 -1041 -2466 -3038 -2444 -944 864 2427 3291 2870
1583B870j418j978j903p14L76J272K330J213Q54l2j209k153j822q26J67J388J665
$$ 2870 1452 -526 -2429 -3143 -2767 -1495 835 2048 2902 2870 1661 -492 -2314 -3140 -2973 -1585 80
1600H0J998J204k48j218j699j837j317j28R37J872K141R54J82n55j738k047j468
$$ 80 2078 3282 3034 1816 117 -1720 -3037 -3165 -2228 -356 1785 2739 2921 2366 628 -1419 -2887
1617b887j96P56J575K004J503L79m35j914j837j469n22L84K008J506J787L34k71
$$ -2887 -3083 -2327 -752 1252 2755 3134 2699 785 -1052 -2521 -3043 -2659 -651 855 2642 2976 2705
1634B705j610k121j335q64N84J224K092J459P06n1j589j748j511j002M61Q33K319
$$ 2705 1095 -1026 -2361 -3225 -2641 -1417 675 2134 2840 2789 1200 -548 -2059 -3061 -2600 -1767 552
1651E52J728Q33l19j051j805j933r91k63J489J745J774J172n3q50j847j830r84
$$ 552 2280 3113 2794 1743 -62 -1995 -2986 -3249 -1760 -15 1759 2931 2878 2028 181 -1649 -2633
1668b633k05R19J723J640J410K37r83j495j971j377l37Q06J697J823J205O01o18
$$ -2633 -2838 -1919 -196 1444 2854 3091 2108 613 -1358 -2735 -3072 -2266 -569 1254 2459 3060 2442
1685B442j417k009j335m37K32J671J719J626N91m06j869j531j672n47M2J648K016
$$ 2442 1025 -984 -2319 -2756 -2524 -853 866 2492 3083 2677 808 -723 -2395 -2942 -2900 -1252 764
1702G64J583O18m69j245j465j695j172K0J641J824J679J071m20r94j805j481j337
$$ 764 2347 2965 2496 1251 -214 -1909 -3081 -3061 -1420 404 2083 3154 2734 1740 -65 -1546 -2883
1719b883K17N54J731J853J272J32r05j615j872j051l23O60K034J320J447L79r03
$$ -2883 -2666 -2112 -381 1472 2744 2876 1971 356 -1516 -2567 -2890 -2230 -196 1124 2571 2950 2047
1736B047j352k117j018p37P75J502J992J612J44k54j782j648j567p17N74J220
$$ 2047 695 -1422 -2440 -3177 -2402 -900 1092 2704 2848 2594 812 -836 -2403 -3120 -2546 -1326
1752a326K328J223R05m93j526j746j713p39J83J586J714J481J321l53j146j983
$$ -1326 1002 2225 3130 2637 1111 -635 -2348 -3087 -2904 -1318 396 1877 3198 2845 1699 -284
1768b84j636j074J36J309J617J859R71Kq06j730j909j390j99J423J434J978R75
$$ -284 -1920 -2994 -2858 -1549 68 1927 2898 2900 2094 364 -1545 -2935 -3134 -1711 -277 1701 2676
1785B676R9o85j598j744j321m22P36J924J530J602K53o61j453j978j434j50K21
$$ 2676 2775 2090 492 -1252 -2573 -2995 -2259 -335 1195 2797 3050 2389 936 -1042 -2476 -2626 -2405
1802b405J517J801J620P43n06j875j627j669o39J14J701J722J596J047m16j139
$$ -2405 -888 913 2533 3276 2770 895 -732 -2401 -3040 -2926 -1225 497 2093 3140 2724 1585
1818A585j798j883p72l4J398J893J727R14j13j126j579j753j350j73J245J463
$$ 1585 -213 -2096 -2868 -2902 -1504 389 2116 3030 2917 1791 212 -1541 -2891 -3064 -1819 -356
1834c56J753J039P57j238j642j722j311p5P25J534J843J559K42o99j674j823j721
$$ -356 1397 2436 3193 1955 313 -1409 -2720 -2795 -2070 -536 1307 2866 3108 2409 735 -1088 -2809
1851b809j53L60J930J605J394Q26m12j821j621j799o42L66J585J830J766Q11p0
$$ -2809 -2962 -2602 -672 933 2327 3153 2741 920 -701 -2500 -3142 -2776 -1191 639 2405 3216 3146
1868C146j677j825j969q31K30J079J901K236J081m59j047j747k236j052k5J015
$$ 3146 1469 -356 -2325 -3156 -2926 -1847 54 2290 3371 2912 1865 118 -2118 -3170 -3195 -2180
1884b180J929J912J525j52o44j770k360r08m77Q43J655J834J665J58r45j174k365
$$ -2180 -251 1661 3186 3034 2390 620 -1740 -2648 -3125 -2282 -627 1207 2872 3030 2085 911 -1454
1901a454j164n61O10J464K014J578Q22n57j454j974j788p49M71J696J651J654
$$ -1454 -2618 -3179 -2569 -1105 909 2487 3309 2752 1298 -676 -2464 -3213 -2742 -1046 605 2259
1917B259P33%j430k050k131l72L3J246J679K170J036k01j034j945j594j263j34
$$ 2259 2992 2992 1562 -488 -2619 -2991 -2958 -1712 -33 2137 3173 2972 1938 -7 -1601 -2864 -2998
1934b998R42J681J849J291M95q25k105j697j316n68Q70J624K191J074P48n38j582
$$ -2998 -2056 -375 1474 2765 3260 2435 330 -1367 -2683 -3251 -2381 -757 1434 2508 3256 2718 1136
1951A136j987j573o43Q00J248K025J571O22j98j884j890j622r51K96J837J844
$$ 1136 -851 -2424 -3067 -2267 -1019 1006 2577 3199 3001 1117 -773 -2395 -3346 -3050 -1213 631
1967F31J852O08m92j332j535j615j192J98Q54K066J892J277l70r51j591k150j279
$$ 631 2483 3091 2599 1267 -268 -1883 -3075 -2877 -2023 43 1935 3212 2842 1891 300 -1850 -3129
1984c129N2Q95J611J794J509M33j097j625j880j085n61P37J633J907J342M30n64
$$ -3129 -3077 -2182 -571 1223 2732 3165 2068 443 -1437 -2522 -3083 -2346 -713 1194 2536 2966 2402
2001B402j232k297j325o35P63J300K150R99O07m49j214j543j657q95M11J311J943
$$ 2402 1170 -1127 -2452 -3087 -2324 -1024 1126 2125 2732 2283 1069 -474 -2131 -3026 -2615 -1304 639
2018F39J127J143j78j358j822j439n78m93J305J624J752J176r4r95j382k022j172
$$ 639 1766 2909 2731 1373 -449 -1888 -2466 -2959 -1654 -30 1722 2898 2804 1809 427 -1595 -2767
2035b767p4R15J589J490J401M68j017j478j584j355m71O31J500J798J257N50n56
$$ -2767 -2841 -1926 -337 1153 2554 3022 2005 527 -1057 -2412 -2883 -2252 -752 1046 2303 2853 2297
2052B297j740j650j043n70L23J364J743J481N53m84j195j877j361l97J85J245
$$ 2297 557 -1093 -2136 -2706 -2383 -1019 724 2205 2758 2274 1079 -798 -2159 -2556 -2371 -1126
2068a126J584J384O84Q5j370j617j474o55j24J213J650J538O06L8p27j670j586
$$ -1126 458 1842 2526 2611 1241 -376 -1850 -2505 -2629 -1416 234 1772 2378 2416 1689 19 -1567
2085a567j017J71Q91J198J902J059m0r22j414j305j292k99Q37J170J785J162J58
$$ -1567 -2584 -2413 -1522 -324 1578 2637 2597 1675 261 -1044 -2336 -2635 -1798 -628 1157 2319 2477
2102B477n51j353j713j050k38M99R85J993J040O45o86r61j844j253n69M52J269
$$ 2477 1926 573 -1140 -2190 -2428 -1929 -944 1049 2089 2734 2048 1087 -757 -2010 -2579 -2127 -858
2119h58J407J227O42m52j023j354j386o39J15J018J858J328O96j60j338j177j578
$$ -858 549 1776 2418 1966 943 -411 -1797 -2436 -2321 -1303 555 1883 2579 2419 1081 -96 -1674
2136a674p49j46J138J076J755R40K58j228j352j299q23k74Q22J369J249J237q0
$$ -1674 -2423 -2569 -1431 -355 1400 2340 2598 1370 18 -1281 -2104 -2378 -1556 -187 1062 2299 2219
2153B219l49j677j102j178k41L72J131J445J464M07r77p10j532j446l76P12J001
$$ 2219 1870 193 -909 -2087 -2328 -1956 -825 620 2084 2491 1514 804 -728 -2174 -2550 -1838 -837
2170h37J552J245N97k43j438j318j182q43K23J342J261J327P11n45q24j634j294
$$ -837 715 1960 2557 2314 876 -442 -1624 -2467 -2244 -902 359 1686 2397 1852 1028 -606 -1900
2187a900k64J37O95J534J383R56J9j141j345j595q52j10P18J729J431O40L26n78
$$ -1900 -2164 -2027 -1332 202 1585 2541 2560 1419 74 -1521 -2373 -2483 -1765 -36 1395 2035 2361 1783
2205A783j582j474j033MO22J266J294J188L68n01j255j642p97o87P41J158J327
$$ 1783 201 -1273 -2306 -2302 -1680 -414 880 2068 2436 1935 680 -962 -1759 -2446 -1705 -547 780
2222G80J039N72l34j209j502j256k26O1Q39J874J390K77o01o71j271j724m96K31
$$ 780 1819 2391 2057 848 -654 -1910 -2136 -2075 -1236 638 2028 2305 1704 1033 -238 -1962 -2458 -2227
2240b227J237J571J052R32m15p54j471j407p86J54N46J832J118Q39J70o87j581
$$ -2227 -990 581 1633 2565 2150 1396 -75 -1482 -2268 -2114 -1568 264 1382 2221 2391 1704 123
2257A23j483j020n6Q54J379J345Q80M40n63j101j622j222l79O60J157J336J499
$$ 123 -1360 -2380 -2436 -1582 -203 1142 2022 2462 1899 798 -824 -2046 -2425 -1765 -608 728 2227
2274B227J3m97j166j354j190m65J62J316J370J372M85k07j147j219j284p09K62
$$ 2227 2240 1743 577 -777 -1967 -2432 -2270 -954 416 1788 2273 2066 919 -300 -1584 -2293 -2031
2291b031Q20J475J707N45j62j146j443j431n90n7R10J520J482O39J34o76j434
$$ -2031 -1211 264 1971 2516 2354 1208 -235 -1666 -2256 -2313 -1403 117 1599 2238 2372 1696 262
2308B62j614r00j18Q38J269J530J099J28q16j107j633j196j63M92J336J371J088
$$ 262 -1352 -2252 -2370 -1532 -263 1267 2366 2494 1678 571 -1062 -2258 -2421 -1929 -593 778 1866
2325A866L48l25q51j881q52l41J63J144J380J395M43l73j283j309j420l98N60
$$ 1866 2214 1889 1038 -843 -1695 -2036 -1873 -729 651 2046 2489 2116 833 -476 -1896 -2294 -1734
2342a734O81J597J004P16m68p11j218j572m02j14P87J594J369J085j93j181j339
$$ -1734 -1053 544 1548 2264 1796 1085 -133 -1705 -2107 -2221 -1434 160 1529 2614 2421 1240 -99
2359i9j476m87k88N96J375J467J229j23p51j297j183j121J49L87J369J118J008
$$ -99 -1575 -2062 -2350 -1754 -379 1088 2317 2194 1443 146 -1037 -2158 -2009 -1622 -253 865 1873
2376A873N99o63j326j178j077o76N23J388J088J048Q25l43r85j734j170o64P32
$$ 1873 2472 1809 483 -695 -1772 -2448 -1925 -537 551 1599 2424 2081 1096 -638 -1808 -2472 -1740
2393a740Q51J158J345N93P0j187j303j227p78o9R00J587J326M92n6o38j222j348
$$ -1740 -889 269 1614 2207 2277 1090 -213 -1440 -2218 -2287 -1387 200 1526 2018 1962 1324 102 -1246
2411a246j151J68N42J507J396R52L16q17j093j424j099l80O63J106J335J092O45
$$ -1246 -2397 -2229 -1687 -180 1216 2168 2484 1667 574 -850 -1949 -2329 -1666 -560 775 1867 2512
2428B512p41j001j632p76l88Q4J096J316J183P77n84q26j450j220n44o3J026J293
$$ 2512 1771 770 -862 -1638 -2026 -1942 -846 470 1653 2430 1846 1020 -430 -1650 -2194 -2257 -1231 62
2446F2J298P71p7j010j112j084j059J04Q27J363J294O08K42q02j156j448q21K77
$$ 62 1360 2131 2054 1044 -68 -1152 -2211 -2107 -1280 83 1377 1985 2227 1425 269 -1179 -2000 -1723
2464a723P3J302J527R47m7l48j252j443q34l43K84J102J435J166L70l25j265j195
$$ -1723 -1650 -348 1179 2126 2079 1731 479 -964 -1798 -2141 -1857 -755 680 1846 2216 1891 626 -569
2482e69j170k38P7J081J311J134O13k43r63j573q99q41N35O62J094J485O02l29
$$ -569 -1739 -1977 -1900 -819 492 1626 2239 1996 1033 -540 -1439 -2280 -1745 -1083 11 1496 2098 1769
2500A769l54j324j295n86j04P46J076J072J077oo25j161j329q17J23L57J206J213
$$ 1769 1415 91 -1204 -1790 -1894 -1148 -72 1000 2077 2071 1446 285 -1044 -1861 -1738 -1381 -175 1038
2518A038P44J35n37r41j277r28k87N54J005J423P56M46m67r74j329o99o84K91
$$ 1038 1782 1917 1380 439 -838 -1766 -2053 -1499 -494 929 1685 2131 1664 690 -639 -1338 -2022 -1731
2536a731J119P66J192M47j42n67j332j313l66K9J043O92J592O56k40p35j090j140
$$ -1731 -612 154 1346 1793 1651 1084 -248 -1561 -1927 -1898 -855 -163 1429 2085 1845 1110 20 -1120
2554a120o88j42R11J042J129O70O2r14r52r90n76q2p3J444J272P28J46n29r63
$$ -1120 -1808 -1950 -1039 3 1132 1802 1864 950 -2 -992 -1568 -1650 -1723 -279 993 1721 1867 1338 375
2573C75j072q05m90M88J211Q22J223Q3j33j174j045p41q05O96P40J179P34N58
$$ 375 -697 -1502 -1992 -1504 -293 529 1752 1835 1702 528 -517 -1258 -2063 -1367 -627 552 1286 1844
2591A844l50o14j005j173m30Q6P07J156R85M82J1p57j051q80q28j04Q54J178R29
$$ 1844 1494 880 -125 -1298 -1728 -1642 -935 221 1206 1688 1699 942 -109 -989 -1817 -1921 -1067 111 1040
2610A040N40J55n74r31j117p11k66M54J186J115O50J39n41q54j069p19l20M47
$$ 1040 1580 1735 1161 230 -887 -1598 -1864 -1410 -224 891 1541 1680 1139 285 -784 -1503 -1823 -1376
2628a376R62J137N47M45m40q97q71p27o05M84P97J171N18M47j15q71p55j092m93
$$ -1376 -414 723 1270 1715 1275 378 -493 -1220 -1825 -1341 -544 627 1145 1592 1477 606 -149 -1241 -1734
2647a734Q8R24O82J227J67K07p58r88q49n35P4M65J093R28Q13mj039p87p83m38
$$ -1734 -1646 -722 -40 1187 1354 1561 803 -185 -1034 -1569 -1495 -1030 63 991 1804 1800 761 -26 -809 -1247
2667a247k14M75O59J263N17rl30q69q04j139J65K81J073P05P18O22n70r76n79
$$ -1247 -1461 -986 -327 936 1453 1444 1114 245 -559 -1698 -1533 -1252 -179 526 1244 1866 1296 320 -259
2686b59r11l94O04N90R04L30N09j75o56p71o76p78L02M81R12R71N50m10j53j154
$$ -259 -1170 -1564 -960 -370 534 864 1373 1198 542 -229 -905 -1683 -1381 -900 12 983 1533 1123 970 -184
2706a84o56n40J19N90P22Q11K55J99n21q27q96m41rO03Q57M32P98J9o60m95r54
$$ -184 -840 -1380 -1261 -671 51 862 1117 1316 795 -32 -928 -1369 -1378 -775 82 514 1312 1331 671 176 -778
2727g78k69n5K75P04N27O31K80m60o81n55q83k26M17P59P11N51K94J6r81l54r59
$$ -778 -1047 -1102 -827 -123 404 1035 1315 855 174 -381 -1264 -1490 -1073 -314 397 948 1242 1258 277 -77 -1036
2748a036Mp5Q55N68P82K43k32o37q06m70o42J94N38N84Q37N29n7n57p31q01k09
$$ -1036 -1032 -1107 -252 316 1098 1341 1109 472 -334 -804 -1446 -1252 -714 -130 707 1236 1179 622 -109 -910 -1119
2769a119P9M45P57O95L42l5n89q13l53m10J1K18P20O85M81j01J23r43o30o82p2
$$ -1119 -1040 -595 162 857 1199 1164 575 -238 -591 -1001 -990 -772 -52 633 1114 1013 1136 193 -437 -1119 -1191
2790a191K34R91M40O32K64l52q39n57n80j37J99M24J094L46J35j04n69q30n80
$$ -1191 -957 34 474 1106 1370 1018 179 -378 -958 -1095 -896 -472 622 968 1103 999 430 -400 -980
2809i80k78N04M33O51K68O59p2n90p68o45k72j87O43O79O06M35J5m71p04o50m77
$$ -980 -1258 -754 -321 330 598 1257 1185 595 -173 -818 -1090 -1277 -634 45 651 1086 1101 630 -74 -724 -1201
2830a201M3K39Q16P15L75K00k73q60o79k84k28K67P90M59N57N40m63p52r31l29
$$ -1201 -1158 -919 -103 612 987 1187 914 54 -625 -909 -1137 -870 -80 379 936 1476 1013 261 -670 -999
2850i99j90J60P51L22O74L61j3p78p27m20m09K16O74R02K30K86o0n07p03m05k70
$$ -999 -1189 -1029 -278 44 718 1079 1066 288 -439 -859 -1268 -1052 -378 524 754 1040 980 473 -230 -635 -905
2871i05j61M17P72N62L66k7m92n28q35k64J47K44Q30M35N73J10m57p78l81q13
$$ -905 -1066 -649 123 685 1051 1024 532 4 -831 -1095 -948 -704 126 561 1134 1244 787 9 -372 -1185
2891a185K8K98N80J047K41M00o59l47q70l74p1j75N45Q32Q34j21j36n63n36o14
$$ -1185 -1157 -859 -279 768 1009 1409 750 403 -467 -841 -912 -1087 -542 290 1124 1003 867 304 -232 -846
2911h46m59L76N07M93M77N50k46l52p71o17k13p4P39O18N35N0J62l02o76p27J5
$$ -846 -1305 -929 -422 71 548 1098 852 500 -271 -888 -1101 -1175 -436 182 717 767 929 627 -49 -776 -761
2932g61k04J12R02M08N38J55m08o83m96m25j73N42M25L96L08K34R7m88p71m65
$$ -761 -965 -853 49 457 995 1150 742 59 -437 -862 -1035 -493 -68 328 636 870 967 479 -292 -757
2952g57l84K14P49L29O24K24l40l34o35n67j90L15L46M08M56M35j95m35j69r64
$$ -757 -1141 -927 -178 151 775 999 659 325 -310 -877 -1067 -752 -406 2 458 893 698 263 94 -870
2972h70o2K16K33P19L18L23j37k46m75m39n61r6O14N47N01J98J36j69o73p17j22
$$ -870 -932 -716 -483 236 554 877 740 494 19 -420 -981 -1077 -463 84 585 783 919 750 77 -640 -762
2993g62J18K6M46O90L06K00m18l28o98m95K88l12P51O16O2M09j6l90p23k13m04
$$ -762 -644 -618 -172 518 824 1024 606 278 -420 -915 -627 -939 -188 428 490 899 883 493 -230 -443 -847
3014h47Q6M55K05O30K97j26o52j60o13k74K65L21N60J72L18J54j26q53k74l26
$$ -847 -761 -306 -101 529 826 700 48 -112 -725 -999 -734 -413 147 319 637 791 665 -188 -462 -788
3034g88J47K36M77M44K14Q0k35n28l05m14r0K84O46J98L51j78k75j93m11k62L31
$$ -788 -641 -405 72 516 730 810 575 47 -258 -672 -762 -478 168 366 717 539 264 71 -340 -602 -271
3055b71m02N00N64K10p3m77j9j21n26q2K41K22N48J86M6L8l87m37k59m34M51J40
$$ -271 -673 -173 391 601 528 51 32 -89 -615 -697 -456 -234 314 500 546 584 197 -240 -499 -933 -482 -342
3077c42N08M5K88N9j28m76l74k63J58R8M86K44J10k17M18o05n40j59J22M79k11
$$ -342 166 211 499 558 430 -46 -420 -683 -525 -427 59 303 413 196 614 9 -531 -690 -568 -89 -300
3098c00P98P3k78M0k09m18j63mO6M02L15J81K04m34k27m91O3k26M36r3N18J84
$$ -300 498 571 293 333 124 -294 -457 -461 -395 7 322 503 707 273 46 -445 -382 -608 -172 -265 253 437
3120D37L52l20n56j53k86K27l33N50K78J09M3j42K35o97q7q9j72L87M72J4K30
$$ 437 789 469 -87 -240 -526 -299 -632 -82 196 305 348 206 441 -256 -343 -432 -604 -217 255 269 499
3141D99J38m02k50m24o6Q9M42Q7J51J99j12k02J09l75k43J06k69O09O63k83l29
$$ 499 637 235 -15 -439 -505 -416 26 113 264 463 351 149 258 -117 -360 -254 -523 86 749 466 137
3162A37j21j37m22J85k80N05M18L7j87L24j49o37j87K08l90K63O19J48j70K65
$$ 137 16 -121 -543 -358 -638 -133 285 322 135 459 310 -327 -514 -306 -696 -433 186 334 164 429
3182D29j45j01p20K85l57K43L96L43J77j38m18K67k54n40q2L46J59L42J00J39
$$ 429 284 183 -537 -252 -609 -366 30 373 550 412 -6 261 7 -533 -615 -269 -110 232 332 471
3202D71N0l20n03k85K09p8M14J15K80k9K49n71l52q3j87N91N5J17L44J76k84l93
$$ 471 521 201 -302 -587 -378 -456 -42 73 353 324 573 2 -350 -433 -620 -29 26 143 487 663 379 -14
3224a4r8l52o3K94K28J57K64j17J30j34l10m45r9O0M75J49N8L77j19l56j13k57
$$ -14 -112 -464 -527 -233 -5 152 416 299 429 295 -15 -460 -559 -499 -24 125 183 560 441 85 -28 -285
3246b85K25m17K79M6K48K63K04o3o05m66M4j76N40L88N6M08k8m83m18k62nOK16
$$ -285 -60 -477 -198 -152 96 359 563 500 -105 -571 -527 -703 -163 225 281 689 661 178 -240 -502 -507 -501 -285
3269b85M72J90J90j48l74j30m26n3J15pP00l8M47l44l6l25k07k65N4K66L62O1
$$ -285 187 377 567 419 45 -85 -511 -564 -449 -456 244 206 653 309 273 -52 -259 -524 -470 -204 158 219
3291B19L59k6l81l37J60m48j64K58J04N69K38j36k8K08o39m50J67j87L65K53K25
$$ 219 578 552 171 -166 -6 -454 -618 -360 -256 313 551 415 387 595 -44 -494 -327 -514 -149 104 329
3312C29M12m50J74l63o03L15j67M98J99M1r0J67l51m45o6j27J76J46M19L41J81
$$ 329 741 291 465 102 -501 -186 -353 145 344 385 295 462 111 -334 -400 -527 -351 -205 214 555 736
3333G36k06j13l70m81L2j62K53K94L47L1O9j92m08l16k60M0o3N49O31P8q4j36
$$ 736 530 417 47 -434 -402 -564 -311 -17 330 361 430 238 -170 -486 -746 -706 -769 -220 411 489 405 269
3355B69r1n16k5n2l5N90L84L4Oj82k31j77m94J28pL72N61J59j79R6m15k85l41
$$ 269 178 -338 -363 -415 -450 140 524 558 564 382 151 -26 -520 -392 -399 -27 534 693 514 610 195 -90 -431
3378d31nr3M77J35P2K83J30n29j97j53j9k58L82l5O19O4J02o4n24l79k63pJ98
$$ -431 -436 -529 -52 83 155 438 568 39 -158 -311 -330 -588 -206 -241 378 442 544 480 -44 -423 -686 -693 -495
3401d95M44J77L6L90k5m43m52m03J24K56K02M51K83k1m8k12m43l70q3K37L00L90
$$ -495 -51 126 162 552 527 84 -368 -771 -647 -391 -189 262 545 524 476 264 -179 -549 -632 -395 -95 295
3423B95L33J6j10k89l04l51Kj4K06O42K30J42j61l73l13l96o9K41o6K89N15L60
$$ 295 628 644 534 245 -59 -410 -408 -422 -216 426 656 798 637 264 -49 -445 -514 -273 -339 -50 465 825
3445H25l85l02j56n05m20K35K85K07L81M7R8j84j88m29j82M4R5M26M64K33r0J37
$$ 825 440 138 -18 -523 -943 -708 -423 -216 165 212 310 126 -62 -491 -673 -629 -534 -108 356 589 499 636
3467F36l50o25r0N1J91P7O68L26k31j40m87j47l04n7p8M24J77N12K7l23j06o14
$$ 636 286 -339 -429 -378 -187 -110 558 884 653 513 26 -121 -425 -482 -560 -136 41 553 580 257 151 -463
3489d63k57L9Q1M87K58P26l90M43o53m14k7k84J8K16N66Q1J45k14l51j07l59k38
$$ -463 -720 -681 -600 -113 145 871 481 924 271 -143 -170 -454 -436 -220 346 427 572 358 7 -100 -459 -697
3511f97K12K9M80J68K08M93o59%n67k05M2K35N07K60K73m34l15j52l70k87K37
$$ -697 -485 -456 24 192 400 893 234 234 -333 -538 -496 -261 246 506 779 345 30 -122 -492 -779 -542
3532e42n4N06M61M46k96q5j57m09k56k4L0L15P08j83K94l50m95p0p55j68L12P16
$$ -542 -596 -90 371 817 521 436 279 -130 -386 -410 -380 -65 643 460 754 404 -91 -161 -916 -1084 -772 -56
3554e6L39J90M8M35m97o90o4m25L06K06M77K28J13k49l43j78k05l48J71K86M50
$$ -56 283 473 521 956 459 -231 -295 -720 -414 -208 269 497 610 361 18 -160 -365 -713 -542 -256 194
3575A94K76M11l18K5p01m72j47j11K32M73L37O11q6j92n71j53j85l82M56K70L54
$$ 194 470 881 563 588 -113 -585 -732 -843 -611 -138 199 810 724 532 -39 -192 -377 -759 -303 -33 321
3596C21R6K88m90j61m89l92Q9N8N70L40P02j28K7m73o97m22n3m4M45L07O82L44
$$ 321 417 705 215 54 -435 -827 -738 -680 -110 230 932 804 831 358 -339 -761 -814 -858 -413 -106 576 920
3618I20k00j7q15n17j3J14J26O76M46l0j67j28o82l54k71M11J97J68P75M9O5l10
$$ 920 720 703 -112 -629 -642 -528 -402 274 720 690 523 395 -287 -641 -912 -501 -304 -136 639 688 753 443
3640D43l02o92n57L43J12M47P97K72J09j82o06k83p92J05nM94O09J75L36j7o05
$$ 443 141 -551 -1108 -765 -653 -206 591 863 972 790 184 -99 -891 -786 -791 -297 312 487 823 806 201
3661B01k31l86k45K77N6Q09K2J30j50j00n83k45j60J21K07O44M21l4m1n00o00
$$ 201 -30 -416 -661 -384 -328 481 503 633 483 383 -200 -445 -605 -484 -277 367 788 754 713 213 -387
3682c87m49j48L43K16O66N01J53Kk35p43k27p48j3M63L16O16N22J47o05J5n84
$$ -387 -836 -984 -641 -425 241 742 895 897 662 -81 -308 -1056 -1069 -606 -290 326 848 995 390 405 -179
3703a79m56k80L30L07P46L60j52m5j01p04k34k44K13j13O94R17m10q3m21n68j99
$$ -179 -635 -915 -585 -278 468 828 676 631 530 -174 -408 -652 -439 -552 142 1059 649 566 145 -423 -622
3724f22m77M70M11M48L88J40k28l33n09l62j15J54K85P07K41L79K25o65o44o00
$$ -622 -1099 -629 -218 230 618 758 530 197 -312 -674 -789 -635 -350 357 598 977 1202 537 -107 -707
3744g07o86M28N23N27P25j26N27o01m31p27n73L35J73O03L52O57p8o4o94l66n02
$$ -707 -1393 -965 -442 85 810 684 1211 610 179 -548 -1121 -786 -613 -10 342 999 921 857 163 -203 -705
3765g05m50K29O89M57K25M81l08m18l49o75m4j08M33O45L72L45Q5l41n09n95j65
$$ -705 -1155 -926 -237 220 445 926 618 200 -149 -824 -868 -976 -543 102 474 819 904 563 54 -541 -706
3786g06P7K94M84L02N28k72l83o55l18J0%J94M43M47K31K60o10n18n84lk01M69
$$ -706 -629 -335 149 451 979 707 324 -331 -649 -639 -639 -445 -2 445 676 936 326 -192 -776 -779 -980 -511
3808e11L24N60M27mk43o72n59j59o4K98M66M77P21l1k98n68p61j66l56K25K83
$$ -511 -187 373 800 796 553 -119 -678 -837 -901 -603 -137 340 1061 1030 732 164 -597 -763 -1119 -894 -611
3829f11O79R96J78l78n83l30o29p45K27M39P65N02N26p0k73o87o68j22j80J63
$$ -611 68 1064 1242 864 281 -49 -678 -1423 -1196 -757 8 510 1036 966 693 6 -662 -784 -964 -801
3849h01P41O91K82j55L65r57l57m32k83J18K14R19K13N06n25k22n33o21j66K28
$$ -801 -60 631 913 758 1123 166 -191 -623 -906 -788 -574 345 558 1064 539 317 -216 -837 -1003 -775
3869g75N01L31P27J18l9l03q18k46l94Q9L48N27O34L19k97k05o85k11m16N8K49
$$ -775 -274 57 784 902 863 560 -258 -504 -898 -809 -461 66 700 1019 722 517 -168 -379 -795 -737 -488
3890d88M07M87L52j53p6n15o93j62K44j5Q14L83m4K11n43j97o41K7l90O67K57
$$ -488 -81 406 758 605 529 14 -679 -841 -597 -612 202 585 541 752 209 12 -629 -602 -992 -325 -68
3911f8L80M95J09k47o54m64k08p9K86M87M15L69L2j36n30n65o19N3M10M59J97
$$ -68 312 807 916 669 15 -449 -657 -736 -450 37 452 821 853 717 187 -378 -997 -944 -534 -75 122
3932A22O91J26n03j73n25l50m90L53J74Q55M48J83j30l35o66n63k28J07M81N83
$$ 122 813 939 436 263 -262 -612 -1102 -749 -575 280 728 911 781 446 -220 -783 -1011 -904 -423 160
3952A60L04O24Rl99j121k13j88N5M50M19M79K70K02m82n51p31k47J32qP48R16
$$ 160 464 1088 1097 698 -423 -636 -824 -769 -319 100 579 849 1051 569 18 -713 -960 -828 -836 -88 828
3973H28K8J62k89p03m63l24k45L33M21L83P46J82n50j14m79q34j99L17K30Q86
$$ 828 856 1018 729 26 -437 -761 -1006 -673 -252 131 877 1059 509 395 -84 -918 -1117 -800 -570 316
3993C16P35L2Kn82o44n37r0j59L87N25N05N26J35m56q26l27m74k06N31L31Q81
$$ 316 1051 1083 1085 503 -141 -678 -768 -927 -540 -15 490 1016 1151 695 -131 -458 -932 -1138 -607 -276 605
4014F05M48K3l80p23m27m79J05M0P15L42M43N52l03o30m15p41k60J71M07M68Q01
$$ 605 1053 1076 696 -27 -454 -933 -828 -788 -73 269 712 1264 961 331 -84 -825 -1085 -914 -507 -39 762
4035G62K76j57m18p95k91m79N13L2N67O11L92k19l5r95k99m56m6L55Q62N37P8
$$ 762 1038 881 463 -332 -623 -1102 -589 -557 10 621 1013 794 759 -236 -535 -991 -1037 -682 180 717 795
4056G95K81n47n23o52j23LN8M43Q28K22L53n82n80m06l40j76K64M60O56K66K54
$$ 795 1076 529 6 -646 -769 -766 -708 -265 563 785 1138 556 -24 -430 -770 -946 -682 -222 434 700 954
4077I54r4m56p10m36l86N35K26N96N79J74j60n90l61n18j94j91N68N65K60K40
$$ 954 860 404 -306 -742 -1128 -593 -367 229 808 982 822 232 -129 -647 -841 -1032 -464 101 361 601
4097F01R3k51m69o61j60q2K72P71O23J27P0k38o80m97j74j54K03P02L63N16K2
$$ 601 694 443 -26 -687 -847 -929 -657 114 737 864 934 696 16 -481 -655 -809 -606 96 459 975 997
4118I97l17l98o41m14j06L25O40K08N23k29jn83l04l43nL07P2M30M58L70l74o43
$$ 997 680 282 -359 -773 -879 -554 86 294 817 588 587 4 -300 -643 -648 -341 -269 161 619 989 615 -28
4140b8j86o21J37j0L35N28L83L58q1m58m21o43O3j66K13N65R55m6M2o49l01n49
$$ -28 -214 -835 -698 -708 -373 155 538 896 815 357 -64 -707 -644 -810 -597 -32 923 877 919 270 -31 -580
4162e80n12M88P5P66J63N72k57l75l45l67l94m1K9Q60L45K84Mm9n79l98n72k12
$$ -580 -1092 -604 -529 237 400 972 715 340 -5 -372 -766 -807 -778 82 427 711 715 666 87 -311 -883 -1095
4184a095M04M54N43O03l4m24k98m22n57J54J7N40L11N87J82R6p54n39n34j08O0
$$ -1095 -691 -237 306 909 875 451 153 -269 -826 -672 -655 -115 196 783 965 1061 307 -232 -766 -874 -814
4205h14M67P71J42L31j31k63n20n07m84K82N1O80N02N20j06n70l88n29m60Q7N23
$$ -814 -347 424 566 897 766 503 -17 -524 -1008 -726 -675 5 507 1027 921 351 -37 -566 -1026 -939 -416
4226d16M28N12M66L6n22m60l52n22l02N85M59J48P17J63j9r22m25Lo33M29N32
$$ -416 12 524 990 1026 504 44 -308 -830 -1132 -547 -88 60 777 940 921 -1 -426 -423 -1056 -627 -95
4247i5N92L37j24J46o20n12k82k80K70K16Q76R9M32l38k7q44o10l04O9M55L84
$$ -95 497 834 710 856 236 -276 -558 -838 -568 -352 524 623 1055 717 690 -154 -764 -1068 -999 -544 -160
4268a60Q09K82K7m89n04p26l20J22M84L57Q70P9L6l39k33r29k97K08J17N12N56
$$ -160 649 931 958 469 -35 -761 -1081 -959 -475 -118 752 831 867 528 295 -634 -931 -723 -606 -94 462
4289D62L96j00l43j80m39l71k06J80M66M42L86J08k23m77j67n41j51P8O12L45
$$ 462 858 758 415 235 -204 -575 -781 -601 -135 307 693 801 578 101 -66 -607 -758 -680 -68 277
4309B77N45p4k51l5o86m41j69K51K30M79K74M95m3o66j5m47o26N41k69Q11M24
$$ 277 822 748 497 462 -224 -665 -834 -583 -353 126 400 895 852 186 171 -276 -902 -361 -630 181 605
4330F05J80jl69k61l48n06j46L02M28N21J12L72m34m20l87n73J85J60M44M61M05
$$ 605 785 784 415 154 -194 -700 -846 -544 -116 405 517 889 455 35 -352 -925 -740 -580 -136 325 730
4351G30j07Km90n72j26o1J08K66N30K87K13j20n04l11m38p5N6K68M37L70K90J01
$$ 730 623 625 135 -437 -563 -624 -516 -250 280 567 780 660 156 -155 -593 -668 -612 -344 93 463 753 854
4373H54p73j22k22m79R2Q8N33N25O9k3M1l60n42l25j16M11L39K48M78N6l15m32
$$ 854 81 -41 -263 -742 -650 -562 -29 496 565 542 583 223 -319 -644 -760 -349 -10 238 716 772 457 25
4395B5k37l14J3J46J43N10K67L59m68l93k80j43m91M16j8O37L32L90k28k17p57
$$ 25 -212 -526 -513 -367 -224 286 553 912 444 51 -229 -372 -863 -447 -465 172 504 894 666 449 -308
4416c08l54q2m9O18N9P35O1j8m62l66j59n34P8N85L13L84M41k48q6n42n00j30
$$ -308 -662 -744 -793 -175 -116 619 680 662 200 -166 -325 -859 -781 -196 117 501 942 694 608 66 -434 -564
4438e64j76K49K57O27M38j25r6o00m41P4l50k2P66J72O12k65l1m04m55m9k92P1
$$ -564 -740 -491 -234 393 831 706 610 10 -431 -357 -707 -729 37 209 821 556 525 121 -334 -383 -675 -604
4460f04L23M94K54J70mm44m64Jn11K18M29J97L75L38mk17p09m08r3J18J95J77
$$ -604 -281 213 467 637 633 189 -275 -274 -785 -567 -138 59 434 772 768 551 -158 -566 -659 -541 -346 -169
4482a69P41R5P6j40p11l75j67J90K25j0P37L17k20O5l67n86l13l68N56K90K16
$$ -169 572 667 743 603 -108 -483 -650 -460 -235 -245 492 809 589 654 287 -299 -612 -980 -424 -134 82
4503H2L99L66j08p44m54j28j63K18M22J85N44p8K36p26l34j47k69O4N18L38L22
$$ 82 481 847 739 -5 -459 -587 -750 -532 -110 75 619 541 777 51 -283 -430 -699 -635 -117 221 543
4524E43K5k4l50l75j23m08P2K36L97N37J50L1k52m44n71k61R3K81L65O55Q0q0
$$ 543 568 544 194 -181 -304 -712 -640 -404 -7 530 680 711 459 15 -556 -817 -724 -443 -78 577 657 577
4546E77k82k71l63l52K5K82L31L79K67K80m92k03l94l42j43K58L39M14K34Q0q1
$$ 577 295 24 -339 -691 -666 -384 -53 326 593 873 381 178 -216 -558 -701 -443 -104 310 544 624 543
4567E43k00p83J1n95N46M77O5M68R1j19j59j25o89n26N14R2N28J97K42J9j09m14
$$ 543 343 -440 -429 -1024 -478 -1 64 532 623 504 345 220 -469 -995 -481 -389 139 336 578 597 488 74
4589G4m72k33j28N06P4M97K27J99p0n08l85l71rK0L23O54j90M96l19l30k98k98
$$ 74 -398 -631 -759 -253 -179 318 545 744 674 166 -219 -590 -599 -579 -256 398 208 704 385 55 -243 -541
4611e41j49J20M53K9Q10j31k7k80o05m3o24P20N8M08L74M2j09j26k22p41j44J04
$$ -541 -690 -570 -117 -88 722 591 564 284 -321 -364 -988 -268 -210 198 572 614 505 379 157 -584 -728 -624
4633f24M73J19M48J11J9k27m62l39k28L9P6L66O87L21k66J06l77q24L1M7j31K83
$$ -624 -151 -32 416 527 546 319 -143 -482 -710 -671 -595 -229 458 779 513 619 242 -582 -551 -504 -635 -352
4655c52Q07Q6J36k25l99m11m29L7K41K92L73K60L92k8n48n26l35j10J67L37M80
$$ -352 455 541 677 452 53 -358 -787 -750 -509 -217 156 416 808 780 232 -294 -629 -739 -572 -235 245
4676B45J75P2N8k81n05k93k1j69K35L77N70J27J64m60o42j22r6l0L18m8N96N75
$$ 245 420 492 550 269 -236 -529 -550 -719 -484 -107 463 590 754 294 -348 -470 -566 -596 -278 -326 270 845
4698H45k45j42m51k92l76j9J83N31M25K71r4j2m67l69m09MK41J10N52L22J78k4
$$ 845 600 458 7 -285 -661 -680 -497 34 459 730 636 624 157 -212 -621 -617 -376 -266 286 608 786 762
4720G62k29o35k82j89J27J05O09N09k77j51j44m71k08j05R7j04N73M61qJ39k53
$$ 762 533 -102 -384 -573 -446 -341 268 777 500 349 205 -266 -474 -579 -482 -586 -13 448 440 579 326
4741C26m46k99j6m9j1L46N08K41N3n1k82q09n1%R5N61J26N8M85k28l82j93n82
$$ 326 -120 -419 -435 -484 -495 -149 359 600 653 602 320 -489 -540 -540 -445 116 242 300 785 557 175 -18 -600
4764f00p8Q6N27J42N54N8Nm17l61m08mk17M74K94L13K69j34r3m56l12j90k65K02
$$ -600 -678 -592 -65 77 631 689 694 277 -84 -492 -496 -713 -239 55 368 637 503 410 -46 -358 -548 -813 -611
4787f11P67L82M4J31l36m83j73l20j68M57N80K45K48J38n63m06j22k97m12L91
$$ -611 156 538 582 713 377 -106 -279 -599 -767 -310 270 515 763 901 338 -68 -190 -487 -899 -508
4807e08L54L17K49Q8J63m63l46l00l13J91K96O82j48L94m01R2n03l62j14l7M62
$$ -508 -154 163 412 500 663 200 -146 -446 -759 -568 -272 410 262 656 255 347 -156 -518 -632 -669 -207
4828b07K67K63K76lj68k23n59k31j39N53J42N07K75k44k60m04k56N3k96K72J93
$$ -207 60 323 599 596 428 205 -354 -585 -724 -171 -29 478 753 509 249 -155 -411 -358 -654 -382 -189
4849a89O27R8J42l52k41l53m7m09L55L06K70L51Q0l7l39k08m72k18K55L15J35
$$ -189 438 536 678 326 85 -268 -315 -724 -369 -63 207 558 638 601 262 54 -418 -636 -381 -66 69
4870F9K83J89q0l30j31n98n4N1M06M13L76R1j04l12k17k90k26M9K40Q7N95M6N0
$$ 69 352 541 461 131 0 -598 -652 -601 -195 218 594 685 581 269 52 -238 -464 -415 -175 -88 507 553 603
4893F03l71M1k90n39J61M8J81L75L31qj76l53k57k33r9K01L18J54N73k93l7l56
$$ 603 232 273 -17 -556 -395 -347 -166 209 540 532 356 3 -254 -487 -586 -385 -67 87 660 367 330 -26
4915b6j41m24M4J72K96K38M10K5r7l03k35k39l05J27M39Q5K47J25q1l64J07m32
$$ -26 -167 -591 -547 -375 -79 159 569 594 497 194 -41 -280 -585 -458 -19 66 313 438 357 -7 100 -332
4937c32k66J55K91K05k3M94j11k88k7o03j60K78K6L91O0K92K39n90J41m54k91
$$ -332 -598 -443 -152 53 30 524 413 125 98 -505 -665 -387 -361 30 90 382 621 31 172 -282 -573
4958e73K35K94R1J77J80Qr9l96j33j60j13m6L34M79m9J90O4n83k4k75o5kK52K78
$$ -573 -338 -44 47 224 404 412 313 -83 -216 -376 -489 -535 -201 278 229 419 483 -100 -124 -399 -464 -466 -214 64
4982F4K65N1nR5k41o37j3k41M68J73J59K30o6j68o4m26q6L32l41N14J33L88n4
$$ 64 329 380 375 470 229 -408 -421 -662 -194 -21 138 368 302 134 70 -356 -442 -110 -451 63 196 584 530
5005E30l03j05m25k29M3J4L77M24o0K00j64k70r6j99j72L5L25M24N5r1M9n16k68
$$ 530 227 122 -303 -532 -489 -475 -98 326 266 466 302 32 -64 -263 -435 -400 -75 349 404 313 362 -154 -422
5028d22J27k57L59K2N7L97K29K44q86j93Ol05J97K37Q2K43M62j57r6l93j73j88
$$ -422 -295 -552 -193 -171 -114 283 512 756 -130 -323 -317 -622 -425 -188 -106 137 599 442 346 -47 -220 -408
5050d08R5L8M07L03p2j60J39m38k28J21j44R4J50M61J06k22j55m0l28j53o1J73
$$ -408 -313 -275 132 435 363 203 342 -96 -324 -203 -347 -253 -103 358 464 242 87 47 -281 -434 -495 -322
5072c22P9J69L02L76l19j33l41k38J01o5K70J63K66K41l04n9m86J27l2m7L8L91
$$ -322 -243 -74 228 604 285 152 -189 -427 -326 -391 -121 42 308 549 245 186 -300 -173 -205 -252 -214 177
5094A77K0K27J04l28j04n64L8j0K71K72J68Q2M55m48o20k40K48l07K62N6L85K39
$$ 177 197 424 528 200 96 -468 -430 -440 -169 103 271 353 808 360 -260 -500 -252 -559 -297 -241 144 383
5116C83r2qqn17pk83J94L62k6L09K53k77m15k67J46l08n5N02L61L74j50O8m31
$$ 383 291 283 275 -242 -249 -532 -338 24 -2 307 560 283 -132 -399 -253 -561 -616 -114 247 621 471 539 108
$$ [...]
8191A16
##END NTUPLES=NMR FID
##END=
