##TITLE=1H_DE-43_EA_TFA3
 CDCl3
 8 sc, 
 3.4.2024
##JCAMPDX= 6.0         $$ Bruker NMR JCAMP-DX V2.0
##DATA TYPE= NMR FID
##DATA CLASS= NTUPLES
##ORIGIN= UXNMR, Bruker Analytische Messtechnik GmbH
##OWNER= root
$$ XWIN-NMR		Version 3.5
$$ Wed Apr  3 16:26:27 2024 Russian Standard Time (UT+4h)  she@DPX200
##.OBSERVE FREQUENCY= 200.1309
##.OBSERVE NUCLEUS= ^1H
##.DELAY= (6, 6)
##.ACQUISITION MODE= SIMULTANEOUS
##.ACQUISITION SCHEME= undefined
##.AVERAGES= 8
##.DIGITISER RES= 18
##SPECTROMETER/DATA SYSTEM= spect
##.PULSE SEQUENCE= zg30
##.SOLVENT NAME= MeOD
##.SHIFT REFERENCE= (INTERNAL, MeOD, 0, 15.7039)
##AUDIT TRAIL= $$ (NUMBER, WHEN, WHO, WHERE, WHAT)
$$ ##TITLE= Audit trail, XWIN-NMR		Version 3.5
$$ ##JCAMPDX= 5.01
$$ ##ORIGIN= Bruker BioSpin GmbH
$$ ##OWNER= she
$$ F:/spectra/data/she/nmr/H-F/1/audita.txt
$$ ##AUDIT TRAIL=  $$ (NUMBER, WHEN, WHO, WHERE, WHAT)
(   1,<2024-04-03 16:25:12.70 +0400>,<she>,<DPX200>,
      <created by zg, POWCHK disabled, PULCHK disabled
       configuration hash MD5:
       00 E9 B6 7A A2 85 ED C7 34 08 36 98 17 FE 4E 26
       data hash MD5: 16K
       09 CE E4 59 95 18 98 6C 05 09 98 76 2D 75 9D 39>)
$$ ##END=
$$ 
$$ hash MD5
$$ 64 F4 1B 20 54 DD A0 36 C5 C4 94 83 38 91 02 E8
##$RELAX= 
##$RELAX= 
##$RELAX= 
##$RELAX= 
##$RELAX= 
##$RELAX= 
$$ Bruker specific parameters
$$ --------------------------
##$DU= <F:/spectra>
##$EXPNO= 1
##$NAME= <H-F>
##$PROCNO= 1
##$TYPE= <nmr>
##$USER= <she>
##$AMP= (0..31)
100 100 100 100 100 100 100 100 100 100 100 100 100 100 100 100 100 100 
100 100 100 100 100 100 100 100 100 100 100 100 100 100 
##$AQSEQ= 0
##$AQ_mod= 1
##$AUNM= <au_zg>
##$AUTOPOS= <>
##$BF1= 200.13
##$BF2= 200.13
##$BF3= 200.13
##$BF4= 200.13
##$BF5= 200.13
##$BF6= 200.13
##$BF7= 200.13
##$BF8= 200.13
##$BYTORDA= 1
##$CFDGTYP= 0
##$CFRGTYP= 5
##$CHEMSTR= <none>
##$CNST= (0..31)
1 1 145 1 1 1 1 1 1 1 1 1 1 1 1 1 1 1 1 1 1 1 1 1 1 1 1 1 1 1 1 1 
##$CPDPRG= <>
##$CPDPRG1= <>
##$CPDPRG2= <>
##$CPDPRG3= <>
##$CPDPRG4= <mlev>
##$CPDPRG5= <mlev>
##$CPDPRG6= <mlev>
##$CPDPRG7= <mlev>
##$CPDPRG8= <mlev>
##$CPDPRGB= <>
##$CPDPRGT= <>
##$D= (0..31)
0 1.2 0 0 0 0 0 0 0 0.06 0 0.03 0 0 0 0 0.0002 0 0 0 0 0 0 0 0 0 0 0 0 
0 0 0 
##$DATE= 1712147112
##$DBL= (0..7)
120 120 120 120 120 120 120 120 
##$DBP= (0..7)
150 150 150 150 150 150 150 150 
##$DBP07= 0
##$DBPNAM0= <>
##$DBPNAM1= <>
##$DBPNAM2= <>
##$DBPNAM3= <>
##$DBPNAM4= <>
##$DBPNAM5= <>
##$DBPNAM6= <>
##$DBPNAM7= <>
##$DBPOAL= (0..7)
0.5 0.5 0.5 0.5 0.5 0.5 0.5 0.5 
##$DBPOFFS= (0..7)
0 0 0 0 0 0 0 0 
##$DE= 6
##$DECBNUC= <off>
##$DECIM= 32
##$DECNUC= <off>
##$DECSTAT= 4
##$DIGMOD= 1
##$DIGTYP= 9
##$DL= (0..7)
0 120 120 120 120 120 120 120 
##$DP= (0..7)
150 150 150 150 150 150 150 150 
##$DP07= 0
##$DPNAME0= <>
##$DPNAME1= <>
##$DPNAME2= <>
##$DPNAME3= <>
##$DPNAME4= <>
##$DPNAME5= <>
##$DPNAME6= <>
##$DPNAME7= <>
##$DPOAL= (0..7)
0.5 0.5 0.5 0.5 0.5 0.5 0.5 0.5 
##$DPOFFS= (0..7)
0 0 0 0 0 0 0 0 
##$DQDMODE= 0
##$DR= 18
##$DS= 0
##$DSLIST= <SSSSSSSSSSSSSSS>
$$ [...]
##$SUBNAM2= <"">
##$SUBNAM3= <"">
##$SUBNAM4= <"">
##$SUBNAM5= <"">
##$SUBNAM6= <"">
##$SUBNAM7= <"">
##$SUBNAM8= <"">
##$SUBNAM9= <"">
##$SW= 18.0517689322627
##$SWIBOX= (0..15)
0 0 2 0 0 0 0 0 0 0 0 0 0 0 0 0 
##$SW_h= 3612.71676300578
##$TD= 16384
##$TD0= 1
##$TE= 0
##$TE2= 300
##$TE3= 300
##$TEG= 300
##$TL= (0..7)
0 120 120 120 120 120 120 120 
##$TP= (0..7)
150 150 150 150 150 150 150 150 
##$TP07= 0
##$TPNAME0= <>
##$TPNAME1= <>
##$TPNAME2= <>
##$TPNAME3= <>
##$TPNAME4= <>
##$TPNAME5= <>
##$TPNAME6= <>
##$TPNAME7= <>
##$TPOAL= (0..7)
0.5 0.5 0.5 0.5 0.5 0.5 0.5 0.5 
##$TPOFFS= (0..7)
0 0 0 0 0 0 0 0 
##$TUNHIN= 0
##$TUNHOUT= 0
##$TUNXOUT= 0
##$USERA1= <user>
##$USERA2= <user>
##$USERA3= <user>
##$USERA4= <user>
##$USERA5= <user>
##$V9= 5
##$VALIST= <valist>
##$VCLIST= <CCCCCCCCCCCCCCC>
##$VD= 0
##$VDLIST= <DDDDDDDDDDDDDDD>
##$VPLIST= <PPPPPPPPPPPPPPP>
##$VTLIST= <TTTTTTTTTTTTTTT>
##$WBST= 1024
##$WBSW= 4
##$XGAIN= (0..3)
0 0 0 0 
##$XL= 0
##$YL= 0
##$YMAX_a= 814014
##$YMIN_a= -636570
##$ZGOPTNS= <>
##$ZL1= 120
##$ZL2= 120
##$ZL3= 120
##$ZL4= 120
##$ABSF1= 10
##$ABSF2= 0
##$ABSG= 5
##$ABSL= 3
##$ALPHA= 0
##$AQORDER= 0
##$ASSFAC= 0
##$ASSFACI= 0
##$ASSFACX= 0
##$ASSWID= 0
##$AUNMP= <proc_1d>
##$AZFE= 0.1
##$AZFW= 0.1
##$BCFW= 1
##$BC_mod= 2
##$BYTORDP= 1
##$COROFFS= 0
##$CY= 11.3945322036743
##$DATMOD= 1
##$DC= 2
##$DFILT= <>
##$DTYPP= 0
##$F1P= 15.7292609196834
##$F2P= 12.9074282941183
##$FCOR= 0.5
##$FTSIZE= 0
##$FT_mod= 4
##$GAMMA= 1
##$GB= 0.15
##$INTBC= 1
##$INTSCL= 1
##$ISEN= 128
##$LB= 0.24
##$LEV0= 0
##$LPBIN= 0
##$MAXI= 10000
##$MC2= 0
##$MEAN= 0
##$ME_mod= 0
##$MI= 1.114404
##$NCOEF= 0
##$NC_proc= 0
##$NLEV= 6
##$NOISF1= 3.799351
##$NOISF2= 2.8
##$NSP= 1
##$NTH_PI= 0
##$NZP= 0
##$OFFSET= 15.70392
##$PC= 1
##$PHC0= -25299.01
##$PHC1= 8.18731
##$PH_mod= 1
##$PKNL= yes
##$PPARMOD= 0
##$PSCAL= 0
##$PSIGN= 0
##$REVERSE= no
##$SF= 200.130013532006
##$SI= 16384
##$SIGF1= 3
##$SIGF2= 2
##$SINO= 400
##$SIOLD= 16384
##$SREGLST= <1H.CDCl3>
##$SSB= 0
##$STSI= 0
##$STSR= 0
##$SW_p= 3612.71676300578
##$SYMM= 0
##$S_DEV= 0
##$TDeff= 0
##$TDoff= 0
##$TI= <>
##$TILT= no
##$TM1= 0
##$TM2= 0
##$TOPLEV= 0
##$USERP1= <user>
##$USERP2= <user>
##$USERP3= <user>
##$USERP4= <user>
##$USERP5= <user>
##$WDW= 1
##$XDIM= 8192
##$YMAX_p= 0
##$YMIN_p= 0
$$ End of Bruker specific parameters
$$ ---------------------------------
##NTUPLES= NMR FID
##VAR_NAME=  TIME,          FID/REAL,        FID/IMAG
##SYMBOL=    X,             R,               I
##VAR_TYPE=  INDEPENDENT,   DEPENDENT,       DEPENDENT
##VAR_FORM=  AFFN,          ASDF,            ASDF
##VAR_DIM=   8192,          8192,            8192
##UNITS=     SECONDS,       ARBITRARY UNITS, ARBITRARY UNITS
##FACTOR=    0.0002768,     1,               1
##FIRST=     0,             0,               0
##LAST=      2.2672688,     0,               0
##MIN=       0,             -636570,         0
##MAX=       2.2672688,     814014,          0
$$ Real data points
##PAGE= N=1
##DATA TABLE= (X++(R..R)), XYDATA
$$ plain form
0 0 0 0 0 0 0 0 0 0 0 0 0 0 0 0 0 0 3 -1 0 -1 7 -7 7 -7 9 -10 10 -11 16 -17 19 -22 25 -30 34 -36 43 -49 53 -59 66
41 66 -74 82 -90 100 -111 123 -134 148 -163 181 -198 218 -239 265 -294 325 -359 402 -450 505 -572
62 -572 654 -757 886 -1059 1292 -1601 1835 3563 126422 53338 -224826 -50083 373397
75 373397 99365 -359477 107476 489798 -205199 -503542 278445 372294 -426970 -309338
85 -309338 444440 158443 -505845 -131742 423973 22260 -398175 79839 478470 -18823
95 -18823 -377415 150344 403877 -242336 -408554 308765 323686 -415367 -238318 435918
105 435918 37464 -522054 42758 443817 -167315 -327692 310442 306356 -271030 -176080
115 -176080 272869 117018 -239881 -85304 218421 83284 -224370 -118818 190495 47647
$$ packed form
0@%%%%%%%%%%%%%%%%LmJjQj4J4j4J6j9K0k1K7l3L6m1M7n5O4p0P9r2J02j12J25
41F6j40J56j72J90k11K34k57K82l11L44l79M16m57N04n59O19o84P61q52R55j077
62e72J226j411J643j945K351k893L436J728J22859p3084k78164J74743M23480
75C73397k74032m58842M66953L82322o94997k98343P81987R3849p99264J17632
85c09338P53778k85997o64288L74103N55715m01713m20435M78014L98631m97293
95a8823l58592N27759K53533o46213j66218P17319J4921p39053J77049O74236
105D35918l98454n59518N64812M01059o11132j60377O38134m086n77386R4950
115a76080M48949j55851l56899J54577L03725j35137l07654J05552L09313j42848
$$ plain form
125 47647 -276548 -45511 305104 19276 -265306 94250 273882 -147998 -234950 184970
135 184970 180752 -192828 -111277 212045 77147 -227513 -88141 196746 43699 -229605
145 -229605 -16896 275310 -4988 -295517 56338 290994 -137624 -271829 225562 258701
155 258701 -241247 -161885 278184 73081 -308998 -40404 260533 -23735 -229969 60466
165 60466 201172 -85670 -191037 91615 181812 -90738 -139991 154441 155446 -175697 -140377
176 -140377 182173 71897 -232517 -42001 237132 -1379 -226183 41414 202112 -77696
186 -77696 -180797 107567 184036 -89824 -140277 119959 127315 -154370 -137881 152735 99330
197 99330 -182872 -64270 204009 18492 -219651 20923 206602 -64536 -168865 129207
$$ packed form
125D7647l24195K31037L50615k85828k84582L59556J79632m21880q6952M19920
135A84970m218l73580Q1551L23322j34898l04660J39372K84887j53047k73304
145b29605K12709K92206k80298k90529L51855K34656m28618j34205M97391L3139
155B58701m99948P9362M40069k05103l82079K68594L00937k84268k06234K90435
165F0466J40706k86842j05367K82652R0197k72550m9253K94432J005l31143L5320
176a40377L22550j10276l04414J90516K79133k38511k24804K67597J60698k79808
186g7696j03101K88364P6469k73860n0453K60236P356k81685J6489K90616n3405
197I9330k82202J18602K68279j85517k38143K40574J85679k71138j04329K98072
$$ plain form
207 129207 164174 -137085 -122378 146697 75279 -168249 -57258 168866 39065 -165297
217 -165297 -18751 158003 -19747 -177177 31359 171501 -49711 -145408 93816 138995
227 138995 -112342 -114733 129898 91637 -129421 -50188 143740 25959 -154519 -24362 125757
238 125757 -21148 -140394 36508 143184 -48117 -127074 83210 126912 -100896 -103103 137746
249 137746 97255 -143148 -63736 150303 18342 -176914 -12727 154579 -23892 -144951
259 -144951 54198 140794 -68248 -122216 87837 108834 -96337 -79057 122169 66719 -130373
270 -130373 -47739 126441 8339 -140980 11217 138413 -31656 -125658 55957 112435
280 112435 -79364 -104530 90962 91819 -94701 -67428 111365 56153 -119553 -43391 121513
$$ packed form
207A29207L4967l01259J4707K69075p1418k43528J10991K26124j29801k04362
217a65297J46546J76754j77750j57430K08536J40142k21212r5697K39224M5179
227A38995k51337k391K44631l8261k21058P9233J93928j17781j80478J30157J50119
238A25757j46905j19246J76902J06676j91301p8957K10284M3702k27808k207K40849
249A37746m0491k40403P9412K14039j31961j95256J64187J67306j78471j21059
259a44951J99149Q6596k09042n3968K10053K0997k05171J7280K01226n5450j97092
270a30373Q2634J74180j18102j49319J52197J27196j70069r4002J81615N6478
280A12435j91799k5166J95492Q57j86520K7273J78793n5212j75706P6162J64904
$$ plain form
291 121513 25014 -121718 -376 125374 -21558 -127644 32416 107710 -61361 -98330
301 -98330 82672 90632 -88165 -64280 104490 46903 -112775 -26684 118641 8480 -120373
312 -120373 9157 112530 -39003 -118854 50192 108491 -64253 -87851 90602 82207 -97129
323 -97129 -61636 105514 40330 -112009 -21932 109695 -1825 -112471 12465 99420 -33630
334 -33630 -91614 52865 89745 -56578 -69415 75640 60257 -86428 -48342 91920 29059
345 29059 -101811 -16538 100829 -5979 -106213 19251 101232 -34161 -91130 53866 87052
356 87052 -62570 -73667 73712 61352 -81354 -46216 90042 32791 -93883 -17247 94282
367 94282 -3453 -98611 16735 90678 -38353 -86961 52633 75879 -66354 -60184 82320
$$ packed form
291A21513r6499j46732J21342J25750j46932j06086J60060P5294j69071l6969
301i8330J81002P960j78797K3885J68770n7587j59678Q6091J45325j10161j28853
312a20373J29530J03373j51533p9851J69046N8299j72744k3598J78453q395j79336
323i7129L5493J67150o5184j52339R0077J31627j11520j10646J24936Q6955j33050
334c3630n7984J44479L6880j46323j2837J45055j5383j46685L8086J40262o2861
345B9059j30870Q5273J17367j06808j00234J25464Q1981j35393n6969J44996L3186
356H7052j49622j1097J47379j2360j42706L5138J36258n7251j26674P6636J11529
367I4282r7735r5158J15346P3943j29031m8608J39594K3246j42233O170J42504
$$ plain form
378 82320 52045 -81879 -28034 93307 17422 -92067 -3766 86747 -16435 -92141 19083
389 19083 77913 -39020 -77815 47815 71382 -53601 -54204 72285 51639 -70883 -29847
400 -29847 81584 17693 -83597 -5404 76406 -17545 -81982 22148 70077 -37863 -64667
411 -64667 49367 60154 -55145 -48333 66952 42672 -70586 -27676 80799 17620 -83405
422 -83405 -3453 81967 -14849 -81862 27707 72937 -42348 -64757 49391 48821 -60741 -39258
434 -39258 63785 29113 -61380 -11489 68815 6395 -65396 5662 65755 -16033 -64539 26489
446 26489 58673 -41732 -59461 44037 44152 -56445 -34039 65424 28743 -61091 -11473 64248
458 64248 2714 -62265 6160 59705 -12914 -56988 18688 50280 -32157 -52889 36901 46724
$$ packed form
378H2320l0275j33924N3845J21341p5885j09489Q8301R0513j03182p5706J11224
389A9083N8830j16933l8795J25630K3567j24983o03J26489k0646j22522M1036
400b9847J11431o3891j01290P8193Q1810r3951o4437J04130M7929j07940k6804
411f4667J14034J0787j15299O812J15285k4280j13258M2910J08475o3179j01025
422h3405P9952Q5420r6816o7013J09569M5230j15285k2409J14148n70j09562K1483
434c9258J03043l4672r0493M9891Q0304o2420p1791P1058O0093q1788m8506R1028
446B6489L2184j00405j7729J03498J15j00597K2406R9463l6681q9834M9618P5721
458F4248o1534o4979O8425N3545p2619m4074P5676L1592q2437k0732Q9790R823
$$ plain form
470 46724 -43888 -34315 58225 28074 -63745 -16691 64977 442 -65839 13863 64150 -24588
482 -24588 -58790 31500 47975 -41038 -40770 48182 37833 -47124 -27391 51433 17429 -59102
494 -59102 -12959 59426 2274 -58079 11857 57636 -24877 -55229 32433 44580 -40249 -31140
506 -31140 50127 23903 -50473 -15683 47220 4460 -47249 3147 49752 -4145 -46173 9312
518 9312 42484 -21270 -46589 24854 43092 -31433 -34897 41221 26700 -47355 -17902 50396
530 50396 11228 -42899 5090 45813 -10233 -44071 8683 32595 -19596 -34272 22481 33147
542 33147 -26187 -31661 30767 27055 -36935 -18113 50326 18406 -46886 -3716 48145 -11473
554 -11473 -52708 14864 43658 -23468 -36078 29852 28645 -35402 -26747 33648 20801 -33393
$$ packed form
470D6724r0612R573R2540l0151r1819M7054Q1668o4535o6281P9702N0287q8738
482b4588l4202R0290J6475q9013K68Q8952j0349q4957J9733P8824l4004p6531
494e9102M6143P2385n7152o0353O9936M5779q2513l0352Q7662J2147q4829R109
506c1140Q1267k6224p4376L4790O2903m2760n1709N0396M6605n3897m2028N5485
518I312L3172o3754k5319P1443J8238p4525l464P6118j4521p4055K9453O8298
530E0396l9168n4127M7989M0723n6046l3838N2754K3912n2191j4676N6753J0666
542C3147n9334n474O2428l712o3990J8822O8439l1920o5292M3170N1861n9618
554a1473m1235O7572K8794o7126j2610O5930j207o4047Q655O0395j2847n4194
$$ plain form
566 -33393 -10747 42477 10147 -43420 -4615 42960 -7295 -43729 19860 44915 -26212 -37781
578 -37781 31563 23693 -44000 -19658 42896 10860 -38456 230 38231 -5062 -35930 7577
590 7577 34931 -6267 -27092 16192 30512 -21053 -33761 19078 22596 -30311 -18482 36676
602 36676 13997 -36808 -5704 34802 -4163 -32783 12427 34272 -10002 -25744 14299 20923
614 20923 -21331 -25676 19189 23731 -20476 -18068 28805 15783 -35931 -14176 35579 5229 -35675
627 -35675 7587 38910 -13334 -35582 16267 25302 -23837 -19034 29671 19378 -25525 -12704
639 -12704 24754 4882 -31209 -5542 32020 3129 -30212 4948 31045 -13890 -33890 17176
651 17176 29367 -20876 -18934 30751 15976 -32397 -12563 27223 2491 -27003 4067 29265
$$ packed form
566c3393K2646N3224l2330n3567L8805M7575n0255l6434O3589K5055p1127j1569
578c7781O9344p870o7693K4342O2554l2036m9316L8686L8001m3293l0868M3507
590G577K7354m1198k0825M3284J4320n1565j2708N2839L518n2907J1829N5158
602C6676k2679n0805L1104M0506l8965k8620M5210K1845m4274j5742M0043O624
614B0923m2254m345M4865M542m4207K408M6873j3022n1714K1755M9755l0350m0904
627c5675M3262L1323n2244k2248N1849R035m9139M803M8705j0293m4903J2821
639a2704L7458j9872l6091K5667L7562k8891l3341L5160K6097m4935k0000N1066
651A7176J2191n0243J942M9685j4775m8373J9834L9786k4732k9494L1070K5198
$$ plain form
663 29265 -2253 -25142 4261 20846 -11577 -23448 14483 25030 -15639 -20133 20302 13676
675 13676 -28931 -12637 30057 8088 -25423 4385 29372 -7560 -28554 7487 21324 -12495
687 -12495 -18308 16313 18149 -17815 -18975 14951 12056 -20212 -8231 27616 10794 -23999 -2802
700 -2802 24804 -5887 -27630 9740 25422 -11915 -18914 16459 14015 -22281 -15270 18939 10227
713 10227 -18117 -3928 23240 3859 -24113 -3186 21846 -2113 -21085 10115 25101 -10302
725 -10302 -21623 12929 14173 -20584 -12830 21622 9560 -20329 -4387 19077 -2091 -21744
737 -21744 2499 20807 -1794 -14856 9775 18450 -11126 -18894 10756 13904 -15316 -11059 19575
750 19575 9073 -22026 -7935 18479 7 -20430 4990 22957 -3501 -17079 8056 14501
$$ packed form
663B9265l1518k2889K9403J6585l2423j1871L7931J0547m0669m494M0435o626
675A3676m2607J6294M2694k1969l3511K9808K4987l6932k0994L6041J3837l3819
687a2495n813L4621J836l5964j160L3926k895l2268J1981L5847j6822l4793K1197
700b802K7606l0691k1743L7370J5682l7337o999L5373k444l6296P011L4209q712
713A0227k8344J4189K7168j9381k7972K0927K5032k3959j8972L1200J4986l5403
725a0302j1321L4552J244l4757P754L4452j2062k9889J5942K3464k1168j9653
737b1744K4243J8308k2601j3062K4631Q675k9576p768K9650L148k9220M257L0634
750A9575j0502l1099J4091K6414j8472k0437K5420J7967k6458j3578K5135O445
$$ plain form
762 14501 -12441 -14942 13407 14188 -12634 -9253 15835 5787 -20746 -6562 18862 1594 -17931
775 -17931 5254 19682 -7853 -19155 8441 14278 -12267 -10044 17105 11609 -14579 -7900 13872
788 13872 2523 -16815 -1546 17573 1106 -15889 1853 13887 -7502 -16537 8213 15167
800 15167 -8517 -9625 13878 8971 -15275 -7765 13726 3994 -14051 194 16307 -799 -16263
813 -16263 909 13328 -5820 -13745 9360 14740 -9560 -11990 11343 7891 -15687 -6765 16655
826 16655 5034 -14475 361 15637 -3476 -16041 4137 13325 -6245 -10582 9758 10244 -11515
839 -11515 -10408 10043 5952 -12802 -3370 15675 3484 -14144 -118 13082 -3860 -13221 6356
852 6356 13486 -6161 -9739 7623 7108 -10772 -8540 9663 6238 -9731 -3626 11738 2369 -13371
$$ packed form
762A4501k6942k501K8349P81k6822L381K5088j0048k6533J4184K5424j7268j9525
775a7931K3185J4428k7535j1302K7596N837k6545K223K7149n496k6188O679K1772
788A3872j1349j9338J5269J9119j6467j6995J7742J2034k1389r035K4750O954
800A5167k3684j108K3503m907k4246P510K1491r732j8045J4245J6113j7106j5464
813a6263J7172J2419j9148p925K3105N380k4300k430K3333l452k3578Q922K3420
826A6655j1621j9509J4836J5276j9113j2565K0178R188j9570m337K0340M86k1759
839a1515J107K0451m091j8754R432J9045j2191j7628J4026J3200j6942r361J9577
852F356P130j9647l578J7362n15j7880K232J8203l425j5969O105J5364r369j5740
$$ plain form
866 -13371 -1721 12689 -1126 -11733 5551 13371 -6488 -11217 8189 7980 -10744 -6043 11957
879 11957 4809 -11363 -3258 9680 -575 -12340 215 11736 -890 -10088 4647 11037 -6145
892 -6145 -10266 8529 8979 -9515 -5503 11458 3085 -12729 -2630 9620 -1886 -10151 3081
905 3081 9815 -2719 -8039 3700 7444 -4662 -7162 6670 8429 -6579 -6909 8935 4652 -11603
919 -11603 -3478 11549 413 -11188 2620 10210 -5362 -9760 5048 6985 -6012 -4962 7332
932 7332 5965 -6171 -4886 7415 4233 -8564 -2698 10221 1544 -11176 532 10117 -5089
945 -5089 -10613 6430 8284 -7863 -5142 9111 3476 -8303 -1475 7804 1014 -6680 -154 6750
959 6750 140 -7769 -257 7741 -2014 -8732 3776 8589 -6133 -7255 7922 4866 -9439 -2420
$$ packed form
866a3371J1650J4410j3815j0607J7284P820j9859m729J9406k09j8724M701J8000
879A1957p148j6172Q105J2938j0255j1765J2555J1521j2626r198J4735O390j7182
892f145m121J8795M50j8494M012J6961q373j5814J0099J2250j1506q265J3232
905C081O734j2534n320J1739L744j2106k500J3832J759j5008l30J5844m283j6255
919a1603Q125J5027j1136j1601J3808P590j5572m398J4808J937j2997J050J2294
932G332j367j2136J285J2301l182j2797N866J2919q677j2720J1708R585j5206
945e089n524J7043J854j6147K721J4253n635j1779O828R279o790p694O526O904
959F750o610p909P512P998r755o718J2508M813j4722j122J5177l056j4305P019
$$ plain form
973 -2420 9345 367 -8138 1865 6941 -2376 -5721 2540 5409 -1951 -5141 2526 5628 -3882 -6920
988 -6920 4747 5576 -7540 -4525 8972 2337 -9463 782 9108 -2973 -7195 4735 5794 -4654
1002 -4654 -3809 4358 2716 -3944 -3172 3415 3150 -4565 -4027 5324 3055 -6773 -1811 8463 -351 -8763
1018 -8763 3086 7981 -4844 -5514 6630 4125 -6466 -2008 6109 596 -5446 -905 4405 424
1032 424 -5079 -1137 5326 61 -6608 1313 7854 -2438 -6352 5714 5784 -6994 -3207 7683 915
1047 915 -7242 1053 6043 -2857 -5138 2155 3243 -2459 -3011 2361 3725 -1514 -3634 2733 4176
1062 4176 -3767 -3798 5803 3269 -6321 -703 6502 -1415 -6547 2188 4532 -3176 -2987 3429 2193 -2991
1078 -2991 -2163 1868 2080 -1787 -1969 3382 3069 -3540 -2608 4900 1105 -6119 278 6406 -1847 -5494
$$ packed form
973b420J1765q978q505J0003N076r317l345Q261K869p360l190P667L102r510l038
988f920J1667Q29j3116L015J3497o635j1800J0245Q326j2081m222J1930J059j0448
1002d654Q45Q167j642o660P72O587k65p715N38R351k269r828M962J0274q814q412
1018h763J1849M895j2825o70J2144k505j0591M458Q117n513o042M541N310l981
1032D24n503L942O463n265o669P921O541j0292l914J2066P0j2778L787J0890o768
1047I15q157Q295M990q900k281P293J088n702n52N372J364n239k120O367J443
1062D176p943l1R601k534r590N618P205p917n132Q735K344p708J89O416j236n184
1078b991Q28M031K12l867j82N351l13o609R32P508l795p224O397O128q253l647
$$ plain form
1094 -5494 3384 3727 -4984 -3100 4755 2010 -3676 -412 3791 454 -3681 -885 3558 838 -3984
1109 -3984 428 4763 -1241 -5137 2137 3992 -4171 -3282 5158 2089 -5143 -425 4870 -1154 -4451
1124 -4451 1600 3807 -1382 -2321 1890 2285 -1982 -2888 1701 2757 -1745 -2581 3331 2101 -4140 -2035
1140 -2035 3670 -91 -4087 989 4213 -1392 -3275 1764 2289 -2233 -1525 2666 2314 -1755 -1675 1834
1156 1834 895 -3366 -1558 3267 1160 -3278 174 3926 -1487 -4181 1339 3589 -2073 -2022 3500 2202
1172 2202 -2814 -1371 2636 493 -2697 -90 3120 526 -2952 -248 2303 -1530 -3218 1594 3128
1187 3128 -1441 -2026 2833 1583 -3130 -1131 3274 830 -2520 573 2827 -820 -3314 269 2004
1202 2004 -1296 -2190 1751 2326 -1656 -2000 1820 1130 -2419 -573 3465 868 -2253 341 2203 -1276
$$ packed form
1094e494Q878L43q711J884P855k745n686L264M203l337m135K796M443k720m822
1109c984M412M335o004l896P274J855q163Q89Q440l069p232M718N295o024l297
1124d451O051K207n189r39M211L95m267r06M589J056m502q36N912j230o241K105
1140b035N705l761l996N076L224n605j883N039N25m522P08M191l52m069Q0L509
1156A834r39m261J808M825k107m438L452L752n413k694N520K250n662N1N522j298
1172B202n016J443M007k143l190K607L210k594l478K704K551l833j688M812J534
1187C128m569n85M859j250m713J999M405k444l350L093K254l647k494L583J735
1202B004l300q94L941N75l982l44L820o90l549J846M038k597l121K594J862l479
$$ plain form
1218 -1276 -2829 819 2336 -1074 -1513 1457 1462 -2196 -1963 1722 1195 -1784 -160 3087 900 -2525
1234 -2525 -420 2156 -623 -2024 1296 2611 -1011 -1667 1153 676 -2360 -1375 1862 1266 -1456 -335
1250 -335 2151 -230 -2404 -34 2470 -162 -1695 1596 1960 -1831 -2260 1356 727 -1847 -355 2434
1266 2434 952 -2023 -630 1282 -635 -1918 538 2146 -400 -1565 988 1266 -1674 -1589 1647 1257
1282 1257 -1290 -23 2102 -20 -2147 -281 1526 -255 -1360 1073 1952 -985 -1615 588 1088 -1351
1298 -1351 -1079 1950 1407 -1287 -661 1505 -43 -2317 -168 2167 -158 -1425 789 1062 -1564 -1888
1314 -1888 1033 907 -1078 -394 1905 485 -1719 -441 1359 37 -1353 813 2020 -224 -1715
1329 -1715 398 768 -1502 -1275 1296 1160 -992 -765 1367 217 -1695 -301 1722 418 -1038 677
$$ packed form
1218a276j553L648J517l410m39K970Nl658K33L685n27k979J624L247k187l425
1234b525K105K576k779j401L320J315l622o56K820m77l036R85L237n96k722J121
1250c35K486k381k174K370K504k632j533L291L64l791m29L616o29k574J492K789
1266B434j482k975J393J912j917j283K456J608k546j165K553K78k940Q5L236l90
1282A257k547J267K125k122k127J866J807j781j105K433Q79k937o30K203N00k439
1298a351K72L029n43k694O26K166j548k274K149K335k325j267K214K73k626l24
1314a888K921j26j985O84K299j420k204J278J800j322j390K166J207k244j491
1329a715K113L70k270K27K571j36k152K27K132j150j912J394K023j304j456J715
$$ plain form
1345 677 1396 -780 -1775 316 908 -979 -761 1240 907 -1453 -806 1127 56 -1253 108 1994 345
1362 345 -1238 468 1557 -918 -1617 908 1342 -978 -825 691 287 -1715 -816 916 202 -999 368
1379 368 1436 -17 -1306 10 1122 -642 -983 1088 1105 -983 -929 885 251 -1598 -529 1388 227
1396 227 -1101 424 1090 -596 -1419 406 1175 -375 -379 932 975 -1104 -909 638 540 -971 -128 1601
1414 1601 28 -1123 -11 1038 -618 -1112 1049 1001 -778 -465 1033 345 -1216 -666 800 326 -613
1431 -613 -41 951 102 -1211 -130 971 -349 -949 552 1022 -604 -1056 661 168 -1153 -17 1053
1448 1053 116 -758 -20 591 -342 -517 137 736 52 -671 336 757 -797 -1102 543 744 -749 -429
1466 -429 1008 339 -1463 -269 1117 -313 -779 742 901 -397 -672 308 214 -500 -592 559 494 -590
$$ packed form
1345F77P19k176r95K091N92j887K18K001l33k360O47J933j071j309J361J886j649
1362C45j583J706J089k475o99K525M34k320J53J516m04k002Q99J732p14j201J367
1379C68J068j453j289J316J112j764l41K071J7k088N4J814o34j849J069J917j161
1396B27j328J525O66j686q23J825P69j550mJ311M3k079J95J547r8j511Q43J729
1414A601j573j151J112J049j656m94K161m8j779L13J498o88j561N50J466m74r39
1431f13N72R92q49j313J081J101j320o00J501M70j626m52J717m93j321J136J070
1448A053r37q74P38O11r33j75O54N99o84p23J007M21j554l05J645K01j493L20
1466d29J437o69j802J194J386j430m66J521J59j298k75R80r4p14r2J151o5j084
$$ plain form
1484 -590 -463 857 210 -1158 -245 1137 -54 -905 855 1000 -618 -1000 738 457 -835 -281 713
1501 713 222 -657 -248 428 -127 -597 24 752 318 -605 175 776 -338 -663 640 563 -806 -160 911
1520 911 107 -1181 17 694 -258 -434 346 499 -196 -221 159 511 102 -404 421 647 -177 -332 387 456
1540 456 -899 -170 816 -84 -727 231 542 -580 -565 701 474 -294 179 443 254 -256 -200 269 14 -260
1560 -260 -358 649 67 -708 -215 672 -301 -849 559 565 -524 -335 901 167 -565 96 564 61 -588 42
1580 42 241 59 -425 -57 432 -34 -477 58 612 -514 -575 649 343 -861 -124 802 -296 -700 69
1599 69 108 -269 -263 31 177 -225 -254 199 66 -132 -309 396 425 -279 -286 516 153 -615 120 551 -262 -325 421
1622 421 433 -448 -28 338 171 -492 -291 387 91 -262 -203 410 28 -420 -107 601 101 -469 180 645 -177
$$ packed form
1484e90J27J320o47j368R13J382j191q51J760J45j618l82J738k81j292N54R94
1501G13m91q79M09O76n55m70O21P28m34r23P80O01j114l25J303p7j369O46J071
1520I11q04j288J198O77r52j76P80J53o95k5L80L52m09n06Q25K26q24j55P19O9
1540D56j355P29R86r00o43R58L11j122J5J266k27p68M73K64j89n10N6M69k55k74
1560b60r8J007n82p75M93Q87r73n48J408Oj089J89J236p34p32O61M68n03o49O30
1580D2J99j82m84L68M89m66m43N35N54j126o1J224l06j204P37R26j098m04P69
1599F9L9l77OK94J46m02k9M53j33j98j77P05K9p04pQ02l63p68P35M31q13o3P46
1622D21J2q81M20L66j67o63K01O78k96l53N9O13l82m48L13P08n00n70O49M65q22
$$ plain form
1643 -177 -246 480 504 -515 -101 399 -90 -409 -7 99 -55 -179 160 188 -85 -215 193 325 -217 -324 286
1664 286 499 -461 -162 538 -191 -616 297 424 -228 -349 54 321 -241 -136 185 188 -154 18 310 64 -237
1685 -237 -203 98 36 -399 38 165 -35 -571 -29 439 -457 -61 290 126 -227 -141 387 31 -103 80 260
1706 260 187 -279 -76 122 -254 -197 347 304 -150 -340 72 363 -458 -145 349 59 -301 147 442 -306 -406
1727 -406 -43 22 -17 -388 118 141 -285 -285 207 73 -326 104 478 237 -466 45 153 -158 -207 171 334 -378
1749 -378 -259 184 52 -74 -176 408 -104 -70 -51 124 51 -270 -82 347 -29 -328 137 186 -276 -162 156
1770 156 126 -575 -200 346 -10 -236 38 104 -271 -220 -37 240 -67 -169 194 144 -39 -391 410 347 -191 -6
1792 -6 379 207 -204 -172 233 -159 -285 268 207 -206 -247 63 -78 -216 -42 264 166 -94 4 256 11 -404
$$ packed form
1643a77o9P26K4j019M14N00m89l19M02J06j54j24L39K8k73j30M08J32n42j07O10
1664B86K13r60K99P00p29m25R13J27o52j21M03K67n62J05L21Ll42J72K92k46l01
1685b37L4L01o2m35M37J27k00n36N42M68q96L96L51j64l53Q6N28l56j34J83J80
1706B60p3m66K03J98l76N7N44m3m54j90M12K91q21L13M94k90l60M48K95p48j00
1727d06L63O5l9l71N06K3m26%M92j34l99M30L74k41p03N11J08l11m9L78J63p12
1749c78J19M43j32j26j02N84n12L4J9J75p3l21J88M29l76k99M65M9m62J14L18
1770A56l0p01L75N46l56k26K74O6l75N1J83K77l07j02L63n0j83l52Q01o3n38J85
1792fL85j72m11L2M05l92j26N53o1m13m1L10j41j38J74L06r8k60R8K52k45m15
$$ plain form
1814 -404 -56 358 -114 -155 5 138 -380 -339 139 -11 -117 1 213 -52 -245 5 179 35 -122 -128 422
1835 422 -223 -316 -167 99 -186 -159 341 245 -326 -142 166 -175 -171 -226 255 152 -29 85 361 -5 -204 140
1857 140 189 -249 -296 197 254 -55 -120 91 -11 -581 -112 262 1 -122 -20 254 -68 6 53 197 -10 48
1879 48 -156 -46 -24 -124 257 133 -147 -107 152 -39 -207 -110 118 -105 -156 162 95 -108 14 -24 25 -237 192
1902 192 -26 -53 50 -80 30 -39 -48 -105 213 87 -30 70 336 -97 -91 126 58 -190 -52 298 27 51 51 76
1926 76 -146 -232 148 -1 366 -116 -130 228 -100 -167 -77 -124 -142 -63 272 0 -333 -195 60 -26 -48 -46 79 -15
1950 -15 -146 41 -87 32 -59 70 -35 -130 -75 234 97 -28 -129 262 76 -90 205 285 -163 88 97 113 -78
1973 -78 -115 15 -184 67 -46 -116 -136 41 -21 32 -17 -153 62 45 -157 -250 -20 190 -65 -191 53 -124 -193
$$ packed form
1814d04L48M14m72m1J60J33n18M1M78j50j06J18K12k65j93K50J74j44j57oN50
1835D22o45r3J49K66k85K7N00r6n71J84L08l41Mn5M81j03j81J14K76l66j99L44
1857A40M9m38m7M93N7l09o5K11j02n70M69L74k61j23J02K74l22P4M7J44k07N8
1879D8k04J10K2j00L81j24k80M0K59j91j68R7K28k23n1L18o7k03J22l8M9k62M29
1902A92k18k7J03j30J10o9rn7L18j26j17J00K66m33OK17o8k48J38L50k71K4%K5
1926G6k22q6L80j49L67m82j4L58l28o7R0m7j8P9L35k72l33J38K55q6k2KJ25r4
1950a5j31J87j28J19r1J29j05r5N5L09j37j25j01L91j86j66K95Q0m48K51RJ6j91
1973g8l7J30j99K51j13p0k0J77o2N3m9j36K15j7k02r3K30K10k55j26K44j77o9
$$ plain form
1996 -193 223 -194 59 -165 88 19 38 150 -54 -27 168 129 -19 -102 -249 -204 77 -156 1 -138 96 -20
2018 -20 154 177 263 -128 -150 41 -70 119 -30 -17 114 -62 -69 -127 -53 2 -126 103 -192 -131 -40 145 217 -111
2042 -111 46 -271 -58 -25 211 -143 -12 86 -102 27 77 -100 -139 65 -137 -140 -139 -144 6 88 7 -13 109 124 -119
2067 -119 124 78 29 -144 -187 212 91 -9 128 116 2 -19 104 51 115 70 -89 31 32 18 60 -42 -14 -206
2091 -206 180 -72 -129 47 -87 -110 -67 190 40 -150 -15 167 30 72 -57 39 -149 113 28 294 -233 98
2113 98 -139 115 5 -115 88 -114 -281 99 -76 223 -85 -35 30 -142 -63 14 4 19 -84 -1 -148 17 161
2136 161 -3 -97 47 -68 -61 -116 -49 -2 15 -154 22 -46 -70 14 -129 88 83 18 3 124 73 226 93 -42 -76
2161 -76 -34 -71 -45 54 -73 145 118 73 14 52 39 -305 34 14 98 -79 211 30 -27 -131 -40 258 -197 -75 -109
$$ packed form
1996a93M16m17K53k24K53o9J9J12k04K7J95l9j48q3j47M5K81k33J57j39K34j16
2018b0J74K3Q6l91k2J91j11J89j49J3J31j76pn8P4N5j28K29k95O1R1J85P2l28
2042a11J57l17K13L3K36l54J31R8j88J29N0j77l9K04k02lJnJ50Q2q1k0J22J5k43
2067a19K43m6m9j73m3L99j21j00J37j2j14k1J23n3O4m5j59J20Jj4M2j02K8j92
2091b06L86k52n7J76j34k3M3K57j50j90J35J82j37M2j29R6j88K62q5K66n27L31
2113I8k37K54j10j20K03k02j67L80j75K99l08N0O5j72P9P7j0J5j03Q3j47J65J44
2136A61j64r4J44j15Pn5O7M7J7j69J76o8k4Q4j43K17no5j5J21n1J53j33j35l4
2161g6M2l7K6R9j27K18k7m5n9L8j3l44L39k0Q4j77K90j81n7j04R1K98m55J22l4
$$ plain form
2186 -109 -110 -36 0 -55 -4 -99 61 140 -230 -48 70 170 -6 -99 150 49 100 -210 2 -130 119 -103 -14 30
2210 30 -18 -4 46 96 -40 -29 87 15 -124 90 32 8 -60 134 90 -44 -67 63 55 -179 -4 40 -129 72 -210
2235 -210 -64 72 41 135 118 -39 -77 35 -67 54 156 116 77 -124 -63 176 47 17 67 -48 15 -19 -12 155
2259 155 15 125 1 59 -183 42 29 -128 -22 -16 99 -117 141 111 42 140 -129 190 -25 37 -48 1 -29 55
2283 55 165 43 62 -19 47 -43 -10 -38 169 -78 -75 -33 129 32 -133 1 -23 -126 -153 20 -98 72 -136 121
2307 121 62 -134 -83 26 103 -49 -50 6 156 -123 69 90 -78 2 176 -126 -49 -42 28 35 60 -285 29 312 -86
2332 -86 8 -30 -38 -213 -174 -60 -77 -45 -133 366 -141 131 109 134 -208 -33 56 72 -47 44 142 -43 -177 -71 2
2357 2 15 -163 164 162 -2 197 -83 -77 -22 -182 -174 97 67 -96 111 -159 -116 12 30 -184 -10 -96 65 -57 -105
$$ packed form
2186a09jP4L6n5N1r5J60P9l70J82J18J00j76r3K49j01N1l10K12j32K49k22Q9M4
2210C0m8J4N0N0j36J1J16p2j39K14n8k4o8J94m4j34k3J30qk34J75M4j69K01k82
2235b10J46J36l1R4j7j57l8J12j02J21J02m0l9k01O1K39j29l0N0j15O3l4PJ67
2259A55j40J10j24N8k42K25j3j57J06OJ15k16K58l0o9R8k69L19k15O2q5M9l0Q4
2283E5J10j22J9q1O6r0L3k8K07k47LM2J62r7j65J34k4j03k7J73j18J70k08K57
2307A21n9j96N1J09P7j52jN6J50k79J92K1j68Q0J74l02P7PP0PK5l45L14K83l98
2332h6R4l8qj75L9J14j7L2q8M99n07K72k2K5l42J75Q9J6j19R1R8j85j34J06P3
2357BJ3j78L27kj64J99k80ON5j60QK71l0j63K07k70M3J28J8k14J74q6J61j22m8
$$ plain form
2382 -105 296 -27 -188 -158 14 21 -156 60 94 0 2 92 95 -42 57 4 137 -224 88 105 -7 28 -58 149 229
2407 229 19 -131 -25 -80 20 -114 -202 298 14 207 131 -159 -58 147 76 -192 -28 -164 -121 -297 30 84
2429 84 216 -99 -18 203 44 -267 169 216 -229 185 -155 181 -32 -188 30 154 -70 -38 242 257 -303 178
2451 178 187 -85 -178 339 30 5 -107 175 32 83 153 -60 -20 -42 95 -9 -175 -6 120 -68 -212 -74 127
2474 127 -46 -26 -71 189 -45 -139 -87 133 184 -43 41 -48 33 -17 107 369 94 -43 65 140 -25 -146 70
2497 70 80 -215 2 226 9 -123 94 265 -51 32 136 9 111 -89 232 148 -341 -304 -58 35 -133 -49
2519 -49 24 -124 -161 -280 103 -157 -372 -81 -28 -111 -241 89 190 -262 163 132 -23 -203 256 240 -63 -156 -184
2542 -184 299 -91 -141 136 128 -242 -174 36 -2 -103 -197 222 108 -249 10 208 133 -169 175 229 -137 -55 76
$$ packed form
2382a05M01l23j61L0J72Pj77K16L4r4KR0Lj37R9n3J33l61L12J7j12L5q6K07Q0
2407B29k10j50J06n5J00j34q8N00k84J93p6k90J01K05p1k68J64j36M3j76L27N4
2429H4J32l15Q1K21j59l11M36M7m45M14l40L36k13j56K18J24k24L2K80J5n60M81
2451A78Rk72r3N17l09k5j12K82j43N1P0k13M0k2J37j04j66J69J26j88j44J38K01
2474A27j73K0m5K60k34r4N2K20N1k27Q4q9Q1n0J24K62k75j37J08P5j65j21K16
2497G0J0k95K17K24k17j32K17J71l16Q3J04j27J02k00L21q4m89L7K46R3j68Q4
2519d9P3j48l7j19L83k60k15K91N3q3j30L30J01m52M25l1j55j80M59j6l03r3k8
2542a84M83l90n0K77ql70O8K10l8j01r4M19j14l57K59J98p5l02L44N4l66Q2J31
$$ plain form
2565 76 4 -127 45 83 62 -133 154 120 -109 -207 -8 355 -63 -102 132 154 -98 -159 256 151 -23 126 5
2588 5 83 -152 -87 -42 -39 -95 -265 -129 -93 -196 43 220 -174 -91 63 187 -274 -133 40 29 -168 65 -23 -290
2612 -290 -67 23 -50 73 -96 -26 85 -13 -86 16 25 -20 59 106 161 -217 -44 189 -123 -313 116 -135 -7 -53
2636 -53 -100 107 -23 -241 72 28 -227 -29 -100 -132 -20 34 120 121 -280 135 223 -28 -91 -7 -79 244 185 -178 -82
2661 -82 42 -183 222 78 -7 101 -42 57 -214 -186 57 -64 -265 49 267 -97 -235 141 101 -132 97 29
2683 29 153 -201 -78 280 -18 -87 59 214 45 -256 133 11 -74 -30 90 145 -31 -49 15 -88 4 48 24
2706 24 -71 -114 54 -92 -79 -234 36 3 66 70 -191 270 -80 -186 162 73 -183 -85 139 -94 -72 458 70 -2
2730 -2 -108 -176 242 -178 -58 161 43 -41 5 -44 -114 -186 -60 69 -133 -129 217 75 -334 32 135 40 -134 -163
$$ packed form
2565G6p2j31J72L8k1j95K87l4k29r8J99L63m18l9K34K2k52o1M15j05j74J49j21
2588EP8k35O5M5Ln6j70J36L6j03K39J77l94Q3J54J24m61J41J73j1j97K33q8k67
2612b90K23R0p3J23j69P0J11r8p3J02Rm5P9M7N5l78J73K33l12j90M29k51J28m6
2636e3m7K07j30k18L13m4k55J98p1l2J12N4Q6Jm01M15Q8k51o3Q4p2L23n9l63R6
2661h2J24k25M05j44q5J08j43R9k71K8K43j21k01L14K18l64j38L76m0k33K29o8
2683B9J24l54J23L58k98o9J46J55j69l01L89j22q5M4J20N5j76j8O4j03R2M4k4
2706B4r5m3J68j46J3j55K70l3O3Mk61M61l50j06L48q9k56R8K24k33K2N30l88p2
2730bj06o8M18m20J20K19j18q4M6m9p0p2J26J29k02ML46j42m09L66J03r5j74k9
$$ plain form
2754 -163 -110 -220 -240 66 77 75 -72 48 103 -116 -186 -57 130 -19 -72 176 117 -156 -224 129 297 -12 43 86
2778 86 -331 7 -143 -127 -95 -177 -57 10 33 -22 292 24 -11 72 62 -55 -163 52 92 69 -347 54 -97 -44
2802 -44 -160 -15 112 -119 -201 19 98 -220 -20 134 -62 13 83 -8 -50 -140 37 9 -108 -56 119 170 32 -265
2826 -265 155 -233 -58 46 155 110 -134 -102 252 35 -243 26 -15 -82 -153 -87 117 -54 -217 118 108 -175
2848 -175 89 88 -166 -126 7 -37 -14 -172 -71 34 17 -141 -87 298 29 -94 310 228 -196 14 70 -116 -147
2871 -147 81 47 -125 -128 132 52 -22 -46 27 56 62 -130 169 -145 -189 94 129 -20 84 -34 4 -29 -216 39 -96
2896 -96 65 -122 188 197 31 101 90 202 112 -21 -2 131 96 -43 114 21 -37 -176 -101 98 209 70 39 26
2920 26 50 169 76 -34 7 132 74 -140 113 -53 -4 -189 60 -131 -299 -147 -80 -105 -8 -69 38 149 -164
$$ packed form
2754a63N3j10k0L06J1kj47J20N5k19p0J29J87j49n3K48n9k73o8L53J68l09N5M3
2778H6m17L38j50J6L2q2J20O7K3n5L14k68l5Q3j0j17j08K15M0k3m16M01j51N3
2802d4j16J45J27k31q2K20P9l18K00J54j96P5P0r1m2r0J77k8j17N2J75N1j38k97
2826b65M20l88J75J04J09m5k44L2L54k17k78K69m1o7p1O6K04j71j63L35j0k83
2848a75K64jk54M0J33m4K3j58J01J05j7j58N4L85k69j23M04q2m24K10N6j86l1
2871a47K28l4j72lK60q0p4k4P3K9Oj92K99l14m4K83L5j49J04j18L8l3j87K55j35
2896i6J61j87L10Rj66P0j1J12r0j33J9J33l5j39J57r3n8j39P5J99J11j39l1j3
2920B6K4J19r3j10M1J25n8k14K53j66M9j85K49j91j68J52O7k5R7o1J07J11l13
$$ plain form
2943 -164 166 -54 30 -20 32 84 -118 -105 154 83 -192 47 7 -63 -76 135 -2 -1 -188 66 -67 4 -152 -128
2967 -128 313 7 -181 9 38 -87 -121 60 -22 -179 48 51 49 -91 138 58 -60 -258 85 63 -83 39 93
2990 93 127 9 166 145 -18 29 -150 120 -2 -16 -16 -27 56 -92 -31 132 27 41 -196 -127 -30 -135 -18 -8 78
3015 78 -2 76 63 220 -62 82 -83 156 30 89 150 -102 -191 44 -26 36 62 315 -60 -51 -20 -35 -71 127 -101
3040 -101 87 -47 71 -96 -142 -186 80 164 7 -163 -85 -106 -29 -116 183 237 -290 9 21 -49 -227 32 124 -156
3064 -156 -118 -4 178 28 75 61 70 -11 12 30 -110 -135 61 190 100 -162 -46 351 -66 -115 108 4 64 3
3088 3 8 62 -88 -48 36 172 -99 -25 184 -90 -135 188 43 -96 -114 153 -67 14 25 27 -35 -3 -70 301 115 -207
3114 -207 59 69 34 -93 2 -43 3 183 114 10 -75 64 18 -52 40 57 161 144 38 132 176 12 -82 216 178
$$ packed form
2943a64L30k20Q4n0N2N2k02J3K59p1k75K39m0p0j3K11j37Jj87K54j33P1j56K4
2967a28M41l06j88J90K9j25l4J81q2j57K27Lkj40K29q0j18j98L43k2j46J22N4
2990I3L4j18J57k1j63M7j79K70j22j4%j1Q3j48O1J63j05J4k37O9R7j05J17J0Q6
3015G8q0P8j3J57k82J44j65K39j26N9O1k52q9K35p0O2K6K53l75RL1j5l6J98k28
3040a01J88j34J18j67m6m4K66Q4j57j70P8k1P7q7K99N4n27K99J2p0j78K59R2k80
3064a56L8J14J82j50M7j4Rq1K3J8j40k5J96J29r0k62J16L97m17m9K23j04O0o1
3088CNN4j50M0Q4J36k71P4K09k74m5L23j45j39j8K67k20Q1J1Ko2L2o7L71j86l22
3114b07K66J0l5j27R5m5M6J80o9j04q5J39m6p0R2J7J04j7j06R4M4j64r4K98l8
$$ plain form
3139 178 -82 135 130 80 -196 -268 -24 81 -119 83 -29 -45 75 -5 131 26 -16 117 103 -35 -282 323 239
3162 239 -36 -83 45 -122 -14 -119 68 -98 -75 41 100 26 17 -19 139 38 -169 -54 46 104 192 118 69 -143
3186 -143 -5 89 -11 137 71 -121 4 -53 -117 216 88 -79 47 92 -246 -10 67 46 -38 243 -18 99 -49
3209 -49 142 -66 -88 7 47 38 6 -130 136 -100 -149 -89 118 -84 100 -33 36 7 -168 15 72 35 -97 -246
3233 -246 -43 -67 20 -104 25 -73 -68 232 12 -96 90 308 141 49 167 162 116 -280 107 -44 -56 -155 130 -43
3257 -43 -84 -60 120 13 21 -57 171 103 -57 -118 -76 -28 -66 35 -15 -97 -218 -101 -15 50 -94 132 19 -19 -169
3282 -169 306 93 -53 91 -34 170 -78 -14 -26 2 -99 53 -14 -82 156 176 -50 1 -5 -75 154 -30 84
3305 84 -97 -216 146 -216 29 -139 -118 -25 64 187 -97 71 154 -105 0 -95 120 -140 106 -87 -79 -39 -35 152
$$ packed form
3139A78k60K17nn0k76p2K44J05k00K02j12j6J20q0J36j05m2J33j4j38k47O05q4
3162B39k75m7J28j67J08j05J87j66K3J16N9p4rl6J58j01k07J15J00N8Q8p4m9k12
3186a43J38R4j00J48o6j92J25n7o4L33j28j67J26M5l38K36P7k1q4K81k61J17j48
3209d9J91k08k2R5M0rl2j36K66k36m9O0K07k02J84j33O9k9j75J83N7l7j32j49
3233b46K03k4Q7j24J29r8NL00k20j08J86K18j67r2J18nm6l96L87j51j2r9K85j73
3257d3m1K4J80j07Qp8K28o8j60o1M2M8l8J01n0q2j21J17Q6O5j44K26j13l8j50
3282a69M75k13j46J44j25K04k48O4j2K8j01J52o7o8K38K0k26N1op0K29j84J14
3305H4j81j19L62l62K45j68K1R3Q9J23k84J68Q3k59J05r5K15k60K46j93QM0MJ87
$$ plain form
3329 152 94 -45 8 -39 52 -166 -60 -60 -88 -150 170 -101 -278 50 70 -93 -30 111 -204 -66 84 126 -83 -40
3353 -40 -37 113 -27 -4 -212 -11 21 29 160 59 -128 22 -54 126 188 82 84 258 -96 8 -206 -175 29 -48
3377 -48 87 98 -33 -157 -224 88 -164 -138 -59 -53 107 8 119 140 -4 16 86 -33 -26 -30 -98 -142 133 232 -56 42
3403 42 38 -111 -65 -114 -14 89 -188 57 153 193 117 48 -160 122 51 54 168 -171 155 181 -110 -113 14 116 13
3428 13 -40 11 -35 26 -106 -96 74 -263 -138 12 31 1 -60 -8 -158 31 -83 -29 -225 -155 -73 -80 -61 204 -51
3453 -51 -20 87 -41 37 132 -76 71 25 109 88 267 119 8 -74 6 69 90 10 52 36 -37 35 83 52 -96 16
3479 16 121 -165 -80 17 26 57 -81 -32 -22 -59 23 -175 243 -7 33 114 52 189 63 88 91 190 -146 -63 111 -93
3505 -93 21 -1 78 -61 171 28 -41 8 -58 110 110 -22 -62 -77 5 -10 -15 10 200 151 -86 -85 -63 -95 96 85 14
$$ packed form
3329A52n8j39N3m7R1k18J06%k8o2L20k71j77L28K0j63O3J41l15J38J50M2k09M3
3353d0LJ50j40K3k08K01L2QJ31j01j87J50p6J80O2j06KJ74l54J04k14L1K04p7
3377d8J35J1j31j24o7L12k52K6P9OJ60r9J11K1j44K0P0j19Pmo8m4K75R9k88R8
3403D2mj49M6m9J00J03k77K45R6M0p6o9k08K82p1LJ14l39L26K6k91lJ27J02j03
3428A3n3N1m6O1j32J0J70l37J25J50J9l0o1N2j50J89j14N4j96P0Q2pJ9K65k55
3453e1L1J07j28P8R5k08J47m6Q4k1J79j48j11q2Q0O3K1q0M2j6p3P2M8l1j48J12
3479A6J05k86Q5R7RL1j38M9J0l7Q2j98M18k50M0Q1o2J37j26K5LR9l36Q3J74k04
3505i3J14k2P9j39K32j43o9M9o6J68%j32m0j5Q2j5nK5J90m9k37JK2l2J91j1p1
$$ plain form
3532 14 -82 98 35 -57 -42 84 7 253 -11 -51 -20 -103 82 21 31 61 4 67 23 -97 -172 52 6 -133 10 0
3558 0 -121 29 -160 -43 47 -105 54 -5 -169 261 -54 108 -146 -6 149 16 -76 -38 -10 -20 -136 -16 -151
3581 -151 156 -53 -104 -22 -46 -43 -177 -38 78 -35 -268 -129 223 135 62 83 -2 149 4 -21 53 -90 -149 -115
3605 -115 79 33 80 54 127 -112 162 92 -142 96 -28 15 -229 157 76 412 -58 -27 107 -194 78 -119 -80
3628 -80 -57 -128 -112 -2 58 -163 93 253 -87 46 -84 12 -202 -125 -82 33 13 165 44 43 -14 44 75 230 -122
3653 -122 -2 30 65 -68 81 135 50 185 39 144 -186 -99 -34 98 -273 178 -136 13 -112 176 -170 -26
3675 -26 121 -20 182 -101 60 -52 -77 -201 -93 41 25 -178 -36 -118 57 -163 -107 -87 16 134 37 25 -95
3698 -95 167 -52 -128 31 -45 348 4 -96 11 -35 -105 -111 -141 -17 -136 -245 -134 96 149 -156 -133 149 33
$$ packed form
3532A4r6J80o3r2J5J26p7K46k64m0L1q3J85o1J0L0n7O3m4j20p5K24m6j39J43j0
3558@j21J50j89J17R0j52J59n9j64M30l15J62k54J40J55j33r2L8K8j0j16J20j35
3581a51L07k09n1Q2k4Lj34J39J16j13k33J39L52q8p3K1q5J51j45k5P4j43n9L4
3605a15J94m6M7k6P3k39K74p0k34K38j24M3k44L86q1L36m70L1J34l01K72j97L9
3628h0K3p1J6J10O0k21K56J60l40J33j30R6k14P7M3J15k0J52j21jn7N8L1J55l52
3653a22J20L2L5j33J49N4q5J35j46J05l30Q7O5J32l71M51l14J49j25K88l46J44
3675b6J47j41K02k83J61j12k5j24J08J34j6k03J42q2J75k20N6K0J03J18r7j2j20
3698i5K62k19p6J59p6L93l44j00J07m6p0ol0J24j19j09J11K30N3l05K3K82j16
$$ plain form
3721 33 -11 -122 -94 75 -54 39 -177 64 -78 38 -42 57 -99 -134 60 11 168 -1 151 28 -73 68 78
3744 78 13 -34 -15 -8 187 -86 -49 -137 56 -1 -134 102 60 110 -112 -85 -137 120 -43 156 156 -18 -57 -92 37 -25
3770 -25 -286 56 -122 -108 83 23 167 -73 57 -15 43 136 69 -126 -189 64 -229 -7 430 -26 21 -37 128
3793 128 129 -20 39 -39 78 -133 -34 -136 -118 -20 23 143 203 175 48 -58 30 187 100 -158 -72 -171 -18 25 47
3818 47 138 -14 199 -48 -79 74 161 -31 -17 -70 -38 -93 42 155 -51 41 28 -41 -192 32 -45 -118 -64 61 -109
3843 -109 -156 3 28 137 -188 -55 -275 35 22 -39 -121 73 -204 -184 -100 -68 170 38 9 14 75 -131 -40 -24 51
3868 51 96 103 22 92 -157 41 -90 8 -143 79 -85 40 -118 146 264 -73 111 -59 -8 80 -25 175 223
3891 223 22 -140 41 12 -105 -162 20 -72 -19 31 29 186 -66 27 52 132 136 -53 -91 8 97 141 -98 -205 -8
$$ packed form
3721C3m4j11K8J69j29R3k16K41j42J16q0R9j56l5J94m9J57j69J52j23j01J41J0
3744G8o5m7J9PJ95k73L7q8J93n7j33K36m2N0k22K7n2K57j63J99%j74l9l5J29o2
3770b5k61L42j78J4J91o0J44k40J30p2N8R3o7j95o3K53k93K22M37m56M7n8J65
3793A28Jj49N9p8J17k11R9j02J8R8M3J20O0k8j27j06Q8J57q7k58Q6r9J53M3K2
3818D7R1j52K13k47l1J53Q7j92J4n3L2n5J35J13k06R2j3o9j51K24p7p3N4J25j70
3843a09m7J59K5J09l25J33k20L10j3o1q2J94k77K0Q4L2K38j32k9NO1k06R1J6P5
3868E1M5Pq1P0k49J98j31R8j51K22j64J25j58K64J18l37J84j70N1Q8j05K00M8
3891B23k01j62J81k9j17n7J82r2N3N0kJ57k52R3K5Q0Mj89l8R9Q9M4k39j07J97
$$ plain form
3916 -8 -91 170 -133 -59 -2 -53 -50 -61 44 -59 171 19 0 80 252 98 -95 88 -39 -77 -110 181 -165 115
3940 115 255 19 -54 -197 -29 -121 47 118 90 73 34 -28 -19 94 -22 48 -1 23 -79 -9 -82 162 -137 67 -192
3965 -192 -78 73 92 39 -151 38 -169 11 -254 228 -77 350 172 19 120 93 4 -31 -78 31 18 -54 -56
3988 -56 47 45 6 162 286 -62 54 100 110 59 -212 19 -38 -94 -44 3 30 49 -128 71 -154 -70 -154 -36 60
4013 60 37 105 -46 -111 -65 -59 85 273 62 -279 -187 196 -12 -18 -74 -117 -313 -130 -169 -245 -123 -90 -108 361 -59
4038 -59 24 -69 -233 55 -132 -18 -210 -56 -54 -219 -106 5 -284 31 -54 35 -177 51 89 7 -56 191 162 -131
4062 -131 60 -42 151 -24 212 94 -62 47 -60 -42 -24 33 -111 -81 58 -31 -127 35 201 -78 53 218
4084 218 67 68 32 78 -32 -184 68 -12 123 -49 -60 -143 130 -91 63 88 -102 -112 -47 -58 -120 48 10 109 133
$$ packed form
3916hq3K61l03P4N7n1Lj1J05j03K30j52j9Q0J72j54j93J83j27l8l3K91l46K80
3940A15J40k36p3j43J68r2J68P1k8j7l9o2RJ13j16P0m9K4j02P0p3K44k99K04k59
3965a92J14J51J9n3j90J89k07J80k65M82l05M27j78j53J01k7q9l5m7J09j3p2k
3988e6J03kl9J56J24l48J16M6J0n1k71K31n7n6N0M7K7J9j77J99k25Q4q4J18R6
4013F0k3O8j51o5M6OJ44J88k11l41R2L83k08on6m3j96J83l9p6J22L3j8M69m20
4038e9Q3r3j64K88j87J14j92J54Kj65J13J11k89L15q5Q9k12K28L8q2o3K47k9k93
4062a31J91j02J93j75K36j18j56J09j07J8J8N7j44L0J39q9r6J62J66k79J31J65
4084B18j51Jl6M6j10j52K52q0J35j72j1q3K73k21J54K5j90j0O5j1o2J68l8R9K4
$$ plain form
4109 133 -25 4 -74 -146 -190 -166 173 112 67 -120 52 -76 -84 5 -79 264 -85 -20 -80 -34 101 4 28 8 -65 -172
4135 -172 52 -31 238 -58 -33 -19 78 -31 96 -15 42 138 126 -50 171 -121 45 140 126 64 37 83 -179 71
4159 71 -161 -15 103 -77 -141 109 81 137 160 54 201 -157 50 38 -38 -15 46 103 9 -209 150 60 -61 -65 -16
4184 -16 -198 0 -36 66 29 6 115 -213 -196 -71 71 214 97 -21 -147 -66 49 -84 -30 71 -70 -75 -4
4207 -4 59 -83 -54 26 57 -87 18 155 102 8 -68 41 90 27 -51 -286 -4 -81 76 -23 -107 -175 -72 32 103 -10
4233 -10 -37 79 24 49 73 127 108 177 53 38 20 -54 175 -193 -19 32 -163 1 -62 130 58 -4 28 75 163 92
4259 92 -109 -215 -36 -165 -53 106 -273 94 -89 179 -230 -108 -48 58 50 178 -106 -158 176 -225 -170 22
4281 22 -177 -251 91 -88 216 161 84 79 -38 -47 31 67 -41 75 77 13 -145 -45 98 -91 147 23 -43 -103 -50
$$ packed form
4109A33j58K9p8p2m4K4L39o1m5j87J72j28qQ9q4L43l49O5o0M6J35r7K4k0p3j07
4135a72K24q3K69k96K5J4R7j09J27j11N7R6j2j76K21k92J66R5j4o2k7M6k62K50
4159G1k32J46J18j80o4K50k8N6K3j06J47l58K07j2p6K3O1N7r4k18L59r0j21mM9
4184a6j82J98l6J02l7k3J09l28J7J25J42J43j17j18j26Q1J15j33N4J01j41nP1
4207dO3j42K9Q0L1j44J05J37n3r4p6J09M9o3p8k35K82p7J57r9q4o8J03J04P1j13
4233a0k7J16n5K5K4N4j9O9j24j5j8p4K29l68J74N1j95J64o3J92p2o2L2M7Q8p1
4259I2k01j06J79j29J12J59l79L67j83K68m09J22O0J06qJ28k84n2L34m01N5J92
4281B2j99p4L42j79L04n5p7nj17rP8L6j08J16Ko4j58J00J43j89K38j24o6o0N3
$$ plain form
4306 -50 -11 -33 46 -151 58 121 -4 -2 -2 -53 240 48 29 -136 43 -39 -213 105 50 15 33 101 96 -53 -118 -218
4332 -218 26 7 49 114 16 -24 145 143 128 -208 135 -13 -47 -51 165 -132 135 -30 -23 14 -73 -66 17 -20 -41 -111 -179
4359 -179 78 -62 271 -218 -59 -59 117 109 -110 -117 -6 -191 45 -231 19 123 -49 -20 20 61 43 -62 -237
4382 -237 129 -112 70 -19 73 66 -124 -70 -71 -66 28 -131 -24 36 -162 -52 -4 132 177 -45 90 21 61 200 6
4407 6 -171 -5 -66 115 107 20 -90 144 69 -137 12 -29 -117 84 57 -89 -155 102 -14 -3 58 -186 -113 324 109
4432 109 36 12 -24 143 -15 10 -84 -30 -81 197 -20 163 -88 122 -96 -62 -82 83 -48 -204 -39 -31 -3 -97
4456 -97 -127 132 -53 -104 169 -179 -56 58 -22 84 -5 -91 55 122 -120 16 15 36 -161 -92 -23 29 -112 -77 -58
4481 -58 179 21 -55 195 -207 -79 -25 30 -19 10 85 -122 -48 50 -103 -49 48 0 -54 177 -101 -118 151 -1 79
$$ packed form
4306e0L9k2P9j97K09O3j25K%n1K93j92j9j65J79q2j74L18n5l5J8O8nj49o5j00
4332b18K44j9M2O5r8m0J69kj5l36L43j48l4mK16k97K67j65PL7q7PQ3l7k1p0o8
4359a79K57j40L33m89J59%J76qk19pJ11j85K36k76K50J04j72K9M0M1j8j05j75
4382b37L66k41J82q9R2pj90N4jNR4j59J07O0j98J10M8J36M5k22J35o9M0J39j94
4407Fj77J66o1J81qq7j10K34p5k06J49m1q8K01k7j46o6K57j16J1O1k44P3M37k15
4432A09p3k4l6J67j58K5r4N4n1K78k17J83k51K10k18L4k0J65j31j56J65QK8r4
4456i7l0K59j85n1K73l48J23J14q0J06q9q6J46O7k42J36jK1j97O9O9N2j41L5J9
4481e8K37j58p6K50m02J28N4N5m9K9P5k07P4R8j53N4R7m8n4K31k78j7K69j52Q0
$$ plain form
4506 79 -145 -140 159 138 37 216 6 195 15 -61 100 -152 95 -56 16 -38 -2 105 -84 -21 -207 -97 175
4529 175 -121 -188 253 -78 -98 37 -81 139 63 11 53 -21 -82 -47 -34 24 -5 -1 -175 38 -62 -29 -64 -51 -139 -140
4555 -140 -55 -123 -50 -76 79 -54 -21 10 120 -58 35 -105 -10 75 -11 63 88 33 -90 -151 -68 74 7 178 55
4580 55 -137 27 120 -8 71 -33 3 107 -5 -242 -31 -47 42 -171 -97 -115 -23 78 -29 -44 -13 230 249 22
4604 22 163 -42 -51 238 -126 26 -58 72 84 -43 117 -72 103 -140 -187 103 73 -18 -134 -119 -24 -43 -80 -75 -36
4629 -36 51 -33 -14 19 27 183 -41 70 32 -133 200 -202 -11 -127 -65 -61 98 87 -95 46 75 38 -245 -104 -177
4654 -177 15 106 -16 206 -34 -13 -25 34 -76 39 102 146 117 173 -70 90 146 -303 124 -38 -168 -54 163
4677 163 -72 20 22 58 -54 -17 -52 67 -116 4 61 115 -186 117 62 170 -92 -72 193 -141 98 -131 -33 23
$$ packed form
4506G9k24NK99k1j01J79k10J89j80p6J61k52K47j51P2n4L6J07j89O3j86J10K72
4529A75k96o7M41l31k0J35j18K20p6n2M2p4o1L5J3N8k9Mj74K13j00L3l5J3q8j
4555a40Q5o8P3k6J55j33L3L1J10j78R3j40R5Q5q6P4K5n5j23o1Q3J42o7J71j23
4580E5j92J64R3j28P9j04L6J04j12k37K11j6Q9k13P4j8R2J01j07j5L1K43J9k27
4604B2J41k05rK89l64J52q4J30J2j27J60j89J75k43m7K90l0r1j16J5R5j9l7NL9
4629c6Q7q4J9L3QJ56k24J11l8j65L33m02J91j16O2MJ59j1j82J41K9l7k83J41p3
4654a77J92R1j22K22k40K1j2N9j10J15O3M4k9N6k43J60N6m49M27j62j30J14K17
4677A63k35R2KL6j12L7l5J19j83J20N7N4l01L03n5J08k62K0K65l34K39k29R8N6
$$ plain form
4701 23 63 59 -98 147 98 19 -1 -6 -26 -156 -30 -248 -91 165 -99 -64 -63 -94 -270 -126 -49 16 12 -105 37 -25
4727 -25 170 163 200 -38 -119 105 -115 283 -30 -19 61 123 14 -175 206 323 102 -88 55 -69 119 114 -128
4750 -128 30 179 108 18 -61 72 -189 321 4 40 136 -163 -62 128 134 -6 87 63 25 36 31 57 30 -175 -58
4775 -58 -82 48 -356 63 -12 -125 114 61 77 -69 -164 126 -39 26 90 -19 -31 72 -21 83 -93 -15 -56 -164
4799 -164 -67 -173 -36 -13 65 31 -66 -155 -35 -80 130 50 -154 35 9 -50 132 37 -168 83 87 -213 -15 -110 78
4824 78 79 -114 -139 160 53 107 88 4 -262 157 122 78 40 65 161 -138 -71 -59 159 -92 172 90 -32 -22 260
4849 260 238 -1 27 -115 -104 -43 -65 -71 -111 74 109 73 136 75 131 90 -147 38 -12 -17 71 -250 24 140 6 -100
4875 -100 77 -50 -131 55 111 161 3 213 -50 -331 -42 -11 -87 68 141 -55 -46 -99 -45 -62 81 106 120 68 -39
$$ packed form
4701B3M0mj57K45m9p9k0nk0j30J26k18J57K56k64L5Jl1j76J44P7O5mj17J42o2
4727b5J95pL7k38q1K24k20L98l13J1Q0O2j09j89L81J17k21j90J43j24J88nk42
4750a28J58J49p1r0p9J33k61N10l17L6R6k99J01J90Oj40R3k4l8J1nK6k7k05J17
4775e8k4J30m04M19p5j13K39n3J6j46r5K90j65O5O4j09j2J03r3J04j76P8m1j08
4799a64R7j06J37K3P8l4r7q9J20m5K10q0k04J89k6n9J82r5k05K51Ml00J98r5J88
4824G8Jj93k5K99j07N4j9q4k66M19l5m4l8K5R6k99O7J2K18k51K64q2j22J0K82
4849B60k2k39K8j42J1O1k2om0J85L5l6O3o1N6m1k37J85n0nQ8l21K74J16j34j06
4875a00J77j27q1J86N6N0j58K10k63k81K89L1p6J55P3j96Rn3N4j7J43K5J4n2j07
$$ plain form
4900 -39 234 141 127 202 75 -43 67 74 -15 -2 -146 28 -117 40 -91 -20 181 -2 98 -50 28 184 -145
4923 -145 20 -130 92 -153 -9 89 223 77 139 -92 -12 -39 -82 -126 -19 30 -45 -8 34 21 27 76 -58 143 20
4948 20 16 96 35 163 -24 30 51 -51 -244 27 -129 -96 -97 -28 -149 -106 109 -144 -84 -11 -49 39 -75 -34 -228 42
4974 42 44 184 -67 216 164 -138 -148 134 38 85 -142 -229 115 19 -32 -122 32 -50 33 66 20 89 46 -2 -142 160
5000 160 29 48 126 2 -102 -1 44 171 -131 -128 -1 66 48 -35 126 29 63 -12 19 -81 -88 75 -30 -44 -17
5025 -17 25 -119 129 -14 183 73 -120 40 123 67 241 47 122 -1 -32 96 97 84 -121 115 9 -174 7
5048 7 59 -34 -9 -40 -42 195 119 -78 148 -70 -130 15 -206 269 176 -126 -112 -101 -125 -68 -133 -78 52 -138 93 -134
5074 -134 43 71 -53 132 -30 110 -45 -20 35 7 -62 -91 68 -2 -85 -64 -39 173 -14 74 -72 222 -10 -31
$$ packed form
4900c9K73r3j4P5j27j18J10Pq9J3j44J74j45J57j31P1K01j83J00j48P8J56l29
4923a45J65j50K22k45J44R8J34j46O2k31Q0k7m3m4J07M9p5L7M2j3OM9j34K01j23
4948B0mQ0o1J28j87N4K1j02j93K71j56L3jO9j21M3K15k53O0P3l8Q8j14M1j94K70
4974D2KJ40k51K83n2l02j0K82r6M7k27q7L44r6n1r0J54q2Q3L3m6O9m3m8j40L02
5000A60j31J9P8j24j04J01M5J27l02LJ27O7j8q3J61r7L4p5L1j00pJ63j05j4K7
5025a7M2j44K48j43J97j10j93J60Q3n6J74j94P5j23l1J28Jj3k05K36j06j83J81
5048GN2r3K5l1kK37p6j97K26k18o0J45k21M75r3l02J4J1k4N7o5N5J30j90K31k27
5074a34J77K8j24J85j62J40j55K5N5k8o9k9J59p0q3K1K5K12j87Q8j46K94k32k1
$$ plain form
5098 -31 80 4 -33 223 -26 -1 33 -40 14 37 82 -71 -184 115 -156 -218 -8 -59 -38 27 -13 87 77 -266 -81
5123 -81 4 -8 88 83 -40 23 -39 -98 10 -46 -22 -89 143 199 -62 -65 -131 75 -27 4 107 104 -30 79 8 43 108
5150 108 19 37 -111 152 -78 -101 -39 4 -109 79 -19 121 62 -1 30 -211 -221 -232 44 150 -68 -8 -101 -122 133
5175 133 -117 53 -1 15 99 -21 -84 84 -9 -161 -43 58 -230 -115 167 -67 259 -103 55 282 -29 94
5197 94 -199 -234 -232 71 -249 -21 -56 67 158 -49 106 123 -239 186 -67 -14 10 -161 31 -3 193 -217 -35
5220 -35 27 57 169 93 -103 -23 23 -109 13 -120 -246 -78 -9 -31 -168 51 3 -4 8 -3 143 -36 46 215 0
5245 0 -70 16 159 31 -38 17 162 -209 -80 -106 -175 29 -184 -9 120 -90 -233 -165 168 -1 250 25 -93
5268 -93 71 -115 -9 -18 -76 -20 103 25 -24 -69 -85 -78 39 49 4 59 23 -98 -2 -193 128 72 -31 -41 58 -163
$$ packed form
5098c1J11p6l7K56k49K5L4p3N4K3M5j53j13K99k71o2K10n1K1O5m0J00j0l43J85
5123h1Q5j2R6nj23O3o2n9J08n6K4o7K32N6k61lo6K06j02L1J03lj34J09p1L5O5
5150A08q9J8j48K63k30k3O2M3j13J88r8J40n9o3L1k41j0j1K76J06k18O0r3k1K55
5175A33k50J70n4J6Q4j20o3J68r3j52J18J01k88J15K82k34L26l62J58K27l11J23
5197I4k93l5KL03l20K28l5J23R1k07J55J7l62M25k53N3K4j71J92l4J96m10J82
5220c5O2L0J12p6j96Q0M6j32J22j33j26J68O9k2j37K19m8pJ2j1J46j79Q2J69k15
5245@p0Q6J43j28o9N5J45l71J29k6o9K04k13J75J29k10j43O8L33j69K51k25j18
5268i3J64j86J06rn8N6J23p8m9m5j6PJ17J0m5N5l6j21R6j91L21n6j03j0R9k21
$$ plain form
5294 -163 -198 -133 -105 -57 84 -28 -107 -26 -67 -14 65 189 82 67 201 79 -136 222 138 -94 -86 -94 207 135 -44
5319 -44 -150 12 118 145 29 149 122 -152 -97 24 87 7 -90 98 -10 -33 57 56 -52 21 25 -42 -35 67 155 93
5345 93 94 -93 -59 21 -199 15 161 66 23 92 42 123 222 74 12 103 -36 -42 5 154 258 72 -95 -118 -37 -16
5371 -16 91 225 -92 74 39 17 -177 121 183 77 21 -1 -2 -189 -294 -170 -62 7 30 -107 -63 1 -15 -81 -166
5396 -166 -179 330 56 0 -73 35 -163 110 171 -70 -58 170 -32 61 13 -12 28 -49 -19 224 240 30 85 38 126
5421 126 66 8 -12 18 112 -40 141 46 7 -56 -306 189 -41 -94 -102 -11 110 28 148 -37 -16 41 -188 -134 -21
5446 -21 -85 -45 133 39 78 129 210 184 59 96 -139 30 109 -2 -42 21 19 -5 -131 -52 -34 67 -82 -96 249 -21
5472 -21 60 61 -190 31 -122 204 -59 -81 172 74 104 -83 79 60 -6 -62 -86 -124 12 -62 -52 -16 -79 129 51 -203
$$ packed form
5294a63l5O5K8M8J41j12p9Q1m1N3P9J24j07j5J34j22k15L58q4k32QqL01p2j79
5319d4j06J62J06K7j16J20k7k74N5J21O3q0r7J88j08k3R0jj08P3Mo7PJ02Q8o2
5345I3Jj87L4Q0k20K14J46r5m3O9n0Q1R9j48o2R1j39oM7J49J04j86j67k3Q1K1
5371a6J07J34l17J66l5k2j94K98O2j06n6k2jj87j05J24J08O9K3j37M4O4j6o6q5
5396a66j3N09k74n6p3J08j98K73O1k41J2K28k02R3m8k5M0p7L0K43J6k10N5m7Q8
5421A26o0n8k0L0R4j52J81r5l9o3k50M95k30n3qR1J21q2J20j85K1N7k29N4J13
5446b1o4M0J78r4L9N1Q1k6j25L7k35J69P9j11m0O3kk4j26P9J8J01j49j4L45k70
5472b1Q1Jk51K21j53L26k63k2K53r8L0j87J62j9o6n6k4l8J36p4J0L6o3K08p8k54
$$ plain form
5498 -203 -93 -123 103 80 -13 56 -86 -148 -170 121 -1 288 -21 -157 -70 -76 114 -9 -117 -162 128 -81 -26 -18
5522 -18 -52 -79 -47 -31 2 70 -134 26 87 0 -354 34 -103 -117 -80 43 -63 142 -30 -63 131 15 112 -4
5546 -4 57 -179 -226 -127 -125 25 88 -130 -14 -89 -121 -106 -43 -24 46 126 -62 47 26 -38 41 120 -13 215 35 97 -23
5573 -23 87 7 -78 152 55 -81 175 112 16 -221 54 139 -5 145 -76 7 1 -7 96 27 -16 71 -37 22 -157
5598 -157 49 -232 7 42 -66 290 92 -43 -26 -181 103 15 -34 -70 -103 137 -20 40 -75 -10 189 111 -101
5621 -101 37 -88 -136 42 70 44 119 113 12 -72 147 67 68 -89 -98 114 -146 -127 253 -158 -43 -77 -85 -141 -249 39
5647 39 -3 -134 19 -34 -85 -181 -217 -33 17 -92 0 -43 -64 -100 53 -119 -53 58 92 104 -11 51 243 109 220
5672 220 246 80 109 15 15 11 -69 -44 -61 -223 50 50 55 103 -30 95 -108 -57 79 -147 -12 84 -45 133 -74 42
$$ packed form
5498b03J10l0K26k3r3O9j42o2k2K91j22K89l09j36Q7oJ90j23j08m5K90k09N5Q
5522a8l4k7L2J6L3O8k04J60O1q7l54L88j37j4L7J23j06K05j72l3J94j16R7j16
5546dO1k36m7R9KJ50O3k18J16p5l2J5O3J9P0Q0j88J09k1o4P9P9j33K28j80O2j20
5573b3J10q0q5K30r7j36K56o3r6k37K75Q5j44J50k21Q3oqJ03o9m3Q7j08N9j79
5598a57K06k81K39L5j08L56j98j35J7j55K84q8m9l6l3K40j57O0j15O5J99p8k12
5621a01J38j25m8J78K8k6P5oj01q4K19q0Jj57rK12k60J9L80m11J15l4qn6j08K88
5647C9m2j31J53n3n1r6l6J84N0j09R2m3k1l6J53j72O6J11L4J2j15O2J92j34J11
5672B20K6j66K9r4%mq0K5j7j62K73%NM8j33J25k03N1J36k26J35R6j29J78k07J16
$$ plain form
5698 42 81 -39 -29 16 24 -23 121 126 65 -57 -170 -163 173 -80 63 157 237 87 45 69 1 -116 -147 -7 -200 -76
5724 -76 120 -162 -108 38 -52 55 56 -99 -14 7 -47 -195 -16 67 53 42 -178 -72 42 181 108 91 39 -61 -22
5749 -22 2 0 -256 22 -158 138 45 41 77 -92 -169 -15 40 -251 103 114 -149 87 10 23 -22 145 32 124 -54
5774 -54 98 51 48 -77 -88 68 114 99 -71 116 56 72 -44 33 -96 -6 -93 -73 -31 -35 16 -63 54 1 -124 -111 130
5801 130 -275 -99 7 -91 -16 37 -5 -247 -131 -95 -121 129 9 -129 22 224 81 -146 -23 81 -115 180
5823 180 193 -128 -9 171 0 -5 -25 -15 197 -24 -122 -23 -107 60 83 -73 20 -83 -144 65 -194 62 -41 163
5847 163 -205 90 101 90 28 37 80 -149 83 -140 98 -72 73 -27 90 48 -35 88 129 32 57 -40 114 -149
5871 -149 23 -105 -133 -139 -17 -54 115 -36 -25 111 31 -77 -71 44 -35 167 0 -113 -16 -104 -139 27 43 -61
$$ packed form
5698D2L9j20J0M5Qm7J44No1j22j13PL36k53J43R4Q0j50m2K4o8j17l1J40j93J24
5724g6J96k82N4J46r0J07Jj55Q5K1n4j48J79Q3j4j1k20J06J14J39p3j7n2j00L9
5749b2K4kk56K78j80K96r3mL6j69p7J54N5k91L54J1k63K36p7J3m5J67j13R2j78
5774e4J52m7lj25j1J56M6j5j70J87o0J6j16P7j29R0q7K0M2mN1p9J17n3j25J3K41
5801A30m05J76J06r8P5N3m2k42J16L6k6K50j20j38J51K02j43k27J23J04j96K95
5823A80J3l21J19J80j71nk0J0K12k21r8R9q4J67K3j56R3j03o1K09k59K56j03K04
5847A63l68K95J1j1o2RM3k29K32k23K38j70J45j00J17m2q3J23M1r7K5r7J54k63
5871a49J72j28k8oJ22l7J69j51J1J36q0j08OJ15p9K02j67j13R7q8l5J66J6j04
$$ plain form
5895 -61 -56 -51 54 130 49 89 76 30 -6 343 -82 118 -73 38 -13 -91 -33 15 109 -97 -120 -254 -118 -41 193 -252
5921 -252 -158 -300 102 -41 168 16 33 -95 9 -152 56 48 73 129 128 182 94 19 -2 130 232 -53 22 18 -2
5946 -2 148 -60 128 37 -9 176 178 169 -1 -38 153 -67 -91 8 5 -65 -90 45 -86 -85 51 -11 176 20 58 -151
5972 -151 37 -164 -3 14 -199 -8 201 31 62 246 -149 -39 -48 -65 -17 -88 -64 143 152 -66 -165 -111 -50 -125 85
5997 85 0 -107 79 -30 -79 126 86 175 -86 -137 13 -8 -41 -15 -158 -137 -123 8 -159 76 160 29 -54 -156
6021 -156 35 16 60 -114 16 -56 101 -103 -38 175 9 149 -111 -78 -145 -27 -193 12 36 -18 -51 20 28 32 115
6046 115 -52 236 28 94 130 102 -57 -196 99 -98 35 -175 -69 -64 -106 -6 -45 -1 148 46 -98 -112 -1
6069 -1 -41 83 -1 55 -47 -32 -59 64 -118 -8 -92 -154 -32 138 66 -114 53 -103 42 68 -104 123 -50 -17
$$ packed form
5895f1NNJ05P6q1M0j3m6l6L49m25K00j91J11n1p8N8M8R4k06k3j34J36P7K34m45
5921b52R4j42M02j43K09j52J7j28J04j61K08qK5N6jN4q8p5k1J32J02k85P5mk0
5946bJ50k08J88r1m6J85Krj70l7J91k20k4R9lp0k5J35j31JJ36o2J87j56L8k09
5972a51J88k01J61J7k13J91K09j70L1J84l95J10rj7M8p1K4K07Rk18r9N4O1p5K10
5997H5q5j07J86j09m9K05m0Q9k61n1J50k1l3K6j43K1J4J31j67K35Q4j31q3j02
6021a56J91j9M4j74J30p2J57k04O5K13j66J40k60L3o7J18j66K05K4n4l3P1QMQ3
6046A15j67K88k08O6L6k8j59j39K95j97J33k10J06Nm2J00l9M4J49j02j44j4J11
6069am0J24q4N6j02J5k7J23j82J10q4o2J22J70p2j80J67j56J45K6j72K27j73L3
$$ plain form
6093 -17 23 -259 -127 93 64 75 100 -159 -33 82 -85 -34 -62 -75 -56 36 73 21 -112 -13 -181 -135 25 -164 -4
6118 -4 104 226 140 -272 -45 -5 59 224 212 -92 -79 -173 60 -130 -26 -74 -30 -43 21 -183 44 -17 -83 76 11
6143 11 95 -56 -132 58 108 -82 117 177 -73 119 -138 98 -149 -127 -87 -193 59 -66 164 105 16 -18 47 -122
6167 -122 -53 4 -12 -185 -20 170 114 96 -151 76 119 72 -42 -31 82 140 83 -45 60 1 29 170 -42 -180
6191 -180 202 -30 11 57 -56 149 -68 120 -164 2 37 47 42 88 69 -61 -331 -228 73 70 -98 8 129
6214 129 82 -108 -18 123 138 -70 27 30 -106 133 88 -31 9 126 195 -77 127 -109 114 -54 -83 61 88 -54
6238 -54 47 58 -58 -80 132 92 97 -56 -170 -223 -85 210 -90 -83 -127 -65 188 -114 127 -49 73 -22 159 74
6262 74 95 31 -88 208 41 1 96 -46 82 -103 -120 115 28 -62 219 73 136 -169 20 -117 26 105 44 134
$$ packed form
6093a7M0k82J32K20k9J1K5k59J26J15j67N1k8j3J9R2L7n2j33R9j68M6J60j89J60
6118dJ08J22q6m12K27M0O4J65j2l04J3r4K33j90J04m8M4j3O4k04K27o1o6J59o5
6143A1Q4j51p6J90N0j90J99O0k50J92k57K36k47K2M0j06K52j25K30n9q9l4O5j69
6167a22O9N7j6j73J65J90n6j8k47K27M3m7j14J1J13N8n7j28J05n9K8J41k12j38
6191a80L82k32M1M6j13K05k17J88k84J66L5J0nM6j9j30k70J03L01lj68J06J21
6214A29m7j90R0J41J5k08R7Lj36K39m5j19M0J17O9k72K04k36K23j68k9J44K7j42
6238e4J01J1j16k2K12m0Nj53j14n3J38K95l00Pm4O2K53l02K41j76J22r5J81q5
6262G4K1o4j19K96j67m0R5j42J28j85j7K35q7r0K81j46O3l05J89j37J43P9o1R0
$$ plain form
6286 134 -131 46 5 -96 -45 128 -180 2 -34 -112 -86 59 -124 26 -128 142 85 60 53 112 184 -97 67 -29
6310 -29 -115 233 -39 -99 91 114 13 117 -176 -157 -112 17 5 40 55 23 118 9 37 -134 178 -26 -14 16 -33
6335 -33 27 -136 -139 -141 -69 -17 -27 -73 -123 -8 -145 -125 -20 34 -227 47 -2 -34 150 -71 42 -95 -8 2 -119 62
6361 62 -59 57 91 -119 -48 187 87 -90 -158 149 -11 -59 376 -61 -80 -188 -7 39 -172 -23 -125 -177 -3
6384 -3 109 3 127 -23 153 -108 -1 -9 -73 40 95 216 4 49 187 164 77 44 167 -37 -144 -112 -89 -2
6408 -2 -74 -5 -19 -142 -197 147 -70 -235 -115 102 90 52 66 -11 -27 -53 -114 -87 -102 -72 -128 -40 -186 -89 115 -185
6434 -185 87 47 155 15 -164 49 44 40 19 85 -101 -120 24 -93 14 0 109 -77 77 -4 1 -123 45 171
6458 171 -114 21 158 -88 38 -161 118 33 -47 15 -108 142 123 12 -12 -169 -21 -23 -170 185 -101 11
$$ packed form
6286A34k65J77m1j01N1J73l08J82l6p8K6J45j83J50j54K70n7k5pN9P2k81J64r6
6310b9q6L48k72o0J90K3j01J04k93J9M5J29j2L5J5l2R5j09K8j71L12k04J2L0m9
6335c3O0j63lkP2N2j0m6n0J15j37K0J05N4k61K74m9l2J84k21J13j37Q7J0j21J81
6361F2j21J16L4k10P1K35j00j77o8L07j60m8M35m37j9j08J81M6k11J49j02n2J74
6384cJ12j06J24j50J76k61J07qo4J13N5J21k12M5J38k3q7l3J23k04j07L2K3Q7
6408bp2O9j4j23n5L44k17j65J20K17j2l8J4p7j6k6o1K7j5L0n6Q8j46R7K04l00
6434a85K72m0J08j40j79K13nmk1O6j86j9J44j17J07j4J09j86J54q1Nj24J68J26
6458A71k85J35J37k46J26j99K79q5q0O2j23K50j9j11k4j57J48kj47L55k86J12
$$ plain form
6480 11 134 71 35 13 -28 -2 37 40 -54 67 100 -47 -75 102 100 -111 119 -11 -39 2 200 -183 -4 -22 -8 126
6506 126 -59 -90 212 -7 3 -34 -262 -104 326 170 -265 42 -76 97 -62 -126 44 61 68 -182 -27 11 -26
6529 -26 82 -97 39 137 120 -112 -91 124 -88 -34 0 -89 -25 -35 27 -203 73 65 -81 -50 73 -125 -18 233
6553 233 -64 -122 52 -6 139 -83 -29 -70 163 -4 -167 50 81 4 -147 -10 -55 115 -147 -2 -158 -172 -31
6576 -31 24 -91 4 -131 17 -12 -192 -103 110 -18 50 -33 108 -114 -13 123 60 83 -49 -12 -197 111 57 -49
6600 -49 0 95 -99 -77 55 -88 -33 -135 49 46 -17 -34 162 -266 136 -12 66 -43 -139 -203 -82 81 54 2 119
6625 119 -17 9 -97 -196 -101 -113 -59 -107 165 -16 -150 -81 -33 16 3 46 -197 -196 201 -90 144 138 -50 -98 25
6650 25 45 36 100 29 78 92 -34 -135 7 48 -140 114 76 -202 -135 -203 -248 74 120 -113 11 -93 -89 -121 -70 149
$$ packed form
6480A1J23o3l6k2m1K6L9Lr4J21L3j47k8J77kk11K30j30k8M1J98l83J79j8J4J34
6506A26j85l1L02k19J0l7k28J58M30j56m35L07j18J73j59o4J70J7Pk50J55L8l7
6529b6J08j79J36R8j7k32K1K15k12N4L4q9O4j0O2k30K76qj46L1J23j98J07K51
6553B33k97n8J74n8J45k22N4m1K33j67j63K17L1p7j51J37m5J70k62J45j56j4J41
6576c1N5j15R5j35J48k9j80Q9K13j28O8q3J41k22J01J36o3K3j32L7j85L08n4j06
6600d9M9R5j94K2J32j43N5j02J84lo3j7J96m28M02j48P8j09r6o4J21J63k7n2J17
6625A19j36K6j06r9R5j2N4m8K72j81j34O9M8M9j3M3k43JL97k91K34oj88m8J23
6650B5K0rO4p1M9J4j26j01J42M1j88K54l8k78O7o8m5L22M6k33J24j04Ml2N1K19
$$ plain form
6676 149 -102 86 99 -224 32 -56 -14 146 30 74 -106 101 -236 6 190 97 -1 -189 -65 50 36 -132
6698 -132 130 76 126 152 -29 59 94 23 -150 -49 -203 74 -106 -224 106 28 61 35 50 -159 -39 -132 77 -88
6722 -88 88 -168 -43 3 84 -90 106 -60 -85 -78 51 -95 147 -19 -210 -218 -104 -73 -6 17 -143 -48 -35 198
6746 198 -174 38 29 -67 -53 -59 29 99 -67 -38 -28 -64 4 12 88 -147 2 53 91 -31 -86 -13 41 68 -51 -53 66 62
6774 62 -39 -3 -64 -75 27 -54 49 68 116 60 158 40 -178 81 -148 65 247 -115 -170 94 -146 -212 -167 92
6798 92 26 -43 74 25 -37 -82 -216 138 -119 -76 28 -39 -210 -46 114 -29 24 268 23 48 -114 186 -61
6821 -61 -30 40 53 -102 -62 184 -15 -9 -57 2 128 -13 21 24 -127 52 22 -27 -69 52 -68 77 -129 -104 -166 99
6847 99 52 35 108 -82 86 151 -46 -75 -266 12 72 -29 338 -206 23 86 270 32 -22 -33 -170 2 50 -62
$$ packed form
6676A49k51J88J3l23K56q8M2J60j16M4j80K07l37K42J84r3r8j88J24J15j4j68
6698a32K62n4N0K6j81Q8L5p1j73J01j54K77j80j18L30p8L3k6J5k09J20r3K09j65
6722h8J76k56J25M6Q1j74J96j66k5PJ29j46K42j66j91qJ14L1O7K3j60R5J3K33
6746A98l72K12rr6J4oQ8P0j66K9J0l6O8QP6k35J49N1L8j22n5P3N4K7j19kJ19m
6774F2j01L6o1j1J02q1J03J9M8n6R8j18k18K59k29K13J82l62n5K64k40o6M5K59
6798I2o6o9J17m9o2m5j34L54k57M3J04o7j71J64J60j43N3K44k45K5j62L00k47
6821f1L1P0J3j55M0K46j99Om8N9J26j41L4Lj51J79l0m9m2J21j20J45k06K5o2K65
6847I9m7j7P3j90J68O5j97k9j91K78O0j01L67n44K29O3J84k38n4j1j37J72M8j12
$$ plain form
6871 -62 -31 68 -72 -104 -70 49 -34 15 54 -36 136 -67 -44 -82 81 -12 91 -90 78 -3 162 -14 -21 -107 -12 12
6897 12 86 -57 -114 21 -170 94 -21 65 -87 -150 -13 -89 -30 116 118 61 251 -204 109 -99 -36 31 80 -212
6921 -212 -49 35 -99 -9 -30 16 -136 -102 97 138 135 50 -73 -77 -96 -133 11 -45 124 213 -111 19 -107 130 31
6946 31 -239 -38 119 74 74 -62 80 -5 -45 -18 -159 197 64 -32 -17 251 275 -90 -110 -255 -49 6 59 -69
6970 -69 -100 92 95 142 17 -249 -120 147 33 -2 -34 52 -62 23 119 -66 204 269 -112 -124 -10 107 53 168
6994 168 -143 42 -122 127 20 24 -113 33 182 -129 178 65 -13 -161 -13 -155 97 -170 55 47 28 6
7016 6 -105 -127 60 16 -30 17 -112 81 179 66 106 -24 -58 -113 56 36 9 -106 -25 4 -30 235 25 -34 171
7041 171 100 111 155 71 43 13 77 -1 -101 -3 -41 69 -99 78 -34 220 -140 88 238 66 -53 -85 83 -20
$$ packed form
6871f2L1R9j40l2L4J19q3M9L9r0J72k03K3l8J63r3J03j81J68q1J65j76pq6R5K4
6897A2P4j43n7J35j91K64j15Q6j52o3J37p6N9J46Kn7J90m55L13k08O3O7M9k92
6921b12J63Q4j34R0k1M6j52L4J99M1lq5j23mj9l7J44n6J69Q9l24J30j26K37r9
6946C1k70K01J57m5%j36J42q5m0K7j41L56j33r6J5K68K4l65k0j45K06N5N3j28
6970f9l1J92LM7j25k66J29K67j14l5l2Q6j14Q5R6j85K70O5l81j2J14J17n4J15
6994A68l11J85j64K49j07Mj37J46J49l11L07j13p8j48J48j42K52k67K25qj9k2
7016Fj11k2J87m4m6M7j29J93R8j13M0j30l4n5J69k0k7j15Q1K9l4K65k10n9K05
7041A71p1J1M4q4k8l0O4p8j00R8l8J10j68J77j12K54l60K28J50j72j19l2J68j03
$$ plain form
7065 -20 73 96 -14 -71 154 7 -32 -170 114 -108 14 -115 -141 -73 -150 55 -82 19 -195 1 -30 -144 15
7088 15 -19 14 142 -120 -35 91 188 -45 123 -55 16 -27 -77 -48 8 -15 139 44 -21 1 -74 -214 -225 -15 17 -57
7114 -57 58 24 82 104 -52 20 63 59 -66 63 103 154 -175 -141 -128 43 2 -34 142 11 19 20 23 -166 -34 70 -46
7141 -46 90 -34 -75 79 195 -58 90 -175 -164 58 4 98 48 174 229 13 88 111 1 -122 -59 -30 87 -176
7165 -176 -122 121 -126 -133 -3 143 -247 122 -61 96 -146 232 2 -3 -49 -76 72 3 -27 -79 36 -80 6 -11
7189 -11 195 31 -136 -36 47 -62 -87 -135 -161 26 82 -63 131 50 80 -6 -4 173 -142 76 -112 -40 30 -13 2
7214 2 62 3 68 -62 -142 -42 -88 -21 -176 83 86 -128 45 -123 10 78 -108 -70 -162 58 37 44 -74 -209 -114 -215
7240 -215 178 56 87 21 -56 -44 -115 -7 -120 -183 -107 105 190 -177 -140 -16 24 -32 88 19 -33 -24 34 76 80 104 113
$$ packed form
7065b0R3K3j10n7K25j47l9j38K84k22J22j29k6O8p7K05j37J01k14J96l1j14J59
7088A5l4L3J28k62Q5J26R7k33J68j78P1m3n0K9N6k3J54r5o5K2p5j40j1K10L2p4
7114e7J15l4N8K2j56P2M3mj25J29M0N1l29L4J3J71m1l6J76j31QJLj89J32J04j16
7141d6J36j24m1J54J16k53J48k65J1K22n4R4n0J26N5k16P5K3j10j23O3K9J17k63
7165a76N4K43k47pJ30J46l90L69j83J57k42L78k30nm6k7J48o9l0n2J15j16Q6j7
7189a1K06j64j67J00Q3j09k5m8k6J87N6j45J94q1L0q6KJ77l15K18j88P2P0m3J5
7214BO0n9O5j30q0J00m6O7j55K59Lk14J73j68J33O8j86L8r2K20k1Pj18j35R5j01
7240b15L93j22L1o6p7J2p1J08j13o3P6K12Q5l67L7J24M0n6J20o9n2RN8M2MK4R
$$ plain form
7267 113 -27 241 -85 36 33 147 236 -42 -66 124 155 -63 43 154 50 113 -213 41 -91 -73 173 33
7289 33 -59 6 -227 7 31 -122 15 -118 -10 45 -62 -76 115 -85 -37 -14 -106 -21 -82 94 58 -19 155 -124
7313 -124 -97 -58 -44 95 -197 206 -102 -26 -88 164 -120 6 -148 35 4 -47 -95 -77 -100 67 30 75 198 -108
7337 -108 191 -96 -40 -144 -16 92 65 81 -9 -118 151 -112 -43 49 -60 -36 -22 -147 99 22 -51 306 22
7360 22 129 -102 -11 -8 82 14 -206 -132 -139 -226 -44 -36 -163 -172 -48 -105 60 -6 -27 -154 44 29 -19 92 142 -150 74
7387 74 61 2 -100 -171 -56 -121 103 -5 -9 -162 -183 125 61 -47 -108 31 42 -106 -57 -210 62 -112 37 -6
7411 -6 -48 -5 84 -130 92 45 -62 -9 7 35 -156 -181 160 59 -160 -14 -195 146 -3 154 110 80 12 194
7435 194 -188 113 39 13 -122 -23 46 -76 3 -5 -67 -33 134 143 -215 27 75 -89 111 82 101 -107 97 75 140
$$ packed form
7267A13j40K68l26J21lJ14Q9k78k4J90L1k18J06J11j04O3l26K54j32J8K46j40
7289C3r2O5k33K34K4j53J37j33J08N5j07j4J91k00M8K3r2Q5o1J76l6p7J74k79
7313a24K7L9J4J39k92M03l08P6o2K52k84J26j54J83l1n1m8J8k3J67l7M5J23l06
7337a08K99k87N6j04J28J08k7J6r0j09K69k63O9R2j09K4J4j25K46p7p3L57k84
7360B2J07k31R1LR0o8k20P4pq7J82Qj27rJ24n7J65o6k1j27J98j5m8J11N0k92K24
7387G4j3n9j02p1J15o5K24j08mj53k1L08o4j08o1J39J1j48M9j53K72j74J49m3
7411fm2M3Q9k14K22m7j07N3J6K8j91k5L41j01k19J46j81L41j49J57m4l0o8J82
7435A94l82L01p4k6j35R9O9j22P9qo2L4J67Rl58K42M8j64K00k9J9k08K04k2O5
$$ plain form
7460 140 -11 54 -194 -19 -157 63 13 -62 34 -253 -10 27 113 43 124 123 68 60 -77 -16 126 -8 117 -105 66
7485 66 197 22 134 -32 40 -33 -34 -108 -146 -186 -23 9 29 26 -62 -21 99 -62 -173 40 38 -38 94 79 -87 32
7511 32 54 49 -100 46 -367 -27 -86 80 138 159 162 22 90 159 -75 45 -40 -105 123 -9 -41 54 40 -140 47
7536 47 -16 -284 -14 -79 80 54 75 -5 -129 98 -130 -15 -29 20 -107 48 49 168 -35 86 -57 -73 49 113
7560 113 -195 38 -190 168 182 -30 -11 -21 -14 0 47 -33 -111 -33 6 101 9 -93 -40 93 77 -258 35 -115 61
7585 61 -117 -127 -75 -57 -79 -73 65 -14 -141 -53 -139 212 6 213 -43 -59 -149 -59 164 -55 44 54 107 52 136 225
7611 225 2 -58 -14 -190 -54 113 63 95 -4 40 106 -134 -107 -67 -118 16 68 109 -19 -77 -178 -116 -102 82 -210
7636 -210 124 -160 -144 6 288 33 -50 121 -43 48 135 16 9 183 247 105 41 45 23 -22 73 -152 -60 -116 -2
$$ packed form
7460A40j51O5k48J75j38K20n0p5R6k87K43L7Q6p0Q1jn5qj37O1J42j34J25k22J71
7485F6J31j75J12j66P2p3jp4l8m0J63L2K0lq8M1J20j61j11K13kp6J32j5j66J19
7511C2K2nj49J46m13L40n9J66N8K1Lj40O8O9k34J20q5o5K28j32l2R5j4j80J87
7536D7o3k68K70o5J59k6K1q0j24K27k28J15j4M9j27J55JJ19k03J21j43j6J22O4
7560A13l08K33k28L58J4k12J9j0PJ4M7q0p8P8L9R5r2j02N3J33j6l35K93j50J76
7585F1j78j0N2J8k2OJ38p9j27Q8q6L51k06K07k56j6r0R0K23k19R9J0N3n5Q4Q9
7611B25k23o0M4j76J36J67n0L2r9M4O6k40K7M0n1J34N2M1j28n8j01O2J4J84k92
7636b10L34k84J6J50K82k55q3J71j64R1Q7j19pJ74O4j42o4Mk2m5R5k25R2n6J14
$$ plain form
7661 -2 -189 -249 95 -19 44 -211 -25 22 39 -115 -91 -124 58 -238 -193 103 -194 -3 49 18 -94 11 81 89 122
7686 122 222 -46 -1 -21 133 7 106 46 -100 234 -14 72 181 -107 2 -248 -3 74 74 66 64 -26 26 -42 9
7711 9 -91 54 119 88 -102 59 -155 27 -184 -133 20 72 -179 -20 -11 196 52 75 130 -39 -84 -47 82 -49
7735 -49 46 -114 61 29 -60 -108 -21 90 58 103 -31 -20 131 -14 -17 -5 38 90 181 9 155 102 143 63 21 -28 -88
7762 -88 -90 38 149 -134 61 -40 -56 -107 81 185 144 24 101 158 -34 108 31 84 -155 131 6 32 162 36
7786 36 60 5 -57 21 -29 -143 -117 -10 7 91 -81 80 -87 -70 -167 -47 11 -98 -123 45 25 174 -42 136 -27
7811 -27 168 -24 -108 38 73 102 32 171 -62 -126 15 -81 -48 110 -124 44 -144 126 -98 191 227 -109 56
7834 56 -150 45 -33 -28 61 75 -170 84 23 56 -211 57 -114 -32 111 166 -26 -18 -70 125 52 77 -178 12 -1
$$ packed form
7661bj87o0L44j14O3k55J86M7J7j54K4l3J82k96M5K96k97J91N2l1j12J05P0QL3
7686A22J00k68M5k0J54j26R9o0j46L34k48Q6J09k88J09k50K45P7%qkr0N2o8N1
7711Ij00J45O5l1j90J61k14J82k11N1J53N2k51J59RK07j44K3N5j69m5L7J29j31
7735d9R5j60J75l2q9m8Q7J11l2M5j34J1J51j45lJ2M3N2R1j72J46n3M1q0m2m9o0
7762h8kJ28J11k83J95j01j6n1J88J04m1j20P7N7j92J42p7N3k39K86j25K6J30j26
7786C6K4n5o2P8n0j14K6J07J7Q4j72J61j67J7r7J20N8j09k5J68k0J49k16J78j63
7811b7J95j92q4J46L5K9p0J39k33o4J41r6L3J58k34J68j88K70k24K89L6l36J65
7834E6k06J95p8NQ9J4k45K54o1L3k67K68j71Q2J43N5j92Qn2J95p3K5k55J90j3
$$ plain form
7859 -1 72 80 35 62 101 -119 -75 3 -81 34 -203 -28 104 -46 5 14 38 -6 -72 -1 151 -82 193 92 -184 65
7885 65 -73 36 -10 -95 -115 30 -82 -9 9 -113 8 24 59 3 45 19 -80 -61 41 19 2 -14 -73 -111 173 256
7911 256 -58 35 162 -49 -160 28 30 -51 -65 -65 -170 -83 105 133 -51 96 15 17 52 -64 -11 -196 -41 186 98
7936 98 -125 -140 20 -1 -106 191 140 148 -139 -87 123 87 -31 80 -263 -36 17 -121 -197 98 221 162 249 -120
7960 -120 27 -85 -154 -105 120 -125 58 72 -191 83 -127 -67 93 106 148 83 32 -70 87 86 17 43 168 28
7984 28 -41 -34 -117 -45 -48 -33 139 0 126 -71 -45 -9 36 68 -120 -104 -171 -138 64 90 68 -132 -58 137 117 52 105
8011 105 145 -150 -165 314 131 -73 130 33 96 50 -120 -113 60 64 -32 -28 29 -2 -112 197 -171 -16 372 37 -46
8036 -46 -36 96 206 81 101 -240 -99 51 -143 -111 -40 -18 -149 -81 -130 82 121 2 13 55 -260 -100 -90 71
$$ packed form
7859aP3Qm5K7L9k20M4P8q4J15k37J75J32j50N1RK4m4o6P1J52k33K75j01k76K49
7885F5j38J09m6q5k0J45j12P3J8j22J21J6L5n6M2k6r9J9J02k2j7j6n9l8K84Q3
7911B56l14R3J27k11j11J88Kq1j4%j05Q7J88K8j84J47q1KL5j16N3j85J55K27q8
7936I8k23j5J60k1j05K97n1Qk87N2K10l6j18J11l43K27N3j38p6K95J23n9Q7l69
7960a20J47j12o9M9K25k45J83J4k63K74k10O0J60J3M2o5n1j02J57jo9K6J25j40
7984B8o9Pq3P2lJ5J72j39J26j97K6L6M5L2j88J6o7L3K02K6k2k00P4J95k0o5N3
8011A05M0k95j5M79j83k04K03r7O3m6j70PJ73Mr6MN7l1j10L09l68J55L88l35q3
8036d6J0J32J10j25K0l41J41J50j94L2P1K2j31O8m9K12L9j19J1M2l15J60J0J61
$$ plain form
8060 71 206 -153 95 69 22 -185 169 -84 2 -195 -24 -54 -70 4 123 55 -48 6 183 -27 -25 33 3 95 -91
8085 -91 37 -8 149 95 61 150 -46 84 158 -72 -60 92 32 -58 -72 133 211 4 -49 -140 -64 62 -35 62 164
8110 164 -5 -69 -42 -115 -46 14 -41 19 27 -139 22 -40 -71 104 47 -88 -136 -74 -15 98 -61 -66 39 36 41 -95 24
8137 24 46 -88 15 -72 52 -6 150 -55 95 62 89 -75 18 -14 -169 132 -54 -143 -24 14 149 -149 159
8160 159 31 -28 19 153 32 76 -221 99 -44 -181 48 40 -9 131 130 4 297 -23 91 82 -8 61 50 -177
8184 -177 10 154 -35 -46 110 100 -88
$$ packed form
8060G1J35l59K48k6m7k07L54k53Q6j97J71l0j6P4J19o8j03N4J77k10KN8l0R2j86
8085i1J28m5J57n4l4Q9j96J30P4k30J2J52o0r0j4K05P8k07n3r1P6J26r7R7J02
8110A64j69o4K7p3O9O0n5O0Qj66J61o2l1J75n7j35m8O2N9J13j59nJ05lNj36J19
8137B4K2j34J03q7J24n8J56k05J50l3K7j64R3l2j55L01j86q9J19L8J35k98L08
8160A59j28n9M7J34j21M4k97L20j43j37K29qm9J40jj26K93l20J14rr0O9j1k27
8184a77J87J44j89j1J56j0j88
8191h8
$$ Imaginary data points
##PAGE= N=2
##DATA TABLE= (X++(I..I)), XYDATA
$$ plain form
0 0 0 0 0 0 0 0 7 -7 7 -7 14 -14 21 -28 35 -42 50 -63 77 -93 112 -133 160 -189 223 -258 298 -344 398 -455
30 -455 521 -593 677 -766 862 -971 1092 -1223 1365 -1524 1696 -1884 2090 -2315 2559 -2827
46 -2827 3121 -3440 3790 -4176 4600 -5067 5587 -6167 6811 -7541 8372 -9326 10436 -11744
60 -11744 13313 -15242 17671 -20839 25157 -31430 41392 -59648 103852 -428677 -163652
71 -163652 814014 -269829 -636570 368906 596908 -393516 -323028 435974 281580 -376769
81 -376769 -118035 394887 142792 -385051 -132087 311914 11060 -432995 -1538 411411
91 411411 -68386 -385376 172464 325448 -256220 -280040 283151 215883 -222590 -78146
101 -78146 279872 105109 -228734 -126553 186306 108045 -240395 -148703 270623 106852
$$ packed form
0@%%%%%%Pj4J4j4K1k8L5m9O3p7R2j13J40j70K05k45K93l49M12m81N56o42P42q53
30d55R76j114J270j443J628j833K063k315K588k889L220l580L974m405M874n386
46b827N948o561P230p966Q776r667J0654j1754J2978j4352J5913j7698J9762k2180
60a1744K5057k8555L2913l8510M5996n6587P2822j01040J63500n32529K65025
71a63652R77666j083843l66741J005476K28002r90424P0488P59002j54394o58349
81c76769K58734N12922k52095n27843K52964M44001l00854m44055M31457M12949
91D11411m79797l16990N57840J52984n81668k3820N63191o7268m38473J44444
101g8146L58018j74763l33843J02181L12859p8261l48440R1692M19326j63771
$$ plain form
111 106852 -364224 -92689 364428 -37485 -376267 186928 403215 -221530 -262208 338159
121 338159 175366 -379398 -91364 356386 -1861 -327243 59319 278961 -129036 -301575
131 -301575 105748 252207 -143188 -220210 227370 251386 -234353 -187654 288673 125691
141 125691 -318213 -45836 326434 -25005 -303491 63688 214577 -150467 -201418 146756
151 146756 164752 -118200 -99501 153734 114916 -154075 -118743 167590 109421 -193038 -74553
162 -74553 236501 28183 -282147 -3241 257324 -76822 -242123 146708 233148 -163096
172 -163096 -178043 182585 123966 -200639 -90076 209438 77103 -192807 -42142 191682
182 191682 -3182 -219692 18325 209749 -59566 -190050 116890 172756 -160709 -147410
$$ packed form
111A06852m71076K71535M57117m01913l38782N63195K16287o24745m0678O00367
121C38159j62793n54764K88034M47750l58247l25382L86562K19642m07997j72539
131c01575M07323J46459l95395p7022M47580K4016m85739M6699M76327j62982
141A25691m43904K72377L72270l51439k78486L67179J50889l65044n0951L48174
151A46756J7996k82952J8699K53235l8818k68991L5332K86333n8169l02459J18485
162g4553L11054k08318l10330K78906K60565l34146j65301L88831Q6440l96244
172a63096j4947L60628n8619l24605J10563K99514j32335k69910J50665K33824
182A91682j94864k16510K38017J91424k69315j30484L06940N5866l33465J3299
$$ plain form
192 -147410 180033 102610 -181858 -36273 207807 20476 -190367 -1692 158076 -39576
202 -39576 -167483 41235 157432 -56689 -157680 68368 143274 -99821 -129349 142826
212 142826 135624 -134499 -75184 169726 39163 -190182 -22794 164282 -30036 -163115
222 -163115 55276 145173 -86649 -140611 97542 121594 -109768 -86546 153537 91437 -152736
233 -152736 -60505 161358 20046 -179617 5388 175817 -36423 -164730 60767 135970
243 135970 -98595 -126559 106599 102979 -107537 -66150 126680 52980 -129186 -35453 131105
254 131105 17833 -127032 13850 137800 -34057 -140877 44241 115950 -84001 -114494
264 -114494 100664 100038 -112394 -77365 126002 58173 -130996 -31245 145854 25288 -132745
$$ packed form
192a47410L27443p7423k84468J45585K44080j87331k10843J88675J59768j97652
202c9576j27907K08718J16197k14121j00991K26048P4906k43095k9528K72175
212A42826p202k70123N9315K44910j30563k29345J67388J87076j94318j33079
222a63115K18391Q9897k31822n3962K38153K4052k31362K3222K40083o2100k44173
233a52736R2231K21863j41312j99663J85005J70429k12240j28307K25497P5203
243A35970k34565k7964K33158l620k10516M1387J92830p3700j82166R3733J66558
254A31105j13272j44865J40882J23950j71857j06820J85118P1709j99951l0493
264a14494K15158o26k12432L5029K03367o7829j89169R9751J77099j20566j58033
$$ plain form
275 -132745 4918 132018 -34929 -142874 38937 118761 -70882 -108899 92912 93967 -108110
286 -108110 -70700 122857 49841 -122420 -12551 136784 -3100 -132155 20393 114827
296 114827 -53735 -117429 64828 106071 -76631 -88337 93342 75112 -104833 -58513 114474
307 114474 44023 -113746 -19324 116435 -3207 -119812 15433 107619 -35803 -96135 57280
318 57280 90408 -68408 -78111 77608 60296 -90383 -45923 101551 33673 -105194 -14723
329 -14723 108683 -5442 -111605 24541 110081 -41816 -102480 58254 88370 -78927 -80651
340 -80651 86563 63382 -92750 -40630 105222 29689 -101267 -7626 102470 -9124 -99393
351 -99393 24888 90057 -47096 -90502 52893 71054 -73520 -60440 86846 51610 -86610
$$ packed form
275a32745J37663J27100j66947j07945J81811P9824j89643l8017K01811J055k02077
286a08110L7410J93557p3016j72261J09869J49335j39884j29055J52548R4434
296A14827j68562o3694J82257M1243j82702j1706J81679j8230j79945M6320J72987
307A14474p0451j57769R4422J35759j19642j16605J35245R2186j43422o0332J53415
318E7280L3128j58816r703J55719j7312j50679M4460J47474o7878j38867R0471
329a4723J23406j14125j06163J36146Q5540j51897o0664J60734L0116j67297j724
340h0651J67214k3181j56132N2120J45852p5533j30956R3641J10096j11594r0269
351i9393J24281O5169j37153m3406J43395J8161j44574J3080J47286l5236j38220
$$ plain form
362 -86610 -25112 101104 16762 -96498 2875 95735 -19549 -95800 26481 81128 -47757
373 -47757 -82496 51485 69047 -62366 -56996 75306 51366 -76723 -31968 88485 21491
384 21491 -88647 -2528 90001 -15289 -88669 29490 78901 -48235 -73200 57099 57994
395 57994 -70572 -49024 75650 35767 -79660 -20804 86805 12633 -82835 6067 87768
406 87768 -14664 -80653 30972 75103 -46723 -71715 50251 51038 -67963 -44364 69215
417 69215 28829 -70750 -12089 75228 5222 -66558 13174 71838 -16236 -64095 27290 58844
429 58844 -43120 -62493 44275 48747 -59650 -42984 67956 32572 -72668 -17574 78070
440 78070 6666 -72958 12492 74573 -21337 -67384 29810 55545 -43287 -51238 49000 43230
$$ packed form
362h6610O1498J26216q4342j13260R9373R2860j15284p6251J22281N4647j28885
373d7757l4739J33981J7562j31413N370J32302k3940j28089M4755J20453o6994
384B1491j10138Q6119R2529j05290p3380J18159M9411j27136k4965J30299Q95
395E7994j28566K1548J24674l9883j15427N8856J07609p4172r5468Q8902Q1701
406H7768j02432o5989J11625M4131j21826k4992J21966P87j19001K3599J13579
417F9215m0386r9579N8661Q7317p0006p1780P9732N8664q8074m7859R1385L1554
429E8844j01964j9373J06768M472j08397J6666J10940l5384j05240N5094R5644
440G8070p1404p9624Q5450O2081r5910m6047R7194K5735r8832p951J00238n770
$$ plain form
452 43230 -53759 -32977 59504 20961 -67734 -12435 69792 -118 -68410 17140 67776 -30219
464 -30219 -62586 40490 52688 -48178 -38527 57047 30177 -59303 -23450 53635 8550 -56941
476 -56941 -2542 57765 -796 -52917 10881 52390 -19941 -50692 29678 48309 -36226 -39421
488 -39421 44200 27100 -55798 -22088 54499 10455 -51354 4721 55504 -8262 -51007 13364
500 13364 45664 -21563 -44606 27135 43007 -34411 -42490 37061 31837 -47957 -24190 58048
512 58048 20580 -53616 -2169 56936 -10765 -56818 18208 47958 -27821 -40199 33983 31361
524 31361 -41225 -30187 39459 21767 -41599 -11748 51330 11364 -51475 -2964 51422 -10081
536 -10081 -52182 22947 52467 -29125 -43223 36193 29038 -47360 -24025 45594 13854 -42813
$$ packed form
452D3230r6989K0782R2481l8543q8695N5299Q2227o9910o8292Q5550N0636r7995
464c0219l2367J03076J2198j00866R651R5574k6870q9480L5853P7085m5085o5491
476e6941N4399O0307n8561n2121O3798M1509p2331l0751Q0370J8631q4535l195
488c9421Q3621j7100q2898L3710P6587m4044o1809N6075N0783o3766m2745O4371
500A3364L2300o7227k3043P1741J5872p7418q079P9551n224p9794K3767Q2238
512E8048l7468p4196N1447N9105o7701m6053P5026K9750p5779j2378P4182k622
524C1361p2586J1038O9646j7692o3366K9851O3078l9966o2839M8511N4386o1503
536a0081m2101P5129K9520q1592j4098P9416p155p6398K3335O9619l1740n6667
$$ plain form
548 -42813 -3440 41215 -4086 -41449 6403 39812 -6910 -31869 20195 37445 -23454 -36667
560 -36667 25470 26002 -37869 -22192 42093 13380 -45296 -7301 39948 -4689 -38544 13485
572 13485 40775 -8490 -28701 16258 27381 -20894 -30349 19777 27025 -24705 -24233 30336 18166
585 18166 -40521 -16321 41108 5998 -40420 9763 46003 -14276 -39766 20117 30083 -28495
597 -28495 -24633 33321 23357 -30627 -17232 30092 8635 -37886 -8579 39215 5051 -37522
609 -37522 4864 38150 -15783 -40196 20751 34514 -24749 -21337 36556 17953 -37350 -12553
621 -12553 31283 187 -31978 4483 31907 -5074 -29443 5595 24186 -12801 -26400 18506
633 18506 30537 -17068 -23235 24117 16648 -33817 -15789 33212 8626 -30258 2498 31748
$$ packed form
548d2813L9373M4655m5301l7363M7852L3409m6722k4959N2064J7250o0899j3213
560c6667O2137N32o3871J5677O4285k8713n8676L7995M7249m4637l3855N2029
572A3485K7290m9265k0211M4959J1123m8275r455N0126P248n1730M72N4569j2170
585A8166n8687K4200N7429l5110m6418N0183L6240o0279k5490N9883R966n8578
597b8495L862N7954r964n3984J3395M7324k1457m6521K9307M7794l4164m2573
609c7522M2386L3286n3933k4413O0947J3763n9263L412N7893j8603n5303K4797
621a2553M3836l1096l2165L6461K7424l6981k4369L5038J8591l6987j3599M4906
633A8506J2031m7605o167M7352p469n0465J8028M9001k4586l8884L2756K9250
$$ plain form
645 31748 -7547 -30697 8240 24266 -11695 -19200 17588 21218 -18231 -21758 15919 13747 -24260
658 -24260 -11584 31352 12508 -28728 -3018 30164 -6548 -32478 11516 30135 -13749 -22218
670 -22218 19325 16115 -25235 -17736 20727 11538 -20088 -4743 25654 5782 -25956 -4511 23611
683 23611 -2508 -24639 10597 28409 -11764 -24269 15582 16014 -24133 -13896 26475 11159
695 11159 -23352 -4095 22033 -3578 -26039 1727 23156 -2342 -17536 10350 21610 -11527
707 -11527 -21651 12790 17365 -17129 -12604 22803 10234 -25390 -8830 20111 -2194 -23266
719 -23266 6440 24654 -4868 -17457 10383 15714 -13825 -15259 15365 15337 -14217 -10640 17355
732 17355 6541 -23893 -8544 21263 2594 -21117 4647 23871 -7627 -22199 9184 16353
$$ packed form
645C1748l9295k3150L8937J6026l5961p505L6788L630l9449l527L7677k172l8007
658b4260J2676M2936j8844m1236K5710L3182l6712k5930M3994J8619m3884q469
670b2218M1543l210m1350P499L8463r189l1626J5345L0397j9872l1738K1445K8122
683B3611k6119k2131L5236J7812m0173j2505L9851M32m0147J0237M0371j5316
695A1159l4511J9257K6128k5611k2461K7766K1429k5498j5194K7886J1260l3137
707a1527j0124L4441M575l4494M525L5407j2569l5624J6560K8941k2305k1072
719b3266K9706J8214k9522j2589K7840N331k9539j434L0624k8k9554L577K7995
732A7355j0814l0434J5349K9807j8669k3711K5764J9224l1498j4572L1383P169
$$ plain form
744 16353 -13721 -12293 19077 13540 -16030 -8590 15844 2876 -19648 -2473 20182 1573 -18046
757 -18046 2646 16577 -9775 -20177 9740 17335 -10853 -10523 17822 10895 -18132 -8291 16830
770 16830 3734 -16397 687 18383 -1597 -18540 631 13292 -7210 -15023 10096 17077
782 17077 -8851 -12420 12182 8958 -16778 -7692 18625 6588 -16269 -62 17307 -4581 -19304
795 -19304 4382 16004 -7027 -12636 11485 12864 -13133 -12608 11980 7478 -14950 -4502 18082
808 18082 4543 -16312 -569 15633 -4345 -16000 7165 15847 -7405 -11449 9517 7845 -13734
821 -13734 -9037 11954 6595 -11559 -2540 14102 1592 -14957 -1011 13640 -2027 -13064 6449
834 6449 14589 -7024 -13097 7983 9019 -11781 -7709 13837 7317 -12303 -4138 11720 -33
$$ packed form
744A6353l0074J428L1370n537k9570P440K4434j2968k2524J7175K2655j8609j9619
757a8046K0692J3931k6352j0402K9917P595k8188L30K8345o927k9027R841K5121
770A6830j3096k0131J7084J7696j9980j6943J9171J2661k0502p813K5119O981
782A7077k5928l569K4602l224k5736R086K6317j2037k2857J6207J7369k1888j4723
795a9304K3686J1622k3031n609K4121J379k5997N25K4588m502k2428J0448K2584
808A8082j3539k0855J5743J6202j9978j1655K3165Q682k3252m044K0966j672k1579
821a3734M697K0991n359j8154R019J6642j2510j6549J3946J4651j5667j1037J9513
834F449Q140k1613o073K1080J036k0800M072K1546o520j9620Q165J5858j1753
$$ plain form
847 -33 -14814 2 14035 -1074 -11725 5336 12528 -7637 -12098 9379 10384 -10187 -6190
860 -6190 13949 4515 -14821 -3575 11917 -1761 -13052 3339 12684 -3581 -10714 5191 9220
873 9220 -6831 -8763 8853 9519 -8006 -6465 10237 4184 -13322 -3516 12382 478 -11775
886 -11775 2618 11195 -5393 -11105 5112 8210 -6715 -6285 8655 7296 -7793 -5336 8705
899 8705 4340 -10206 -2467 12105 1683 -12083 592 10895 -5687 -12367 6264 9624 -8501
912 -8501 -6337 10025 4583 -9927 -2648 9560 1822 -7792 585 9076 -422 -9606 355 8320
926 8320 -3379 -9809 4826 9163 -6975 -7868 8767 4970 -10188 -2475 10994 1254 -8711 1708
940 1708 8136 -2662 -7489 2320 6594 -2387 -6490 3300 6790 -4816 -7671 5326 6310 -8107
$$ packed form
847c3j4781J4816J4033j5109j0651J7061P192k0165m461K1477J005k0571L997
860f190K0139r434j9336J1246J5492j3678j1291J6391R345j6265p133J5905M029
873I220j6051j932J7616O66j7525J541J6702o053j7506R806J5898j1904j2253
886a1775J4393Q577j6588n712J6217L098j4925M30J4940j359j5089K457J4041
899H705m365j4546P739J4572j0422j3766J2675J0303j6582o680J8631L360j8125
912h501K164J6362n442j4510P279J2208p738r614Q377Q491r498r184R961P965
926H320j1699o430J4635M337j6138q93J6635l797j5158P713J3469r740r965J0419
940A708O428j0798m827R809M274q981m103R790L490j1606k855J2997R84j4417
$$ plain form
954 -8107 -4873 10189 2996 -10714 376 10360 -2730 -8623 5245 7615 -5039 -5396 5251 3662
968 3662 -5801 -4261 5024 3856 -5776 -3768 7082 3051 -8372 -1668 9978 -426 -9601 3741
982 3741 9229 -5904 -6995 7192 4532 -7742 -2305 7274 963 -6056 -903 5032 458 -5685
996 -5685 -1041 6293 519 -7271 1156 8102 -3185 -7534 6006 7014 -7417 -4012 8764 1830
1010 1830 -8669 502 7138 -2568 -6319 2337 4162 -2598 -3996 1960 4442 -1868 -4448 3220 5283
1025 5283 -4123 -4463 6439 3661 -7563 -1413 7724 -1234 -7838 2736 5586 -4450 -4370 3867 2641
1040 2641 -3512 -2430 2731 2492 -2402 -2437 3647 3634 -4299 -3102 5723 1656 -7138 162 7628 -2480
1056 -2480 -6999 3698 4624 -5850 -3614 5388 1904 -4674 -374 4698 926 -3791 -651 4351 1001
$$ packed form
954h107L234J5062p193j3710J1090R984j3090n893J3868K370j2654l57J0647j589
968C662r463J540R285j168r632K008J0850m031j1423O704J1646j0404r175J3342
982C741N488j5133j091J4187k660j2274N437R579o311p019N153N935m574o143
996e685M644P334n774p790Q427O946j1287m349J3540J008j4431L405J2776o934
1010A830j0499R171O636r706l751Q656J825o760j398N956K482o310k580P668K063
1025E283r406l40J0902k778j1224O150R137q958o604J0574K850j0036Q0Q237j226
1040B641o153J082N161k39m894l5O084j3p933J197Q825m067q794P300P466j0108
1056b480m519J0697R26j0474K236R002l484o578M300N072l772m717L140N002l350
$$ plain form
1071 1001 -4545 159 5558 -1279 -6571 2331 4958 -5106 -4556 6448 3134 -6320 -783 6079 -1201
1086 -1201 -5064 2112 4225 -1625 -2700 2059 2385 -2070 -3193 1417 3112 -2178 -2932 3563 2715 -4618
1102 -4618 -2547 5041 255 -5201 1491 5236 -1712 -3662 2659 2663 -2836 -1702 2613 2327 -1816 -1774
1118 -1774 2039 1589 -3434 -2532 3514 1982 -3907 -502 4868 -725 -5042 1600 4212 -2689 -2612 4159
1134 4159 2133 -3734 -1516 3031 420 -3205 -337 3515 671 -3361 -237 3165 -1137 -4239 1305
1149 1305 4291 -1928 -2930 3188 2474 -3966 -1544 4111 863 -3173 882 3487 -995 -3377 434
1164 434 2038 -1397 -2185 1902 2491 -1814 -2634 1668 1791 -2868 -1269 3828 1572 -2920 301 3187
1180 3187 -1127 -3532 1159 2612 -1152 -1947 1744 1434 -2413 -2270 1580 1320 -1692 -560 2764 994
$$ packed form
1071A001n546M704N399o837n292Q902K627j0064N50J1004l314r454N537O862p280
1086a201l863P176K113n850j075M759L26m455j123M610J695n290p54O495q48p333
1102d618K071P588m786n456O692L745o948j950O321Mn499J134M315k86m143M2
1118a774L813m50n023R02O046j532n889L405N370n593m317O642K612o901P7O771
1134D159k026n867K218M547k611l625K868L852k844m032L124L402m302l102N544
1149A305K986o219j002O118p14o440K422N655l248m036M055K605m482k382L811
1164D34J604l435p88M087N89m305q20M302J23m659J599N097k256m492L221K886
1180C187m314k405M691J453l764p95L691l10l847J43L850k60l012J132L324j770
$$ plain form
1196 994 -2855 -584 2450 -421 -2617 1471 3091 -1285 -2225 1533 1247 -2585 -1725 2437 1345 -1817
1212 -1817 -446 2173 78 -2892 -127 2887 204 -2011 1320 2729 -1612 -2694 1099 1228 -2189
1227 -2189 -938 2672 691 -2419 -417 1471 -514 -2174 866 2578 -315 -1602 985 1605 -2085
1242 -2085 -1925 1809 1639 -1750 -701 2240 37 -2896 -689 1447 -221 -1813 1044 2091 -713
1257 -713 -1752 778 1090 -1575 -1136 1844 1600 -1280 -883 1624 -134 -2641 -189 2244 31 -1695
1273 -1695 993 1556 -1745 -2164 1052 1419 -1010 -491 2084 922 -1867 -947 1421 240 -1744 240
1289 240 2133 -143 -1972 570 1103 -1527 -1615 1452 1386 -1221 -397 1725 203 -2076 -152 1627 171
1306 171 -1131 702 1881 -557 -1928 499 1231 -893 -968 1409 1263 -1528 -1337 1117 278 -1712 -78
$$ packed form
1196I94l849K271L034k871k196M088J620m376r40L758k86l832Q60M162j092l162
1212a817J371K619k095k970K765L014k683k215L331J409m341j082L793J29l417
1227b189J251L610j981l110K002J888j985j660L040J712k893j287K587O20l690
1242b085J60L734j70l389J049K941k203k933K207K136j668j592K857J047k804
1257g13j039K530L12k665M39K980k44k880L97K507j758k507K452K433k213j726
1273a695K688N63l301m19L216L67k429N19K575j162k789R20K368j181j984J984
1289B40J893k276j829K542N33k630q8L067o6k607Q24K122j522k279J924J779j456
1306A71j302J833J179k438j371K427P32k124p5K377j46k791J91K454q39j990J634
$$ plain form
1323 -78 2248 308 -1401 174 1310 -654 -1404 893 1463 -603 -681 1262 619 -1991 -1036 1124 137
1340 137 -1344 309 2117 93 -1848 271 1456 -788 -1115 1543 1547 -1020 -1024 777 267 -1599 -544
1357 -544 1343 566 -1178 218 1204 -698 -1455 633 1506 -390 -485 1324 1029 -1252 -948 870 240
1374 240 -1427 -155 1673 112 -1760 -276 1039 -689 -1324 842 1564 -390 -718 916 759 -1007
1390 -1007 -578 1056 482 -721 -37 1119 -111 -1465 -320 1074 -375 -905 1008 1284 -879 -1039
1406 -1039 764 424 -1240 9 1584 479 -1120 31 823 -293 -1306 66 1027 -21 -847 161
1422 161 726 -819 -1203 745 972 -621 -349 1160 166 -1416 -187 1070 -235 -1139 775 939 -483
1439 -483 -912 463 468 -921 -567 892 819 -397 -605 739 212 -1407 -60 1210 54 -921 845 1359
$$ packed form
1323g8K326j940j709J575J136j964p50K297N70k066p8J943o43k610R55K160r87
1340A37j481J653J808k024j941K119J185k244l27K658Mk567mJ801n10j866J055
1357e44J887p77j744J396R86j902p57K088Q73j896r5J809k95k281L04J818o30
1374B40j667J272J828j561j872J484J315j728o35K166P22j954l28J634j57j766
1390a007M29J634n74j203O84J156j230j354J145J394j449n30J913K76k163j60
1406a039J803l40j664J249J575j105j599J151P92j116j013J372R61j048q26J008
1422A61N65j545l84J948K27j593K72J509r94j582J229J257j305r04J914J64j422
1439d83m29J375Nj389L54J459p3j216k08J344n27j619J347J270j156r75J766N14
$$ plain form
1457 1359 -708 -994 655 485 -903 -212 1135 53 -965 -276 191 -174 -667 71 942 160 -787 -41
1475 -41 1043 -463 -921 876 880 -987 -512 1126 132 -1267 -216 611 -401 -719 364 462 -259 -463
1493 -463 41 410 -42 -437 545 907 -450 -770 594 480 -947 -341 930 30 -1259 246 455 -679
1511 -679 -814 531 340 -443 -180 472 461 -326 -386 612 502 -446 -279 690 301 -1048 -137 965 -618
1530 -618 -862 604 622 -856 -511 959 364 -565 15 681 25 -491 60 381 -206 -733 -157 730 -90
1549 -90 -738 150 755 -534 -570 601 482 -747 209 870 91 -624 190 232 -436 -469 351 95 -245 -293 13
1570 13 260 -486 -506 66 455 -458 -361 943 -66 -626 112 794 -315 -498 596 388 -410 -187 341 54
1590 54 -313 -58 266 270 -268 -310 414 202 -532 -155 428 7 -706 317 707 -411 -528 477 484 -495 -290
$$ packed form
1457A359k067k86J649j70j388O91J347j082j018O89M67l65m93P38Q71p82r47P46
1475d1J084j506m58J797Mj867M75J638r94j399J051Q27j012l18J083R8p21k04
1493d63N04L69m52l95R82L62j357l20J364j14j427O06J271r00j289J505K09j134
1511f79j35J345j91p83K63O52j1p87o0R98j10r48J67R69l89j349R11J102j583
1530f18k44J466J8j478L45J470n95r29N80O66o56n16N51L21n87n27N76Q87q20
1549i0o48Q88O05j289l6J171j19j229R56O61p79p15Q14M2o68l3Q20k56l40m8L06
1570A3K47p46k0N72L89r13R7J304j009n60P38O82j109j83J094k08p98K23N28k87
1590E4l67K55L24Mn38m2P24k12p34L77N83m21p13J023L90j118j17J005Pr79K05
$$ plain form
1611 -290 478 -5 -343 -136 258 -142 -282 32 335 -5 -450 -11 473 -98 -375 350 607 -438 -252 883
1631 883 65 -741 147 695 -237 -584 111 262 -176 -205 315 121 -226 -332 236 108 -413 -162 542 319
1651 319 -348 -14 492 -239 -514 79 343 -497 -397 255 82 -411 123 372 142 -188 -122 307 177 -21
1671 -21 -53 109 -27 -390 -82 666 -198 -575 222 295 -411 -294 321 63 -376 198 434 8 -150 121 347
1692 347 78 -202 302 309 -94 -544 253 44 -453 -353 469 307 -410 -169 385 -231 -390 268 314 -157 -129
1713 -129 73 100 -207 -21 19 15 -169 -81 234 -125 -313 20 441 -16 -271 189 232 -239 -364 195 344 -338
1735 -338 -45 495 21 -195 197 140 -125 -461 77 421 87 -128 129 177 -265 -332 247 308 -218 -169 474 143
1757 143 -331 15 223 -21 -92 128 213 70 -242 33 90 -60 -51 268 247 33 25 316 -185 -302 -217 294 -125
$$ packed form
1611b90P68m83l38K07L94m00j40L14L03l40m45M39M84n71k77P25K57j045J86J135
1631H83q18q06Q88N48r32l47O95J51m38k9N20j94l47j06N68j28n21K51P04k23
1651C19o67L34N06p31k75N93K64q40J00O52j73m93N34K49k30l30O6M29j30j98
1671b1l2J62j36l63L08P48q64l77P97P3p06J17O15k58m39N74K36m26j58K71K26
1692C47k69k80N04Pm03m50P97k09m97J00Q22j62p17K41N54o16j59O58M6m71K8
1713a29K02K7l07J86M0mj84Q8L15l59j88L33M21m57k55M60M3m71j25N59J49o82
1735c38K93N40m74k16L92n7k65l36N38L44l34k15K57M8m42o7N79O1n26M9O43l31
1757A43m74L46K08k44p1K20Q5j43l12K75N7j50RL19k1k14qK91n01j17Q5N11m19
$$ plain form
1780 -125 -96 298 246 -223 -313 -149 232 -158 -58 229 47 -193 -84 124 -57 -117 42 342 18 -190 29
1801 29 72 -208 -399 330 153 -48 -109 296 4 -347 -113 263 75 -297 163 44 -49 -271 182 216 24 -164
1823 -164 144 60 -216 -334 192 -20 -517 -58 115 -93 -182 181 204 -191 -241 -26 296 -223 -164 127 160 -232
1845 -232 -240 73 -23 -90 -4 312 -68 -330 172 263 -182 -75 285 248 -148 -160 127 -156 -76 123 206 410 -70
1868 -70 -258 90 10 -218 -6 443 64 -37 140 275 35 -56 -7 33 -282 37 -68 -21 -128 -90 72 73 79 -85
1892 -85 -21 -21 22 -5 128 20 -157 303 67 -274 -149 252 219 -193 71 169 -318 -130 -69 98 -58 91 -41
1915 -41 -129 -68 -23 165 170 92 -68 133 -22 -43 -41 121 2 -187 94 123 -202 -251 242 -20 -15 108 138 -138 -201
1940 -201 92 -33 -38 -73 -129 71 -14 -32 123 46 -57 -221 -33 198 85 -120 163 39 -39 -52 -99 -136 -18 197
$$ packed form
1780a25K9L94n2m69r0J64L81l90J00K87j82k40J09K08j81o0J59L00l24k08K19
1801B9M3k80j91P29j77k01o1M05k92l51K34L76j88l72M60j19r3k22M53L4j92j88
1823a64L08q4k76j18N26k12m97M59J73k08q9L63K3l95n0K15L22n19N9K91L3l92
1845b32qL13r6o7Q6L16l80k62N02R1m45J07L60l7l96j2K87k83Q0J99Q3K04m80
1868g0j88L48q0k28K12M49l79j01J77J35k40r1M9M0l15L19j05M7j07L8J62JOj64
1892h5O4%M3k7J33j08j77M60k36l41J25M01l3m12K64R8m87J88O1J67j56J49j32
1915d1q8O1M5J88Np8j60K01j55k1KJ62j19j89K81K9l25m9M93k62NJ23L0k76o3
1940b01K93j25nl5n6K00q5j8J55p7j03j64J88K31j13k05K83j24p8j3m7l7J18K15
$$ plain form
1964 197 -14 -46 -5 175 -28 71 166 -81 315 -68 15 150 194 -228 35 -67 79 3 115 -6 -213 22
1986 22 156 26 128 189 93 -18 10 -20 -66 -103 -17 -115 -22 186 25 -128 -48 35 123 -11 -38 100 -165 76 25
2011 25 -198 22 171 73 -40 -86 35 185 83 -35 108 -11 -48 -132 38 -10 -37 79 -160 69 50 41 -87
2034 -87 -19 13 -12 -148 -186 100 -89 34 140 -4 99 56 -72 36 31 -2 50 -44 1 110 -74 92 -126 56
2058 56 143 154 -239 -155 -90 -30 78 38 63 -37 205 -29 18 -200 137 23 47 73 -212 -73 -19 -33 -161 -115 -77
2083 -77 -122 225 143 -10 178 102 -105 -68 -131 -72 9 28 99 76 85 12 -69 124 -181 -67 124 -208 -30 103 324
2108 324 49 50 -138 99 -8 23 327 -32 156 -65 175 70 -60 45 -6 -122 65 89 -112 -30 -219 -101
2130 -101 90 139 -22 29 188 153 101 -9 30 -41 3 41 111 -28 125 8 58 -107 7 -81 -75 73 -35 -78 -220
$$ packed form
1964A97k11l2M1J80k03R9R5k47L96l83Q3J35M4m22K63j02J46p6J12j21k07K35
1986B2J34j30J02O1r6j11K8l0m6l7Q6r8R3K08j61j53Q0Q3Q8j34k7J38k65K41n1
2011B5k23K20J49r8j13m6J21J50j02j18J43j19l7q4J70m8k7J16k39K29j9rj28
2034h7O8L2k5j36l8K86j89J23J06j44J03m3j28J08nl3N2r4M5J09j84J66k18J82
2058E6Q7J1l93Q4O5O0J08m0K5j00K42k34M7k18L37j14K4K6k85J39N4j4j28M6L8
2083g7m5L47q2j53J88p6k07L7o3N9Q1J9P1k3Rp3q1J93l05J14J91l32J78J33K21
2108C24k75Jj88K37j07L1L04l59J88k21K40j05j30J05n1j16J87K4k01Q2j89J18
2130a01J91M9j61N1J59l5n2j10L9p1M4L8P0j39J53j17N0j65J14q8OJ48j08m3j42
$$ plain form
2155 -220 81 6 73 -112 -173 -158 86 42 -33 10 -5 98 4 -133 -295 230 9 -77 27 -75 84 -45 -58 -154
2179 -154 56 -15 206 -75 140 32 146 81 37 -104 42 -152 -43 31 141 14 20 -107 76 90 300 -1
2201 -1 116 131 40 50 119 -46 -50 -24 -71 74 176 153 115 -107 24 93 193 153 -71 251 136 -47 161 62 -186
2226 -186 1 -97 79 -143 54 96 146 -2 135 -13 23 31 50 -20 51 -128 79 35 100 -298 -34 163 -44 -95
2250 -95 -200 -66 -64 99 -87 29 -192 12 70 -186 -86 119 222 91 57 38 193 97 -157 175 80 18 -22
2273 -22 149 4 173 -195 129 105 -57 267 75 -10 108 -52 97 -163 13 165 92 27 -236 48 -83 -186
2295 -186 -27 -24 247 85 109 -29 -101 -90 30 86 -107 -109 -47 95 -124 -121 120 -53 -64 76 -182 32 -257 35
2319 35 87 -46 -85 45 25 -35 -280 260 -274 -26 -106 148 47 -13 -126 21 -20 -201 220 -44 12 17 -81 160
$$ packed form
2155b20L01p5O7j85o1J5K44m4p5M3j5J03r4j37j62N25k21q6J04j02J59j29j3r6
2179a54K10p1K21k81K15j08J14o5m4j41J46j94J09P4J10j27Oj27J83J4K10l01
2201aJ17J5r1J0O9j65mK6m7J45J02k3l8k22J31O9J00m0k24L22j15j83K08r9k48
2226a86J87r8J76k22J97M2N0j48J37j48L6QJ9p0P1j79K07m4O5l98K64J97k07n1
2250i5j05J34KJ63j86J16k21K04N8k56J00K05J03j31l4j9J55r6k54L32r5o2m0
2273b2J71j45J69l68L24k4j62L24j92q5J18j60J49k60J76J52p3o5k63K84j31j03
2295a86J59LK71j62K4j38p2J1J20N6j93kO2J42k19LK41j73j1J40k58K14k89K92
2319C5N2j33l9J30k0o0k45N40n34K48q0K54j01o0j13J47m1j81M21k64N6Nr8K41
$$ plain form
2343 160 -130 40 82 81 92 101 99 95 -111 -124 156 85 35 68 203 -123 -152 117 84 -145 -114 102 135 -230 276 -74
2369 -74 223 -39 -90 133 -133 -16 105 -7 -70 -154 -11 153 -166 31 200 -35 66 -82 -170 1 -100 -98
2391 -98 268 -29 -13 182 101 30 -85 31 172 -147 -29 -47 3 -283 4 -19 87 -233 -35 186 52 -49
2413 -49 96 168 -121 -22 106 129 -80 -161 86 79 -18 -129 90 -22 -113 118 109 95 -128 69 41 118 132 171 174 61
2439 61 -236 62 17 -145 -182 80 -11 -13 16 -49 -65 -189 61 271 -17 149 59 41 135 124 153 -129 -18 -187 75
2464 75 -26 -54 -89 223 -36 -192 134 245 -45 21 186 106 107 -28 -15 143 8 -162 128 7 44 -76 0
2487 0 -159 7 303 184 -20 -72 147 15 -245 -74 363 -100 -129 86 25 6 -97 -63 26 -3 63 -13 -39 -100
2511 -100 -266 74 123 5 -147 263 188 -262 11 199 180 9 61 183 -98 -81 -46 55 29 -326 155 -96
$$ packed form
2343A60k90J70M2jJ1Rkmk06j3K80p1n0L3J35l26k9K69l3k29L1K16L3l65N06l50
2369g4K97k62n1K23k66J17J21j12o3q4J43J64l19J97J69k35J01j48q8J71j01K
2391i8L66k97J6J95q1p1j15J16J41l19J18j8N0k86K87k3J06l20J98K21j34j01
2413d9J45P2k89R9J28K3k09q1K47pr7j11K19j12r1K31rj4k23J97k8P7J4L9Lj13
2439F1k97K98m5j62l7K62r1kK9o5j6j24K50K10k88J66r0j8R4j1K9k82J11j69K62
2464G5j01k8l5L12k59j56L26J11k90O6J65q0Jj35J3J58j35j70K90j21L7j20P6
2487@j59J66K96j19k04n2K19j32k60J71M37m63k9K15o1j9j03L4Q9k9O6p6k6o1
2511a00j66L40M9j18j52M10p5m50K73J88j9j71N2J22k81J7L5J01k6l55M81k51
$$ plain form
2533 -96 -22 -185 100 58 -266 179 -30 -122 -34 39 168 -22 -50 59 118 68 -59 7 78 81 -141 124 137 -44 143
2558 143 -35 -4 129 31 -106 -101 -19 -58 16 55 -136 -14 -77 -72 0 83 -56 -1 -205 119 -152 33 -10 108 -132
2583 -132 -184 125 49 -18 -142 100 -45 -14 6 51 16 72 -19 24 -158 -142 -131 75 -108 -8 -105 52 -96 -217
2607 -217 233 -40 -102 -92 -36 17 -115 -11 17 -150 -176 157 -15 -104 -45 -44 353 45 -83 273 -10 -1 -18 87
2631 87 -181 -161 71 70 -20 -198 -48 -73 -45 12 118 -88 -143 -107 168 83 -114 9 137 37 -164 -50 234 13
2655 13 89 41 -43 -12 41 109 -88 14 -31 -108 72 -216 59 170 -35 -63 10 85 -18 46 52 113 -167 -86 93 193
2681 193 25 -12 38 65 -51 -5 103 -37 -21 211 42 106 -118 214 59 -213 52 92 -57 -26 -17 31 -77 255
2705 255 -146 -29 13 -347 108 -46 -134 -11 151 97 -149 -137 220 33 -113 157 142 -115 -59 -184 45 155
$$ packed form
2533i6P4j63K85m2l24M45k09r2Q8P3J29j90k8J09N9n0j27O6P1Lk22K65J3j81J87
2558A43j78L1J33r8j37NQ2l9P4L9j91J22o3NP2Q3j39N5k04L24k71J85m3J18k40
2583a32n2L09p6o7j24K42j45L1K0M5l5N6r1M3j82J6J1K06j83J00r7J57j48j21
2607b17M50k73o2J0N6N3j32J04K8j67k6L33j72q9N9JL97l08j28L56k83Rj7J05
2631H7k68K0K32jr0j78J50k5K8N7J06k06n5L6K75q5j97J23J28j00k01J14K84k21
2655A3P6m8q4L1N3O8j97J02m5p7J80k88K75J11k05k8P3P5j03O4OO1k80Q1J79J00
2681A93j68l7N0K7j16M6J08j40J6K32j69O4k24L32j55k72K65M0j49L1RM8j08L32
2705B55m01J17M2l60M55j54q8J23J62n4k46J2L57j87j46K70j5k57N6j25K29J10
$$ plain form
2727 155 29 -4 163 140 -109 125 40 -161 -73 232 -81 -64 72 7 -28 -94 60 133 157 -27 -32 191 -138 -152
2751 -152 94 2 -37 -56 -107 34 -227 50 301 -195 -198 -30 107 -82 9 146 146 106 -119 -74 -113 88 -65 -133
2775 -133 343 -12 43 111 -13 68 -12 70 -184 105 11 125 116 52 -206 37 -264 -158 144 -102 -103 19 202 178
2799 178 -131 12 204 46 -74 55 207 81 -150 52 53 -191 119 -20 201 32 13 53 106 -8 14 80
2821 80 -270 -77 45 156 73 -105 -39 136 19 -55 164 92 -175 -26 250 -60 28 -57 135 -33 -51 76 54
2844 54 143 -46 164 39 -273 -141 -160 -205 -45 43 37 1 -245 177 116 -44 86 -112 27 79 -185 -20 354
2867 354 -34 13 -33 69 -76 -94 30 -130 -10 9 -21 -14 -228 28 -29 -223 -26 81 -2 51 -129 165 42
2890 42 -49 -213 -53 -58 29 -141 -18 154 -23 192 -28 10 -187 -77 -71 -51 -43 -14 -13 85 -7 63 -128 -68 25 -121
$$ packed form
2727A55j26l3J67k3k49K34q5k01Q8L05l13J7J36o5l5o6J54P3K4j84nK23l29j4
2751a52K46r2l9j9n1J41k61K77K51m96lJ68J37j89R1J37%m0k25M5l9K01j53o8
2775a33M76l55N5O8j24Q1q0Q2k54K89r4J14ro4k58K43l01J06L02k46jJ22J83k4
2799A78l09J43J92j58j20J29J52j26k31K02Jk44L10j39K21j69j9M0N3j14K2O6
2821H0l50J93J22J11q3j78O6J75j17p4K19p2k67J49K76l10Q8q5J92j68j8J27k2
2844E4Q9j89K10j25l12J32j9m5J60Q8ol6k46M22o1j60J30j98J39N2k64J65L74
2867C54l88M7m6J02j45j8J24j60J20J9l0Pk14K56n7j94J97J07q3N3j80K94j23
2890D2r1j64J60nQ7j70J23J72j77K15k20L8j97J10OK0QK9JR8r2P0j91O0R3j46
$$ plain form
2916 -121 -21 -299 -15 106 79 -68 244 41 -213 -13 84 -78 63 -37 252 50 18 178 156 -172 -168 56
2938 56 31 -121 -234 238 38 55 8 82 -113 -292 -5 154 -170 -47 -65 140 102 -185 97 -37 -184 233
2960 233 -45 -90 -125 -96 139 -33 -24 -49 49 -106 -91 207 52 71 -42 161 98 -125 -33 109 -15 -146 5 66
2984 66 104 -40 42 -68 59 -3 30 -44 -72 -161 194 62 -193 -141 29 8 -101 -8 266 104 -80 49 62 -100
3008 -100 29 -64 -17 206 -55 94 -55 79 -4 -91 181 -318 -208 5 -207 -95 154 32 -9 8 37 -181
3030 -181 -3 -136 3 28 -65 -38 -97 -90 -173 257 105 9 -84 -8 299 -315 33 79 50 -12 -351 51 46 -93 -191
3055 -191 -140 122 170 344 142 126 87 121 164 -237 4 -4 84 -197 -45 -83 -13 -66 20 149 18 27 97 -154 188
$$ packed form
2916a21J00k78K84J21k7j47L12k03k54K00R7j62J41j00K89k02l2J60k2l28MK24
2938E6k5j52j13M72k00J7m7P4j95j79K87J59l24J23j8K05l8k87K82j34j47M17
2960B33k78m5l5K9K35j72Rk5R8j55J5K98j55J9j13K03o3k23R2J42j24j31J51O1
2984F6L8j44Q2j10J27o2L3p4k8q9L55j32k55N2J70k1j09R3K74j62j84J29J3j62
3008a00J29r3M7K23k61J49j49J34q3q7K72m99J10K13k12J12K49j22m1J7K9k18
3030a81J78j33J39K5r3K7n9Pq3M30j52r6r3P6L07o14L48M6k9o2l39M02nj39r8
3055a91N1K62M8J74k02j6l9L4M3m01K41qQ8k81J52l8P0n3Q6J29j31RP0k51L42
$$ [...]
8191E4
##END NTUPLES=NMR FID
##END=
