##TITLE=1H_DE-43_EA_TFA2
 CDCl3
 8 sc, 
 3.4.2024
##JCAMPDX= 6.0         $$ Bruker NMR JCAMP-DX V2.0
##DATA TYPE= NMR FID
##DATA CLASS= NTUPLES
##ORIGIN= UXNMR, Bruker Analytische Messtechnik GmbH
##OWNER= root
$$ XWIN-NMR		Version 3.5
$$ Wed Apr  3 14:24:12 2024 Russian Standard Time (UT+4h)  she@DPX200
##.OBSERVE FREQUENCY= 200.1309
##.OBSERVE NUCLEUS= ^1H
##.DELAY= (6, 6)
##.ACQUISITION MODE= SIMULTANEOUS
##.ACQUISITION SCHEME= undefined
##.AVERAGES= 8
##.DIGITISER RES= 18
##SPECTROMETER/DATA SYSTEM= spect
##.PULSE SEQUENCE= zg30
##.SOLVENT NAME= MeOD
##.SHIFT REFERENCE= (INTERNAL, MeOD, 0, 15.7039)
##AUDIT TRAIL= $$ (NUMBER, WHEN, WHO, WHERE, WHAT)
$$ ##TITLE= Audit trail, XWIN-NMR		Version 3.5
$$ ##JCAMPDX= 5.01
$$ ##ORIGIN= Bruker BioSpin GmbH
$$ ##OWNER= she
$$ F:/spectra/data/she/nmr/H-F/1/audita.txt
$$ ##AUDIT TRAIL=  $$ (NUMBER, WHEN, WHO, WHERE, WHAT)
(   1,<2024-04-03 14:21:59.62 +0400>,<she>,<DPX200>,
      <created by zg, POWCHK disabled, PULCHK disabled
       configuration hash MD5:
       00 E9 B6 7A A2 85 ED C7 34 08 36 98 17 FE 4E 26
       data hash MD5: 16K
       79 B0 C5 5C 45 EC 11 00 1D A7 B7 0F AA C5 C5 F0>)
$$ ##END=
$$ 
$$ hash MD5
$$ B5 15 DF 6C 19 EA AD 9E 2A 58 33 7F 5E 68 FA F5
##$RELAX= 
##$RELAX= 
##$RELAX= 
##$RELAX= 
##$RELAX= 
##$RELAX= 
$$ Bruker specific parameters
$$ --------------------------
##$DU= <F:/spectra>
##$EXPNO= 1
##$NAME= <H-F>
##$PROCNO= 1
##$TYPE= <nmr>
##$USER= <she>
##$AMP= (0..31)
100 100 100 100 100 100 100 100 100 100 100 100 100 100 100 100 100 100 
100 100 100 100 100 100 100 100 100 100 100 100 100 100 
##$AQSEQ= 0
##$AQ_mod= 1
##$AUNM= <au_zg>
##$AUTOPOS= <>
##$BF1= 200.13
##$BF2= 200.13
##$BF3= 200.13
##$BF4= 200.13
##$BF5= 200.13
##$BF6= 200.13
##$BF7= 200.13
##$BF8= 200.13
##$BYTORDA= 1
##$CFDGTYP= 0
##$CFRGTYP= 5
##$CHEMSTR= <none>
##$CNST= (0..31)
1 1 145 1 1 1 1 1 1 1 1 1 1 1 1 1 1 1 1 1 1 1 1 1 1 1 1 1 1 1 1 1 
##$CPDPRG= <>
##$CPDPRG1= <>
##$CPDPRG2= <>
##$CPDPRG3= <>
##$CPDPRG4= <mlev>
##$CPDPRG5= <mlev>
##$CPDPRG6= <mlev>
##$CPDPRG7= <mlev>
##$CPDPRG8= <mlev>
##$CPDPRGB= <>
##$CPDPRGT= <>
##$D= (0..31)
0 1.2 0 0 0 0 0 0 0 0.06 0 0.03 0 0 0 0 0.0002 0 0 0 0 0 0 0 0 0 0 0 0 
0 0 0 
##$DATE= 1712139719
##$DBL= (0..7)
120 120 120 120 120 120 120 120 
##$DBP= (0..7)
150 150 150 150 150 150 150 150 
##$DBP07= 0
##$DBPNAM0= <>
##$DBPNAM1= <>
##$DBPNAM2= <>
##$DBPNAM3= <>
##$DBPNAM4= <>
##$DBPNAM5= <>
##$DBPNAM6= <>
##$DBPNAM7= <>
##$DBPOAL= (0..7)
0.5 0.5 0.5 0.5 0.5 0.5 0.5 0.5 
##$DBPOFFS= (0..7)
0 0 0 0 0 0 0 0 
##$DE= 6
##$DECBNUC= <off>
##$DECIM= 32
##$DECNUC= <off>
##$DECSTAT= 4
##$DIGMOD= 1
##$DIGTYP= 9
##$DL= (0..7)
0 120 120 120 120 120 120 120 
##$DP= (0..7)
150 150 150 150 150 150 150 150 
##$DP07= 0
##$DPNAME0= <>
##$DPNAME1= <>
##$DPNAME2= <>
##$DPNAME3= <>
##$DPNAME4= <>
##$DPNAME5= <>
##$DPNAME6= <>
##$DPNAME7= <>
##$DPOAL= (0..7)
0.5 0.5 0.5 0.5 0.5 0.5 0.5 0.5 
##$DPOFFS= (0..7)
0 0 0 0 0 0 0 0 
##$DQDMODE= 0
##$DR= 18
##$DS= 0
##$DSLIST= <SSSSSSSSSSSSSSS>
$$ [...]
##$SUBNAM2= <"">
##$SUBNAM3= <"">
##$SUBNAM4= <"">
##$SUBNAM5= <"">
##$SUBNAM6= <"">
##$SUBNAM7= <"">
##$SUBNAM8= <"">
##$SUBNAM9= <"">
##$SW= 18.0517689322627
##$SWIBOX= (0..15)
0 0 2 0 0 0 0 0 0 0 0 0 0 0 0 0 
##$SW_h= 3612.71676300578
##$TD= 16384
##$TD0= 1
##$TE= 0
##$TE2= 300
##$TE3= 300
##$TEG= 300
##$TL= (0..7)
0 120 120 120 120 120 120 120 
##$TP= (0..7)
150 150 150 150 150 150 150 150 
##$TP07= 0
##$TPNAME0= <>
##$TPNAME1= <>
##$TPNAME2= <>
##$TPNAME3= <>
##$TPNAME4= <>
##$TPNAME5= <>
##$TPNAME6= <>
##$TPNAME7= <>
##$TPOAL= (0..7)
0.5 0.5 0.5 0.5 0.5 0.5 0.5 0.5 
##$TPOFFS= (0..7)
0 0 0 0 0 0 0 0 
##$TUNHIN= 0
##$TUNHOUT= 0
##$TUNXOUT= 0
##$USERA1= <user>
##$USERA2= <user>
##$USERA3= <user>
##$USERA4= <user>
##$USERA5= <user>
##$V9= 5
##$VALIST= <valist>
##$VCLIST= <CCCCCCCCCCCCCCC>
##$VD= 0
##$VDLIST= <DDDDDDDDDDDDDDD>
##$VPLIST= <PPPPPPPPPPPPPPP>
##$VTLIST= <TTTTTTTTTTTTTTT>
##$WBST= 1024
##$WBSW= 4
##$XGAIN= (0..3)
0 0 0 0 
##$XL= 0
##$YL= 0
##$YMAX_a= 551966
##$YMIN_a= -489372
##$ZGOPTNS= <>
##$ZL1= 120
##$ZL2= 120
##$ZL3= 120
##$ZL4= 120
##$ABSF1= 10
##$ABSF2= 0
##$ABSG= 5
##$ABSL= 3
##$ALPHA= 0
##$AQORDER= 0
##$ASSFAC= 0
##$ASSFACI= 0
##$ASSFACX= 0
##$ASSWID= 0
##$AUNMP= <proc_1d>
##$AZFE= 0.1
##$AZFW= 0.1
##$BCFW= 1
##$BC_mod= 2
##$BYTORDP= 1
##$COROFFS= 0
##$CY= 11.3945322036743
##$DATMOD= 1
##$DC= 2
##$DFILT= <>
##$DTYPP= 0
##$F1P= 15.7292609196834
##$F2P= 12.9074282941183
##$FCOR= 0.5
##$FTSIZE= 0
##$FT_mod= 4
##$GAMMA= 1
##$GB= 0.15
##$INTBC= 1
##$INTSCL= 1
##$ISEN= 128
##$LB= 0.24
##$LEV0= 0
##$LPBIN= 0
##$MAXI= 10000
##$MC2= 0
##$MEAN= 0
##$ME_mod= 0
##$MI= 1.114404
##$NCOEF= 0
##$NC_proc= 0
##$NLEV= 6
##$NOISF1= 3.799351
##$NOISF2= 2.8
##$NSP= 1
##$NTH_PI= 0
##$NZP= 0
##$OFFSET= 15.70392
##$PC= 1
##$PHC0= -25299.96
##$PHC1= 12.98731
##$PH_mod= 1
##$PKNL= yes
##$PPARMOD= 0
##$PSCAL= 0
##$PSIGN= 0
##$REVERSE= no
##$SF= 200.130013532006
##$SI= 16384
##$SIGF1= 3
##$SIGF2= 2
##$SINO= 400
##$SIOLD= 16384
##$SREGLST= <1H.CDCl3>
##$SSB= 0
##$STSI= 0
##$STSR= 0
##$SW_p= 3612.71676300578
##$SYMM= 0
##$S_DEV= 0
##$TDeff= 0
##$TDoff= 0
##$TI= <>
##$TILT= no
##$TM1= 0
##$TM2= 0
##$TOPLEV= 0
##$USERP1= <user>
##$USERP2= <user>
##$USERP3= <user>
##$USERP4= <user>
##$USERP5= <user>
##$WDW= 1
##$XDIM= 8192
##$YMAX_p= 0
##$YMIN_p= 0
$$ End of Bruker specific parameters
$$ ---------------------------------
##NTUPLES= NMR FID
##VAR_NAME=  TIME,          FID/REAL,        FID/IMAG
##SYMBOL=    X,             R,               I
##VAR_TYPE=  INDEPENDENT,   DEPENDENT,       DEPENDENT
##VAR_FORM=  AFFN,          ASDF,            ASDF
##VAR_DIM=   8192,          8192,            8192
##UNITS=     SECONDS,       ARBITRARY UNITS, ARBITRARY UNITS
##FACTOR=    0.0002768,     1,               1
##FIRST=     0,             0,               0
##LAST=      2.2672688,     0,               0
##MIN=       0,             -489372,         0
##MAX=       2.2672688,     551966,          0
$$ Real data points
##PAGE= N=1
##DATA TABLE= (X++(R..R)), XYDATA
$$ [...]
1813b61l00N70m9p4K89L52o66k15Q1M59j4p0o6Q9J73n30j0J18O8J63j03P1l12
1836b37j78J24L63j59K76J68q8l37R2k85J13K72O1n9l8L2l43j79L70J51p2k23
1858a76L56k75K7l41M35Kk70K60p6Q1j7k06J11J92N45p1m26K80n45l06J64K92
1880C6L66l04k12L18n73P4K43K25J15l13j44L23j96R6l36M16J92l30J09m27J90
1901a32K88j49j95O93l15l94L3O1j99N31M4O2k38l43P1J08L23l01l7P2K8q7M06
1924C30j66k5k40L73j57K95n32K46l61J83j07OP56o07k62J04j53MK97L10m0k86
1946c2Q9l76R8L46L36n83j5K36l03l0JJ49K86P1j46K99j34l71j36J03J5K30K21
1969C54l41j52j54J41J10L42K6j95l09J12joL96j23o0Q3k66q3m5J16qJ50J9j95
$$ plain form
1813 -261 -561 9 -40 -114 175 527 -139 -354 -273 186 172 102 36 125 298 -232 -242 -124 -56 107 4 75 -237
1836 -237 -415 -291 72 -87 189 357 269 -68 24 -261 -148 124 185 126 88 120 -223 -402 -32 119 47 -176
1858 -176 180 -95 -68 -409 26 28 -242 18 -58 23 6 -200 -89 103 648 577 151 431 -114 -420 -256 36
1880 36 402 98 -114 204 -369 -295 -52 173 288 -25 -169 154 -42 54 -282 134 326 -4 105 -322 -132
1901 -132 156 7 -188 505 190 -204 -171 -110 -309 222 266 328 90 -253 -182 -74 249 -52 -89 -17 11 -76 330
1924 330 164 139 -101 272 115 410 -122 124 -237 -54 -161 -155 601 -6 -268 -164 -317 -313 -16 294 254 -32
1946 -32 57 -319 -221 125 461 -122 -137 99 -204 -234 -233 -84 202 273 127 426 292 -79 -215 -112 -97 133 354
1969 354 13 -139 -293 -152 -42 300 326 131 -178 -66 -67 -73 323 200 140 223 -43 -126 -171 -55 -63 87 106 -89
1993h9J8k53L80l88L81J12J84n8k21m6J45k44J58L80j06o13O7K60k4l44O16k84
2015C1l40L61j95j07K84k33m0J63M17m7p69O65k33q7M34K3k48N9j69K6J11Q1l78
2038a91J13L10n79rK78p6O6kL44J75l27Nr5K83k5k40P0K90l94j69J45J40J0n6
2062F6M9r2L33p06J3N77K0k77R6Q2m00m5K63p2K15k23J94p6O3J58l82J34K83o7
2086B06m6K46j04l89K66l07L9L40k31Nr3m1k5J76l1R8l49K35j23Q2K8rj89L08
2110I2R7m01q3N77n06L3L43j20K26j34l19l0J08PJ52K38M5n42k01M26k41L52K92
2133D11j73N8j40j64J96or6j12N9Q2j10l5M8K0k0J35l16K44K41m40K10j23o5j22
2157b18M12r5k03M68l63K8K13q2l41K09n5P4j12q4L84j67J52mn71l0M20k67M2
$$ plain form
1993 -89 -71 -324 56 -332 49 161 345 287 66 20 165 -79 79 459 353 -260 -193 67 43 -301 315 31
2015 31 -309 52 -143 -250 34 -199 -239 -76 341 294 -475 190 -43 -130 304 327 79 138 -31 -5 106 187 -191
2038 -191 -78 232 -347 -356 -78 -154 -88 -90 254 429 102 107 12 295 270 30 100 390 -4 -173 -28 112 122 66
2062 66 115 23 356 -350 -337 240 260 -17 79 161 -239 -284 -21 -93 122 -101 93 17 80 238 -144 -10 273 206
2086 206 160 406 302 -87 179 -128 -89 251 20 25 -68 -109 -134 42 11 109 -240 -5 -128 -46 -18 -27 -216 92
2110 92 189 -212 -295 282 -224 -191 152 32 258 124 -195 -225 -117 -110 42 280 325 -217 -418 8 -233 119 411
2133 411 238 296 156 -8 188 182 86 -26 33 115 5 -30 18 38 18 153 -163 81 322 -118 92 -31 -96 -218
2157 -218 194 99 -104 364 1 29 242 160 -181 28 -27 47 -65 -149 235 68 220 216 -355 -385 35 -232 -190
2180a90K29n9J75j01j37k9j73M18k53J54j07j01J92RR2Q6k24J97n04L79j69K21
2202A05P8l75n4K47J11j64o6L63l35PJ44L89j27n15J60NK03l18J38M5j80j96J77
2225a58rM2rJ51l6k63J22j7K05l7K1j56K56k3K1n2J5k22p7N51m45J35J56l48P2
2250a05J59p7L2q7K27n3p1n4r7R1J52k36J98j34K12k32K25j40L5K55l17J55J44
2273B82m41PL60k95j6N7R6l7k89J88k68L32Q2J98k32l8J09p5l1K8o2N4M0k24L20
2298A45N8k03K1N9j95J9O4K6j23J25p6J5L3k1O4J8O6k43L09P6l09K20j07L4j66
2323i1K89j47j26J07K03j53k75j15N88o36J49J44p6K61k85J0J75O5j0mj0k5K17
2346B55m4M5k35O9k17J84J81m07RP0J39j0j71K54m25J60l7r3K25j64K48l7L65
$$ plain form
2180 -190 39 -20 155 54 -83 -112 -285 133 -120 34 -73 -174 18 27 119 205 -19 178 -326 53 -116 105
2202 105 183 -192 -246 1 112 -52 -118 245 -90 -83 61 450 323 -192 -32 -27 176 -142 -4 41 -139 -335 -158
2225 -158 -167 -125 -134 17 -19 -282 -160 -177 28 -9 12 -144 112 89 110 58 73 -149 -226 325 -120 15 171 -177 -105
2250 -105 54 -23 9 -78 149 96 25 -29 -126 -35 117 -119 79 -55 157 -75 150 10 45 300 -17 138 282
2273 282 -159 -152 208 -87 -103 -46 50 13 -276 -88 -356 -24 58 256 24 -14 95 20 -11 17 -45 9 49 -175 145
2298 145 203 0 21 80 -115 -96 -32 -6 -129 -4 -80 -65 -32 -53 11 29 95 -148 161 237 -72 148 41 75 -91
2323 -91 198 51 -75 32 235 82 -193 -308 280 -356 -207 -63 -139 122 -163 -153 22 87 77 73 63 38 255
2346 255 211 256 21 90 -127 57 238 -169 -160 -90 49 39 -132 122 -303 -143 -180 -273 -48 -212 36 -1 364
2369C64n94K63L52k29k43j48J94J57K9p8k66L5R2K02k12O7m66L23J13J32j06J37
2391A18k79Mj6K21k19L82J2k27j80Q3K13r9J37p0M9j69j16J39j23N1M2j09K59
2414A03k51KJ57j90L22j19k32M46k3k9k39q5K59j18o7K8j42L64o1m04P0K49R0
2437A30m04J74J15J20j47k07j17K10K60J86l95N2j21J24K68l75J68K4k95K86J0
2458F6k10K68J46m08J84J57k02j78P7K89l31P4L45k92jM69n08J43J91r5m2j25
2480A7K02k12R8K25l72k1j1l7l25L75J9p6J88N2m0K55j58k49K15N4k46L0J86l47
2504a78L44m8j34j15K12j60j61K08K10l89R6L6Q6p2P5j6q6K74J1j4j32J3j54K48
2528A54o3m6j39O3pR1o3R5l35K26J86k3k17k2k5n3L54m05L43l8L1J10J59l88N2
$$ plain form
2369 364 -230 33 385 156 -87 -235 -41 116 145 67 -199 -164 -72 130 -82 -15 -481 -158 -45 87 -19 118
2391 118 -161 -157 -173 48 -171 211 223 -4 -184 -101 112 13 150 80 129 -40 -156 -17 -140 -89 -47 -156 103
2414 103 -148 -146 11 -179 143 24 -208 238 215 186 -53 -138 121 3 -64 -36 -178 186 125 -279 -209 40 130
2437 130 -274 -100 15 135 -12 -219 -336 -126 134 320 -75 -23 -144 -20 248 -127 41 65 -230 56 66
2458 66 -144 124 270 -138 46 203 1 -177 -100 189 -142 -68 277 -15 -16 453 -55 88 279 184 142 17
2480 17 219 7 105 330 -42 -63 -74 -111 -436 -61 -42 -118 70 122 82 337 179 -70 145 199 -47 -17 169 -178
2504 -178 166 118 -16 -131 81 -79 -240 -32 178 -211 -115 -79 7 -65 10 -6 -92 182 193 179 47 60 -94 154
2528 154 91 45 -94 -31 -38 53 -10 85 -250 -24 162 139 -78 -100 -125 -178 176 -229 114 76 107 217 376 -12 40
2553D0K7n2k95K97K58j34j25l33J48J12J42Q0j69J54l53J76J14k2j58jJ86N7l18
2576a69R4J25j21J3N8J52k03p0J09k27J88K71k43J56m78K56p8j7K49j89J82j89
2598a31K92l72J31P6J10j4l81Q1J97J87L4l80L86l08r0K16N1j23n8j16P4O5J40
2621F7k57J78j39J29K85l21L0q4M9r0K73m1J11m0j14N6o2J31n7j67n9N17k10l19
2645a34J51M2j10J19q3O9K10J10l39k53oJ62P1R5o4m5j27K25r5j22J59k10R9M9
2669b7q3N5J18j90J48j41K39J30j89k50j89L82Q8J30k22M1kj83P5L90l02j60J13
2692b9M8j62J25J62q2P0m71L46j08K37l03r8K11J88K69l70r0Q2j68k4K7M21j75
2715A06j0P2m03J94j75J95R7j80K7N3P7k62PO4m9L38j28J0k89J72J72L7J40m21
$$ plain form
2553 40 67 15 -280 17 275 141 16 -317 -169 -57 85 165 -4 150 -203 -27 87 65 -93 -94 92 149 -169
2576 -169 -75 50 -71 -58 0 152 -51 -121 -12 -239 -51 220 -23 133 -345 -89 -167 -184 65 -124 58 -131
2598 -131 161 -211 -80 -4 106 92 -289 -208 -11 176 210 -170 216 -92 -182 34 85 -38 -96 -212 -138 -73 67
2621 67 -190 -12 -151 -22 263 -58 -28 -112 -63 -153 120 79 190 150 36 92 30 161 104 -63 -122 395 185 -134
2645 -134 17 59 -51 68 -15 54 264 374 35 -218 -224 -62 9 104 40 -5 -132 93 -2 -124 35 -175 -76 -27
2669 -27 -110 -55 63 -127 21 -120 119 249 60 -190 -379 3 91 221 -1 40 38 -145 -70 320 18 -142 -29
2692 -29 19 -143 -18 144 62 132 -339 7 -101 136 -167 -265 -54 134 403 33 -57 25 -143 -167 -140 281 106
2715 106 96 168 -235 -41 -216 -21 76 -104 -77 -24 53 -209 -202 -138 -187 151 23 33 -256 -84 88 125 265 -156
2739a56K71l6j2o2r2O1l1K83k63l24L86Q9k34K09q4j19m1P5l9K02J29o4m65L01
2763a6J04J81l92p0K34l5M7J63j73l41N9J90J14J6k23O6K1n4L7%J00j0j14q6L47
2788A65l5k16j4K15j8k75O6J97j88K68k96Q5L81l63J33k94Q0q7L39j18p7M2r0
2811a00L41n5k94K12J01j94q1J6Q7k36Q0o6M97k51J09k64P7K93m33Qj15L32J21
2834A85k05O3J45o3j66j1J98j07l9J5R6n7NK53j83Mk07j11M29k35l37K23%J32
2858B7j9j8L1O5k43K87R1l18J98JJ4k79O1J10K0mk66K48J61j89P3j0k24J72K8
2883A7J04q2n4K24k88J29k8k2j14R9j70L97k20M3j27K09Jk49O9K82k72j89J06
2906a35J55L3k76J09K8q6L54l50K35q1j68K42o1O1N8j37O9J3k05L38k19j07K68
$$ plain form
2739 -156 115 79 67 5 -87 -26 -57 226 -37 -361 25 114 -120 89 5 -114 -155 -80 -119 83 212 148 -317 -16
2763 -16 88 269 -123 -193 41 6 53 216 43 -298 -239 -49 65 81 -142 -76 -55 -109 -72 -72 28 18 -96 -182 165
2788 165 130 -86 -100 115 97 -178 -112 85 -103 165 -131 -46 335 -28 105 -189 -109 -196 143 25 -52 -10 -100
2811 -100 241 186 -108 104 205 11 -70 -54 33 -203 -123 -189 308 57 166 -98 -21 272 -161 -153 -268 64 185
2834 185 -20 43 188 125 -41 -52 146 39 0 15 111 54 59 312 129 133 -74 -185 244 9 -328 -105 -105 27
2858 27 8 -10 21 86 -157 130 221 -97 101 102 116 -163 -102 8 28 24 -242 6 167 -22 51 41 -183 -11 17
2883 17 121 39 -15 209 -79 50 22 0 -114 -15 -185 212 -8 35 -92 117 118 -131 -62 220 -52 -241 -135
2906 -135 20 53 -223 -114 -86 -172 182 -168 67 -14 -182 60 -1 60 118 -19 50 63 -142 196 -23 -130 138
2929A38l82K43J31m01K77j36L44l1R4j63j90J07k40L43j02k51M09M3j70j56K07
2950A14k19P7Q7j78J91RL77l97l53L94l5n8n6o7k1P1J50j19l3j91K83J91j23j8
2974G6j65L60k41l9%L6J39k28J1L4K7j83K51l43JM7L1L14k82k8Q0o8J04K24m2
2999A16l52L32j86J32j19J51K85m28L14k27j6q1k51J22K81j7j28J79j13J03k57
3020a60L7l4K75k98J0K84PR4j56P4k73j0R2J18P9j86O7M3j95J17k33K04R7j16
3044f3L14l9k3k87M9J4J96j43K5k39n8K65j19J29o2n6N6K4L30m75J04P6k87M28
3068A59l06J13J41j24N3j73K09Ll0j79J37J31p6J66j02j65J91O1m45L07l10K85
3090D6j04j78K53j85P1R8j51J06N0Qp3J47j40J25j46K45o6nL3o0K37k67J60m30
$$ plain form
2929 138 -244 -1 130 -271 6 -130 214 183 277 114 -76 31 -209 134 32 -219 190 233 63 -93 114
2950 114 -105 -28 59 -119 72 81 458 61 -292 102 67 9 -47 -114 -135 -64 86 -33 -66 -257 26 217 94 76
2974 76 -89 271 30 -9 -9 27 166 -62 -51 -17 10 -173 78 -265 -264 -217 -186 128 -154 -182 -102 -170 -66 158 116
2999 116 -236 96 -90 42 -77 74 359 -69 245 18 2 -79 -330 -208 73 56 -72 107 -6 97 -160
3020 -160 -123 -157 118 -180 -170 114 121 215 59 133 -140 -150 -58 60 139 -47 20 63 -132 -15 -248 -44 53 -63
3044 -63 251 212 189 -98 -49 -35 161 18 43 -196 -254 11 -108 21 -41 -97 -41 -17 313 -162 -58 18 -269 159
3068 159 -147 -34 107 -17 36 -137 72 75 45 -134 3 134 58 224 122 -43 148 209 -236 71 -239 46
3090 46 -58 -236 17 -168 -97 1 -150 -44 6 14 -59 88 -52 73 -73 172 106 101 134 74 311 44 204 -226
3114b26N5J25J23j67K29L7l81J61Kj44N6K4r9J61J2K02j47J15k13O4J72o9l94
3137c02K44R0j64P8k64K02Nm6J47J3o5L36m73L09k36K01j36K60j39j71l6K7J01
3160a9J04o4l6j26J27J27k95J63K10K0k73j20jJ31Ko0m2L80l55L20r4j22L3K19
3184B29j28J92k32k17K0L5K78k78Q8j26n4J05K37j56j26L0j08J31J6N0k6n1l4
3207a25K05J03k8O3j20J16j65j4k7r9J72k7j29j69J39J74j81o9K25k62J25l9K23
3230I1m6J24j10J26l46K46J0k26R5j01J27J11l94J92J30k63K18o4j14J34J66j22
3252a6K15m01K80O5o4n0N1q8M4m1l6K30q3q4J24r1l62M14J32j55j20J37PL5k45
3277a02J22J76k63mK10j27k1k9J66P0k41J96j74k12J75J00j6r1K26m89M78oj26
$$ plain form
3114 -226 -171 -46 77 -90 139 176 -205 -44 -42 -186 -130 -106 -205 -44 -32 170 23 138 -75 -11 161 92 -302
3137 -302 -58 32 -132 -54 -318 -116 -111 -157 -10 3 -62 274 -199 110 -126 75 -61 199 60 -111 -147 -120 -19
3160 -19 85 21 -15 -141 -14 113 -182 -19 191 211 -62 -182 -183 -52 -50 -110 -152 228 -127 193 99 -23 10 229
3184 229 101 293 61 -156 -136 -101 177 -101 -13 -139 -193 -88 149 -7 -133 -103 -211 -80 -64 -14 -40 -91 -125
3207 -125 80 183 155 218 98 214 49 35 8 -91 81 54 -75 -244 -105 69 -112 -181 44 -218 -93 -132 91
3230 91 45 169 59 185 -161 85 95 -131 -36 -137 -10 101 -293 -101 29 -234 -16 -80 -194 -60 106 -16
3252 -16 199 -202 78 143 79 29 80 -8 36 -5 -41 189 106 22 146 55 -307 107 239 84 -36 101 108 143 -102
3277 -102 20 196 -67 -71 139 12 -9 -38 128 198 -43 153 -21 -233 -58 42 26 -65 161 -328 150 144 18
3300A8j24K05k60J56J39J5l0l42K87K8K57l57ML4J71m4j87R2j28j12K04j06K39
3323A59l24L76l56Q6l8OJ19kj82m5K80j17K51k01j57K92k4k19o0L70N1o43K81
3346i7j5N1K14J1l52J94P4k54J78j76K18q1J69j60J33ok1l3m48M81j31J30r3k41
3370b55J24L39k36M4j09J60j3p8j66K02k93N00m42J06K92j89R1m01K58JJ47j7
3392F5k46O1K51J85j00j67K0l12M57k20j67J23P1l68J85o3o4L01k7J21J12k47
3414b9n0J54J78j04n7r3l2o3L20k31l20L42j41K17j49p6K17j79J24O3j01K72j24
3437A38j48j36j63N02j56n4J3J96j29j21J83nj41k73K98m45N52j36j1J47J66n39
3459b62J62K83j87O8n0q6K36k69j15L34k10J86P1m03L03j09r5K14J2l14J77j50
$$ plain form
3300 18 -106 99 -161 -5 134 149 119 -223 64 92 349 -8 -4 30 201 157 -30 62 -66 -178 26 -80 159
3323 159 -165 211 -145 -59 -97 -91 28 26 -156 -201 79 -38 213 12 -145 147 123 -96 -156 214 265 -378 -97
3346 -97 -112 -61 153 164 -188 6 80 -174 4 -172 46 -35 134 -26 107 101 80 47 -401 80 -51 79 -14 -255
3370 -255 -131 208 -28 16 -93 67 54 -24 -190 12 -281 219 -223 -117 175 -14 77 -324 -66 -65 82 65
3392 65 -181 -120 131 316 216 49 69 -243 214 -6 -173 -50 21 -347 -162 -225 -289 12 -15 106 218 -29
3414 -29 -79 75 253 149 92 -1 -33 -96 224 -7 -327 15 -126 91 -58 -134 83 -96 28 91 -10 262 138
3437 138 -10 -146 -309 193 37 -17 -4 192 63 -58 125 120 -21 -294 4 -441 111 -25 -36 111 277 -262
3459 -262 -100 183 -4 64 14 -72 164 -105 -220 114 -96 90 161 -242 61 -48 -143 71 83 -231 -54 -204
3481b04K02j16p2J33l4j39K39j41j25K80k1J28k73m3J00J41O2rl82K71K44k82
3503d1K28k20J8Q5J6n5k15J28q8J12j97J74Q2j4Q7p9J23l06K12j7J22j88K82l38
3527h9P8m4pP8N4R2m10M67l27J38Q7Q0m01J72J51j28L4q0M2J0R4pN1k06k24J53
3553a42jk27M48N7m9j27l29M76l37L9M03k35J9K38l58J75k2r2K40J3k12P2j64
3576a15K0l6ML06j83k54J93O7L1J5k17K43J41Mj85J98k01m1n1L5L07k08k15M58
3600C16l35k79J37K28l26J46qL12k80J55o4r5L48p8q5k51M5J80l42M18l04M37
3622B75k09p4NnR2k4J45k77l9J94j39J82j23M8j30K9l45N39k21J68J20j71j53
3645a13K5K74l65K48J84n1j83j70L6J12J1k4k9P2o1n8q2K54k87P5J32J07P1k16
$$ plain form
3481 -204 -2 -118 -190 -57 -91 -230 9 -132 -257 23 2 130 -143 -186 -86 55 117 108 -274 -3 241 -41
3503 -41 187 -33 -15 70 86 31 -184 -56 -144 -32 -229 -55 27 13 100 21 144 -162 50 33 155 -33 249 -89
3527 -89 -11 -55 -62 16 70 162 -248 219 -108 30 117 197 -204 -32 119 -9 25 -55 -13 -3 91 84 135 -71 -295 -142
3553 -142 -143 -370 78 135 86 -41 -370 106 -231 -192 211 -24 -5 233 -125 50 28 -64 176 189 -23 49 -115
3576 -115 -95 -131 -127 179 -4 -258 -65 2 33 48 -169 74 215 219 34 232 31 -10 -61 -26 281 73 -142 316
3600 316 -19 -298 -161 67 -259 -113 -121 191 -89 66 2 -93 255 177 92 -159 -114 66 -276 142 -162 275
3622 275 66 -8 -3 -8 84 60 205 -72 -111 83 -56 126 3 51 -79 -50 -395 144 -77 91 211 40 -113
3645 -113 -88 186 -179 69 253 202 19 -151 -115 -3 8 -16 -45 27 -34 -92 -174 80 -207 -132 0 107 178 -38
3669c8r7K13j69j44K47J20j01P6r9J53l32j15K50J12j06k6K63k01M9j94J94n7
3691bN7j65kL59L4l68J06J14k7l42K74k07j75N26j55R5k02K27k61k5O3o6J58j40
3715a24K20N1j78J25M6j37K16l4j04o3J73j86K0l2j47J11K15k83M76n12J30o4
3737h1j0K07j16P0j20J91n6j67O4J1j15M29j75k35L0J38L2m2J47l81j16M37j88
3760d6j91J71L18l95J33j65J39J91q4j06l2K35l08K99l79L75r7L9K72j36k06o7
3782d0K69l56p0K81J47k60L7l88K89J19m40K83p8O6J18J66J80k56R4P8j93J33
3804A79J39m13J99k8l12P2L45m22P7R0R9k4K38l58K45N8k60L0J25NK7k40R7k2
3828e4K15J35l18j52K91l00N0K49j43K01m00J67R5M7P2j30q7KK8K08o8l7j59K29
$$ plain form
3669 -38 -135 78 -91 -235 12 132 31 107 8 161 -171 -286 -36 76 -30 -56 207 6 55 -139 55 -2
3691 -2 55 -110 -112 247 281 -87 19 133 106 -236 38 -169 -344 182 27 122 -80 147 -114 -139 -76 -142 16 -124
3715 -124 96 147 -31 94 140 3 219 185 81 18 191 5 25 -7 -154 -43 172 -111 365 -147 -17 -81
3737 -81 -91 116 0 70 -50 141 85 -82 -18 -7 -122 307 132 -103 -73 65 97 55 202 -179 -295 142 -46
3760 -46 -237 -66 252 -143 -10 -175 -36 155 71 -35 -67 168 -140 159 -220 155 58 97 369 233 27 -40
3782 -40 229 -127 -197 84 231 -29 8 -380 -91 28 -412 -129 -207 -141 -23 143 323 67 161 239 46 179
3804 179 318 -95 104 76 -236 -164 181 -241 -164 -74 25 1 239 -119 126 184 -76 -46 79 84 111 -129 -32 -54
3828 -54 161 296 -22 -174 117 -183 -133 116 -27 174 -226 -59 36 83 155 25 -62 -60 -32 176 108 71 -88 141
3852A41J98n19J35Kp7L15l40K23r0j79K49l4j00O5O7j40o1J26j51j79L58p6J96
3875A29k87K85j13J36k34J78k76M7J36n2J95j0k5m06J56K43j12J73r4j34n1N4
3897f2j54J32L46l99J42k05J32j6j1j12K03N4O7j33P3K3m5j39J01K74o39L32j34
3920a70l1L24qj03o1k77L22J8J06p2J03k39n3J0L0O1K8Q2R6j60m8R6j43J33J8
3945F2k21K34r3O6m4m6N2j2r7K81k61J58R5k17l6K32k32J60j25J64j1j53jj51
3969a96K27P3q3J37k75L38k89j5K24j01K34n5q0j16j96K02q4J43k73J02L23m03
3991a63L81j45jM2k14J88j08q9O7J15l7j21R0J44r9j13M38l40j57L08q8k74M33
4014B57j27j44j4R1l93L87j5L2J13l32K06j4L5j08j14M7K52j72lj6J56k46K93
$$ plain form
3852 141 339 -180 -45 -43 -120 195 -145 78 -12 -191 58 24 -76 -11 56 -84 -145 -19 -170 -349 9 -67 129
3875 129 -158 127 14 150 -84 94 -182 -135 1 -51 144 134 109 -297 -141 102 -10 163 69 -65 -116 -62
3897 -62 -216 -84 262 -137 5 -200 -68 -84 -95 -207 -4 50 117 -16 57 80 35 -104 -3 271 -368 -36 -170
3920 -170 -201 123 115 12 -49 -326 -4 14 120 48 151 -88 -141 -131 -101 -40 -12 70 166 6 -42 54 -89 44 62
3945 62 -159 75 -18 48 4 -42 10 -2 -99 182 -79 79 174 -43 -79 153 -79 81 -44 120 109 -44 -45 -196
3969 -196 31 104 21 158 -117 221 -68 -83 141 40 274 219 139 23 -173 29 -55 88 -185 -83 240 -163
3991 -163 218 73 72 114 -100 88 -20 -109 -42 73 36 -85 5 149 50 -63 375 35 -122 186 98 -176 257
4014 257 130 -14 -28 63 -330 57 42 74 187 -145 61 47 82 -26 -140 -93 159 -13 -16 -32 124 -122 171
4037A71l82K80o6K2P2n7q0o7N4o2J43j17K7n6O2j43M0M22k66J79l27J69Rk2m0
4062c5P1k4r8J70k46K42k17K30k50qO3l3l8J80l00K64k72P0K29JL4j73K3K79j44
4087A8l5O3pJ08j46j35j32J71K20l21M19l59P1K15m0l18J68o9R8J23L3p1R5o1
4111A08j88J86j97J54j52j7J03K30m07L03O4j80J3k26L08j97R2j64J08j19r5N03
4133B30k92K52k98L25j91l2J86k19jkk79L56R7k50J12o6O3l5Q6j27J46l30J52
4156a17J58p5K69k73o0N6J50j70r8K97R1q7k67K25k29J58O8j89N3J9o4j75K95
4179C5k84M3NL0L13k75J24k09L69j86J25k8N9l18K28J0j06J58k29M7P7j44K9j
4203a28K14k48K87r9l1J19j27J3k05P5J81p2l86L50N0j32q7J43n9L38l65MK82
$$ plain form
4037 171 -211 69 3 25 97 40 -40 -107 -53 -115 28 -89 -62 -118 -56 -199 -159 263 -3 176 -151 18 27 5 -35
4062 -35 36 12 -86 84 -162 80 -137 93 -157 -165 -102 -135 -173 7 -293 -29 -301 -231 -2 -1 33 -140 -117 162 18
4087 18 -17 46 39 147 1 -134 -266 -95 125 -196 223 -136 -65 150 110 -208 -40 -109 -11 112 145 74 169 108
4111 108 -80 106 -91 63 -89 -106 -3 227 -180 123 187 7 20 -206 102 -95 -3 -167 -59 -178 -273 230
4133 230 -62 190 -108 217 26 -6 180 -39 -40 -42 -321 35 132 -118 -6 -72 -9 -44 42 -85 61 -269 -117
4156 -117 41 -34 235 -38 -98 -42 108 -62 -160 137 228 141 -126 99 -130 28 96 -93 -40 -21 -85 -260 35
4179 35 -249 -206 -201 -171 142 -133 -9 -218 151 -35 90 62 121 -197 31 41 -65 93 -136 -89 -12 -156 -127 -128
4203 -128 86 -162 125 26 -5 114 -13 0 -205 -130 51 -21 -407 -57 -7 -139 -226 -83 -142 196 -169 -165 117
4226A17j34j69M6J0L89l77K29k31m6R7l6R6K14m5q0k15M4J81m3o1J23l53K36J53
4250A45J80j98j60r8K48k55p9M02j92j1O2j1L35k27j25M13k69M8k55OJ56p8J46
4273A83M4l56n4L10l1k33QL26k30O8j84K18j95q9L22l71J90K36o1m4J7j32J68
4296A10K15m42J3k8J99j94J08K47k88J21j21K76k28j17J12J69k72M9K15k69O2
4317f3l9J66J54k90PM25m02J49Q6k03oJ25o7j53J33k02J82L3j9l4L2j12L8K42
4341A82J9l14L14l44J18K03n3j54K66k60J04j03k1J92j17k63L34k52J5J22L7L9
4363F4L0k08J61q2K01m21L89k18J9K07l5Mp8k3qj61L22j98j18K12k37L18k23q5
4387a68k3K63j33K96r2P5k14j1J98m87M02k8L0n1q3J38L0L44o25L42l61J00l2
$$ plain form
4226 117 -17 -186 -140 -130 259 -118 111 -120 -166 -69 -105 -9 205 160 80 -135 -91 90 47 -14 109 -244 -8 145
4250 145 325 127 -33 -131 117 -138 -217 185 -7 -18 44 33 368 141 16 429 160 208 -47 -41 115 37 183
4273 183 227 -129 -183 127 96 -137 -129 197 -33 35 -149 69 -126 -215 107 -264 -74 162 101 57 74 -58 110
4296 110 325 -117 -104 -132 67 -127 -19 228 -60 61 -60 216 -12 -129 -17 152 -120 -71 144 -125 -63
4317 -63 -102 64 218 -72 -65 360 -42 107 193 -10 -16 109 42 -111 22 -180 2 35 16 -18 14 -98 -60 182
4341 182 201 -113 201 -143 -25 178 125 -29 237 -23 81 -22 -43 149 32 -231 103 -149 -134 -12 25 64
4363 64 94 -114 47 -35 166 -255 134 -84 -65 142 107 111 33 10 2 -159 163 -35 -153 59 -178 140 -83 -168
4387 -168 -191 72 -61 235 143 218 4 -7 191 -296 106 78 108 57 -26 112 142 486 -139 203 -158 -58 -90
4410i0JJ13m7j64K11J76l16J97l4Jk1N7j08J64k57J38J41m5j43O1N6Rj63pJ35
4435F5j24R0O9J0M6j91K72m10J58k56K46P9k56K57p7P0J95l36k9J33k42L81k07
4458e7R3j54k1K16j38j61K64j78O5M5L3n4J74o2K1j61J8p2J38K9j35J23J24k95
4482a45k0J84k59M53j58j28n8K74k53N5l25L07K48M1l39K02L4j50O7j90mK33K54
4505C23l92l9L70l83J87j6j10J9r2M8k87O02l88J54m8l7rj37K35R6J21j81k04
4528a68K18o2J55l4n2R0l62L74k26k80L42J28j05k72K38q0J3K20k9j11K1p7L20
4551B61j56m3m7j06K02j19K38k65p7R0J96k30R5j13j0q4o7K10J34j35J49j23r1
4574i1q4J01J14j41Ok01O61j35l14J53j74l8L29k33j48K45k74L37k25J07j07L4
$$ plain form
4410 -90 -89 24 -23 -187 24 200 -116 81 47 48 27 84 -24 140 -117 21 162 117 -26 35 91 100 -63 -70 65
4435 65 -59 31 100 110 156 -35 237 -173 -15 -271 -25 54 -202 55 -22 48 243 -93 -122 11 -231 150 -57
4458 -57 36 -118 -139 77 -61 -222 42 -136 -71 -26 7 -47 127 65 86 -75 -57 -129 9 38 -97 26 150 -145
4482 -145 -165 19 -240 213 55 -73 -131 143 -110 -55 -380 -73 175 216 -123 79 113 -37 30 -160 -164 69 323
4505 323 -69 -108 262 -121 66 50 -60 -41 -133 -85 -372 230 -158 -4 -52 -89 -98 -235 0 96 217 36 -168
4528 -168 50 -12 143 109 57 147 -215 159 -67 -347 -5 123 18 -254 -16 -96 -83 137 108 -3 18 -59 261
4551 261 105 62 15 -91 111 -8 230 -35 -112 -22 174 -56 39 -74 -84 -168 -235 -25 109 -26 123 0 -91
4574 -91 -175 -74 40 -101 -95 -296 365 230 -84 69 -105 -143 186 -47 -195 50 -224 113 -112 -5 -112 -78
4596g8O0J69j33M6qk23M0K97J1l25K77k77k2M35R4l61R1k12J46k3J38mj90J1N6
4621A5k2m4N4j85N63l44j05K38M4k34K50m8m5j27R6j26N7J76j93M5j17n0J7K13
4645A28k9n4k03J69r6p6K10N9j12l7j54J98P9r8l0k58L92m6J88p9l94L37j57m0
4669a03L57j08k58M7J05j13Q3J3J0J37o0j00j39k8J81J96l65M04j22n2J31j05
4691A11N9k91j57K66M5mj08q7J49L68l86K34j80j17K54O8l71M4N3j10K87M9l07
4714a31K43k6p8J19k60J27o7M01k46K3K94l75k22P8l3K26J53k65KK51j64q5j05
4737a40J45j56J51o2J59l2l05N1J47j59N6r2N1P8O5j17O7MJ80Q8J90k49l03mL25
4762A38j66n5P2L7J67r3j39q5J01j41J32J57K4j38j54J54j47J62L3j95K17j09
$$ plain form
4596 -78 -18 151 18 64 56 -167 -127 170 181 -144 133 -144 -166 269 363 2 93 -119 27 4 142 138 -52 -41 15
4621 15 -7 -51 3 -182 381 37 -68 170 214 -20 230 182 137 10 106 -20 37 213 20 65 -52 -102 -85 128
4645 128 99 45 -158 11 -85 -161 49 108 -4 -41 -195 3 82 -16 -46 -304 88 42 230 151 -243 94 -63 -103
4669 -103 254 146 -112 -65 40 -73 10 23 33 170 110 10 -129 -157 24 220 -145 259 137 85 216 111
4691 111 170 -121 -278 -12 33 29 -79 -166 -17 351 -35 199 19 -98 156 224 -147 -103 -50 -160 127 176 -131
4714 -131 112 86 8 127 -133 -6 -73 328 82 105 399 24 -198 -120 -153 73 226 -39 -37 214 50 -35 -140
4737 -140 5 -151 0 -62 97 65 -240 -189 -42 -201 -145 -237 -186 -108 -43 -160 -93 -89 91 179 369 120 -183 -187 138
4762 138 -28 -83 -11 26 193 100 -39 -124 -23 -164 -32 125 149 11 -143 11 -136 26 59 -136 81 -28
4784b8J50K23k17K3n2j25K04k27k4K8j46k6N3J96o4P9O9j62J96k61K07j51j0J8
4808d7j00M45l99j04J94j23Mj75L65J01r7j59J44j40K0k8p3J34L5k3J20j47L14
4831B61k72jj32k4K80j03M6O7j81L83k67j93M6j33M19k92Q2k96K84k80P1K25j26
4854a36j11K58r3K27j03K08k05K27j20j85J48L5M0k03j41K35l8p9K86j53k26j8
4876a47K59O0k45j03K07J31j26l2R4n5M0k68K03j86J66N8K2P8j96J09Q6pp5J00
4900A73j53j50L97m8j61M4j00P2j83K33oj3j52Q5j22J59J4j36Jj10p5J84L54l45
4924c8Lk61P2K83J95k25l7R0J28l26J08K1O8P4j60k33L91j3j02j57K1J51J19N1
4948B23j74J8J85j33k43j08L43j60j35o8K95J09k46J78j36J47K88n30J6J69M5
$$ plain form
4784 -28 122 345 128 151 99 -26 178 -49 -73 -45 -191 -217 -164 32 -32 47 116 -46 150 -111 96 -55 -65 -47
4808 -47 -147 298 -101 -205 -11 -134 -130 -305 60 161 64 -95 49 -91 -71 -99 -172 -38 -3 -26 94 -53 261
4831 261 -11 -12 -144 -168 112 9 55 122 -59 324 57 -136 -90 -223 196 -96 -14 -310 -26 -306 -235 -10 -136
4854 -136 -247 11 -82 145 42 250 45 272 152 -33 115 150 190 -13 -154 81 43 -36 250 97 -129 -147
4876 -147 112 172 -73 -176 31 162 36 4 98 43 83 -185 18 -168 -2 56 78 156 -40 69 155 148 73 173
4900 173 20 -130 267 219 58 102 2 74 -109 124 118 105 -47 38 -84 75 89 -47 -46 -156 -231 -47 307 -38
4924 -38 -35 -296 -224 59 254 29 -8 82 210 -116 -8 13 81 155 -5 -238 153 140 38 -119 -98 53 172 223
4948 223 49 67 252 119 -124 -232 111 -49 -184 -252 43 152 -94 84 -52 95 383 -147 -131 38 83
4969H3k2J9k27J26L19m45OJ69Q8n1p2L1r8J62J45l67J09K25m05L63l08L04l32
4992a78R5m2J3j6K38j16k25L35k24J12K33j62j02m3K06p5k39K3j39M20M8j71j15
5015a24J54J08l93M32k28L0Q4J61k93j43K03p7J0p4R3K34m04K50j24J89j52Oj44
5038b02J21K53n2k18j1J40M6j81j53J95Q9q6J30O1k74m7K22k13J16J4Q6K9j61
5061i6J74o2k12K86j18J60k94n7L66k25J99k37o2J06J09j05J35r9J78j91r2K07
5083G0J20j88Q0j1l12J05J33m22N49l70Q2M08k66J26j04q9J60K6L3k63J14P2p7
5106b4M02n32L18K43j98j47q7j41J65R9l0N0r6j64k8K59o4J33M2k39J41O7k88
5129a19J20jm4J72p7O0l52J77J4mp4n9L83j60k9l63M07n0l05J66J76m6P5R1J14
$$ plain form
4969 83 61 80 -147 -21 298 -147 -141 28 116 65 -7 24 -74 88 233 -134 -25 200 -205 158 -150 154 -178
4992 -178 -83 -125 -112 -128 110 -6 -231 104 -120 -8 225 63 -39 -82 124 49 -190 -167 -306 114 162 -9 -124
5015 -124 30 138 -255 177 -51 -21 63 224 -69 -212 -9 -86 -76 -150 -57 177 -227 23 -101 88 -64 -58 -202
5038 -202 -81 172 120 -98 -109 31 77 -104 -257 -62 27 -59 71 132 -142 -189 33 -180 -64 -50 36 65 -96
5061 -96 78 16 -196 90 -28 132 -162 -219 147 -78 121 -116 -178 -72 37 -68 67 -32 146 -45 -137 70
5083 70 190 2 82 71 -241 -136 -3 -425 124 -246 -164 244 -22 104 0 -89 71 97 130 -133 -19 53 -24
5106 -24 378 -154 164 407 209 62 -25 -166 -1 98 68 118 22 -142 -170 89 25 158 200 -39 102 169 -119
5129 -119 1 0 -44 128 51 111 -241 -64 -50 -54 -128 -187 196 36 7 -356 51 1 -304 -138 38 -8 67 158 272
5154B72l05J82N8j5j35J47k84j49J67N5J53p0j74k3pK78L4j28j17Q6j01L51l23
5177d8j10K04O8p6P6j16K5MK15j13m31J61J28j99L32j6j65O4J40n2k68M57k49
5200C1M8rk08L97k19J18j9J18m07Q3K81k15K91k34m93M42K95k86N2j75K7j64J14
5223a32K10Q4k20p4R1R2O2k23J91j33kj35J45J27k56J71l5J30j51J61l5l9n1Q4
5247F2M6oj65J88j93N1J75O8r4k84K44J5j01l9L1k31K87n11M55L7q8K08Q7j83
5271E9k51L0J48k2k37K05L78k28l92L21N8n57O17l58J06R6n6j5J72Jm2p2J05M9
5295A15k17K02Jl61K76q0J48J29l29J44K2l4J37m1K8k92J99o7n5j50K79k50L42
5318A46k63j00J61j92K46J49k06N6m0j66J68k96J51L5K76j40n3o9Q4J64j08k14
$$ plain form
5154 272 -33 149 207 192 57 204 -80 -229 -62 -7 146 76 -98 -121 -128 150 184 56 -61 25 -76 275 -48
5177 -48 -158 46 114 38 114 -2 23 27 242 129 -302 -141 -13 -212 120 104 -61 3 143 91 -177 280 31
5200 31 79 70 -138 259 40 158 139 257 -150 -67 214 -1 290 56 -437 5 300 14 66 -109 -82 -246 -132
5223 -132 78 162 -58 -132 -41 51 113 -110 81 -52 -54 -189 -44 83 -173 -2 -37 93 -58 103 68 29 -22 62
5247 62 108 102 -63 125 -68 -17 158 226 132 -152 92 107 6 -33 -2 -233 54 -457 -2 35 -53 155 242 59
5271 59 -192 -162 -14 -36 -273 -68 310 82 -310 11 69 -488 129 -229 -123 -27 -83 -98 74 75 33 -39 66 115
5295 115 -102 100 101 -260 16 -64 84 213 -116 28 50 16 153 112 140 -152 47 -20 -75 -225 54 -196 146
5318 146 -117 -217 -56 -248 -2 147 -59 -3 -43 -209 -41 -337 -186 -151 125 -15 -68 -137 -53 111 3 -211
5340b11J39J31j25n6K10j31M7Q7j89L91j86l50L04Q8l6q5j56J85j48K08J61k02
5362G6O8M3j87m9j3j78K79j64K62k24J21q9J52J44j49k28K44l06J81P6j76m9j91
5385c57M06j64l8K56l58K14k6K5J00P4j35p1R2L5j19L10k38J25j37j71M1K10j81
5408a07k0j60M65j48j56M25k20n1J16P5k32J07n7j65j32M59l72J55O1m05J97L38
5430A73j10K63n08L0K89k42J25J04l16L29J11KJ9l21Q3j48K81m41M23j34RJ82
5452B03l04p0J02K02N5j77k94L52m3L8p8JmJ74j96K7om6J6j14J17K9m3k50M31
5477A22j19p3p0J22j85R3L47p0k95O6O1M8J9J87m60J98q8R1PK02j82k89P4L02
5501A08k39j09K33P0k55M61Ok17P0r9R8j71L6j95O2o2K52j72o3J94l6L6J48l55
$$ plain form
5340 -211 -72 59 -66 -122 88 -43 4 91 -98 293 107 -243 61 149 113 28 -128 57 -91 117 278 76
5362 76 144 187 0 -49 -62 -240 39 -125 137 -87 34 -55 97 241 92 -136 108 -198 -17 59 -117 -166 -357
5385 -357 49 -115 -153 103 -255 -41 -67 -42 58 132 -3 -74 18 53 -66 244 6 131 -6 -177 -136 74 -107
5408 -107 -127 -287 178 30 -126 299 79 28 144 219 -13 94 37 -128 -260 199 -173 -18 43 -362 -165 173
5430 173 63 326 -182 -152 137 -105 20 124 -192 137 248 250 269 -52 31 -117 164 -277 146 12 21 203
5452 203 -101 -171 -69 133 188 11 -283 69 26 64 -14 -13 -17 157 -39 -12 -18 -64 -48 -162 -45 -16 -59 -309 122
5477 122 3 -70 -140 -18 -203 -110 237 167 -128 -62 -1 47 66 253 -207 -9 -97 -6 1 203 21 -268 -194 108
5501 108 -131 -240 -7 63 -192 269 275 58 128 29 127 -44 -8 -203 -141 -203 49 -123 -186 8 -28 8 156 -199
5525a99K85L9k25q5K11M8k12J86n4M8j12K98j01k7k72K10j03Q1L0r0J87j08mj43
5549a12L15m56K66J53j49J63O3k95j29k4lK5M8L63j03l9R6k55N7j13J32J74m11
5572b34J14K24k21j26J56J12j61J41J78k60J75l15J69l1q0M1R0o0L45m18ML43
5594A86j19l79M01R3k10j0n9J31k63J55J18l3j10k6j35J75j56J38J74k44K21K2
5616G0j08J41K3k03L11l22K15l12J90J71j94p8K31m7k55J12J4K0j09J72kj75L33
5639A98l19K5M0l9Q5j02J52j9J02m4N1j85R4R7l6p2R8nq6k3o2k5J98l21J49J06
5665E7j00J13k95K01j28M6J91O2l71J77K94j33r9r6o0K38Nj25K37k85k34L66J1
5688G2K88j76j89N5k73J85j33O4K47j37K1o0o3J30J2L5q9J1l0P9K09l18J41j5
$$ plain form
5525 -199 86 125 -100 -185 26 74 -138 48 -6 42 -70 228 127 100 -172 38 -65 16 46 -44 143 35 31 -112
5549 -112 203 -253 13 166 17 180 243 -52 -181 -205 -208 -183 -135 228 125 86 182 -73 -16 -129 3 177 -234
5572 -234 -120 104 -117 -243 -87 25 -136 5 183 -77 98 -217 -48 -79 -159 -118 -28 -88 257 -161 -157 186
5594 186 67 -312 89 182 -28 -38 -97 34 -229 -74 44 11 -99 -125 -260 -85 -241 -103 71 -173 48 70
5616 70 -38 103 126 -77 234 -88 127 -185 5 176 -18 -96 135 88 -167 -55 -41 -21 -130 42 40 -135 198
5639 198 -121 -96 -56 -95 -10 -112 40 21 123 79 130 -55 39 136 100 28 126 121 35 12 -50 -75 123 -198 -49 57
5665 57 -43 70 -225 -24 -152 -106 85 147 -224 -47 247 114 15 -81 -141 97 102 -23 214 -71 -305 61 72
5688 72 360 184 -5 50 -223 -38 -171 -107 140 3 24 -36 -99 31 43 78 -11 0 -30 49 258 -60 81 66
5712F6j65J83k6J95l21K25K05m38Oq4J25k1J31O5Oo9O0k22J00j0J11q7K4K75j23
5737B11k92N0P5M6O7l11J01k30K35R1J0M7k3j91M6J01q3L3j11K29Pj13L4j48K94
5762A75l6j36k98J81o7Q0l1L19p2j12K50L0k89M1J09k62J52j32p7J63P0P8k32
5785i6j08J59M5Q1m3k0J73k77j40N5K05p1r1L08k59m5j7l6J96j94J71Q4k34K66
5809A12k23j55L51j02QOK03K0l51J54J36m41L98k8j90J24Jk63L50m3LQ2j10J01
5833A43j16K3p0N3j21K65P3r8k82K79j70J3J35j85q4L22l2o0j05j53L0K37j9j76
5857i8K99k51J27l5j75o9K82J09m9r9np7j25J55l2R3j21j77L91J3j96L08l97J95
5881F6m44L54j40J63p3J61K2j2L0k60n7L20l10J08k4j19K38J58k88J37p6j9K39
$$ plain form
5712 66 -99 84 58 253 -68 157 362 -76 -70 -154 -29 -50 81 146 152 83 143 -79 21 11 122 35 59 334 211
5737 211 -81 -31 44 90 157 -154 -53 -283 -48 43 53 100 77 -114 -68 33 -50 -17 -128 101 108 -5 29 -119 175
5762 175 139 3 -295 -114 -181 -101 -132 187 115 3 253 283 -6 35 144 -118 34 -98 -175 -12 58 136 -96
5785 -96 -204 -45 0 81 38 18 191 -86 -226 -171 34 -37 -128 180 -79 -124 -141 -177 19 -175 -4 80 -154 112
5809 112 -111 -266 85 -17 -9 -3 200 220 -131 23 159 -282 116 88 -102 22 23 -240 110 67 70 152 42 143
5833 143 27 50 -20 33 -88 177 250 152 -130 149 -21 -8 127 -58 -142 180 148 88 -17 -170 -140 97 78 -98
5857 -98 201 -50 77 42 -133 -202 80 189 140 41 36 -41 -166 -11 -43 50 -71 -248 143 156 -40 268 -129 66
5881 66 -378 -24 -164 -1 -74 87 109 97 127 -133 -190 130 -180 -72 -96 -215 23 181 -107 30 -46 -65 174
5904A74j10Lk4J07r7K5J65k38oqJ93j42r3j28j23L54j42j5n9K18k21j12L53Jo1
5929A4j34K45kp8l15L23M2L1Q5j29k09K01O4q5L9J3m6o4m6j60L13l08J69j3J18
5954F8j31Q4J06p2j97J20j67K32p7r6K4j85K22J56j08L7R8p9J47j66K30j38k8
5977H0j84L61l72J04KK92j71k2j09M5K18q1j65m4J79n9j04o1M7N0qk85N09o1j58
6002CK28k74K56l03Q8M4k69K80j41k0J67J71k46p6J97p9m3K6K09q2k40k2j12L0
6026b08L02j70J35l82M04j59R5Q1PJ29k29P6K1k51lL41m06L28l37M46j42k36K14
6049E6oj46J70o4j05J27j5K7k30L13M8k55M96k08j38K24l32l4Kp2M45l03j7K68
6073B51j50m9j01J52k3j83m1J94j65L52k41j29K19l25J06M21k16o9K28k25J48
$$ plain form
5904 174 64 67 43 150 53 78 243 5 -1 -9 184 42 -51 -179 -302 52 -90 -105 -164 54 -167 -279 74 75 14
5929 14 -120 125 123 45 -270 53 95 126 211 82 -127 74 138 53 92 105 59 -5 -51 -211 102 -206 -37 -50 68
5954 68 -63 21 127 55 -142 -22 -189 43 -34 -130 -106 -291 -69 87 -21 16 114 35 182 16 246 108 80
5977 80 -104 257 -115 -11 -9 283 112 90 -19 26 244 163 -2 -46 133 74 -30 -91 -44 6 -2 -287 222 161 3
6002 3 231 -43 213 -90 -2 42 -227 53 -88 -108 59 230 -16 -92 105 26 -17 9 218 136 -104 -126 -238 -208
6026 -208 94 -76 59 -323 81 -78 17 98 105 234 5 81 102 -149 -152 189 -217 111 -226 220 78 -158 56
6049 56 50 -96 74 10 -95 32 17 44 -186 127 175 -80 416 208 70 294 -38 -72 -70 -142 303 0 -17 251
6073 251 101 52 -49 103 80 -103 -144 50 -115 237 -4 -133 86 -239 -133 288 72 3 231 6 154
6094A54j83k61K34J0J58l8j05n9K52k31J74l5k76K65j18M4r3Q3l2nK88k72L2N7
6118D3N5j02J3J24l9n9p6k2J55j33Q7k58J49rm1K40k2j63J78j30l2J92k43k2M4
6143g1j12J52J21N9l23k36N89p1k4j5j86n6O4K53k95L68m61L11n2p1K70n28K96
6166a8J20j56J26j39r1L5L31k22p1OK90j17j28l4J92N1l46Q6Q1J36k85K05MK5
6190H1rj34J40k84J67K2L5l4oNj40J27R3O8k6l47M51q7j09J76J22k24L4l18J60
6215c7P6m31M54L6J0j77M46n69K92MJ6k25L33l60L16l16L2L0K04j46L88j58l98
6238a80J42N1J30j27n6K3J71k27J67j23rN0p1J04J9L0rmk05P8J71j32J01j04%
6263a0j08m6M2L0M1K2L4K09j05j16j71K12j98k0K37k98L77l65k59O29P1j1l31
$$ plain form
6094 154 -29 -290 -56 -46 112 74 -31 -90 162 -69 105 70 -206 59 -59 -15 -108 -25 -57 -62 226 -46 -14 43
6118 43 98 -4 9 133 94 35 -41 -63 92 -41 46 -212 -63 -72 -113 127 105 -58 120 -10 -42 150 -93 -115 -71
6143 -71 -183 -31 90 149 -174 -410 179 108 84 69 -117 -173 -109 144 -151 217 -244 67 15 -56 214 -314 -18
6166 -18 102 -54 72 -67 -158 -123 208 -14 -85 -79 211 94 -34 -68 124 175 -171 -85 -4 132 -153 52 56 81
6190 81 72 -62 78 -206 -39 -17 18 -16 -22 -17 -157 -30 63 131 105 -242 209 122 13 189 311 87 121 -197 -37
6215 -37 39 -392 62 98 108 -69 377 -192 100 104 120 -105 228 -132 184 -132 -100 -70 134 -12 376 218 -180
6238 -180 -38 13 143 16 -40 -17 154 -73 94 -29 -38 12 -59 45 64 94 85 81 -124 -46 125 -7 94 -10 -10
6263 -10 -118 -164 -122 -92 -51 -29 5 214 109 -7 -178 34 -164 -184 53 -245 132 -233 -492 137 208 197 -134
6286a34J72q2j49K90k73L21j30n1l9k4j2J30j47K45n7K2o4J74j90j69J14K38k70
6309h5K42l03K74j01r3J6k13L50K8j09O4pmj39J10k38J95n3L19J4m36K35m3J26
6333A49k6M6k97J13Q8j44p4J06J78R3j55JPk24M14j34l30L19j48J16j88P7o3P8
6357BJ9j53j73K10j2lK96j31j3j98j94K43j3L41j10k97P9J57J17m69L34j79J50
6380Cnj87N5K13J8k47K93j52K87m71J25j5J14M3QM4j15J07l7p9j52Q7J1N6j62
6405a58J2J24j46O2J35%J1j11l7j03J16N1J41N5k89J48Q3l2J06k52j0m1L21l84
6429a98J69j30J81r4p3J38j56J52j54M2J11J23j00lO8J21j13l6J65k89K5J4P6
6452C9N1q7l5m9K77j7%j8k32P7j75K88J7j13j25J42J38l93n2M26k12J69k22J63
$$ plain form
6286 -134 38 -44 -193 97 -176 145 15 -36 -75 -99 -111 19 -128 117 60 82 18 192 2 -167 -53 185 -85
6309 -85 157 -146 128 27 -66 -50 -263 87 115 6 70 63 59 -80 30 -208 -13 -66 253 267 -169 66 23 149
6333 149 123 169 -128 -15 73 -71 -145 -39 139 232 77 78 85 -139 275 141 -189 130 -18 98 -90 -13 -76 2
6357 2 21 -132 -305 -95 -107 -110 186 55 42 -156 -350 -107 -120 221 111 -186 -107 50 167 -302 32 -147 3
6380 3 -2 -189 -134 79 97 -150 143 -9 278 -193 -68 -83 31 74 82 126 11 118 81 2 -150 -63 -52 4 -158
6405 -158 -146 -22 -168 -106 29 29 40 -71 -108 -211 -95 -44 97 152 -137 11 94 62 168 -84 -94 -135 186 -198
6429 -198 -29 -159 22 -72 -145 -7 -163 -11 -165 -123 -12 111 11 8 76 197 84 48 213 -76 -51 -37 39
6452 39 90 3 -32 -81 196 179 179 161 -71 6 -169 119 136 23 -102 40 178 -215 -267 159 -53 116 -106 57
6476E7j14o5J58P4j64l07K37k2K71J8k67L16O1m29K90j74K30R2j45j92p0K19J42
6499B16J4Q4n13L18k23J68r7J20p6r6K20j10K10k41r7J27j83K66J00j59l4J57
6521A71j30K73p4n84M92k80k9J47Ql3O8k8j05K43k8k2k10rk16M84o8n1M6K67l05
6546B7k48K46J44P3n9j70n8J60k56L65j52o7p4K43M5l79L54j22j78L07oj26P2
6569A41l24L58L2l46K82K8j92r7Q0J83j03L36n97L68j01j32J24P9r6N3l48P6J42
6592e4r2J89P0j95K1j06K02k85R1q9K51R6r4K01j43k46L5K85k90N8L44j03k96
6615a50K35rp9j28J68J02k08p9L13k28J06j11M4K09j26k01J34l03M02l5k3k11
6637a78K05j08J40l2j65J61J76r7K17j13k63N9m7j59K65l03J37j39J84J39r6j7
$$ plain form
6476 57 -57 -122 36 110 -54 -361 -124 -146 125 143 -124 192 253 -176 114 -60 170 262 117 -75 -145 74 216
6499 216 230 314 -199 119 -104 64 -33 87 11 -85 135 25 235 -6 -103 24 -159 107 207 48 14 171
6521 171 41 314 240 -344 148 -132 -161 -14 -6 -39 29 1 -104 139 111 89 -121 -130 -346 138 70 19 65 332 27
6546 27 -221 25 169 242 183 13 -45 115 -141 224 72 5 -69 174 219 -160 194 72 -106 201 195 69 141
6569 141 -183 175 207 -139 143 171 -21 -118 -38 145 42 378 -219 149 48 -84 40 119 23 76 -272 -196 -54
6592 -54 -146 43 113 -82 -61 -167 35 -250 -159 -248 3 99 5 206 63 -183 -148 137 -153 -95 249 146 -150
6615 -150 85 76 -3 -131 37 139 -69 -148 165 -63 43 -68 -24 185 59 -142 -8 -311 91 56 33 -178
6637 -178 27 -81 59 27 -138 23 199 102 319 206 -57 2 -45 -204 61 -242 -105 -244 -60 79 -17 -34
6659c4J18m8k69J21j7K2M03n09K82J0k16K84M5k24j06N4j13K00n1j40O6L1j01
6682a92J43J59j75N4P2j35J14Nj44O9J40j26j77L73j57j20K67l16J92R0k90n2
6704b06K45J64l43J07J74J29l64J82k71K65J63l43Q7j69L38k45L44j65j67jk2
6725i8J08q5J16j79K40k04J02o0j09J58Q2k38l5K54k74L81j45J33j24j13n8QL03
6748A63j74K7j70p8K75k00J79P4j04J14j9p4l6J64k91l7q2L02j11L28l03J80n9
6771F8P3j35j56P8J14j68L38j69j66M42r2k98o7K09Q8j57J33k21O1j9P7n1M3j22
6795i7J4K27j64O8j68rJ38Q3O4j36M5m2k81L03j5k8j59L49j94l45L52K77m14Q8
6819d4l03J19M89m70Q7J73Q9lj14m5J32j33j01J95j93J68Q9j56K02l6n8n6J3j1
$$ plain form
6659 -34 84 36 -233 -112 -129 -107 296 -213 69 79 -137 147 192 -32 -138 -84 -197 3 -48 -188 -122 -91 -192
6682 -192 -49 110 -65 -11 61 -74 40 45 -99 -30 110 -16 -193 180 23 -97 170 -146 46 136 -154 -206
6704 -206 39 203 -140 -33 141 270 -94 88 -183 82 245 -98 -11 -180 158 -87 257 92 -75 -76 -98
6725 -98 10 -75 41 -138 102 -102 0 -60 -169 -11 71 -167 -202 52 -222 159 14 147 23 -90 -148 -140 163
6748 163 -11 16 -154 -232 43 -157 22 96 -8 106 87 13 -23 141 -150 -187 -269 33 -78 250 -53 127 68
6771 68 141 6 -150 -72 42 -126 212 43 -123 319 227 -71 -138 71 159 2 135 -86 -25 -44 33 -18 25 -97
6795 -97 -83 144 -20 48 -120 -129 9 92 156 20 65 23 -258 45 30 2 -157 192 -2 -347 5 282 -132 -44
6819 -44 -347 -228 261 -209 -122 51 140 137 23 -22 110 -23 -124 71 -122 46 135 -21 181 145 87 31 44 33
6843C3j31r6J20J52o7P2j81O4K16j46j27k9J03K6J3R3l62K4J58L0k8J38J93j91
6867G7j79n0j81K97R6j15J90k02j2L48j07j7k59NK34l27N30k81j45k9P0J03j44
6890i8m1K55k84K08j65K81k86J84L10l09K37j75m0k03K83k36O0R3O8r2J18j75
6912gO0l37L11O7mj10K17j92J13l4M8k69L1J56o4k06L32l2O2k4k79J11J20O9L1
6937A70j07M9j47J31k54q0J54j13J36K65k27K17k18kj87K02J11N8j5j45M9N1m9
6960D9J54j78j6N5k1n3l58L85J28k78m6K64k09J86j63k93L43J83j76o8P4L78l25
6983A5K4M7j23Jj40L53j3j40j8R8j82l1M83m94K13k00J31Rj52j35K25K91r2k48
7007g8q7K81k20L32k41O9j84J7LR6P9P0j89K25p1j96R9l0onK06j75L61k99k4j25
$$ plain form
6843 33 -98 -194 -74 78 11 83 -98 -34 182 36 -91 -120 -17 9 22 115 -247 -223 -65 -35 -63 75 268 77
6867 77 -102 -152 -333 -36 60 -55 135 -67 -79 269 162 145 -114 -109 125 -202 328 47 -98 -127 -57 46 -98
6890 -98 -139 116 -168 40 -125 156 -130 54 364 55 292 117 77 -126 157 -79 -19 74 142 50 168 -7
6912 -7 53 -284 27 94 90 -20 197 5 118 84 132 -137 -106 50 -14 -220 112 80 142 118 -161 -50 70 139 170
6937 170 63 112 -35 96 -158 -238 -84 -197 -61 204 -23 194 -24 -26 -213 -11 100 158 143 -2 47 98 49
6960 49 203 25 9 64 43 -10 -368 17 145 -133 -179 85 -124 62 -101 -394 -51 132 -44 -112 -38 340 15
6983 15 39 86 -37 -36 -176 177 164 24 6 104 -78 -109 374 -120 93 -107 24 33 -119 -254 -29 262 170 -78
7007 -78 -165 116 -104 228 -13 56 -128 -111 -108 -12 67 137 -52 173 102 -94 5 -25 -31 -36 170 -5 356 57 33 -92
7033i2P1M9l6J79j66lJ61ok19R8P4j28l3o5J68l02L68k36Q6J93k46QJ06j14r9
7058a84R9J17j66k7J41J12J8K9k28j58M06m21M11J61k44J7k73K41l9J36j07l25
7080b84R2J63J72p5j41k30K07L00j6k65rJ34k15l0M11o0j34J85j22k05K7Q7j22
7103a30jM03m95L28j31Q1N1r6J71q0R9l38j43J73q1Q2K19rk51O2N6m2nJ12j46
7128a11r5J3Q1K01j1O4l05M1J76L3l44L31l4j07J89N3l35J02M21n84K75k72L86
7151A68q1j33P0j32P4r6R2L0J4J24j86oJ30j31L30k29M9k01p4M51j57m8m0K34
7175B52r9l18q9K74O5o9j17L87j99J44j79q0J83j88k00J94J02r3l2q9K20j9q8
7198c8J47K2o1o5m6J02j30j1Q2L7r0O9j08K53j59k97L12pk65K20N1K15k76J86
$$ plain form
7033 -92 -21 28 -8 171 5 2 163 157 -62 36 110 -18 -51 -116 52 -250 118 -118 -32 161 -85 -77 29 -85 -184
7058 -184 -85 32 -134 -161 -20 92 110 139 -89 -247 159 -262 149 310 66 83 -190 51 12 148 41 -284
7080 -284 -192 -29 143 68 -73 -303 -96 204 188 -77 -86 48 -167 -197 214 154 20 205 83 -122 -95 -8 -130
7103 -130 -131 272 -223 105 -26 55 106 10 181 101 200 -138 -281 -108 -189 -107 112 103 -148 -86 -30 -72 -77 35 -111
7128 -111 -206 -193 -112 89 78 142 -163 -122 54 87 -257 74 40 -67 122 175 -160 -58 363 -221 54 -218 168
7151 168 87 -46 24 -108 -34 -130 -38 -8 6 130 -56 -62 68 -63 267 38 87 -114 -188 263 106 58 18 252
7175 252 153 -165 -254 20 85 16 -101 286 87 231 52 -28 155 -33 -233 -39 63 -30 -62 -151 69 50 -38
7198 -38 109 131 70 5 -41 61 -69 -80 2 39 -51 18 -90 163 4 -293 19 12 -253 -33 18 233 -43 143
7222A43j9k66L86l17J91j67K86k71P8o5j9j16K00J34j19J80l16p4K77j00j76o
7244a56R4M6j58M43M8l61O8J7J6j30M5R8l39o7M94j05o7L9K02j12K3l48J48J34
7268G2j16k92J40n3L07L4J1q0k37o0K43p7R8j54Q8J33j23l4L07m53L78K32l12
7291E2k47J39J34j42J78Lj20j25K9l2R4J56j37l3L15m05K22j56l00O51k36m8j91
7314a99Q6n1O4k2J47N2l55J32L86k74j52J65J02M0j04O2l9L5l71K85p4KN2n4r6
7339a81J4n7J03L78k70j3j03J40j04m2J89l15J24L0R2J45J81l89P0l9j13m9L89
7362A80l57J98j28M38j95P0j56j74K00j60n3m1J12K36r5j43J64m4J47o00M07q6
7384h0O2Q8O3K9k66N8j22K88n8l19J50J55j41J38jQ8O1k65J01J44k4l4l56K07
$$ plain form
7222 143 124 -142 244 -73 118 -49 237 -34 44 -21 -40 -156 44 178 59 239 -77 -151 126 26 -150 -156
7244 -156 -62 -16 -174 269 317 -44 24 41 57 -73 -28 70 -269 -336 158 53 -14 25 227 115 138 -210 -62 72
7268 72 -44 -336 -196 -249 58 92 103 23 -214 -274 -31 -108 -10 -164 -76 57 -66 -100 207 -246 132 364 52
7291 52 -195 -56 78 -64 114 117 -3 -128 -99 -131 -37 119 -18 -51 264 -141 81 -75 -375 276 40 -8 -199
7314 -199 -113 -164 -100 -122 25 77 -278 -146 240 -34 -186 -21 81 121 17 79 40 75 -296 -11 -85 -83 -31 -85 -181
7339 -181 -167 -224 -121 257 -13 -26 -129 11 -93 -135 54 -261 -137 -107 -15 130 311 -78 -8 -47 -160 -209 180
7362 180 -177 21 -107 331 136 206 50 -124 76 -84 -137 -178 -66 170 75 -68 96 52 199 -401 6 -80
7384 -80 -18 70 133 162 -104 -46 -168 120 62 -257 -107 48 -93 45 44 132 193 -72 29 173 149 115 -241 -34
7408c4k38P9J90J9J73l45J13N1l8J99r8q0J36k58J10j09J20m7K29n8k16J04k32
7431b30L36j57J1K09n2k09k7j44J03L74k87J08K66k71j79L52k08N4J37j30J00
7452A56o2j09O4J79k44j8j1K23Q0r4l51J58K09j26J6J50k24K02j49qJ51j29J27
7475A90j11j28J47J0j09K4oo1J77rL8o7J2j16J72nj05j30qM8j79J45K14L5l65
7500a87J81j56K04N7k77J61J95Q2k98K10j22l42J28K06r3L74l25q8N8P9P0j07
7522A0k47L2M73k55r7K85l0j96L7K30m36R8M3k2k1j49L21j53n4J25J12j65q1k9
7546a69J72J3k46Q0L41o0j5j66N7K0p8N5Ro7l12N46k13k14J27K55j18mMK9j34
7571h8J27k2J31j26j10PK71k26L78m56J67l1n0M5p9K08m11J41L47k38J65p2j97
$$ plain form
7408 -34 -272 -193 -3 16 189 -156 -43 8 -30 169 71 -9 127 -131 -21 -130 -10 -57 172 114 -102 2 -230
7431 -230 106 -51 -40 169 117 -92 -119 -263 -160 214 -73 35 301 30 -149 203 -5 49 186 56 156
7452 156 94 -15 49 228 -16 -34 -45 178 258 164 -187 -29 180 54 70 220 -4 198 49 41 192 63 190
7475 190 79 -49 98 108 -1 23 17 -44 133 124 162 95 107 -9 163 158 53 -77 -85 -37 -216 -71 143 178 -187
7500 -187 -6 -162 42 99 -178 -17 178 260 -38 172 50 -292 -164 42 -51 323 -2 -90 -32 47 117 10
7522 10 -237 -205 268 13 -84 201 171 -25 12 242 -194 -96 -53 -75 -96 -245 76 -77 -131 -6 106 -59 -140 -169
7546 -169 3 16 -230 -150 191 131 116 -50 7 27 -51 4 13 -54 -366 180 -33 -247 -120 135 17 13 17 46 -88
7571 -88 39 17 148 22 -88 -81 190 -36 342 -114 53 22 -28 17 -62 146 -265 -124 223 -15 150 78 -119
7594a19m7K72P6l44K89k11L44l47M09l97K81k49k0o6K54k4N9k26K4L4LK6j52K83
7618A52j04K6k5R0l92P2K10J30j00N1j08M0k58K74j1k48Q0P3K43l04j20J63l6
7641a02k4O7j30O8J54K09j66j34L54k72k9J28m5k4lj24j2K02k09P8J50l97M67
7664B06l74qJ66r1Q4k02J34j09J77L0L4N0n6O0Q1k85K45l33K23K4n9j11n2K43
7688G7Q4j36r1r0J07J55j88n3K1J30n8P0P0k74J59Q6k05j13K96m8j79J60k5k9
7712g4j75J57K65J20n10K85m8p8j7PN3n7P6J99j35j94K49k45J54M6m3N6k78J42
7736d5j03k1K65k17q8J71QJ3J07j37p7P9O5j77p5L27j13K28k41m2q4P6J09j7j50
7761a39L21Pj91J34k49K0J39k54K46o6rL08l60l2J42l9K43k51q1L6J45k06J59
$$ plain form
7594 -119 -166 106 182 -162 127 -84 260 -87 322 -75 206 -43 -63 -129 125 101 160 -66 -42 -8 -5 21 -131 152
7618 152 48 74 49 139 -253 -181 29 159 59 110 2 42 -216 58 47 -201 -121 -48 195 -109 -229 -66 -102
7641 -102 -126 -59 -189 -121 33 242 76 -58 296 24 -5 123 78 54 51 -73 -85 117 -92 -14 136 -261 206
7664 206 -168 -176 -10 -101 -17 -219 -85 -194 -17 13 47 97 41 101 182 -103 142 -191 32 56 -3 -114 -166 77
7688 77 161 25 -66 -156 -49 106 -82 -135 -114 16 -42 28 98 -176 -17 69 -136 -249 47 -1 -180 -20 -45 -74
7712 -74 -249 -92 173 293 -217 68 20 -58 -75 -68 -15 -72 4 203 68 -126 123 -122 32 78 35 91 -187 -45
7736 -45 -148 -169 96 -121 -209 -38 -30 -17 90 -47 -124 -45 20 -157 -232 95 -18 210 -31 -73 -157 -81 28 11 -139
7761 -139 182 189 -2 132 -117 -97 42 -212 34 -32 -41 267 -93 -125 17 -22 221 -30 -111 -75 70 -136 23
7784B3l59J03L71M9j12j40l8j00K21j06K79m05M85l05O7L9j82J45j2L48m36J97
7806A32k07q8L46j44j51O9K3q4L14l9k64j3Mj83M11l01J96r5L41l61K81k36k27
7829b76J48K1R6j69L80k2k22Q6K3o5j90K6K10j26lL6O1j8Q9j73J95pJ54m5j03
7854A06O0k47J19m9m3n8J68O4k85L61j62J7q8J92k06J93L1j95J3j56J16p0J01
7877a8lJ99o8J78l52k24m3M18j5n8nr2O5p1R5m61L29r0L50l00K84k10Q7j16L43
7902B22k46m01K71K57P8k8l29L45l97M02p2j48J58M4j93%Q4J0j10K9J55K5k80
7925a24R7J22p1m5J55k39RK79j70j36r7M61r3j22m2M6J14k15L1L8O6LJ8O9k18
7950f4P0k5l5J40N4J45l01O1l3n9j21K24l11K52M6j54J07J32l65L86jn3nj76K61
$$ plain form
7784 23 -336 -233 138 187 75 -65 -103 -203 18 -88 191 -214 271 -34 33 72 -110 35 23 371 -65 132
7806 132 -75 -163 183 39 -112 -43 -20 -104 210 171 -93 -106 -102 -285 126 -175 21 -74 267 -94 187 -49 -276
7829 -276 -128 -107 -11 -180 200 178 -44 42 65 0 -190 -164 46 -80 -83 -47 14 -4 85 -88 107 100 254 209 106
7854 106 166 -81 38 -11 -54 -112 56 120 -165 196 34 51 -37 155 -51 142 173 -22 -9 -165 -49 -119 -18
7877 -18 -21 178 110 288 -64 -288 -331 87 72 14 9 -83 -18 -89 6 -455 -126 -216 134 -166 118 -92 -5 -121 222
7902 222 -24 -425 -154 103 181 153 -176 169 -228 174 102 -46 112 156 -37 -37 47 57 -53 -24 131 156 -124
7925 -124 -27 95 24 -21 134 -105 -96 183 13 -123 -220 241 148 26 -16 30 144 -71 -40 -2 64 67 85 154 -64
7950 -64 6 -19 -54 86 140 285 -16 45 12 -47 -168 56 -255 -3 43 -111 -4 128 -237 149 148 95 90 -86 175
7975A75m79L92k49K74o4J99k94J0q0J56k20K30J94q6P0nl9k69R6k4j31K73j52
7998b3q2J70k02R6M3j64J23p4N6J47j23J63k9J0l39R5K58j17r7J64k7k06K50J18
8022B10o4n1K55l70K17N1j69M0j8J0j13q4q0O3k2L18l47j67L34o5J1M9j11J39
8046C6j94K36j47j42L9J16L25j57L7j28j96J53Q2M5k03O3l9l1P4R3O6m0L5o1j41
8071g9K07r0J75j33l4J42k21L9O7R4j3j2o9r2j13j14M02l65kL91j76N2m9J67p2
8096A02j17Q6j45q0J03K02n0P2K5m9k79L1L00j5j37O1m4j53k58L09K12q7j19j53
8120a83K21j1j17J80l09L59m1p7j95J95K97n70n2M70k01K48j89R0M9j95j36L5
8142a32L86l17J52O0l40J68r6J52m6L18k44n6L7k36K74j25J58p7k03K23n2J21
$$ plain form
7975 175 -304 88 -161 113 49 248 -46 -36 -116 40 -180 50 244 158 228 223 184 -85 11 -13 -144 129 -23
7998 -23 -105 65 -137 -41 2 -162 -39 -113 -57 90 -33 130 101 111 -228 -133 125 8 -89 75 48 -158 92 210
8022 210 146 95 350 -20 197 248 79 119 101 111 -2 -86 -166 -103 -125 193 -154 -321 13 -52 -41 8 -103 36
8046 36 -158 78 -69 -211 -172 -56 269 112 149 21 -175 -22 60 105 -98 -35 -74 -105 -31 62 128 88 123 62 -79
8071 -79 128 38 213 80 46 188 -33 6 73 167 154 142 73 -19 -132 -246 156 -209 -211 180 4 56 7 174 102
8096 102 -15 71 -74 -154 -51 151 101 173 198 149 -130 -99 201 186 49 110 66 -87 -345 -36 176 89 -30 -183
8120 -183 38 27 -90 90 -219 140 99 22 -173 22 319 -251 -303 167 -34 214 25 115 164 -31 -167 -132
8142 -132 254 -63 89 149 -191 -23 -119 33 -13 305 61 5 42 -194 80 -45 113 36 -167 56 4 125
8164A25j35k20L86k30J0R7J26k47J61j13j83R4K60k62k1K73l86K10J91J00l19
8185h3K03lJ42l97L7N6
$$ plain form
8164 125 -10 -230 156 -74 -64 33 159 -88 73 -40 -223 -129 131 -131 -152 121 -265 -55 136 236 -83
8185 -83 120 117 259 -138 -101 -45
8191d5
$$ Imaginary data points
##PAGE= N=2
##DATA TABLE= (X++(I..I)), XYDATA
0@%%%%%%Pj4J4j4J4k1L5m9O3p7R1j12J40j68K03k45K89l40M01m69N46o37P35q41
30d49R66j104J253j421J607j812K038k285K555k852L179l536L924m350M814n320
46b793N875o479P139p867Q668r548J0521j1602J2812j4174J5715j7477J9513k1898
60a1595K4742k8195L2493l8017M5407n5861P1879r9733J61566n29879J58843Q20316
72E51966p90842J21945N52103m95756m17781O95237O6503l66014K45472J02974
82B65807m93294P9607L68416j13972j73620J30331m0188j33364J0807J27066L9279
93F6875j64104j36663J96450P5891j47261J84581J73409l78880q1781L93891j05360
104G7048k05966L80012j8484m74331K13421K70517m25080L6461M81115l26708
$$ plain form
0 0 0 0 0 0 0 0 7 -7 7 -7 7 -14 21 -28 35 -42 49 -63 77 -91 112 -133 156 -184 217 -252 294 -343 392 -449
30 -449 517 -587 666 -755 852 -960 1078 -1207 1348 -1504 1675 -1861 2063 -2287 2527 -2793
46 -2793 3082 -3397 3742 -4125 4543 -5005 5516 -6086 6726 -7448 8267 -9210 10303 -11595
60 -11595 13147 -15048 17445 -20572 24835 -31026 40853 -58880 102686 -427193 -268350 551966
72 551966 -238876 -116931 435172 -60584 -478365 216872 283375 -82639 162833 265807
82 265807 -227487 -147880 220536 106564 -67056 63275 23087 -110277 -99470 27596 66875
93 66875 -97229 -233892 -37442 38449 -108812 75769 249178 -129702 -211483 182408 77048
104 77048 -128918 251094 232610 -241721 -28300 242217 -182863 -146402 334713 8005
114H005l67017M42966O0162m36591K09150K87609l19351k5058L15387j47278j62330
125a34346K15266n635j45119J52512P7079j50925k7284K5405n1416O196J8412
136a9855J4723N3456o7341q2852J09013J8236j17086J02030R1694j62824P996
147e2810J44130j22860m7014J84526p2187j16634K07089K907k51885R9629J37652
158A12543k17121n083K36223r9258j44184J43432r369j34228J25760Q5600j23665
169b9350K8140P6655j19831k9165J21446j6434n4891N8358N119n2649M456j554
181i700o987K3824j8610j0862M6036k1840m9301M2893J1933l4357N4832K7771
193E5632o4097J9761K5194r0536J3468J06090n7116n9382R7431j2975j11822N9264
$$ plain form
114 8005 -359012 83954 144116 -292475 -83325 204284 -115067 -140125 175262 27984 -134346
125 -134346 80920 75285 -69834 82678 159757 8832 -18452 6953 -44463 -38267 -19855
136 -19855 -5132 48324 -19017 -101869 7144 25380 -91706 10324 102018 -60806 -52810
147 -52810 91320 -31540 -78554 105972 33785 -82849 124240 127147 -124738 -25109 112543
158 112543 -104578 -109661 126562 27304 -116880 26552 17183 -117045 8715 94315 -29350
169 -29350 -1210 75445 -44386 -73551 47895 31461 -23430 34928 40047 -12602 -8146 -9700
181 -9700 -16687 7137 -11473 -22335 23701 1861 -47440 -4547 7386 -26971 27861 55632
193 55632 -8465 11296 36490 -54046 -40578 65512 8396 -50986 46445 33470 -78352 -19088
205a9088O7133p7119P662O9450o1393l3617O7741k4165m2808P3615K3294n9989
217i284K2022L3839n4664k3084L8015K933j2559M716n676p912o246j0242J8357
230i785K6401r546o265P522j9518o360K3090o583j820L6460j0217l8258K9128
243A4249J5512n1162N510M6664k8999k8028L2290j0334l6621K5470K0168j7715
255a2996K0027K1212l3855j0970K6794r485j3720K9751J1316k5458n451J1728
267H893l870n947L755M178j046j0074j0904l10p26j975Q270O996L348J0999k632
282H955j7003P759J3991j3413k05K4313r721k6839R853J1519j4184N028J5763
295A5816j1932j1509M186j1119q157J6906L910j1589J1813J3320j3448n227J7105
$$ plain form
205 -19088 48045 -29074 -21412 48038 -13355 -46972 20769 -3396 -46204 27411 50705 -9284
217 -9284 12738 46577 -8087 -31171 6844 9777 -2782 1934 -3742 -11654 -17900 -28142 -9785
230 -9785 16616 7070 805 8327 -11191 -17551 5539 -1044 -2864 33596 23379 -14879 14249
243 14249 29761 -21401 -15891 30773 1774 -26254 6036 -4298 -40919 -15449 4719 -12996
255 -12996 7031 28243 -5612 -16582 10212 727 -12993 16758 28074 2616 -2835 8893
267 8893 5023 -924 2831 7009 5963 -4111 -15015 -15325 -16051 -18026 -9756 -2760 588 11587 8955
282 8955 -8048 -289 13702 289 84 24397 14676 -12163 -2310 9209 -4975 53 15816
295 15816 3884 -7625 -3439 -14558 -22715 -5809 -1899 -13488 -1675 11645 -1803 -7030 10075
308A0075L445j1052L082Q950n885j2839k583N525J827o67L431K455m878n915l373
323h402k807M864P222o581l770J3355P6j3812J1000J8732j2167r719J4440j926
337A0505j8246K706O853p800J963Q408o966j291R644p157j0161J3004N984j4621
351g175j8J1935n107p963R589Q814l919k538J976k29m919m588J252O15l524J631
367d168K982k746K857N913n626j763J1512m134j3743R722Q531j6675j018J9747
381A1391n974j2787J2787L231j4106M170O048j3255R16J0565j0808l010J7858
394G026j439j3148J0919R315j1678k774Q382k248n473p6o50R06R48l138K181M713
410C766m129k814J842l740q31M710l893J304J1962n487r732J5276N286j7354N480
$$ plain form
308 10075 13520 2468 5550 14500 8615 -4224 -6807 -1282 545 -122 3309 5764 886 -5029 -8402
323 -8402 -11209 -6345 877 -5704 -9474 3881 3957 -9855 1145 19877 7710 -2009 12431 10505
337 10505 -7741 -5035 1818 -5982 -4019 4389 -2577 -3868 5776 -1381 -11542 1462 7446 -7175
351 -7175 -7193 4742 -365 -8328 1261 10075 6156 3618 5594 5365 446 -4142 -2890 -2275 -5799 -4168
367 -4168 -1186 -3932 -1075 4838 -788 -2551 8961 4827 -8916 806 9337 -7338 -8356 11391
381 11391 5417 -7370 5417 8648 -5458 -1288 4760 -8495 -7579 2986 -7822 -10832 7026
394 7026 5587 -7561 3358 12673 995 -1779 6603 4355 -1118 -1194 -1844 -938 10 -3128 -947 3766
410 3766 -363 -3177 -1335 -5075 -5906 -1196 -5089 -3785 8177 2690 -7042 8234 13520 -3834 1646
425A646J4500j4804r545J2864o337j0329J3269J520j2298J1480N431j9315K850
438i068J7045j2570o836J8727K3j4417O862O721n676M422N456n631J93j11j0284
453e144j465N743l502l75N284l002j427K475n968K743J1356p586m959J5020l367
468E826j8599J2230J2943j3802L380J5732j3547j0351J1601p432j0641J6942J537
481E819j8458Q196J0893j7412j348J9107k651q677Q748J244q369J281K26q32Q902
496F669Q29o030N102j493j1377L210N620n827L851L977j3078q56J1445r155l286
511a0399K2142k68j9351Q867Q528j7296o25J6901n064n657J0029m264r516P167
525A194P21p391P926O277r957m018K244l845O55M737L199O853k230j2574K735
$$ plain form
425 1646 16146 1342 -8203 4661 -1676 -12005 1264 2784 -9514 1966 7397 -11918 -9068
438 -9068 7977 -4593 -11429 7298 7321 -7096 -234 6487 811 5233 10689 5058 5251 5140 -5144
453 -5144 -6609 -866 -4368 -4743 541 -2461 -3888 -1413 -7381 -4638 6718 -868 -5827 9193 5826
468 5826 -12773 -543 12400 -1402 1978 17710 4163 -6188 5413 -2019 -12660 4282 5819
481 5819 -12639 -4443 6450 -10962 -12310 6797 4146 -4531 4217 5461 -2908 -1627 -1401 -2233 6669
496 6669 7498 1468 6570 5077 -6300 -3090 2530 -3297 554 4531 -8547 -9403 2042 -7113 -10399
511 -10399 11743 11475 -7876 991 9519 -7777 -8402 8499 3435 -2222 7807 3543 -5973 1194
525 1194 1915 -5476 2450 8727 -1230 -5248 -3004 -6849 -6194 -1457 1742 8595 6365 -6209 -3474
540c474Q424r995p07J7994n258j5369R035L690j4764P504J4680j2145k309J4117
554A1423j2032j4973J5183N208j4217Q764J5826j2705j1013Q746P41o586O003
567C68P191l271n671l545o04J312K436N460M132n068k069K574p978l677J2704
582D294J532j2089R140Q699j8628m918J8190l992j1225J6439N384k0387m24J0151
596B166j1694R4K0253k025j2650Q130J824j6153L212J6362l260q420N598J121
610D558j0201l155P644M660k322K4M138m079r409J334M407k097M151J0024n566
625D111q558N534j36q909J0111J2499j0990p321P886p030j0182J2072Q498p970
639c85J634M907j0644m327Q350j890k981R864K397r732k13N087m654j796R214
$$ plain form
540 -3474 4950 -5045 -5752 12242 6984 -8385 650 4340 -10424 -2920 11760 -385 -2694 11423
554 11423 -609 -15582 -399 4809 -9408 -644 15182 2477 -8536 210 951 -5635 368
567 368 7559 4288 -1383 -4928 -5532 -4220 -1784 3676 7808 2740 671 3245 -4733 -8410 4294
582 4294 5826 -6263 2877 11576 -7052 -11970 6220 2228 -8997 7442 12826 -7561 -7985 2166
596 2166 -9528 -9434 10819 8794 -3856 4274 6098 -10055 -6843 9519 6259 -2161 3437 4558
610 4558 -5643 -8798 -1154 3506 1184 1208 5346 1267 -8142 -6808 -2401 -4498 -347 9677 4111
625 4111 -4447 1087 951 -7958 2153 14652 3662 -3659 4227 -2803 -12985 -913 7585 -385
639 -385 1249 6156 -4488 -8815 -465 -2355 -5336 4528 6925 -2807 -3020 2067 -2587 -4383 4831
654D831M907m169l871j954k733l071K138P092L046n008j801p28n128J12P810Q83
670B356k898M466j580q991K131O832k970N50Q963j352q175M67m13n312L312O398
686C784q05q50k01p169k878O064K317L99M531n83q111k666K909Q89L069M592j03
703E188k132j986l153p28K268J285J209K036k092l607j760j487K93N616L556k469
719B037P0j385o840q98O814K843K6K292j579o304m85K811J92L235K626l764k562
736h71L19l312j257N066K184j304K182K1n292j873J505P46K295M231p36l953j403
753a452j963J32L600L891P9r84l460l632N63J324J458K905J777l580j449M24k512
770b879l0L619P81o45J138j480m472K21K365N73L196L258k968l587o33j958N19
$$ plain form
654 4831 9738 5569 1698 -256 -2989 -6060 -3922 3170 6216 1208 -593 -1321 -6449 -6337 1473 2356
670 2356 -542 3924 2344 -6647 -4516 2316 -654 -104 8859 7507 -668 -201 -614 -5926 -2614 3784
686 3784 2979 2129 1928 -5241 -8119 -2055 262 661 5192 4609 -3502 -6168 -3259 -2370 699 5291 5188
703 5188 3056 1070 -2083 -2811 -543 742 1951 3987 1895 -1712 -3472 -4959 -4666 950 4506 2037
719 2037 2107 722 -6118 -7016 -202 2641 2667 4959 3380 -2924 -3409 -598 -406 2829 5455 1691 -871
736 -871 -552 -3864 -5121 -55 2129 825 3007 3028 -2264 -4137 -2632 -1886 409 4640 3904 -49 -1452
753 -1452 -3415 -3283 317 4208 4287 3303 -157 -3789 -3226 -1902 -444 2461 4238 658 -791 -367 -2879
770 -2879 -2909 710 1491 846 1984 504 -3968 -3747 -1382 -809 2387 5645 2677 -910 -1543 -3501 -2982
787b982M756K433k201r08j490l320M69L725Q73K11O70j806k851j11j63P78K209
804B92J822m2m30j767j663l59R01K133K648j07k497j714q21j287K069L608J08
821B894j781j151k495j278J695J302Q05J893j6k745j50J394j430L96K782Q55j180
838A790q96j540j825O85J604J446J333j19k647k426l24J338R98J451Q62q54k545
855a669j192J906J334l69J736J451k374j213L03r34N5J931N15r21J347p50l966
872b810K17K500o93j9L036j538l065J58J007L39K266P70p07o89p24j423Q93J620
890A138j69J31k18p29n1m79j527J229K051j803o21K942k184l488K705J426j047
907f94K225J391l226m9J335k458L84M093j471l112K418k79k776J890J875j815
$$ plain form
787 -2982 1774 4207 2006 1098 -392 -3712 -3243 482 1355 1566 2236 430 -2421 -2532 -2695 -1917 292
804 292 2114 2072 1642 -125 -1788 -2147 -1246 887 3535 3428 931 -783 -1604 -2891 -822 2786 2894
821 2894 1113 -38 -2533 -3811 -2116 -814 -9 1884 1868 -877 -1027 367 -1063 -667 2115 2970 1790
838 1790 894 -646 -2471 -1786 -182 1264 2597 2478 -169 -2595 -2919 -1581 -583 868 1730 876 -1669
855 -1669 -2861 -955 379 10 1746 3197 823 -390 -87 -1021 -966 965 1480 559 1906 1156 -2810
872 -2810 -2593 -93 -786 -805 2231 693 -2372 -2214 -1207 -868 1398 2168 1461 772 48 -1375 -482 1138
890 1138 969 1100 882 153 102 -377 -1904 -675 1376 -427 -1048 1894 -290 -3778 -1073 353 -694
907 -694 1531 2922 -304 -353 982 -1476 -1092 3001 1530 -1582 836 557 -2219 -329 1546 -269
923b69O94N63k371K63J492k737N49L555j259j649K298o59k288J622J435j102J791
940A928m06k970R35J574k754J129L586k491k408K199q74j412K594m52k042L099
956A235p0l816K702K382m283K65M380k352j719K582j425j879L350J20k968K948
972A452J000m794R71L278k774m92K605j161j766J898r11m67K541j536j484L040
988A400p6k924K026J602l087Q30K310k716N18K420l403o57M197k156l276M259
1004A267L46m864K264K919l172Q6K514k402k15L179k117j535L703j014k941K507
1020E25J357k605Q26J183k241J178R05k859J415K397l759m91M057k177k639L888
1036I60L62l094K235J141l301J870J890k940K40L429k698j774L224o14k879K241
$$ plain form
923 -269 425 988 -1383 -1120 372 -2365 -1816 1739 480 -1169 1129 470 -1818 -196 1239 137 1928
940 1928 1522 -1448 -513 1061 -1693 -564 3022 531 -1877 322 -552 -1964 630 178 -1864 1235
956 1235 1165 -2651 51 2433 -1850 -1585 2795 443 -1276 1306 -119 -1998 1352 1472 -1496 1452
972 1452 2452 -2342 -1371 1907 -867 -1359 1246 85 -1681 217 -694 -1161 1380 -156 -1640 1400
988 1400 1324 -1600 426 2028 -1059 -229 2081 -635 -117 2303 -1100 -1757 2440 284 -2992 1267
1004 1267 1613 -3251 -987 1932 -1240 -1154 1360 -1042 -1257 1922 -195 -1730 1973 959 -1982 525
1020 525 1882 -723 103 1286 -955 223 1128 -1731 -316 2081 -1678 -2169 1888 -289 -2928 960
1036 960 1322 -1772 463 1604 -1697 173 2063 -877 -637 2792 94 -1680 1544 930 -1949 292
1052B92J014k327J475k58j900K007M21k774J819K233k941m53L084k299q05L047
1068A635j217j661L312p37m175L185K083m410J058L780l277j739K869n54k304
1083b152K539M69j876J506L08k442R78J628j307K71J542j317m34N19j151P23J833
1100A637j734j64K503k357k593K823R34k966K295J944l624M6K794k781o01L883
1116B039j170k691K994K42l747J514K717k067j78K483j972j093J070m50p77K221
1132A135l45q92M33k89j861J422Q30o55J218k44k019J505M25k368J263K529j549
1149E38j632K476q62k504K100J170j921J443R19k254q73J904j580k00K568l18
1165I74k163J081j51j511J413P24j21M96K86j743K83J008q08L11J474n24r74J80
$$ plain form
1052 292 1306 -1021 454 196 -1704 303 724 -2050 -231 2002 -939 -1392 1692 -607 -1412 1635
1068 1635 418 -1243 2069 1332 -2843 342 2425 -1985 -927 2853 -424 -2163 706 152 -2152
1083 -2152 387 856 -1020 486 794 -1648 -670 958 -349 -78 1464 147 -287 232 -919 -196 1637
1100 1637 -97 -261 2242 -115 -2708 115 1049 -1917 378 2322 -1302 -1256 1538 -1243 -1844 2039
1116 2039 869 -1822 1172 1414 -2333 -819 1898 -169 -347 2136 164 -929 141 -309 -1086 1135
1132 1135 790 -102 331 42 -1819 -397 433 -222 996 752 -1267 238 663 -1705 -442 2087 538
1149 538 -1094 1382 520 -1984 116 1286 -635 808 1727 -527 -1400 504 -1076 -1276 1292 974
1165 974 -1189 -108 -259 -1770 -357 367 246 742 1028 -715 -432 576 -232 79 1553 1029 55 235
1183B35o93p34J178K33n24J264l12k380N03J395r30L19J916r78j021O81n08n73
1201i29J540N52j155Q09N9j836K50J102o56L92R27o50q77J71o87m71J344O19n75
1220g1P37L5j935M08J060k6O00R41r29q83M5o12J38J217M0o96M33n78j117M92
1240g01M00o1L68J181r63o92M98r07O9J342R10p07K28j015q33M41N51M65K70J00
1260I44j109n40K69j53j4R53o4k83J34m55p61N14Q04q0N25J70o45l60J60p53P00
1281d4J037k1m41j47r80j019J041Q25o7L86N1j157n59M35K05M87N85N1l55k0n57
1302b64m34P62J77j8L70R3o93o17KN5O62J180o18l94j34p90o13Q71J072l80N20
1323H09n32j000l10L38R5O71J239q67n19K58n96m57P95J059k37m7J78j570m35
$$ plain form
1183 235 -458 -1192 -14 219 -305 959 647 -1733 -1230 165 -765 -446 1470 492 -529 152 -356 -929
1201 -929 611 1163 8 817 876 -960 -710 392 -264 128 1055 405 -472 -301 -988 -1459 -115 504 -71
1220 -71 666 701 -1234 -826 234 208 808 1749 820 -63 -18 -630 -492 725 765 69 502 -76 -1193 -701
1240 -701 -301 -362 6 1187 224 -468 30 -877 -808 534 1444 737 965 -50 -883 -442 109 574 844 944
1260 944 -165 -705 -436 -589 -603 350 286 3 137 -318 -1079 -565 239 159 684 854 209 -151 9 -744 -44
1281 -44 993 972 531 384 -596 -1615 -574 251 184 570 621 -536 -1095 -660 -455 32 617 668 313 293 -264
1302 -264 -698 64 241 223 593 686 -7 -624 -622 -567 95 1275 657 263 129 -661 -1274 -403 669 289 809
1323 809 277 -723 -1033 -695 -600 71 1310 443 -76 182 -414 -871 -76 983 746 699 877 -693 -1128
1342a128P36j40M11J035l20q90m70j81o2J273K98k03r5l79m10R0L71j20J025L47
1362A188p81n21L37n79m47J161Nk52O70p17j178Q2M09O3P57J150j015r00M68l57
1382d57k00J539N20j147M37r7j280P6J350o66k46J097q75p04%Kj63N26N88l04
1402dO33l97j047L21M08J65P26O64j469k17K39q62M38J649o72j126J068m26k002
1421a911J358J193j119K24J339j668n24J356n88o08J560P58j475L07N12j209N3
1438d42Q75J91k02M01j090m99M77p37O15J014k49r44O74l68q84J212N97r13P17
1457D45P79j428l15J295j002n22J687J72j642M30L03j459J112O33l86r9P04j032
1475c25q93J623m35k40R67m9j015L96Q2p31Q25M77q59O81L81j240k56R38r70N
$$ plain form
1342 -1128 -392 -532 -121 914 594 -296 -766 -947 -1009 264 562 359 264 -115 -525 -435 -64 -184 841 1188
1362 1188 407 -114 223 -356 -803 358 363 111 781 64 -1114 -1032 -623 -560 197 1347 332 -568 -100 -457
1382 -457 -657 882 1402 255 692 595 -685 -609 741 75 -171 926 51 -653 -653 -651 -814 -288 300 -4
1402 -4 629 232 -815 -494 -86 79 805 1469 0 -217 22 -840 -402 1247 575 -551 517 91 -1911
1421 -1911 -553 640 -479 -255 1084 -584 -1108 248 -340 -948 612 1370 -105 202 714 -495 -442
1438 -442 433 624 422 823 -267 -766 -289 -1026 -411 603 354 -590 84 -284 -1168 44 641 -272 445
1457 445 1224 -204 -519 776 -226 -748 939 1111 -531 -101 202 -1257 -145 488 102 3 707 -325
1475 -325 -1218 405 -30 -270 697 648 -367 29 111 -620 205 682 -177 504 885 -355 -611 327 -643 -638
1495f38J241r5j025O61m28q83J059P89q74J60O62j094l61J197m65m9J043p44p16
1514e60P42j40o44R09L00q78K36P06j125q2Q18n36Q8P43j42q05M12j63q15J181
1534B45N55j009R1O14r40q1P43j26L6M90n15o48Q36m65k95M41N13n72L64K77q75
1555c21P2N92r72N34O77n95n62P92k35o68Q25O02r27J79N72m69k95M85n04j3M51
1576B20m61l61O12k83k60O30j27k67N06R7q06M64J80m89O48L29o41m05O43k78
1596d9j97M77K41q44L49J29p39K60O06m26l23Q00j29l73M9M69o66K50K81l30L98
1617B33q5l70K43K87k81K28J82n35p1J05k58k5O61m45k20M82p9m41N31J91l00
1638C3k04N84l56k63M38K33o37J41M02p73M26J23j51r7R4l53J48K15kj10L83k67
$$ plain form
1495 -638 603 508 -517 144 -284 -1167 -108 681 -193 -33 629 -465 -826 371 -94 -143 900 156 -560
1514 -560 182 42 -602 307 607 -271 -35 671 -454 -536 282 -254 -166 577 435 -370 42 -121 -936 245
1534 245 800 -209 -118 496 -444 -525 218 92 128 618 103 -545 291 -174 -469 -28 485 -87 277 554 -321
1555 -321 -249 343 -629 -95 582 -13 -575 217 -18 -686 139 741 -186 -7 565 96 -199 286 -218 -231 220
1576 220 -241 -602 10 -273 -533 97 -30 -297 209 306 -500 -36 144 -345 303 632 -9 -414 229 -49
1596 -49 -246 231 472 -372 -23 106 -633 -373 233 -193 -516 284 155 -218 -169 300 -366 -116 165 -165 233
1617 233 148 -222 21 308 27 255 437 -98 -169 -64 -322 -347 314 -131 -351 131 52 -389 142 333 33
1638 33 -171 413 57 -206 232 465 -172 -31 371 -402 24 147 -4 -101 -7 -360 -212 3 1 -109 274 7
1660Gk74Q36m29n13N24n5N1K6L86p25J67L24m92K64Q2k41k53K93J44n01L74J71
1682A66l67J48j44J6K46J7j95K21N2j7k41K13k35J68j7K6Q8j91P7r2J13K21l07
1705c4J02J73m08l7j94J14L09K62j26k43L05l37k84L3M76l44L12N6j41m1k01N27
1727B79K3k11n8n1Q3j67k1J30J80N4m14L78m19K0mK60j20P7N1j55L00j48k95P6
1751a52J36L88m49K35l8%k23O3J21K89l56k99K69l64J94P5M43j34k58j13J20k5
1773g8J27q5p0K76jk02l1OK02k29K74Q1j58m65p4K41Q6l55N34L08m36j49K53J8
1797G3j86j37O33k25J22n11l9J05J50LL11R7k28k22k00R8K82l0k57L01Lj05n51
1820e13K50J57K12R2m09L37L9k1k04J21J15j82R2j3k46k33M59P0k01K7J82m5k89
$$ plain form
1660 7 -267 569 140 -373 151 96 147 173 559 -166 1 325 -167 97 179 -62 -315 -22 122 -379 -5 166
1682 166 -201 -53 -197 -181 65 82 -113 108 160 143 -98 115 -120 48 31 57 145 -46 31 -61 52 273 -34
1705 -34 68 241 -167 -204 -398 -284 25 287 161 -82 223 -114 -398 -365 111 -233 79 135 -6 -47 -248 279
1727 279 302 91 33 -18 65 -102 -123 7 187 241 -173 205 -214 -194 -198 62 -58 19 70 -85 215 67 -228 -152
1751 -152 -16 372 -77 158 120 120 -103 -40 81 370 14 -285 -16 -380 -186 -111 332 198 -60 -173 -53 -78
1773 -78 49 -36 -106 170 169 -33 -64 -58 144 -85 189 270 112 -353 -427 -186 -100 -455 79 387 -49 -198 55 73
1797 73 -113 -250 383 158 280 -231 -270 -165 -15 -12 299 396 168 -54 -254 -156 126 96 -161 140 143 38 -513
1820 -513 -263 -106 106 198 -211 126 165 144 -60 61 176 -6 86 73 -173 -406 53 123 -78 -51 131 86 -203
1843b03J1p4LM69O4l08J1j31j96QM56K37j30k01K8k22M4j77J79M26r3r3J07m55
1867b40J68k18M32R3kK13n85o0L87l45K02N26k87m31Q2K52k46J49p3J75j06j22
1889c6j85J46J75j77N4O9L5k76J67j77q5J92K03N5M07m26k93J25J56k98L20J11
1911B62j4j08j65N8j45M21k25j69M70l33jj89N3J96l07N96l63M5j57k07K07J89
1933A14J11K00ln08K2j32K02n6K74m5k45j1k24j14O0L79K46l74P2R6k61L5K65
1956A03K26l9k47J35K12l74j61K64j5L35l48j24N6l70J23L97k00n4M54j008L39
1977b96J67l06K85O03J36o73N5J36j09k4K70Rm61M88l20j11J59k3J7R2q4Rnl02
2001b88J13J7K12K0M1k5l09j75O36k30o7M50j56j77j10J86l37J24J9k6MN36m32
$$ plain form
1843 -203 -192 -266 -263 206 270 -38 -27 -158 -354 -346 110 347 217 16 44 -178 -134 -311 -132 294 201 108 215 -240
1867 -240 -72 -290 142 235 233 446 -139 -199 188 -157 45 571 284 -147 -65 187 -59 90 17 192 86 -36
1889 -36 -221 -75 100 -77 -23 46 81 -195 -28 -205 -290 -98 105 160 567 141 -152 -27 129 -169 151 262
1911 262 248 140 -25 33 -112 309 84 -85 385 52 51 -138 -85 111 -196 400 37 82 -75 -282 -75 114
1933 114 225 425 422 -86 -64 -196 6 -50 224 179 -66 -77 -301 -415 -355 24 270 -104 -32 64 -197 -162 103
1956 103 329 290 43 178 390 16 -145 119 104 439 91 -33 23 -347 -224 173 -27 -81 373 -635 -296
1977 -296 -129 -435 -150 453 589 -84 -29 107 -2 -26 244 253 -208 280 -40 -151 8 -15 2 94 10 19 14 -288
2001 -288 -175 -158 54 74 115 90 -219 -394 242 12 -55 395 239 62 -48 138 -199 -75 -56 -82 -78 458 26
2024B6l75J18K54l09M50J95k49k68P0J69K0Q6j90K7K00l74J03J26j3M44m11M3
2046A42k83j2k18L28q4J3k01J63K44N5l82M5K34L0j8j47j03K3o8L02O7oJ83l28
2070b1Q4l74J08J8K87k94O05l40m9L4J26m40NL26K27o61L52J42k28N7J44k2o3
2093B3j20J77j97J20j21M60j72j47j42l37K67J82M4l8Q4J08j48j32L1J87m02J40
2115a33L43k57j41J78j2j49N31k14k46J41K34n89M2N79k06k23K12l0l35K20J55
2136A00k64J66k0J08j93J46J7N7j47J23J24l1j97R1J24j71k93J48J84j89K28l36
2158b25J75r4K47K1q4l2k27k6L37m6J3J16K94m62kK28n3k29K65l52o3M04k77l5
2182a07Oj51kJ00K65k61Q9K78j86oJ2j1L5J40n2j10R8j37J86j43j5j81R0O3k58
$$ plain form
2024 26 -349 -231 23 -286 164 359 110 -158 -88 81 101 187 -3 24 224 -150 -47 79 66 510 99 142
2046 142 -141 -153 -371 -43 -127 -114 -315 -152 92 147 -235 -190 44 74 56 -91 -194 -171 -239 63 130 124 307 -21
2070 -21 63 -311 -203 -185 102 -192 413 73 24 58 184 -256 -251 75 302 -359 -7 135 -93 -36 108 86 23
2093 23 -97 80 -117 3 -118 342 170 23 -119 -456 -189 -7 37 -1 83 191 43 -89 -58 129 -273 -133
2115 -133 210 -47 -188 -10 -22 -171 360 146 -100 41 275 -314 -272 307 101 -122 90 60 -275 -55 100
2136 100 -164 2 -18 90 -103 43 60 117 -30 93 217 186 -11 80 204 33 -260 -112 72 -117 111 -225
2158 -225 -50 -144 103 124 40 8 -219 -245 92 46 59 175 469 7 5 233 180 -49 216 -136 -199 205 -72 -107
2182 -107 -101 -252 -254 -154 111 -150 -61 217 31 25 37 26 61 201 149 39 137 0 186 43 28 -153 -63 0 -258
2207b58J79J79o9J59n6m45L43k4J92m33J52L08k17J09m1J1J11L9k76L9K1j52K13
2230H4j01j35L5K3Q9K35m24O6k12M12J33m43Q6K86j07k08K57N2k02J53m7j32L18
2253B18j92q8R4K46p00L76J03P3k73N7q4J13K2K09r8j27K97j99L1q5K0j0O0q0
2277a7J17L1lj11O3p5kJ23j14j20R6K04m2q4J77j47l66L95m2j93L48o6q6k3K86
2302C49l03l1k18L97r7j41Q7k1j78K12k29J14J45l54M78m35JL58j23RK13k30J37
2325A40j71J57j16j84K45j13K79q0k94q9L34j52l38N20K3j83j5L5o0l05L28j0
2347d9PJ28j58L76j61j55p3LP3K74k04l16L62j21J63r3n6K07l78j45L31j14j25
2370b24K24J7o1R0J82l15R6O0j8j46L22r4j11J28j65j23J80k26J03J36k22L1J45
$$ plain form
2207 -258 -79 100 31 190 134 -311 32 8 200 -233 -81 227 10 119 78 89 200 239 -37 2 23 -129 84
2230 84 -17 -152 -117 -94 -5 230 -194 -128 -340 72 205 -238 -152 134 27 -181 76 128 -74 79 32 -100 218
2253 218 26 -62 32 278 -422 -46 57 130 -143 -86 -170 -57 -35 174 76 -51 246 47 78 -7 13 3 63 -17
2277 -17 100 131 128 17 80 5 3 126 12 -108 -12 192 150 66 243 96 -270 125 83 -110 238 172 86 63 349
2302 349 46 15 -203 194 97 -44 43 22 -156 56 -173 -59 86 -268 210 -225 -224 134 11 20 233 3 140
2325 140 -31 126 10 -174 71 -42 237 157 -137 -226 108 -44 -382 138 161 -22 -37 -2 -62 -367 -39 -49
2347 -49 -42 86 -72 304 143 -12 -85 -82 -9 265 61 -255 107 -14 149 56 0 207 -171 -316 15 -99 -224
2370 -224 0 17 -44 46 228 -87 9 69 51 -95 227 133 22 150 -15 -138 42 -184 -81 55 -167 -136 9
2393IK5j21j71L60k59m0L65r4r2N5k29J46J90j52J30K34n00%P1J34l9j78J02J6
2417c8j85J96j26K18j07r6J06J62R0l25j7r6M06j98J67k82L53p5k5j84K09o7j78
2440i2K33j8k30m7L90m07J13K59j39j02K3J80k46J19j96j68M61j16J41r0R8k81
2462a15N8K05l77PN07m0k98O7mm82M19K53m30M24l73L0N7K22j93J30J07k32L9
2485a9N1N7l21J57L9m8J75j05l11M07J22m62N47k24o7m81M13J06P3k27L43J7l00
2508e8L16m74J42L55l62Q8K12l23K61q1l3o7K89k10q1L2p2K38l41J49o4K90Lk04
2532Ej96L47j64r9J34j00Rj08M8R0J53k06K6k07K57J78m11L06l00M68L3j80k69
2555a86K68J60k47M8q9R0M5j31J52J06j42j27j00N12m98n0N49k36j24j90K40q9
$$ plain form
2393 9 34 -87 -258 102 -157 -197 168 74 -18 37 -192 -46 144 -8 122 356 -144 -144 -73 61 22 -156 -54 -38
2417 -38 -223 -27 -153 65 -42 -138 -32 130 220 -105 -122 -218 188 -10 157 -125 228 153 128 -56 153 86 -92
2440 -92 141 123 -107 -154 236 -171 -58 201 62 -40 -17 163 -83 36 -160 -328 133 17 158 68 166 -115
2462 -115 -57 148 -229 -222 285 245 -53 14 10 -472 -53 200 -230 194 -179 -149 -92 130 -63 67 174 -58 -19
2485 -19 32 89 -232 -75 -36 -84 91 -14 -325 82 204 -258 289 65 -2 -483 -70 36 109 -118 225 242 -58
2508 -58 258 -216 -74 281 -81 7 219 -104 157 76 43 -24 265 55 -26 6 -66 172 -169 -20 -84 206 209 5
2532 5 -191 156 -8 -107 27 -73 -64 -172 -124 -34 119 -87 -61 -268 -11 167 -244 62 -238 230 263 83 -186
2555 -186 82 242 -5 43 -46 44 89 -42 110 216 74 -53 -153 359 -139 -189 360 124 0 -190 50 -39
2577c9J64N5k62o0N1J07q1L75m5k89k6p6M1N2K03Km6l2r4m4J50l50Q9L35l19n1
2603a90R1L3J84m93L67J70p5j66n5j4N5J05j51J58J35j05j22j15j3K44j1j36Q2
2626b2L08l94L3L36l63K43Rj44J59j49k63K03J6O1j18K47K4l36k08M57l79J62
2648a18J52j22J70j3k09L02j46j84J62J60k52K88k76LK30k57K00k56K19K79l04
2669B8l42O23m83j02K96J79k41J3J0J3Q0K41l04m0J81k27J26K3J82j47j87O7l17
2692c28K28L94l29m3J21j08L23m17n8M40j41j10KM8l2j23l8JL8J86J15k60J59
2715F8l9lK08J40k37j40J95k63j87L20mK5j39qq5J74Q5k26q3R0n8J89R1m6l56
2740b89K79O7Pj32J56O2m5l78J6K12j9j02K05j13K77l94K15L8q5jo0JL1M6j62
$$ plain form
2577 -39 125 180 -82 -142 -91 16 -65 310 265 -24 -50 -126 -85 -33 170 172 126 94 0 -44 106 -244 -155 180 -139 -190
2603 -190 -99 -66 118 -375 -8 162 87 -79 -134 -148 -93 12 -139 19 154 49 -73 -188 -201 43 32 -104 -22
2626 -22 286 -108 -75 261 -102 141 150 6 165 16 -247 -44 -28 33 -85 162 186 -150 -358 99 -280 -118
2648 -118 34 -88 82 69 -140 162 16 -168 -6 154 -98 190 -86 -83 147 -110 90 -166 53 332 28
2669 28 -314 309 -174 -276 20 199 -42 -29 -19 -6 74 315 11 -29 152 -75 51 74 256 109 -78 -11 -328
2692 -328 -100 294 -35 -78 43 -65 258 -159 -217 223 82 -28 -26 22 -10 -133 -171 -170 -132 54 169 -91 68
2715 68 29 26 234 374 137 -3 192 -71 -258 62 58 83 -56 -64 -149 25 110 -116 -199 -109 -167 22 113 67 -289
2740 -289 -10 57 64 -68 88 150 105 -273 -257 -45 -64 -166 39 -74 203 -191 24 62 -23 -24 -84 -83 -52 -6 -168
2765a68K63K8J13j92k1K3J10k44m8j02M9O3j6P0K9N0L9L3j82Q4o2J04P1p9J64
2790A79k77J82j6j14J64j47m2J47J18j62K59m04J66k19J4K43L01l71q3N3n5N5
2812ik04K83K48k86k09K43l8o9J42j59o5J37j14O7P0J82j20j26R2j35K91j08m46
2835c33K68J58j22J49K6m72K97J53j38j85KO3J64P9j14J28J01j11K1r2j89L35
2857A88k05L28k13r6J5qJ22j53j68M8lJ70j32L12m05L86l18K11j52J41q6j44M2
2880a20N1m6K39j82j01J33j58O9P8kJ10J18m80J00N52o28M10n0j19J27j50Q2r2
2903e9L15m24Q3J34k04K65J14j00j18P8J55m12L04k94K93q4k00J85L00m89N8k8
2925a28J95p7L1Q9J30j00J18m73L61j26j73L36O8j70j01j17jj9J36j10m0L82k01
$$ plain form
2765 -168 95 123 236 44 23 46 156 -88 -136 -238 -189 -126 -142 -72 -43 7 46 79 -103 -19 -81 23 94 15 179
2790 179 -98 84 68 -46 118 -29 -71 76 194 32 291 -113 53 -166 -152 91 392 21 -62 -9 -64 -9
2812 -9 -213 70 318 32 -177 66 28 -41 101 -58 -123 14 -100 -33 37 219 99 -27 65 -70 221 113 -333
2835 -333 -65 93 -29 120 146 -326 -29 124 -14 -199 -197 -134 30 109 -5 123 224 113 134 42 -147 188
2857 188 -17 311 98 2 17 9 131 -22 -190 -142 -145 25 -107 205 -200 186 -132 79 -73 68 -18 -162 -120
2880 -120 -69 -115 124 -58 -159 -26 -184 -115 -37 -39 71 189 -291 -191 361 -267 143 93 -26 101 -49 33 -59
2903 -59 256 -168 -85 49 -155 110 224 124 6 84 239 -173 131 -163 130 46 -154 31 331 -158 -100 -128
2925 -128 67 -10 21 110 240 140 258 -215 146 20 -153 183 251 81 -20 -137 -138 -157 -21 -131 -171 211 10
2948A0k23J53j09J95k09L05k03j49K59J79j28ol46K45j06K05o3l77M05K4j6j91
2970a46J69L7j12p4J87n4P1J01k92K45j71J58Oj45o5j5l7L49l0k50J90j33Pp2
2994g6j1P4l06J44k28K08K62j30L65k47J02K7k73L45l18j14L06l02L94j98o2N4
3016A6k64K39r0J66j30K53k21J01p3M9l9k33M60r8j6k00K11j08O4K5pO8q7P5j05
3041E6p9J31l16R6J31j71N6j26L22j21K91l30J70m4j9m8J15j47J95l41J28m0K87
3064A96j49J23k04n8q3L79k31j68J44k7m3J03p2j56L55r7J49j20Q2J66m85J44
3086e2q9K59J66l12J87l06j7Q5j22K03k14m6N9Q5J26k03K66l48J75K68l78K74
3108F6q3O8j02K26l1J35kk91K1J91l38L59j67n1j47j55Q5M33j13j52J74j61n5
$$ plain form
2948 10 -213 -60 -169 26 -183 122 -81 -230 29 208 80 74 -272 -27 -133 72 9 -368 37 61 45 -146
2970 -146 23 60 -52 -126 61 7 78 179 -113 132 -39 119 125 -20 -85 -100 -137 212 182 -68 122 -11 -4 -76
2994 -76 -87 -13 -319 -175 -403 -195 67 -63 302 55 157 184 -89 256 -62 -176 130 -172 222 24 -38 16
3016 16 -248 -9 -99 67 -63 190 -31 70 -3 46 7 -226 234 136 120 -80 131 23 87 112 105 173 86 161 56
3041 56 -23 108 -208 -112 19 -152 -96 -222 100 -21 270 -60 110 66 47 -1 114 -33 162 -179 -51 -91 196
3064 196 47 170 -34 -92 -175 204 -27 -195 -51 -78 -121 -18 -90 -246 109 12 161 41 123 289 -196 -52
3086 -52 -141 118 284 -28 159 -147 -164 -79 -201 2 -212 -258 -199 -114 12 -191 75 -273 -98 170 -208 66
3108 66 -17 51 -51 175 144 279 277 -14 7 198 -140 219 52 1 -146 -301 -216 217 104 -48 126 -35 -90
3131i0J95J16k66k02L1L62n0qp2j14J26j93j0J43J8J03J62l46j02K38j26m6K91
3154A60m4k6M4p9r8J29o8%P1L5j62J60k07L4k2J66j69K90k03k42rK16l06L34N9
3179F3j2k10J08j6L27k22q3n2K32r6K18m45K75k34K04K10j52j00K0J33k20m29
3201d81M75J56p1p9j56K83l83L55j72N0j14Q0m0K53k37J83j83L4P8J25p2J18l13
3224a11K14J92k67k7k78K75K06Lk94J78R8j55p3L78k49J11l97K36j33J42j96R2
3246e5k1j34J15L08k52j0J81j71J48l63J76J7l9R9L3N7jO2m20O64m52L06k6j5
3270B07l53L58l48N8Q4R0l18j7M52p5n5r9J55j8j68K09j01K52j78l01J89n6j25
3293a58K26j09R5k11L48m17qK00RJ18k90J23k67K13K32M7k42J62l18K44J64J0
$$ plain form
3131 -90 105 221 -45 -247 -216 146 96 88 16 -98 28 -165 -175 -32 -14 89 251 -95 -197 41 -85 -131 160
3154 160 116 90 134 55 -43 86 18 18 89 124 -38 122 -85 -51 -73 93 -76 214 11 -231 -240 -24 -330 4 63
3179 63 51 -159 -51 -67 260 38 -45 -97 135 39 257 -188 87 -147 57 267 115 15 35 168 -52 -481
3201 -481 -6 150 79 0 -156 127 -256 99 -73 -23 -137 -57 -97 156 -81 102 -81 -47 31 156 84 202 -111
3224 -111 103 295 28 1 -277 -2 204 207 -87 91 189 34 -39 339 90 201 -196 40 -93 49 -147 -55
3246 -55 -76 -210 -95 213 -39 -49 132 -39 109 -254 -78 -61 -100 -1 32 89 88 150 -270 394 -58 248 222 207
3270 207 -146 212 -136 -78 6 96 -222 -239 213 138 83 -16 139 121 -47 162 61 313 135 -166 23 -33 -158
3293 -158 68 -41 54 -157 191 -226 -234 -34 -25 93 -197 -74 -341 -128 104 151 -91 71 -247 -3 161 171
3315A71k98J07R7O5j90R9l9m4K56J07l50o0j68K09k69J81J44m5K87l68j03NQ6
3338a20R9j93L69j88J38q1J03K3k28k11K70Q2k47J09K39j30j3j26R7J84k95J35
3360A6j03N1j56M5L14j26K25k71r4L87q2m64L60q2j12J10MJ60n20J84K76l04N2
3383a30K17j38nN3lQ7K5j20M5k46K72k03K60n5k9j36J12o7J6J47K18o55M21k3
3407F3k14O0M7j5l1J54j11J8J85j19n4J64j41m2J61p8q2m6J53j22O7K0op5J87
3432A43m08J22j29L74l67K2N45l92Q3j23J07L52n70L13k5j18o9N2J54j03j67L58
3454A54o5r4j07J47j24K52r8k00J53Q8J05j23l06K72R4j67n5J00J95k52K4J4J31
3477A38k11J60kJ2m40M74l19K2M53l80R1j41K16n52L10J96j75K58r7o4P0p0ML7
$$ plain form
3315 171 -127 -20 77 142 -48 51 12 -32 224 331 -19 -79 -247 -38 -307 -126 18 -27 260 -108 -211 -206 -120
3338 -120 -21 -214 155 -33 105 24 127 150 -78 -289 -19 63 -184 -75 164 34 21 -105 -8 176 -119 16
3360 16 -87 -36 -192 -147 167 41 266 -5 -99 288 206 -258 102 20 -92 18 22 182 -338 -154 122 -182 -130
3383 -130 87 -51 -56 -3 -6 81 106 -14 31 -215 57 -146 114 59 30 -106 6 -61 -45 102 320 -335 86 63
3407 63 -151 -91 -44 -59 -90 64 -47 -29 156 37 -17 147 6 -36 125 47 -35 -81 72 -50 17 37 31 -44 143
3432 143 -265 -143 -272 102 -265 -243 302 -90 -7 -130 -23 329 -241 72 47 -71 -140 -88 66 -37 -204 154
3454 154 89 -5 -112 35 -89 163 65 -135 18 106 211 88 -218 54 148 -19 -74 26 221 -31 -7 7 138
3477 138 -73 87 85 97 -343 131 -188 -166 287 -93 -2 -143 73 -479 -169 27 -148 110 13 -51 19 -51 -47 -10
3501a0J39J07k96l93M30j89K75n31L77J38k21o8L52j40K2o2J85l94J13L08l6l3
3523G3j45K55j40O2k29L48k40L8j50J50O7j58M8m4k25K46k8j32J52J85l53J46
3545g4M4N5j77J07J62k0k2R7N9q8m3j16p3Q5l8N4o2K1j48q9J11L51l95J76L2l03
3571b94L38L3J31l15P2K10M9n5l69K30j37R8q2l7m7L44j48J66k68J07J1Q5l74
3594b52O0J84Q6O0j71L41k27K49j48l42L01j49K19l15J52P1l89M33m6L7l46N4
3616a38J81M2k63K38l68J61Q3o1J13k2J41k03J4O8J1nj24J04q5J38q6N0%r4J06
3641Aj47J48j41j6K32k44K00Ro1o7J38M2j01J00j60K49q6j81k60M16K06l15r0
3664a28q3J06K83j17j66m2l9L26K7J77m33K4K0k3Q0j99K71k1n1P9k53N5L85l25
$$ plain form
3501 -10 129 236 -60 -453 -23 -212 63 -468 -91 47 -174 -242 110 -30 -8 -70 115 -279 -166 142 106 73
3523 73 -72 183 43 105 -124 224 -16 22 -128 22 89 -69 -21 -65 -290 -44 -72 -204 -52 133 -220 -74
3545 -74 -30 25 -152 -45 117 97 75 172 231 143 100 -16 -89 -4 -42 12 -50 -29 -177 -266 -155 196 -199 -23 9 -294
3571 -294 44 77 208 -107 -35 175 224 169 -200 30 -107 -9 -91 -128 -175 169 21 187 -81 26 37 122 -252
3594 -252 -192 -8 78 138 -33 308 81 330 182 -160 141 -8 211 -104 48 119 -270 163 117 154 -192 -138
3616 -138 43 85 -178 60 -308 -147 -64 -125 -12 -34 107 -96 -82 -14 -3 -8 -132 -28 -113 25 -61 -11 -11 -105 1
3641 1 -146 2 -139 -155 77 -167 33 42 -19 -86 52 94 -7 93 -67 182 96 -85 -345 71 277 -38 -128
3664 -128 -211 -105 178 61 -105 -147 -186 140 167 344 -89 -65 -45 -68 12 -187 84 63 12 91 -162 -107 278 -47
3688d7j04L70j12j15N9k94K24k32L22Kk14L01j39r9P7J61k98J85J0J97l53L8K27
3711A66l45L59k72KJ94j67J74K0k23qQ1P8o6MlJ67l49L14o8j78K88k37%j29J45
3736e3J2NJ35J8r2p9o5jK43j19j55K03k8r2n6M23k73j0J30klr1L7j73L1m7l6j1
3764a49m6M48o50O78n45M77j42J04l27n4n2K84J32j57K0K4J26j10k66PL89l73
3786a82J58N8r9P5J88l82K00J87m21R6J98j84K5J17j61m8O6J52k06L56j99R2J57
3809B43j38o3J56k51J04o6J24j6J02j96j42L11k50j05Q5j5K91j82j24J81J2Q5
3831A46j59j69J51L38o64K94J19m7PK21l16k7J86p7N0k08K20j74K1J30k55J36
3853g7N7J17m1J2q6Q5J50m45K17J41o2J40m96M48N9l69L1J83j57J71j63l4K42
$$ plain form
3688 -47 -151 219 107 -8 51 -243 -19 -251 71 73 -141 160 21 -78 -1 160 -138 47 57 254 -99 -61 166
3711 166 -179 180 -92 -90 104 -63 111 131 -92 -100 -19 59 -7 -3 -6 161 -188 126 58 -120 168 -69 -69 -198 -53
3736 -53 -41 -36 99 117 25 -54 -119 -120 123 4 -151 52 24 -68 -124 299 26 16 146 144 141 50 87 -86 -55 -102 -138 -149
3764 -149 -195 253 -397 281 -264 213 71 175 -152 -206 -258 26 158 1 21 45 171 61 -205 -198 191 -182
3786 -182 -24 34 -65 10 198 -184 16 203 -218 -122 76 -108 -83 34 -127 -175 -109 43 -163 193 -6 86 243
3809 243 105 42 198 -53 51 -15 109 93 195 -1 -143 168 -82 -187 -102 -117 174 -8 -132 49 61 146
3831 146 -13 -182 -31 307 -357 -63 56 9 16 237 -79 -106 80 3 53 -155 65 -109 -88 42 -213 -77
3853 -77 -20 97 56 68 -18 67 217 -228 -11 130 68 208 -288 160 219 -150 -119 64 -93 78 -85 -119 123
3876A23m4k52K76j05j87N3J06MK44p5k37J32l1j89p2K48k3r5rK57o5J12m49J1
3900b67N89m30J68j51O6P7R4p3k51M5J60n7j4K55k14j4J99k59MJ42j2n5K00k19
3924a7J8O5j44J6o2K0K85m22J97K37L4k91L86j74j56k51J11L93j13k51q4N4J5
3947a34Q3l2j63J41J54L1J77k80K91q6k07q2J35K7J77j70J9m8P3L5j03j75K33
3970I6J65m94J34j02L3N2J8P7j90L14J43n6j73M8Q7j02M7j42J73j32N8j46O7k36
3994b61N8L42l76K97K7k39k17J29l1O03k73k9j44J44J06j55J48l95J30r5L08l08
4016b31L68k60K56j55N6k08L16K37l60J09j40j13K09Q4p0j02K18k8j76K55k79
4037a4J41k53P2L23l10J14J13k24J9N7Pj5M0n9j4j10M5M6lJ84P6j64k53J23J22
$$ plain form
3876 123 79 -173 103 -2 -189 -136 -30 -26 218 143 -94 38 7 -182 -254 -6 -29 -124 -133 124 59 171 -278 -267
3900 -267 322 -108 60 -91 -25 52 146 73 -178 -133 27 -30 -44 211 -3 -17 182 -77 -73 69 57 2 202 -17
3924 -17 1 66 -78 -62 -124 -104 181 -241 -44 193 227 -64 322 148 -8 -259 -148 245 132 -119 -203 -149 -134
3947 -134 -51 -83 -246 -105 49 80 257 -23 268 182 -25 -107 28 55 232 62 81 33 106 141 38 -137 96
3970 96 261 -233 -99 -201 -168 -116 -98 -21 -211 103 246 190 17 65 152 50 97 -45 128 -4 54 -92 -25 -261
3994 -261 -203 139 -237 60 87 -152 -369 -240 -271 332 59 30 -114 30 136 -19 129 -266 -136 -231 77 -231
4016 -231 137 -123 133 -22 34 -174 142 379 19 128 -12 -125 84 168 98 -4 214 186 10 265 -14
4037 -14 127 -126 -54 269 -41 73 186 -38 -19 38 45 30 70 11 -3 -113 -68 -22 -25 159 235 71 -182 -59 63
4062F3J42j3l26J81l7Lp9rJ56j7l27M32J54q6m79J84M3j45k0J73P5j69J39K43
4086B81l20p2k5j0K79r8j24n8L00m23J18L65k74R8O5l27L30k73m1K14j81K57J39
4109B20m05K56p0K22Rm47Q5nJ59J79j20j43K03j58J08r1m0P7k8J68n31K83n3Q0
4133d2o6K05j49Q3q7k5L3k78K52M8Lj81K57j4j86j4K15J80k48M0j3l43L56j55
4157a29QL72j80l05L52P7l06L66j61k17J27Q1k01J40%J01o7r4M9J06J77k24k10
4180a38J97nj76M6J5K03j99q7K58MP2m34J24M8r1J87r0N0J44k60j74N64j5j41
4204A02j62L4j95K13Q8r9j52L33Q4k46q9O4M27l97L7R0j17k7O1j28K42j33R5k31
4228a06J23j55k8M2K33p2K1j48l6k4K25l11K75Mk25K14J50l52K42J03j00n66L37
$$ plain form
4062 63 205 192 -134 47 10 13 -66 -75 81 64 -263 169 323 237 -242 -58 -15 -160 -180 -7 68 -101 38 281
4086 281 -39 -111 -136 -146 133 35 -89 -147 153 -270 -152 213 -61 37 102 -225 105 -168 -209 5 -176 81 220
4109 220 -185 71 1 223 232 -215 -130 -135 24 203 83 -60 143 -15 93 2 -38 39 11 179 -352 -69 -122 -42
4133 -42 -108 97 -52 31 -56 -81 -48 -326 -74 -26 -23 -204 53 39 -147 -161 54 234 -14 26 13 -330 26 -129
4157 -129 -121 251 71 -234 118 195 -111 255 94 -123 4 85 -116 24 24 125 58 -36 13 119 296 72 -138
4180 -138 59 54 -122 -76 -61 142 -57 -144 114 118 190 -244 -120 -72 -163 24 -66 -16 128 -132 -306 258 243 102
4204 102 -60 -26 -221 -8 80 -19 -171 162 246 0 -89 -25 402 5 42 132 15 -12 49 -79 163 30 125 -106
4228 -106 17 -138 -166 -124 109 37 58 -90 -126 -150 75 -236 39 43 -182 32 182 -170 72 175 75 -491 -154
4251a54K91j52J80j75J10J3j16j7M7p0MJ13K2k2Qo2j58J27l5K69R8j53j46J26
4275A48l54K73j7j62K31O3m87N02J0m12K65R2j47L25j91k02L37k32k91K20K5j51
4297a55J38p6k3k0K93k68J19j91L47j47j08ok02K61M22m54J3M3r3k6r0N5J81k65
4321b52L17p2j27k19J80L64k02K28qr3j91K80k25M0M4k04K61J0l31K55j45J08
4343A8j42R5O3k00J22n6K48k43J12j55n0J54J31o9j3j19Q0K5N0m7Q0k51r2O7J62
4368c0J3K31K9k48o3J25K13j96J33j53J9M3j49O0j22J81J45j49j26K21m1n7j12
4391c3J02J37k90O7o8J77n9n0L7m0j64J09K99j27r7L6K01k84j47Q0J57J2n7k91
4415b93M43j05l58K72R1k06J42K7J74p4q0l13L03k07k0K46p7K63j69k10L40m2
$$ plain form
4251 -154 137 -15 165 -10 100 113 -3 -20 27 -43 -39 74 96 74 82 20 -138 -11 -46 223 321 168 22 148
4275 148 -206 67 50 -112 119 182 -305 197 207 -205 60 152 5 330 139 -63 274 42 -249 -29 -4 -155
4297 -155 -17 -93 -116 -136 157 -111 8 -183 164 17 -91 -97 -299 -38 384 -70 -57 -14 -107 -133 -223 -168 13 -252
4321 -252 65 -7 -134 -353 -173 191 -11 217 209 116 -75 205 -20 20 64 -140 121 131 -200 55 -90 18
4343 18 -124 -29 34 -166 -44 -100 148 -95 17 -138 -188 -34 97 28 15 -104 -24 1 51 4 84 -167 -259 -192 -30
4368 -30 -17 214 243 -5 -68 57 270 74 207 54 73 116 -33 27 -95 86 231 82 -44 177 136 79 -33
4391 -33 69 206 -84 -17 -85 92 33 -17 20 -20 -184 -75 224 97 0 36 237 -47 -194 -114 43 55 -2 -293
4415 -293 150 45 -313 -41 50 -156 -14 13 187 113 33 -280 23 -184 -204 42 -35 228 59 -151 189 147
4437A47j70J19k06o8K06j51L59k65M40l61n9j79K51j35n9j53M72l40L64p2k9Q9
4459B00n4q0j76J98J85o1p3k30p6L97l73K20j29r7L7J04RP2j38m2q4K27l02J57
4483a09K40k29R4J81j08j97j03L12j67k8J65p1k74J46K89k00j8j58K99O5l82L65
4505A12k67K21k02K30q4J7K16l30M2q1J53K1j34j11L13j47j06R3M1j23K17mj83
4528i6pJ12J40k8M1l87K98M4k48L66l15M9k37M02k84J01j06l3j28K39J85R0k9
4551A69o4r1j37K34J73j34k1k99J62J01l20J64M0J09l61L36l03k7J79n9qL19j26
4574C6j90J32n2J73j79K03m6o5J42k00K5k73K63K00r1n9K43n33L53o8L6p1K8j15
4598a08o8L7R7R5K22l01K35K8k75P4J9L07o29L86l64L03k75Q2J92m15N17j74o
$$ plain form
4437 147 -23 96 -110 -178 28 -123 236 -29 411 50 -9 -188 63 -72 -131 -284 188 -152 212 140 111 200
4459 200 146 66 -110 88 273 212 139 -91 -167 230 -143 77 -52 -149 -112 -8 1 73 -65 -107 -191 36 -266 -109
4483 -109 131 -98 -4 177 69 -128 -231 81 -86 -114 51 -20 -294 -148 141 -59 -77 -235 64 129 -253 112
4505 112 -155 66 -136 94 10 27 243 -87 -45 -126 27 48 -86 -197 116 -31 -137 -44 -3 -126 91 87 -96
4528 -96 -103 9 149 121 162 -225 73 117 -131 235 -80 -31 -268 134 -150 -49 -155 -188 -316 -77 108 198 169
4551 169 105 14 -123 111 284 150 129 -170 -8 93 -227 -63 -23 86 -275 61 -242 -269 -90 -149 -157 162 36
4574 36 -154 -22 -74 99 -80 123 77 12 154 -46 -21 -294 -31 169 78 19 262 -271 82 14 50 -21 7 -108
4598 -108 -176 -139 -42 53 275 -26 209 237 -38 36 55 362 -267 119 -245 58 -217 -135 57 -358 159 -15 -21
4621b1P2k54P8K05j63k39K37J86K4j5k4j62J77J00k81K33Pm9j85K2K03l02J3J57
4645A9m0j20J69j68r6K97J8L1J0k62J12l0P1P3j97K83r5l52R9L49j05p0j07L34
4669B23l01K88l84Q2o8J35P9j94K03J36m08J51K07R7k01Pj23R5j86Q9J01rj33
4692a14J90R7l1K5j1R1k86Q0o4j09j9J88j51k25J51K84r4j57K40k27L3J50K03
4715B44m17R6O3j09J11j73K23K5j50J42k80K49n3j61L65m45J37K22j76j35J56
4736f6L46l78m8K7K47k12K84j96j55L06k4k22pJ41j48J16o9J40k18M50j46k86
4758a18O6K4K08l10J27J23Q5k90L8j58L90l48J93J49q6J63l70J8L64k71j69L17
4780A45q9r3j43L29k03l7kQ6m0o2O7O2J83r3m11M31o2J2n9N1m8j44K34J16j61
$$ plain form
4621 -21 51 -203 -125 80 -83 -322 -85 101 125 110 86 -76 101 201 -80 153 160 111 -74 -52 151 -151 -138 19
4645 19 -21 -141 28 -140 -236 61 79 110 120 -142 -30 -60 11 84 -113 170 75 -277 -178 171 66 -4 -111 223
4669 223 -78 210 -174 -92 -160 -25 54 -140 63 199 -209 -58 149 246 45 52 -71 24 -162 -73 28 19 -114
4692 -114 76 173 142 167 156 247 -39 41 -23 -132 -151 37 -114 -339 -188 96 2 -155 85 -142 -109 41 244
4715 244 -173 -77 -14 -123 -12 -185 38 63 -87 55 -225 24 -29 -190 175 -270 -133 89 -87 -222 -66
4736 -66 280 -98 -146 -119 128 -84 200 4 -151 155 131 -91 -98 43 -105 11 -58 82 -136 314 168 -118
4758 -118 -52 -28 180 -130 -3 120 205 -85 -47 -205 185 -163 30 179 93 256 -114 -96 268 -3 -172 145
4780 145 56 -37 -180 149 -54 -91 -93 -7 -47 -109 -42 20 203 110 -301 130 68 80 21 72 24 -120 114 230 69
4805F9K35m31Mj12M77j67l6L54o25O12l21k26K32P0j37J86m3k11K07r0j15L5J92
4828A59k44q8K23Q5k49j9L3K51M2j78N2r9K0K1k27K70K51p1q7L3j76J61m01M50
4852B12l12l0K82l28L68n2n90M21J38ln10M34l7Q2l56J50j34J68K02j88L61l65
4874h7R3rj17J70j37K50P5j72j34l3J03N5m1QJ46j66J49j60l2M3j45J13J07j27
4898d8P3k5J78l10MM78l29J78k93M8N2Qj10K28j98J13k74J95n9Q0j44J06M8Q4
4922H3P3N3l05R1j45M5j13M21l17K6R5Q7k90K39o5J31m04L73q0K4P3n6K3j84J64
4947D2o4J84j33j53J02k41L82k86L90k61N2j83M40k47P2Q2j75j06k6M36k92J92
4969B07j59R0j53J6R3l9k06K39M4k12J03p0J61k03J3N4j80J96j67K5J61M8l20
$$ plain form
4805 69 304 -127 -123 -235 242 75 39 393 -232 380 59 -167 65 135 -2 184 141 -70 137 47 -68 -33 159
4828 159 -85 -173 50 135 -114 -133 -100 151 193 15 67 -32 -12 9 -218 52 303 232 145 178 2 163 -238 212
4852 212 -100 -130 152 -176 192 140 -450 -29 109 106 -404 30 -7 75 -281 -131 -265 -97 105 -83 278 -87
4874 -87 6 -3 -120 50 -87 163 238 66 -68 -101 2 57 16 24 170 4 153 -7 -39 4 -141 -28 79 -48
4898 -48 25 0 178 -132 -128 350 21 199 -94 -46 6 14 -96 132 -66 47 -227 -32 -91 -11 -155 -49 -1 83
4922 83 156 209 -96 -5 -150 -105 -218 203 -114 -88 7 94 -196 43 -22 109 -295 78 -2 22 95 39 62 -122 42
4947 42 -22 162 29 -124 -22 -263 119 -167 223 -38 14 -169 271 24 96 178 3 -103 -129 307 15 207
4969 207 48 138 -15 1 94 55 -151 88 132 -80 23 -47 114 -89 -76 -22 -202 -6 -173 -148 13 61 -259
4992b59M49j29j17j98K56J00n2j68R6K35j70k61K52j04Q0k66L07j46p8K80j89
5013h2K20k9M9j67l4J28q5j93J50Q3K23j84J26j37j96P1J66J40j93j60J28r4k6
5036i6J56j2m5J82k35j4N7L14j54k95QK3J27N1p5j14L5K09J76m6k01k59L2L2J31
5061a3o0K04M6k4q2k59J46j34J59j00P6O8k22K35K15l04P4N0j12L27m22J21J34
5084A23k64m6kL34k9k73J02J28k93R2on0K49Q7p1J34k42j7J62Q3J94n20l2J43
5108a4L25l73J2k15K26P4K2l8K97k43k02J56P8r6J79j79j84R2LM9J53j80K35l20
5132a43L87m57L15L3J25k29k21O8O1J22j71QJ0L13m65L04j37p7J19J14j32M01
5154C48j76n6M4m8k29k11K49O6O0L6J06j43j73j2K20j18J12k0J78j17j98m1K07
$$ plain form
4992 -259 190 61 -56 -254 2 102 50 -118 -22 213 43 -218 34 -70 10 -256 51 -95 -173 107 -82
5013 -82 138 109 158 -9 -43 85 0 -193 -43 40 263 79 205 68 -128 -57 109 249 56 -104 24 -70 -96
5036 -96 60 48 3 185 -50 -64 -7 307 153 -142 -134 -111 16 67 -8 -122 -87 122 298 252 51 -208 -176 -144 -13
5061 -13 -73 131 177 153 71 -188 -42 -176 -17 -117 -41 27 -195 40 255 -49 25 75 -37 290 -132 -11 123
5084 123 -141 -187 -189 145 116 -157 -55 73 -220 -128 -134 -184 65 152 81 215 -27 -44 118 201 395 -125 -157 -14
5108 -14 311 -62 -50 -265 -39 35 57 19 316 73 -129 27 105 9 188 9 -175 -83 -80 -31 122 -58 177 -143
5132 -143 244 -213 102 135 260 31 -190 -122 -61 61 -110 -102 -92 221 -244 60 -77 -154 -35 79 -53 348
5154 348 172 116 160 112 -117 -328 -79 -13 47 83 189 46 -127 -139 81 -37 75 55 233 116 -82 -123 84
5177H4j90K11j08R1p7K88k39k72K63nj37m4m4J69K05l37P7L26k03l23N09j00R2
5200B36m33J11K02l8o8l4L6j4j60J18L4N08m02K7l49K60R8j94J23k30R5J28k4
5223C0J19k77J27jJ5J7j19M12l04k0k83L50K7n2j52L81Mk66K57r2m4j91L9o7k5
5248a15K11k95K65J30j96J53l5km2j42N6j1r5j7q4M41k10o5L02m18J98j36K18
5271A11Qk45k6M6j02M11l00KL1j6R4j82J20M5K7J1n7L3O7O2k08J25k41J94R4l1
5297G3n4J03nk70J12j76K23j68L35l12Q2r6J20o6j41K64r5No1M25l19J86k30j30
5321a95J67l1r2J60K05j37j73L6O0j12J95j68J02p6q5L90n33M42q5J9k00K1J24
5344C4P0l7j7L8k03L91k24k0o6R4J66j16k29J65J20n3O0q7J77k87p1j18L50j19
$$ plain form
5177 84 -106 105 -3 88 11 299 60 -212 51 46 -91 -135 -179 -10 195 -142 -65 261 58 -265 244 144 236
5200 236 -197 -86 116 78 10 -24 12 -2 -162 -44 -10 498 96 123 -226 34 132 -62 61 -169 -74 54 30
5223 30 149 -128 -1 -2 13 30 -89 323 19 -1 -284 66 93 41 -111 270 274 8 265 173 129 -62 -23 -90 -115
5248 -115 96 -199 66 196 0 153 118 116 74 -68 -12 -23 -118 -135 -219 222 12 -53 249 -169 29 -107 111
5271 111 119 -126 -152 -106 -208 203 -97 -95 -64 -80 14 -168 -48 -3 24 35 -22 11 78 140 -68 57 -184 10 104 73
5297 73 19 122 117 -153 -41 -217 6 -162 173 -139 -57 -153 -33 -99 -240 24 -71 -66 -127 298 -21 165 -65 -195
5321 -195 -28 -59 -151 9 214 77 -96 -60 0 -112 83 -85 17 -59 -144 246 -287 155 70 89 -111 -90 34
5344 34 104 67 50 88 -115 276 52 32 -34 60 226 110 -119 46 166 113 173 86 263 -24 -95 -213 137 18
5368A8Q7o6j27L8O1J70j90k29L4J56oO7N2j52K15j0K7k09L42m69N1K30K1j36N5
5393C0n9Q1l46L35j68K19r8Q4J19l45J85j95R5O9J91l66J71n5k41J24Q0J8J62
5416I0k24J56R3j67J68n6k6qj17M5J14J82m68j03M50k30J3R3J35o7J59l97K12
5439D7J69k77J39j19J93o2kk8j10n8J80M5l09K62O4J35m44K98j91J02k39K89j97
5462a13j3K91j92J37j33n8L46k92p2L84l09J60jl91J85M0n5M4J5j29K35J04q8
5485I5l53J47K27n14N85j48K24k32j3M5j83M97k96rk09J32p9j04J18q3Q7J78j46
5508c4J72j09L9j73J18m8K09n2K9l09N6M6J81j84J44J61m08L32o9l5j00Q1M0P
5532I4J72n19K20LN2P9l05J32m1O3RK30k07R0Lo0J57o8q0m2o0K33R7j87j6p8k6
$$ plain form
5368 18 105 39 -88 -50 11 181 -9 -238 -204 -48 -54 13 65 -87 128 118 145 -64 278 -191 -140 90 111 -25 30
5393 30 -29 52 -294 41 -127 92 -6 78 197 -148 37 -158 -63 6 197 -169 2 -53 -294 -170 -90 -72 90
5416 90 -134 22 115 -52 116 60 34 26 -91 -46 68 250 -218 -321 129 -101 -88 5 140 73 232 -165 47
5439 47 216 -61 78 -41 152 90 88 60 -50 -108 72 117 -192 70 134 269 -175 123 -68 34 -205 84 -113
5462 -113 -126 165 -27 110 -23 -81 265 -27 -99 285 -24 136 135 -256 -71 -31 -86 -42 -27 -156 79 183 95
5485 95 -258 -111 116 -398 187 39 263 31 18 63 -120 377 81 72 -137 -5 -84 -188 -70 -153 -66 112 -34
5508 -34 138 29 68 -105 13 -35 174 122 151 -158 -102 -56 125 -59 85 246 -162 170 101 66 -34 47 87 94
5532 94 266 -253 -33 -30 22 101 -204 -72 -113 -50 -41 189 -18 72 75 15 172 104 24 -18 -78 155 252 65 49 -29 -55
5559e5k4l74J74L16p3mMJ70j56J0p9J92o2j08K70k3J22m05J89Q3q6j82M3J12L8
5584I2j1j82J61j27j91M92n06J60J78r3k39L63n7L1j52K00k75L02o7l85L77k27
5606a56R3J73j33O1k9j0J20j08o9J30p6J40k88K16J15m57K85O1l46L40q1j96K83
5629F8R0j07N0k57J19K90l26J70j47J7K08o5n9n4j1k45K68M5K2j19J63j10Q1j28
5653c7O3J04J15p4j33M0l7j4l63M64j38j34K46j02j84M49l20q6O8J51j51K37j80
5676a6J52j61K90l58o9L0O5J10M3K3p3j80N9L56ok08l5J42l56N5Nm5oL2R0L33
5702B72l05O8L97l59k45K5L51k89J47k29Q2k9Q6L9m2J82Q7q9L4j82J42l6j92K46
5726A61n9Ok12K8J37j21j60J71p7K06L4j49oR4M4r2j17Q4J48k06k2J48k52K20
$$ plain form
5559 -55 -79 -453 -279 37 -36 -40 -36 134 -22 -12 -91 101 39 -69 201 178 300 -105 84 167 81 -101 -58 54 92
5584 92 81 -101 60 -67 -258 234 -272 -112 66 -27 -266 97 40 71 -81 119 -156 146 79 -306 71 -156
5606 -156 -63 110 -23 38 9 -1 119 11 -58 72 -4 136 -152 64 179 -278 7 68 -278 62 -19 -215 68
5629 68 158 51 101 -156 -37 253 -73 97 -50 -33 175 110 51 -3 -14 -259 9 54 76 -43 120 10 91 -37
5653 -37 26 130 245 171 38 78 41 27 -336 128 -10 -144 102 0 -184 265 -55 -141 -73 78 -73 164 -16
5676 -16 136 -25 265 -93 -162 -132 -67 43 86 109 36 -144 -85 271 265 57 22 164 -192 -137 -132 -177 -183 -151 -61 272
5702 272 -33 35 432 73 -172 -147 204 -85 62 -167 -85 -114 -28 11 -31 151 238 149 183 1 143 107 -85 161
5726 161 102 108 -104 -76 61 -60 -220 -49 -126 80 114 -35 -41 53 97 5 -112 -28 120 -86 -108 40 -212 8
5750Hn8n1j06M13jj69M9k46J94j11J66k61J2L74l41J99r2K4k61M86k94J55j44
5773e5J44q3R9j60K4N8r2l7Q4j51J81j16J73J14j13N3j61K20m43J97J41j56mq3
5797a66N7J95l1O4k07J25N2k62J24J88j22N2p1r2O8L02m61L50o9M2M1j47m0j16
5821a24m4k47O00k48K82k66J85j0o8p3J09N5k99K91l8qkm9k17J83P6o0r7n2r7
5846b18K7O0Q9K8k10K29j32P9j48K06j2J83j94p2o3L83k65K00m4Q5j35J15j88
5869Cj0j44L02j62rN20n21J25l33J72K30j94K13o2j45j74N34k92J49l26ML3j36
5892b23J04K45m3k26J54nK02k82J16j10J08j19J51j72K16J1J10j75j17j5J67o8
5914B9k27L93l89L37j77QN1o1JK66k20R6j98L6qj19J80J1jj55R4J4N5K27k01j59
$$ plain form
5750 8 -50 -101 -207 206 205 36 85 -161 33 -78 88 -173 -161 213 -128 71 -21 3 -258 228 -66 89 -55
5773 -55 89 6 105 -55 -31 27 -65 -102 -18 -169 12 -104 69 183 70 123 -38 182 -261 -64 77 -79 -83 -166
5797 -166 -109 86 55 119 -88 37 89 -173 -49 139 17 69 -2 -94 -26 276 -185 165 96 138 179 32 -8 -124
5821 -124 -168 -415 185 -63 219 -47 138 128 60 -13 96 151 -148 143 105 97 95 46 -171 12 88 28 -69 -121 -218
5846 -218 -191 -131 -42 -14 -224 5 -127 -48 -196 10 -2 181 -13 -85 -148 235 -30 170 126 211 76 191 3
5869 3 -7 -151 151 -11 -20 500 -21 104 -229 -57 173 -21 192 130 -15 -189 345 53 202 -124 -120 -87 -223
5892 -223 -119 126 83 -143 11 6 208 -74 42 -68 40 -79 72 -100 116 127 237 62 -55 -70 97 29
5914 29 -198 195 -194 143 -34 -26 25 -36 -35 231 11 107 -91 -55 -63 -182 -2 9 8 -147 -53 -39 16 243 42 -117
$$ [...]
8191b08
##END NTUPLES=NMR FID
##END=
