##TITLE=1H_DE-43_EA_TFA
 CDCl3
 8 sc, 
 2.4.2024
##JCAMPDX= 6.0         $$ Bruker NMR JCAMP-DX V2.0
##DATA TYPE= NMR FID
##DATA CLASS= NTUPLES
##ORIGIN= UXNMR, Bruker Analytische Messtechnik GmbH
##OWNER= root
$$ XWIN-NMR		Version 3.5
$$ Tue Apr  2 16:15:04 2024 Russian Standard Time (UT+4h)  she@DPX200
##.OBSERVE FREQUENCY= 200.1309
##.OBSERVE NUCLEUS= ^1H
##.DELAY= (6, 6)
##.ACQUISITION MODE= SIMULTANEOUS
##.ACQUISITION SCHEME= undefined
##.AVERAGES= 8
##.DIGITISER RES= 18
##SPECTROMETER/DATA SYSTEM= spect
##.PULSE SEQUENCE= zg30
##.SOLVENT NAME= MeOD
##.SHIFT REFERENCE= (INTERNAL, MeOD, 0, 15.7039)
##AUDIT TRAIL= $$ (NUMBER, WHEN, WHO, WHERE, WHAT)
$$ ##TITLE= Audit trail, XWIN-NMR		Version 3.5
$$ ##JCAMPDX= 5.01
$$ ##ORIGIN= Bruker BioSpin GmbH
$$ ##OWNER= she
$$ F:/spectra/data/she/nmr/H-F/1/audita.txt
$$ ##AUDIT TRAIL=  $$ (NUMBER, WHEN, WHO, WHERE, WHAT)
(   1,<2024-04-02 16:13:36.34 +0400>,<she>,<DPX200>,
      <created by zg, POWCHK disabled, PULCHK disabled
       configuration hash MD5:
       00 E9 B6 7A A2 85 ED C7 34 08 36 98 17 FE 4E 26
       data hash MD5: 16K
       AB 3D 59 B0 3E CF 6F 02 96 0A 95 FA E2 1A 16 8D>)
$$ ##END=
$$ 
$$ hash MD5
$$ 0C 39 B2 AA 74 E7 AA 3D E0 19 73 D8 2C 2B B1 2A
##$RELAX= 
##$RELAX= 
##$RELAX= 
##$RELAX= 
##$RELAX= 
##$RELAX= 
$$ Bruker specific parameters
$$ --------------------------
##$DU= <F:/spectra>
##$EXPNO= 1
##$NAME= <H-F>
##$PROCNO= 1
##$TYPE= <nmr>
##$USER= <she>
##$AMP= (0..31)
100 100 100 100 100 100 100 100 100 100 100 100 100 100 100 100 100 100 
100 100 100 100 100 100 100 100 100 100 100 100 100 100 
##$AQSEQ= 0
##$AQ_mod= 1
##$AUNM= <au_zg>
##$AUTOPOS= <>
##$BF1= 200.13
##$BF2= 200.13
##$BF3= 200.13
##$BF4= 200.13
##$BF5= 200.13
##$BF6= 200.13
##$BF7= 200.13
##$BF8= 200.13
##$BYTORDA= 1
##$CFDGTYP= 0
##$CFRGTYP= 5
##$CHEMSTR= <none>
##$CNST= (0..31)
1 1 145 1 1 1 1 1 1 1 1 1 1 1 1 1 1 1 1 1 1 1 1 1 1 1 1 1 1 1 1 1 
##$CPDPRG= <>
##$CPDPRG1= <>
##$CPDPRG2= <>
##$CPDPRG3= <>
##$CPDPRG4= <mlev>
##$CPDPRG5= <mlev>
##$CPDPRG6= <mlev>
##$CPDPRG7= <mlev>
##$CPDPRG8= <mlev>
##$CPDPRGB= <>
##$CPDPRGT= <>
##$D= (0..31)
0 1.2 0 0 0 0 0 0 0 0.06 0 0.03 0 0 0 0 0.0002 0 0 0 0 0 0 0 0 0 0 0 0 
0 0 0 
##$DATE= 1712060016
##$DBL= (0..7)
120 120 120 120 120 120 120 120 
##$DBP= (0..7)
150 150 150 150 150 150 150 150 
##$DBP07= 0
##$DBPNAM0= <>
##$DBPNAM1= <>
##$DBPNAM2= <>
##$DBPNAM3= <>
##$DBPNAM4= <>
##$DBPNAM5= <>
##$DBPNAM6= <>
##$DBPNAM7= <>
##$DBPOAL= (0..7)
0.5 0.5 0.5 0.5 0.5 0.5 0.5 0.5 
##$DBPOFFS= (0..7)
0 0 0 0 0 0 0 0 
##$DE= 6
##$DECBNUC= <off>
##$DECIM= 32
##$DECNUC= <off>
##$DECSTAT= 4
##$DIGMOD= 1
##$DIGTYP= 9
##$DL= (0..7)
0 120 120 120 120 120 120 120 
##$DP= (0..7)
150 150 150 150 150 150 150 150 
##$DP07= 0
##$DPNAME0= <>
##$DPNAME1= <>
##$DPNAME2= <>
##$DPNAME3= <>
##$DPNAME4= <>
##$DPNAME5= <>
##$DPNAME6= <>
##$DPNAME7= <>
##$DPOAL= (0..7)
0.5 0.5 0.5 0.5 0.5 0.5 0.5 0.5 
##$DPOFFS= (0..7)
0 0 0 0 0 0 0 0 
##$DQDMODE= 0
##$DR= 18
##$DS= 0
##$DSLIST= <SSSSSSSSSSSSSSS>
$$ [...]
##$SUBNAM2= <"">
##$SUBNAM3= <"">
##$SUBNAM4= <"">
##$SUBNAM5= <"">
##$SUBNAM6= <"">
##$SUBNAM7= <"">
##$SUBNAM8= <"">
##$SUBNAM9= <"">
##$SW= 18.0517689322627
##$SWIBOX= (0..15)
0 0 2 0 0 0 0 0 0 0 0 0 0 0 0 0 
##$SW_h= 3612.71676300578
##$TD= 16384
##$TD0= 1
##$TE= 0
##$TE2= 300
##$TE3= 300
##$TEG= 300
##$TL= (0..7)
0 120 120 120 120 120 120 120 
##$TP= (0..7)
150 150 150 150 150 150 150 150 
##$TP07= 0
##$TPNAME0= <>
##$TPNAME1= <>
##$TPNAME2= <>
##$TPNAME3= <>
##$TPNAME4= <>
##$TPNAME5= <>
##$TPNAME6= <>
##$TPNAME7= <>
##$TPOAL= (0..7)
0.5 0.5 0.5 0.5 0.5 0.5 0.5 0.5 
##$TPOFFS= (0..7)
0 0 0 0 0 0 0 0 
##$TUNHIN= 0
##$TUNHOUT= 0
##$TUNXOUT= 0
##$USERA1= <user>
##$USERA2= <user>
##$USERA3= <user>
##$USERA4= <user>
##$USERA5= <user>
##$V9= 5
##$VALIST= <valist>
##$VCLIST= <CCCCCCCCCCCCCCC>
##$VD= 0
##$VDLIST= <DDDDDDDDDDDDDDD>
##$VPLIST= <PPPPPPPPPPPPPPP>
##$VTLIST= <TTTTTTTTTTTTTTT>
##$WBST= 1024
##$WBSW= 4
##$XGAIN= (0..3)
0 0 0 0 
##$XL= 0
##$YL= 0
##$YMAX_a= 457133
##$YMIN_a= -654334
##$ZGOPTNS= <>
##$ZL1= 120
##$ZL2= 120
##$ZL3= 120
##$ZL4= 120
##$ABSF1= 10
##$ABSF2= 0
##$ABSG= 5
##$ABSL= 3
##$ALPHA= 0
##$AQORDER= 0
##$ASSFAC= 0
##$ASSFACI= 0
##$ASSFACX= 0
##$ASSWID= 0
##$AUNMP= <proc_1d>
##$AZFE= 0.1
##$AZFW= 0.1
##$BCFW= 1
##$BC_mod= 2
##$BYTORDP= 1
##$COROFFS= 0
##$CY= 11.3945322036743
##$DATMOD= 1
##$DC= 2
##$DFILT= <>
##$DTYPP= 0
##$F1P= 15.7292609196834
##$F2P= 12.9074282941183
##$FCOR= 0.5
##$FTSIZE= 0
##$FT_mod= 4
##$GAMMA= 1
##$GB= 0.15
##$INTBC= 1
##$INTSCL= 1
##$ISEN= 128
##$LB= 0.24
##$LEV0= 0
##$LPBIN= 0
##$MAXI= 10000
##$MC2= 0
##$MEAN= 0
##$ME_mod= 0
##$MI= 1.114404
##$NCOEF= 0
##$NC_proc= 0
##$NLEV= 6
##$NOISF1= 3.799351
##$NOISF2= 2.8
##$NSP= 1
##$NTH_PI= 0
##$NZP= 0
##$OFFSET= 15.70392
##$PC= 1
##$PHC0= -25298.92
##$PHC1= 11.98731
##$PH_mod= 1
##$PKNL= yes
##$PPARMOD= 0
##$PSCAL= 0
##$PSIGN= 0
##$REVERSE= no
##$SF= 200.130013532006
##$SI= 16384
##$SIGF1= 3
##$SIGF2= 2
##$SINO= 400
##$SIOLD= 16384
##$SREGLST= <1H.CDCl3>
##$SSB= 0
##$STSI= 0
##$STSR= 0
##$SW_p= 3612.71676300578
##$SYMM= 0
##$S_DEV= 0
##$TDeff= 0
##$TDoff= 0
##$TI= <>
##$TILT= no
##$TM1= 0
##$TM2= 0
##$TOPLEV= 0
##$USERP1= <user>
##$USERP2= <user>
##$USERP3= <user>
##$USERP4= <user>
##$USERP5= <user>
##$WDW= 1
##$XDIM= 8192
##$YMAX_p= 0
##$YMIN_p= 0
$$ End of Bruker specific parameters
$$ ---------------------------------
##NTUPLES= NMR FID
##VAR_NAME=  TIME,          FID/REAL,        FID/IMAG
##SYMBOL=    X,             R,               I
##VAR_TYPE=  INDEPENDENT,   DEPENDENT,       DEPENDENT
##VAR_FORM=  AFFN,          ASDF,            ASDF
##VAR_DIM=   8192,          8192,            8192
##UNITS=     SECONDS,       ARBITRARY UNITS, ARBITRARY UNITS
##FACTOR=    0.0002768,     1,               1
##FIRST=     0,             0,               0
##LAST=      2.2672688,     0,               0
##MIN=       0,             -654334,         0
##MAX=       2.2672688,     457133,          0
$$ Real data points
##PAGE= N=1
##DATA TABLE= (X++(R..R)), XYDATA
$$ [...]
1886A30j41K30l44K00k4n7J36n2n3j86J49j7J65k79K4J96k52K59j44K00P3l57
$$ 130 -11 219 -125 75 51 -6 130 78 25 -161 -12 -29 136 -143 -119 77 -175 84 -60 140 213 -144
1908a44J89J07m0j71J29l7m2j66K45j69K10m8K5j00J34j0o9j34J32j45K71l06
$$ -144 45 152 112 -59 70 33 -9 -175 70 -99 111 63 88 -12 122 112 43 -91 41 -104 167 -139
1930a39Ql6k2K67q2J79l92Q3J03M4j15N3q7L47l2k9r3J92p5m0j22J87k8j21m4
$$ -139 -131 -167 -189 78 -4 175 -217 -134 -31 13 -102 -49 -136 211 179 150 57 249 174 134 12 199 171 50 6
1955Fk14M87j65J01k52k8O8loJ49m1M2j53J47k11R7Q3r7j75K61j24J85j44r6P6
$$ 6 -208 279 114 215 -37 -65 3 0 -6 143 102 144 -9 138 -73 24 107 10 -165 96 -28 157 13 -83 -7
1980gR2l06L70k06K08k46K35J32j86l4j54N6k0P5o4K46k45M2J98l13J1N8K19p0
$$ -7 85 -221 149 -57 151 -95 140 272 86 52 -102 -46 -66 9 -55 191 -54 -12 186 -127 -116 -58 161 91
2004I1j41J88k03q6R4J83J09l51j46J96P9j7k93O0K73P1K18l14m9p3O6Q2J2m0
$$ 91 -50 138 -65 -151 -57 126 235 -116 -262 -66 13 -4 -297 -237 36 107 325 11 -38 -111 -45 37 49 9
2028IM0J77j69k23L07p9j53J80k78J67Q0j86J69l4l0K69o4l49L03m43J43m0J57
$$ 9 49 226 57 -166 141 62 -91 89 -189 -22 58 -128 41 7 -23 246 182 -167 136 -307 -164 -204 -47
2051d7j45K35pj00K05k46J08j06L90l68Q3J32o3O8k23Q2j96L14j35j2j74M9o1
$$ -47 -192 43 36 -64 141 -105 3 -103 287 -81 2 134 71 139 -84 -2 -198 116 -19 -31 -205 -156 -217
2074b17K64o4j60K66J9J48k62K95n35J3J71O5k09M14j44n8M3k19J49J2O2M5l08
$$ -217 47 -17 -177 89 108 256 -6 289 -246 -233 -62 3 -206 208 64 6 49 -170 -21 -9 53 98 -210
2097b10kK72n3N1Pj40p8P6J5K00m09L94k1j99R0O8p2Kk5M7K22k17l0K46j41k26
$$ -210 -212 60 7 58 65 -75 -153 -77 -62 138 -271 123 102 -97 -7 61 -11 -9 -34 13 235 18 -12 234 93 -133
2123a33J45j24o5M3K39j9j29m1P1M2K2k9r9j53K33J12k58K58k58j64K43l56O52
$$ -133 12 -112 -177 -134 105 86 -43 -84 -13 29 51 22 -77 -230 3 115 -143 115 -143 -307 -64 -420 232
2146B32r7k36R3Q8K0P6j51J00k73J71L8l8l3Nj04J82O5k42K28m39M04N6m2p7O3
$$ 232 135 -101 -8 80 100 176 25 125 -148 23 61 23 -10 -5 -109 73 138 -104 124 -315 89 145 103 26 89
2171H9j28J63r3n2J74j75L51l17O2k0K68k24j01P8k2L1J61q5R0k40K59L6k37R4
$$ 89 -39 124 31 -21 153 -22 329 12 74 54 322 98 -3 75 53 84 245 160 250 10 269 305 68 162
2195A62m17J44L13j58k5N9j72J94Q9j66J58q4rk22p9M66m32J5J54P8k19J80L31
$$ 162 -255 -111 202 44 19 78 -94 100 189 23 181 97 88 -134 -213 253 -179 -164 -10 68 -151 29 360
2218C60l25J54k1k85J30j00J98j71J79J05j80j97j4K03k10L69j81k06j18L64o3
$$ 360 35 189 168 -117 13 -87 111 -60 119 224 44 -153 -167 36 -174 195 14 -192 -310 54 -9
2239iJ37k33j52N2M58l05n5R5o1nk6n4K65k21J15r8J62j48J75k06o8J98r8j69
$$ -9 128 -105 -257 -205 253 -52 -107 -12 -73 -78 -104 -158 107 -114 1 -97 65 -83 92 -114 -182 16 -82 -251
2263b51K47j59K31j56r0j39K26J74%j3m9q0Q8j10J02p9k2K11j56K3j92L90j21
$$ -251 -4 -163 68 -88 -178 -317 -91 83 83 70 21 -59 29 -81 21 -58 -80 131 -25 -2 -194 196 75
2286G5Jj19J01j50J22J56j10k44L39k33QJ51l32K15R7k11K76K7j16N4j82L11k48
$$ 75 76 -43 58 -92 30 186 76 -168 171 -62 -54 97 -235 -20 77 -134 142 169 53 107 -75 236 -12
2309a2q4L54j38k02K86k19R3k5L6l3l26J16n5K57j37O5j6nlJ53j72K18j06M9j51
$$ -12 -96 258 120 -82 204 -15 78 53 89 56 -270 -154 -209 48 -89 -24 -40 -45 -48 105 -67 151 45 94 -57
2334e7k4J90l15l4J99l2J49m6k54k1L71Kj38j5J89l01O8j5O3j30K77m60K90N9
$$ -57 -81 109 -206 -240 -41 -73 76 30 -224 -245 126 128 -10 -25 164 -137 -69 -84 -21 -151 126 -334 -44 15
2358A5K94j28r3l82J44J12r4m4K37J43Rl34L25O7m49M6J96j77K94r1N3j85J50
$$ 15 309 181 88 -294 -150 -38 -132 -176 61 204 213 -121 204 271 -178 -132 64 -113 181 90 143 -42 108
2381A08j26l0K49j62L6k3r6j34J20J54k33J77J09j96l3J9J39j71J16r0J5O5j05
$$ 108 -18 -48 201 39 75 52 -44 -178 -58 96 -137 40 149 -47 -80 -61 78 -93 23 -67 -52 13 -92
2404i2J67Ol3o3L2q9J42M9l72K68J32k34r3J32J08Ok22K67r2J46j14j55O7J23
$$ -92 75 81 48 -15 17 -72 70 119 -253 15 147 -87 -180 -48 60 66 -156 111 19 165 51 -104 -37 86
2428H6l44J30J02J31j75rL16k93J78r2n4J60k71L56l87L03j66L3j94J2n7L36j4
$$ 86 -258 -128 -26 105 -70 -79 237 -56 122 30 -24 136 -135 221 -166 137 -29 4 -190 -178 -235 101 87
2451H7O4k06r3J50k6mlL7mm2K12Nm82L84j83Q7K59k11N0j73J70j10K3l7J36n9
$$ 87 151 -55 -148 2 -24 -28 -31 6 2 -40 172 177 -305 79 -104 -17 242 31 81 -92 78 -32 -9 -46 90 31
2477C1k53K31j82K83k1j52k42M47j54j41L22r1j98Qo0J92PlJ66l32qJ45j32j09
$$ 31 -222 9 -173 110 89 -63 -305 142 -12 -153 169 78 -120 -112 -172 20 27 24 190 -142 -150 -5 -137 -246
2501b46J9K42K8j33J77l06K12J78J94j23l37J32j0k9K13k72K42k31P5O3m61M09
$$ -246 -227 15 43 -90 87 -219 -7 171 365 242 -95 37 27 -2 211 -61 181 -50 25 88 -373 36
2523C6J05j69K32q0j46q9P6K3J3n5K8J90j11M2j2j62J8n2L00j92J66o4k06J69
$$ 36 141 -28 204 124 -22 -111 -35 -12 1 -54 -26 164 53 95 83 -79 -61 -113 187 -5 161 97 -109 60
2547F0j57O1J74l26L27J9j7m27N90m28J48n3p9L32m8j06j49J56j59P8j96J65J68
$$ 60 -97 -36 138 -188 139 158 141 -286 304 -124 24 -29 -108 224 176 70 -79 77 -82 -4 -200 -35 133
2570A33o1j59N5K42k32k18M33k71K9j02J42J45m58N81m49J48M7j46K89j30k61
$$ 133 72 -87 -32 210 -22 -240 193 -78 -49 -151 -9 136 -322 259 -190 -42 5 -141 148 18 -243
2591b43J04K9J39N1k89M05k19J4K2j25K42j47L09k91j71N12m29NK59q4k37L7k35
$$ -243 -139 -110 29 80 -209 196 -23 -9 13 -112 130 -17 292 1 -170 342 -87 -82 177 93 -144 -107 -342
2614c42L79k2k96J76K06m4j31N4J28k76M06l50M1O8O4k46O5K19J26q3j86K4M8
$$ -342 37 15 -281 -105 101 57 -74 -20 108 -168 238 -112 -71 -3 61 -185 -120 99 225 142 -44 -20 28
2637B8n4K35l96K56j44k21L93k85L92j59J90k14j32J88j08j12J97n4k74M42j24
$$ 28 -26 209 -187 69 -75 -296 97 -188 204 45 235 21 -111 77 -31 -143 54 0 -274 168 44
2658D4j46J9K90j96j56R8r1R3O1k7m9P2Q3J88l49R7l80M16Q9N1n7J38l19j16J7
$$ 44 -102 -83 207 11 -145 -47 -138 -45 16 -11 -60 12 95 283 -66 31 -349 67 156 207 150 288 -31 -147 -130
2683a30j04J81Q7n4K24j43O6r8N5r1q1N9p7R5J1K81m66K32k34j08rJ21M57k68
$$ -130 -234 -53 34 -20 204 61 127 29 84 -7 -88 -29 -106 -11 0 281 -185 47 -187 -295 -304 -183 274 6
2707FJ05K58l65p0K99j89j16R0j80L08n8q5j09j4M26m04L15j3j68L3jl80L06L16
$$ 6 111 369 4 -66 233 44 -72 18 -162 146 88 3 -106 -120 306 -98 217 204 36 69 68 -312 -6 310
2731C10m28J7j37J20k7Q8J03Lp2J77k37k14L46j76K06j59M0L4l60L66j18K38Q2
$$ 310 -118 -101 -238 -118 -145 -57 46 49 -23 154 -83 -297 49 -127 79 -80 -40 -6 -366 0 -118 120 202
2754B02r6j85m1L00k83J19l46N34m13L76L2k16J59j59j9q4j13M30l98K96p4j19
$$ 202 106 -79 -120 180 -103 16 -330 204 -209 167 199 -17 142 -17 -36 -120 -233 197 -201 95 21 -98
2776i8K02n9J22m69K58o2j82M55J65m38K51k61OJ55m9J45k52J1J2K54p3o0M3k38
$$ -98 104 45 167 -302 -44 -106 -288 167 332 -106 145 -116 -110 45 -4 141 -111 -100 -88 166 93 33 76 -162
2800a62L45J22k94P3k52J08q9K15R7j41P8l53N0J04J07j90K24j9j27K66l04kL75
$$ -162 183 305 11 84 -168 -60 -149 66 163 22 100 -253 -203 -99 8 -182 42 23 -104 162 -142 -144 231
2823B31m65M02l65L18j72n9j16M46m70J78O2J19O5m22K13j0J26O8k10K40k81p6
$$ 231 -234 168 -197 121 -51 -110 -226 220 -250 -72 -10 109 174 -248 -35 -45 81 149 -61 179 -102 -178
2845a78M67j87j48J58p6o4K48j18j4J11o8R4m23K17j13J47q2N2n8j05J82j80J26
$$ -178 289 102 -46 112 36 -28 220 102 88 199 131 225 -198 19 -94 53 -29 23 -35 -140 42 -138 -12
2868a2On0J69k24J65Q7j61j75K84j56K9p3J19L3j5K0K8J18o4k78J51J41J3j20
$$ -12 -6 -56 113 -111 54 141 -20 -195 89 -67 -38 -111 8 41 26 46 74 192 128 -150 1 142 155 35
2892C5k38L08k72N40j92j46k33K14p2n9J01P2j17N2Jk8L18k44k60K56n1R4q9J3
$$ 35 -203 105 -167 373 181 35 -198 16 -56 -115 -14 58 -59 -7 -6 -34 284 40 -220 36 -15 79 -10 3
2916CJ22J20j93r4J78m5j33J63n27O39j76p6M06k59k09M7J41n3l54L50k6l23J68
$$ 3 125 245 52 -42 136 91 -42 121 -406 233 57 -19 387 128 -81 -34 107 54 -300 50 24 -299 -131
2939a31K91j90%O9M1j27l8L74m31K97l79J94L9k01M6N33j16j77k13K04O9j59o9
$$ -131 160 -30 -30 39 80 -47 -85 289 -142 155 -224 -30 9 -192 -146 387 271 94 -119 85 154 -5 -74
2962g4J53j95J67N5j54J13k43K63l58J44R6K55l5k95j38L88j66J60l2j62r6j13
$$ -74 79 -116 51 106 -48 65 -178 85 -273 -129 -33 222 187 -108 -246 142 -24 136 104 -58 -154 -267
2984b67O9J03l9J16J70K9P2j18k72R3L8L32k29l56J65J98j19L6p8k77J35L86r6
$$ -267 -198 -95 -134 -18 152 181 253 135 -137 -44 -6 326 97 -259 -94 104 -15 21 -57 -334 -199 187 91
3007I1k89N60n58L50J6j8jj44N3j4j0k3q5L2j9j65L60k55K59l77J60L7j23K98
$$ 91 -198 362 -196 154 170 152 151 7 60 46 36 13 -72 -40 -59 -224 136 -119 140 -237 -77 -40 -163 135
3031A35k85L25j16M9j06P4J3k3j86q7J31J01j66J67n3j25J99j65M3J66J26R3o1
$$ 135 -150 175 59 108 2 76 89 66 -120 -207 -76 25 -141 26 -27 -152 47 -118 -75 91 217 310 249
3054B49l69J6QJ2L37l78K48R6j63m8j35K3J65k78L83m3j41O9M2o2m4p4J40q0J15
$$ 249 -120 -104 -96 -84 253 -125 123 219 56 8 -127 -104 61 -217 166 123 -18 51 93 31 -13 -87 53 -27 88
3079H8k10J4K27j27Ql2N8j16JK93j69p7k4pl1N02k63N0j23K4J86k42m0r7j90J04
$$ 88 -122 -108 119 -8 0 -32 26 -90 -89 204 35 -42 -66 -73 -104 398 135 185 62 86 272 30 -10 -107 -297 -193
3105a93J97j88R0K18j99O0j48L05j80J47j55j90K22k36J31j11L01j79J09j40P0
$$ -193 4 -184 -94 124 -75 -15 -163 142 -38 109 -46 -236 -14 -250 -119 -230 71 -108 1 -139 -69
3126f9j24p3J46J11k4J81k40J57R5o3k7j73K23k80K28j65m1K95k43k09K10O9l4
$$ -69 -193 -266 -120 -9 -33 148 -92 65 160 97 70 -103 120 -160 68 -97 -138 157 -86 -295 -85 -16 -50
3149e0J96j58r8K62j64j16P9L9m2j07J05j7K3K18l20J46p1l9J09M8j05Or0K11
$$ -50 146 -12 -110 152 -12 -128 -49 -10 -52 -159 -54 -71 -48 170 -150 -4 -75 -114 -5 43 -62 -56 -146 65
3173F5m74L37J10q1l2j34J84K14l43K69N7j51k1J22j06k90K25p6j11J21r3K55
$$ 65 -409 -72 38 -43 -75 -209 -25 189 -154 115 172 21 0 122 16 -274 -49 -125 -236 -115 -208 47
3195D7J68m76M76n45L64Q5r5Q0k73L11m2j57Q0J22M6n39L29k8P9J42j93j98L47
$$ 47 215 -261 215 -330 34 119 24 104 -169 142 100 -57 23 145 191 -348 -19 -47 32 174 -19 -217 130
3218A30k9N3p2O6j72J66J9m12J97m8M7o6P7M8J66n35M82p5J95m20J54J35k92K18
$$ 130 101 154 82 148 -24 142 161 -251 -54 -102 -55 -121 -44 4 170 -365 117 42 237 -183 -29 106 -186 32
3242C2k55K12p8J3K8n0K05l3j48J7J88l20L62k35J01j23o3K34k22J32k3J24j2
$$ 32 -223 -11 -89 -76 -48 -98 107 74 -74 -57 131 -189 173 -62 39 -84 -147 87 -135 -3 -26 98 86
3265H6k03K35j36J35j97P9k9QJ04q4Q5l20L18j84j01L56j67M6j71O9J4K64j97
$$ 86 -117 118 -18 117 -80 -1 -30 -22 82 -2 83 -237 81 -103 -204 152 -15 31 -140 -71 -57 207 10
3288A0k3K63l94k5P8J88k44K09l39K05M4O4K44j77pm6k15J05K76l90K14L3ok47
$$ 10 -13 250 -144 -169 -91 97 -147 62 -277 -72 -28 36 280 103 96 50 -165 -60 216 -174 40 73 67 -180
3312a80K77j02j75K48J45k58K50%k47J56k4k77K9L9K26j15l14M06K10l19J10J08
$$ -180 97 -5 -180 68 213 -45 205 205 -42 114 90 -187 -158 -119 107 -8 -322 84 294 -25 85 193
3334A93m39K72L5M2M9k58J42J12j79j81K79j93M0K64k04M4O9j10M6o8j73K36O8
$$ 193 -246 26 61 103 152 -106 36 148 -31 -212 67 -126 -86 178 -26 18 87 -23 23 -45 -218 18 86
3357H6k32K68m6j81K21k62L30l0k83J69j47J98k23K5J72j0j6KL2L8j53r0M12j66
$$ 86 -146 122 76 -105 116 -146 184 154 -129 40 -107 91 -132 -107 65 55 39 41 73 111 -42 -132 280 114
3381A14K3k43q5J43J71k31J4L6K36j9l59J33M4j44K42k68K02J94j53j1j91J19
$$ 114 137 -106 -191 -48 123 -108 -94 -58 178 159 -200 -67 -23 -167 75 -193 9 203 50 39 -152 -33
3403c3P7J26l68l8L28J76k20L7L8n7j0n4L1j10r6o2N51k19r5Q2J48j46j15p6R7
$$ -33 44 170 -198 -236 92 268 48 85 123 66 56 2 33 -77 -173 -235 316 97 2 84 232 86 -29 -105 -8
3428hJ52j64NO8j37O0ML2J54j1l56K82k12q8K69L2k19N7J59l1j78Q9J4J6K06J08
$$ -8 144 -20 -15 53 -84 -24 -20 12 166 155 -201 81 -131 -219 50 82 -137 -80 79 48 -130 -41 -27 -11 195 303
3454C03l92J1k69L79k22j06K41R5J98j50m2J16l25L52N6j51k16L90k89J02k1k40
$$ 303 -89 -78 -347 32 -190 -296 -55 40 238 88 46 162 -163 189 245 94 -122 268 -21 81 60 -180
3476a80J89l60L73JRR6m71M13o6j0r9p6M68n68J55L8j3O9k1J23q6n6j27K29K24
$$ -180 9 -351 22 23 32 128 -343 70 4 -6 -105 -181 287 -281 -126 -88 -101 -32 -53 70 -16 -72 -199 30 254
3501B54m25o1M44m6j34j33R3j5nK8R8j59J32O3l61o5K50K5J49m9N4l42K5L09j86
$$ 254 -171 -232 212 166 32 -101 -8 -23 -28 0 98 -61 71 134 -227 -292 -42 -17 132 83 137 -205 -180 129 -57
3526e7J17k62K34m1jJ48k87N54n53L96l43J17r3J98m1n1l6N3j85R1n1P7q9K62
$$ -57 60 -202 32 -9 -10 138 -149 405 -148 248 -95 22 -71 127 86 35 -1 52 -133 -42 -93 -16 -105 157
3550A57k42J04O4l41M38l33j09K99r3J45k10J20o2Q2P5k56Q6J72j59J65m3k53
$$ 157 -85 19 83 -258 180 -153 -262 37 -56 89 -121 -1 -63 19 94 -162 -76 96 -63 102 59 -194
3572a94K69j71R6k29L41p6m9j88K83kj03j16P0M20m24J8J81l63K49P3m9j58K18
$$ -194 75 -96 0 -229 112 36 -13 -201 82 80 -23 -139 -69 351 -73 -55 126 -237 12 85 36 -122 96
3595I6p1j76J00K12Jj95L06j35j55k01O2J71l07N79l32j09m2J56J92pq0l22K57
$$ 96 25 -151 -51 161 162 -33 273 138 -17 -218 -156 15 -292 287 -45 -154 -196 -40 152 145 65 -257 0
3618@j99J75o9L33j34K6l36L32j92j12J44j22J64J55k11K3O8P1l02L20l49O00
$$ 0 -199 -24 -93 240 106 132 -204 128 -64 -176 -32 -154 10 165 -46 -23 45 116 -186 134 -215 385
3640C85l52j22J06m44P04j26L7k36R0J46k61k0O4j73L18J58m71L60j60q7L14l32
$$ 385 33 -89 17 -427 277 151 188 -48 42 188 -73 -93 -29 -202 116 274 -197 163 3 -84 230 -102
3662a02j16L10j83K35o9r9J15j73L57j21q5J17j41m2j5o1N2K37r9k16j82O31m66
$$ -102 -218 92 -91 144 75 -24 91 -82 275 154 69 186 45 3 -12 -73 -21 216 117 -99 -281 350 -116
3685a16K58j6k45J29n0Q1m1Rj35J15O3K17l57L33l07K06j66K4J24j2j56J09J46
$$ -116 142 126 -119 10 -40 41 0 9 -126 -11 52 269 -88 245 -62 144 -22 2 126 114 -42 67 213
3708B13R8j37j09r2nk95K83K90k63J51k50n5K89j75J21r2j92K94j45J95j02k15
$$ 213 311 174 65 -27 -32 -327 -44 246 -17 134 -116 -171 118 -57 64 -28 -220 74 -71 124 22 -193
3730a93K70o3J03j34n0L2P5J14k03L5r8O2J8j41k9K83r1q5L60k28j34O9J78m5
$$ -193 77 14 117 -17 -67 -35 40 154 -49 -14 -112 -50 -32 -173 -202 81 -10 -95 265 37 -97 -28 150 105
3754A05j27Q8P6j44J2K40p4%j96n3J04k61J01Lq7L00j18l3j45J53k7p0J87R2o5
$$ 105 -22 66 142 -2 10 250 176 176 -20 -73 31 -230 -129 -126 -213 87 -31 -64 -209 -56 -83 -153 34 126 61
3779F1q5J74l71J80J47M0j79k45M25j30K8p0j50L0J07P8j38J22j91K75k55J00
$$ 61 -24 150 -221 -41 106 146 -33 -278 147 17 45 -25 -175 -145 -38 40 -98 24 -167 108 -147 -47
3801d7p4lK29Q8k59l1RK64n25N20n07J52K02j66K33m13N81k83Q3l90K94J52o8
$$ -47 -121 -124 105 193 -66 -97 -88 176 -349 171 -336 -184 18 -148 85 -328 253 -30 53 -337 -43 109 41
3824D1r2o0K18j11l3j9L65j33k00PJ30k69L58k33j08L15k81j15K58K10j37L9l82
$$ 41 -51 -111 107 -4 -37 -56 309 176 -24 -17 113 -156 202 -31 -139 176 -105 -220 38 248 111 150 -232
3847b32K84k62M14Jj53J07l57K13j4o3M7K06k70O0P9n7M5O7N8j53m0j01Q0q7J65
$$ -232 52 -210 204 205 52 159 -198 15 1 -62 -15 191 -79 -19 60 3 48 115 173 20 -20 -121 -41 -128 37
3872C7k10L20j54K16j77Q1K51k51l04K63j15j34J74J86O9l76P0o2M5o6K12j32
$$ 37 -173 147 -7 209 32 113 364 113 -191 72 -43 -177 -3 183 252 -124 -54 -116 -71 -137 75 -57
3894e7J61j09p6J21k39J71j37K19o4K03j78l28L76l17J46K94q0M3K7j71L02l69
$$ -57 104 -5 -81 40 -199 -28 -165 54 -10 193 15 -313 63 -254 -108 186 106 149 176 5 307 -62
3916f2L47j97n3K86m22K86k76K88k06J36k90J53O0O1J11k99J03L0j7J15q8l93
$$ -62 285 88 35 321 -101 185 -91 197 -9 127 -163 -10 50 111 222 -77 26 56 39 154 66 -327
3938c27M53k06O7p7J9J15J70l10K16R2l8l2o0j30j04o9J62Pj80L26j40N9q2j9
$$ -327 126 -80 -13 -90 -71 44 214 -96 120 212 174 142 82 -48 -152 -221 -59 -52 -232 94 -46 13 -69 -88
3962h8K18J6k02Q8j22R8K53n00M31Q9k59r1k1M6J21o5K45l39K15j45n5k1j9J18
$$ -88 130 146 -56 32 -90 8 261 -239 192 281 22 -69 -90 -44 77 12 257 -82 133 -12 -67 -88 -107 11
3986A1m5J43N7L8l80K30q9K86q8m4k14j62L71k77J36K16k89J24K7J28P3j83j01
$$ 11 -34 109 166 204 -176 54 -35 251 163 119 -95 -257 114 -163 -27 189 -100 24 51 179 252 69 -32
4009c2o0R4k98L82p5r6M6l85M37N2j75P3o6p0J52J14O0j25LL3n3J25k23J38K30
$$ -32 -92 2 -296 86 11 -85 -39 -424 13 65 -110 -37 -103 -173 -21 93 153 28 31 64 11 136 -87 51 281
4034B81j96k49J95R5J01j77R8ok94O5J0J73M0k35J28p6J74n05L83K45m09J75j04
$$ 281 85 -164 31 126 227 50 148 142 -152 -87 -77 96 136 -99 29 -47 127 -378 5 250 -159 16 -88
4057h8Nmj30L9K74k29K28k15K95p9m7l6k34j1J03K7M02l61J02Q8k53J99j02J31
$$ -88 -83 -87 -217 -178 96 -133 95 -120 175 96 49 13 -221 -232 -129 -102 300 -61 41 129 -124 75 -27 104
4081A04j11j22J9P6Q5j42L22n4k35M30k88j02O4q1J63j54j14p1J39K05pLm0j39
$$ 104 -7 -129 -110 -34 51 -91 231 177 -58 372 84 -18 46 -35 128 -26 -140 -211 -72 133 126 129 89 -50
4105e0K01j57m2%R7p6j07L86j39j07j51J01j05Q8P7j8K41q8M0m0j89J47p4j47
$$ -50 151 -6 -48 -48 49 -27 -134 252 113 6 -145 -44 -149 -61 16 -2 239 151 191 151 -38 109 35 -112
4129a12L80l76O4L27j84l2j51j3J66j98Q6n8J89j57m3J05J35k58L55k91O7l2j48
$$ -112 268 -108 -44 283 99 67 -84 -97 69 -129 -43 -101 88 -69 -112 -7 128 -130 225 -66 1 -31 -179
4152a79J50p0J32K05m72J40P4j40J71J16J19k67k2j42P3M6m1L03p7J17l28N2j4
$$ -179 -29 -99 33 238 -234 -94 -20 -160 11 127 246 -21 -43 -185 -112 -66 -107 196 119 236 -92 -40 -54
4175e4L46j06l12P5P9k67kK65K30p2k96J51K33m63J95M4M6n0m6j36K16L1l7J37
$$ -54 292 186 -126 -51 28 -239 -241 24 254 182 -114 37 270 -193 2 46 92 42 -4 -140 76 107 70 207
4199B07l39J09J54n7oj28K53k27LJ32J43j67k95K55p2K62j71p8o2j80J53j39K33
$$ 207 -132 -23 131 74 68 -60 193 -34 -31 101 244 77 -218 37 -35 227 56 -22 -84 -264 -111 -250 -17
4222a7k8L25l64K58j96J00L3k8P7q6k34NJ90j25O8K11k14k48K4J27K45n9l49M40
$$ -17 -45 280 -84 174 -22 78 111 83 160 74 -160 -155 35 -90 -22 189 -25 -273 -249 -122 123 64 -285 155
4246A55r1k76M26l19L49J64l44p4J27k10O8LK30j88m0j08J99k5q2K76l46J45K1
$$ 155 64 -212 214 -105 244 408 64 -10 117 -93 -25 -22 208 20 -20 -128 71 46 -36 240 -106 39 60
4269F0n8R5Q0m81L99n6j72J60l30M25j00j65J64K81l60K8K4j20q5M66J8r5l27
$$ 60 2 97 177 -304 95 39 -133 27 -303 122 22 -143 21 302 -58 -30 -6 -126 -211 255 273 178 -149
4292a49O8o0K28J6L7n0r8J03m8qm3j03oJ41p3J51k79J75J42k2j36L17k07m8O6
$$ -149 -81 -141 87 103 140 90 -8 95 47 39 -4 -107 -113 28 -45 106 -173 2 144 122 -14 303 96 48 114
4317A14j01J26j89p4J83k75L23j4j00K1j0Q6k55K90R2N8j13j63JJ90k57m4J79
$$ 114 13 139 -50 -124 59 -216 107 93 -7 14 4 90 -165 125 217 275 162 -1 0 190 -67 -111 68
4340F8Kj18L7p4M17m28K64l11K00O6k22K19n14L44J34j91j32L77j44M6j07j49
$$ 68 70 -48 -11 -85 332 -96 168 -143 57 123 -99 120 -394 -50 84 -107 -239 138 -6 40 -67 -216
4362b16K50k49O0K68j11N7j21J53J45ok07O6k87J89J29j00j84J49R9k45K52j55
$$ -216 34 -215 -155 113 2 59 -62 91 236 230 23 89 -198 -9 120 20 -164 -15 84 -161 91 -64
4384f4K2j62K9K58Q3p4r5L92l52p7n6K92l16K94n5l71L99J2L2k45M4l6J23n7q0
$$ -64 -42 -204 -175 83 166 92 -3 389 37 -40 -96 196 -120 174 119 -252 147 159 191 -54 -10 -46 77 20 -60
4409f0J49o8j08J1K32k54L90k52JQ7l61J51J76l2k24K37j77J13j61J13J32J27
$$ -60 89 21 -87 -76 156 -98 292 40 41 128 -233 -82 94 62 -162 75 -102 11 -150 -37 95 222
4431B22l26K25n1k01J98J06j77K2J0pl25M46j61n1o5j1L60J2k12M79m5n55K3J34
$$ 222 -104 121 70 -131 67 173 -4 18 28 21 -304 142 -19 -70 -135 -146 214 226 14 493 448 -107 -84 50
4455E0J6j81j2P3L1K99k07j83J48m0J16o0jNJ64l24L13Kl13N8m4J57K93j99l04
$$ 50 66 -115 -127 -54 -23 276 69 -114 34 -6 110 50 49 54 218 -106 207 209 -104 -46 -90 67 360 161 -143
4480a43L48k13L22j89j71K78j50q0l0J08jj78L51j61j74J11l1J69o4kJ89k78k28
$$ -143 205 -8 314 125 -46 232 82 2 -28 80 79 -99 252 91 -83 28 -3 166 102 100 289 11 -217
4503b17K98k7m4k74M85j41k73L0K53p7r1Q5J42k55j47K50M8L7k30J66N3p1mK84
$$ -217 81 54 10 -264 221 80 -193 -163 90 13 -78 7 149 -106 -253 -3 45 82 -148 18 71 0 -4 280
4527B80j58R0k32J35M3l10K86k09J49M6j51j46K31o6J36j16l4P4M9m6j90J09K8
$$ 280 122 212 -20 115 158 -152 134 -75 74 120 -31 -177 54 -12 124 8 -26 48 97 51 -139 -30 -2
4550bJ9rJ85k93j87K18J01R4k20J56L1q0J30m5p5l3Mk50L05K17o16M52o4j34L04
$$ -2 17 8 193 -100 -287 -69 32 126 -94 62 93 13 143 98 23 -10 -6 -256 49 266 -350 102 38 -96 208
4575B08l68L41k81j6J59j81J23j19J05j81l7K48J40N5l94q1N45P6l39r7o6J95
$$ 208 -160 181 -100 -116 43 -138 -15 -134 -29 -210 -247 1 141 196 -198 -279 266 342 3 -94 -160 35
4597C5k58J58J4j28K6K27k6j89L6J01O4n2k0j57J32P1J39J2o9j87L3M8j82J12
$$ 35 -223 -65 -51 -179 -153 74 48 -141 -105 -4 60 8 -12 -169 -37 34 173 185 116 -71 -38 10 -172 -60
4621f0O0K8j35O9k29M72k3o3J9j41K13m54M75l25NJ72j76q8K14j43l3P2K1J83
$$ -60 0 28 -107 -38 -267 205 182 119 138 -3 210 -244 231 -94 -89 83 -93 -181 33 -110 -143 -71 -50 133
4645A33j85k36K80J89p5n1J94j86K4Q0k31p7J03j60L0K50J12l36K22j40N9k08
$$ 133 -52 -288 -8 181 106 55 249 63 87 167 -64 -141 -38 -198 -168 82 194 -142 80 -60 -1 -209
4667b09J15O0N1j4J02j22l2K7J91k03J12q9rj48R9K30k06K40k30L5k25K45q2j42
$$ -209 -94 -34 17 3 105 -17 -49 -22 169 -34 78 -11 -20 -168 -69 161 -45 195 -35 0 -225 20 -62 -204
4691b04J87j26J9J94k05P1l9N9j92M7K66l0k61L63k25L05l07o2L59j93J76k29
$$ -204 -17 -143 -124 70 -135 -64 -103 -44 -236 -189 77 47 -214 149 -76 229 -78 -140 219 26 202 -27
4713b7N8j67R3J9J33m2l7j67M0m8J46L62k97m4J6J33k55K80l41K14Ol8J91l6j72
$$ -27 31 -136 -43 -24 109 67 30 -137 -97 -145 1 363 66 22 38 171 -84 196 -145 69 75 37 228 192 20
4738B0p4K56m87Q9K69j69K0K3k58K09R1J9j15J17j6j26j47K29J38N2k69K03K65
$$ 20 -54 202 -285 -196 73 -96 -76 -53 -311 -102 -11 8 -107 10 -6 -132 -279 -50 88 140 -129 74 339
4761C39j19j77j49Q7R4j6J04k92J56M5r8R2M2k42J62k1J36l52J95M7R8Nj70j56
$$ 339 220 43 -106 -19 75 59 163 -129 27 72 -26 66 108 -134 28 7 143 -209 -14 33 131 136 -34 -190
4785a90K14oP1j14O9J76J3k86j8K21m3q1K7k03L67J3j88q6K4m7p2J66k90J39k7
$$ -190 24 18 89 -25 44 220 233 -53 -71 150 107 26 53 -150 217 230 42 -44 -20 -67 -139 27 -263 -124 -151
4810a51L20l65J72N3R3j44q2K64l59O8Q4J5J02K3j28R3Ol4m6J49l25M77k42q4
$$ -151 169 -196 -24 29 122 -22 -104 160 -199 -131 -47 -32 70 93 -35 58 64 30 -16 133 -192 285 43 -41
4834d1J76j54j5lJ29j97N1J85p4k03L00l91L05j54l9J42Q3j6J4j00J01k43J13
$$ -41 135 -19 -34 -37 92 -105 -54 131 57 -146 154 -237 68 -86 -125 17 100 84 98 -2 99 -144 -31
4857c1L19l16N4pl8j5J53mQk45K29j70j16L57j1k05j25R6K43j43n5n6j08K53Q4
$$ -31 288 -28 26 19 -19 -34 119 115 123 -122 107 -63 -179 178 167 -38 -163 -67 176 33 -22 -78 -186 67 151
4882A51j26J43k27K93k62K05O8k08k48K70o3J79k42J87q4k64K05q4L04k94K2p9
$$ 151 25 168 -59 234 -28 177 245 37 -211 59 -4 175 -67 120 36 -228 -23 -107 197 -97 -75 -154
4904a54L12j09j38K65k6l16j55M98l15J14J88k36J35m49M63j52K9k13L74j29M8
$$ -154 158 49 -89 176 150 -166 -321 177 -138 -24 164 -72 63 -386 77 -75 -46 -259 115 -14 34
4925C4k79J50L07k17OK8J18m17M22k37M9J90o5J39m31L74o7k36o0K20O6j31Q9
$$ 34 -245 -95 212 -5 1 29 147 -270 152 -85 -36 154 89 228 -203 171 104 -132 -192 28 94 -37 52
4948E2q2r1O4p0J67q2J25k09L56k53k65K42j64K53k5J29p0J28l89L06m6RQ2k59
$$ 52 -30 -121 -57 -127 40 -42 83 -126 230 -23 -288 -46 -210 43 18 147 77 205 -184 122 76 85 167 -92
4972i2K67m66L18j91J65M1M0o2m6K10k08j00j20RK97k7q7K1K15j06J01l29K53
$$ -92 175 -291 27 -164 1 42 82 20 -26 184 -24 -124 -244 -235 62 35 -52 -31 184 78 179 -150 103
4995A03Nm65L27m8K83L5l33J43j82M4K8N4j91K67L2k50p8M40m94K40P0j51J8K46
$$ 103 108 -357 -30 -78 205 240 -93 50 -132 -88 -60 -6 -197 70 102 -148 -226 214 -280 -40 30 -121 -103 143
5019A43o2j65k6J28p3j03K18J25j74l6J6j2j92J85J21j88%N5J72J1k3j91J00J34
$$ 143 81 -84 -110 18 -55 -158 60 185 11 -25 -9 -21 -213 -28 93 -95 -95 -40 132 143 120 -71 29 163
5043A63k58j22J61J02j38Q9o5k0M2j56K80r6j8r9J02M24m81K98j29n9J6m4K17
$$ 163 -95 -217 -56 46 -92 -3 -68 -88 -46 -202 78 -18 -36 -135 -33 391 -90 208 79 20 36 -8 209
5066B09l16K22k13J83L8L7k55j69J26m1K84j58p3l0L13n6k77K56m3j03J18Q4p7
$$ 209 -107 115 -98 85 123 160 -95 -264 -138 -179 105 -53 -126 -156 157 101 -176 80 37 -66 52 136 59
5089E9K37k84q2J63k28K39j52J74o4j50j04M99j01j64R0l10K43L5k41O1n2o9J23
$$ 59 296 12 -70 93 -135 104 -48 126 62 -88 -192 307 206 42 132 -178 65 100 -141 -80 -132 -201 -78
5112g8J02k65J36N6L56k54j15K6J04j4r9Q2j73KJ91K3J91j54J13Ql59L49k94J57
$$ -78 24 -241 -105 -49 307 53 -62 -36 68 54 -45 37 -136 -134 57 80 271 117 230 238 -121 228 -66 91
5136I1j62J82J10k20j54J82j29O0P8K93l39J12P9j78M9R4l26N5J06j06J20j02
$$ 91 -71 111 221 1 -153 29 -100 -40 38 331 -8 104 183 5 54 148 -178 -123 -17 -123 -3 -105
5158a05j2N8J00L9j03J14j32p3PJ07J05j66L8j00J47j48L89k22j43M2k4N7J24
$$ -105 -117 -59 41 80 -23 91 -41 -114 -107 0 105 -61 -23 -123 24 -124 265 43 -100 -58 -82 -25 99
5181I9k24L25k70%o2Q5J62j64J4M2J27j33N4j81j72J79M7o3J08l7J79k59J01P7
$$ 99 -125 200 -70 -70 -132 -47 115 -49 -35 7 134 1 55 -126 -298 -119 -72 -135 -27 -64 115 -144 -43 34
5205C4o1J46j49l8J85k72J68m5K85j67m8J70k35J02j20K80l90J13J9J13K44r3
$$ 34 -27 119 -30 -68 117 -155 13 -32 253 86 38 208 -27 75 -45 235 -155 -42 -23 90 334 241
5227B41n6Ok9l4j6k41K25j99J96j98K52k62K93k99J1Q0j22Q7J27P3j52Q7j06J09
$$ 241 185 191 162 128 112 -129 96 -103 93 -105 147 -115 178 -121 -110 -30 -152 -65 62 135 -17 70 -36 73
5251G3j46P8q8J25ML6O8j85j76K09L37k18kj64j96Q1L89k77K03k40j07K12j59
$$ 73 -73 5 -83 42 46 82 150 -35 -211 -2 335 117 115 -49 -245 -164 225 -52 151 -89 -196 16 -143
5274a43J8J79l0m2j8n0k9qJ51K5r8N2J9J62J38k81L3k56K30RJ11j78K01k57k4
$$ -143 -125 54 24 -18 -36 -86 -115 -123 28 53 -45 7 26 188 326 45 78 -178 52 61 172 -6 195 -62 -86
5299h6nm4J52M1J25j73j48R2k81N02k9j78J51p3r0k51K4K85k46J46K93l04J83
$$ -86 -91 -135 17 58 183 10 -138 -46 -327 175 146 -32 119 46 -44 -295 -271 14 -232 -86 207 -97 86
5322H6j50K68k42J60k7qj40M20k87M5j43J27k33J45P0l27L14o10N25k71L73j43
$$ 86 -64 204 -38 122 95 87 -53 367 80 125 -18 109 -124 21 91 -236 78 -532 -7 -278 95 -48
5344d8K39k13K55k82j2n3j29K55k2N4J3k79L06m3j06P0K46k59p6J42j92M45l55
$$ -48 191 -22 233 -49 -61 -114 -243 12 -10 44 57 -222 84 41 -65 5 251 -8 -84 58 -134 311 -44
5367d4J68N5m19K13q6J06J66j26j33J31k3J2m6j36L14j62N0l4L0R8j28J99n49
$$ -44 124 179 -240 -27 -113 -7 159 33 -100 31 8 20 -26 -162 152 -10 40 6 36 134 6 205 -344
5390c44J98j50K43Q3K40j71j40q9J79O8%l53K56J06K4l30J53J50k8j6k65J69O
$$ -344 -146 -296 -53 30 270 99 -41 -130 49 117 117 -236 20 126 150 -180 -27 123 95 79 -186 -17 -11
5413a1l2j15K24N9J96l75k82L16q6J73P5k78O6O9Q4j57J84k2k1k94J89L46k77
$$ -11 -43 -158 66 125 321 -54 -336 -20 -106 67 142 -136 -70 -1 83 -74 110 88 67 -227 -38 308 31
5436C1ln6K6p1J02k41L18k64J43P2o0n1K38j24J1k35J92j94K78k07Q0L03j45l61
$$ 31 28 -28 -2 -73 29 -212 106 -158 -15 57 -3 -54 184 60 71 -164 28 -166 112 -95 -15 288 143 -218
5460b18J44K2J29q2L6P3o9O9M3m22K31L9k63J83K28k22m3N4r9K28p9N1k47K67
$$ -218 -74 -52 77 -5 31 104 35 104 147 -275 -44 -5 -268 -85 143 -79 -122 -68 -167 61 -18 33 -214 53
5484E3J81j41q6j00j50J75K20m2j37K92k25l04J00P0n0J43o1P6P4r8J76p3k34
$$ 53 234 93 7 -93 -243 -68 152 110 -27 265 40 -264 -164 -94 -144 -1 -62 14 88 -10 166 93 -141
5507a41R5J05J86L2p8j86M8j87o7R4J91k34K54m57M54J37j63l1J16l14J7N8J5
$$ -141 -46 59 245 277 199 13 61 -126 -193 -99 92 -142 112 -345 109 246 83 52 168 -146 -129 -71 -56
5530e6qj98L59O0j53l0J38J03j69k36J81J8L9rl7p2P2J05q2L0k14Q3j8Q1J04r4
$$ -56 -64 -262 97 157 4 -26 112 215 46 -190 -9 9 48 39 2 -70 2 107 25 55 -159 -76 -94 -13 91 -3
5556ck00M17l4q8L1j87J5PO9K2L01j71l83J88J93q5k84N5K04q7j51J29P1o7M4
$$ -3 -203 214 180 92 123 -64 -49 -42 27 49 350 179 -204 -16 177 92 -192 -137 67 -20 -171 -42 29 -38 6
5581FQ2j39O0J66j28j81L16j44J23o9lNJ9p5L5r7k08J96j72K05J87J43k52j75
$$ 6 88 -51 9 175 47 -134 182 38 161 92 89 94 113 38 73 -24 -232 -36 -208 -3 184 327 75 -100
5605a00p9K27j04M6R6rr2J66Jm2k16O5J81r4k01Q0J79N0m6j19k29K62j20J42j56
$$ -100 -179 48 -56 -10 86 77 -15 151 152 110 -106 -41 140 46 -155 -75 104 154 108 -11 -240 22 -98 44 -112
5630a12M2k6K20k35K24ok9k83kJ46J73k07O2Q8Q0Nj15l10K01K69l4j50P8j02o0
$$ -112 -70 -96 124 -111 113 107 78 -205 -207 -61 112 -95 -33 55 135 140 25 -285 -84 185 151 1 79 -23 -83
5655h3J66p4p9O8Q7j02j9j02R2j16L15J08j79j12K78k78p8K51j55J76l5j29j30
$$ -83 83 9 -70 -2 85 -17 -36 -138 -46 -162 153 261 82 -30 248 -30 -108 143 -12 164 129 0 -130
5678a30K83j91q2K11k4J54k9l68L08K26k01j83M3R5n1K3k5k38M60k21P7k02K81
$$ -130 153 -38 -120 91 67 221 192 -176 132 358 157 -26 17 112 61 84 59 -179 281 60 137 -65 216
5701B16r6Q4k69M9j03J57J09n1K5q8j7k8K41m75P8J62j3q5L02m78n0J49K62R1
$$ 216 120 204 -65 -16 -119 38 147 96 121 33 16 -12 229 -246 -168 -6 -19 -104 198 -280 -330 -181 81 172
5725A72j21j66J32O7ok76J26j25L94k86J52P4l82K15J39l57N61j41j70r8J90o4
$$ 172 51 -115 17 84 78 -198 -72 -197 197 -89 63 137 -245 -30 109 -248 313 172 2 -96 94 30
5747C0l10R6L74j13jQ3k80J78M2jm37M02nj08k0J60K2m28J33J94Q6j5j14n2j44
$$ 30 -280 -184 190 77 76 159 -121 57 99 98 -339 63 58 -50 -70 90 112 -316 -183 11 97 82 -32 -84 -228
5772b28N34n60O5M5J86m3Or3J64m4O8J47q5k55K33J07k26k5r7o3L21q4p5k28M84
$$ -228 306 -254 -189 -144 42 -1 5 -88 76 32 100 247 162 -93 140 247 21 -4 -101 -164 157 73 -2 -230 254
5797B54k67J15J36k65o9J84l29K73J41j91n5K09j10j3j56J58R1m7j61j0J9P4J36
$$ 254 -13 102 238 -27 -96 88 -241 32 173 -18 -73 136 26 13 -143 15 106 59 -102 -112 -93 -19 117
5820A17J09l98J85J46k76LK98j65J42j32Kj08n2K12j57n3q6J74J72j15o6l6j13
$$ 117 226 -172 13 159 -117 -114 184 19 161 29 31 -77 -129 83 -74 -127 -213 -39 133 18 -48 -84 -197
5843a97L60j15j36J55Q6j93o3J4Q7o6kK45j52j79j0J41mJ76r2k03L86l59K22q0
$$ -197 163 48 -88 67 153 -40 -103 -89 -2 -68 -70 175 23 -156 -166 -25 -29 147 55 -148 238 -121 101 21
5867B1k84N84l16J21j0k9p7k80O62m76J82j49r6p0K48p4J39Ql15K67k48J99j4
$$ 21 -263 321 5 126 116 87 10 -270 392 -84 98 -51 -147 -217 31 -43 96 104 -211 56 -192 7 -7
5890gOk90K92q3Q9M5LO6kL4J0l68J19O8Qr9J33k5k35K40R7Nj54K33Q3k43L33k68
$$ -7 -1 -291 1 -82 7 52 55 121 119 153 163 -205 -86 -18 -10 -109 24 -1 -236 4 101 106 -48 185 268 25 358 90
5918I0k91J08K9J68J0k29M18m59R2J09l24L64l37L80k11O0R9k3p4l3k8K32k66
$$ 90 -201 -93 -64 104 114 -115 303 -156 -64 45 -279 85 -252 128 -83 -23 76 53 -21 -54 -82 150 -116
5941a16J38k19Q4N4j9MR5J35k36K56k85O1J98m05J55J88j65J49n6q5K09l06Q7
$$ -116 22 -197 -113 -59 -78 -74 21 156 -80 176 -109 -48 150 -255 -100 88 -77 72 16 -69 140 -166 -79
5964g9K8O4Rr3j94M47j94N9k8k59K63q5J90N4Q6l34j33L8J77o5k6q8O5O6J10L8
$$ -79 -51 13 22 -71 -265 182 -12 47 19 -240 23 -62 128 182 268 -66 -199 -161 16 -49 -75 -163 -98 -32 78 116
5990A16p4k00P3L4m2M14l68K47j94j56Mj01K70p3J94N8n70O63k58K07n03L66r7
$$ 116 42 -158 -85 -51 -93 321 -47 200 6 -150 -146 -247 23 -50 144 202 -368 295 37 244 -259 107 10
6013A0j11oK49m0n2j01o5K42J5l74K49k05P0K22Ok95J45Q7p3KP4j74J97J9j69
$$ 10 -101 -107 142 102 50 -51 -116 126 141 -233 16 -189 -119 103 109 -186 -41 46 -27 -25 49 -125 72 91 -78
6038g8Oo7j02J87r9q5K15L31l95K20k16K90k58O8K3j1o6L53o4l67J45R5j05P5
$$ -78 -72 -139 -241 -54 -153 -238 -23 308 -87 133 -83 207 -51 17 40 29 -37 316 252 -115 30 125 20 95
6062I5j86o9L59k01J75k48J40k9j61J4J66J57j33j81K68k08J0J09K0j30K9j35
$$ 95 -91 -160 199 -2 173 -75 65 36 -125 -111 55 212 79 -102 166 -42 -32 77 97 -33 -4 -139
6084a39K31j02j11K6K14l09J44m2o9N1j6J90o4J37l80L27q3o7K40j00P5j86K28
$$ -139 92 -10 -121 -95 119 -190 -46 -88 -157 -106 -122 68 4 141 -239 88 5 -62 178 78 153 -33 195
6107A95l15J71J26k47J44J95r1j95N0m7M7K75l09p9l9K13K38m43p5K19L0o9Q6
$$ 195 -120 51 177 -70 74 269 178 -17 33 -14 33 308 -1 -80 -119 94 332 -111 -186 33 63 -6 80
6130H0r8p1L80o1k86j4J70j72j7J37j67J59J11J4j90K98l73J44l4K65q5q1j43
$$ 80 -18 -89 291 230 -56 -70 100 -72 -89 48 -119 40 151 165 -25 273 -100 44 10 275 190 109 -34
6153c4j7J9KK22r5J11k49K33j81j7K02j63J98j12J21j14k27l5m6K45k11J41qr9
$$ -34 -51 -32 -30 192 97 208 -41 192 11 -6 196 33 231 119 240 126 -101 -136 -182 63 -148 -7 -15 -114
6177a14K87j30K00j13k41L06j21r6j29K87L4k43P0P5l02K80l0n5J95j48J07j85
$$ -114 173 43 243 130 -111 195 74 -22 -151 136 170 -73 -3 72 -230 50 20 -35 160 12 119 -66
6199f6J78P0m3r6N3j98N6L17k53Ro2l8J87n4k7j44q4K93O9k13K1J61k45J22j17
$$ -66 112 182 139 43 96 -102 -46 271 18 27 -35 -73 114 60 33 -111 -195 98 167 -46 -25 136 -109 13 -104
6224a04r2K24J72n4j31K3j58K95j7l08J07k99N86j98j02J29j50O0J99k82O2qR7
$$ -104 -196 28 200 146 15 38 -120 175 158 -150 -43 -342 244 46 -56 73 -77 -17 182 -100 -38 -46 51
6247E1j39O6R9M6M8l6l3j16O7j87K21j77j61L97k21n0K12oN2j00m4J39k42J0M2
$$ 51 -88 -22 77 123 171 135 102 -14 53 -134 87 -90 -251 146 -75 -125 87 81 133 33 -11 128 -114 -104 -62
6272f2L56l08J35j26J76k42M0J36k02J22l0L8k1P3j51Q1J12j62K42j52k85K03
$$ -62 294 -14 121 -5 171 -71 -31 105 -97 25 -5 33 12 85 -66 15 127 -35 207 55 -230 -27
6294b7Q7pj20L2O5j3q6k42q5M94l32J61J39k34L79j79m2o5Q5j11o0K47j03J45
$$ -27 60 53 -67 -35 30 17 -69 -311 -396 98 -234 -73 66 -168 211 32 -10 -75 10 -101 -161 86 -17 128
6318A28j52J52J45k68j3O5k7j53J45q5L1k25J76K56k16J9r4J93j8m8J00k55J06
$$ 128 -24 128 273 5 -8 57 30 -123 22 -63 -32 -257 -81 175 -41 -22 -116 77 59 11 111 -144 -38
6341c8J26j14J70k45j05J48J30k7J97k14m2J06k54L70k49P8%p9K57k25j09J01
$$ -38 88 -26 144 -101 -206 -58 72 45 242 28 -14 92 -162 208 -41 37 37 -42 215 -10 -119 -18
6363a8R1k4k18J69o5l31K20K17N5p7J19l7j34p6k6K26j9j05M1p3K76j75l15J39
$$ -18 73 49 -169 0 -65 -396 -176 41 96 19 138 101 -33 -109 -135 91 72 -33 8 -65 211 36 -279 -140
6387a40J3L72j98Q0n08M20j00J8J35l27L36M9R0Rj82K6j69L8K11k80n4J59K56
$$ -140 -127 245 47 127 -381 39 -61 -43 92 -235 101 150 240 249 67 93 -76 -38 173 -107 -161 -2 254
6410B54l62M33k56j8K10l67J02j16K58k36L10l99J85nm2M7mN7m12L22p8L30l52
$$ 254 -108 325 69 51 261 -106 -4 -120 138 -98 212 -187 -2 -7 -49 -2 -6 51 -361 -39 -117 213 -139
6433a39M23j22k08J03n2q3O8j45J09J4M9R9k46K65j89R7n9N6J51k19K42j07q2
$$ -139 284 162 -46 57 5 -78 -10 -155 -46 -32 17 116 -130 135 -54 43 -16 40 191 -28 214 107 25
6456B5j57K05j18K13k36k2k7J80J82j59jJ8k59O9J26K16k08r5J3j02%J28q6K99
$$ 25 -132 73 -45 168 -68 -90 -117 63 245 86 85 103 -156 -87 39 255 47 -48 -35 -137 -137 -9 -95 204
6480B04p1p7L6j62K40m23J74n8Q9K27J07n26K86K3N5N8l91M10r7l64L43k40R7
$$ 204 133 56 92 -70 170 -253 -79 -137 -48 179 286 -240 46 69 124 182 -209 201 104 -260 83 -157 -60
6503f0J7M7k85M39j0J05l68J81l0k46K04J41N5ol72Q2J9j96K6OL61P5M8l13m1
$$ -60 -43 4 -281 158 148 253 -115 66 36 -210 -6 135 190 184 -188 -106 -87 -283 -257 -251 110 185 233 -80 -121
6528a21R8M19k40j68j14L24p1R3L6k20r1Kqj31K70j05P9o9J11j10J4O6k76J16
$$ -121 -23 396 156 -12 -126 198 127 220 256 36 -55 -53 -61 -192 78 -27 52 -17 94 -16 -2 64 -212 -96
6552i6N5K22k98J82R7j80m6j86J59L10m42L39r7k08Q4l5J68j78J46j44J68k56
$$ -96 -41 181 -117 65 162 -18 -64 -250 -91 219 -223 116 19 -189 -105 -140 28 -150 -4 -148 20 -236
6574b36K93m9J4j87K29R9j54K9O9k18n2J30K02O9l05J04j83K48j47j95N13k19
$$ -236 57 8 22 -165 64 163 9 38 107 -111 -163 -33 169 238 -67 37 -146 102 -45 -240 273 54
6596E4L84m54P6j87r3K80Mq7K21j12k98K93o7j17L39j65k90L55K4j36P4O7k00
$$ 54 438 -16 60 -127 -220 60 64 -23 198 86 -212 81 14 -103 236 71 -219 136 160 24 98 165 -35
6619c5K7J0k37K78k18O9j74M35k58K33n9k6nk04J06k16M29J54l53L25j78J00k96
$$ -35 -8 2 -235 43 -175 -106 -280 155 -103 130 71 45 40 -164 -58 -274 155 309 -44 281 103 203 -93
6642i3r8L36k47M4j44K19O7j48q6J98j0J92m79J68MKJ02p0J97l73N9L34j30j62
$$ -93 -191 145 -102 -58 -202 17 84 -64 -150 48 38 230 -249 -81 -77 -75 27 -43 154 -219 -160 174 44 -118
6666a18K13j37p5K33n68N27n3k20K62k29m8L46j72j26K57l68N3J64K10r1q1l0
$$ -118 95 -42 -117 116 -452 75 22 -198 64 -165 -213 133 -39 -165 92 -276 -223 -59 151 60 -21 -51
6688e1k60K92k59L27m8k54K03K19J62n29K12k27K73J20j32Q4m09K39M4j66j6K11
$$ -51 -311 -19 -278 49 1 -253 -50 169 331 -198 14 -213 60 180 48 132 -277 -38 6 -160 -176 35
6710C5lJ95m50K66r9P0q3q2L77k95m7K36k10J00j8k13O9j14L11K4Q1m04K23j41
$$ 35 32 227 -223 43 -56 14 -69 -151 226 -69 -116 120 -90 10 -8 -221 -152 -266 45 69 150 -254 -31 -172
6734a72O7K07n67O28j41q7J73p4J02p4n8K14k64K10j56P1k64q2M27n9J05j98j64
$$ -172 -105 102 -465 163 22 -65 108 34 136 62 4 218 -46 164 8 79 -185 -267 160 101 206 8 -156
6757a56j08K75j9j28R2K48j04l24J11J30R4j59R1l18L18k83M74k81P8j70L68o1
$$ -156 -264 11 -8 -136 -44 204 100 -224 -113 17 111 -48 43 -275 43 -240 234 -47 31 -139 229 168
6779A68k87j18O4M91l77k00M49k19j59O0N2J32K28k34K08l04q6L56k29K40j4k43
$$ 168 -119 -237 -173 318 -59 -259 190 -29 -188 -128 -76 56 284 50 258 -46 -132 224 -5 235 221 -22
6801b2L5lj15J47l58l8N77k07J81k53J10n0J21j22k71N79l89J0K2L04n30K31j1
$$ -22 13 10 -105 42 -316 -354 223 16 197 -56 54 4 125 3 -268 311 -78 -68 -46 258 -272 -41 -52
6824e2J12l3m30L64mq4O9p0K97p6n3m0N9k50K62j14Oo2L3K8Q2J79k27j96K05q
$$ -52 60 27 -403 -39 -43 -127 -58 -128 169 93 40 0 59 -191 71 -43 -37 -99 -66 -38 44 223 -4 -200 5 -3
6850ck26L46k45J06J29N0l36K9L82l35l01J62K29K61m36L52j20K6J70o8l17J42
$$ -3 -229 117 -128 -22 107 157 -179 -150 232 -103 -404 -242 -13 248 -188 164 44 70 240 172 -145 -3
6872cl34J81m5N5l0L23q1l4m9j95K10Q7k64Q2Q2n1PJ08M3l15J28P7K65k08O0J45
$$ -3 -337 -156 -201 -146 -176 147 66 32 -17 -212 -2 85 -179 -97 -15 -66 -59 49 92 -223 -95 -18 247 39 99 244
6898B44k81J21O3n7j99K98p1P5k45L0L3R5k06J81p8j7J34j12k24K80N4l83J60
$$ 244 -37 84 147 90 -109 189 118 193 -52 -22 11 106 -100 81 3 -14 120 8 -216 64 118 -265 -105
6921a05J70jJ41j18J44j50k13Q8J8N9q6J8K40k63J47O6q1k62PJ79q7J1k02K39
$$ -105 65 64 205 87 231 81 -132 -44 -26 33 -53 -35 205 -58 89 155 74 -188 -181 -2 -89 -78 -280 -41
6945d1j5q9J57J97j37j9l3l51M34o7M8M7j10J04j12PK9M0q2k3l29M39j54J23l05
$$ -41 -56 -145 12 209 72 53 20 -331 103 36 84 131 21 125 13 20 49 89 7 -16 -345 94 -60 63 -242
6970b42K08L41j00j31j71J55k44R3n8j96N77j70k65K75j12q5MK50k72J07M6j22
$$ -242 -34 307 207 76 -95 60 -184 -91 -149 -345 232 62 -203 72 -40 -125 -121 129 -143 -36 10 -112
6992a12r6J86L0l7J19r8J51K06j49k72j2K0m5J53k70K24J13l34J89J63j71P5j22
$$ -112 -208 -22 8 -29 90 -8 143 349 200 -72 -84 -64 -109 44 -226 -2 111 -223 -34 129 -42 33 -89
7015h9p8J18L19k34J1L4j85MJ67N0j68o7K21k13J8q2r6N64m77K15m6j7K33l11
$$ -89 -167 -49 270 36 47 81 -104 -100 67 117 -51 -118 103 -110 -92 -174 -270 294 -183 32 -14 -31 202 -109
7039a09L1K29j93l0N5l38L92Jm1k05L91j21J06j24l1jJ53k60J59o5j65J12M7N3
$$ -109 -78 151 -42 -72 -17 -355 37 38 -3 -208 183 62 168 44 13 12 165 -95 64 -1 -166 -54 -7 46
7063D6J70j24j52J31k29J25O6o2Q9j0l66K69j03j79L94K46n24J74r0J50j02p8
$$ 46 216 92 -60 71 -158 -33 33 -29 60 50 -316 -47 -150 -329 65 311 -213 -39 -129 21 -81 -159
7085a59q9L48m9j5k87K33K5l0N9J15OM2n9j56j7K3k29J95K44k89K5J00J71j05
$$ -159 -248 100 51 36 -251 -18 7 -23 36 151 157 199 140 -16 -33 -10 -239 -44 200 -89 -64 36 207 102
7109A02j85J97Lj51O3J26m34J62O6j48O3j31M0L78J9l28M01l26j42Q3K68L2q7
$$ 102 -83 114 117 -34 29 155 -279 -117 -51 -199 -136 -267 -227 151 170 -158 243 -83 -225 -142 126 158 71
7132G1j13n5O3K43l69J62J09P8k67Q6J52k95J9J20k27K97j94j71ON78l63M8Q1
$$ 71 -42 -97 -34 209 -160 2 111 189 -78 8 160 -135 -116 4 -223 74 -120 -291 -285 293 -70 -22 59
7155E9j71j2J28q4K53O3l35K25k65L03j14k03O3n9K68L10k81O6j96j34K10Ko9
$$ 59 -112 -124 4 -80 173 236 -99 126 -139 164 50 -153 -90 -149 119 429 148 214 18 -116 94 96 27
7178B7l30J40N7P0j97K36J14m6m7K75k63O7k43j28L49l68J26J39j99N44o14L96
$$ 27 -303 -163 -106 -36 -233 3 117 71 24 299 36 103 -140 -268 81 -287 -161 -22 -221 323 -291 105
7200A05k12k52L19L8M4J31k04q9j0K29J4o4j50j06O5J57k4o7J03l9j15J3j63M11
$$ 105 -107 -359 -40 -2 42 173 -31 -120 -130 99 113 49 -101 -207 -142 15 -9 -76 27 -12 -127 -114 -277 134
7224A34qJ9J01n13L62k22J93j28k96K61J24N1J20j28rj74N8J15m5P1k31L08l45
$$ 134 126 145 246 -267 95 -127 66 -62 -358 -97 27 78 198 70 61 -113 -55 60 15 86 -145 163 -182
7247a82P0j0J73j52K38j67L2J77k42p3R0J48j20k33J66J09M9k21kL18p9P2Q0J39
$$ -182 -112 -122 51 -101 137 -30 2 179 -63 -136 -46 102 -18 -251 -85 24 73 -148 -150 168 89 161 241 380
7271C80n51J91j63K18m9K1J2Q9p7J96l01J72j16j41M7K23j2k6l21Q3K85k19J37
$$ 380 -171 20 -143 75 26 47 59 148 71 267 -34 138 22 -119 -72 151 139 113 -208 -125 160 -59 78
7294G8j31J28K0l16K9K98j55j49K10j29M27k37k69M4J27K40l32K30j23m0Mq8J95
$$ 78 -53 75 95 -221 -192 106 -49 -198 12 -117 310 73 -196 -152 -25 215 -117 113 -10 -50 -46 -134 61
7317F1r7J03J99l53N3J83j31O4j52j16K87j63J77M4k14J9jJ39k24O9J20J04k94
$$ 61 -36 67 266 -87 -34 149 18 82 -70 -186 101 -62 115 159 -55 -36 -37 102 -122 -53 67 171 -123
7340a23J27J47k67Q5k1k12J25K31J55j38j23o1O4m1p6K72m00P9J75o8J3r5K44
$$ -123 4 151 -116 -31 -52 -264 -139 92 247 109 -14 -75 -11 -52 -128 144 -256 -177 -2 -70 -57 -152 92
7363I2j68Q2j14J91p4k43L33J58n00L91j21q6M9J02Q8j7m4o8j70K39L63o29j4
$$ 92 -76 6 -108 83 9 -234 99 257 -243 148 27 -59 -10 92 180 163 119 51 -119 120 483 -146 -160
7386a60n9M97l18j59J62J4L14m14L28L3k32N9J8j9j91j26L0M05k77J91M0r3o6
$$ -160 -219 278 -40 -199 -37 -23 291 -123 205 238 6 65 83 64 -127 -253 -223 182 -95 96 136 43 -23
7409b3K46k3j83P8l4k60J54J8J75p4O1J17k76p7LR6K24k92k08K22n7Q5J16j18
$$ -23 223 200 17 95 61 -199 -45 -27 148 74 135 252 -24 -101 -98 -2 222 -70 -278 -56 -113 -28 88 -30
7433c0o3K86j47p7j49J87k2q0K44J04q2J1j70j9p8K62l13J45J0J69m02J41N9J64
$$ -30 -93 193 46 -31 -180 7 -15 -95 149 253 171 182 12 -7 -85 177 -136 9 19 188 -214 -73 -14 150
7457A50J67l28R9q3J42K3j51O5r2O0p9J32k72J44J95k51L38q3P4j51J49j29k56
$$ 150 317 -11 88 5 147 170 19 84 -8 52 -27 105 -167 -23 172 -79 259 176 250 99 248 119 -137
7480a37L50j48k08K1P6J26J60l37J23O5j89R5J93Q2k14k04J04K97l58Q4L9L24
$$ -137 213 65 -143 -122 -46 80 240 -97 26 91 -98 -3 190 272 58 -146 -42 255 -103 -19 20 344
7502C44k68k2l20J87J05R0pP9j15o6r9j99L06J77l32p0M27k21k60L16m8k15K34
$$ 344 76 54 -266 -79 26 116 109 188 73 7 -92 -291 15 192 -140 -210 217 -4 -264 52 4 -211 23
7525B3j1j49K20l3J20m7m81M66k87K26j08m3r4K90j80j78L84j01j70Q0N00m66
$$ 23 12 -137 83 50 170 123 -358 108 -179 47 -61 -104 -198 92 -88 -266 118 17 -153 -73 427 -39
7547c9J29PP1j68j72J81j83j15M44j90K37R5m38L76j64k21J9J6J94r6l4j36L9
$$ -39 90 97 168 0 -172 9 -174 -289 155 -35 202 297 -141 235 71 -150 -131 -115 79 -17 -51 -187 -148
7570a48K99j9l34J5J45M9j00J05J63j57K49k50K42j29j25K49l86K29J2k34Q4K39
$$ -148 151 132 -202 -187 -42 7 -93 12 175 18 267 17 259 130 5 254 -132 97 109 -125 -41 198
7592A98k84M2j7k15J93L33k33m7p4J71L1k16K5M78k57k77J86j13N9J70j71m31
$$ 198 -86 -44 -61 -276 -83 250 17 -30 -104 67 98 -118 -93 385 128 -149 37 -76 -17 153 -18 -449
7614d49M67N5J75o4Q3j21J0j15m1q9J36n3k11J51l7J46K34j52J0J38j78j15nL6
$$ -449 18 73 248 184 267 146 156 41 0 -89 47 -6 -217 -66 -103 43 277 125 135 273 95 -20 -25 11
7638A1k49j09M70l25J28l7j58K88l34K84J22o3J59l68J02J79k75L35o8k50K20
$$ 11 -238 -347 123 -202 -74 -111 -269 19 -315 -31 91 28 187 -181 -79 100 -175 160 92 -158 62
7659F2k22K54k36m7J30O6N4K03k31m9pO9N5j66p9K8j15K31J66j02j94Q0K71l90
$$ 62 -160 94 -142 -189 -59 7 61 264 33 -16 -23 46 101 -65 -144 -116 -231 0 166 64 -130 -50 221 -169
7683a69l8L11K02l35L44m37LK84l78M10k81o4J67p0K56j91j36L35j18j38J17j89
$$ -169 -207 104 306 -29 315 -122 -119 165 -213 197 -84 -148 19 -51 205 14 -122 213 95 -43 74 -115
7705a15J6L7j78N52k30n7%J18j08l3Kj48L9j62L61j77J75k06O1k3r4L40l33K11
$$ -115 -99 -62 -240 312 82 25 25 143 35 2 4 -144 -105 -267 94 -83 92 -114 -53 -76 -170 170 -163 48
7729D8j21O9J14R4O4k13j63J65j5P6p5j13L13k44M4K30m44L19J29m67K01k84L99
$$ 48 -73 -4 110 204 268 55 -108 57 42 118 43 -70 243 -1 43 273 -171 148 277 -190 11 -273 126
7752A26j38L3q0M8K02J6q4k03J40k81J04oK51N1j6k79K07J62l05K02O1j64J19
$$ 126 -12 21 -59 -11 191 207 123 -80 60 -221 -117 -123 128 179 163 -116 91 253 -52 150 211 47 166
7775A66l77K10N1K5k05J95l5j5J03j44j21m6K88J1j96j95M61j16Oj0Q7l09L47
$$ 166 -211 -1 50 75 -130 65 30 15 118 -26 -147 -193 95 106 -90 -285 176 60 66 56 143 -166 181
7798A81Ol57P0N2R7M8J86l83J48k3L7k30nJ91K42k41q4K85k28K10j39k18J94M
$$ 181 187 -170 -100 -48 49 97 283 -100 48 25 62 -168 -173 18 260 19 -65 220 -8 202 63 -155 39 43
7822D3l3R4l7Q5j85K14n67J42L81k2k78L26K17m48K01n7k42k62N43j94J56qJ31
$$ 43 10 104 67 152 -33 181 -386 -244 137 115 -163 163 380 -68 133 76 -166 -428 115 -79 77 69 200
7845B00k80Q3j89J8K11m5l0J65k01k3K2j3K5Q6Qr9R0k7j57O4L99m81J30L76l17
$$ 200 -80 3 -186 -168 43 -2 -32 133 -68 -91 -69 -82 -57 29 37 -62 28 1 -156 -92 307 -174 -44 332 15
7870A5m71M73o7J0j51K05K75l94J9O4J29q4R8j32oJ13j42l39L85m8J11Qj30m3
$$ 15 -456 17 -50 -40 -191 14 289 -105 -86 -22 107 23 121 -11 -17 96 -46 -385 0 -48 63 71 -59 -102
7894a02L0J44k19K00l78K98J8jJ09j91j31K33J20k39L0ko6K48L2m5k18J46j38
$$ -102 -72 72 -147 53 -325 -27 -9 -10 99 -92 -223 10 130 -109 -79 -81 -147 101 133 88 -130 16 -122
7917a22o6K28J59J1l27L93m67rL17k5j13J48Pj89K27l34J61j01L4l6K11j37O2
$$ -122 -188 40 199 210 -117 276 -191 -200 117 92 -21 127 134 -55 172 -162 -1 -102 -68 -104 107 -30 32
7940C2m7K56m01J11J19k08K01k8J08q8r5M09m67Q1J03N5j70K1O4q5jM4n8k6J20
$$ 32 -15 241 -160 -49 70 -138 63 35 143 55 -40 369 -98 -17 86 141 -29 -8 56 -29 -30 14 -44 -70 50
7965E0o4l1J55j64K55j5l05J64j96k5L43Mj73K55l04J32k63J7L64j32o6J26J21
$$ 50 -14 -45 110 -54 201 186 -119 45 -151 -176 167 171 -2 253 -51 81 -182 -165 199 67 1 127 248
7988B48n00K26lR8R8k12J16J43k36r1K29j44j16K32m3k39L03j2j79R4M2O0l1j22
$$ 248 -252 -26 -29 69 167 -45 71 214 -22 -113 116 -28 -144 88 45 -194 109 97 -82 12 54 114 83 -39
8012c9l2J9K18k16qM0K93m06P5j0J50k8j52J33j70j24M58j18r3O5k4j49J36q6
$$ -39 -71 -52 166 -50 -58 -18 275 -131 -56 -66 84 56 -96 37 -133 -257 201 83 -10 55 31 -118 18 -68
8036f8L26j28j55J72N0l64J81J9k59L96k31j30J45J41J04l82K57o1n7J18M6m6
$$ -68 258 130 -25 147 197 -167 14 33 -226 170 -61 -191 -46 95 199 -183 74 13 -44 74 120 74
8058G4P3k0lj44K98l84J52J8j99J50K7j23L83k98K4j73J17J09J79o7k76J97l53
$$ 74 147 127 124 -20 278 -106 46 64 -135 15 42 -81 302 4 28 -145 -28 81 260 193 -83 114 -239
8081b39J54K8O7p5J50j7j43J68k3l40J55k8j05L63j13P4j89j24L89j37k42J22
$$ -239 -85 -57 10 -65 85 68 -75 93 70 -270 -115 -143 -248 115 2 76 -113 -237 152 15 -227 -105
8103a05P7j36Q1qJ45rL00m91J67Q7o8j10LP3n3kR3j64K51Rj71o0J01R5j43m3K91
$$ -105 -28 -164 -83 -91 54 45 345 -146 21 108 40 -70 -67 6 -47 -49 44 -120 131 140 -31 -91 10 105 -38 -81 210
8130B10k60N6j37K12J15k12N4K5O0j74%M1m0J61j72j27K10p7M1qL2k11M06k28
$$ 210 -50 6 -131 81 196 -16 38 63 123 -51 -51 -10 -50 111 -61 -188 22 -55 -14 -22 10 -201 205 -23
8154b3J05j15J69l27K34L8p7j0N5p0m7K64k42J0M61l16M9n05L12q1O2r2J63J48
$$ -23 82 -33 136 -191 43 81 4 -6 49 -21 -68 196 -46 -36 425 109 158 -347 -35 -116 -54 -146 17 165
8178A65m67J65K01Q7k3q3M1n1k5J0j88J92J8
$$ 165 -302 -137 64 151 128 45 86 35 10 20 -168 24 42
8191D2
$$ Imaginary data points
##PAGE= N=2
##DATA TABLE= (X++(I..I)), XYDATA
0@%%%%%%%qJ6j6K4l2M0n6P2q8J04j28J60j98K39k82L37m00M72n53O42p44Q59r88
$$ 0 0 0 0 0 0 0 0 -8 8 -8 16 -16 24 -32 40 -48 56 -72 88 -110 129 -153 184 -216 256 -297 345 -399 460 -528
30e28J132j291J469j668J885k124K388k677K995l346L729m145M602n100N641o236
$$ -528 604 -687 782 -886 999 -1125 1263 -1414 1581 -1765 1964 -2181 2421 -2679 2962 -3274
46c274O887p597Q372r221J0156j1189J2333j3600J5015j6605J8407k0470K2851
$$ -3274 3613 -3984 4388 -4833 5323 -5866 6467 -7133 7882 -8723 9684 -10786 12065
59A2065k5636K8947l2963L7955m4349N2870o4854Q3049j14255J81910n73432L35728
$$ 12065 -13571 15376 -17587 20368 -23981 28889 -35965 47084 -67171 114739 -458693 -122965
71a22965N41528j072897P47716K23842p68528N04278K80736p51317L87363J44302
$$ -122965 418563 -654334 93382 317224 -451304 52974 333710 -417607 -30244 114058
81A14058m60937L63016J40108m98720K58710K28083k23096P3289J51746j49869
$$ 114058 -346879 16137 156245 -342475 -83765 144318 -78778 -5489 146257 -3612
91c612m2414J47282L325k91744N9250K45106k13236M4280K85890l67103M5150
$$ -3612 -46026 101256 104581 -187163 -127913 117193 -96043 -51763 234127 -132976 -87826
102h7826M70201l95405j19948M25068l84354m0729M71035m36976q1738M95416
$$ -87826 382375 -13030 -132978 292090 -92264 -132993 338042 -98934 -180672 314744
112C14744l81663k0413M73395m64456p2698N33875l55271j48994L67183l04851
$$ 314744 -66919 -87332 386063 -78393 -151091 382784 27513 -121481 245702 -59149
122e9149o4641L49224k47968q5590K42333j37076K9438J51659k09410k3843J40118
$$ -59149 -123790 225434 -22534 -108124 134209 -2867 26571 178230 -31180 -55023 85095
133H5095q2073k3213L1897l7116L848J9957N1911l7705j05799J22137M2461j35985
$$ 85095 3022 -20191 11706 -25410 -21562 -1605 50306 12601 -93198 28939 71400 -64585
145f4585J03424r709j66909J78764J6356k12729J48718J6960j32968K18688n2244
$$ -64585 38839 29130 -137779 40985 57341 -155388 -6670 10290 -122678 96010 43766
156D3766k11880K24741k7022j82675K24918p1686k01025K63913p634j97136J75278
$$ 43766 -168114 56627 29605 -153070 71848 162 -200863 63050 55416 -141720 33558
167C3558k9527j27932J92067l4519j33180J34119k9748o6079J17859p4672q1370
$$ 33558 4031 -123901 68166 33647 -99533 34586 4838 -61241 56618 -18054 -99424
178i9424J26269J886n3157M4545j5753k4457L5204J7282k8257m8028L4042M9867
$$ -99424 26845 28731 -24426 20119 4366 -20091 15113 32395 4138 -43890 -9848 40019
190D0019m9950J2105K6747p3982N2486O2493j01502K6033N3064q3705O8341L8047
$$ 40019 -9931 2174 28921 -45061 7425 69918 -31584 -5551 47513 -36192 32149 70196
202G0196j42148O6469P6643j20107O4046N5089j36283P5346Q8016j32131K2252
$$ 70196 -71952 -5483 71160 -48947 15099 70188 -66095 9251 97267 -34864 -12612
213a2612N6562r0398N5334N3022j02125K6271N0462n9756L3530K0227p6610L2778
$$ -12612 43950 -46448 8886 61908 -40217 -13946 36516 -23240 10290 30517 -46093 -13315
225a3315N4870m6651q053K0412k6183J400L1156j3171l2246J9187L3369j9838
$$ -13315 41555 -5096 -13149 7263 -18920 -17520 13636 465 -31781 -12594 20775 937
237I37r440J2034l0145R600M2359l8548j3511L8171k8262R440M2079o5169p397
$$ 937 -8503 3531 -26614 -17014 25345 -13203 -26714 11457 -16805 -7365 34714 -30455 -37852
250c7852P0982m0182j3187N4319n3651j3424P2798l9762l4593N0024k1227o236
$$ -37852 33130 -7052 -20239 34080 -19571 -32995 39803 41 -34552 15472 -5755 -11991
262a1991N0351l7407k5436M5341j5679j3461L1206k8734j3487M8756q672l1112
$$ -11991 38360 953 -24483 20858 5179 -8282 22924 -5810 -19297 29459 20787 -10325
274a0325J9106k244j4490K5759L719l0155Q240K1991j2620n539N790j6630N071
$$ -10325 8781 6537 -7953 17806 21525 -8630 -390 21601 8981 3442 9232 -7398 -2327
287b327K5658j4855j3446J8343j0049m883K3132k3178j9953L6852j753k2512K2720
$$ -2327 23331 8476 -4970 13373 3324 -1559 21573 -1605 -21558 15294 13541 -8971 13749
300A3749j0984k3705L3972J49l2045J8357N231j6136K3005m952l1355K0289R766
$$ 13749 2765 -20940 13032 13181 -18864 -507 4724 -11412 11593 6641 -24714 -4425 5341
313E341k0791J6124K428k5173K0646J4060k9006K033J3955j4967Q287J4835k0885
$$ 5341 -15450 674 3102 -22071 -1425 12635 -16371 -14338 -383 -15350 -7063 7772 -13113
326a3113k522J9157q358o452Q762j0373l36K0708q165j3219J2870l229q517J7411
$$ -13113 -15635 3522 -4836 -11288 -2526 -12899 -13235 7473 -692 -13911 -1041 -4270 -12787 4624
340D624m510j8468J9021R046j7817Q576L525j8151J3877J2127j9979M985J2856
$$ 4624 114 -18354 667 9713 -8104 472 3997 -14154 -277 11850 -8129 -3144 9712
353I712j2842O578Q306j9599L886J6910j2261Q78J1463j5254J724J6382j3216
$$ 9712 -3130 3448 11754 -7845 -3959 12951 690 1568 13031 -2223 -499 15883 2667
366B667p519J4675m867l898J3036p442j0743J2653Q09j0550P352O52q892J1025
$$ 2667 -4852 9823 4956 1058 14094 6652 -4091 8562 9371 -1179 6173 6825 -2067 8958
380H958L557j5497M927O723j1579O328P837j5993M139J3478j4329j391J0832j3436
$$ 8958 12515 -2982 1945 8668 -2911 3417 11254 -4739 -600 12878 -1451 -2842 7990 -5446
394e446J418J4621j3001l275J2981j0206k175J1049j1216k774J3146o163m820
$$ -5446 -4028 10593 -2408 -5683 7298 -2908 -5083 5966 -5250 -8024 5122 -1041 -5861
407e861Q693o424m143R022k840o484O191J285m406L048J697o616R92O297m708
$$ -5861 2832 -3592 -7735 1287 -1553 -8037 -1846 -561 -4967 -1919 -222 -6838 -5846 451 -4257
422d257k039P589m558l341J0079o856n967J2242m238p233J3672n625q732J4578
$$ -4257 -6296 1293 -3265 -6606 3473 -3383 -9350 2892 -1346 -8579 5093 -532 -9264 5314
436E314m956r867J4497m397r237J5237m480r218J3249m885p893J2034l587o189
$$ 5314 358 -9509 4988 591 -8646 6591 2111 -7107 6142 1257 -6636 5398 1811 -4378
450d378J0419l931n253P967l709k431N413k988j179L504k080P82o36j002K844
$$ -4378 6041 2110 -3143 4824 1115 -1316 4097 1109 -70 3434 1354 2136 1500 498 3342
465C342l281j31M865n886J858N440r370K255P487j0515M333O139j2726O214P734
$$ 3342 61 -70 4795 -1091 767 6207 -3163 -908 6579 -3936 397 6536 -6190 24 7758
480G758j3758O261N654j4663R903O371j5608Q948M358j3688J0463K595j3730J0347
$$ 7758 -6000 261 5915 -8748 1155 7526 -8082 866 5224 -8464 1999 4594 -9136 1211
494A211K574j0512R605j981q876J0699j573p128Q028l451l162Q589m549k966M474
$$ 1211 3785 -6727 2878 897 -7979 2720 1147 -5981 2047 -1404 -4566 4023 -526 -3492 982
509I82m191K920K930o825M506P99n023P731l065p067J0011k565n116J0278p578
$$ 982 -3209 -289 2641 -4184 322 1121 -3902 3829 764 -6303 3708 1143 -3973 6305 -1273
524a273l793J3258q813l797J2285j1506N28J4707j3953k036J3157j2097J969J2259
$$ -1273 -5066 8192 -621 -4418 7867 -3639 -3111 11596 -2357 -4393 8764 -3333 -1364 10895
538A0895j5301J314J2232j1331K476P330j2862M942Q235j0641L443L394p553O352
$$ 10895 -4406 -3092 9140 -2191 285 7615 -5247 -305 7930 -2711 732 4126 -3427 2925
552B925J522o839L071o80l61M692n479p14M731n196L691K785j0749N834N525r795
$$ 2925 4447 -2392 679 -1 -362 4330 -1149 -1863 2868 -2328 1363 4148 -6601 -767 4758 -5037
568e037P354M51j2024J1667K560j3133J0228j98j1300J4258j183j4396J2183P10
$$ -5037 2317 2768 -9256 2411 4971 -8162 2066 1868 -9432 4826 3643 -10753 1430 2140
582B140j0001J1691l396r858J2015j240p200Q250n167l323R649l744l794M339
$$ 2140 -7861 3830 434 -9424 2591 1351 -5849 2401 -2766 -6089 3560 -184 -3978 361
596C61l495J302M117m850N96J185j950N652k817n141P007k459k272P486o625l166
$$ 361 -3134 -1832 2285 -2565 -1969 -784 -2734 2918 101 -5040 1967 -492 -2764 4722 -1903 -5069
612e069J0743n927k565P962q446M89J0686r436j739R134q188J576Q854j1023K8
$$ -5069 5674 -253 -2818 5144 -3302 -2813 7873 -1563 -3302 5832 -2356 -780 8074 -2949 -2921
627b921Q662o133J335M289q378K983N341n467J932L92m289N280Q36m897K467j062
$$ -2921 5741 -392 943 5232 -3146 -163 5178 -289 1643 2035 -2254 3026 3862 -1035 1432 370
643C70p22M696l697k349L986k987J971L090p575K137N102n037K029J646o813M716
$$ 370 -352 4344 647 -1702 2284 -703 1268 4358 -3217 -1080 4022 -1015 1014 2660 -4153 563
659E63L530o398K254Q47m494O125K61o702M160L45l283N304k293m954N533k64
$$ 563 4093 -2305 -51 796 -3698 2427 2688 -4014 146 491 -2792 2512 219 -4735 798 534
675E34j794K535l949p35N568k555j029J827l786K487L976n281j35K388k169K640
$$ 534 -1260 1275 -2674 -3409 2159 -396 -1425 402 -3384 -897 3079 -2202 -2337 51 -2118 522
691E22J197m844J470K342j955K387j542k708L915P20k332J176j445o41L327p11
$$ 522 1719 -3125 -1655 687 -1268 1119 -423 -3131 784 1504 -828 348 -1097 -1738 1589 878
707H78k159P61l18J664J562l802L09J835j122K385k14m313K095K551k004J118
$$ 878 -1281 -520 -838 826 2388 -1414 -1105 730 -392 1993 1779 -2534 -439 2112 108 1226
723A226j070k569L946O20l251J821m80j817M223j018l968K644O36j101J949j415
$$ 1226 156 -2413 1533 2153 -1098 723 243 -1574 2649 1631 -2337 307 943 -158 1791 376
739C76k497K754O46j233K80j402J15K509p01j213j14JJ038K25j167k62L3O07J759
$$ 376 -2121 633 1279 46 326 -1076 -961 1548 847 -366 -480 -479 559 784 -383 -645 -612 -5 1754
758A754j887j370J669l07M91P92k638k13K883o27p40M79j834J012K673k459p43
$$ 1754 -133 -1503 166 -141 350 1142 -1496 -1709 1174 547 -193 286 -1548 -536 2137 -322 -1065
775a065J395j393J435J575k641p82K466p10p5M76j751Q01J990j325n39J59o97
$$ -1065 330 -1063 372 1947 -694 -1476 990 280 205 681 -1070 -269 1721 396 -143 16 -681
792f81J236Q10j727k84P73K85O47n87r58J23O49P80o40j120M85P76p7K75p74j121
$$ -681 555 1365 -362 -646 127 412 1059 472 -486 -363 286 1066 426 -694 -209 567 490 765 -9 -1130
812a130J753L29n59k13o11l64K253q48j704J065K89l06J370j326j602J911J08
$$ -1130 623 952 393 180 -431 -795 1458 610 -1094 -29 260 -46 1324 -2 -1604 307 415
829D15o69L34n96m44J994o12j328O31l09M1J334j017j172P91O50Ok48m72o31J033
$$ 415 -254 80 -516 -960 1034 422 -906 -275 -584 -543 791 -226 -1398 -607 43 49 -199 -671 -1302 -269
849b69N13n3j185q3Q52L53J90r05q49J296Q03q03k66k43k21J461kj537N00O15
$$ -269 244 191 -994 -1077 -225 128 318 -587 -1436 -140 663 -140 -406 -649 -870 591 589 -948 -448 167
869A67j16M60l8j409N93J438o77o05R6n61J012M66p35k21K36M3M41L74j236K15
$$ 167 51 511 473 -936 -343 1095 418 -187 -91 -652 360 826 91 -130 106 149 590 964 -272 -57
889e7N82J29j62k59k49j60J040K42j095JO29l01L33k47o61O39P00p94J29j50l18
$$ -57 525 654 492 233 -16 -176 864 1106 11 12 641 340 673 426 -235 404 1104 310 439 289 -29
910b9J95J012j068k09P37l04r0K39p73%P65l76Lm51J19J44L88l92m69J64K05K45
$$ -29 166 1178 110 -99 638 334 244 483 -290 -290 475 99 102 -349 -230 -86 302 -90 -559 -395 -190 55
932E5Kp5o73K86O58l09l58K28j84L43N42q45m19N47o0K90L7q90n0J141k88o86
$$ 55 57 -18 -691 -405 253 -56 -414 -186 -370 -27 515 -330 -749 -202 -262 28 65 -825 -875 266 -22 -708
954g08O74o13L28O41m36m56N20m93P70k82n81L88L02J06J03n35k03M66L30l58
$$ -708 -34 -647 -319 322 -114 -570 -50 -543 227 -55 -636 -248 54 160 263 -272 -475 -9 321 -37
974c7m1k61M09K64l28j21Q8O4J25J88o15J03M68j24O10n83l71O09j88j13N81q28
$$ -37 -78 -339 70 334 6 -115 -27 37 162 350 -265 -162 306 182 792 209 -162 447 259 146 727 -101
996a01l01R55j57o46R07p00k9J051q11m28L70r6J48P8l63k56P85n25l4L54l35
$$ -101 -402 553 396 -250 657 -43 -72 979 168 -260 110 14 162 240 -123 -379 406 -119 -153 201 -134
1017a34j13O27k76l93L24j82Q6L80l80j09J30k18N13j53r6K01m60L25K82n84K65
$$ -134 -247 380 104 -289 35 -147 -61 319 -61 -170 -40 -258 255 102 6 207 -253 72 354 -230 35
1038C5L21o86O02J14r09O54M57j188O05op73R51K21r26O71Q7k69M55l41m82O40
$$ 35 356 -330 272 386 -523 131 588 -600 5 -1 -774 177 398 -528 143 230 -39 416 75 -407 233
1059B33L8n10J20J28k18M55m9P0l64R0Q4J9k62J36k91K07L97k09l62L87l7m76
$$ 233 271 -239 -119 9 -209 246 197 267 -97 -7 77 96 -166 -30 -321 -114 283 74 -288 99 62 -414
1081d14N81m09R8N99n41R7K28l43k00O59o89R3N78m55k82P40k31o27N58j21j45
$$ -414 167 -242 -144 455 -86 11 239 -104 -304 355 -334 -241 337 -118 -400 340 109 -518 40 -81 -226
1102b26N16m51j9M54m36k84N93l51J80Nj41K2l8j44L21j26J53J62l21O9Q1j53
$$ -226 290 -161 -180 274 -162 -446 147 -204 -24 -19 -160 -138 -176 -320 1 -125 28 190 -131 -62 19 -134
1124a34k58O57l95j06K11n8P5p9O9J2L40l81L67j23k73J41j04O8j4K48m00J31
$$ -134 -392 265 -130 -236 -25 -83 -8 -87 -18 -6 334 -47 320 197 -76 65 -39 29 15 263 -137 -6
1146flj0N14k76l35L06q8J7L56m23K7J14j11J32l6j34j07K39q0j20K06l93P4K24
$$ -6 -9 -19 495 219 -116 190 102 119 475 52 79 193 82 214 178 44 -63 176 96 -24 182 -211 -137 87
1170H7n3L21k45l39L38N8k8k10L26l27K00j26p7J81P2q8J21k32j2K27k42p8J00
$$ 87 34 355 110 -229 109 167 139 -71 255 -72 128 2 -75 106 178 90 211 -21 -33 194 -48 -126 -26
1193b6p8j55L81j57qr5J07r6J6j28K65J65l95K95K06n42J46J17l27K77p5r3K0
$$ -26 -104 -259 122 -35 -43 -138 -31 -127 -111 -239 26 191 -204 91 297 -245 -99 18 -309 -32 -107 -200 -180
1216a80L05L7K9l22J36J22l5j29p4L64l84M85j64k40L07j25r6J67j72Q1jJ37j09
$$ -180 125 162 191 -131 5 127 92 -37 -111 253 -131 354 190 -50 257 132 36 203 31 112 111 248 139
1239A39k31J0K23N4j98r2n9J96L80k14j08q7L03k29N6j40p7M7r0L48J02k00j40
$$ 139 -92 -82 141 195 -3 -95 -154 42 422 208 100 13 316 87 143 3 -74 -27 -117 231 333 133 -7
1262gN19n70K07k85L49j46o6L8J54l8l14N9K18j09j05M4q7j01N7L03j15n6R5q
$$ -7 512 -58 149 -136 213 67 1 39 193 155 -159 -100 118 9 -96 -52 -139 -240 -183 120 5 -51 44 36
1286C6j23N5K47j59j40J67k21J61k1J6J37q7k80K26rO5J30k75J73j93J36k10K1
$$ 36 -87 -32 215 56 -84 83 -138 23 2 18 155 68 -212 14 5 70 200 -75 98 -95 41 -169 -148
1309a48j60K65K42j34j56L17j85j07J66J00J77k03k3k47J96k73J55k8Q3L8J09
$$ -148 -308 -43 199 65 -91 226 41 -66 100 200 377 174 151 -96 100 -173 -18 -46 37 75 184
1330A84k67j03N7J43o6m2n9Q2q1J59q3N7n0k8J33K1np2P8k7o9L2k54K34M77m13
$$ 184 -83 -186 -129 14 -52 -94 -153 -71 -152 7 -76 -19 -69 -97 36 57 52 -20 58 31 -38 -6 -260 -26 451 38
1356C8J65k16o6J88k79K95k94J22K87k52k77L82j46K12j41J07q5j14mr6J04J44
$$ 38 203 -13 -79 109 -170 125 -169 -47 240 -12 -289 93 -53 159 18 125 40 -74 -78 -174 -70 74
1378G4p9m9M9J04j23K9K5k6J61L2ql15K01j59J5L3N9j3k08K41n7j45P7L39l04
$$ 74 -5 -54 -5 99 -24 5 30 4 165 197 189 -126 75 -84 -69 -36 23 10 -198 43 -14 -159 -82 257 -47
1403d7m0K88l99O3J45J6k1K86l13n7J26k17K93J44j50j8kJ03q9q0j9l54N65k29
$$ -47 -87 201 -198 -135 10 26 5 291 -22 -79 47 -170 123 267 117 99 97 200 111 31 12 -342 223 -6
1427fN5k1l41L71k09K45j37q5k69N72j63l2l34K96L6j25L13q0qq4r9K66j90k84
$$ -6 49 28 -313 58 -151 94 -43 -128 -397 175 12 -20 -354 -58 -22 -147 166 86 78 -6 -105 161 -29 -313
1451c13K36Pj44j29p3L23p5K67J01R1l29k36J30mj7J2J54n3n2NL5lR0k70P4P3
$$ -313 -77 -70 -214 -343 -416 -93 -168 99 200 291 -38 -274 -144 -148 -165 -153 1 -52 -104 -99 -64 -67 23 -247 -173 -100
1477a00J7M2k5k73N38k66J42J3j02k8j9k1L43l39P5j05K92P3k55j2q2L26m08K99
$$ -100 -83 -41 -66 -339 199 -67 75 88 -14 -42 -61 -82 261 -78 -3 -108 184 257 2 -10 -92 234 -174 125
1501A25j73P7j55K34n5K2m0K8K86l35J95j31q8R9k71J65k04J82O9j47M67k51l11
$$ 125 -48 29 -126 108 53 75 35 63 349 14 209 78 -10 89 -182 -17 -221 -39 30 -117 350 99 -212
1524b12J63J80l96K06K0L75j67j6k49L9J68j64K48q1j42no8j68j77M39k36L68
$$ -212 -49 131 -265 -59 -39 336 169 153 -96 -57 111 -53 195 114 -28 -33 -101 -269 -446 -7 -243 125
1546A25K1j03j71L01m7k93L55O5l58N0QN2L9k79K53j6rq8K26p6n6r3L26l32K19
$$ 125 146 43 -128 173 126 -167 188 253 -105 -55 -47 5 44 -235 18 2 -7 -95 131 55 -1 -94 232 -100 119
1571A19j57K93o1m59M21k75J43O7L7r8j45J85j50PJ13P5k67J98j14Q7M7P0q1k71
$$ 119 -38 255 194 -265 156 -119 24 91 128 30 -115 70 -80 -73 40 115 -152 46 -68 19 66 136 55 -216
1595b16J80J10k81M4K18n1Q6m45M95l13m8L45J14k95j23J85j06K75k85K48k69
$$ -216 -36 74 -207 -163 55 4 90 -355 140 -173 -221 124 238 -57 -180 5 -101 174 -111 137 -132
1616a32J30M0k91q8J37k4M37p7j7j02p6L27l99J7J75j8o3K9j21M2n6N4L61o25
$$ -132 -2 38 -253 -341 -204 -228 209 132 115 13 -63 264 -135 -118 57 39 -24 5 -116 -74 -130 -76 285 -340
1640c40M98j21N2j62j32K82j38K4J28o1l6q1O5L9Q6J52n55K30K32pj02j25n2L96
$$ -340 158 37 89 -73 -205 77 -61 -37 91 30 -6 -87 -22 17 103 255 -300 -70 162 155 53 -72 -124 272
1664B72m09nJ32j09K5J75k2j87q1M38j69k9k34J70N2k6R4k08P6P8l0J80k87K31
$$ 272 -137 -142 -10 -119 -94 81 59 -128 -209 229 60 31 -203 -33 19 -7 87 -121 -45 33 3 183 -104 127
1688A27l06r7L29k90K82N0k70J16K08r6k32M73k29k79J38J00Rkl0j51J64L63j43
$$ 127 -179 -276 53 -237 45 95 -175 -59 149 53 -179 294 65 -214 -76 24 33 31 1 -150 14 377 234
1711B34j64j62R6j25K26j46N4j14j15K64P1j09k13j7K62q8Q8j14K1q5J49l8J09
$$ 234 70 -92 4 -121 105 -41 13 -101 -216 48 119 10 -203 -220 42 -46 42 -72 -51 -136 13 -25 84
1734H4j69J00m0j04N7k37L07K7k25nP1K9LK42k28O8j1j53K50J13m43M67m01J45
$$ 84 -85 15 -25 -129 -72 -309 -2 25 -200 -205 -134 -105 -102 140 -88 -20 -31 -184 66 179 -264 203 -198 -53
1758e3m4k52L97K47l2l24J25j20L2l53N93j34O8k27k0j30R8p4MJ39j49J51m2o5
$$ -53 -97 -349 48 295 263 -61 64 -56 -24 -377 216 82 150 -77 -97 -227 -129 -203 -199 -60 -209 -58 -100 -165
1782a65L1J6Q0K21j24r6N6n6J53k09N1J89m5M2j81K08k19j3O1R1m32N03Ll19R6
$$ -165 -134 -118 -38 183 59 -37 19 -37 116 -93 -42 147 102 144 -37 171 -48 -61 0 91 -341 162 165 -154 -58
1807e8J02q6k15M75j28l83L38N3R9k02k4N9J7PK63l61m8j07J30R5k11J35K01j15
$$ -58 44 -42 -257 218 90 -293 45 98 197 -5 -29 30 47 54 317 -44 -92 -199 -69 26 -185 -50 151 36
1831C6k17MJ77J73r7J58k53j2k10K10K30l45O7J62k26K3J87n6o5L80j36m64K33
$$ 36 -181 -177 0 173 76 234 -19 -31 -241 -31 199 -146 -79 83 -143 -120 67 11 -54 326 190 -274 -41
1854d1l5L61m01M7k01L9K45R4j40K94l89K8L0K44k88K10J51k81M9mJ26q8o0Q4
$$ -41 -76 285 -116 -69 -270 -231 14 108 -32 262 -127 -99 -69 175 -113 97 248 -33 16 12 138 50 -10 74
1878G4k00J40M6L04k08k6n2m2K01j48m2l29J00J49K04j17j97M1p4N6N9j22K12
$$ 74 -126 14 60 364 156 130 78 36 237 89 47 -282 -182 -33 171 54 -143 -102 -176 -120 -61 -183 29
1901B9k31O17l01k60J4PK67Q2l02m6J70O5k19J08j1J80j79q1K8K18j62m3j12q3
$$ 29 -202 415 114 -146 -132 -125 142 224 -78 -124 46 111 -108 0 -11 169 -10 -91 -63 155 -7 -50 -162 -245
1925b45J29J14m4K7l4P6K6Lj22oN6j24J44K02k46q9K68j42p9J93j95K09j64l1
$$ -245 -116 -2 -46 -19 -53 23 49 52 -70 -76 -20 -144 0 202 -44 -133 135 -7 -86 107 -88 121 -43 -74
1949g4O3J28n6j00k00K54m8K0j6J61j10j57j48N13j89J36o5m5J52j82l13K77j07
$$ -74 -11 117 61 -39 -239 15 -33 -13 -29 132 22 -135 -283 230 41 177 112 67 219 37 -276 1 -106
1972a06N8J66Nk57P1O8j43J67J61j24pR8j73j06J56L20n32K57J63m94M46q6k22
$$ -106 -48 118 123 -134 -63 5 -138 29 190 66 59 157 -16 -122 34 354 -178 79 242 -252 194 108 -114
1995a14L2J10N5r3J1K00k09l5L18k53J42K4n5k39R8%J02l4k30L2k07M06j3K6k81
$$ -114 -82 28 83 -10 1 201 -8 -43 275 22 164 188 133 -106 -8 -8 94 60 -170 -138 -345 61 48 74 -207
2020b07K0J58j20J9J17j78M21m3k83K34O4Nk52J49J0k01P9K58r1j80L61l51J08
$$ -207 -187 -29 -149 -130 -13 -191 230 187 -96 138 202 207 -45 104 114 -87 -8 250 159 -21 340 -11 97
2043I7j93R3j83K78l21L04J35o3j4k61M09l30J57N8q3j14K53k30M0R6j16J19j41
$$ 97 -96 -3 -186 92 -229 75 210 147 133 -128 281 -49 108 166 83 -31 222 -8 32 128 12 131 -10
2066a0J22k82K29k09J97MN0q0j58J19qJ37J86k96K1k02L84l9M6J5l15N1L03n67
$$ -10 112 -170 59 -150 47 51 101 21 -137 -18 -26 111 297 1 22 -180 204 165 211 226 -89 -38 265 -302
2090c02N32r1k9m2K4j28O4j17L01K1k8p7l41K53J12j58k53J80j2K0Kj76L64j97
$$ -302 230 139 110 68 92 -36 28 -89 212 233 205 128 -213 40 152 -6 -259 -79 -91 -71 -69 -245 119 -78
2114g8m0k33N19j42o6rq0K89q9L0O4j06o2J45J2j70Q0r5j52K9J31N0j89K17qP8
$$ -78 -118 -351 168 26 -40 -49 -129 160 71 101 165 59 -3 142 154 -16 64 -31 -183 -154 -23 27 -162 55 47 125
2140A25j65l9J34k10J45l0L09m55J53p6r3J62J82l2l0k34m5L15p7m2N9J58j98
$$ 125 -40 -79 55 -155 -10 -40 269 -186 -33 -109 -202 -40 142 110 80 -154 -199 116 39 -3 56 214 16
2163A6k15M89m29J39j54Q1l2J31j70M7K44k0l37L20j55L06k53j5L4k70J35L8J87
$$ 16 -199 290 -139 0 -154 -73 -105 26 -144 -97 147 127 -210 110 -45 261 8 -7 27 -243 -108 -70 117
2186A17j97J68l15J36j16K54J94k72L1J76j14k2m6J26m4j13o0j32l1L63K4j03
$$ 117 -80 88 -227 -91 -207 47 241 -31 0 176 62 40 -6 120 76 -37 -97 -229 -260 103 127 24
2208B4K8M1m2J13l53K65j6N5j43K2K30n05J95O4K01p0j97J64j11J34k80Q5J48
$$ 24 52 93 51 164 -189 76 60 115 -28 -6 224 -281 -86 -22 179 109 -88 76 -35 99 -181 -96 52
2231E2j37Rq3K68m71L40j92J63l2j8L62j46j66K98k28Q3K7j13P7j20K35j94j35
$$ 52 -85 -76 -159 109 -362 -22 -214 -51 -83 -101 261 115 -51 247 19 102 129 16 93 -27 208 14 -121
2254a21j36J47J09o3K54l02nO3r2m7R9K67l94J13j7j7K55k70L57k59M8J57p8j7
$$ -121 -257 -110 -1 -64 190 -112 -117 -54 -146 -193 -94 173 -221 -108 -125 -142 113 -157 200 -59 -11 146 68 51
2278E1p6J23J73l02J47l20L14M3O4k23k7J6j68M39j71Q6j79K13m42K54R3j17n1
$$ 51 -25 98 271 -31 116 -204 110 153 217 -6 -33 -17 -185 254 83 169 -10 203 -239 15 108 -9 -60
2301f0j47K47M6j41L89j27k42m4L61k61j82J36p7J75n4L6r1P3k64K56Q1k5q8k51
$$ -60 -207 40 86 -55 334 207 -35 -79 282 21 -161 -25 -102 73 19 55 -36 37 -227 29 110 85 -3 -254
2325b54K56N2j41Q8j4P6n3R2k39K47O1o2k03j17K97j17l0J46L7L0l1J31k84k07
$$ -254 2 54 -87 1 -13 63 10 102 -137 110 171 109 -94 -211 86 -31 -61 85 122 152 121 252 -32 -239
2349b39N8J21L03l43J07M9j27J40p9k69J64K78k98P2K15l93K14R7j43L65l49M5
$$ -239 -181 -60 243 -100 7 56 -71 69 -10 -279 -115 163 -135 -63 152 -241 -27 70 -73 292 -57 -12
2371a2M4P8j44j83L17k15K89k5l58J01N6o7j48K94q8O0n9lJ34m94N31k19J96p
$$ -12 32 110 -34 -217 100 -115 174 149 -209 -108 -52 -119 -267 27 -61 -1 -60 -63 71 -423 108 -111 85 78
2395G8k3p7r7j6J75j32K07j18rk18M14j47p2M7q8J69j43o1M0j31m0J70k71K91
$$ 78 55 -22 -119 -135 40 -92 115 -3 -12 -230 184 37 -35 12 -76 93 -50 -111 -71 -202 -242 -72 -343 -52
2419e2L28k09O6k71L30l25n7P7r8Q1p8J30J21J3M1j66K23J92k98J00n0r7N4JR
$$ -52 276 67 133 -138 192 -133 -190 -113 -211 -130 -208 -78 43 56 97 -69 154 346 48 148 98 1 55 56 65
2444F5P5n1n2p9l57j28M97P0k09K73l37P4m7K10m7Q3Q7j62J88P7n59N6L52j04
$$ 65 140 89 37 -42 -399 -527 -30 40 -169 104 -233 -159 -206 4 -43 40 127 -35 153 230 -329 -273 79 -25
2468b5J62P8j59j78ooR6LM12m97L2J48K18n42K36k5J17J00L4l12R9r4pQ2r7J22
$$ -25 137 215 56 -122 -128 -134 -38 -35 377 -120 -88 60 278 -264 -28 -53 64 164 198 -114 -15 -109 -116 -34 -131 -9
2494ir1n5K23j5j44K98l27N2J96k95K1K62m34K64l3J5M6k02L67k02O6j31K19P8
$$ -9 -100 -155 68 53 -91 207 -120 -68 128 -167 -146 116 -318 -54 -87 -72 -26 -228 139 -63 3 -128 91 169
2518A69k08N1j10J15pK7%L7k06J1J84qk28J75R5o7q4L88o21M51k91K58l4j41P8
$$ 169 -39 12 -98 17 10 37 37 74 -132 -121 63 55 -173 2 97 30 -54 334 -287 164 -127 131 97 -44 34
2543C4N8O1r4j12j38K49j08Rj01J21l07L26O4Oq1j8k34K85k29K17L3l2j7K00l44
$$ 34 92 153 59 -53 -191 58 -50 -41 -142 -21 -328 -2 62 68 -13 -31 -265 20 -209 8 41 9 -8 192 -152
2568a52L62q9l4On0Kj39J50J23q0j97J39J96k71j48K60j05J43n5j25R6l6k42K78
$$ -152 210 121 87 93 43 45 -94 56 179 99 -98 41 237 -34 -182 78 -27 116 61 -64 32 -4 -246 32
2592C2R4J53k56J60k04J68l85N94j48j32j72K78q5k11L0M5n4K35j27n4K24k09
$$ 32 126 279 23 183 -21 147 -238 356 208 76 -96 182 97 -114 -84 -39 -93 142 15 -39 185 -24
2614b4N5j39J18J29l2K22k58K5Q4m51J48J86j26K28P1j86M0l02M31k08j22k6J41
$$ -24 31 -108 10 139 107 329 71 96 180 -271 -123 63 -63 165 236 50 90 -212 219 11 -111 -137 4
2637Dp6O6o8k2M2L8M8N1j40j5J07M3r8Kj5p1J06n5rL0K0k12J64l02O18j54m6k9
$$ 4 -72 -6 -74 -96 -54 -16 32 83 -57 -72 35 78 -20 -18 -33 -104 2 -53 -62 -32 -12 -224 -60 -362 256 102 56 27
2665B7K22j26L5q6r4nJ16k7m1NK6j42L20k60j03R8r5K57j54n0J34O3K2M6k24O6
$$ 27 249 123 158 72 -22 -27 89 62 21 26 52 -90 230 -30 -133 -35 -130 127 -27 -77 57 120 142 188 -36 30
2691C0L2r9m6k1n7J99j35J84M7j70K45k59k66N08j18j26R7j52J0J38R0j32q8P8
$$ 30 62 -37 -83 -104 -161 38 -97 87 134 -36 209 -50 -316 192 74 -52 45 -107 -97 41 131 -1 -89 -11
2715a1k13L51n8r4j17j02KJ96K84j92%k41L88j21K2l6j24K13j58j76K77m2PL7
$$ -11 -224 127 69 -25 -142 -244 -242 -46 238 46 46 -195 193 72 94 58 -66 147 -11 -187 90 48 55 92
2739I2K8R8m43L20m4k3J4j04M3j42K29k51J25j64R2P5L04m79J99p3K36j62J97
$$ 92 120 218 -225 95 51 28 42 -62 -19 -161 68 -183 -58 -222 -130 -55 249 -230 -31 -104 132 -30 167
2762A67j23R8l03L74p8r8L35j63k84O8J04k03J41k67p3L42J59k35K55j19k45J46
$$ 167 44 142 -161 213 135 37 372 209 -75 -7 97 -106 35 -232 -305 37 196 -39 216 97 -148 -2
2784bK79l95L00l7k05l8M52m82j8r3J89J10l47J46J83j78P9O6n91N81J08j44M3
$$ -2 277 -118 182 145 -60 -98 354 -128 -146 -239 -50 60 -287 -141 42 -136 -57 9 -582 -1 107 -37 6
2807FK03l15O2m0J03L6j23R9Mj18K9J55j82J65O8J50k10k97N1J43p8k42L30m2
$$ 6 209 -106 -44 -84 19 55 -68 31 35 -83 -54 101 -81 84 152 302 92 -205 -154 -11 -89 -331 -1 -43
2831d3K8k8J10J6j50R8N2j18J62j60j44M65P7m69n3L42K48m65j86M3J67K59j64
$$ -43 -15 -43 67 83 -67 31 83 -35 127 -33 -177 288 365 -104 -157 185 433 -32 -218 -175 -8 251 87
2854H7o1k3M4p9J67r0l2l9J73q1j7k28O5J08K75o1j75L6j31j24J64K18k66mj99
$$ 87 26 3 47 -32 135 45 13 -26 147 66 49 -179 -114 -6 269 208 33 69 -62 -186 -22 196 -70 -74 -273
2879b73K64j2N1J18k1J1N1l11K1K23j30K08l11Q7J07j5J06j25j30M9k87M57K7
$$ -273 -9 -21 30 148 127 138 189 -122 -101 122 -8 200 -111 -24 83 68 174 49 -81 -32 -319 138 165
2902A65j35k17J6J21o7K36j52L62m58R6j87J35K73k03j09K01j76J98J46j75l28
$$ 165 30 -187 -171 -50 -117 119 -33 329 -129 -33 -220 -85 188 -15 -124 77 -99 99 245 70 -258
2923b58Q1K56q5J09j89Q2j23M17k21m4p2P8m6K91N1l44P8l33K42n7J19n2K1J38
$$ -258 -177 79 -6 103 -86 -4 -127 290 69 25 -47 31 -15 276 327 -17 61 -272 -30 -87 32 -20 1 139
2947A39R5l51p5P3J0J11j35L17n0l13J67J21J78k71j96J12J95j45k79J50K93q6
$$ 139 234 -117 -192 -119 -109 2 -133 184 134 -179 -12 109 287 16 -180 -68 127 -18 -297 -147 146 60
2969F0K5N6k16Q6j00J35k36L21k88L55m91N42k55K36Pp6k91J09Q6j05J53n5L4
$$ 60 85 141 -75 11 -89 46 -190 131 -157 198 -293 249 -6 230 237 161 -130 -21 65 -40 113 58 92
2992I2k06L40k66P6j39K04N5k26L7P2k52J86L2j02R0p6p6L41L6j59O4o0j30L67
$$ 92 -114 226 -40 36 -103 101 156 -70 -33 39 -213 -27 5 -97 -7 -83 -159 182 218 59 123 63 -67 300
3016C00j55l08K5KJ40J7k6J00j02J44q8o2k02J41N1P6n6j54K65k17L21j15R4k63
$$ 300 145 -163 -138 -136 4 21 -5 95 -7 137 49 -13 -215 -74 -23 53 -3 -157 108 -109 212 97 191 -72
3040g2K09j86J2J81k0q6J10k65J15J55m01M00J19j18m8%j68j73R1L00j44J04j67
$$ -72 137 -49 -37 144 124 38 148 -117 -2 153 -248 152 271 153 105 105 -63 -236 -145 155 11 115 -52
3063e2j85M55J8j97J1n2J0n7J59l60k7J68j05J19k2j80J1K98j10m0K7L21j43k3
$$ -52 -237 218 236 39 50 -2 8 -49 110 -250 -277 -109 -214 -95 -117 -297 -286 12 -98 -138 -111 210 67 44
3087D4k24L46l73J22J0P3j1j44P3P0n5L0J3q6J6j05J51M8k8J99k65J30R1j17l19
$$ 44 -180 166 -207 -85 -75 -2 -13 -157 -84 -14 -69 -39 -26 -112 -96 -201 -50 -2 -30 169 -96 34 125 8 -311
3112c11J02J47M23k83k00Pm7L60j41k8pk1kj9Q1J16k55J17n5P8k17J09L66m25
$$ -311 -209 -62 361 78 -122 -115 -162 198 57 29 22 1 -1 -20 61 177 -78 39 -16 62 -155 -46 320 -105
3136a05J71k76K81j03j90k75L55L91m09K66j37J26k52P3rL02j09Q3r9j05K4l7
$$ -105 66 -210 71 -32 -222 -497 -142 249 -160 106 -31 95 -157 -84 -93 209 100 183 84 -21 3 -34
3158c4Q0k73K56o1o2l7l1q7K25j53K23n1Q6j32l8j0M2J8Q2M4r6M7Q6o5J17k66
$$ -34 46 -227 29 -32 -94 -131 -162 -249 -24 -177 46 -5 81 -51 -89 -99 -57 -39 43 87 -9 38 124 59 176 -90
3184i0J12j30L22k84J12o9P2J6n6J4k89J06M36l74l2J91J6k5j34J79J54l31J50
$$ -90 22 -108 214 -70 42 -27 45 61 5 19 -270 -164 272 -102 -134 57 73 48 -86 93 247 -84 66
3207F6J82k65J06M7j26J06k48Lj76K40K1L8P5K0M7K2k55K92l03L96j01j20o5J05
$$ 66 248 -17 89 136 10 116 -132 -129 -305 -65 -44 -6 69 89 136 158 -97 195 -108 288 187 67 2 107
3231A07o2l7K51k63J99j16r7k51L17K78l48J26m2J07j35L6o3p3j40J88j95K03
$$ 107 45 8 259 -4 195 79 -18 -269 48 326 -22 104 62 169 34 70 7 -66 -206 -18 -213 -10
3253a0J74k78rK32k16K8J69K2j86J67o2j1q0p5L57l90J16m1J88L6l0j49M9J9Q4
$$ -10 164 -114 -123 109 -107 -79 90 112 -74 93 31 20 -60 -135 222 -168 -52 -93 95 131 101 -48 1 20 104
3278A04N6r0pr5K05q0k26K24J48j97l84K67j20J40pj4N3Q0r4J25k82J44J98l07
$$ 104 160 70 63 -32 173 93 -133 91 239 42 -342 -75 -195 -55 -62 -76 -23 57 -37 88 -194 -50 148 -159
3302a59M7K21p1l4R5j78j22J07K6L6j93L68k57R8J94k26n0N4J51l13L37K3r3J4
$$ -159 -112 109 38 4 99 -79 -201 -94 -68 -32 -225 143 -114 -16 178 -48 -98 -44 107 -206 131 154 61 75
3326G5j24J1J33o0m13M27J50q8R2k25J4mk23J01R8J13L1P5j8l25K21p8K09k24
$$ 75 -49 -38 95 35 -378 49 199 111 203 -22 -8 -12 -235 -134 -36 77 108 183 165 -160 61 -17 192 -32
3350c2J52j30on3J89k69J31l2J44rj21K08p6j18J30j09r3q0J90J90l48n4j98L76
$$ -32 120 -10 -16 -69 120 -149 -18 -50 94 85 -36 172 96 -22 108 -1 -94 -174 16 206 -142 -196 -394 -18
3374a8j54j24M02j67k0K7L7J27l0O1k43K29r8l26K61k1J77j16j1n6j20J02J24
$$ -18 -172 -296 106 -61 -81 -54 -17 110 80 141 -102 127 29 -297 -36 -57 120 4 -7 -63 -183 -81 43
3397D3j87J18M47j86m1l70L3R2J76J4J2k41J27N7n2Q0j23K59j44j4J44m20J31
$$ 43 -144 -26 421 235 194 -176 -143 -51 125 139 151 -90 37 94 42 122 -1 258 114 100 244 -176 -45
3420d5j00K68j51Q0mj27M0J7q3m8J58K80m68M00j83j21J3P6K27j45J80l45k41
$$ -45 -145 123 -28 52 48 -79 -39 -22 -105 -153 5 285 -183 217 34 -87 -74 2 229 84 264 -81 -322
3443c22K38K5L5K06k45L58n37J23K72l31L15j39l08N49j20j45J63Ok53L16n99
$$ -322 -84 -59 -24 182 -63 295 -242 -119 153 -178 137 -2 -310 239 119 -26 137 143 -110 206 -393
3464c93M27r9k3O1q7J90o0J7M5jq3J54m6m22K43K44K44m83J20r7J71n4j12J20
$$ -393 34 -65 -88 -27 -114 76 16 33 78 77 -6 148 102 -320 -77 167 411 -72 48 -49 122 68 -44 76
3488G6M5R9m9r8j89K62k9k89K91k09J7P3q0K32l55P6J74m3K05l55N3K25kJ35k00
$$ 76 121 220 171 73 -116 146 117 -172 119 -90 -73 0 -80 152 -203 -127 47 4 209 -146 -93 132 130 265 65
3513F5K3Nk11K04m3j03m7J83J2l21K34j73O3J7L51j70j89J14j63k0j0J77L77m89
$$ 65 88 93 -118 86 43 -60 -107 76 88 -233 1 -172 -109 -92 259 89 -100 14 -149 -169 -179 -2 375 -114
3537a14J38R5k10l1J51J80j13l5J42j22j87J10O5k46K23q8k23M37m6k6m9k42J17
$$ -114 24 119 -91 -122 29 209 96 61 203 81 -106 4 69 -177 46 -42 -265 172 126 100 51 -191 -74
3560g4K63j48L0r6q6Q4J60k63K5j9J12J71q8k19K25j07N5m7p9M6r7L23q7j60K48
$$ -74 189 41 71 -25 -111 -27 133 -130 -105 -124 -12 159 71 -148 77 -30 25 -22 -101 -55 -152 171 84 -76 172
3585A72o0J79k87Ok05J73p7J27P2k87M32j54l4l4K3J92l40P7Q5q7K91k16QJ37
$$ 172 112 291 4 10 -195 -22 -99 28 100 -187 245 91 57 23 46 238 -102 -25 60 -27 264 48 56 193
3609A93k51K32j94M38m09L95l63J55j8N0j82R4k09K04j33O4L4k52k9L05J37m34
$$ 193 -58 174 -20 418 9 404 41 196 178 228 46 140 -69 135 2 66 100 -152 -181 124 261 -173
3631a73K26j73K12j16n9O8K92r3k22J15p5Q2q2j35J48r0k2N6j84J26J71j07m7
$$ -173 53 -120 92 -24 -83 -15 277 184 -38 77 2 84 2 -133 15 -75 -97 -41 -225 -99 72 -35 -82
3654h2j4K1L53k79J30k99PK96j10j69K62j08m0p1J49q5o6J38M7m06K09j0J40J87
$$ -82 -96 -75 278 -1 129 -170 -163 133 23 -146 116 8 -32 -103 46 -39 -105 33 80 -326 -117 -127 13 200
3678B00j01o2o1Q9J22J34m06J21l54K41M58l34j50L29j34L0K9o9o4l00J03K99
$$ 200 99 37 -24 65 187 321 -85 36 -318 -77 381 47 -103 226 92 122 151 82 18 -282 -179 120
3700A20j43K4k02K30j63J23m5l1L5L20O3j46j33j29l0L36l05J51O3k05R1n6J10
$$ 120 -23 1 -201 29 -134 -11 -56 -87 -52 268 331 185 52 -77 -107 229 -76 75 138 -67 24 -32 78
3723G8j04l6R3k01L28j94k3K45j58j49L12j21k09J47j55M3J12K4n3O0k9m6K51
$$ 78 -26 -62 31 -170 158 -36 -59 186 28 -121 191 70 -139 8 -147 -104 8 32 -21 39 10 -36 215
3746B15k71j05K75j54O2r6q4L0P2nm3O2Q3O0k75n9M51k60r5J54N4N3kk09P6pm7
$$ 215 -56 -161 114 -40 22 -74 -158 -128 -56 -61 -104 -42 41 101 -174 -233 218 -42 -137 17 71 124 122 -87 -11 -18 -65
3773f5j28M43j02j61o6K25q1P0j08q0k46L13N3k97K65j37M7Q9q9N4OO9J78j62
$$ -65 -193 250 148 -13 -79 146 65 135 27 -53 -299 14 67 -230 35 -102 -55 34 -55 -1 5 74 252 90
3797I0j78p9J57m8J72r1J74k41k45k8M64l2Qj22j97P6K04o5n8J40m3q3n8J73J2
$$ 90 -88 -167 -10 -58 114 23 197 -44 -289 -317 147 115 123 1 -196 -120 84 19 -39 101 58 -25 -83 90 102
3822A02r6j1j07J83J28l49K53r7k23P3K54k11n4J47o8j06K98L8o7N6k50J40L1
$$ 102 6 -5 -112 71 199 -150 103 6 -217 -144 110 -101 -155 -8 -76 -182 116 154 87 143 -107 33 64
3845F4J9n0m0K06o3L2k7j74J27j08J17p8j00N9n5r0K36n25L54j9L8K6M5K35J1
$$ 64 83 33 -7 199 136 168 141 -33 94 -14 103 25 -75 -16 -71 -161 75 -450 -96 -115 -77 -51 -6 229 240
3870B40k73j62K17k31K73k4J47l15K09J30k32p1K61m6q6j91J60J01k19L44o6q8
$$ 240 -33 -195 22 -209 64 40 187 -128 81 211 -21 -92 169 123 37 -154 6 107 -112 232 166 78
3892G8n6J73J5r2J94l30K29j50k13l4K95p5P0J07l11m8M0J97q4j70K45OO4k0k61
$$ 78 22 195 210 118 312 -18 211 61 -152 -186 109 34 104 211 -100 -148 -108 89 5 -165 80 86 150 130 -131
3917a31o7J93j90K02j4l0j27m4p4J57L22j89j50P7K11k99J21J69j49K40O4k12
$$ -131 -198 -5 -195 7 -7 -37 -164 -208 -282 -125 197 8 -142 -65 146 -153 -32 137 -12 228 292 80
3939H0j45Q9m19L35K8M1J64r4k98l8J99o7J16r5J70m06M48k37o8Q9P3K20l24K09
$$ 80 -65 24 -395 -60 -32 9 173 79 -219 -257 -58 -125 -9 -104 66 -340 108 -129 -197 -108 -35 185 -139 70
3963G0J46k37J98m17K78q0l8J38O7J03k87J04k01J49k4l7k34N7K48l7O3r5j8J95
$$ 70 216 -21 177 -240 38 -42 -80 58 125 228 -59 45 -156 -7 -31 -68 -302 -245 3 -34 29 -66 -84 111
3987A11N5k33n0M3K20l01K75Jj57K71j91k62M71j22k13L38j82J3O6q3m09L32K00
$$ 111 166 -67 -117 -74 146 -155 120 121 -36 235 44 -218 253 131 -82 256 74 87 153 70 -339 -7 193
4010A93r0J38n4k06j66K21k90J32L05k30m5J91k3l9k7P9j12r6M22j52q2j60J79
$$ 193 103 241 187 -19 -185 36 -254 -122 183 -47 -92 99 76 37 10 89 -23 -119 303 151 69 -91 88
4033H8j54k7l9J09j72K22J54l31J50j04J92j76j30M2K16Q8p5J1k12l7N5j60K66
$$ 88 -66 -93 -132 -23 -195 27 181 -150 0 -104 88 -88 -218 -176 40 128 53 64 -148 -185 -130 -290 -24
4056b4j42K52m8k28kK20J67L6j83P2l50K8K93K0k6p9N5m4l5j12J30j23J58j41
$$ -24 -166 86 38 -190 -192 28 195 231 48 120 -230 -202 91 111 85 6 61 17 -18 -130 0 -123 35 -106
4080a06K29j13R5K22l64J31q5k66J84K33j23J65k62L1K04k80K69j44O0q0Q5n0
$$ -106 123 10 105 327 -37 94 9 -257 -73 160 37 202 -60 -29 175 -105 164 20 80 0 85 35
4102C5J9j86J9J55j66j27R3P4L37j53k18M0o3L3R3K66l75l3J02N9j24J34N2J13
$$ 35 54 -132 -113 42 -124 -251 -158 -84 253 100 -118 -78 -141 -108 -15 251 -124 -157 -55 4 -120 14 66 179
4126A79j97p1j2J87R8N4m73R2J15K24l10J33O6l15M04k19j7o3J71K21k15j35K20
$$ 179 -18 -89 -101 86 184 238 -235 -143 -28 196 -114 19 85 -230 174 -45 -62 -125 46 267 52 -83 137
4149A37j57K47L4j18r4J46l52K73o2J31k52J01j03j80L54K10j52k72M3%K60l57
$$ 137 -20 227 261 143 49 195 -157 116 54 185 -67 34 -69 -249 105 315 163 -109 -66 -66 194 -163
4171a63L02j56K8R9j82N7N0l9K06K6j68n6r3K04K7l42K67J2n6J0LM1K4k23J56
$$ -163 139 -17 11 110 -72 -15 35 -4 202 228 60 4 -89 115 142 -200 67 79 23 33 36 77 101 -122 34
4196C4l2j7K3k26L19k56K33j16P6M1Q6n0j75o1O7j21M04l87r9K54Rp8J00Qn6J31
$$ 34 2 -15 8 -218 101 -155 78 -38 38 79 165 115 -60 -121 -54 -175 229 -158 -257 -3 6 -72 28 36 -20 111
4222A11k01M9j5N6P3J17k62q4o3N3J21J01j40M8j43M8m1K65j00J59j78k30L81
$$ 111 -90 -41 -56 0 73 190 -72 -156 -219 -166 -45 56 -84 -36 -179 -131 -172 93 -7 152 -26 -256 125
4245A25K38j11k78p4J18J23l08K69k99M1J53j85J47N2J43j96N9J25j31J58l24
$$ 125 363 252 -26 -100 18 141 -167 102 -197 -156 -3 -188 -41 11 154 -42 17 142 11 169 -155
4266a55J18J01k23R5K5m2J52m6k8K0L2k12n9K76k3P8o4J18l31J55n7lK63j58J29
$$ -155 -37 64 -159 -64 -39 -81 71 25 -3 17 49 -163 -222 54 31 109 45 163 -168 -13 -70 -73 190 32 161
4291A61p9J67k11L28m94L53k93J47l3l01L20Q6k53P2M8Q3m9l01J89O2J16j15M
$$ 161 82 249 38 366 -128 225 -68 79 46 -255 65 151 -102 -30 18 101 52 -249 -60 2 118 3 7
4314GQ8J88k5j11o7K11j71K36l01k32L84j33k08K6j66L18j18r6p4K13k6N5P6l3
$$ 7 95 283 258 147 80 291 120 356 55 -177 207 74 -134 -108 -274 44 -74 -170 -244 -31 -57 -2 74 41
4338D1j4m4K11K8q8pL9n6j64P9M8Q2k24J44J87j24p5j73J99O3j27K6l8L36m30
$$ 41 27 -17 194 222 134 127 166 110 -54 25 73 155 -69 75 262 138 63 -110 89 152 25 51 13 349 -81
4363h1J66O9r8J24k28J27j03M8q6K07j68J20j69j61K18j10J35J72l75M23l01m0
$$ -81 85 154 56 180 -48 79 -24 24 -62 145 -23 97 -72 -233 -15 -125 10 182 -193 230 -71 -111
4385a11K56L9k05j03L6N4q1k9k6K67k08J17j18J95L2j81J28J94j46k41l0L57p1
$$ -111 145 184 -21 -124 -88 -34 -115 -144 -170 97 -111 6 -112 83 115 -66 62 256 110 -131 -161 196 125
4408A25r9m9p0Q5K9J11J43k94l0J84j94mnJ11l8n2K12j66J25k12j10L06k20P4
$$ 125 26 -23 -93 -8 21 132 275 -19 -49 135 -59 -63 -68 43 5 -47 165 -1 124 -88 -198 108 -112 -38
4432c8j06J25k3l9J47j45M9L39k50J0k47K82O0j14K77n72J39K61j72j11L1K7J86
$$ -38 -144 -19 -42 -81 66 -79 -30 309 59 69 -178 104 164 50 327 -245 -106 155 -17 -128 -97 -70 116
4455A16O3j90J1l63L55J05l3j60j46J11J29J78q4J99l32R6j80K95j53j26N3J67
$$ 116 179 -11 0 -363 -8 97 64 -96 -242 -131 -2 176 92 291 -41 55 -125 170 17 -109 -56 111
4477A11j43j61K56K1k09K38k57p4M33k67k3K33j77J41p4j80J05m4P3j23K12nj8
$$ 111 -32 -193 63 84 -125 113 -144 -218 215 -52 -75 158 -19 122 48 -132 -27 -71 2 -121 91 86 68
4500F8k06J48P8nj56Q0O8j30J20k51J0J38l2l0J66k01J96j79M9j57K28J55q7J23
$$ 68 -138 10 88 83 -73 7 75 -55 65 -186 -176 -38 -70 -100 66 -135 61 -118 -69 -226 2 157 70 193
4524A93r5j03l6p7J35o6M8J85o03M06j71J92J8K23j59L5k40J88k20K38pk55J52
$$ 193 98 -5 -41 -118 17 -49 -1 184 -419 -13 -184 8 26 249 90 125 -115 73 -147 91 84 -171 -19
4547a9K17j88l47L77j20K31l17J76j72k3K3J45L8p2n6P2N0J54k38J02l59O04k97
$$ -19 198 10 -337 40 -80 151 -166 10 -162 -185 -162 -17 21 -51 -107 -35 15 169 -69 33 -326 278 -19
4570a9j9J29j92K52k66j15j28L86K24j65r2M8l1J69k49j34J96j02K93j39M8k81
$$ -19 -38 91 -101 151 -115 -230 -358 28 252 87 -5 43 12 181 -68 -202 -6 -108 185 46 94 -187
4592a87J59J51m5m31L27jR8j56K65k91J39Q3l40J32K39m49L41k87M4J63pj70K42
$$ -187 -28 123 78 -353 -26 -27 71 -85 180 -111 28 111 -229 -97 142 -307 34 -253 -209 -46 -53 -223 19
4615A9P0O1j52K44n08M24K9j40Q5k99k42L16O0q8k7K52Qk80K67J4k47l3J50rj65
$$ 19 89 150 -2 242 -266 158 187 47 132 -167 -409 -93 -33 -121 -148 104 112 -168 99 113 -134 -167 -17 -26 -191
4640a91J11j33l8J55L1L99j80k21J47M6Jl6r9k66M00k03J74q3K5j57J40j53J11
$$ -191 -80 -213 -251 -96 -65 334 154 -67 80 126 127 91 -8 -274 126 -77 97 14 39 -118 22 -131 -20
4663b0k4P8l03N50l73j32K30J3j88J53J01k67L48k56J64k04K71k51J20k64K35
$$ -20 -44 34 -269 281 -92 -224 6 19 -169 -16 85 -182 166 -90 74 -130 141 -110 10 -254 -19
4684a9j38K20K7k41j11M30j26LPk84N3J85J23p4j40M0n1P6J44m9q6K88o1j56j29
$$ -19 -157 63 90 -151 -262 168 42 45 52 -232 -179 6 129 55 -85 -45 -96 -20 124 75 -11 277 216 60 -69
4709f9N5NJ27k47L14j13k5k89J97J94l00O8J31m5N5j39K05k9Pj10O2K35j5k12
$$ -69 -14 -9 118 -129 185 72 47 -242 -45 149 -151 -83 48 3 58 -81 124 95 102 -8 54 289 274 62
4733F2j16kpL08j31l08J95q4K3O8n4m0O5j32j02J09Q8P9l1k31L66l23L04K0k32
$$ 62 -54 -56 -63 245 114 -194 1 -83 -60 8 -46 -86 -21 -153 -255 -146 -58 21 -10 -241 125 -198 106 126 -106
4758a06mJ39J03k87J57J95k36R1R9k40J15Oj77P1p5r8L74l35J31j47K79j70k85
$$ -106 -110 29 132 -155 2 197 -39 52 151 -89 26 32 -145 -74 -149 -247 127 -208 -77 -224 55 -115 -400
4781d00J82M44k68J63k05m7J37j48L95j25k3Pp7j44M62n06K38j8q1J33l1O1J56
$$ -400 -218 226 -42 121 -84 -131 6 -142 253 128 105 112 35 -109 353 -153 85 67 -14 119 88 149 305
4804C05o9m68K41R5k14K3j15J54l4O9J85m9l40M96k07j8K51l56K20j81L9o6P4
$$ 305 236 -232 9 104 -110 -87 -202 -48 -82 -13 172 123 -217 279 72 54 305 -51 169 -12 27 -39 35
4827C5k64J54M7k79M17K30l67J73m93L11p0J95K26k52k8Q1j45j66R3K19l08L90
$$ 35 -229 -75 -28 -307 110 340 -27 146 -347 -36 -106 89 315 63 35 116 -29 -195 -102 117 -191 199
4849A99j88k31K75j79Q3j89K33R8J21j22j78j8k2J46q8J67l38L02K43k58l9J17
$$ 199 11 -220 55 -124 -41 -230 3 101 222 100 -78 -96 -118 28 -60 107 -231 71 314 56 17 134
4871A34o9j57Q9K69j48j42K41m38L62q6l3m2K46j66Pk42k8L72k19q1J26q5K02
$$ 134 65 -92 -3 266 118 -24 217 -221 141 55 22 -20 226 60 67 -175 -203 169 -50 -131 -5 -90 112
4894A12m5j43L7k3m5j48K63%j61N2N2K0K23k54K63k14J95j88J44o2j55J8l6J1
$$ 112 67 -76 -39 -62 -107 -255 8 8 -153 -101 -49 -29 194 -60 203 -11 184 -4 140 78 -77 -59 -95 -84
4918h4J97j22k02K61j75K8N9n4lK24k53J86j39J98j50J32j80nJ06K65j28m0k68
$$ -84 113 -9 -211 50 -125 -97 -38 -92 -95 129 -124 62 -77 121 -29 103 -77 -82 24 289 161 121 -147
4941a47J62j66J3Q7r0Q2j9J49j1o3j60L27p1K8m25K98N6J94k10J05k26l1R9K2
$$ -147 15 -151 -138 -51 -141 -59 -78 71 60 -3 -163 164 93 121 -304 -6 50 244 34 139 -87 -118 -19 3
4965CL61l79K64l07M4o7J59r1j29K03jn0J87j11Q9j54j76l9J09J04R0N1q7k08
$$ 3 364 -15 249 -58 -14 -81 78 -13 -142 61 60 10 197 86 175 21 -155 -194 -85 19 109 160 73 -135
4989a35J18j18L05Qk91Q8K25j88j94R2j03K13J10L0j26j07NoJ29j02p9M17l26
$$ -135 -17 -135 170 178 -113 -25 200 12 -182 -90 -193 20 130 160 34 -73 -68 -74 55 -47 -126 291 -35
5012c5NJ02j41R7j13K0Mj98J29L49m38K96m09K81l5L55k23K19j57j5j16L4J24
$$ -35 -30 72 -69 28 -85 -65 -61 -259 -130 219 -219 77 -332 -51 -86 269 46 265 108 93 -23 11 135
5035A35j54m4K3J17j21P8J3k23L6J55p6J34k8L2K05m47J7K3K59lk13O9k55J23
$$ 135 -19 -63 -40 77 -44 34 47 -176 -140 15 -61 73 45 77 282 -165 -148 -125 134 131 -82 -13 -268 -145
5059a45MJ72K22m64Q3J15k12J1J6K65n9QpL09l05j68K01j81J48j73K53j59J24
$$ -145 -141 31 253 -211 -128 -13 -225 -214 -198 67 8 16 9 318 13 -155 46 -135 13 -160 93 -66 58
5082E8l5R5l14J89J87j21j27P0l0K40l16J80j14L45j83m16O56l52l7K49l36K91
$$ 58 23 118 -196 -7 180 59 -68 2 -28 212 -104 76 -38 307 124 -292 364 12 -25 224 -112 179
5104A79k78M50k37k9j17j85N70m87J78j48J90q7J18o5p2J0L4k17L8K12J79l85
$$ 179 -99 351 114 85 -32 -217 353 -134 44 -104 86 -1 117 52 -20 -10 24 -193 -155 57 236 -149
5126a49J30k33J98m8J84J26l45L63j33K6k39l0m4J07p1K62l60N39k32j41l4L01
$$ -149 -19 -252 -54 -102 82 208 -137 226 93 119 -120 -150 -194 -87 -158 104 -256 283 51 -90 -124 177
5148A77j6k5j22K12j20J29r5k60K22j71k5K35k71K73J8j36k23J71R7j04R2M8l79
$$ 177 161 136 14 226 106 235 140 -120 102 -69 -94 141 -130 143 161 25 -198 -27 70 -34 58 106 -273
5171b73M37k09J4o5R6J27k46J55j19q1J22O8K31l07P4P3j80j03K28p7R1q9k2q8
$$ -273 164 -45 -31 -96 0 127 -119 36 -83 -164 -42 26 257 -50 24 97 -83 -186 42 -35 56 -33 -55 -143
5195a43J70k14Q4R8J4n5k66K55j94R8K25K1k9M2K9p4k05L15m00l9L16j53J97r0
$$ -143 27 -187 -103 -5 9 -46 -312 -57 -251 -153 72 93 64 106 135 61 -144 171 -229 -268 48 -105 92 2
5219BL6J34R3J54k58j59J6J00j45J44oM3K15m72k1K55n0r8J88k81J15J22j61j0
$$ 2 38 172 265 419 161 2 18 118 -27 117 111 154 369 -103 -124 131 81 -17 171 -110 5 127 -34 -44
5243d4j53R2J36J55j17j81J56Pj94K77k16m1K02J01m11K93m7J2r8M8J53q2J26
$$ -44 -197 -105 31 186 69 -112 44 51 -143 134 -82 -123 79 180 -231 62 15 27 -71 -23 130 48 174
5266A74l51J94R4j49K02p7P5l24O8m4J82K10n46L85pj07n6K74m72J41J46J96j34
$$ 174 -177 17 111 -38 164 87 162 -162 -94 -138 44 254 -292 93 86 -21 -77 197 -275 -134 12 208 74
5289G4p5K2J9n3o1L8j47J14j02L23k59J39J03j45Q3j36l9m3J55k36J76K5L7N6
$$ 74 -1 21 40 -13 -74 -36 -183 -69 -171 152 -107 32 135 -10 73 -63 -102 -145 10 -226 -50 -25 12 68
5313F8P9k91P0o6K28k20o8J36J49k39M3K23P9j53L41m22m7P3j2J10n0m1K33k3
$$ 68 147 -144 -74 -140 88 -132 -200 -64 85 -154 -111 112 191 38 379 -43 -90 -17 -29 81 31 -10 223 200
5337B00m35K16K38j28l63kK19J70j19j60j7J00R5j37J13K1N9j96j16J56k5J58
$$ 200 -235 -19 219 91 -272 -274 -55 115 -4 -164 -181 -81 14 -123 -10 11 70 -126 -242 -86 -111 47
5359D7k09J11O1O9l33J02Q8l4j22K87o0j7J83Jl31K78Qj16j56j69j9O78m53R2
$$ 47 -162 -51 10 79 -254 -152 -64 -98 -220 67 7 -10 173 174 -157 121 129 13 -143 -312 -331 347 -106 -14
5383a4n0k31K56L2j28J46Q4pj41j96K52k08R6K52k68MJ13j72Q8p7J93L8p4k46
$$ -14 -64 -295 -39 -7 -135 11 95 88 -53 -249 3 -205 -109 143 -125 -121 -8 -180 -92 -169 24 62 -12 -258
5407b58L08k44J12K34pq2j49M7L1J70k15J57j12P6nk30K53J5l3q4J4m9M0nk73
$$ -258 50 -194 -82 152 145 63 -86 -39 -8 162 -53 104 -8 68 63 -167 86 101 68 -16 -2 -51 -11 -16 -289
5432b89J54P0L6M1l8j11K30k65J2M55k91J28K8k94j88K33j90M01k6L7p2L4j62
$$ -289 -135 -65 -29 12 -26 -137 93 -172 -160 295 4 132 160 -134 -322 -89 -279 122 96 133 61 95 -67
5455f7J48J03o16N26J35l34K21j0k10J88j0j90K0J2J65jn8j13j83N16j61l14J54
$$ -67 81 184 -432 94 229 -105 116 106 -104 84 74 -116 -96 -84 81 80 22 -91 -274 242 81 -233 -79
5478g9K26j02J60r5J42l29p4L5K96j67K8m1j78J31q5J30J33l3j49j03J38O1k2
$$ -79 147 45 205 110 252 -77 -151 -116 180 13 41 0 -178 -47 -132 -2 131 98 -51 -154 -16 45 23
5501B3R2p4j1k46R0J19J16Q8j89j36j53N20k50JJ3J69l46J06J25R8Kj25j59M84
$$ 23 115 41 30 -216 -126 -7 109 197 8 -128 -281 239 -11 -10 3 172 -174 -68 57 155 157 32 -127 357
5525C57m38q1M38k70K51o05M24k70K23K05m39L9j50J25L37k36J11o5J79j6k55
$$ 357 -81 -162 276 6 257 -348 76 -194 29 234 -205 -166 -316 -191 146 -90 21 -44 135 119 -136
5546a36p8J49j25J04K71J08m2k33j50L17j25j7rJ0Ll64M74k89L91j21r1R0l69
$$ -136 -214 -65 -190 -86 185 293 251 18 -132 185 60 43 34 44 47 -317 157 -132 259 138 47 137 -232
5569b32L56m38N49j44m43K99K80k53K31k4j64R0k77J41k1j05j15K00L12o3p8k77
$$ -232 124 -314 235 91 -352 -53 227 -26 205 181 17 107 -170 -29 -50 -155 -270 -70 242 179 101 -176
5591a76l5Q8J86J71l22K24j47m2M5J62J0k39L93k64K18k50k9%j80P8J40j6j2J11
$$ -176 -211 -123 63 234 -88 136 -11 -53 -8 154 164 -75 318 54 272 22 -7 -7 -187 -109 31 15 3 114
5615A14j86J01k08M85l30L76n61P9J1K27j32k41L43k31O8Q5J32o7P2k91J52R7
$$ 114 -72 29 -179 306 -24 352 -209 -130 -119 108 -24 -265 78 -153 -85 0 132 65 137 -154 -2 95
5637I5pj64L17l45j33K89P7J7j98J78l86N53k47L9J07l78L16oj50n4J6Km1N0M3
$$ 95 88 -76 241 -104 -237 52 129 146 -52 126 -260 293 46 85 192 -186 130 124 -26 -80 -64 -62 -103 -53 -10
5662a0N2k1n3j87L68r3j23p2J04L00l12N6l78L98p6j3R4QP4%k0k65L12J70j82
$$ -10 42 21 -32 -219 149 56 -67 -139 -35 265 -47 9 -369 29 -47 -60 34 42 116 116 96 -169 143 313 131
5687A31j51r9J67J63j63J81p2k33J42J1k27K09k22J05J19N1Q4k43Q3K5p6J62p7
$$ 131 -20 -119 48 211 48 229 157 -76 66 77 -150 59 -163 -58 61 112 196 -47 36 61 -15 147 70
5710G0J15k02r4J6J51M2Pj08j45L28r9j91k0L1q7oJ10J19P4M9J26l64J62jj74
$$ 70 185 -17 -111 -95 56 98 105 -3 -148 180 81 -110 -130 -99 -186 -192 -82 37 111 160 286 -78 84 83 -91
5735i1J9J2J29p1N4k08Q3J76p2M2j8J8p6j78K06j00J4j08K76j68K03m19R4M0L53
$$ -91 -72 -60 69 -2 52 -156 -73 103 31 73 55 73 -3 -181 25 -75 -61 -169 107 -61 142 -277 -183 -143 210
5760B10j37Q4m2j89O9N7j9n6O4Q3qk01J52k15Q8j33J3J43O4K43k51k13p2O0J83
$$ 210 73 157 115 -74 -5 52 33 -23 41 124 116 -85 67 -148 -60 -193 -180 -37 27 270 19 -194 -266 -206 -23
5785b3j75K44r5q5L90k69LjJ14k75K89r3j13o1J20J61m9k6j00m1P9k98K14P0J01
$$ -23 -198 46 -49 -134 256 -13 -10 -11 103 -172 117 24 -89 -150 -30 131 82 56 -44 -85 -6 -304 -90 -20 81
5810H1k46R9J15L7k94R5J83K2m4o4j38J7J12L7l3R2p5j06L96m20N5j09L18k4r2
$$ 81 -165 -66 49 86 -208 -113 70 92 48 -16 -154 -137 -25 12 -21 71 -4 -110 286 -134 -79 -188 130 106 14
5835A4J2M4j4j56Ql9J24M6j97J26J51o0n9m6J04L6k88P8o6K44O3k86n8L13m8j12
$$ 14 26 70 56 -100 -92 -131 -7 39 -158 -32 119 59 0 -46 58 94 -194 -116 -182 62 125 -161 -219 94 46 -66
5861f6K4J46k01J44m7j89L39j36O5n5P1j60K11n87O43ql07R9n1K29j33r0n4RL0
$$ -66 -42 104 -97 47 0 -189 150 14 79 24 95 -65 146 -441 202 194 -113 -14 -65 164 31 -59 -113 -104 -74
5886g4j32J56k93K19K1nJ99j15o0K19j22m7K2J36m5k35M09m07J39q0J24q8M48
$$ -74 -206 -50 -343 -124 -103 -108 91 -24 -84 135 13 -34 -12 124 79 -156 253 -154 -15 -95 29 -59 389
5909C89n48J40L66o82K89m5qj09L08J8k52K80k89O2K22Kj12L25k97q9q7N6q3n1
$$ 389 -159 -19 347 -335 -46 -91 -99 -208 100 118 -134 146 -143 -81 141 143 31 356 59 -30 -117 -61 -144 -195
5933a95K20n1M1k09L32%k1k7m0M6j85J45P3j23k40K41J67k95P7K2Q0Jj4N9l88
$$ -195 25 -26 15 -194 138 138 117 90 50 96 -89 56 129 6 -234 7 174 -121 -44 -22 58 59 45 104 -284
5958b84PK92j7J59k90K22O9k14J96j52l09K9L82k09L7J11J03k7J52k75J15k72
$$ -284 -277 15 -2 157 -133 89 158 -56 140 -12 -321 -292 90 -119 -82 29 132 105 257 -18 97 -175
5980a75L48M4m23J91J46k5K8o2j36P1L7K4J32O6l17K2K64j88q9N4LL5P9k29J51
$$ -175 173 217 -206 -15 131 106 134 72 -64 7 44 68 200 266 -51 -29 235 47 -42 12 15 50 129 -100 51
6005E1J41j79l7Q3r8O2J07Ql8j90K46m7O1j52l03K82P5j22m6J85j16m0J64p1j17
$$ 51 192 13 -24 59 -39 23 130 138 100 -90 156 109 170 18 -285 -3 72 -50 -96 89 -27 -67 97 26 -91
6030i1l4j2L7J31j9J29q7j14J47K01l27j91K93q9l3J29m16L13j05K41k33oK1K04
$$ -91 -125 -137 -100 31 12 141 54 -60 87 288 -39 -230 63 -26 -59 70 -346 -33 -138 103 -130 -136 -115 89
6054H9N9k1J63j90n7j55L28k11j13Q2N6n2K74l50J76j28m1K05j01n3mJ34J77l68
$$ 89 148 127 290 100 43 -112 216 5 -108 -26 30 -22 252 -98 78 -50 -91 114 13 -40 -44 90 267 -101
6078a01J58j00J45N9k85n6K42l7k3p6j77p6L54j18J30q3mk8K63j57Ln0J6R4j37
$$ -101 57 -43 102 161 -124 -180 62 25 2 -74 -251 -327 27 -91 39 -44 -48 -76 187 30 33 -17 -1 93 -44
6103d4R9K3j71L21k77j33J78J34q9j33J8R4o9j59R3M5J07j4j24K20M7l25q2J74
$$ -44 55 78 -93 228 -49 -182 -4 130 41 -92 -74 20 -49 -208 -115 -70 37 23 -101 119 166 -159 -241 -67
6127f7o6K7L20k95j72N12l62j8M6j33L50L8o4J11j17n8l6j31J38j70P8Rj26O3
$$ -67 -133 -106 214 -81 -253 259 -103 -121 -75 -208 142 180 116 227 110 52 16 -115 23 -147 -69 -60 -186 -123
6151a23N9J70k06k9qK67l5p0L8j19pJ39n0j56J64j81o8MK06J5K82l93j67N53l44
$$ -123 -64 106 -100 -129 -137 130 95 25 63 -56 -63 76 26 -130 34 -147 -215 -211 -5 10 292 -101 -268 285 -59
6176e9J3j4j37n5L79Q8l18M3l8j83J92M8N6k6j04Pj71M11K7l37J75j48k2K02m0
$$ -59 -46 -60 -197 -252 127 215 -103 -60 -98 -281 -89 -41 15 -11 -115 -108 -279 132 159 -178 -3 -151 -173 29 -11
6201a1m9J16jl4l53K85J10M4L4P5k49o7M7P4l4j5j37M79l02J3j32M7j13L84o0
$$ -11 -60 56 55 21 -332 -47 63 107 141 216 -33 -100 -53 21 -13 -28 -165 314 12 25 -107 -60 -173 211 151
6226A51j11j19K28k08K8M33k29l09m0R0Q5j78K56j43K71l29J73P2j83J69j58j87
$$ 151 40 -79 149 -59 -31 402 173 -136 -176 -86 -1 -179 77 -66 205 -124 49 121 -62 107 -51 -238
6248b38N77O0k83j30J63Q9K30n68R6K26m12N37l03J70l32J13k25L16k8Lj28j9
$$ -238 339 399 116 -14 149 238 468 -100 -4 222 -190 347 44 214 -118 -5 -230 86 58 61 -67 -86
6270h6J20Q0j17j44R5M51j52M7k52Mp2j64J44O0j0P8j09J30l64J59K93J1%j38
$$ -86 34 114 -3 -147 -52 399 247 294 42 46 -26 -190 -46 14 4 82 -27 103 -261 -102 191 202 202 64
$$ [...]
8191a30
##END NTUPLES=NMR FID
##END=
