##TITLE=1H_DE-43H_DEK
 D2O
 64 sc, 
 10.10.2024
##JCAMPDX= 6.0         $$ Bruker NMR JCAMP-DX V2.0
##DATA TYPE= NMR FID
##DATA CLASS= NTUPLES
##ORIGIN= UXNMR, Bruker Analytische Messtechnik GmbH
##OWNER= root
$$ XWIN-NMR		Version 3.5
$$ Thu Oct 10 15:03:22 2024 Russian Standard Time (UT+4h)  she@DPX200
##.OBSERVE FREQUENCY= 200.1318
##.OBSERVE NUCLEUS= ^1H
##.DELAY= (6, 6)
##.ACQUISITION MODE= SIMULTANEOUS
##.ACQUISITION SCHEME= undefined
##.AVERAGES= 8
##.DIGITISER RES= 18
##SPECTROMETER/DATA SYSTEM= spect
##.PULSE SEQUENCE= zg30
##.SOLVENT NAME= D2O
##.SHIFT REFERENCE= (INTERNAL, D2O, 0, 15.7039)
##AUDIT TRAIL= $$ (NUMBER, WHEN, WHO, WHERE, WHAT)
$$ ##TITLE= Audit trail, XWIN-NMR		Version 3.5
$$ ##JCAMPDX= 5.01
$$ ##ORIGIN= Bruker BioSpin GmbH
$$ ##OWNER= she
$$ F:/spectra/data/she/nmr/H-F/1/audita.txt
$$ ##AUDIT TRAIL=  $$ (NUMBER, WHEN, WHO, WHERE, WHAT)
(   1,<2024-10-10 15:02:30.07 +0400>,<she>,<DPX200>,
      <created by zg, POWCHK disabled, PULCHK disabled
       configuration hash MD5:
       00 E9 B6 7A A2 85 ED C7 34 08 36 98 17 FE 4E 26
       data hash MD5: 16K
       95 D7 BC 89 4C E9 76 7E 31 04 65 D2 86 D5 14 C9>)
$$ ##END=
$$ 
$$ hash MD5
$$ C1 A2 0A 00 75 49 57 36 E0 1E 3A 84 E6 CE 81 88
##$RELAX= 
##$RELAX= 
##$RELAX= 
##$RELAX= 
##$RELAX= 
##$RELAX= 
$$ Bruker specific parameters
$$ --------------------------
##$DU= <F:/spectra>
##$EXPNO= 1
##$NAME= <H-F>
##$PROCNO= 1
##$TYPE= <nmr>
##$USER= <she>
##$AMP= (0..31)
100 100 100 100 100 100 100 100 100 100 100 100 100 100 100 100 100 100 
100 100 100 100 100 100 100 100 100 100 100 100 100 100 
##$AQSEQ= 0
##$AQ_mod= 1
##$AUNM= <au_zg>
##$AUTOPOS= <>
##$BF1= 200.13
##$BF2= 200.13
##$BF3= 200.13
##$BF4= 200.13
##$BF5= 200.13
##$BF6= 200.13
##$BF7= 200.13
##$BF8= 200.13
##$BYTORDA= 1
##$CFDGTYP= 0
##$CFRGTYP= 5
##$CHEMSTR= <none>
##$CNST= (0..31)
1 1 145 1 1 1 1 1 1 1 1 1 1 1 1 1 1 1 1 1 1 1 1 1 1 1 1 1 1 1 1 1 
##$CPDPRG= <>
##$CPDPRG1= <>
##$CPDPRG2= <>
##$CPDPRG3= <>
##$CPDPRG4= <mlev>
##$CPDPRG5= <mlev>
##$CPDPRG6= <mlev>
##$CPDPRG7= <mlev>
##$CPDPRG8= <mlev>
##$CPDPRGB= <>
##$CPDPRGT= <>
##$D= (0..31)
0 1.2 0 0 0 0 0 0 0 0.06 0 0.03 0 0 0 0 0.0002 0 0 0 0 0 0 0 0 0 0 0 0 
0 0 0 
##$DATE= 1728558149
##$DBL= (0..7)
120 120 120 120 120 120 120 120 
##$DBP= (0..7)
150 150 150 150 150 150 150 150 
##$DBP07= 0
##$DBPNAM0= <>
##$DBPNAM1= <>
##$DBPNAM2= <>
##$DBPNAM3= <>
##$DBPNAM4= <>
##$DBPNAM5= <>
##$DBPNAM6= <>
##$DBPNAM7= <>
##$DBPOAL= (0..7)
0.5 0.5 0.5 0.5 0.5 0.5 0.5 0.5 
##$DBPOFFS= (0..7)
0 0 0 0 0 0 0 0 
##$DE= 6
##$DECBNUC= <off>
##$DECIM= 24
##$DECNUC= <off>
##$DECSTAT= 4
##$DIGMOD= 1
##$DIGTYP= 9
##$DL= (0..7)
0 120 120 120 120 120 120 120 
##$DP= (0..7)
150 150 150 150 150 150 150 150 
##$DP07= 0
##$DPNAME0= <>
##$DPNAME1= <>
##$DPNAME2= <>
##$DPNAME3= <>
##$DPNAME4= <>
##$DPNAME5= <>
##$DPNAME6= <>
##$DPNAME7= <>
##$DPOAL= (0..7)
0.5 0.5 0.5 0.5 0.5 0.5 0.5 0.5 
##$DPOFFS= (0..7)
0 0 0 0 0 0 0 0 
##$DQDMODE= 0
##$DR= 18
##$DS= 0
##$DSLIST= <SSSSSSSSSSSSSSS>
$$ [...]
##$SUBNAM2= <"">
##$SUBNAM3= <"">
##$SUBNAM4= <"">
##$SUBNAM5= <"">
##$SUBNAM6= <"">
##$SUBNAM7= <"">
##$SUBNAM8= <"">
##$SUBNAM9= <"">
##$SW= 24.0689170037331
##$SWIBOX= (0..15)
0 0 2 0 0 0 0 0 0 0 0 0 0 0 0 0 
##$SW_h= 4816.95568400771
##$TD= 16384
##$TD0= 1
##$TE= 0
##$TE2= 300
##$TE3= 300
##$TEG= 300
##$TL= (0..7)
0 120 120 120 120 120 120 120 
##$TP= (0..7)
150 150 150 150 150 150 150 150 
##$TP07= 0
##$TPNAME0= <>
##$TPNAME1= <>
##$TPNAME2= <>
##$TPNAME3= <>
##$TPNAME4= <>
##$TPNAME5= <>
##$TPNAME6= <>
##$TPNAME7= <>
##$TPOAL= (0..7)
0.5 0.5 0.5 0.5 0.5 0.5 0.5 0.5 
##$TPOFFS= (0..7)
0 0 0 0 0 0 0 0 
##$TUNHIN= 0
##$TUNHOUT= 0
##$TUNXOUT= 0
##$USERA1= <user>
##$USERA2= <user>
##$USERA3= <user>
##$USERA4= <user>
##$USERA5= <user>
##$V9= 5
##$VALIST= <valist>
##$VCLIST= <CCCCCCCCCCCCCCC>
##$VD= 0
##$VDLIST= <DDDDDDDDDDDDDDD>
##$VPLIST= <PPPPPPPPPPPPPPP>
##$VTLIST= <TTTTTTTTTTTTTTT>
##$WBST= 1024
##$WBSW= 4
##$XGAIN= (0..3)
0 0 0 0 
##$XL= 0
##$YL= 0
##$YMAX_a= 137398
##$YMIN_a= -89657
##$ZGOPTNS= <>
##$ZL1= 120
##$ZL2= 120
##$ZL3= 120
##$ZL4= 120
##$ABSF1= 10
##$ABSF2= 0
##$ABSG= 5
##$ABSL= 3
##$ALPHA= 0
##$AQORDER= 0
##$ASSFAC= 0
##$ASSFACI= 0
##$ASSFACX= 0
##$ASSWID= 0
##$AUNMP= <proc_1d>
##$AZFE= 0.1
##$AZFW= 0.1
##$BCFW= 1
##$BC_mod= 2
##$BYTORDP= 1
##$COROFFS= 0
##$CY= 11.3945322036743
##$DATMOD= 1
##$DC= 2
##$DFILT= <>
##$DTYPP= 0
##$F1P= 15.6554695791079
##$F2P= 12.8336369535428
##$FCOR= 0.5
##$FTSIZE= 0
##$FT_mod= 4
##$GAMMA= 1
##$GB= 0.15
##$INTBC= 1
##$INTSCL= 1
##$ISEN= 128
##$LB= 0.24
##$LEV0= 0
##$LPBIN= 0
##$MAXI= 10000
##$MC2= 0
##$MEAN= 0
##$ME_mod= 0
##$MI= 1.114404
##$NCOEF= 0
##$NC_proc= 0
##$NLEV= 6
##$NOISF1= 3.799351
##$NOISF2= 2.8
##$NSP= 1
##$NTH_PI= 0
##$NZP= 0
##$OFFSET= 15.70392
##$PC= 1
##$PHC0= -26346.25
##$PHC1= 12.98743
##$PH_mod= 1
##$PKNL= yes
##$PPARMOD= 0
##$PSCAL= 0
##$PSIGN= 0
##$REVERSE= no
##$SF= 200.130013532006
##$SI= 16384
##$SIGF1= 3
##$SIGF2= 2
##$SINO= 400
##$SIOLD= 16384
##$SREGLST= <1H.CDCl3>
##$SSB= 0
##$STSI= 0
##$STSR= 0
##$SW_p= 3612.71676300578
##$SYMM= 0
##$S_DEV= 0
##$TDeff= 0
##$TDoff= 0
##$TI= <>
##$TILT= no
##$TM1= 0
##$TM2= 0
##$TOPLEV= 0
##$USERP1= <user>
##$USERP2= <user>
##$USERP3= <user>
##$USERP4= <user>
##$USERP5= <user>
##$WDW= 1
##$XDIM= 8192
##$YMAX_p= 0
##$YMIN_p= 0
$$ End of Bruker specific parameters
$$ ---------------------------------
##NTUPLES= NMR FID
##VAR_NAME=  TIME,          FID/REAL,        FID/IMAG
##SYMBOL=    X,             R,               I
##VAR_TYPE=  INDEPENDENT,   DEPENDENT,       DEPENDENT
##VAR_FORM=  AFFN,          ASDF,            ASDF
##VAR_DIM=   8192,          8192,            8192
##UNITS=     SECONDS,       ARBITRARY UNITS, ARBITRARY UNITS
##FACTOR=    0.0002076,     1,               1
##FIRST=     0,             0,               0
##LAST=      1.7004516,     0,               0
##MIN=       0,             -89657,          0
##MAX=       1.7004516,     137398,          0
$$ Real data points
##PAGE= N=1
##DATA TABLE= (X++(R..R)), XYDATA
$$ [...]
$$ plain form
1895 69 -139 -82 -182 -474 64 -279 34 -118 29 232 271 116 121 -182 101 -100 99 -127 -7 57 265 -245
1917 -245 -78 -86 -56 132 162 212 -84 -152 -147 -59 -11 202 -192 132 144 20 -171 105 -97 196 -127 87 -267 -3
1941 -3 131 14 335 87 -219 -129 -257 42 -36 94 345 -96 149 104 -111 17 -32 3 -101 -205 43 -17 242
1964 242 -209 101 251 -84 -268 -46 11 -68 -73 40 -70 43 224 -145 151 62 6 84 -209 112 62 -308 -193
1987 -193 10 38 -225 241 -24 -244 -347 68 100 -77 -43 21 27 -97 -238 -67 -165 28 -78 37 77 46 -80
2010 -80 2 69 -197 210 -287 -170 -48 -132 -9 133 176 -87 178 -193 -57 31 -82 162 191 -9 235 -177
2032 -177 -142 -124 -206 226 53 -225 100 315 104 140 -74 -75 44 80 -82 327 -319 220 27 -50 190 -54 60
2055 60 59 -89 116 102 56 -23 226 398 38 -78 -40 -60 130 307 -55 114 -196 74 -99 -255 -20 -76 205
$$ packed form
1895F9k08N7j00k92N38l43L13j52J47K03L9j55Nl03K83k01J99k26J20O4K08n10
1917b45J67qL0J88L0N0k96o8NQ8M8K13l94L24J2j24j91K76k02K93l23K14l54K64
1941cJ34j17L21k48l06R0j28K99p8J30K51m41K45m5k15J28m9L5j04j04K48o0K59
1964B42m51L10J50l35j84K22N7p9nJ13j10J13J81l69K96q9n6P8k93L21n0l70J15
1987a93K03K8k63M66k65k20j03M15L2j77L4O4Oj24j41J71r8J93j06J15M0l1j26
2010h0Q2O7k66M07m97J17J22q4J23J42M3k63K65l71J36Q8j13K44K9k00K44m12
2032a77L5J8q2M32j73k78L25K15k11L6k14jJ19L6j62M09o46N39j93p7K40k44J14
2055F0jj48K05j4m6p9K49J72l60j16L8k0J90J77l62J69l10K70j73j56K35n6K81
$$ plain form
2078 205 -112 -128 -25 2 -211 -166 -93 -89 -135 -216 135 -112 -93 82 13 -117 43 -131 210 -202 -67 -94 -61 -12
2102 -12 -4 62 161 67 -162 14 57 197 -243 -178 -2 19 -108 -84 302 -600 -11 227 -275 32 32 55 -184 267
2126 267 -334 364 -195 185 -102 -8 296 318 162 45 -13 347 185 45 -250 111 64 104 -87 -29 -153 -135
2148 -135 -306 47 219 52 92 -94 89 14 -392 268 -239 156 152 34 91 25 -66 -145 -94 -276 -168 -35 -83
2171 -83 106 -268 60 -59 -115 -41 15 66 123 -23 -174 -92 -19 117 14 191 -103 87 -26 153 -253 -139 -116
2194 -116 6 165 -134 147 -13 -74 -94 107 49 -37 -151 200 -174 121 113 -74 178 66 -77 -167 47 -19 1
2217 1 30 7 104 112 139 -15 -119 162 28 -23 -108 -132 191 -91 80 -249 -43 -134 137 188 83 53 125 49 -273
2242 -273 4 -313 -109 189 -310 284 -57 287 43 115 254 310 -161 99 -9 -173 173 -215 -74 28 5
$$ packed form
2078B05l17j6J03K7k13M5P3Mm6q1L51k47J9J75o9j30J60j74L41m12J35k7L3M9
2102a2QO6R9r4k29J76M3J40m40O5J76K1j27K4L86r02N89K38n02L07%K3k39M51
2126B67o01O98n59L80k87R4L04K2j56j17n8L60j62j40k95L61m7M0j91N8j24J8
2148a35j71L53J72j67M0j86J83p5m06O60n07L95mj18N7o6r1p9N1j82J08J33m8
2171h3J89l74L28j19n6P4N6N1N7j46j51Q2P3J36j03J77k94J90j13J79m06J14K3
2194a16J22J59k99K81j60o1k0K01n8q6j14L51l74K95qj87K52j12j43r0K14o6K0
2217AK9k3R7QK7j54j04K81j34n1q5k4L23k82J71l29K06r1K71N1j05l0P2p6l22
2242b73K77l17K04K98m99N94l41L44k44P2J39N6m71K60j08j64L46l88J41J02k3
$$ plain form
2263 5 168 -315 -267 -256 -143 33 65 11 70 -11 -86 -300 -141 254 -177 -142 -282 101 -76 108 224 147 -167 -80
2287 -80 167 -99 -271 -4 226 340 297 105 167 171 236 190 -23 69 -359 -159 385 -9 74 21 -169 -118 -57 -203
2311 -203 95 247 -119 239 166 -148 -323 -183 123 218 -270 -143 236 105 -153 95 129 159 -20 -110 -4 110
2333 110 -142 -45 311 95 179 -32 161 14 186 -86 156 -9 113 -6 20 106 369 67 -65 -126 136 128
2355 128 -59 84 81 -95 -148 -30 -186 -132 457 -28 77 -59 -68 53 -221 -197 71 38 -238 24 86 -118 -98
2378 -98 -109 171 56 112 -103 -111 -30 -266 121 -92 423 36 159 -339 456 217 26 102 52 121 -51 565 360
2401 360 -6 34 -73 -13 15 -106 34 133 72 -170 55 -119 -247 97 214 -303 -224 -70 -40 79 42 272 -138
2424 -138 -98 50 453 50 61 -65 -3 -185 172 277 185 138 -191 2 4 -102 264 -125 -159 271 -37 -98 -165
$$ packed form
2263EJ63m83M8J1J13J76L2n4N9q1p5k14J59L95m31L5j40L83j77J84J16p7l14Q7
2287h0K47k66j72K67K30J14m3j92O2MO5m6k13R2m28K00N44l94Q3n3j90N1O1j46
2311b03K98J52l66L58p3l14j75J40L06R5m88J27L79j31k58K48L4L0j79r0J06J14
2333A10k52R7L56k16Q4k11J93j47J72k72K42j65J22j19K6Q6K63l02j32o1K62q
2355A28j87J43lj76n3J18j56N4N89m85J05j36rJ21k74K4K68l3k76K62O2k04K0
2378i8j1K80j15N6k15qQ1k36L87k13N15l87J23m98P95k39j91P6n0O9j72O16k05
2401C60l66M0j07O0K8j21J40R9o1k42K25j74j28L44J17n17P9J54L0J19l7K30m10
2424a38M0J48M03m03J1j26O2j82L57J05r2m7l29J93Kj06L66l89l4M30l08o1o7
$$ plain form
2447 -165 -11 -9 -56 -91 -250 145 -105 -7 66 -11 237 -206 -49 132 -80 136 -287 374 -118 74 11 149 -37
2470 -37 36 64 -17 -277 -24 222 55 60 -146 185 216 -65 81 -114 128 149 205 208 -114 213 227 15 -321 -156
2494 -156 -44 -310 116 134 -49 224 79 -168 35 234 -148 -135 -60 135 -82 80 -271 316 -7 331 95
2515 95 -87 -86 -67 11 -56 -335 20 9 25 -7 -151 -314 -334 -51 410 -199 -50 -3 91 296 87 -280 150 -212
2539 -212 6 173 322 43 -303 304 285 33 -2 4 193 247 -60 -73 -206 -102 -140 408 -137 75 144 -6 92
2562 92 60 -22 -66 58 -40 15 -143 51 53 61 -104 245 84 69 67 6 -124 48 96 178 379 262 128 286 121
2587 121 -118 103 392 -384 -275 72 -161 79 -46 -166 80 54 -68 -124 -223 107 82 4 281 56 -72 32
2609 32 -214 -384 -93 -29 -84 -295 -143 14 144 -167 27 183 114 332 135 -179 196 -339 124 -264 -269 -59
$$ packed form
2447a65J54Km7l5j59L95k50R8P3p7K48m43J57J81k12K16m23O61m92J92o3J38j86
2470c7P3K8q1k60K53K46j67Nk06L31L1k81J46j95K42K1N6Ll22L27J4k12l36J65
2494a56J12k66M26J8j83K73j45k47K03J99l82J3P5J95k17J62l51N87l23L38k36
2515I5j82JJ9P8o7k79L55j1J6l2j44j63k0K83M61o09J49M7R4K05k09l67M30l62
2539b12K18J67J49k79l46O07j9k52l5OJ89N4l07j3j33J04l8N48n45K12O9j50R8
2562I2l2q2m4J24r8N5j58J94KQj65L49j61j5ko1j30J72M8Q2K01j17j34J58j65
2587A21k39K21K89p76J09L47k33K40j25j20K46k6j22n6r9L30k5p8K77k25j28J04
2609C2k46j70K91O4n5k11J52J57J30l11J94J56o9K18j97l14L75n35M63l88nK10
$$ plain form
2631 -59 161 -125 -287 65 257 -176 -11 -252 -251 212 40 37 75 26 -41 123 -246 -19 -217 128 -164 474 -166
2654 -166 -24 -66 -65 -49 254 351 -150 -199 -140 -27 -275 138 -24 -54 -51 137 -42 -50 198 -45 -122 -105 179 -77 -67
2679 -67 164 14 60 -136 -16 -19 113 -47 45 -15 144 226 -91 191 77 -54 76 179 -226 -575 3 -149
2701 -149 -35 -19 -200 54 -115 58 -54 -198 554 -42 -117 -211 44 199 -3 538 135 -105 -145 -155 -242 -38
2723 -38 -195 -128 97 2 -273 205 -23 10 65 -320 77 -499 -196 -99 -362 22 -22 106 -187 94 42 155 -18
2746 -18 -41 -192 -229 46 -201 -124 54 -92 3 27 124 -15 68 -122 -200 -181 -90 54 -147 -40 26 -359 0 101
2770 101 25 99 68 68 -167 141 -52 -152 138 -204 111 32 37 -121 -81 302 -281 183 -117 127 -191 73 -39
2793 -39 -304 134 -32 13 90 4 -1 122 -70 62 -175 87 41 -320 -150 -188 -179 142 -163 -268 -135 -232 76 -23
$$ packed form
2631e9K20k86j62L52J92m33J65k41JM63j72lL8m9o7J64l69K27j98L45k92O38o40
2654a66J42m2JJ6L03R7n01m9N9J13k48M13j62l0LJ88j79qK48k43p7J7K84k56J0
2679f7K31j50M6j96J20lJ32j60R2o0J59Q2l17K82j14j31J30J03m05l49N78j52
2701a49J14J6j81K54j69J73j12j44P52n96p5r4K55J55k02N41m03k40m0j0q7K04
2723c8j57O7K25r5k75M78k28L3N5l85L97n76L03R7k63L84m4J28k93K81n2J13j73
2746a8k3j51l7K75k47P7J78j46R5K4R7j39Q3j90p8J9R1J44k01J07O6l85L59J01
2770A01p6P4l1%k35L08j93j00K90l42L15p9Nj58M0L83n83M64l00K44l18K64j12
2793c9k65M38j66M5P7q6nJ23j92J32k37K62m6l61J70l8RL21l05j05J33r7L08r9
$$ plain form
2817 -23 -146 -208 -60 27 -310 -148 -200 0 155 -211 77 69 46 371 240 161 96 -68 -66 68 -50 121 86 76
2841 76 -347 37 -205 -135 -122 188 21 -120 -114 86 -144 -11 87 93 -138 -62 -86 75 -103 559 38 -1 27 60
2865 60 -402 20 -28 138 -74 -6 -4 1 -228 -64 84 111 -5 -2 171 -54 -132 -166 112 21 318 35 -6 32 129
2890 129 113 222 217 163 -6 -304 -497 87 266 27 57 61 330 95 -176 19 90 -125 -242 95 -495 -324 192
2913 192 -132 -36 -69 48 260 -241 -56 -323 18 -169 136 -30 -113 10 -54 -128 -182 -38 63 -252 290 -145
2935 -145 -162 167 349 -71 -190 106 10 -230 -8 -140 -269 -106 -134 -51 -172 62 151 -58 34 181 141 7
2957 7 137 21 68 -21 21 -30 126 156 28 -42 190 -25 -170 236 -301 71 -215 -219 47 -185 -38 48 -209 -86
2981 -86 115 -81 -98 96 -185 -205 47 -53 318 5 -114 -176 -25 20 138 234 142 -24 -31 404 -208 -74 312
$$ packed form
2817b3j23o2J48Q7l37J62n2K00J55l66K88qk3L25j31p9o5j64KJ34j18J71l5j0
2841G6m23L84k42P0J3L10j67j41OK00k30J33R8Ok31P6k4J61j78O62n21l9K8L3
2865F0m62M22m8J66k12O8KNk29J64J48K7j16LJ73k25p8l4K78r1K97k83m1L8R7
2890A29j6J09nn4j69k98j93N84J79k39L0MK69k35k71J95P1k15j17L37n90J71N16
2913A92l24R6l3J17K12n01J85k67L41j87L05j66q3J23o4p4n4J44J01l15N42m35
2935a45j7L29J82m20j19K96r6k40K22j32j29J63k8Q3j21K34Q9k09R2J47m0j34
2957GJ30j16M7q9M2n1J56L0j28p0K32k15j45M06n37L72k86mK66k32J47Q6k57J23
2981h6K01j96j7J94k81k0K52j00L71l13j19o2J51M5J18R6r2j66pM35o12J34L86
$$ plain form
3004 312 -49 126 -19 -153 435 -59 68 -77 50 -86 -122 -287 -27 262 -37 45 -491 -249 -60 -48 -292
3025 -292 91 -34 -217 -344 140 146 -121 -443 -58 -86 -145 177 -59 179 397 -143 -196 2 -376 -10 -113 116
3047 116 28 -123 -21 264 -144 52 -299 -95 297 -64 88 -286 -275 218 14 197 107 151 -392 -71 175
3068 175 206 -80 -45 55 -17 -208 -128 -70 69 -86 70 -46 9 204 82 60 21 -91 -226 208 182 8 -365
3091 -365 202 -150 107 -40 -181 57 -40 -197 175 -114 -34 165 56 -14 -169 7 104 80 -182 10 -19 97
3113 97 73 82 63 233 189 -108 314 16 -104 71 -60 161 94 -65 -23 -118 247 101 68 -281 142 75 97 -278
3137 -278 94 191 18 -30 160 -70 308 61 136 -38 -52 -136 -22 17 344 39 -99 170 -12 -133 -37 215
3159 215 129 -90 86 342 -70 -145 153 5 191 156 307 -93 -291 175 -265 389 -98 29 27 302 241 -242
$$ packed form
3004C12l61J75j45j34N88m94J27j45J27j36l6j65K60K89k99Q2n36K42J89J2k44
3025b92L83j25j83j27M84Ok67l22L85k8n9L22k36K38K18n40n3J98l78L66j03K29
3047A16q8j51J02K85m08J96l51K04L92l61J52l74J1M93k04J83r0M4n43L21K46
3068A75L1k86L5J00p2j91Q0N8J39j55J56j16N5J95j22k2l9j12j35M34k6j74l73
3091c65N67l52K57j47j41K38r7j57L72k89Q0J99j09p0j55J76R7k4k62J92k9J16
3113I7k4Rj9J70m4k97M22k98j20J75j31K21o7j59M2r5L65j46l3l49M23o7K2l75
3137b78L72R7j73m8J90k30L78k47P5j74j4q4J14L9L27l05j38K69j82j21R6K52
3159B15q6k19J76K56m12p5K98j48J86l5J51m00j98M66m40O54m87J27kK75o1m83
$$ plain form
3181 -242 119 -23 -267 116 272 192 228 -37 82 -349 75 -177 75 101 -186 195 157 201 221 93 3 46 188
3204 188 -150 109 -81 98 193 51 95 -171 102 150 46 416 67 186 172 31 174 71 201 26 242
3225 242 53 -36 191 -155 132 -66 100 -70 -98 166 24 162 134 33 -142 -32 -65 34 1 -127 53 284
3247 284 -153 -371 -25 -46 172 192 -237 66 228 -14 -63 -33 -105 26 -331 3 -195 260 -129 -125 81 282
3269 282 265 30 -186 53 262 -81 29 -217 292 28 -299 31 -17 107 -48 17 -228 -181 -82 117 -83 -133
3291 -133 -105 102 -57 -61 121 -69 348 -82 -318 55 9 -184 273 -309 -142 -264 -7 67 -64 158 -203 -199
3313 -199 5 70 -130 -176 -17 15 345 283 40 -13 35 -121 -63 -93 60 50 101 172 -57 -131 -25 -113 141 17
3337 17 419 60 -107 -57 -217 -155 224 269 -82 171 -135 77 -66 -364 110 -62 199 -369 31 140 45 -136
$$ packed form
3181b42L61j42k44L83J56q0L6k65J19m31M24k52K52K6k87L81l8M4K0j28r0M3J42
3204A88l38K59j90J79R5j42M4k66K73M8j04L70l49J19j4j41J43j03J30j75K16
3225B42j89q9K27l46K87j98J66j70k8K64j42J38k8j01j75J10l3R9l3j28J80K31
3247B84m37k18L46k1K18K0m29L03J62k42m9L0p2J31l57L34j98M55l89MK06K01
3269B82j7k35k16K39K09l43J10k46N09k64l27L30m8J24j55O5k45M7R9J99k00n0
3291a33K8K07j59mJ82j90M17m30k36L73m6j93M57n82J67j22K57P4j31K22l61M
3313a99K04O5k00m6J59L2L30o2k43n3M8j56N8l0J53j0N1P1k29p4J06q8K54j24
3337A7M02l59j67N0j60O2L79M5l51K53l06K12j43k98M74j72K61n68M00J09r5j81
$$ plain form
3359 -136 29 36 76 -27 -160 -74 210 -68 150 -93 77 1 -249 33 124 242 -70 48 130 -189 -124 128 78
3382 78 238 59 22 162 -168 127 -8 176 99 118 -183 -125 -29 -90 -111 1 16 230 2 -36 33 -206 48 -317
3406 -317 246 431 -103 -122 124 -199 4 -176 -268 7 -74 -95 -6 -150 79 184 58 -154 321 121 -452 47
3428 47 -211 56 27 -17 22 145 -65 99 -50 85 239 -1 69 -105 183 35 -58 -237 -107 11 -98 87
3450 87 109 172 187 -416 287 -113 195 99 -277 38 -229 44 224 64 33 -121 258 -138 25 -315 -262 291
3472 291 90 -7 361 -27 -123 -176 -58 -79 -12 111 -65 63 -198 -93 -59 -94 114 -199 100 -167 100 -68
3494 -68 -30 -47 -76 -119 312 166 59 125 -118 -65 -43 -31 -261 -338 -433 11 19 -216 -123 -15 97 55 87 257 70
3519 70 -117 91 -26 -45 0 -235 -62 -88 -213 -131 -69 -28 -24 -59 -171 -26 -49 105 -167 107 225 22 -28 -385
$$ packed form
3359a36J65PM0j03j33Q6K84k78K18k43J70p6k50K82R1J18l12J18Q2l19O5K52n0
3382G8J60j79l7J40l30K95j35J84p7J9l01N8R6o1k1J12J5K14k28l8O9k39K54l65
3406c17N63J85n34j9K46l23K03j80r2K75q1k1Q9j44K29J05j26k12M75k00n73M99
3428D7k58K67k9m4L9J23k10J64j49J35J54k40P0j74K88j48r3j79J30J18j09J85
3450H7K2O3J5o03P03m00L08r6l76L15k67K73J80j60l1j54L79l96J63l40N3N53
3472B91k01r7L68l88r6n3J18k1O7J23j76J28k61J05L4l5K08l13K99k67K67j68
3494f8L8j7k9m3M31j46j07O6k43N3K2J2k30p7r5M44Qk35R3J08J12m2L2J70j87
3519G0j87K08j17j9M5k35J73k6j25Q2O2M1Ml5j12J45k3J54k72K74J18k03n0l57
$$ plain form
3543 -385 116 -122 -348 166 -62 26 -333 -301 46 -162 -225 152 148 -23 -26 206 -9 -163 17 263 -34 -83 -14
3566 -14 -98 -217 1 1 61 177 -8 195 74 -44 -34 -6 -59 120 111 -139 -282 99 -77 99 -88 -76 68 -43
3590 -43 -64 -130 111 164 74 30 -272 -125 -50 -18 14 181 -159 30 174 -161 105 35 185 275 115 183 28 -48
3614 -48 -147 -89 259 -125 47 -68 66 111 -163 -137 56 8 109 102 -118 13 11 39 169 227 86 -55 -404 -273
3638 -273 -74 -43 216 87 -79 -65 -56 10 87 270 99 160 129 -122 61 -127 47 137 95 115 -57 95 353 258
3662 258 -17 -51 -142 -4 -79 179 -206 -52 383 -232 75 -130 145 52 -160 -230 -157 -55 125 -108 -218 73
3684 73 74 196 209 71 94 264 -116 -416 8 258 -185 84 163 182 -198 204 55 53 -9 -46 -288 -196 -161 -47
3708 -47 36 -142 138 -99 -145 -16 -152 -254 297 -27 232 252 -228 160 99 214 408 -140 171 87 -275 107
$$ packed form
3543c85N01k38k26N14k28Q8l59L2L47k08o3L77mj71lK32k15j54J80K46k97m9O9
3566a4q4j19K18%O0J16j85K03j21j18J0K8n3J79rk50j43L81j76J76j87J2J44j11
3590d3k1o6K41N3r0m4l02J47P5L2L2J67l40J89J44l35K66p0J50R0j60O8j55p6
3614d8r9N8L48l84J72j15J34M5k74K6J93m8J01pk20J31kK8J30N8j41j41l49J31
3638b73J99L1K59j29j66J4RO6P7J83j71O1l1k51J83j88J74R0m2K0j72J52K58r5
3662B58k75l4r1J38p5K58l85J54M35o15L07k05K75r3k12p0P3J02J80k33j10K91
3684G3JJ22J3j38K3J70l80l00M24K50m43K69P9J9l80M02j49ko2l7k42R2L5J14
3708d7Q3j78K80k37m6J29j36j02N51l24K59K0m80L88o1J15J94n48L11q4l62L82
$$ plain form
3730 107 -57 180 25 -266 31 -137 191 -144 -98 10 85 -171 -63 19 -45 234 -410 146 26 -186 79
3751 79 -61 -98 -89 -155 56 101 1 -13 -7 176 172 -53 -143 1 240 174 227 269 91 118 -93 325 62 97 255 160
3777 160 49 24 4 9 106 -31 21 40 -117 -86 38 93 363 181 138 -309 -18 -118 -205 -243 -145 21 -26 -35 -79 56
3803 56 2 -189 -87 -205 241 -126 -379 -116 -260 -73 225 -288 -39 -17 91 -92 46 352 95 -93 179
3824 179 -38 -5 63 126 -63 -31 -124 -6 251 217 382 22 11 -62 223 128 200 69 53 -3 41 -76 -198 17
3848 17 5 64 -228 84 4 -140 50 182 271 -220 -144 -366 -46 -149 29 -181 -241 -84 -350 89 25 -374 -145
3871 -145 293 286 -59 281 -142 -232 86 56 231 -71 -24 -20 238 -64 0 85 139 -193 210 94 186 -248 183 9
3895 9 -75 -197 -20 72 -151 161 81 -61 56 -343 25 -100 -124 -222 288 3 -52 188 -176 72 44 -83 -82 246
$$ packed form
3730A07j64K37j55k91K97j68L28l35M6J08P5k56J08Q2o4K79o44N56j20k12K65
3751G9j40l7Ro6K11M5j00j4OJ83mk25r0J44K39o6N3M2j78K7k11M18k63L5J58r5
3777A60j11k5k0NR7j37N2J9j57L1J24N5K70j82m3m47K91j00q7l8R8J66m7rm4J35
3803E6n4j91J02j18M46l67k53K63j44J87K98n13K49K2J08j83J38L06k57j88K72
3824A79k17L3O8O3j89L2r3J18K57l4J65l60j1p3K85r5P2j31j6n6M4j17j22K15
3848A7j2N9k92L12q0j44J90J32Q9m91P6k22L20j03J78k10o0J57k66M39o4l99K29
3871a45M38pl45L40m23r0L18l0J75l02M7MK58l02O4Q5N4l32M03j16R2m34M31j74
3895Iq4j22J77R2k23L12q0j42J17l99L68j25k4r8N10k85n5K40l64K48k8j27JL28
$$ plain form
3919 246 -118 -25 -43 67 79 -91 -48 579 -237 223 -143 -19 -168 30 11 114 -69 152 240 67 189 -93
3941 -93 369 -199 -150 -127 -14 73 160 -112 8 -25 176 -90 171 41 329 113 18 293 -103 194 6 81 54
3964 54 -130 -213 -17 88 224 -328 84 14 -11 -80 -273 -330 -396 -73 125 330 -10 41 60 21 64 -15 38 255
3988 255 -329 312 -16 -50 110 137 46 -174 104 -141 179 -158 -232 134 -38 50 169 -58 -311 205 294 -161
4010 -161 80 84 11 -18 -5 -44 -395 213 -206 -238 -21 -304 38 18 222 -334 -163 -91 15 -34 49 -82 -96 -125
4034 -125 -42 93 -29 0 136 -39 -51 -347 122 -86 339 -62 -50 -12 -49 102 -193 288 -350 -49 -48 -13 -199
4057 -199 276 44 -27 61 14 -174 97 -380 86 40 -188 -90 -70 55 311 -57 338 -365 111 -102 -129 -240
4079 -240 152 -41 -194 4 -32 -52 -279 -113 21 154 142 -289 144 -15 2 -66 65 -44 -84 -41 -67 365 -304
$$ packed form
3919B46l64R3j8J10J2j70M3O27q16M60l66J24j49J98j9J03j83K21Q8j73J22k82
3941i3M62n68M9K3J13Q7Q7k72J20l3K01k66K61j30K88k16r5K75l96K97j88P5k7
3964E4j84q3J96J05J36n52M12p0k5o9j93n7o6L23J98K05l40N1J9l9M3p9N3K17
3988B55n84O41l28l4J60K7r1k20K78k45L20l37p4L66j72Q8J19k27k53N16Q9m55
4010a61K41Mp3k9J3l9l51O08m19l2K17k83L42k0K04n56J71P2J06m9Q3j31j4k9
4034a25Q3J35j22K9J36j75j2k96M69k08M25m01J2L8l7J51k95M81o38L01JL5j86
4057a99M75k32p1Q8m7j88K71m77M66m6k28R8K0J25K56l68L95p03M76k13k7j11
4079b40L92j93j53J98l6k0k27J66J34J33j2m31M33j59J7o8J31j09m0M3k6M32o69
$$ plain form
4102 -304 -360 146 -58 227 220 -88 193 -119 51 100 -216 227 214 100 368 -63 59 -86 53 -146 -90 193
4124 193 85 -242 -25 -162 175 -86 125 8 166 -96 113 181 44 -50 -26 118 -128 123 74 -5 -245 -97
4146 -97 125 -162 122 -1 -17 -12 -62 -209 -11 -89 265 85 79 211 83 169 -79 -134 -175 20 89 17 163 154 27
4171 27 -242 -255 211 20 108 145 0 129 25 73 369 -340 -114 76 66 -81 34 132 314 211 -11 12 -23
4194 -23 -57 97 -367 -149 -165 -186 185 160 101 -33 -315 68 243 73 98 37 -255 109 277 18 -20 -64 59
4217 59 83 169 -95 -19 -367 5 49 -14 -152 230 -332 207 -113 119 78 265 103 -60 153 389 -280 -121
4239 -121 -62 -100 52 48 343 193 -60 -12 -73 195 20 -140 -174 177 -40 276 -215 -31 4 86 26 163 6
4262 6 30 10 20 144 85 -127 73 218 -68 -65 -67 -70 230 -126 50 60 -222 -17 -17 -347 -195 131 73 179 21
$$ packed form
4102c04n6N06k04K85pl08K81l12J70M9l16M43j3j14K68m31J22j45J39j99N6K83
4124A93j08l27K17j37L37k61K11j17J58k62K09O8j37r4K4J44k46K51m9p9k40J48
4146i7K22k87K84j23j6Nn0j47J98p8L54j80oJ32j28Q6k48n5m1J95O9p2J46rj27
4171B7k69j3M66j91Q8L7j45J29j04M8K96p09K26J90j0j47J15R8J82j03k22K3l5
4194b3l4J54m64K18j6k1L71k5n9j34k82L83J75j70K5o1k92L64J68k59l8m4J23
4217E9K4Q6k64P6l48L72M4o3j38L82n62N39l20K32m1J87j62j63K13K36o69J59
4239a21N9l8J52mK95j50k53M8o1K68j75j60l4L51k17L16m91J84L5Q2o0J37j57
4262FK4k0J0J24n9k12K00J45k86LklL00l56J76J0k82K05%l30J52L26n8J06j58
$$ plain form
4287 21 -25 -31 -28 218 208 -177 2 -86 54 217 263 -239 -12 127 95 273 163 -37 204 -70 -150 36 142 -3
4311 -3 -79 -179 -106 -253 249 -34 31 145 223 -3 77 165 140 -9 -84 -180 27 38 -107 74 -139 31 -108 224
4335 224 -54 93 -173 -218 -108 112 -46 -84 -203 33 248 -115 335 -340 -370 -281 22 238 -87 -299 -193
4356 -193 -40 -40 104 -222 10 -83 -18 66 87 -237 -25 25 136 235 51 7 180 -24 -64 -37 20 108 -83 -206
4380 -206 -16 56 24 34 -194 -45 222 -103 16 -55 -66 109 81 132 -278 -71 150 -67 -343 -386 201 -15 -214
4403 -214 359 -105 14 352 -257 214 157 49 -397 21 -224 -54 -51 88 -44 215 -80 -190 -156 112 -175
4424 -175 30 -171 -212 -17 -133 101 -267 128 -22 36 -155 196 47 145 135 -46 149 -171 -66 125 -119
4445 -119 151 40 436 -241 -94 7 312 143 -65 -276 -278 315 136 -275 -109 42 -244 8 -182 271 158
$$ packed form
4287B1m6oLK46j0l85J79q8J40J63M6n02K27J39l2J78j10k00K41k74q0J86J06j45
4311cp6j00P3j47N02k83O5J14P8k26Q0Q8k5j49p5r6K07J1j45J81k13J70j39L32
4335B24k78J47k66m5J10K20j58l8j19K36K15l63M50o75l0Q9L03K16l25k12J06
4356a93J53%J44l26K32r3O5Q4K1l24K12N0J11R9j84m4J73k04m0K7N7Q8j91j23
4380b06J90P2l2J0k28J49K67l25J19p1j1J75k8N1m10K07K21k17k76m3N87k16j99
4403b14N73m64J19L38o09M71n7j08m46M18k45J70LJ39j32K59k95j10L4K68k87
4424a75K05k01m1J95j16K34l68L95j50N8j91L51j49R8j0j81J95l20J05J91k44
4445a19K70j11L96o77J47J01L05j69k08k11kN93j79m11J66J51k86K52j90M53j13
$$ plain form
4466 158 7 -130 53 -228 -207 -168 54 59 -123 -23 -73 131 -299 -132 76 189 10 14 -429 64 178 -36
4488 -36 19 -281 -182 -106 -88 406 -171 126 -86 -85 127 -41 145 -91 -51 91 93 124 -122 100 258 153 -53 -29
4512 -29 95 24 -2 -11 -15 -2 -110 -198 59 -23 115 99 22 41 -9 24 38 24 194 -46 9 134 -27 -159 -19 -1
4538 -1 -58 -140 -43 -377 -241 34 -74 209 81 -127 -45 88 15 -41 79 -223 -65 18 -159 121 -7 -224 -102
4561 -102 -45 20 -206 -90 -4 267 33 -89 -18 2 78 7 -27 193 179 -373 14 22 10 -180 -1 -165 -180 54
4585 54 -109 299 288 175 -137 -85 32 -5 -14 -235 -4 -115 -39 -79 99 -337 140 148 333 253 -70 61 282 296
4609 296 338 149 -80 61 253 181 -132 -177 -160 57 161 -56 142 41 -22 -104 -48 161 -335 -73 -40 -43 -42 183
4633 183 76 71 -139 334 176 140 129 158 4 194 46 2 -194 -37 -164 -8 126 -297 37 27 23 -116 -86
$$ packed form
4466A58j51j37J83k81K1L9K22Nj82J00n0K04m30J67K08J13j79Mm43M93J14k14
4488c6N5l00R9P6J8M94n77K97k12JK12j68J86k36M0J42KL1k46K22J58j05k06K4
4512b9J24p1k6rmJ3j08q8K57q2J38j6p7J9n0L3J4j4J70k40N5J25j61j32J40J8
4538an7q2R7l34J36K75j08K83j28k08Q2J33p3n6J20l02J58Q3j77K80j28k17J22
4561a02N7O5k26J16Q6K71k34j22P1K0P6p1l4K20j4n52L87Qj2j90J79j64j5K34
4585E4j63M08j1j13l12N2J17l7rk21K31j11P6m0J78m36M77QJ85q0l23J31K21J4
4609B96M2j89k29J41J92p2l13m5J7K17J04k17J98j01o3q2N6K09m96K62L3lJK25
4633A83j07nk10M73j58l6j1K9j54J90j48m4j96J57j27J56J34m23L34j0mj39L0
$$ plain form
4656 -86 222 56 -22 -34 10 -33 -95 13 -58 -192 -143 30 -170 -104 99 -115 -152 133 54 20 245 -114 -125 -33 -31
4681 -31 -243 -272 206 -5 105 -115 -157 -72 75 -87 -73 29 326 369 -52 40 -90 283 62 -69 -200 -219 53
4704 53 -82 19 257 -159 122 130 -7 -124 59 -276 -14 -25 34 73 -38 -155 88 -69 51 -87 -96 -112 -26
4727 -26 149 -60 -90 -230 -24 -123 9 -1 133 99 316 -135 4 -116 9 -168 37 -83 86 12 -49 -396
4749 -396 -217 -79 251 -80 -310 -337 5 -51 -140 -122 -23 -100 94 -222 -181 -40 98 178 -147 136 99 -57 -124
4772 -124 13 71 -63 133 299 106 -87 195 19 -141 136 90 153 -16 -310 368 65 66 8 42 176 62
4794 62 66 115 -89 -115 -12 33 -185 189 50 -53 -190 104 56 277 -82 254 -53 -70 -290 -304 68 -7 59 -76
4818 -76 -292 -41 -5 -266 106 103 171 112 69 27 40 416 -18 -37 80 28 19 -128 230 -40 31 -295 -183 -267 -74
$$ packed form
4656h6L08j66p8j2M4m3o2J08p1j34M9J73k00O6K03k14l7K85p9l4K25l59j1R2K
4681c1k12k9M78k11J10k20m2Q5J47j62J4J02K97M3m21R2j30L73k21j31j31j9K72
4704E3j35J01K38m16K81Qj37j17J83l35K62j1N9L9j11j17K43j57J20j38rj6Q6
4727b6J75k09l0j40K06r9J32j0J34l4K17m51J39j20J25j77K05j20J69p4o1l47
4749c96J79J38L30l31k30k7L42n6q9J8R9p7J94l16M1J41J38Q0l25K83l7j56o7
4772a24J37N8j34J96J66j93j93K82j76j60K77m6O3j69k94O78l03Jn8L4J34j14
4794F2MM9k04k6J03M5k18L74j39j03j37K94m8K21l59L36l07j7k20j4L72p5O6j35
4818g6k16K51L6k61L72lO8n9m3m2J3L76m34j9J17n2rj47L58k70P1l26J12q4J93
$$ plain form
4843 -74 18 -29 -84 -82 244 -134 59 17 16 -110 -66 -86 -39 248 -177 -301 -243 -224 251 -191 24 -43 64 190 -153
4868 -153 136 -11 136 -216 -56 -93 -279 -108 145 29 -231 -254 167 71 166 115 177 -86 -113 -20 30 -281 114
4891 114 181 105 164 23 80 87 -443 -242 78 -12 65 93 190 -27 85 -115 130 111 234 82 345 -8 97 -242
4915 -242 -10 8 -182 8 214 47 -45 13 409 -128 25 -38 -140 -122 40 -227 87 -13 111 131 -1 -17
4937 -17 57 241 213 88 156 259 -140 -138 13 22 111 -36 77 -100 -6 147 -125 16 -266 -141 84 -323 24
4960 24 -43 -132 -54 212 138 -23 160 49 -103 7 -140 -224 -178 -322 -170 -73 -55 -20 -153 94 126 -43 33 104
4984 104 -281 -3 -75 175 62 -506 118 8 -52 319 -95 -142 27 -9 217 -135 -104 286 -403 288 359 228
5006 228 122 -31 131 48 -12 367 -39 -62 224 45 125 178 24 103 67 194 -37 140 44 140 -191 61 -54
$$ packed form
4843g4R2m7n5KL26l78J93m2jj26M4k0M7K87m25j24N8J9M75m42K15o7J07J26l43
4868a53K89j47J47l52J60l7j86J71K53j16k60k3M21r6R5n1O2k63k7R3N0l11L95
4891A14O7p6N9j41N7Pn30K01L20r0P7K8R7k17J12k00K45j9J23j52K63l53J05l39
4915b42K32J8j90J90K06j67r2N8L96n37J53o3j02J8J62k67L14j00J24K0j32j6
4937a7P4J84k8j25O8J03l99KJ51RQ9j47J13j77R4J53k72J41k82J25K25m07L47
4960B4o7q9P8K66p4j61J83j11j52J10j47q4M6j44J52R7J8L5j33K47L2j69P6P1
4984A04l85K78p2K50j13n68O24j10o0L71m14m7J69l6K26l52L1L90o89O91P1j31
5006B28j06j53J62q3o0L79m06k3K86j79Q0N3j54P9l6J27k31J77r6R6l31K52j15
$$ plain form
5029 -54 -33 83 -283 1 14 -86 -32 -53 45 -150 180 238 -155 -205 -9 -138 130 -169 89 -377 224 9 -157
5052 -157 96 170 -3 136 -85 -307 -36 -93 -161 -322 98 -293 242 -80 -101 7 120 -335 168 -16 -376
5073 -376 -147 -83 -52 -119 -44 -238 51 -3 -22 149 217 339 -69 24 41 -231 240 275 -298 -81 19 -129 87
5096 87 16 -29 15 68 263 45 -78 257 162 13 48 -49 -58 50 -176 169 -44 -59 -19 307 -55 -279 -38 18
5120 18 89 -351 213 23 279 -185 39 -59 89 105 186 -122 -94 -162 -75 31 -46 80 -91 116 300 -56 -234
5143 -234 -118 -115 -26 47 485 -156 -384 -124 -79 313 9 60 -226 -11 -6 -60 -4 119 -39 -172 -151 422 442 -105
5167 -105 59 -212 -236 -102 -88 -7 145 -131 190 7 -317 -121 185 161 -33 -180 51 -388 -27 100 80 -42
5189 -42 -170 215 -138 33 -218 333 142 -150 161 27 -238 115 -229 -25 -229 179 -72 -129 42 140 -158
$$ packed form
5029e4K1J16l66K84J3j00N4k1R8j95L30N8l93n0J96j29K68k99K58m66O01k15j66
5052a57K53P4j73J39k21k22K71n7o8j61M20l91N35l22k1J08J13m55N03j84l60
5073c76K29O4L1o7P5j94K89n4j9J71O8J22m08R3J7k72M71L5n73K17J00j48K16
5096H7p1m5M4N3J95k18j23L35r5j49L5r7rJ08k26L45k13j5M0L26l62k24K41N6
5120A8P1m40N64j90K56m64K24r8J48J6Q1l08K8o8Q7J06p7J26j71K07J84l56j78
5143b34J16LQ9P3M38o41k28K60M5L92l04N1k86K15Nn4N6J23j58j33K1N73K0n47
5167a05J64k71k4J34J4Q1J52k76L21j83l24J96L06k4j94j47K31m39L61J27k0j22
5189d2j28L85l53J71k51N51j91k92L11j34k65L53l44K04k04M08k51n7J71R8k98
$$ plain form
5210 -158 82 -268 27 -143 -261 263 195 -143 -86 -87 -80 -127 109 74 -255 103 -116 -175 -129 118 -169 -61 43
5233 43 83 -41 -94 -58 221 -103 43 -251 230 167 394 -108 271 8 117 145 -280 36 37 -152 134 26 138
5256 138 -10 -161 47 8 10 -292 -332 -78 181 -160 -401 -260 -307 -38 170 -48 33 36 382 -151 -93 82 104
5279 104 76 252 56 -83 -153 208 -201 209 232 233 -137 168 250 30 67 -2 312 95 -101 -33 -60 9 -307 -57
5303 -57 336 147 -122 143 58 -218 -94 201 -130 78 460 -221 -23 24 -129 -63 -132 46 -16 165 -52 -49 26
5326 26 -13 -202 -220 -113 -72 -66 -87 103 -239 22 80 120 -210 -64 -24 -19 -46 115 41 -212 -132 190 70 -33 -120
5351 -120 48 128 -135 -22 13 -125 126 122 -31 -44 -179 -122 54 52 -71 -17 -158 -125 266 124 -75 121 267
5374 267 -38 -40 -134 -325 -294 -29 93 -163 56 97 -263 28 134 299 -153 -183 -69 40 63 -206 89 9 92
$$ packed form
5210a58K40l50K95j70j18N24o8l38N7jPm7K36l5l29L58k19n9M6K47k87J08J04
5233D3M0j24n3L6K79l24J46k94M81o3K27n02L79k63J09K8m25L16Jj89K86j08J12
5256A38j48j51K08l9Kl02m0K54K59l41k41J41m7K69K08k18Q1LL46n33N8J75K2
5279A04k8J76j96j39p0L61m09M10K3Jl70L05Q2k20L7o9L14k17j96O8k7O9l16K50
5303e7L93j89k69K65q5k76J24K95l31K08L82o81J98M7j53O6o9J78o2J81k17LP5
5326B6l9j89j8J07M1Ok1J90l42K61N8M0l30J46M0Nk7J61p4k53Q0L22j20j03q7
5351a20J68Q0k63J13L5j38K51mj53j3j35N7J76kj23N4j41L3L91j42j99J96J46
5374B67l05kr4j91L1K65J22k56K19M1l60K91J06J65m52l0J14J09K3k69K95q0Q3
$$ plain form
5397 92 -123 -137 90 79 -48 -157 -388 -197 54 -27 -104 -146 41 -297 405 71 -125 -155 97 135 -80 12 182
5420 182 86 124 147 -59 -91 110 97 -7 133 -6 101 183 162 -84 -87 120 -236 -34 82 336 236 -241 -60
5443 -60 -138 28 -341 -102 -31 -163 150 347 139 -67 121 -43 -133 124 -110 102 237 -95 79 -228 -41
5464 -41 11 -1 -75 -28 -35 172 3 -45 -331 185 100 -247 -182 -203 -97 268 12 -47 -306 -148 -23 -71 14 -226 67
5489 67 80 -61 -241 -228 208 -138 -207 120 238 236 -164 -295 -13 -40 -230 -111 -44 131 -4 241 -222 -26 -82
5512 -82 2 133 252 20 -154 87 424 -234 132 414 70 73 -90 24 -1 -74 111 98 -73 -99 35 -87 73
5535 73 101 202 156 -54 -115 -101 -123 -300 26 36 72 284 -201 31 86 93 9 75 40 -56 -16 74 -112 20 -33 186
5561 186 -326 1 20 277 -204 198 54 -179 86 156 54 -52 163 -47 -35 281 23 -112 292 -99 104
$$ packed form
5397I2k15j4K27j1j27j09k31J91K51q1p7m2J87l38P02l34j96l0K52L8k15R2J70
5420A82r6L8K3k06l2K01j3j04J40j39J07Q2k1k46lK07l56K02J16K54j00m77J81
5443f0p8J66l69K39P1j32L13J97k08k06J88j64r0K57k34K12J35l32J74l07J87
5464d1N2j2p4M7pK07j69m8k86N16q5l47O5k1J06L65k56n9k59J58J25m8Q5k40K93
5489F7J3j41j80J3M36l46o9L27J18km00j31K82k7j90J19O7J75j35K45m63J96n6
5512h2Q4J31J19k32j74K41L37o58L66K82l44Lj63J14k5p3J85j3j71k6J34j22J60
5535G3K8J01m6k10o1J4k2j77L26J0L6K12m85K32N5Pq4O6l5r6M0R0j86J32n3K19
5561A86n12L27J9K57m81M02j44k33K65P0j02j06K15k10J2L16k58j35M04l91K03
$$ plain form
5582 104 77 161 -147 -131 120 15 -246 -176 -43 68 -126 -228 149 -84 -99 15 9 94 143 -38 -15 60 -1 -57
5606 -57 -139 133 125 34 60 -13 19 106 129 -169 65 255 1 -291 -191 95 140 140 -184 267 -145 -138 -37 -8 321
5631 321 432 118 -120 -133 97 -133 -60 166 -290 48 276 -183 -59 -76 69 93 233 -32 -205 26 -214
5652 -214 -129 49 222 14 23 -52 12 130 174 -127 124 -68 -10 77 119 -86 -176 171 187 22 -77 1 -255 -79
5676 -79 -28 -210 70 -13 -189 -41 -5 266 -90 20 187 -173 8 -111 -140 -31 161 -175 -15 28 -193 111
5698 111 -135 151 187 6 291 -1 -3 -349 164 -189 86 -100 -209 53 21 124 83 -24 72 124 -122 -133 -213
5721 -213 235 32 -99 -3 -200 123 21 -237 225 147 49 -146 36 -318 -132 -313 117 29 27 -171 173 128
5743 128 86 21 -211 80 -77 -65 -133 457 142 270 26 148 -161 3 149 45 -150 115 -149 -143 -263 -125
$$ packed form
5582A04k7Q4l08J6K51j05k61P0J33J11j94j02L77k33j5J14oQ5M9j81K3P5o1n6
5606e7q2K72qr1K6p3L2Q7K3k98K34J90k54k92J00K86M5%l24M51m12PJ01K9L29
5631C21J11l14k38j3K30k30P3K26m56L38K28m59J24j7J45K4J40k65j73K31k40
5652b14Q5J78J73k08Rp5O4J18M4l01K51j92N8Q7M2k05r0L47J6j65r9P8k56J76
5676g9N1j82K80q3j76J48L6K71l56J10J67l60J81j19k9J09J92l36J60M3k21L04
5698A11k46K86L6j81K85k92kl46N13l53K75j86j09K62l2J03m1j07R6N2k46j1q0
5721b13M48k03j31R6j97L23j02k58M62p8r8j95J82l54J86j81M30q8kj98L44m5
5743A28m2o5k32K91j57J2o8N90l15J28k44J22l09J64J46j04j95K65k64Oj20J38
$$ plain form
5765 -125 111 -21 -196 120 -44 252 -258 47 52 -153 12 32 134 16 -294 -179 310 472 199 265 -83
5786 -83 21 -37 151 246 130 -208 83 -36 68 263 300 173 23 186 87 -235 -455 228 -126 65 -25 -30 -140
5809 -140 -179 59 -63 352 -232 -177 80 -38 -149 -213 37 225 156 103 -131 172 37 -184 -275 54 -98 -79
5831 -79 -371 -90 39 -124 -52 -256 261 107 -97 91 72 76 -56 -18 -20 47 -111 103 -248 -167 203 172 166 -121
5855 -121 116 -106 93 254 144 202 -196 -6 117 -54 -50 161 -87 -86 389 -129 -64 -200 -256 23 458 -104
5877 -104 -180 217 -49 182 -16 53 152 39 29 134 -289 -88 138 -58 -131 -253 123 85 -207 -339 -22 -186
5899 -186 -89 -153 78 218 123 363 502 -33 150 -59 -98 -33 -118 6 -19 -171 -48 135 -155 -15 6 167 437
5922 437 -341 -106 239 -173 8 456 116 -201 -175 148 39 -137 -141 -170 148 -3 97 0 -124 -466 114 427
$$ packed form
5765a25K36j32j75L16j64K96n10L05Nk05J65K0J02j18l10J15M89J62k73O6l48
5786h3J04n8J88R5j16l38K91j19J04J95L7j27j50J63r9l22k20O83l54J91r0nj10
5809a40l9K38j22M15n84N5K57j18j11o4K50J88o9n3k34L03j35k21r1L29j52J9
5831g9k92K81J29j63P2k04N17j54k04J88j9Mj32L8kO7j58K14l51Q1L70l1ok87
5855a21K37k22J99J61j10N8l98J90J23j71MK11k48JM75n18O5j36n6K79M35n62
5877a04p6L97k66K31j98O9R9j13j0J05m23K01K26j96p3j22L76l8k92j32L17j64
5899a86R7o4K31J40r5K40J39n35J83k09l9O5q5J24k5j52J23J83k90J40K1J61K70
5922D37p78K35L45m12J81M48l40l17K6L23j09j76mk9L18j51J00r7j24l42N80L13
$$ plain form
5944 427 193 146 -114 -148 -17 -111 48 -58 88 39 -115 -92 119 18 -5 -20 84 397 -393 -167 6 -259
5966 -259 -68 87 -330 -142 34 -226 -56 150 47 -52 -60 87 47 -129 -65 -97 -49 105 -220 -153 -87 -273 8
5989 8 -191 284 -51 -54 -156 18 112 76 162 -12 58 284 -87 -47 -80 -53 -283 158 26 -131 -277 191 346 105
6013 105 99 239 200 -167 -118 173 -135 4 134 -35 -53 -372 -177 1 -46 -38 -34 -69 -199 108 203 358 126 138
6037 138 -68 -116 -123 -98 72 -256 170 -101 -267 -1 33 -253 77 -32 278 243 353 -259 58 -21 -39 -2 -48
6060 -48 -101 22 -46 119 -42 -64 80 -13 -28 -42 -295 -138 8 -91 -154 101 33 -185 182 209 19 40 -268 -72
6084 -72 -286 69 108 116 85 132 35 -59 -92 -58 7 74 161 -9 223 62 95 -147 -14 -126 86 -89 22 105 -290
6109 -290 -23 -42 -112 154 -15 95 -242 59 -67 214 -30 -175 -58 -114 -72 -1 195 144 158 -5 -37 363 10
$$ packed form
5944D27k34m7k60l4J31r4J59j06J46m9j54K3K11j01k3j5J04L13p90K26J73k65
5966b59J91J55m17J88J76k60J70K06j03r9qJ47m0j76O4l2M8J54l25O7O6j86K81
5989Hj99M75l35lj02J74R4l6Q6j74P0K26l71M0l3K7k30M41j32j57j46M68J55k41
6013A05oJ40l9l67M9K91l08J39J30j69j8l19J95J78m7QMl5j30L07R5J55k32J2
6037A38k06m8pK5J70l28M26k71j66K66L4k86L30j09L10l5J10o12L17p9j8L7m6
6060d8n3J23o8J65j61k2J44r3j5j4k53J57J46r9o3K55o8k18L67K7j90K1l08J96
6084g2k14L55L9Ql1M7r7r4l3L4O5O7Q7j70K32j61L3k42J33j12K12j75J11Q3l95
6109b90K67j9p0K66j69J10l37L01j26K81k44j45J17n6M2P1J96n1J4j63l2M00l53
$$ plain form
6132 10 99 89 -158 144 -108 203 -92 -202 150 -62 128 66 305 -332 -39 40 -167 -95 86 28 336 -148
6154 -148 21 104 52 174 137 156 -45 -75 195 5 -277 -3 -27 -16 49 32 -128 75 -225 60 22 -56 156 213
6178 213 -84 19 -251 23 15 -386 -218 -590 -106 -87 36 216 -157 248 -118 28 138 22 -278 109 356
6199 356 36 42 209 40 -87 -63 -88 -105 -27 18 110 97 235 -21 104 -93 -74 -242 -374 -100 29 241 192 -173
6223 -173 -243 -44 -14 -44 54 -253 -89 67 -23 115 -191 -235 51 271 20 330 -388 86 339 -153 202 -231
6245 -231 3 -89 -41 249 -18 -109 -88 28 -82 9 -98 -63 159 2 141 -92 -50 -176 194 245 -317 -151 52
6268 52 26 -197 -75 -133 256 -115 184 -167 1 173 22 136 -5 156 46 274 88 -67 248 -62 17
6289 17 -156 -103 -7 -47 91 155 -140 114 265 -210 36 14 31 163 23 58 208 -116 -132 285 -131 83 257
$$ packed form
6132A0Q9j0k47L02k52L11k95j10L52k12J90o2K39o37K93P9k07P2J81n8L08m84
6154a48J69Q3n2J22l7J9k01l0K70j90k82K74k4J1O5j7j60K03l00K85l8p8K12N7
6178B13k97J03k70K74qm01J68l72M84J9J23J80l73M05l66J46J10j16l00L87K47
6199C56l20OJ67j69j27K4k5j7P8M5R2j3J38k56J25j97J9j68j32K74J29K12m9l65
6223a73p0J99L0l0R8l07J64J56r0J38l06m4K86K20k51L10p18M74K53m92L55m33
6245b31K34r2M8K90k67r1K1J16j10R1j07L5K22j57J39k33M2j26L70N1n62J66K03
6268E2k6k23J22n8L89l71K99l51J68J72j51J14j41J61j10K28j86j55L15l10P9
6289A7j73N3R6m0J38O4k95K54J51m75K46k2J7J32j40L5J50l24j6M17m16K14J74
$$ plain form
6312 257 -114 148 -151 -216 -89 26 71 154 -266 45 -186 -134 6 -123 -141 -5 23 -167 -75 125 131 -158 -59
6335 -59 -144 -251 -83 268 139 42 -3 -38 -125 -250 68 51 194 3 -37 174 -134 73 102 429 -175 -228 -84
6358 -84 80 193 7 156 164 40 17 214 -72 -24 -72 135 123 61 61 -256 -375 -22 -45 -84 80 61 158 216 -122
6383 -122 -246 101 -39 -196 120 -124 -119 176 311 -88 2 195 -204 73 -82 -6 133 -149 -5 -150 -73 14
6405 14 109 75 -259 76 195 -205 -141 -44 -61 -27 -127 -36 -105 244 -227 103 147 -285 116 -116 66 128 -111 155
6429 155 3 116 -166 -214 -96 42 -17 -34 -49 -355 -42 -19 57 234 -118 19 -30 -28 -206 15 228 73 -31
6452 -31 70 27 83 215 -105 -457 -26 206 223 8 -101 -226 -106 163 -12 79 25 -68 144 -468 -37 156
6474 156 189 81 353 117 -93 173 166 -161 43 -19 -71 125 -251 35 -31 -61 85 80 -100 287 -7 152 67
$$ packed form
6312B57l71K62k99o5J27J15M5Q3m20L11k31N2J40j29j8J36K8j90R2K00Ok89R9
6335e9q5j07J68L51j29r7m5l5q7j25L18j7J43j91m0K11l08K07K9L27o04n3J44
6358h4J64J13j86J49Qj24k3J97k86M8m8K07j2o2%l17j19L53k3l9J64j9R7N8l38
6383a22j24L47j40j57L16k44NK95J35l99R0J93l99K77j55P6J39k82J44j45P7Q7
6405A4R5l4l34L35J19m00O4R7j7L4j00R1o9L49m71L30M4m32M01k32J82O2k39K66
6429A55j52J13k82m8J18J38n9j7j5l06L13K3P6J77l52J37m9Kj78K21K13j55j04
6452c1J01m3N6J32l20l52M31K32J7k15j09j25J20K69j75R1n4r3K12o12M31J93
6474A56L3j08K72k36k10K66pl27K04o2n2J96l76K86o6l0J46nj80L87k94J59q5
$$ plain form
6497 67 -5 33 -181 133 13 -36 -251 40 481 -30 -55 67 244 -182 106 -80 99 -91 159 97 158 135 -111
6520 -111 167 148 -23 87 93 -126 240 110 -14 4 10 81 13 -53 298 95 -148 116 -56 68 57 84 -210 294
6544 294 86 -312 16 -2 96 -87 -119 -314 158 171 60 62 -120 24 -224 -280 86 110 257 -156 42 42 -109
6567 -109 109 22 -297 -35 30 -202 -192 128 -154 130 -524 53 -21 38 -141 -288 -38 -73 -102 106 141 8 80
6590 80 139 -95 -254 -40 -409 -11 76 88 -182 -130 55 -75 11 87 118 -175 -137 137 -120 56 12 -36 -100 76
6614 76 -45 -177 82 5 159 119 -21 252 25 219 73 -64 -21 -220 450 -197 164 222 217 -33 75 -227
6636 -227 -105 -123 -127 109 15 41 -57 85 -27 -220 -172 98 -425 -226 56 -241 -21 50 184 -149 36 -160 -101
6659 -101 126 228 -459 -5 79 104 -151 -108 266 -18 -311 -134 39 -26 71 43 113 170 -212 125 168 42 18
$$ packed form
6497F7p2L8k14L14j20m9k15K91M41n11k5J22J77m26K88j86J79j90K50o2O1k3k46
6520a11K78j9j71J10Ok19L66j30j24J8OP1o8o6L51k03k43K64j72J24j1K7k94N04
6544B94k08l98L28j8R8j83l2j95M72J3j11Kj82J44k48n6L66K4J47m13J98%j51
6567a09K18q7l19K62O5k32J0L20k82K84o54N77p4N9j79j47K50l5k9K08L5j33P2
6590H0N9k34j59K14l69L98Q7J2k70N2J85j30Q6P6L1k93L8K74k57J76m4m8o4J76
6614G6j21j32K59p7J54m0j40K73k27J94j46j37M3j99O70o47L61N8nk50J08l02
6636b27J22j8mK36r4K6r8J42j12j93M8K70n23J99K82k97K20P1J34l33J85j96N9
6659a01K27J02o87M54Q4K5k55M3L74k84k93J77J73o5R7k8P0N7l82L37M3j26k4
$$ plain form
6682 18 58 60 44 163 -45 -39 -153 197 -111 -39 -158 45 -70 -251 195 34 210 90 164 -85 -33 -17 -67 135
6706 135 79 -88 151 0 40 11 227 497 107 112 -53 68 -429 205 79 -99 68 215 90 142 -184 121
6728 121 98 51 87 -288 -186 -175 -50 -140 68 -71 214 -45 -52 30 37 -245 -74 17 -61 -137 200 314 44 -233
6752 -233 -230 -44 -77 -178 89 189 11 -165 115 -3 196 79 125 125 8 123 -128 -88 -10 -89 -282 -33 206
6775 206 259 43 140 -228 -51 124 -13 -58 -59 24 188 -12 -52 -174 -141 357 -63 206 141 -44 195 -130 33
6798 33 200 165 -314 -185 70 -158 -10 -11 -72 253 -72 -128 79 -52 60 85 337 -126 30 -45 -166 244 -309
6821 -309 -351 210 64 -51 -60 47 -75 -40 -158 18 -174 -106 -265 -375 240 160 52 89 341 -116 234 -244
6843 -244 83 -78 -107 77 -96 -63 -64 249 -10 142 -34 233 -102 313 114 -141 -4 -16 66 -29 -120 177 -226
$$ packed form
6682A8M0Kj6J19k08Oj14L50l08P2j19K03j15j81M46j61J76j20P4k49N2J6n0K02
6706A35n6j67K39j51M0k9K16K70l90Nj65J21m97O34j26j78J67J47j25N2l26L05
6728A21k3m7L6l75J02J1J25r0K08j39K85k59pQ2Pk82J71R1p8p6L37J14k70k77
6752b33LJ86l3j01K67J00j78j76K80j18J99j17M6%j17J15k51M0P8p9j93K49K39
6775B06N3k16R7l68J77J75j37m5jQ3J64k00m0j22L3M98m20K69o5j85K39l25J63
6798C3J67l5m79J29K55k28J48jo1L25l25n6K07j31J12K5K52m63J56p5j21M10n53
6821c09m2N61j46j15rJ07j22L5j18J76j92O8j59j10O15q0j08L7K52m57L50m78
6843b44L27j61k9J84j73L3jL13k59J52j76K67l35M15j99k55J37j2Q2r5r1K97m03
$$ plain form
6866 -226 28 57 198 102 165 24 -95 25 176 -119 -181 126 -46 -323 13 185 15 -102 4 85 -57 -185
6888 -185 174 58 -17 161 17 -57 -47 107 485 241 -306 -30 -25 -25 256 -127 -351 -241 -98 -178 -4 338 -187
6911 -187 247 -64 6 139 201 177 159 40 -250 -198 35 147 18 66 -75 -1 -152 149 158 96 253 -83 -5 59
6935 59 87 -356 -56 -153 215 -128 -206 215 -188 217 -38 -100 -84 15 59 80 17 -228 63 -89 174 7 -83 -7
6959 -7 -196 -148 -62 56 390 -159 52 12 -22 76 58 129 207 -119 234 -18 18 70 -95 -74 147 74 -2 128 76
6984 76 49 -345 -151 -26 32 205 101 90 -50 124 165 99 42 -37 -279 -74 -71 113 -19 34 -154 -262 -126 -188
7008 -188 -44 10 -108 -44 -208 -310 124 -53 111 -244 146 189 -85 -215 -157 -24 203 84 101 222 -16 82
7030 82 -29 213 -120 191 -241 28 -8 122 263 -230 -136 -177 -123 56 -247 7 93 -72 -65 112 305 -28 54
$$ packed form
6866b26K54K9J41r6O3j41j19J20J51k95o2L07j72k77L36J72j70j17J06Q1j42j28
6888a85L59j16p5J78j44p4J0J54L78k44n47K76N%K81l83k24J10J43q0J74L42n25
6911a87M34l11P0J33O2k4j8j19k90N2K33J12j29M8j41P4j51L01Ro2J57l36P8O4
6935E9K8m43L00r7L68l43p8M21m03M05k55o2J6R9M4K1o3k45K91j52K63j67r0P6
6959gj89M8Q6J18L34n49K11m0l4R8j8P1P8l26L53k52L6N2j65K1K21p3p6J30n2
6984G6k7l94J94J25N8J73j04j1j40J74M1o6n7p9k42K05LJ84j32N3j88j08J36o2
7008a88J44N4j18O4j64j02M34j77J64l55L90M3k74j30N8J33K27j19J7J21k38R8
7030H2j11K42l33L11m32K69l6J30J41m93R4m1N4J79l03K54Q6j65PJ77J93l33Q2
$$ plain form
7053 54 14 124 -92 -120 201 -15 -171 -58 -145 213 -110 15 -151 -151 180 28 35 -122 172 158 93 -34 -262
7076 -262 -42 -300 63 -170 36 94 85 -69 213 -73 -265 112 -110 -188 97 -220 528 111 5 468 144
7097 144 248 83 -168 154 267 -223 -93 -40 -40 -320 139 -164 133 -29 41 -50 -5 -338 -141 -151 145 251
7119 251 -237 121 200 202 134 -13 227 182 -83 416 15 79 -129 -43 56 -290 20 -271 37 16 218 91 19
7142 19 -39 64 145 136 -164 47 157 -80 27 -75 -59 49 79 -331 187 187 73 97 -94 17 -204 -44 -175
7165 -175 -79 -227 89 -226 -84 234 47 258 -187 133 -187 164 89 46 -8 -31 137 64 -33 -89 45 -68 183
7188 183 -19 49 -60 -240 59 125 139 236 198 -116 42 -166 -78 -229 -40 86 -298 239 106 287 164 218
7210 218 -22 -142 309 15 -71 126 56 -48 36 -89 -100 -366 -259 239 -95 -278 -130 -84 -297 66 -268 113
$$ packed form
7053E4m0J10k16k8L21k16j56J13q7L58l23J25j66%L31j52Pj57K94j4o5j27k28
7076b62K20k58L63k33K06N8rj54K82k86j92L77k22p8K85l17P48m17j06M63l24
7097A44J04j65k51L22J13m90J30N3%k80M59l03K97j62P0r1M5l33J97j0K96J06
7119B51m88L58P9Ko8j47K40m5k65M99m01O4k08Q6R9l46L10k91L08k1K02j27p2
7142A9n8J03Q1rl00K11J10k37J07j02J6J08L0m10N18%j14K4j91J11k21J60j31
7165a75R6j48L16l15J42L18j87K11m45L20l20L51p5m3n4k3J68p3r7n6J34j13K51
7188A83k02O8j09j80K99O6J4R7l8l14J58k08Q8j51J89J26l84N37j33J81j23N4
7210B18k40j20M51k94q6J97p0j04Q4j25j1k66J07M98l34j83J48M6k13L63l34L81
$$ plain form
7232 113 -1 38 -266 -270 256 115 -27 283 -44 148 -128 -52 -19 -187 -40 128 48 306 -212 26 -307 -26
7254 -26 -85 -83 198 -52 4 -63 187 314 -132 -51 76 11 188 -370 -111 -85 -157 -33 -249 -133 -360 73 460
7277 460 -181 -295 -185 -141 13 -155 142 -57 65 -254 -41 45 -114 117 -20 -111 -166 29 -160 167 39
7298 39 -74 -167 -60 -65 -88 -35 -261 3 202 -92 -18 155 56 218 -118 -148 -82 -8 -108 -52 -15 -132 158 47
7322 47 42 267 44 220 -211 80 -141 500 -196 -127 138 36 -93 196 82 -199 98 309 178 -111 150
7343 150 121 118 194 287 -75 182 -86 -30 -368 -4 98 -147 42 -99 8 24 -248 -34 -101 115 162 -12 3
7366 3 46 -80 -4 -86 8 59 -143 371 108 190 107 -120 -192 -187 37 -253 60 -77 -37 -33 198 153 -94 -70 -76 -81 81
7393 81 135 -314 -43 108 131 -307 294 -105 -16 229 192 -273 -137 -161 -122 71 38 59 344 57 265 12 96
$$ packed form
7232A13j14L9l04mN26j41j42L10l27J92k76P6L3j68J47J68q0K58n18K38l33K81
7254b6n9KK81k50N6o7K50J27m46Q1J27o5J77n58K59K6p2J24k16J16k27M33L87
7277D60o41j14J10M4J54j68K97j99J22l19K13Q6j59K31j37r1n5J95j89L27j28
7298C9j13r3J07nk3N3k26K64J99k94P4J73r9J62l36l0O6P4j00N6L7j17K90j11
7322D7nK25k23J76m31K91k21O41o96O9K65j02j29K89j14k81K97K11j31k89K61
7343A50k9lP6R3l62K57k68N6l38L64J02k45J89j41J07J6k72K14o7K16M7j74J5
7366CM3j26P6q2R4N1k02N14k63Q2q3k27p2NK24k90L13j37M0MK31m5k47K4onJ62
7393H1N4m49K71J51K3m38O01l99Q9K45l7m65J36k4L9J93l3K1K85k87K08k53Q4
$$ plain form
7416 96 -272 89 67 73 -113 -420 -154 -291 12 46 -81 46 179 3 40 -11 -131 75 -75 162 -71 109
7438 109 -84 256 8 66 28 175 -80 -26 -5 77 -260 1 40 -28 -21 -190 -6 -133 -326 -207 208 116 -54
7461 -54 254 -89 -362 341 93 134 -194 -296 -63 -77 -27 140 62 -289 -141 -72 -149 157 84 -204 -14 -106 -192
7484 -192 25 -300 392 -84 51 99 -218 193 262 -371 78 204 -210 258 140 35 78 106 122 52 205 -78
7506 -78 178 -1 -217 -76 -198 -186 41 -1 274 59 60 -283 161 -55 43 -32 65 -14 -60 167 -18 58 -84 -170
7530 -170 -393 75 179 292 101 398 -114 -64 79 -59 -36 120 -39 104 -180 -8 91 -2 3 -162 -53 140
7552 140 -44 67 -95 -121 51 243 -22 -170 -67 72 79 96 -207 -194 305 -76 190 157 16 -107 -7 152
7574 152 1 61 -65 -41 96 8 -222 604 346 104 -48 182 -307 307 -128 -59 -61 134 159 17 43 16 188
$$ packed form
7416I6l68L61k2Oj86l07K66j37L03L4j27J27J33j76L7n1j20K06j50K37k33J80
7438A09j93L40k48N8l8J47k55N4K1Q2l37K61L9o8Pj69J84j27j93J19M15r2j70
7461e4L08l43k73P03k48M1l28j02K33j4N0J67p8l51J48O9p7L06p3k88J90r2q6
7484a92K17l25O92m76J35M8l17M11O9o33M49J26m14M68j18j05M3K8J6p0J53k83
7506g8K56j79k16J41j22J2K27m2K75k15Jl43M44k16R8p5R7p9m6K27j85P6j42q6
7530a70k23M68J04J13j91K97n12N0J43j38K3J56j59J43k84J72R9r3Nj65J09J93
7552A40j84J11j62k6J72J92k65j48J03J39PJ7l03J3M99l81K66l3j41j23J00J59
7574A52j51O0j26K4J37q8k30Q26k58k42j52K30m89O14m35O9kJ95K5j42K6k7J72
$$ plain form
7597 188 -42 -3 96 37 163 -73 256 312 61 -75 249 -52 287 285 -147 240 -36 -154 -241 -136 -95 -14 -253
7620 -253 -6 209 162 104 -94 314 -247 -136 115 72 19 27 -153 99 -32 167 23 -43 218 124 -139 -26 161
7643 161 -18 218 -37 208 97 68 -145 194 306 289 -320 92 138 -190 -56 -106 24 -293 292 40 -9 -268
7665 -268 -152 -85 87 85 31 88 142 -299 -102 -177 -174 161 69 191 99 -86 -148 -190 88 -97 -318 550 -113 -262
7689 -262 -18 -350 342 149 47 -225 -286 74 174 123 91 174 196 -114 208 184 -215 -126 20 -364 32 266
7711 266 110 -92 -146 -196 64 118 61 -241 -16 -92 -80 307 -236 140 107 -219 -227 -71 -252 30 13 -76 -106 157
7735 157 -135 108 -61 32 -219 118 -61 -298 278 -4 -185 -19 -114 -147 353 222 323 112 -56 47 279
7756 279 -161 82 181 -193 80 -46 157 -113 -240 103 -29 -14 88 132 -62 332 124 87 142 -174 191 -22
$$ packed form
7597A88k30L9R9n9J26k36L29N6k51j36L24l01L39km32L87k76j18q7J05M1Q1k39
7620b53K47K15m7n8j98M08n61J11K51m3n3Qj80K52j31J99j44o6K61r4k63J13J87
7643A61j79K36k55K45j11k9k13L39J12j7o09M12M6l28J34n0J30l17N85k52m9k59
7665b68J16O7J72kn4N7N4m41J97p5LL35r2J22r2j85o2m2K78j85k21Q68o63j49
7689b62K44l32O92j93j02k72o1L60J00n1l2Q3K2l10L22k4l99Q9J46l84L96K34
7711B66j56k02n4n0K60N4n7l02K25p6J2L87n43L76l3l26qJ56j81K82j7q9l0K63
7735A57k92K43j69R3k51L37j79k37N76k82j81J66r5l3N00j31J01k11j68J03K32
7756B79m40K43R9l74K73j26K03k70j27L43j32J5J02M4j94L94k08l7N5l16L65k13
$$ plain form
7778 -22 -202 -294 96 -113 -153 147 -140 -80 95 80 -161 134 372 -312 -77 -136 252 -323 -48 -365 115 -25
7800 -25 -447 -28 156 -205 -146 75 -27 -109 -292 63 -281 -119 -75 249 44 86 93 231 -36 -207 -262 89 -115
7823 -115 19 199 62 19 345 -372 -222 -48 4 10 41 22 107 -28 -82 -72 135 7 179 -137 138 21 204
7846 204 242 -15 83 -43 120 -261 -95 309 126 128 -5 -134 33 39 186 45 123 -20 3 -100 125 214 47
7869 47 315 69 125 -40 228 -159 -258 212 -101 -98 30 -300 -24 217 23 -167 -258 -176 90 52 -224 36 -89
7892 -89 100 31 -146 -197 111 -136 -5 -5 -124 -105 -2 130 24 150 15 -124 108 84 -9 -82 -103 -165 -143 82
7916 82 163 31 -220 49 17 112 207 211 130 113 7 149 -50 -88 118 5 -95 312 -81 40 225 21 139
7939 139 -42 36 100 70 -58 -242 181 168 -59 -126 -44 -9 50 76 -74 196 53 -317 311 -51 -429 237 -261
$$ packed form
7778b2j80r2L90k09m0L00k87O0J75j5k41K95K38o84K35n9L88n75K75l17M80j40
7800b5m22M19J84l61N9K21j02q2j83L55l44J62M4L24k05M2PJ38k67j71n5L51k04
7823a15J34J80j37m3L26p17J50J74N2OL1j9Q5j35n4J0K07j28J72l16K75j17J83
7846B04L8k57R8j26J63l81J66M04j83Kj33j29J67OJ47j41P8j43K3j03K25Q9j67
7869D7K68k46N6j65K68l87r9M70l13LJ28l30K76K41j94j90r1Q2K66l8k76K60j25
7892h9J89o9j77n1L08k47J31%j19J9J03J32j06J26j35j39K32k4r3p3k1o2K2K25
7916H2Q1j32k51K69l2R5R5Mq1j7j06J42j99l8K06j13j00M07l93J21J85k04J18
7939A39j81P8O4l0j28j84M23j3k27o7Q2L5N9K6j50K70j43l70O28l62l78O66m98
$$ plain form
7962 -261 103 53 -107 -22 219 4 -46 -86 -147 -99 184 -187 -72 -223 143 170 -43 -226 -92 -141 52 -166 -166
7985 -166 -137 -139 139 25 -67 259 -398 177 93 132 207 -118 192 240 -197 -117 -148 38 -174 121 52 -85 138 -621
8009 -621 -145 -111 -199 146 -49 64 -124 200 147 12 199 -190 133 335 -288 118 269 -144 -64 84 -81
8030 -81 306 37 -96 41 -156 26 -141 -30 -254 -150 120 -121 221 -90 72 -40 -286 99 75 -166 -248
8051 -248 -112 -131 -181 -36 -217 123 20 -67 11 132 53 -209 32 -238 16 -240 165 186 -172 90 134 127 -258
8074 -258 -87 187 -127 -104 -21 -242 -171 -56 -108 -84 -204 -200 -168 32 307 -178 -274 218 -109 378 80 244 -185
8097 -185 48 40 119 253 66 66 -51 -398 -120 -100 399 -175 -18 -26 -550 -59 -201 69 -92 105 312 111 243
8120 243 46 18 -32 -193 -109 -231 64 80 -184 -101 -37 40 -134 36 93 162 -41 -53 -87 43 50 -94 118 -186
$$ packed form
7962b61L64n0j60Q5K41k15n0m0o1M8K83l71J15j51L66K7k13j83J34m9J93k18%
7985a66K9kK78j14r2L26o57N75q4L9P5l25L10M8m37Q0l1J86k12K95o9j37K23p59
8009f21M76L4q8L45j95J13j88L24n3j35J87l89L23K02o23M06J51m13Q0J48j65
8030h1L87k69j33J37j97J82j67J11k24J04K70k41L42l11J62j12k46L85k4k41q2
8051b48J36j9n0J45j81L40j03q7P8J21p9k62K41k70K54k56M05K1l58K62M4pl85
8074b58J71K74l14K3Q3k21P1J15n2K4j20ML2K00K75m85r6M92l27M87k98J64m29
8097a85K33qP9J34j87%j17l47K78K0M99n74J57qn24M91j42K70j61J97K07k01J32
8120B43j97k8n0j61Q4j22K95J6k64Q3O4P7j74J70N7O9k03j2l4J30Pj44K12l04
$$ plain form
8144 -186 65 -7 69 27 85 -113 49 -245 -30 26 -209 -107 216 56 211 -175 86 23 33 -133 -67 -30 -104
8167 -104 262 -50 -66 98 164 139 -109 -43 22 -22 -279 180 -11 -5 133 -52 -251 -4 -31 -102 -40 155 29 -413
$$ packed form
8144a86K51p2P6m2N8j98J62k94K15N6k35J02L23j60J55l86K61o3J0j66O6L7p4
8167a04L66l12j6J64O6k5k48O6O5m4k57M59j91OJ38j85j99K47k7p1O2J95j26m42
8191d13
$$ Imaginary data points
##PAGE= N=2
##DATA TABLE= (X++(I..I)), XYDATA
$$ plain form
0 0 0 0 0 0 0 0 0 -8 8 -8 8 -8 16 -16 24 -24 32 -34 40 -48 57 -66 80 -89 104 -118 135 -153 174 -197 221
31 221 -247 278 -311 346 -384 429 -477 527 -585 649 -717 795 -879 975 -1081 1202 -1338
48 -1338 1497 -1683 1901 -2165 2488 -2898 3439 -4183 5279 -7055 10412 -18985 85032 137398
62 137398 -76196 -60123 -25955 -12188 73963 79086 -67234 -89657 -14702 41910 69683 25933
74 25933 -64574 -52064 6631 47128 61580 -3310 -83195 -40074 26739 45443 46415 -19150 -88970
87 -88970 -15610 68600 43721 5709 -32710 -72244 -5709 78361 38664 -33051 -52664 -34177
99 -34177 34275 71839 8434 -45848 -37012 -12452 37410 57396 -14859 -62280 -20974 17066
111 17066 36741 36770 -20505 -54392 -8877 31293 35396 17026 -37826 -54911 8785 47052 23272
$$ packed form
0@%%%%%%%qJ6j6J6j6K4l2M0m8N6o6P4q8J05j23J46j69J93k22K53k88L27l71M18
31B21m68N25n89O57p30Q13r06J004j112J234j366J512j674J854k056K283k540
48a338K835l180L584m066M653n386O337p622R462j2334J7467k9397J04017N2366
62A37398k13594J6073L4168J3767Q6151N123j46320k2423P4955N6612K7773m3750
74B5933r0507J2510N8695M0497J4452o4890p9885M3121O6813J8704R72o5565o9820
87h8970P3360Q4210k4879l8012l8419l9534O6535Q4070l9697p1715j9613J8487
99c4177O8452L7564o3405n4282Q836K4560M9862J9986p2255m7421M1306L8040
111A7066J9675K9n7275l3887M5515M0170M103j8370n4852j7085O3696L8267k3780
$$ plain form
124 23272 -6472 -37494 -35487 25388 51964 9640 -28755 -37065 -13444 36016 39599 -11024 -35861
137 -35861 -22457 5770 37837 27058 -21982 -35941 -9961 17221 33941 12447 -33567 -30689
149 -30689 6484 23236 24373 3358 -35837 -26712 20641 31631 9412 -13698 -31933 -13928
161 -13928 28078 28828 -2789 -23115 -24765 1763 33187 19170 -16430 -24085 -11433 10863 28747
174 28747 9425 -23397 -21840 -292 17849 23031 -534 -27089 -16079 10079 20155 14404 -8797
187 -8797 -27261 -9198 18894 19517 3366 -15997 -22354 1677 23807 13986 -6836 -17996 -15145
200 -15145 8865 24550 6579 -15838 -16434 -4202 13738 20259 -1075 -19125 -11658 3913 15842
213 15842 14083 -7914 -20658 -6001 10764 15031 6660 -12462 -18106 778 15959 11886 -1300
$$ packed form
124B3272k9744l1022K007O0875K6576m2324l8395q310K3621M9460L583n0623k4837
137c5861J3404K8227L2067j0779m9040j3959K5980K7182J6720k1494m6014K878
149c0689L7173J6752J137k1015l9195R125M7353J0990k2219k3110j8235J8005
161a3928M2006P50l1617k0326j650K6528L1424j4017l5600p655J2652K2296J7884
174B8747j9322l2822J557K1548J8141N182k3565k6555J1010K6158J0076n751k3201
187h797j8464J8063K8092O23j6151j9363o357K4031K2130r821k0822j1160K851
200a5145K4010J5685j7971k2417n96J2232J7940O521k1334j8050P467J5571J1929
213A5842j759k1997j2744J4657J6765M267q371j9122n644J8884J5181m073j3186
$$ plain form
226 -1300 -15593 -13863 7407 17430 5884 -8256 -14581 -6524 12102 16423 -578 -12949 -11326
239 -11326 221 14096 11545 -6488 -14646 -6353 6325 13877 6907 -10985 -13463 -283 10651
252 10651 11326 108 -13322 -10760 5135 12365 6786 -4883 -13313 -5836 9811 11861 1268 -9194
266 -9194 -10945 -989 11936 9117 -3784 -10566 -6737 4264 12299 5424 -8185 -10219 -1974 7519
280 7519 10392 454 -10403 -8329 2611 9737 7306 -3477 -10852 -4901 6504 9181 2736 -6836
294 -6836 -10135 -420 9140 7380 -1550 -8463 -7307 3530 9870 4456 -5369 -8527 -3155 5960 9175
309 9175 932 -7496 -6762 958 7769 6660 -2658 -8782 -4548 4469 7644 3029 -5057 -8063 -1294
324 -1294 6854 6997 45 -7352 -6272 2113 7424 4217 -3421 -7189 -3491 5115 7462 1377 -5720
$$ packed form
226a300j4293J730K1270J0023j1546j4140o325Q057J8626M321j7001j2371J623
239a1326J1547J3875k551j8033q158Q293J2678P552o970j7892k478J3180J0934
252A0651O75j1218j3430K562J5895P230n579j1669q430P477J5647K050j0593j0462
266i194j751R956J2925k819j2901o782L829J1001Q035o875j3609k034Q245R493
280G519K873r938j0857K074J0940P126k431j0783p375N951J1405K677o445r572
294f836l299R715R560j760q930o913J156J0837O340n414r825l158N372R115L215
309I175q243q428P34P720O811j109r318o124M234R017L175m615q086l006O769
324a294Q148J43o952p397J080Q385N311l207p638l768L698Q606K347o085p097
$$ plain form
339 -5720 -6586 -421 6523 5906 -1886 -6880 -4447 2685 7170 3459 -3975 -6821 -1633 5004 6046 614
355 614 -5839 -5384 1210 5859 4460 -2090 -6517 -3141 3650 6081 1572 -4085 -5713 -681 5131 4863
371 4863 -500 -5323 -4330 1779 5794 2763 -2838 -5725 -1913 3353 5054 662 -4538 -4363 326 4757
387 4757 4176 -1473 -4863 -3043 2240 5137 2404 -3085 -4758 -783 3911 4424 -51 -4317 -3685 1082
403 1082 4947 3152 -2008 -4521 -2295 2547 4555 1410 -3470 -3949 228 3986 3335 -546 -4083 -3164
419 -3164 1429 4330 1953 -2558 -3651 -1519 2672 3537 689 -3455 -3145 351 3783 2847 -1026 -3814
435 -3814 -2158 2001 3903 1444 -3115 -3616 -528 2969 2866 -322 -3679 -2892 1161 3196 1868 -1682
451 -1682 -3344 -1464 2279 3208 357 -2643 -2993 214 3367 2597 -791 -3045 -2018 1129 3242 1711
$$ packed form
339e720q66O165O944o17p792m994K433P132M485l711p434k846N188O637J042n432
355F14o453M55O594M649j399o550m427L376O791K431m509n657j628N032N812k68
371D863n363m823R93O109M015l031n601k887L812N266J701m392n200J75M689M431
387D757n81n649l390J820N283K897k733n489j673L975M694N13m475m266O32M767
403A082L865j795n160k513K226M842K008l145m880m79M177L758o51l881l537R19
419c164M593K901k377m511j093K132M191Q65k848m144L10L496L432r36l873k788
435c814J656M159J902k459m559n01L088L497j03l188l357P87M053K035j328l550
451a682j662J880L743R29k851l000l50L207L153p70l388k254J027L147K113j531
$$ plain form
467 1711 -1894 -2726 -703 2248 3030 28 -2883 -2453 957 2845 1557 -1038 -3028 -1500 1625 2333
483 2333 976 -1861 -2793 -300 2516 2178 -712 -2558 -1970 1051 2579 1563 -1367 -2162 -838 1647
499 1647 2295 3 -2202 -2017 286 2623 1891 -900 -2343 -1122 1127 2263 988 -1954 -2264 -307
515 -307 2035 1856 -239 -2183 -1757 777 2336 1085 -1179 -2153 -1147 1328 2023 426 -1715 -1615 -172
532 -172 1888 1702 -445 -1755 -1206 653 1803 823 -1416 -1808 -264 1531 1573 353 -1695 -1286 338
549 338 1567 992 -720 -1802 -930 933 1616 431 -850 -1846 -180 1462 1373 -178 -1363 -751 610
566 610 1561 1019 -804 -1414 -279 1074 1691 306 -1653 -1238 175 1344 1358 -470 -1391 -812 875 1505
584 1505 753 -994 -1519 -483 1184 1031 -178 -1233 -1097 483 1551 795 -1027 -1251 -824 768 1287
$$ packed form
467A711l605q32K023K951P82l002k911M30L410J888j288k595j990J528L125P08
483B333j357k837r32K493K816l38k890j846N88L021J528j016k930p95J324K485
499A647O48k292k205J85K303K337p32k791j443J221K249J136j275k942l10J957
515c07K342j79k095j944M26K534J559j251k264r74J006K475O95j597k141J00J443
532a72K060j86k147j310N49J859J150r80k239l92J544J795M2j220k048M09J624
549C38J229n75j712j082Q72J863O83j185j281r96J666J642q9j551j185O12J361
566F10R51n42j823o10J135J353O17j385j959M15J413J169J4j828r21N79J687O30
584A505p52j747n25J036J667j53j209j055J36J580J068p56j822k24M27J592N19
$$ plain form
601 1287 252 -852 -1044 -36 1301 1030 -212 -1540 -472 397 1058 842 -664 -1284 113 987 813
618 813 91 -1173 -1031 112 1089 709 -448 -797 -653 400 965 146 -777 -1080 7 906 812 -177 -953
637 -953 -881 223 887 726 -595 -1010 -241 524 984 449 -764 -897 -149 706 594 -14 -725 -935 327
656 327 1112 341 -619 -1038 -691 938 859 -3 -761 -968 -106 936 958 -536 -864 -391 605 734 522 -535
676 -535 -831 45 765 1197 140 -570 -616 318 472 779 -355 -999 -432 482 794 289 -778 -690 168 605
696 605 572 -26 -677 -659 305 990 -87 -759 -715 -138 642 681 90 -587 -468 -1 596 775 -320 -896 -417
717 -417 461 797 290 -679 -980 -155 500 639 -53 -583 -787 289 987 313 -505 -587 -408 465 780 178
737 178 -739 -472 25 252 491 141 -471 -363 310 502 312 -539 -603 -117 308 402 -194 -809 -580 154 713
$$ packed form
601A287j035j104j92J008J337k71j242j328J068Q69O61k16j506o20J397Q74j74
618H13p22j264J42J143R77l80j157l49J44J053N65q19r23l03J087Q99r4r89p76
637i53P2J104O64j61j321m15P69P65M60n35j213j33P48Q55j12o08p11k10J262
656C27P85p71r60m19L47J629p9q62p58k07Q62J042K2j494l28M73R96J29k12j057
676e35k96Q76P20M32j057p10m6R34J54L07j134o44N67R14L12n05j067Q8Q58M37
696F05l3n98o51J8R64O85j077o72M4N77P80L9n91o77J19M67N97J79j095n76M79
717d17Q78L36n07r69l01Q25O55J39o92n30k04J076O98o74q18q2J79Q73L15o02
737A78r17K67M97K27K39l50o12J08O73J92j90q51o4M86M25R4n96o15K29P34N59
$$ plain form
758 713 222 -254 -523 -133 571 377 123 -214 -437 -28 425 584 -137 -737 -469 -54 439 254 -235 -584
778 -584 15 408 587 231 -730 -634 -71 618 433 -45 -909 -274 183 703 437 59 -698 -124 827 761 80
799 80 -435 -460 123 467 260 -281 -497 -191 346 261 -12 -294 -381 86 270 325 -26 -396 -387 121 397 311 -302
822 -302 -545 -90 476 522 196 -523 -456 296 610 338 -245 -553 -330 269 560 243 -189 -609 -181 243 497
843 497 -13 -347 -445 167 305 133 58 -452 -4 169 352 307 -565 -148 290 368 586 26 -412 -464 254 344
865 344 120 -177 -480 -71 551 635 18 -198 -358 107 390 4 19 -496 -199 389 546 90 -281 -711 77
886 77 344 393 234 -273 -220 211 327 203 -511 -270 -77 404 111 -45 -44 -435 -73 354 353 -417 -370 -270 190
909 190 222 290 -225 -197 29 444 369 170 -239 -268 62 545 608 -195 -448 -399 174 340 269 -441 -318 -188 676
$$ packed form
758G13m91m76k69L90P04j94k54l37k23M09M53J59p21o00K68M15M93j85m89l49
778e84N99L93J79l56r61R6N63O89j85m78q64O35M57N20k66l78p57N74R51o6o81
799H0n15k5N83L44k07n41k16L06N37q5k73k82q7M67J84N5l51l70RN08K76q6o13
822c02k43M55N66M6l26p19O7P52L14k72n83l08K23N99K91l17m32m20M28M24K54
843D97n10l34r8O12J38j72p5n10M48J73J83m5q72M17M38P8K18n60m38n2P18R0
865C44k24k97l03M09O22Q4o17k16j60M65K83l86J5n15K97N88J57m56l71m30P88
886G7K67M9j59n07N3M31J16j24p14K41J93M81k93j56Jl91L62M27jp70M7J00M60
909A90L2O8n15K8K26M15p5j99m09k9L30M83O3q03k53M9N73J66p1p10J23J30Q64
$$ plain form
932 676 529 -47 -141 -298 86 180 48 -185 -641 -212 255 694 -126 -712 -412 68 424 377 -213 -587 -268
953 -268 -57 366 -200 -399 -530 58 266 784 209 -111 -190 518 142 222 -150 -307 -47 413 237 -79 -273
974 -273 -334 177 261 442 -250 -509 -455 -35 545 -109 -127 -304 68 443 562 22 -429 -355 212 521 225 -98
996 -98 -366 -4 68 150 -16 -240 -296 -175 115 177 -110 -396 -323 229 460 167 -333 -326 -298 170 465 18 -277
1019 -277 -141 114 -15 371 -240 -199 -187 372 324 340 -72 -64 267 106 141 153 -370 -126 81 240 -57 -543 -94
1042 -94 28 210 176 -341 -319 76 92 323 117 9 -335 -440 190 228 -204 -358 377 -77 134 179 -53 -29
1064 -29 237 250 218 -189 -155 -89 -74 159 230 -144 -42 -129 -238 224 282 -104 128 -142 -74 73 30 130 -331 -49
1088 -49 -88 62 -123 -130 -201 280 -82 -18 21 -235 83 -14 312 -17 -98 -160 -47 122 -109 -53 -290 -7 269 184
$$ packed form
932F76j47n76r4j57L84R4j32k33m56M29M67M39q20n86L00M80L56m7n90l74L19
953b68K11M23n66j99j31N88K08N18n75l20p9P08l76Q0l72j57K60M60j76l16j94
974b73o1N11Q4J81o92k59N4M20N80o54j8j77L72L75J19n40m51P4N67L09k96l23
996i8k68L62P2Q2j66k24n6J21K90O2k87k86P3N52K31k93n00PK8M68K95m47k95
1019b77J36K55j29L86o11M1J2N59m8J6m12QL31j61L5J2n23K44K07J59k97m86M49
1042i4J22J82l4n17K2L95J6K31k06j08l44j05O30L8m32j54P35m54K11M5k32K4
1064b9K66J3l2m07L4O6J5K33P1l74J02q7j09M62N8l86K32k70O8J47m3J00m61K82
1088d9l9J50j85pp1M81l62O4L9k56L18r7L26l29q1o2J13J69k31N6k37K83K76q5
$$ plain form
1112 184 133 31 152 -341 181 -38 151 -253 -11 120 222 -181 -121 -281 -190 -80 486 -131 -200 -62 -118 150
1134 150 198 79 -290 -90 339 327 -89 -240 -25 131 -111 189 35 49 -264 344 401 126 23 -303 43
1155 43 66 496 22 270 -266 -258 26 -112 44 0 -15 41 349 -111 151 -190 -19 172 -28 7 -218 -159 -139
1178 -139 361 185 -139 -71 -27 218 74 20 327 -382 101 303 285 -157 -102 -56 -16 335 225 -267 -383 46
1200 46 35 225 96 22 -43 -4 194 143 -123 -383 3 326 182 -181 -46 -579 263 183 281 25 -291 26 18
1223 18 202 45 -189 -158 -216 170 145 -85 180 -99 -74 160 128 -290 239 150 44 -230 83 -53 -142 -8 114
1246 114 -27 -43 -256 41 46 169 -119 335 -143 -248 98 -6 374 -268 -124 -285 186 119 -21 -267 -348 -137
1268 -137 78 102 -10 -426 -27 200 10 57 -228 -263 -24 501 -18 -68 -352 -30 -217 225 24 -514 -248
$$ packed form
1112A84n1j02J21m93N22k19J89m04K42J31J02m03O0j60R1J10N66o17o9J38n6K68
1134A50M8j19l69K00M29j2m16j51K15J56k42L00j54J4l13O08N7k75j03l26L46
1155D3K3M30m74K48n36QK84j38J56m4j5N6L08m60K62l41J71J91k00L5k25N9K0
1178a39N00j76l24O8M4K45j44n4L07p09M83K02j8m42N5M6M0L51j10m92j16M29
1200D6j1J90j29p4o5L9J98n1k66k60L86L23j44l63J35n33Q42q0R8k56l16L17q
1223A8J84j57k34L1n8L86k5k30K65k79K5K34l2m18N29q9j06k74L13j36q9J34J22
1246A14j41j6k13K97NJ23k88M54m78j05L46j04L80o42J44j61M71o7j40k46q1K11
1268a37K15K4j12m16L99K27j90M7k85l5K39N25n19n0k84L22j87M42k01n38K66
$$ plain form
1289 -248 215 412 46 100 103 -62 221 239 238 66 -455 -47 84 409 168 -270 -122 -6 368 -21 -189 -48
1311 -48 -52 -253 79 104 146 -31 -83 289 14 -149 -152 -67 -118 247 293 54 -351 57 129 -76 -137 -116 94 -406 -239
1336 -239 -25 -86 -67 -12 76 23 98 -154 -151 -42 23 158 57 -193 -107 175 83 52 92 -69 109 -146 -134 70 -50
1361 -50 85 -256 26 143 -137 -44 65 299 34 -54 -326 83 -147 -101 376 -10 -269 7 -203 -55 241
1382 241 158 55 -94 -8 -54 -139 87 -398 -409 15 138 293 -66 -156 -165 264 141 -67 -270 18 125 242 78
1405 78 172 94 132 28 -6 132 -342 -80 -39 70 74 -102 -66 57 122 116 -98 -237 9 236 -127 182 253 -134
1429 -134 100 43 377 169 -108 -31 -87 48 -148 205 153 -214 -61 -14 3 -141 -131 74 117 94 31 -290 33
1452 33 -43 50 9 -85 -139 -61 221 -159 23 -120 31 -180 -262 369 -44 -169 75 -149 55 342 14 -162 322
$$ packed form
1289b48M63J97l66N4Lj65K83J8jj72n21M08J31L25k41m38J48J16L74l89j68J41
1311d8mk01L32K5M2j77n2L72k75j63lQ5n1L65M6k39m05M08P2k05o1K1K10n00J67
1336b39K14o1J9N5Q8n3P5k52LJ09O5J35j01k50Q6K82r2l1M0j61J78k55J2K04j20
1361e0J35l41K82J17k80R3J09K34k65q8k72M09k30M6M77l86k59K76k10J48K96
1382B41q3j03j49Q6m6q5K26m85j1M24J23J55l59r0rM29j23k08k03K88J07J17j64
1405G8R4p8L8j04l4J38m74K62M1J09Mj76L6J23O5ok14j39K46K27l63L09P1l87
1429a34K34n7L34k08k77P7n6J35j96L53n2l67J53M7J7j44J0K05M3k3o3l21L23
1452C3p6R3m1r4n4P8K82l80J82j43J51k11q2O31m13j25K44k24K04K87l28j76M84
$$ plain form
1475 322 -102 -165 -131 121 -122 182 350 140 62 -39 -81 -298 254 -18 -85 71 -25 112 -103 -65 66 -16 119
1498 119 -29 168 5 -260 24 233 73 61 -32 -86 -51 154 -337 -24 167 81 332 -95 134 -113 -303 154
1520 154 -84 -50 -116 -154 -12 87 -104 -187 -286 -18 -90 -25 -87 -153 -225 -75 -64 117 -57 115 394 -422 64 114
1544 114 -148 -68 -123 -152 126 -217 -153 2 -76 -149 -195 347 -7 335 -46 -140 337 -131 -251 -44 193 -51 57
1567 57 -37 142 -542 36 212 19 -15 -88 4 -218 255 -209 -129 -71 118 89 369 -53 -114 -50 225 -17 -184
1590 -184 -114 -37 -179 45 -23 -93 -36 168 100 -27 183 -125 312 -15 -39 99 83 196 170 250 139 44 294 59
1614 59 62 -208 35 138 -233 154 -53 227 225 -44 94 71 -411 -292 127 26 -229 154 111 13 329 252 -181
1637 -181 134 89 229 47 139 -225 -11 257 133 -31 -99 -140 3 103 60 -123 45 164 19 55 97 -198
$$ packed form
1475C22m24o3L4K52k43L04J68k10p8j01m2k17N52k72o7J56r6J37k15L8J31q2J35
1498A19j48J97j63k65K84K09j60j2r3n4L5K05m91L13J91q6K51m27K29k47j90M57
1520A54k38L4o6l8J42R9j91q3r9K68p2O5o2o6p2J50J1J81j74J72K79q16M86N0
1544A14k62Q0n5k9K78l43O4J55p8p3m6N42l54L42l81r4M77m68j20K07K37k44J08
1567E7r4J79o84N78J76j93l4p3R2k22M73m64Q0N8J89k9K80m22o1O4K75k42j67
1590a84P0P7j42K24o8p0N7K04o8j27K10l08M37l27k4J38j6J13k6Q0j11r5K50k35
1614E9Lk70K43J03l71L87k07K80kk69J38k3m82J19M19j01k55L83m3r8L16p7m33
1637a81L15m5J40j82R2l64K14K68j24j64o8m1J43J00m3j83J68J19j45L6M2k95
$$ plain form
1659 -198 232 3 -46 47 195 223 225 94 68 200 32 -82 3 -21 97 324 -235 152 -180 -1 -141 -315 -7
1682 -7 -70 247 13 143 -40 75 21 -129 239 -44 32 -8 43 -7 -400 37 -104 -203 -58 -19 -34 -214 136 -146
1706 -146 148 -146 -277 67 78 -82 -342 -185 -327 -103 -28 -129 222 -12 -51 9 -55 111 189 101 122 128 -103
1729 -103 -111 -362 -59 18 94 -247 70 228 -105 -190 -207 -229 177 -71 -141 -334 -120 111 -212 -73 28 291 -47
1752 -47 23 198 -262 105 -219 -204 136 -13 286 -131 -406 145 280 5 486 -205 72 -135 24 -105 -21
1773 -21 -100 369 50 63 58 82 49 -138 -66 -153 -59 11 108 -61 4 8 353 -115 43 22 -3 -239 -68 -60 166 142 62
1800 62 57 -49 91 31 87 121 303 66 -6 188 306 -266 173 341 -77 149 -150 -47 9 102 112 87 -151 -52
1824 -52 69 26 58 -96 -113 209 318 -95 -89 -164 -72 -116 262 -49 -444 150 -113 129 -70 203 181 -248 -179 -98
$$ packed form
1659a98M30k29m9R3J48K8Kj31k6J32j68j14Q5k4J18K27n59L87l32J79j40j74L08
1682go3L17k34J30j83J15n4j50L68k83P6m0N1n0l93M37j41r9J45L9j5j80L50k82
1706a46K94k94j31L44J1j60k60J57j42K24P5j01L51k34l9O0o4J66P8q8K1Ok31
1729a03qk51L03P7P6l41L17J58l33q5j7k2M06k48p0j93K14K31l23J39J01K63l38
1752d7P0J75m60L67l24J5L40j49K99m17k75N51J35k75M81o91K77k07J59j29Q4
1773b1p9M69l19J3nK4l3j87P2q7R4P0R7j69O5ML45m68J58k1k5k36J71QK26k4q0
1800F2nj06J40o0N6L4J82k37p2J94J18n72M39J68m18K26k99J03N6R3J0k5k38R9
1824e2J21m3L2j54j7L22J09m13Op5R2m4L78l11l95N94k63K42j99K73k2m29O9Q1
$$ plain form
1848 -98 -14 -46 125 28 73 206 -15 -165 26 -71 32 -28 41 -34 69 -160 2 174 24 15 140 36 331 -81
1872 -81 0 61 -13 -71 -73 -120 -289 -186 16 253 -205 345 -8 265 10 -183 -4 117 -138 223 98 184 -37
1895 -37 80 93 76 197 -100 100 -132 400 9 -197 -256 55 56 182 348 -70 104 353 -109 -148 217 314 138
1918 138 181 -194 -38 -58 65 208 269 300 -83 -143 -46 -220 -94 -121 205 -200 -149 229 110 61 -36 4 -247 89
1942 89 -44 163 -258 -3 217 153 110 -283 -184 65 0 114 9 65 -53 -175 230 -40 -86 -213 163 -67
1964 -67 -51 18 246 98 -149 -281 -251 113 -139 -307 -32 -279 -186 -256 -137 -18 21 5 -125 -200 -219 -182 79 -13
1988 -13 177 16 97 214 222 97 178 41 62 -65 349 -91 132 -78 -135 203 -19 -187 -30 -5 -68 230 -102
2011 -102 133 -92 98 5 -24 45 -126 104 263 11 109 48 -227 -75 -146 -72 -218 140 -47 -22 -54 156 -189
$$ packed form
1848i8Q4l2J71r7M5J33k21j50J91r7J03o0O9p5J03k29J62J72j50rJ25j04K95m12
1872h1Q1O1p4n8km7j69J03K02K37m58N50l53K73k55j93J79J21k55L61j25Q6k21
1895c7J17J3j7J21k97K00k32N32l91k06n9L11JJ26J66m18J74K49m62l9L65R7j76
1918A38M3l75J56k0J23J43O1L1l83o0R7j74J26k7L26m05N1L78j19m9r7M0k51L36
1942H9j33K07m21K55K20o4m3l93R9K49o5J14j05N6j18j22M05k70m6j27L76k30
1964f7J6O9K28j48k47j32L0L64k52j68K75k47R3p0J19J19L9j6j30p5j9L7K61r2
1988a3J90j61Q1J17Qj25Q1j37K1j27M14m40K23k10n7L38k22j68J57K5o3K98l32
2011a02K35k25J90r3k9O9j71K30J59k52R8o1k75J52p1P4j46L58j87K5l2K10l45
$$ plain form
2034 -189 -37 8 -63 12 100 3 -10 291 202 -146 84 63 -309 -171 34 -332 407 44 63 108 30 115 117 -35 -26
2059 -26 47 -91 150 42 -95 56 309 -104 80 5 270 -130 17 97 172 -517 -130 146 -172 -168 86 219
2081 219 -173 29 229 -33 66 73 -35 267 22 177 126 270 -98 151 86 12 154 159 -99 -41 104 143 -12
2104 -12 112 266 -65 -148 40 16 -19 -29 -53 93 124 252 -52 136 -48 35 -46 -32 58 186 187 -60 -266 14
2128 14 64 95 -52 78 157 22 -4 95 123 -149 117 200 -219 165 -21 254 16 155 189 -69 150 79 165 149
2152 149 -290 105 -99 -52 15 4 260 26 135 4 54 -258 79 121 125 -94 -51 -358 -185 126 -86 95 -210
2175 -210 -200 -18 -164 195 -37 34 -13 -79 66 -116 -300 -89 -14 228 -226 481 -124 226 165 76 -9 249 -183
2198 -183 190 33 80 -46 -394 0 -126 -183 19 120 -187 368 350 62 57 -268 31 -45 -48 -220 -105 -2 508
$$ packed form
2034a89J52M5p1P5Q8r7j3L01q9l48K30k1l72J38K05l66P39l63J9M5p8Q5Kj52R
2059b6P3j38K41j08j37J51K53m13J84p5K65m00J47Q0P5o89L87K76l18MK54J33
2081B19l92K02K00k62R9Pj08L02k45J55n1J44l68K49o5p4J42Nk58N8J45L9j55
2104a2J24J54l31q3J88k4l5j0k4J46L1J28l04J88j84Q3q1J4R0J28Jk47k06K80
2128A4N0L1j47J30P9j35k6R9K8k72K66Q3m19L84j86K75k38J39L4k58K19p1Q6j6
2152A49m39L95k04M7O7j1K56k34J09j31N0l12L37M2Mk19M3l07J73L11k12J81l05
2175b10J0J82j46L59k32P1m7o6J45j82j84K11P5K42m54P07o05L50o1q9q5K58m32
2198a83L73j57M7j26l48L94j26n7K02J01l07N55j8k88nl25K99p6lj72J15J03N10
$$ plain form
2221 508 -164 -151 241 -187 -201 -101 -166 -8 -184 209 97 -468 -125 220 143 -67 -96 9 57 31 -139 9
2243 9 181 -370 -29 -11 -288 196 26 -37 -62 253 117 -173 143 44 -95 -326 274 230 126 -192 -124 81 220
2266 220 4 -297 -186 65 317 1 102 224 -87 -29 -125 163 -7 -116 -60 -124 -115 -81 -337 -293 162 -207 -150
2289 -150 -355 17 50 65 -75 -146 74 -103 -65 -32 121 -79 186 -238 1 -196 190 109 118 306 272 -44 -129
2312 -129 20 74 -81 -86 87 253 -224 110 106 154 -65 -74 -26 -18 -191 -47 -56 -199 201 -149 14 -416 186 102 34
2337 34 -182 -197 -159 34 26 -370 79 -83 340 50 392 -44 -215 313 -55 70 102 191 -80 162 129 212 161
2360 161 44 -2 86 -268 -127 -127 -290 -166 -48 -154 -203 -233 51 142 37 37 -49 -133 18 -377 87 -53 -125 -141
2384 -141 94 70 -157 0 -253 282 115 169 152 36 261 170 -236 77 276 410 78 -343 48 -143 70
$$ packed form
2221E08o72J3L92m28j4J00o5J58j76L93j12n65L43L45p7k10k9J05M8k6j70J48
2243IJ72n51L41J8k77M84j70o3k5L15j36k90L16r9j39k31O00m4j04l18O8K05J39
2266B20k16l01J11K51K52l16J01J22l11N8r6K88j70j09N6o4RL4k56M4M55l69N7
2289a50k05L72L3J5j40p1K20j77L8L3J53k00K65m24K39j97L86q1RJ88l4l16q5
2312a29J49N4j55nJ73J66m77L34mM8k19rM8Qj73J44rj43M00l50J63m30O02q4o8
2337C4k16j5L8J93ql96M49j62M23k90L42m36j71N28l68J25L2Q9k71K42l3Q3n1
2360A61j17m6Q8l54J41%j63J24J18j06m9l0K84R1j05%q6q4J51l95M64j40p2j6
2384a41K35k4k27J57k53N35j67N4j7j16K25r1m06L13J99J34l32m21L91j91K13
$$ plain form
2405 70 97 -56 18 175 -9 -48 -61 167 -286 -76 166 202 -92 115 84 -163 -67 -246 -159 -110 5 -105 -249
2428 -249 12 -111 -29 -30 -369 276 -172 110 152 -23 22 52 65 24 110 -3 -200 -191 -256 166 -77 -116 50 135 -105
2453 -105 -62 22 19 -93 26 -124 235 149 -77 -39 -213 -128 200 83 -249 189 203 -57 -303 -101 43 64 42
2476 42 -395 -16 -128 -16 154 41 155 -49 61 275 -175 -71 164 -137 -116 97 -25 305 158 -23 54
2497 54 97 -63 -260 195 100 -317 -118 35 -248 -231 401 -35 -182 395 0 -40 241 268 91 -141 22 -347
2519 -347 -150 -28 -44 -227 88 -56 -43 20 434 -56 -134 456 -43 -64 25 14 -239 45 34 -87 -104 128 -246
2542 -246 -63 -25 -165 63 166 -201 -103 -100 152 159 88 9 -12 -63 -10 -17 -120 -4 462 132 -406 42 -10 164 125
2567 125 -310 97 -227 55 162 35 147 -80 -85 -106 -39 -28 137 -142 -233 83 156 0 -49 -1 171 103 -133
$$ packed form
2405G0K7j53P4J57j84l9j3K28m53K10K42L6k94K07l1k47R6j79Q7M9J15j10j44
2428b49K61j23Q2jl39O45m48K82M2j75M5L0J3m1Q6j13j97Ro5M22k43l9J66Q5k40
2453a05M3Q4lj12J19j50L59q6k26L8j74Q5L28j17l32M38J4k60k46K02J44K1k2
2476D2m37L79j12J12J70j13J14k04J10K14m50J04K35l01K1K13j22L30j47j81P7
2497E4M3j60j97M55r5m17J99J53k83J7O32m36j47N77l95m0K81K7j77k32J63l69
2519c47J97J22j6j83L15j44J3O3M14m90p8N90m99k1Q9j1k53K84j1j21j7K32l74
2542b46J83L8j40K28J03l67R8LK52Pp1p9k1n1N3pj03J16M66l30n38M48n2J74l9
2567A25m35M07l24K82J07j27J12k27nk1O7J1J65k79r1L16P3j56m9M8J72o8k36
$$ plain form
2590 -133 -278 77 210 -182 7 -38 -371 200 72 -16 53 -61 30 -33 12 -127 -6 -199 -165 -12 156 -356
2612 -356 -94 38 50 -48 -268 115 -14 -358 192 -283 -144 -44 -5 35 323 232 77 -194 -71 -51 83 -221
2634 -221 82 -94 -329 -289 164 224 -106 -256 231 350 30 103 -100 -128 -347 -308 -75 282 66 87 -233 115
2656 115 77 301 73 -151 -11 205 -37 219 66 -213 76 197 -181 60 -51 215 136 24 103 -202 -91
2677 -91 252 -180 123 -101 219 -24 30 -40 66 21 262 298 427 298 -213 -106 -117 7 -62 38 97 -96 321
2700 321 -265 36 -174 371 20 37 54 -243 -646 -315 335 -87 70 159 -392 -144 -23 -26 -10 12 -109 110
2722 110 -114 80 -119 -139 -304 -454 -208 151 174 -194 -54 12 183 -291 -355 -81 105 55 70 13 -22 70 -180
2745 -180 130 163 -170 -46 -310 -2 -217 101 215 -253 117 137 57 -75 80 377 -288 -8 -22 89 -23
$$ packed form
2590a33j45L55J33l92J89m5l33N71j28q8O9j14R1o3M5j39J21j93L4J53J68n12
2612c56K62J32J2r8k20L83j29l44N50m75J39J00L9M0K88r1j55k71J23K0J34l04
2634b21L03j76k35M0M53O0l30j50M87J19l20P3k03k8k19L9K33L57k16K1l20L48
2656A15l8K24k28k24J40K16k42K56j53k79K89J21l78K41j11K66p9j12P9l05J11
2677i1L43m32L03k24L20k43N4p0J06m5K41L6J29j29n11J07j1J24o9J00N9j93M17
2700C21n86L01k10N45l51J7J7k97m03L31O50m22J57Q9n51K48J21lJ6K2j21K19
2722A10k24J94j99k0j65j50K46L59K3l68J40O6J71m74o4K74J86n0J5n7l5R2k50
2745a80L10L3l33J24k64L08k15L18J14m68L70K0q0j32J55K97o65K80j4J11j12
$$ plain form
2766 -23 65 49 184 233 45 234 -213 -160 100 -116 143 -340 147 125 8 -7 -25 -19 -199 155 -231 88 -31
2789 -31 -110 202 44 -165 124 -314 92 24 59 -8 -20 80 173 -10 -81 183 -37 188 186 -24 -90 249 59 51
2813 51 33 18 -52 5 100 221 213 -32 95 87 175 354 -235 207 -205 67 -88 31 -140 -9 122 -200 86 25
2837 25 157 117 -299 -217 -57 -66 155 310 -244 -240 -21 -43 -113 -67 42 -138 -44 -267 -6 -198 -121 128 121 -163 -203
2862 -203 152 88 163 116 -188 378 28 122 -77 104 -69 -248 -188 -128 -66 187 -6 68 -22 222 2 -77 228
2885 228 -161 2 188 -225 183 -392 319 -11 -159 66 -82 186 -175 -24 -84 110 -77 130 90 76 162
2906 162 67 -162 -137 5 298 33 311 -11 57 -97 215 100 -172 294 26 157 95 199 222 155 -137 -65
2928 -65 -19 63 -125 -438 251 -289 113 -7 -268 -47 76 -6 157 281 210 -274 80 145 -47 51 121 50 -151
$$ packed form
2766b3Q8j6J35M9j88J89m47N3K60k16K59m83M87k2j17j5j8Oj80L54l86L19j19
2789c1p9L12j58k09K89m38M06o8L5o7j2J00R3j83p1K64k20K25kk10o6L39j90q
2813E1j8j5p0N7R5J21qk45J27qQ8J79n89M42m12K72j55J19j71J31J31l22K86o1
2837B5J32m0m16Q2J60rK21J55n54MK19k2p0M6J09j80R4k23K61j92P7K49pk84m0
2862b03L55o4P5m7l04N66l50R4j99J81j73j79O0O0O2K53j93P4r0K44k20p9L05
2885B28l89J63J86m13M08n75P11l30j48K25j48K68l61J51o0J94j87K07m0j4Q6
2906A62r5k29K5J42K93k65K78l22O8j54L12j15k72M66k68J31o2J04K3o7k92P2
2928f5M6Q2j88l13O89n40M02j20k61K21J23q2J63J24p1m84L54O5j92R8P0p1k01
$$ plain form
2951 -151 -36 172 147 152 45 -117 218 -2 287 97 52 -340 -114 208 227 -44 194 218 -34 55 -18 -335 86
2974 86 -116 -114 236 -214 -190 -2 -60 50 35 212 174 -303 98 199 -121 268 124 434 75 4 124 -160 127
2997 127 -107 22 186 62 -49 0 -11 -182 209 139 15 -123 -12 -22 232 170 -43 -272 -47 -96 -107 129
3019 129 149 170 42 -133 193 -150 112 -319 153 426 -32 -90 -1 -178 -326 184 180 -197 236 140 228 365 57
3042 57 46 470 81 -16 -235 74 -44 178 106 -8 156 3 214 66 -32 154 -17 -161 -15 141 279 -50
3064 -50 116 99 229 136 410 291 -162 -5 -129 -32 -46 -67 -303 109 55 53 -37 232 57 -218 110 42 179 -440
3088 -440 102 -82 105 -28 166 -192 221 -135 -26 233 -154 256 35 45 198 -112 -238 35 95 -126 -129
3109 -129 74 -206 -63 -143 7 36 -281 -73 93 280 -38 -477 -118 -174 -36 -244 45 111 69 369 -189 222
$$ packed form
2951a51J15K08k5Nj07j62L35k20K89j90m5l92K26L22J9k71K38K4k52Q9p3l17M21
2974H6k02KL50m50K4J88n8J10j5J77l8m77M01J01l20L89j44L10l59p1J20k84K87
2997A27k34J29J64j24j11M9j1j71L91p0j24j38J11j0K54o2k13k29K25m9j1K36
3019A29K0K1j28j75L26l43K62m31M72K73m58n8Q9j77j48N10ml77M33r6Q8J37l08
3042E7j1M24l89r7k19L09j18K22p2j14J64j53K11j48r8J86j71j44J46J56J38l29
3064e0J66j7J30r3K74j19m53J57j24R7j4k1k36M12n4kr0K69j75k75L28o8J37o19
3088d40N42j84J87j33J94l58M13l56J09K59l87M10k21J0J53l10j26K73O0k21l
3109a29K03k80J43q0J50K9l17K08J66J87l18m39L59n6J38k08K89O6m2L00n58M11
$$ plain form
3131 222 -197 -106 -173 133 204 97 42 293 61 -70 -81 -521 -150 62 99 136 101 125 -11 -285 61 116 84 424
3155 424 138 -127 -106 171 -438 60 203 -33 -78 324 -16 -103 -106 142 193 81 -61 -22 189 -254 -165 197 332
3178 332 179 65 -368 95 60 -452 -60 108 -64 109 -15 -404 -166 33 134 306 78 24 -59 -234 -80
3199 -80 -84 51 -184 -154 229 -26 146 80 -43 -88 221 -196 132 233 -159 -27 -179 373 -184 27 -131 90
3221 90 41 163 83 23 -91 -286 -67 220 165 -305 19 204 23 -183 4 -158 -66 -61 15 0 -151 -278 18
3244 18 -62 9 172 -158 -48 51 46 -42 331 10 220 68 -68 -47 -81 -27 312 55 -117 38 -285 154 -305
3267 -305 237 54 -164 47 -81 -136 187 -181 212 217 65 292 -207 -209 25 180 -120 361 -21 156 -206 -234
3289 -234 14 27 -1 124 -67 310 -182 -234 -146 204 -43 -178 -97 -228 316 -56 267 74 59 -183 12 -44
$$ packed form
3131B22m19R1o7L06P1j07n5K51k32j31j1m40L71K12L7L7l5K4j36k74L46N5l2L40
3155D24k86k65K1K77o09M98J43k36m5M02l40q7lK48N1j12j42L9K11m43Q9L62J35
3178C32j53j14m33M63l5n12L92J68j72J73j24l89K38J99J01J72k28n4q3j75J54
3199h0mJ35k35L0L83k55J72o6j23m5L09m17L28J01l92J32j52N52n57K11j58K21
3221I0m9J22q0o0j14j95K19K87n5m70L24J85j81k06J87j62R2NP6j5j51j27K96
3244A8q0P1J63l30J10R9nq8L73l21K10j52j36K1l4N4L39k57j72J55l23M39m59
3267c05N42j83k18K11j28n5L23l68L93Nj52K27m99kK34J55l00M81l82J77l62k8
3289b34K48J3k8J25j91L77m92n2Q8L50k47j35Q1j31N44l72L23j93j5k42J95n6
$$ plain form
3311 -44 146 246 209 206 98 155 -29 118 -166 168 311 -246 -23 196 -144 20 164 -49 195 -117 153 50
3333 50 -57 -156 -114 -290 25 -100 131 -193 306 -28 -254 -302 -257 3 99 203 -229 116 117 264 29 96 -132
3356 -132 138 88 110 -219 2 72 -104 183 178 231 -51 -83 178 -34 -184 -143 -550 -213 16 75 -12 -174 -180 99
3380 99 -145 -151 54 127 99 -111 -104 234 -20 92 151 -324 -482 -12 -171 -168 -184 -45 221 26 8 311 195 142
3404 142 -52 99 13 -261 80 63 153 -15 21 41 148 197 -62 -177 -108 55 40 -169 51 158 -22 70 -160
3427 -160 209 -105 109 -65 168 -200 130 86 -55 296 -136 49 372 62 -266 288 99 191 -210 113 -103
3448 -103 209 -30 91 -131 62 35 213 219 214 25 -244 -138 -254 -5 -64 123 -269 44 189 27 -40 -107 186
3471 186 -204 -134 -49 5 45 -109 -99 16 -222 22 -205 81 -114 112 -141 -234 7 -343 199 149 -181 193
$$ packed form
3311d4J90J00l7lj08N7j84J47k84L34J43n57K23K19l40J64J44k13K44l12K70j03
3333E0j07r9M2j76L15j25K31l24M99l34k26m8M5K60R6J04m32L45JJ47k35O7k28
3356a32K70n0K2l29K21P0j76K87nN3k82l2K61k12j50M1m07L37K29N9q7j62oK79
3380I9k44oK05P3k8k10PL38k54J12N9m75j58M70j59Lj6J39K66j95j8L03j16n3
3404A42j94J51q6k74L41j7R0j68L6K0J07M9k59j15O9J63j5k09K20J07j80R2k30
3427a60L69l14K14j74K33l68L30m4j41L51m32J85L23l10l28N54j89R2m01L23k16
3448a03L12k39J21k22J93k7J78Onj89k69J06j16K49n9J87l92L13J45j62o7o7K93
3471A86l90P0Q5N4M0j54J0J15k38K44k27K86j95K26k53r3K41l50N42n0l30L74
$$ plain form
3493 193 49 158 24 69 202 99 -57 30 -260 -208 230 122 158 -27 -297 88 -9 23 -51 -258 162 -136
3515 -136 61 -61 56 317 -34 333 -33 -31 -44 -52 109 -27 -28 -103 -203 -14 -81 -28 132 268 -173 -82 219 -32
3539 -32 48 -45 -28 44 0 -65 -17 171 18 -109 52 -217 147 99 -102 -126 79 -35 -209 34 -73 47 -74
3562 -74 8 -32 -130 -228 -38 40 -46 -257 124 14 199 -52 145 -116 -252 -133 11 -84 24 -6 -47 -200 -106 91
3586 91 -4 193 -39 -264 317 -298 -104 105 116 49 -298 140 400 -37 -131 -134 40 -88 -96 38 50 79 29 -44
3610 -44 -175 25 133 23 -64 88 -16 -361 133 -213 248 295 -237 -88 292 287 -184 -4 225 -222 -207 -210 -28
3633 -28 -10 -154 50 60 243 -245 -73 -288 -108 -192 95 322 -288 94 -123 92 95 -3 -172 -258 197 -227 177
3656 177 72 -179 -29 67 139 -268 326 -151 -41 21 27 188 -393 -376 -270 61 -199 36 22 -465 12 -253
$$ packed form
3493A93j44J09j34M5J33j03j56Q7k90N2M38j08L6j85k70L85r7L2p4k07M20k98
3515a36J97j22J17K61l51L67l66Kj3qJ61j36jp5j00J89o7N3J60J36m41R1L01k51
3539c2Q0r3J7P2m4o5M8J88j53j27J61k69L64m8k01k4K05j14j74K43j07J20j21
3562g4Q2m0r8r8J90P8q6k11L81j10J85k51J97k61j36J19J44r5J08l0m1j53R4J97
3586I1r5J97k32k25N81o15J94K09J1o7l47M38K60m37r4lJ74j28qJ34J2K9n0p3
3610d4j31K00J08j10q7J52j04l45M94l46M61M7n32J49L80nm71J80K29m47J5lJ82
3633b8J8j44K04J0J83m88J72k15J80q4K87K27o10L82k17K15Lr8j69q6M55m24M04
3656A77j05k51J50R6P2m07N94m77J10O2OJ61n81J7J06L31k60K35j4m87M77k65
$$ plain form
3678 -253 223 157 174 227 216 -341 86 107 -316 -100 96 116 6 -244 -236 -25 -86 -83 112 188 -163 -53 152 17
3702 17 303 -12 -129 292 -24 -61 147 -35 204 -155 178 -12 -176 92 343 3 99 61 64 -26 -24 223 196
3725 196 -71 16 -10 -4 137 -131 -40 -135 14 102 -144 130 18 -228 214 180 25 -185 19 -44 170 -144 117
3748 117 -276 8 149 12 -136 182 -173 -167 -139 -87 20 -64 16 100 268 359 154 -64 250 -59 -126 7 146
3771 146 12 141 36 399 -220 310 -128 -202 7 55 -183 157 33 205 126 -20 75 -106 48 -204 -93
3792 -93 -143 297 -126 243 -246 -26 5 -176 -204 -104 78 12 26 -32 -16 -88 193 -14 -104 7 189 -65 176
3815 176 231 -217 204 -136 -236 -47 110 -68 -227 -135 -158 -60 -52 -53 283 147 123 95 326 -13 -336 200 -59
3838 -59 -70 -222 -358 44 -193 124 81 -422 234 124 107 198 249 145 10 -19 -8 -176 98 -84 -96 51 -20
$$ packed form
3678b53M76o6J7N3j1n57M27K1m23K16J96K0j10k50QK11o1LJ95P6l51J10K05j35
3702A7K86l15j17M21l16l7K08j82K39l59L33j90j64K68K51l40R6l8Lr0KK47k7
3725A96k67Q7k6OJ41k68R1r5J49Q8k46K74j12k46M42l4j55k10K04o3K14l14K61
3748A17l93K84J41j37j48L18l55OK8N2J07q4Q0Q4J68R1k05k18L14l09o7J33J39
3771A46j34J29j05L63o19N30m38p4K09M8k38L40j24J72p9j46R5j81J54k52J11
3792i3n0M40m23L69m89K20L1j81k8J00J82o6J4n8J6p2K81k07r0J11J82k54K41
3815A76N5m48M21l40j00J89J57j78j59R2k3R8QjL36j36k4k8K31l39l23N36k59
3838e9j1j52j36M02k37L17m3n03O56j10j7R1N1j04j35k9J1j68K74j82j2J47p1
$$ plain form
3861 -20 -539 -113 150 -232 95 -203 6 252 71 -78 71 -174 -42 139 201 181 147 -188 -297 -285 -123 81
3883 81 -153 39 -30 40 65 -84 -59 151 -156 65 21 245 51 -149 -45 28 110 -150 49 207 172 -49 67
3906 67 139 -96 -87 94 148 60 49 97 155 59 89 -241 25 196 -195 358 -23 258 -26 -329 182 48 -54 71
3930 71 -394 -107 12 -100 273 -240 -184 -174 44 66 -270 -255 37 -64 -218 -66 -243 134 103 176 117 -109 -105
3953 -105 -82 14 375 161 -281 29 244 64 -39 -158 -170 50 171 7 -57 -71 -44 -187 98 -223 -118 -63
3975 -63 162 85 51 -141 -100 -226 -388 177 94 276 118 155 -391 39 98 55 268 115 -168 -213 120 161 -236
3998 -236 36 84 141 141 -312 -135 105 22 84 102 -79 -170 278 235 -172 98 -19 154 9 56 54 87 198 -131
4022 -131 39 -34 55 40 -210 -94 -497 -80 1 297 -42 166 114 14 150 -81 -338 -223 -213 51 133 341
$$ packed form
3861b0n19M26K63l82L27k98K09K46j81j49J49k45J32J81O2k0l4l35j09J2J62K04
3883H1k34J92o9P0K5j49K5K10l07K21m4K24j94k00J04P3Q2k60J99J58l5k21J16
3906F7P2k35RJ81N4q8j1M8N8r6L0l30K66J71l91N53l81K81k84l03N11j34j02J25
3930G1m65K87J19j12L73n13N6J0K18K2l36J5K92j01j54J52j77L77l1P3n9k26M
3953a05K3R6L61k14m42L10K15j80j03j19j2K20J21j64o4j4K7j43K85l21J05N5
3975f3K25p7l4j92M1j26j62N65q3J82j58L7n46M30N9m3K13j53k83m5L33M1l97
3998b36K72M8N7%m53J77K40q3O2J8j81r1M48m3m07K70j17J73j45M7kL3J11l29
4022a31J70p3Q9j5k50J16m03M17Q1K96l39K08n2j00J36k31k57J15J0K64Q2K08
$$ plain form
4044 341 18 128 -314 -53 21 3 181 67 -66 -121 206 -37 -144 -131 176 -42 103 28 4 339 -101 114
4066 114 -35 -211 53 24 43 34 -271 183 9 -112 148 -249 -45 -130 -56 -365 466 -61 101 136 -162 -216 374
4089 374 -87 -85 420 -301 11 -157 128 256 65 1 24 263 87 282 277 -168 -133 -87 -27 53 132 -176 -108 -117 -31
4114 -31 -28 -20 200 -204 245 424 -74 59 -245 -17 -58 -31 -49 -291 -263 -99 203 -35 -217 -24 -20 -44 -145 318
4138 318 -196 -7 -77 112 14 -9 171 95 -2 -9 -451 -37 -148 -245 -209 65 44 27 260 20 -106 -285 -229 56
4162 56 71 -324 -149 -418 93 76 25 -326 67 99 -3 156 -26 140 -384 170 -251 86 -110 -274 11 89
4184 89 -63 -323 132 -19 89 -63 194 -134 -413 169 -11 44 -126 -185 -19 -125 70 -244 -247 -22 171 -134
4206 -134 -67 -162 -11 -81 -214 -123 -18 -147 49 -98 -40 183 -28 -17 -267 123 -108 -27 62 212 -233 173 -90
$$ packed form
4044C41l23J10m42K61P4j8J78j14j33n5L27k43j07J3L07k18J45p5k4L35m40K15
4066A14j49j76K64k9J9rl05M54j74j21K60l97K04q5P4l09Q31n27J62L5k98n4N90
4089C74m61KN05p21L12j68K85J28j91o4K3K39j76J95nm45L5M6O0Q0P9l08O8rQ6
4114c1LQK20m04M49J79m98J33l04K28m1K7j8k42K8J64L02k38j82J93Mk4j01M63
4138C18n14J89p0J89r8k3J80p6r7pm42M14j11r7L6K74k1j7K33k40j26j79N6K85
4162E6J5l95J75k69N11j7n1l51L93L2j02J59j82J66n24N54m21L37j96j64K85P8
4184H9j52k60M55j51J08j52K57l28k79N82j80N5j70n9J66j06J95l14lK25J93l05
4206a34O7r5J51p0j33R1J05j29J96j47N8K23k11J1k50L90k31Q1Q9J50m45M06k63
$$ plain form
4229 -90 265 -6 229 158 230 113 107 -98 429 51 36 -244 -51 -137 136 -111 -7 -330 -143 35 129 234 -214
4252 -214 -140 228 -32 -82 349 101 263 -66 132 34 -12 16 239 -72 122 -63 -9 -97 149 -246 -145 -298
4274 -298 -11 138 -23 -305 180 275 98 48 22 130 153 129 -75 39 -27 -134 96 112 -286 210 68 102 -205
4297 -205 -178 222 -280 1 132 288 251 73 135 1 143 240 -123 -183 -192 -40 -309 153 -189 1 194 -279
4319 -279 -88 -280 -275 54 -47 -178 -138 1 116 -114 4 124 -51 -43 9 171 44 -21 -209 185 -157 88
4341 88 -172 42 -151 -315 -303 -138 -123 30 -85 54 -365 49 173 -6 -122 -31 46 77 -154 -47 -66 40
4363 40 -225 253 55 -131 -97 -153 102 98 -30 -173 -185 88 92 -293 24 235 299 -15 -13 40 295 35 -212 80
4387 80 53 123 -100 -171 59 -59 301 9 -167 -240 -259 22 -84 -79 -171 -129 322 177 -157 -67 120 204 398 -300
$$ packed form
4229i0L55k71K35p1P2j17ok05N27l78j5k80J93q6K73k47J04l23J87J78R4J05m48
4252b14P4L68k60n0M31k48J62l29J98r8m6K8K23l11J94j85N4q8K46l95J01j53
4274b98K87J49j61k82M85R5j77n0k6J08K3k4k04J14o6j07K30J6l98M96j42L4l07
4297b05K7M00n02K81J31J56l7j78O2j34J42R7l63o0rJ52k69M62l42J90J93m73
4319b79J91j92NL29j01j31M0J39J15k30J18J20j75QN2J62j27o5j88L94l42K45
4341H8k60K14j93j64J2J65J5J53j15J39m19M14J24j79j16R1P7L1k31J07j9J06
4363D0k65M78j98j86L4n6K55mj28j43j2K73Ml85L17K11O4l14KN3K55k60k47K92
4387H0k7P0k23p1K30j18L60k92j76p3j9K81j06Nr2M2M51j45l34R0J87Q4J94o98
$$ plain form
4411 -300 280 420 27 -51 37 -132 -14 -48 -114 -227 -121 -215 377 -125 -67 -108 -102 232 123 89 124 198 -5 73
4435 73 -206 186 142 170 -3 315 -260 108 -39 92 17 -79 19 129 -100 185 115 -205 260 203 -261 238 -47
4458 -47 -353 63 -177 95 -72 -62 196 -137 -255 -67 146 162 52 -34 -25 -234 -136 182 -108 169 -189 -185 44
4481 44 -26 -141 90 85 -1 -30 48 71 -238 -114 -25 212 -65 -106 -149 78 -72 37 41 -58 54 -106 71 24 177
4506 177 107 -225 52 40 103 331 -109 -37 98 -148 -60 189 -89 56 52 85 -10 67 112 99 9 166 74 138 -44
4531 -44 108 43 158 194 -100 283 133 88 -23 -98 223 -22 125 76 155 -114 -256 -167 -44 -248 191 -18 -23
4554 -23 69 127 149 -234 159 -69 -134 -74 -286 -106 182 -125 -206 295 -196 -299 73 -30 -300 -286 135 161 69
4577 69 31 -15 -129 -226 -109 -67 68 75 162 -91 -64 -130 126 16 -114 55 38 -119 -254 182 -57 25 9 -89 -198
$$ packed form
4411c00N80J40l93p8Q8j69J18l4o6j13J06r4N92n02N8m1OL34j09l4L5P4k03P8
4435G3k79L92m4K8j73L18n75L68j47J31p5r6R8J10k29K85p0l20M65n7m64M99k85
4458d7l06M16k40K72j67J0K58l33j18J88K13J6j10q6Rk09R8L18k90K77l58MK29
4481D4p0j15K31nq6k9P8K3l09J24Q9K37k77m1m3K27j50J09Mr9J12j60J77m7J53
4506A77p0l32K77j2O3K28m40P2J35k46Q8K49k78J45mL3r5P7M5j3r0J57r2O4j82
4531d4J52o5J15L6k94L83j50m5j11p5L21k45J47m9P9k69j42Q9J23k04M39k09n
4554b3R2N8K2l83L93k28o5O0k12J80K88l07q1N01m91j03L72j03k70J4M21K6r2
4577F9l8m6j14r7J17M2J35PQ7k53K7o6K56j10j30J69j7j57j35M36k39Q2j6r8j09
$$ plain form
4602 -198 -121 -107 279 68 -144 -174 132 34 232 -231 315 118 -247 111 75 301 176 154 26 13 1 373 75
4625 75 12 236 225 78 -129 195 137 192 151 -34 94 372 -52 190 133 242 234 -192 86 201 -112 -137 -67 -58
4649 -58 128 436 81 147 52 63 -118 194 99 -167 57 118 -42 -201 -235 -285 -36 49 141 -208 107 53 86 197
4673 197 178 316 -172 -62 -140 -66 331 55 129 -14 244 -233 -141 -81 -34 116 147 -112 -208 36 -217 -133 172
4696 172 227 140 -219 -138 -156 -82 -42 9 -148 -152 -131 -76 192 7 -144 -169 -19 58 -415 132 -179 -137 -148 -88 61
4721 61 -35 -209 99 -75 419 9 -15 -160 -257 -355 -70 143 -228 -225 5 192 238 -75 -269 -267 -80 -152 51 380
4745 380 0 -218 -82 22 46 -32 90 41 166 98 -130 95 -363 -146 80 -114 -431 19 172 2 177
4766 177 -107 -49 80 -437 -254 115 -187 36 168 9 9 64 81 101 -78 131 74 -144 -12 54 -72 -37 -23
$$ packed form
4602a98P7J4L86k11k12l0L06r8J98m63N46j97l65L58l6K26j25k2j28j3j2L72k98
4625G5o3K24j1j47k07L24n8N5m1j85J28K78m24K42n7J09qm26K78J15l13k5P0R
4649e8J86L08l55O6r5J1j81L12r5k66K24O1j60j59l4n0K49Q5R2l49L15n4L3J11
4673A97j9J38m88J10p8P4L97k76P4j43K58m77R2O0M7J50L1k59r6K44k53Q4L05
4696A72N5q7l59Q1j8P4M0N1j57mK1N5K68j85j51k5J50P7m73N47l11M2j1O0J49
4721F1r6j74L08j74M94m10k4j45r7r8K85K13l71LK30J87M6l13j94KJ87p2K03L29
4745C80l80k18J36J04K4p8J22m9J25o8k28K25m58K17K26j94l17M50J53j70J75
4766A77k84N8J29n17J83L69l02K23J32j59%N5J7K0j79K09n7k18J32O6j26L5J4
$$ plain form
4789 -23 -54 139 -72 -89 -142 19 -89 -133 33 -77 -396 66 -203 262 109 186 161 126 262 -325 299 -140 57
4812 57 -271 -21 183 193 202 358 -108 -126 -140 -108 -51 -83 245 122 1 -160 -171 -14 -126 33 282 -188 90
4835 90 -32 -26 -136 -23 -31 198 -167 -96 -37 235 16 -251 -154 33 -42 65 41 -25 -219 -50 146 -118 -134 -404
4859 -404 103 39 280 435 8 34 -51 -56 -32 -72 142 -256 -94 -91 132 -140 8 135 -57 -1 -95 57 -91 -38
4883 -38 -350 -111 107 216 -138 27 39 147 96 -33 -22 -238 -88 -61 -277 -139 126 112 -84 41 -124 11
4905 11 218 152 45 138 -67 103 46 88 96 131 153 230 257 0 -6 -69 -124 -16 49 -405 71 -98 -356 83 -143
4930 -143 228 -262 132 127 50 355 85 -96 -64 70 -67 -94 206 -197 -272 -37 269 216 -86 167 58 51 -198
4953 -198 137 225 24 97 -164 -304 -7 212 43 32 -99 -86 -124 80 38 284 123 -29 -33 -163 48 104 91
$$ packed form
4789b3l1J93k11j7n3J61j08m4J66j10l19M62k69M65j53P7k5l5J36n87O24m39J97
4812E7l28K50K04J0RJ56m66j8j4L2N7l2L28j23j21j61j1J57j12J59K49m70K78
4835I0j22Oj10J13qK29l65P1N9K72k19k67R7J87p5J07k4o6j94J69J96k64j6k70
4859d04N07o4K41J55m27K6q5nK4m0K14l98J62LK23k72J48J27j92N6r4J52j48N3
4883c8l12K39K18J09l54J65J2J08n1j29J1k16J50K7k16J38K65j4j96J25j65J35
4905A1K07o6j07R3k05J70n7M2QL5K2P7K7k57oo3n5J08O5m54M76j69k58M39k26
4930a43L71m90L94np7L05k70j81L2J34j37k7L00m03p5K35L06n3l02K53j09pk49
4953a98L35Q8k01P3k61j40K97K19j69j1j31J3l8K04m2K46j61j52mj30K11N6j3
$$ plain form
4976 91 -120 108 54 -118 -206 73 88 222 -177 -145 228 -117 86 -98 -55 173 114 -55 105 -4 49 316 39
4999 39 -317 -163 -118 -130 2 114 145 479 -93 -78 17 -143 119 -33 156 -234 193 181 14 215 108 -93
5021 -93 0 3 88 -129 136 -100 -95 191 41 34 -37 142 -68 -169 -266 -62 -14 58 65 -91 44 150 63 310 -164
5046 -164 130 -42 11 209 -161 23 -19 -174 -74 -115 -37 -166 -71 54 68 -55 10 -41 305 -76 -60 -119 -131 414
5070 414 9 -185 6 -126 -29 64 -201 -177 88 -23 97 145 171 275 -109 -39 -107 -106 -75 -345 164 -38 -136 290
5094 290 -15 128 -219 -400 -296 179 -152 19 -265 23 -114 204 -39 43 148 10 -99 36 -325 -130
5114 -130 -164 -128 -208 151 -44 23 -59 42 -20 62 295 -370 153 -89 -112 -159 173 151 -180 -291 -177 197 67
5137 67 0 346 19 -143 -60 -78 -60 -98 330 -49 237 -11 182 89 145 -91 77 54 -136 344 -124 -49 159
$$ packed form
4976I1k11K28n4j72q8K79J5J34l99L2L73l45K03j84M3K28n9j69J60j09N3K67k77
4999C9l56J54M5j2J32J12L1L34n72J5R5j60K62j52J89l90M27j2j67K01j07k01
5021i3R3LQ5k17K65k36NK86j50pp1J79k10j01r7K04M8P2Pj56J35J06q7K47m74
5046a64K94j72N3J98l70J84m2j55J00m1P8j29R5J25J4j23O5n1L46l81J6n9j2N45
5070D14m05j94J91j32R7R3k65K4K65j11J20M8K6J04l84P0o8JL1k70N09k02r8M26
5094B90l05J43l47j81J04M75l31J71k84K88j37L18k43Q2J05j38j09J35l61J95
5114a30l4L6q0L59j95O7q2J01o2Q2K33o65N23k42k3m7L32k2l31j11J14L74j30
5137F7o7L46l27j62Q3j8J8l8M28l79K86k48J93r3N6k36J68k3j90M80m68P5K08
$$ plain form
5160 159 -161 -83 108 -94 220 -50 168 -312 311 -26 -86 66 -24 -8 285 273 147 150 176 40 7 -137 70
5183 70 183 -19 -395 -142 60 128 133 33 165 58 -73 156 -267 -200 122 176 -35 -190 185 -97 79 -160
5205 -160 45 12 56 168 240 -68 128 21 10 118 -141 -43 230 -151 -206 -4 -206 -90 104 472 -50 109
5227 109 31 -189 3 -196 186 52 221 -159 -131 1 292 151 51 34 -5 -61 69 -162 -134 -228 85 -209
5249 -209 55 67 19 151 75 -41 -97 263 162 47 21 143 65 -112 96 -91 103 26 -14 167 -76 15 -107
5272 -107 288 -72 253 -55 231 49 -31 78 111 135 -13 -187 41 -38 -42 -86 -108 2 163 60 124 -20 65
5295 65 13 124 -406 72 56 106 11 -122 -136 62 -45 -287 367 101 132 -60 70 -142 -98 -44 276 -48 29
5318 29 59 83 -138 -190 239 -249 74 -5 -58 18 -147 -94 -28 45 -229 -8 59 -47 -171 145 237 -57 -79 174
$$ packed form
5160A59l20P8J91k02L14k70K18m80O23l37o0J52r0J6K93j2j26LK6j36l3j44K07
5183G0J13k02l76K53K02O8Nj00J32j07j31K29m23O7L22N4k11j55L75k82J76k39
5205a60K05l3M4J12P2l08J96j07j1J08k59R8K73l81n5K02k02J16J94L68n22J59
5227A09p8k20J92j99L82j34J69l80K8J32K91j41j00j7l9n6J30k31K8r4L13k94
5249b09K64J2m8J32p6j16n6L60j01j15k6J22p8j77K08j87J94p7m0J81k43R1j22
5272a07L95l60L25l08K86j82q0J09L3K4j48j74K28p9mm4k2J10J61j03O4j44Q5
5295F5n2J11n30M78j6N0r5j33j4J98j07k42O54k66L1j92J30k12M4N4L20l24P7
5318B9L0K4k21n2M29m88L23p9n3P6j65N3O6P3k74K21O7j06j24L16R2k94k2K53
$$ plain form
5342 174 173 115 -129 -387 72 -137 -209 -204 113 -168 -123 200 69 -86 102 58 193 200 -101 -131 78 -39 -452 96
5366 96 51 92 -176 -144 -242 256 -1 -83 -111 -413 -272 123 116 60 -104 -120 347 69 -173 14 315 -277 -97 59
5390 59 -75 -41 -88 219 -149 -146 218 98 -157 93 -324 129 126 -17 -203 -148 -16 131 3 21 137 198 374
5413 374 61 -118 -110 -66 41 84 -225 106 -46 173 -87 -242 94 -185 5 180 -120 211 173 67 -13 -244
5435 -244 -223 -4 6 -99 -131 23 -89 279 175 69 -305 315 147 133 160 -56 17 136 329 150 -83 -130
5457 -130 328 22 -78 3 -132 112 -156 -12 70 57 -7 -119 -259 -12 83 105 134 164 71 22 157 160 -93 0
5481 0 134 122 -93 -131 6 177 -208 0 15 -114 -195 -164 34 -112 -219 224 -193 143 114 115 74 141 -12 -175
5505 -175 -12 -100 -62 -17 114 71 166 64 -31 123 -129 -68 -62 -84 198 287 124 211 -141 -217 78 -253 188 87
$$ packed form
5342A74jn8k44k58M59k09p2NL17k81M5L23j31j55J88m4J35Pl01l0K09j17m13N48
5366I6m5M1k68L2r8M98k57q2k8l02J41L95pn6j64j6M67k78k42J87L01n92J80J56
5390E9j34L4m7L07l68LL64j20k55K50m17M53lj43j86N5J32J47j28J8J16O1J76
5413C74l13j79QM4J07M3l09L31j52K19k60j55L36k79J90J75l00L31l8j06q0k31
5435b44K1K19J0j05l2J54j12L68j04j06l74O20j68j4K7k16P3J19J93j79k33m7
5457a30M58l06j00Q1j35K44k68J44Q2j3o4j12j40K47R5K2K9L0r3m9J35Lk53R3
5481@J34j2k15l8J37J71l85K08J5j29q1L1J98j46j07M43m17L36k9Jm1O7j53j63
5505a75J63q8L8M5J31m3R5j02r5J54k52O1Ok2K82Q9j63Q7l52p6K95l31M41j01
$$ plain form
5529 87 142 -334 62 -211 -311 187 -50 -166 -79 -94 -289 -282 -70 -176 217 -69 -91 96 -31 -307 -84 -77 -9
5552 -9 -155 -218 -89 -317 -118 514 -233 -255 -251 167 83 77 187 -7 -3 -96 198 26 219 -5 -112 -225 112 -93
5576 -93 -145 -27 -70 72 62 34 123 -71 94 92 -228 234 56 101 121 -18 -31 44 -133 -61 225 168 -311 229 -141
5601 -141 -235 355 -25 -87 69 17 -46 154 -130 -259 -273 60 87 240 123 -76 275 190 -54 268 7 -104
5623 -104 159 222 77 -171 -72 147 8 -132 264 -89 187 17 213 26 477 82 -165 331 -95 -181 -250
5644 -250 116 -127 64 -25 103 -75 -174 -112 -33 -77 14 12 -106 13 -127 161 -6 -100 144 219 85 30 -145 -344
5668 -344 126 -181 -83 -22 -206 -85 -113 102 -92 146 -21 88 109 -70 76 159 132 150 23 352 137 165 -29
5691 -29 254 -116 81 -270 -12 -62 -415 -19 18 254 61 -29 -245 -152 -264 -203 -28 -55 -251 -97 -199 188
$$ packed form
5529H7N5m76L96k73j00M98k37j16Q7j5j95PK12j06L93k86k2J87j27k76K23PO8
5552ij46o3J29k28J99O32p47k2MM18q4oJ10j94Mr3K94j72J93k24j07j13L37k05
5576i3n2J18m3J42j0k8Q9j94J65kl20M62j78M5K0j39j3P5j77P2K86n7m79N40l70
5601a41r4N90l80o2J56n2o3K00k84j29j4L33K7J53j17j99L51q5k44L22k61j11
5623a04K63O3j45k48R9K19j39j40L96l53K76j70J96j87M51l95k47M96m26q6o9
5644b50L66k43J91q9J28j78r9O2P9m4R1kj18J19j40K88j67r4K44P5j34n5j75j99
5668c44M70l07R8O1j84J21k8K15j94K38j67J09K1j79J46Q3k7J8j27L29k15K8j94
5691b9K83l70J97l51K58n0l53L96L7K36j93r0k16R3j12O1J75k7j96J54j02L87
$$ plain form
5713 188 159 83 54 -149 293 -8 138 225 -129 151 162 -192 122 -16 -10 75 -136 -57 -10 -205 -177 -70 111 143
5737 143 -166 -313 -68 12 146 -18 -73 98 172 -63 196 -95 377 36 36 -1 15 -62 -18 79 55 375 -92 -82
5761 -82 5 -173 40 5 -63 -13 53 22 28 -2 63 265 -100 -270 -105 -205 66 -223 -133 22 -48 102 258 222 -54
5786 -54 26 67 -114 17 -6 214 -295 89 -212 3 41 -111 150 28 -65 -163 -128 -15 171 -102 85 372 232
5809 232 -126 -46 -49 -95 280 -126 62 -90 -268 188 25 46 -112 -41 69 124 51 -309 207 -29 -17 -43 -74 277
5833 277 104 -351 182 -89 124 9 -7 -175 -19 165 -212 132 157 -192 130 -235 -199 10 113 -116 -294
5854 -294 -372 -308 -59 158 -322 -224 23 -169 87 162 180 -49 187 -25 -314 142 -411 122 -97 14 -21 -248
5876 -248 123 231 46 222 -48 267 146 133 -3 383 -176 390 118 110 -320 220 56 -193 177 45 -46
$$ packed form
5713A88k9p6k9k03M42l01J46Q7l54K80J1l54L14j38OQ5k11P9M7j95K8J07J81L2
5737A43l09j47K45Q0J34j64n5J71P4k35K59k91M72l41%l7J6p7M4R7k4L20m67J0
5761h2Q7j78K13l5o8N0O6l1Ol0O5K02l65j70J65j00K71k89R0J55p0J50J56l6k76
5786e4Q0M1j81J31k3K20n09L84l01K15L8j52K61j22r3r8L5J13J86k73J87K87j40
5809B32l58Q0lm6L75m06J88j52j78M56j63K1j58P1J10N5p3l60N16k36J2k6l1L51
5833B77j73m55N33k71K13j15j6j68J56J84l77L44K5l49L22l65L6K09J03k29j78
5854b94p8O4K49K17m80R8K47j92K56P5J8k29K36k12k89M56n53N33k19J11l5k27
5876b48L71J08j85J76k70L15j21j3j36L86n59N66k72qm30N40j64k49L70j32r1
$$ plain form
5897 -46 -127 252 -57 367 -253 -124 364 174 99 -58 -31 183 -241 -229 -383 -58 102 76 248 -50 187 -97
5919 -97 159 33 -62 -169 -115 -213 -288 -101 213 -95 37 -84 125 -151 12 -147 -74 107 219 96 25 77 82
5942 82 -203 -1 151 -520 28 156 102 216 65 -53 -35 -105 276 -34 -69 -232 123 87 147 36 131 147 -129
5965 -129 -14 -46 -77 -139 -70 -97 -96 -306 -108 -237 -28 82 159 175 136 150 -152 63 72 167 261 314 -31 -20 84 38
5991 38 89 29 -33 -98 192 -82 41 181 209 -242 36 46 -116 98 -19 -135 -3 -156 84 -220 -215 -110 -65
6014 -65 -145 -126 52 25 -64 168 248 -205 -83 294 132 -73 -321 -183 109 44 65 -4 -17 63 122 -75 201 224
6038 224 -154 146 -125 194 381 -121 127 -5 -50 -97 -99 -1 14 -71 -64 84 371 94 46 81 111 154 -501 -308
6062 -308 22 199 -56 56 -211 -82 27 -95 169 -103 36 -184 81 -247 13 328 175 203 -99 -119 204
$$ packed form
5897d6q1L79l09M24o20J29M88j90p5j57K7K14m24J2j54L25J60k6J72k98K37k84
5919i7K56j26r5j07N4r8p5J87L14l08J32j21K09k76J63j59P3J81J12j23p1N2N
5942H2k85K02J52o71N48J28n4J14j51j18J8p0L81l10l5j63L55l6O0j11R5J6k76
5965a29J15l2l1o2O9k7Jk10J98j29K09J10P7J6l9J4l02K15RR5R4N3l45J1J04m6
5991C8N1o0o2o5K90k74J23J40K8m51K78J0j62K14j17j16J32j53K40l04NJ05M5
6014f5q0J9J78k7q9K32Q0m53J22L77j62k05k48J38K92o5K1o9j3Q0N9j97K76K3
6038B24l78L00k71L19J87n02K48j32m5m7kR8J5q5PJ48K87k77m8L5L0M3o55J93
6062c08L30J77k55J12k67J29J09j22K64k72J39k20K65l28K60L15j53K8l02k0L23
$$ plain form
6083 204 -92 -64 21 -87 -35 -51 267 -189 13 -279 127 287 -87 -215 -33 -43 217 -123 -198 8 -183 -60
6105 -60 5 -74 -84 -15 -18 -16 41 -34 4 -48 -4 -30 -158 -60 108 188 104 -82 -6 264 -1 117 -93 28 -39 -122 127
6132 127 -149 -153 21 -194 -345 43 -193 116 -344 102 295 -191 -114 -45 -99 -11 216 85 3 29 -117 97 -199
6155 -199 36 257 -57 -61 -110 91 -78 389 150 105 -27 -145 -184 -271 -43 67 117 -332 75 -327 227 -118
6177 -118 -65 -33 96 -192 45 80 -162 36 -303 194 -70 60 69 -330 42 214 -104 -170 -8 -194 -62 -189
$$ packed form
6083B04k96K8Q5j08N2j6L18m56K02k92M06J60l74j28J82j0K60l40p5K06j91J23
6105f0O5p9j0O9lKN7p5L8n2M4k6j28R8J68Q0q4j86P6K70k65J18k10J21o7q3K49
6132A27k76mJ74k15j51L88k36L09m60M46J93m86P7O9n4Q8K27j31q2K6j46K14k96
6155a99K35K21l14mm9K01j69M67k39m5j32j18l9q7K28J10N0m49M07m02N54l45
6177a18N3L2J29k88K37L5k42J98l39M97k64J30Rl99L72J72l18o6J62j86J32j27
$$ [...]
8191h2
##END NTUPLES=NMR FID
##END=
