##TITLE=1H_DE-43H_D2O
 D2O
 8 sc, 
 6.8.2024
##JCAMPDX= 6.0         $$ Bruker NMR JCAMP-DX V2.0
##DATA TYPE= NMR FID
##DATA CLASS= NTUPLES
##ORIGIN= UXNMR, Bruker Analytische Messtechnik GmbH
##OWNER= root
$$ XWIN-NMR		Version 3.5
$$ Tue Aug  6 14:39:14 2024 Russian Standard Time (UT+4h)  she@DPX200
##.OBSERVE FREQUENCY= 200.1313
##.OBSERVE NUCLEUS= ^1H
##.DELAY= (6, 6)
##.ACQUISITION MODE= SIMULTANEOUS
##.ACQUISITION SCHEME= undefined
##.AVERAGES= 8
##.DIGITISER RES= 18
##SPECTROMETER/DATA SYSTEM= spect
##.PULSE SEQUENCE= zg30
##.SOLVENT NAME= Acetone
##.SHIFT REFERENCE= (INTERNAL, Acetone, 0, 15.7039)
##AUDIT TRAIL= $$ (NUMBER, WHEN, WHO, WHERE, WHAT)
$$ ##TITLE= Audit trail, XWIN-NMR		Version 3.5
$$ ##JCAMPDX= 5.01
$$ ##ORIGIN= Bruker BioSpin GmbH
$$ ##OWNER= she
$$ F:/spectra/data/she/nmr/H-F/1/audita.txt
$$ ##AUDIT TRAIL=  $$ (NUMBER, WHEN, WHO, WHERE, WHAT)
(   1,<2024-08-06 14:37:44.96 +0400>,<she>,<DPX200>,
      <created by zg, POWCHK disabled, PULCHK disabled
       configuration hash MD5:
       00 E9 B6 7A A2 85 ED C7 34 08 36 98 17 FE 4E 26
       data hash MD5: 16K
       E8 C1 AB 22 01 E0 16 D5 C6 81 7B 36 80 9D D2 32>)
$$ ##END=
$$ 
$$ hash MD5
$$ 53 86 D8 1E 02 68 8F 76 58 29 4C 32 EC A5 76 EC
##$RELAX= 
##$RELAX= 
##$RELAX= 
##$RELAX= 
##$RELAX= 
##$RELAX= 
$$ Bruker specific parameters
$$ --------------------------
##$DU= <F:/spectra>
##$EXPNO= 1
##$NAME= <H-F>
##$PROCNO= 1
##$TYPE= <nmr>
##$USER= <she>
##$AMP= (0..31)
100 100 100 100 100 100 100 100 100 100 100 100 100 100 100 100 100 100 
100 100 100 100 100 100 100 100 100 100 100 100 100 100 
##$AQSEQ= 0
##$AQ_mod= 1
##$AUNM= <au_zg>
##$AUTOPOS= <>
##$BF1= 200.13
##$BF2= 200.13
##$BF3= 200.13
##$BF4= 200.13
##$BF5= 200.13
##$BF6= 200.13
##$BF7= 200.13
##$BF8= 200.13
##$BYTORDA= 1
##$CFDGTYP= 0
##$CFRGTYP= 5
##$CHEMSTR= <none>
##$CNST= (0..31)
1 1 145 1 1 1 1 1 1 1 1 1 1 1 1 1 1 1 1 1 1 1 1 1 1 1 1 1 1 1 1 1 
##$CPDPRG= <>
##$CPDPRG1= <>
##$CPDPRG2= <>
##$CPDPRG3= <>
##$CPDPRG4= <mlev>
##$CPDPRG5= <mlev>
##$CPDPRG6= <mlev>
##$CPDPRG7= <mlev>
##$CPDPRG8= <mlev>
##$CPDPRGB= <>
##$CPDPRGT= <>
##$D= (0..31)
0 1.2 0 0 0 0 0 0 0 0.06 0 0.03 0 0 0 0 0.0002 0 0 0 0 0 0 0 0 0 0 0 0 
0 0 0 
##$DATE= 1722940664
##$DBL= (0..7)
120 120 120 120 120 120 120 120 
##$DBP= (0..7)
150 150 150 150 150 150 150 150 
##$DBP07= 0
##$DBPNAM0= <>
##$DBPNAM1= <>
##$DBPNAM2= <>
##$DBPNAM3= <>
##$DBPNAM4= <>
##$DBPNAM5= <>
##$DBPNAM6= <>
##$DBPNAM7= <>
##$DBPOAL= (0..7)
0.5 0.5 0.5 0.5 0.5 0.5 0.5 0.5 
##$DBPOFFS= (0..7)
0 0 0 0 0 0 0 0 
##$DE= 6
##$DECBNUC= <off>
##$DECIM= 24
##$DECNUC= <off>
##$DECSTAT= 4
##$DIGMOD= 1
##$DIGTYP= 9
##$DL= (0..7)
0 120 120 120 120 120 120 120 
##$DP= (0..7)
150 150 150 150 150 150 150 150 
##$DP07= 0
##$DPNAME0= <>
##$DPNAME1= <>
##$DPNAME2= <>
##$DPNAME3= <>
##$DPNAME4= <>
##$DPNAME5= <>
##$DPNAME6= <>
##$DPNAME7= <>
##$DPOAL= (0..7)
0.5 0.5 0.5 0.5 0.5 0.5 0.5 0.5 
##$DPOFFS= (0..7)
0 0 0 0 0 0 0 0 
##$DQDMODE= 0
##$DR= 18
##$DS= 0
##$DSLIST= <SSSSSSSSSSSSSSS>
$$ [...]
##$SUBNAM2= <"">
##$SUBNAM3= <"">
##$SUBNAM4= <"">
##$SUBNAM5= <"">
##$SUBNAM6= <"">
##$SUBNAM7= <"">
##$SUBNAM8= <"">
##$SUBNAM9= <"">
##$SW= 24.0689771365484
##$SWIBOX= (0..15)
0 0 2 0 0 0 0 0 0 0 0 0 0 0 0 0 
##$SW_h= 4816.95568400771
##$TD= 16384
##$TD0= 1
##$TE= 0
##$TE2= 300
##$TE3= 300
##$TEG= 300
##$TL= (0..7)
0 120 120 120 120 120 120 120 
##$TP= (0..7)
150 150 150 150 150 150 150 150 
##$TP07= 0
##$TPNAME0= <>
##$TPNAME1= <>
##$TPNAME2= <>
##$TPNAME3= <>
##$TPNAME4= <>
##$TPNAME5= <>
##$TPNAME6= <>
##$TPNAME7= <>
##$TPOAL= (0..7)
0.5 0.5 0.5 0.5 0.5 0.5 0.5 0.5 
##$TPOFFS= (0..7)
0 0 0 0 0 0 0 0 
##$TUNHIN= 0
##$TUNHOUT= 0
##$TUNXOUT= 0
##$USERA1= <user>
##$USERA2= <user>
##$USERA3= <user>
##$USERA4= <user>
##$USERA5= <user>
##$V9= 5
##$VALIST= <valist>
##$VCLIST= <CCCCCCCCCCCCCCC>
##$VD= 0
##$VDLIST= <DDDDDDDDDDDDDDD>
##$VPLIST= <PPPPPPPPPPPPPPP>
##$VTLIST= <TTTTTTTTTTTTTTT>
##$WBST= 1024
##$WBSW= 4
##$XGAIN= (0..3)
0 0 0 0 
##$XL= 0
##$YL= 0
##$YMAX_a= 81213
##$YMIN_a= -75578
##$ZGOPTNS= <>
##$ZL1= 120
##$ZL2= 120
##$ZL3= 120
##$ZL4= 120
##$ABSF1= 10
##$ABSF2= 0
##$ABSG= 5
##$ABSL= 3
##$ALPHA= 0
##$AQORDER= 0
##$ASSFAC= 0
##$ASSFACI= 0
##$ASSFACX= 0
##$ASSWID= 0
##$AUNMP= <proc_1d>
##$AZFE= 0.1
##$AZFW= 0.1
##$BCFW= 1
##$BC_mod= 2
##$BYTORDP= 1
##$COROFFS= 0
##$CY= 11.3945322036743
##$DATMOD= 1
##$DC= 2
##$DFILT= <>
##$DTYPP= 0
##$F1P= 15.6554695791079
##$F2P= 12.8336369535428
##$FCOR= 0.5
##$FTSIZE= 0
##$FT_mod= 4
##$GAMMA= 1
##$GB= 0.15
##$INTBC= 1
##$INTSCL= 1
##$ISEN= 128
##$LB= 0.24
##$LEV0= 0
##$LPBIN= 0
##$MAXI= 10000
##$MC2= 0
##$MEAN= 0
##$ME_mod= 0
##$MI= 1.114404
##$NCOEF= 0
##$NC_proc= 0
##$NLEV= 6
##$NOISF1= 3.799351
##$NOISF2= 2.8
##$NSP= 1
##$NTH_PI= 0
##$NZP= 0
##$OFFSET= 15.70392
##$PC= 1
##$PHC0= -25627.1
##$PHC1= -8.012508
##$PH_mod= 1
##$PKNL= yes
##$PPARMOD= 0
##$PSCAL= 0
##$PSIGN= 0
##$REVERSE= no
##$SF= 200.130013532006
##$SI= 16384
##$SIGF1= 3
##$SIGF2= 2
##$SINO= 400
##$SIOLD= 16384
##$SREGLST= <1H.CDCl3>
##$SSB= 0
##$STSI= 0
##$STSR= 0
##$SW_p= 3612.71676300578
##$SYMM= 0
##$S_DEV= 0
##$TDeff= 0
##$TDoff= 0
##$TI= <>
##$TILT= no
##$TM1= 0
##$TM2= 0
##$TOPLEV= 0
##$USERP1= <user>
##$USERP2= <user>
##$USERP3= <user>
##$USERP4= <user>
##$USERP5= <user>
##$WDW= 1
##$XDIM= 8192
##$YMAX_p= 0
##$YMIN_p= 0
$$ End of Bruker specific parameters
$$ ---------------------------------
##NTUPLES= NMR FID
##VAR_NAME=  TIME,          FID/REAL,        FID/IMAG
##SYMBOL=    X,             R,               I
##VAR_TYPE=  INDEPENDENT,   DEPENDENT,       DEPENDENT
##VAR_FORM=  AFFN,          ASDF,            ASDF
##VAR_DIM=   8192,          8192,            8192
##UNITS=     SECONDS,       ARBITRARY UNITS, ARBITRARY UNITS
##FACTOR=    0.0002076,     1,               1
##FIRST=     0,             0,               0
##LAST=      1.7004516,     0,               0
##MIN=       0,             -75578,          0
##MAX=       1.7004516,     81213,           0
$$ Real data points
##PAGE= N=1
##DATA TABLE= (X++(R..R)), XYDATA
0@%%%%%%%%%%%%%Kj0J6j6J6j6K3l1L2l7M5n1N9o9P7q8J01j14J30j46J62j80K01
$$ 0 0 0 0 0 0 0 0 0 0 0 0 0 0 2 -8 8 -8 8 -8 15 -16 16 -21 24 -27 32 -37 40 -48 53 -61 69 -77 85 -95 106
36A06k25K52k80L11l45L79m19M66n15N69o32P02p80Q70r73J094j239J411j625
$$ 106 -119 133 -147 164 -181 198 -221 245 -270 299 -333 369 -411 459 -514 580 -659 752 -873
55h73J897k252K743l460M589j1562R0131k6041q7388o80m816N2202N7573n6349
$$ -873 1024 -1228 1515 -1945 2644 -8918 81213 55172 -32216 -32896 -37712 14490 72063 15714
69A5714p8575K0161N7325L9793k5437o6047j0045M7477L8966M543n9819m6134
$$ 15714 -62861 -42700 14625 54418 28981 -37066 -47111 366 39332 43875 -15944 -62078
81f2078M8363N3215p429k6332m4498n165P1809K7414n3662l4398j453K9130N2003
$$ -62078 -13715 39500 32071 5739 -38759 -43924 27885 55299 1637 -32761 -34214 -5084 46919
94D6919j3342o6489j0615L9961L9809M625n4415l8278L9371M3328J284k6831m4691
$$ 46919 33577 -32912 -43527 -3566 36243 40868 -13547 -51825 -12454 30874 32158 5327 -39364
107c9364K886O2667J9920m2332l4183j363L5462L8028k2519m6302m748K7049L3798
$$ -39364 -36478 26189 46109 3777 -30406 -31769 3693 41721 19202 -27100 -31848 -4799 28999
120B8999M519m5759k8059L0890L4701K305k5831l3317O340M1800J5732k2510l2823
$$ 28999 33518 -12241 -40300 -9410 25291 27596 1765 -31552 -25212 16588 32320 9810 -23013
133b3013q584L6087L0782k0884l2940p678J6410L4315N816m1486k1685K3866K6908
$$ -23013 -31597 4490 35272 14388 -18552 -26230 -9820 24495 30311 -11175 -32860 -8994 17914
146A7914Q628k1738l4795P322L8388J1260j9561k6547p410K9620K6174j4987k9250
$$ 17914 26542 4804 -29991 -22669 15719 26979 7418 -19129 -26539 3081 29255 14268 -14982
159a4982r930J8113L0213r01l3166j3546J5201K1962J1538k1178k8626Q863K8831
$$ -14982 -24912 -6799 23414 22513 -10653 -24199 -8998 12964 24502 3324 -25302 -16439 12392
172A2392Q722j3431k3371o367K5001J9564j0627k1601j1517J4534K6450j587k5500
$$ 12392 21114 7683 -15688 -22055 2946 22510 11883 -9718 -21235 -6701 19749 18162 -7338
185g338j1898Q986K0386J2146j9960k3670Q042K1142J0118q775k3575n297K2372
$$ -7338 -19236 -10250 10136 22282 2322 -21348 -13306 7836 17954 9179 -14396 -19693 2679
198B679J5924q847j7714j0409J2344K2952j523k0919j0981P229J9006Q263j7148
$$ 2679 18603 9756 -7958 -18367 -6023 16929 15406 -5513 -16494 -9265 9741 18004 856
211H56j7408N787J5979J0406p222k0779l573J8342J1724m505j5127j0791J1167
$$ 856 -16552 -10765 5214 15620 8398 -12381 -15954 2388 14112 9607 -5520 -16311 -5144
224e144J8966j670j5074j0166M142J6489Q324j4706j4284L303J3181J0196o235
$$ -5144 13822 12152 -2922 -13088 -8946 7543 15867 1161 -13123 -9820 3361 13557 7322
237G322j7609k605J4306J0279k502j4006r352J0025J5149q32j1903r477K828J5706
$$ 7322 -10287 -12892 1414 11693 9191 -4815 -14167 -4142 11007 10175 -1728 -11205 -8377 7329
251G329N624j1542j1359J178J1065R558n897j4491k091J0833R497j291j2138q075
$$ 7329 12953 1411 -9948 -8770 2295 11853 5956 -8535 -10626 207 9704 8413 -3725 -11800
265a1800Q290J1834P54r719r313K791J3047M755r095r640j44R720Q951n410j1862
$$ -11800 -3510 8324 9078 -641 -9954 -7163 5884 10639 1544 -8096 -8240 1480 10431 5021 -6841
280f841k265Q296Q959o19j0845o614O839R876J249p898q640K281J0494M461o758
$$ -6841 -9106 -810 8149 7530 -3315 -9929 -3090 6786 8035 137 -8503 -6222 4272 8733 1975
295A975q610p50Q763P376m064r814k943P146Q205r50r176n080N155Q212J773o931
$$ 1975 -6635 -7385 1378 8754 4690 -5124 -8067 -921 7284 6334 -2842 -7922 -2767 5445 7218 287
311B87p818K278R213L357n396p272j278P493O947l861p959k218M929P115l81p399
$$ 287 -7531 -5253 3960 7317 1921 -5351 -6629 864 7811 3950 -4009 -6227 -1298 5817 5436 -1963
327a963n234M206P260K243o088o763J763P173L720m115o712j199O621N069k090
$$ -1963 -7197 -2991 4269 6512 424 -6339 -4576 2597 6317 2202 -4510 -5709 912 5981 3891
342C891o963k797M548O232O4o364m548L009O433K143n195n750J307O245L222l143
$$ 3891 -3072 -5869 -1321 4911 4975 -1389 -5937 -2928 3505 5648 453 -5297 -3990 2255 5477 2334
358B334o209j516N492N121k143n489k556L470N712M42n188m588K374N890J723
$$ 2334 -3875 -5391 101 5222 3079 -2410 -4966 -1496 4216 4658 -530 -5118 -2744 3146 4869
373D869m464m919P95N268L196k575n314j309M781M123j367n301k546L147N207
$$ 4869 405 -4514 -3719 1549 4745 2170 -3144 -4453 328 4451 3084 -2217 -4763 -1616 3591
388C591M21m737l722K000M487K069l522l953O0M368L118k309m671q76L394L578
$$ 3591 4012 -725 -4447 -2447 2040 4109 587 -3366 -3306 1062 4180 1871 -2800 -3676 -282 3296
404C296n33m163k367K258M477N09l769l370J261M347J839l106l642J80L321K960
$$ 3296 2763 -1400 -3767 -1509 2968 3477 -292 -3662 -2401 1946 3785 679 -2963 -2783 538 3498
420C498j871l651j548L124L921r09l838j951J751L906N93k914l239J292L431J623
$$ 3498 1627 -2024 -3572 -448 3473 2564 -1274 -3225 -1474 2432 3025 111 -3128 -1836 1595 3218
436C218k515l735K24L339K576j196l835q05K193L000j67l001k185J944K900M93
$$ 3218 703 -3032 -2808 531 3107 1911 -1924 -2729 -536 2464 2297 -704 -2889 -945 1955 2448
452B448k959k552J540K444J938j963l271NK745K149j039k885j300K192K839n86
$$ 2448 -511 -3063 -1523 921 2859 896 -2375 -2370 375 2524 1485 -1400 -2700 -508 2331 1745
468A745k252j795R19K840O96k076k239L76K904J629k030k773l8K140K272q14k852
$$ 1745 -507 -2302 -1383 1457 2153 77 -2162 -1786 1118 2747 717 -2056 -2094 46 2318 1504 -1348
485a348r82J813K503m23j783k041Q39K766R28j897k231K43K048J868j795k017
$$ -1348 -2330 -517 1986 1563 -220 -2261 -1422 1344 2272 375 -1856 -1613 435 2303 508 -1509
501a509l52K144J538j62k464j141J219K228K66k073j505Q60K197M73j090k351
$$ -1509 -1861 283 1821 1659 -805 -1946 -727 1501 1767 -306 -1811 -951 1246 1719 629 -1722
517a722J54K094J509j344j832o13J725J631j03k381q23J227J716M78j879j746
$$ -1722 -1568 526 2035 691 -1141 -1754 -29 1602 1499 -882 -1705 -478 1238 1716 -163 -1909
533a909R14J825R14j481j844L6K107J284p51k382l69J720J437m94j624j007J202
$$ -1909 -995 830 1744 263 -1581 -1545 562 1846 1095 -1287 -1656 64 1501 1007 -617 -1624 -422
550d22J662K72j453j628P95J424J000j223j551o13K033J083r82j466l45J415J325
$$ -422 1240 1512 59 -1569 -774 650 1650 427 -1124 -1737 296 1379 397 -1069 -1414 1 1326
567A326m08j743m40O29J853J56j487j485P22J514M51m17j926L22J074J225p70
$$ 1326 918 -825 -1265 -636 1217 1373 -114 -1599 -877 637 1088 671 -1255 -933 141 1366 596
584E96p92j016J026J627l34j403q51N85J626M05j479j147K39J391P56o40j614
$$ 596 -196 -1212 -186 1441 1107 -296 -1147 -562 1064 1469 -10 -1157 -918 473 1229 589 -1025
601a025K96P41J045l43j320o74J126R95j51j193k82N08J099J04r13p88R5R63Q34
$$ -1025 -729 12 1057 714 -606 -1280 -154 841 690 -503 -785 -277 822 926 13 -775 -680 283 1117
620A117o67j284k30J294O28l71q12r57Q96J425j19j196m26M48O23N02p26j055
$$ 1117 450 -834 -1064 230 858 487 -325 -1282 -386 1039 920 -276 -702 -254 369 871 145 -910
638i10K05Q71R35o08j004j66O59Q71l04j122o51J155Q84l28m52j205R79Q52J67
$$ -910 -705 166 1101 493 -511 -677 -18 853 549 -573 -1224 -69 815 487 35 -1170 -191 661 828
657H28p89j020L65Q73P73m51j317J02P60N75o6q64n17O76R47k13n86p94K60J190
$$ 828 39 -981 -616 257 1030 579 -738 -636 124 699 633 -231 -748 -72 875 662 76 -718 -458 732
677G32m0p31l42l27P34J014p45r82j46O94Q35l67m31r76P14J155j57n63p89L52
$$ 732 692 -39 -381 -708 26 1040 295 -687 -833 -139 696 329 -102 -1078 -364 791 634 71 -718 -366
697c66O76K9m65l93j65Q21M26k57r13k20P87J010p17p57k59Q10N10k77l95l64
$$ -366 310 339 -126 -519 -684 137 563 306 -607 -827 -40 970 253 -504 -763 47 557 280 -115 -479
717d79N07L63L22n81q29K42N18L85k39p12j60N71P07k00o94m07N23O95N6l93p85
$$ -479 28 391 713 132 -697 -455 63 448 209 -503 -663 -92 615 415 -279 -686 -163 532 588 195 -590
738e90M74M78L60m09r86R3P91M28o52o32l0O72O72j21q67NJ30N25L65j014k19
$$ -590 -116 362 722 313 -673 -580 211 639 -13 -645 -675 -3 669 548 -319 -314 -184 341 706 -308 -527
759e27M8Q51K10k66p15R6L75M86m07m55m05P51L80R3o44l66J49J064k41m08p85
$$ -527 -479 372 582 316 -399 -303 72 558 151 -304 -709 42 422 515 -129 -495 -346 718 477 69 -716
780g16L69N18J04j90m22k08N41L90k85n37K76J19L91M9p86k65N24M01M9k45n55
$$ -716 -347 171 275 85 -337 -545 -4 386 101 -436 -160 -41 350 399 -387 -652 -128 273 322 77 -478
801d78K29O20K37o39l38K14J99L05K21r05k62M99N73j70o79l20N69O14l0o35n11
$$ -478 -249 371 608 -31 -369 -155 44 349 570 -335 -597 -98 475 305 -374 -694 -125 489 459 -176 -687
822f87M00N01L33j80q35J04J19L51J29m86n32R19j6L73o07k55R6N50jm14l63J14
$$ -687 -287 214 547 367 -468 -364 -245 106 235 -251 -783 136 120 493 -114 -369 -273 277 276 -138 -501 -387
844c87N39K18m25m36J56L13L46j9o26k49N85J78o6k87j60q5M72M33m96k95K32
$$ -387 152 370 -55 -491 -335 -22 324 305 -321 -570 15 193 127 -160 -320 -405 67 500 4 -291 -59
865e9K71K33m12k48n1J77J99L2l64j04M70J22K8j83o75K05O63j01m95o8l7N70
$$ -59 212 445 33 -215 -266 -89 110 142 -222 -326 144 266 294 111 -564 -359 304 203 -292 -360 -397 173
887A73Q1l15q1k47J68M29q0m64n2J87N75j69l84l83K97N72k61j7j67RL54Q8p3
$$ 173 254 -61 -142 -389 -221 208 128 -336 -388 -201 374 205 -179 -562 -265 307 46 29 -138 -129 225 313 240
910B40m53Q1N25M1j23l65j88M5L80P3l27l13K83K94No2l55K39L3M27n64p7k23
$$ 240 -213 -132 393 434 311 -54 -242 -197 183 256 -71 -384 -101 193 198 136 -219 20 53 480 -84 -161 -384
933c84L57K03k29k73q9K22M13j06N3m86K24L15j45j07O3l70N25p3k5l09J5M91
$$ -384 -27 176 -53 -326 -415 -193 220 114 167 -319 -95 220 75 -32 31 -339 186 113 88 -221 -206 285
955B85n2l46K31k9l82N28K27o08j60J41K44J89k78N0k36K10K5k20J8q2Q4L21j7
$$ 285 233 -113 118 89 -293 235 462 -146 -306 -165 79 268 -10 40 -196 14 39 -181 -163 -245 -161 160 143
978A43n0j23n73Q95ok25k80J16J62K2m31L34mN6j38K01P8p19P85j52J79m31J14
$$ 143 93 -30 -603 292 286 61 -219 -103 59 81 -350 -16 -20 36 -102 99 177 -542 243 91 270 -161 -47
1001d7K64J8j59j60j07J93Q2J91j88k74j92N27M8J31k66p7q9K28P5l39l9K06M55
$$ -47 217 235 76 -84 -191 2 84 275 87 -187 -379 148 196 327 61 -16 -105 123 198 -141 -180 26 481
1024D81l41j39J46n8l51M70m25j94K23L8L15l7P4n85K50K60k05j20j35K82K58
$$ 481 140 1 147 89 -262 208 -217 -411 -188 -150 165 128 202 -383 -133 127 -78 -198 -333 -51 207
1045B07m1k45J14j34K42j73k8j22o6L69l5J08l09K6kK22R1k01r0%Q7J82l64J34
$$ 207 166 -79 35 -99 143 -30 -58 -180 -246 123 88 196 -113 -87 -89 133 224 23 -67 -67 20 202 -162 -28
1069b8N0K38k64N7j02k2q0K77l00o5M87l77L68k49p3L2j7J17J17j53K2K01j27
$$ -28 22 260 -4 53 -49 -71 -151 126 -174 -239 248 -129 239 -10 -83 -51 -68 49 166 13 35 236 109
1092A09J24k56M4l47ON56k52J92l27J30k7j91J72l50K52Q1k2O2k2R6k4K38j90
$$ 109 233 -23 21 -326 -320 236 -16 176 -151 -21 -48 -239 -67 -417 -165 -84 -106 -44 -66 30 6 244 54
1115E4K7j48L34q3j13m9J58L0J10k86j86m4J2M12k17l19J04K01J08J86q9m92L39
$$ 54 81 -67 267 184 71 22 180 210 320 34 -152 -196 -184 228 11 -308 -204 -3 105 291 202 -290 49
1138D9M4N3R5l58k97O06q0j3q9m2Q3j93K83J05k13k04Q3K06O9n09J81J61k0J39
$$ 49 93 146 241 -117 -414 192 112 99 10 -32 51 -142 141 246 33 -171 -88 118 187 -322 -141 20 0 139
1162A39k90q2M10j18Q6l05o4Q9M89o9m04j48lL06k70M29k23m40P11j34k39L3J81
$$ 139 -151 -233 177 59 145 -160 -224 -135 354 285 -119 -267 -270 36 -234 195 -28 -468 243 109 -130 -97 84
1185H4O8o9P3o2J9m47N24n7k23J22j22M23j96k57l6J58J67j43l2j53o9J51M0m
$$ 84 152 83 156 94 113 -334 190 133 -90 32 -90 333 137 -120 -156 2 169 26 -6 -159 -228 -77 -37 -41
1209d1jj41K50j74K07m3k72M1J71J87k5k06J09K01k20J90l83K3J07K19k5p5m08
$$ -41 -42 -183 67 -107 100 57 -215 -174 -3 184 159 -47 62 263 43 233 -150 -127 -20 199 174 99 -309
1232c09J72%J04j0j7K31L3l89M11j75j80n4p7M73j96J3L3j57j05l42J36M85j56
$$ -309 -137 -137 -33 -43 -60 171 204 -185 226 51 -129 -183 -260 213 17 30 63 -94 -199 -541 -405 80 -76
1255g6K95n55K24mL39m28Q2J69L53m16N4j19K17m01M6N51l25J42j26l15K96o0
$$ -76 219 -336 -112 -116 223 -205 -123 46 399 -17 37 -82 135 -266 -220 331 6 148 22 -293 3 -57
1277e7P6k10R9L69j63l15L52k58J97J15j64J68j68K36k49K02l17J70j34J09J16
$$ -57 19 -191 -92 277 114 -201 151 -107 90 205 41 209 41 277 28 230 -87 83 -51 58 174
1298A74j52m5k55M93J85j10j35m92J87K31O4k70j17N44k18j83k59L23k2K94p6
$$ 174 22 -23 -278 215 400 290 155 -337 -150 81 145 -125 -242 302 84 -99 -358 -35 -57 237 161
1319A61l97q5K50QJ72j14J68k11nO2j95N27m00K2R7j1J37k90j62M41k76J85p9
$$ 161 -236 -321 -71 -63 109 -5 163 -48 -53 9 -186 341 -59 -37 60 49 186 -104 -266 175 -101 84 5
1342EmJ85l56P4rj20K85J78j62k13P8N98m76j1M0N5l1j37M8K58j20M9j08J77k47
$$ 5 1 186 -170 -96 -105 -225 60 238 76 -137 -59 539 63 52 92 147 116 -21 27 285 165 214 106 283 36
1367C6j65J69N6r3K6j16K1K85j49rQ8k04J27N2k19J30r2q4L03j93R8k26K95l01
$$ 36 -129 40 96 3 29 -87 -66 219 70 61 149 -55 72 124 -95 35 -57 -141 162 -31 67 -159 136 -165
1391a65R6K15k18k92M13O7n1p1j57K41l95L45k04K55l86L20l45K79r2J32J87J78
$$ -165 -69 146 -72 -364 49 116 65 -6 -163 78 -317 28 -176 79 -307 13 -332 -53 -145 -13 174 352
1413C52n00k41L05L19m35P8k10L18k87J95j23M3K76l7K99k60k81L41l91J89J65
$$ 352 -148 -389 -84 235 -200 -122 -332 -14 -301 -106 -229 -186 90 53 352 92 -189 152 -239 -50 115
1434A15j37k40K64J60k12P0j82K82j0K5l93K91j39k3J19J60j36K9J33k86n5K18
$$ 115 -22 -262 2 162 -50 20 -162 120 110 135 -258 33 -106 -129 -10 150 14 43 176 -110 -165 53
1456E3j68J15N3q1J83k99j09M68j63J13l20N0k14M47p5J04j14nJ68k41J02j56
$$ 53 -115 0 53 -28 155 -144 -253 215 52 165 -155 -105 -319 128 53 157 43 38 206 -35 67 -89
1478h9L00l1Rk58O7j55L57k14L7J26k70J62J39k97K92k25J47r5q8K36j40O7l43
$$ -89 211 180 189 -69 -2 -157 200 -14 23 149 -121 41 180 -117 175 -50 97 2 -86 150 10 77 -266
1501b66Q1J99j1m0J9PJ42k15j42K41m45N62J30m02J03l1K75l59P9K2K64k32mp5
$$ -266 -185 14 3 -37 -18 -11 131 -84 -226 15 -430 132 262 -140 -37 -68 207 -152 -73 -51 213 -19 -23 -98
1525i8j78K25J71k08j0L07mj55L4o1m2J29k69L62n23L74q3Q8l0J03k84r4q3K92
$$ -98 -276 -51 120 -88 -98 209 205 50 84 23 -19 110 -159 203 -320 54 -29 59 29 132 -152 -246 -329 -37
1549c7Q9J6j41j81L35l5m11J96K46j69M5j58Q4j23J94k19K93j77k81M80N6J19
$$ -37 52 68 -73 -254 81 46 -365 -169 77 -92 -47 -205 -121 -244 -50 -269 24 -153 -434 46 102 221
1571B21k7k16k61L36p4j0K73k42j94K35j01k55M37m20J16M89m69J7J52l0Kj11
$$ 221 194 -22 -283 53 -21 -31 242 0 -194 41 -60 -315 122 -298 -182 307 -162 -145 7 -23 -21 -132
1593a32k18K92L68l51R1k06J79j41J02O1N3k60M10m04J52L8N1p3j80J74J71l53
$$ -132 -350 -58 310 -41 50 -156 23 -118 -16 45 98 -162 248 -156 -4 34 85 12 -168 6 177 -176
1615a76L21k29K96m4k98K97l61J73k56M72k70K61J47k39j44K07l1j29lO2k74J56
$$ -176 145 -84 212 168 -130 167 -194 -21 -277 195 -75 186 333 94 -50 157 126 -3 -6 56 -218 -62
1637f2n9J85J48j31j07K9j30K20J34j36k87N02j6r8k41r0L89k89N3L1j78J76K9
$$ -62 -121 64 212 81 -26 3 -127 93 227 91 -196 306 290 192 -49 -139 250 -39 14 45 -133 43 72
1660G2L2k6j85Q3k2J36k77N6l8L89j87j88j13K82k05J03j42K26j81K16K19q5j95
$$ 72 104 78 -107 -24 -46 90 -187 -131 -169 220 33 -155 -268 14 -191 -88 -230 -4 -185 31 250 165 -30
1683c0j01J31j2K85L3k77j91K79j70M10n09K58k38Q6k08L25K00k51p7L1Q1J21
$$ -30 -131 0 -12 273 306 29 -162 117 -53 357 -152 106 -132 -46 -254 71 271 20 -57 -26 55 176
1705A76l30J5l8K56j67j78N53l08J85l59J02N1L7j20n3q3O29l68J63p1J42n31
$$ 176 -154 -139 -177 79 -88 -266 287 -21 164 -195 -93 -42 -5 -125 -178 -261 368 0 163 92 234 -297
1727b97K22N03n73MK42R0k93J53J28J64n84L22q9K4j13R8m14L74L58k08q0L8J84
$$ -297 -75 428 -145 -141 101 191 -102 51 179 343 -241 81 -8 16 -97 1 -413 -39 319 111 31 69 253
1750B53l53J40J51n10L86q4Q7o9P1j50J11k2j60M9J36J9k83L09q6j01NJ09N21
$$ 253 -100 40 191 -319 67 -17 70 1 72 -78 33 11 -149 -100 36 55 -228 81 -5 -106 -101 8 529
1773E29m96k56K82k37m0L54o7ql3K2M0j64l2L56j96j15M0j11j29K44j58j4j05
$$ 529 33 -223 59 -178 -218 136 69 61 28 50 90 -74 -106 250 54 -61 -21 -132 -261 -17 -175 -189 -294
1796b94J66J9K3J77L61n79K20l05K93O8k38K20P8q5j67j53K49J15j64J04k59J52
$$ -294 -128 -109 -86 91 452 -127 93 -212 81 149 -89 131 209 124 -43 -196 53 168 4 108 -151 1
1818AK03o02J63K5L22k23J23O4O2P3l30K52p0K05l31j25K09O8j85K8N2L3j45p9
$$ 1 204 -398 -235 -210 112 -111 12 76 138 211 -119 133 63 268 -63 -188 21 89 -96 -68 -16 17 -128 -207
1842b07J13J61P1l61J48n3j24J74o8N34r5l6k40J7Oj71P8q7K15j8Q3k82L26j91
$$ -207 -94 67 138 -223 -75 -128 -252 -78 -146 388 293 257 17 34 40 -131 -53 -140 75 57 140 -142 184 -7
1866gJ59j87J06K6l93N66k41n6k7L2L62m28K19r9j19K74O4j44k23Q8K7mj83J15
$$ -7 152 -35 71 97 -296 270 29 -27 -54 -22 340 -88 131 32 -87 187 251 107 -116 -28 -1 -5 -188 -73
1890g3L15l07j77k1J18O6J99k83K7K77m65L58l7J37o0R7J07oo9p3m94K11L12l06
$$ -73 242 -65 -242 -263 -145 -79 120 -163 -136 141 -324 34 -3 134 74 171 278 272 203 130 -364 -153 159 -147
1914a47K23J28l61J37Q1k9J25j89O0o2L43n40L24j32l4J7p7L36k54J85l32J15
$$ -147 76 204 -157 -20 61 32 157 -32 28 -34 309 -231 93 -39 -73 -56 -133 203 -51 134 -198 -83
1936h3L29k49l1Q2K4m26L03Lr9J82q6j59j9L19k31J45j01K66l96K31M8l2R1l04
$$ -83 246 -3 -34 48 72 -354 -51 -48 -147 35 -51 -210 -229 90 -141 4 -97 169 -227 4 52 20 111 -193
1960a93J65j62L07k51l8L68q8p3j52j49L21K06j72K6j38o9L7J12o6QJ8j68J30
$$ -193 -28 -190 117 -134 -172 196 108 35 -117 -266 55 261 89 115 -23 -92 -55 57 -9 -1 17 -151 -21
1983b1j74M56j39k25J84Q4j9k6P3j32O7k6m01L77l39J42P7m8J80p7k13R6J58J36
$$ -21 -195 261 122 -103 81 165 146 120 193 61 128 102 -299 78 -261 -119 -42 -90 90 13 -200 -104 54 190
2007A90l93R3k3L6%j61K65o8RN5r0O5J00k54K13K9p4J35p0k91L73O4q0n87N21
$$ 190 -203 -110 -133 -97 -97 -258 7 -61 -52 3 -87 -22 78 -176 37 66 -8 127 57 -234 139 203 123 -464 57
2032E7RJ08l60q7K21R6k27K97N9j45M8J75m10K61n49M71j76j12K64l05Q5J78l12
$$ 57 66 174 -186 -273 -52 44 -183 114 173 28 76 251 -159 102 -447 24 -152 -264 0 -305 -220 -42 -354
2055c54J21K15KJ54k29k8L37m12K74j60J2K49l83K94J5Q3k94OJ2M88J3n95J76
$$ -354 -233 -18 -16 138 -91 -119 218 -194 80 -80 -68 181 -202 92 107 190 -104 -98 -86 402 415 -180 -4
2078dJ59l46M68j54Q7j6L2l37J76j65J99p3j94L27k43r1j5M92o90M88o1p2k29
$$ -4 155 -191 277 123 210 194 226 -111 65 -100 99 26 -168 159 -84 -175 -190 302 -388 100 39 -33 -262
2101b62J44R1p5j41L3K52p6J83k89q6L30m08j04O05j82l8j61jJ49Q2k54K41J8
$$ -262 -118 -27 -102 -243 -210 42 -34 149 -140 -226 104 -304 -408 197 15 -23 -184 -185 -36 46 -208 33 51
2124E1j0J38l06j23K49J61j91Kj83M1L13k31J71J79k33j26P4J56Pk83j02k91O64
$$ 51 41 179 -127 -250 -1 160 -31 -29 -212 -171 142 -89 82 261 28 -98 -24 132 139 -144 -246 -537 127
2147A27j67L63n82K12j32L6K74k94P4L7k26J97M8nM48n67l0M27J12m83J43o2J47
$$ 127 -40 323 -259 -47 -179 -143 131 -163 -89 -52 -278 -81 -33 -38 410 -157 -187 240 352 -131 12 -50 97
2170I7L1n1k30r5J37M17n25P7N5m9l7L71m08J52Nj41J96L4M6R0k36L5L11m89K57
$$ 97 128 77 -153 -248 -111 306 -219 -142 -87 -136 -173 198 -210 -58 -53 -194 2 36 82 172 -64 -29 282 -207 50
2195E0k62K50k67L49p9L6j42j79J02J83J22j73L0j8J17k02J15l3j17l0K15m0k40
$$ 50 -212 38 -229 120 41 77 -65 -244 -142 41 163 -10 20 2 119 -83 32 -1 -118 -148 67 27 -213
2218b13J54J05k12m3J2J86j54O8K52m3M7k33k3j49K15p8j9J10P1k09K42p1k17
$$ -213 -59 46 -166 -209 -197 -11 -165 -97 155 112 159 -74 -97 -246 -31 -109 -128 -18 53 -156 86 15 -202
2241b02L21j94nj10K62j26o5K10J44k24K04l76Q0r5M37l41K03K88k96j84M4M64
$$ -202 119 -75 -80 -190 72 -54 -119 91 235 11 215 -161 -81 -176 261 -80 123 411 115 -69 -25 439
2263D39m30j7o8M76o23P5M57k15l1mj70O4p1P0Q9k70L11j27j12J04K36j25R2l59
$$ 439 9 -8 -76 400 -223 -148 309 94 63 59 -111 -47 -118 -48 41 -229 82 -45 -157 -53 183 58 150 -209
2287b09K49j25Q7J88j29M9k82L81l79K38j28j21L00m33M41j38L6j36k0L28j66
$$ -209 40 -85 2 190 61 110 -172 209 -170 68 -60 -181 119 -314 127 -11 25 -111 -131 197 31
2308C1K47j17m29J15O6J87j43K85l37L88l23k3J76j08K9J68R2m92K44j04r1P2
$$ 31 278 161 -268 -153 -87 100 -43 242 -95 293 -30 -53 123 15 44 212 304 -188 56 -48 -139 -67
2330f7J50J29l56L74k12P8r6k33L08k60M98l58P7j18m1k0K97j86j31P8J7p5L16
$$ -67 83 212 -144 230 18 96 0 -233 75 -185 313 -45 32 -86 -127 -147 150 -36 -167 -89 -72 -147 169
2353A69j48K84n77J44N35l94O2J98j62n9R4j88J48k54O1J96n1k97J19K5j14p4
$$ 169 21 305 -272 -128 407 13 75 273 111 52 146 -42 106 -148 -87 109 58 -239 -120 -95 -209 -283
2375b83K29o7j3J09R1j88Q0k38J71k1L36l57M3J80J11l70K73n2K42l84J26jK25
$$ -283 -54 -121 -134 -25 66 -122 -42 -280 -109 -130 206 -151 -108 72 183 -187 86 34 276 -108 18 17 242
2398B42l88J75%N6j42M42o60L22J23k07j69j79N46J02k18j26%L62k59j55J20p5
$$ 242 -146 29 29 85 -57 385 -275 47 170 -37 -206 -385 161 263 45 -81 -81 281 22 -133 -13 -88
2420h8P2j22J07J47Pj4k06K56J3k7l1P0j87j7M7j05Q8L3K19l30m4O3L17j45k24
$$ -88 -16 -138 -31 116 123 109 -97 159 172 145 114 184 -3 -20 27 -78 10 43 262 -68 -112 -49 268 123 -101
2445a01J3P6q6j88K66j01K55j49J6j79J45J82K51o19K48o8j20N02n04K38j82L58
$$ -101 -88 -12 -98 -286 -20 -121 134 -15 1 -178 -33 149 400 -219 29 -39 -159 343 -161 77 -105 253
2467B53j99oj2J9O3j66J68j56R8j44M04j74j05L18k95q0j77J44L64j35j12k94
$$ 253 54 48 36 55 118 -48 120 -36 62 -82 322 148 43 361 66 -14 -191 -47 317 182 70 -224
2489b24J81K88j92J80j79Q4j59q8K9P9J86M9k85r2K36l33K09k09j58J29M13k10
$$ -224 -43 245 53 233 54 138 -21 -109 -80 -1 185 234 -51 -143 93 -240 -31 -240 -398 -269 144 -66
2511f6k43o5N54l12M8J83k20J38j88J93N0K3k35n3M1P0M7L85n07k1L18k33kK55
$$ -66 -309 -374 180 -132 -84 99 -121 17 -171 22 72 95 -140 -193 -152 -82 -35 350 -157 -178 140 -93 -95 160
2535A60J62p6k74Q2j71J67J78k50J17J03l35L12m04J18J48L34m84K45k21k71N79
$$ 160 322 246 -28 54 -117 50 228 -22 95 198 -137 175 -229 -111 37 371 -113 132 -89 -360 219
2556B19o27L53K2L1J43k19j97M88l48K88j11K00j94J1J69k52L30l6k82Pm5j25
$$ 219 -408 -55 -33 -2 141 -78 -275 213 -135 153 42 242 48 59 228 -24 306 270 -12 -5 -50 -175
2578a75K03m6k16N23n44L62k2k87M77J34k96m72M62r3J27l7o9l6k11L52q9l1q3
$$ -175 28 -18 -234 289 -255 107 85 -202 275 409 113 -359 103 10 137 100 31 -5 -216 136 47 16 -67
2601f7JJ82k62L72j75m6j90K91J14r7l9J59m94K34Jj02P7l11M95l90J60J34K4
$$ -67 -66 116 -146 226 51 5 -185 106 220 123 84 243 -251 -17 -16 -118 -41 -352 143 -247 -87 47 71
2624G1J48k83K28k32j75J77j88J06K0j4nJ88K26m97J35p5r5K37m1r1L7M76j45
$$ 71 219 -64 164 -68 -243 -66 -254 -148 -128 -142 -147 41 267 -230 -95 -170 -265 -28 -69 -160 -123 353 208
2647B08j76j21j71N03j73m31J25L50k58J40k20m9K5N93n19j24N40mj18j83J14
$$ 208 32 -89 -260 243 70 -361 -236 114 -144 -4 -224 -273 -248 345 -174 -298 242 238 120 -63 51
2668E1k54J90O1r5P1jq3M58n26J75k00K35k45OL51l29K30Qj7j2j00KJ77l26K15
$$ 51 -203 -13 48 -47 24 23 -60 398 -128 47 -153 82 -163 -157 194 -135 95 103 86 74 -26 -24 153 -173 42
2693D2K11m93K70P2J28o2k92J20J2L6p5K52k60O2J77k27J85k38k0J83N4l5K10
$$ 42 253 -240 30 102 230 168 -124 -4 8 44 -31 221 -39 23 200 -27 158 -80 -100 83 137 102 312
2716C12j75j1J1j8j02j4k54K29j58K35l2j42j4r9M61l26M33o8j41j60K13m13M26
$$ 312 137 126 137 119 17 3 -251 -22 -180 55 23 -119 -133 -232 229 -97 336 268 127 -33 180 -233 193
2739A93j39qj47J06J09k22J1J9J21mN7k04K50l08L46l86J5M25l83N16k47m7K1
$$ 193 54 46 -101 5 114 -108 -97 -78 43 39 96 -108 142 -166 180 -206 -191 234 -149 367 120 73 94
2762I4J67n2n0K53k73p1l34L35J41j97K43q5k38K67k11K23l84M0J54j19N4R8J64
$$ 94 261 209 159 412 139 68 -266 69 210 13 256 171 -67 200 -11 212 -172 -132 22 -97 -43 55 219
2785B19k74J99j98K1M9k63L32j51M65l07q0J57p0K38k13k85j10M05l12M38n05
$$ 219 -55 144 -54 -33 16 -247 85 -66 399 92 12 169 99 337 124 -161 -271 134 -178 260 -245
2806b45K35K7m8l9K20m8J32m64jL79j79l0L05l32Q3k4J74j86K27j63q9R7j37J08
$$ -245 -10 17 -31 -70 150 102 234 -230 -231 148 -31 -61 244 -88 -5 -29 145 -41 186 23 -66 31 -106 2
2830BJ91m93K42R8j47O2N3K94n1p8m23k0L89k16o5n6M26l4k34K60k58N2O9k41
$$ 2 193 -300 -58 40 -107 -45 8 302 251 173 -250 -270 119 -97 -162 -218 208 174 -60 200 -58 -6 63 -178
2854a78Q4j97M09k43J06j37J90l2k60J34q6J99q8K05k23J31J27J28l86L80l0l55
$$ -178 -94 -291 118 -125 -19 -156 34 2 -258 -124 -210 -11 -99 106 -117 14 141 269 -117 263 233 -122
2876a22K62o5j05r6J96P6j20RJ28L6j93J31j78k4R4K44k76O1J30j6k39J65l61
$$ -122 140 75 -30 -126 70 146 26 35 163 199 6 137 -41 -65 29 273 -3 58 188 172 -67 98 -263
2899b63pK99j23K05j58k48K68Q5j23J23K79k87l3k5L3J63k74K18j7J7m05L98M2
$$ -263 -270 29 -94 111 -47 -295 -27 58 -65 58 337 50 17 -8 25 188 -86 132 115 132 -273 125 167
2922A67j43q9J75k49PL05k02J74l28M14k51O1m2m5J27Q7l99J90K33j57j28O4l33
$$ 167 24 -65 110 -139 -132 173 -29 145 -183 231 -20 41 -1 -46 81 168 -231 -41 192 35 -93 -29 -362
2945c62J29J25KQ5Q1k0n1K51k68K66o80N90k11p8L16n46K60K57k64L0n4j35J00
$$ -362 -233 -108 -106 -21 60 40 -11 240 -28 238 -442 148 -63 -141 175 -371 -111 146 -118 -88 -142 -277 -177
2968a77M9j18L13l54J46J27j3k29K72j01J87q2j34p3n6M3N2L08l15m2J57Nj41
$$ -177 -128 -246 67 -287 -141 -14 -27 -256 16 -85 102 20 -114 -187 -243 -200 -148 160 -155 -197 -40 -35 -176
2991a76K42r6J08J16j07R3j3k45q8M11k92l54M49j14k05J68o7oL61O9m46mM39
$$ -176 66 -30 78 194 87 180 167 -78 -166 245 -47 -401 48 -66 -271 -103 -170 -176 185 254 -192 -196 243
3014B43j68n5Q6l23L42J63J69m10j23r9K65p5K9l6j46M47j60r2J0p6J35k47l7
$$ 243 75 20 106 -217 125 288 457 47 -76 -175 90 15 44 8 -138 309 149 57 67 -9 126 -121 -158
3037a58K6L09l80K63m9o7J55K03j08m63J82j73L34l21K92j35J32O6q4m1J02l5
$$ -158 -132 177 -203 60 11 -56 99 302 194 -269 -87 -260 74 -247 45 -90 42 108 24 -17 85 50
3059E0K29l28QJ82k28N9n6J92j87P9k79L10j38k47L73J66j77j07k1J03j36J41
$$ 50 279 -49 -41 141 -87 -28 -84 108 -79 0 -279 31 -107 -354 19 185 8 -99 -120 -17 -153 -12
3081a2K2j80J04R1o9N6r7K70k58M00l84p1J20k0N9J13l96L42l72M06p3j61K81
$$ -12 10 -170 -66 25 -44 12 -85 185 -73 327 -57 -128 -8 -28 31 144 -252 90 -282 124 51 -110 171
3104A71m36N8J38j73O12l28K1J10n8l9k6K3j99J96l09K18PM8Q0m77R7K17J0j85
$$ 171 -265 -207 -69 -242 370 42 63 173 115 76 50 73 -126 70 -239 -21 -14 34 114 -363 -266 -49 -39 -224
3128b24K64L0k88K28N9M6m7J73l04K74j72K62j93j34p0j73K68J23r0pK24l98p
$$ -224 40 70 -218 10 69 115 68 241 -63 211 39 301 108 -26 -96 -269 -1 122 32 25 249 -149 -156
3151a56K52o1K5K10l42J98j47N7N6j24R8N6k73j0M68l97M15k70j19J60k83J1r7
$$ -156 96 35 60 270 -72 126 -21 36 92 -32 66 122 -151 -161 307 -90 325 55 -64 96 -187 -176 -273
3174b73L10j06K0K9nM4r8k63M43l04J29r2Q9k41O21l83k18K42K71p4j35L9j73
$$ -273 37 -69 -49 -20 -25 19 -79 -342 101 -203 -74 -166 -77 -318 303 -80 -298 -56 215 141 6 45 -128
3197a28p4K52k9J24l74nK77N4r9jk4j11J1J59j19L40l80J33j2Q5K18l32K9j21
$$ -128 -202 50 21 145 -229 -234 43 97 -2 -3 -27 -138 -127 32 -87 253 -127 6 -6 79 297 -35 -6 -127
3221a27O9o7j9L79r8j49N0j8J03k5j19J68l22K05J99n15M31j28j24L09j91k48
$$ -127 -58 -125 -144 235 137 -12 38 20 123 98 -21 147 -175 30 229 -286 145 17 -107 202 11 -237
3243b37J02J30k16j0K00R8j98J56j70PJ73j37k32M65m47O0J81K59l89M49k09k8
$$ -237 -135 -5 -221 -231 -31 67 -131 25 -145 -138 35 -102 -334 131 -316 -256 -75 184 -205 244 35 7
3265Gj84L07q7j17K40k54O8J9j36J77R1m37K57K18j34P3J07l69J32N7J58l33K84
$$ 7 -177 130 43 -74 166 -88 -20 -1 -137 40 131 -306 -49 169 35 108 215 -154 -22 35 193 -140 144
3288A44j87J79j30j77J2K63J1J37j8j44j13q7L67q8k61J39j12o2Q9J09j58j77
$$ 144 -43 136 6 -171 -159 104 115 252 234 90 -23 -110 257 169 -92 47 -65 -127 -38 71 -87 -264
3310b64K01L37l23J3J03J15lj94J4o1K66o8k50lj87K76L1K12k74L3J95l19K29
$$ -264 -63 274 -49 -36 67 182 179 -15 -1 -62 204 136 -114 -117 -304 -28 3 215 -59 -26 169 -150 79
3333G9k07J39j9kk54K77Q3j52L44k38k39J59j57j6J00P6J8j00J47J55j97K15l03
$$ 79 -128 11 -8 -10 -264 13 96 -56 288 50 -189 -30 -187 -203 -103 -27 -9 -109 38 193 -4 211 -92
3356i2L50m86K34p2P4p7O1L58l70K17P4l24j46J02J10J8N1j26N1J76P4j66K2q3
$$ -92 258 -228 6 -66 8 -69 -8 350 -20 197 271 -53 -199 -97 13 31 82 -44 7 183 257 91 113 30
3380C0k1lJ46k14n4j88M37k27K52L3L6k09j62N7J65l72Q7L93r5n3j81K32k20K30
$$ 30 9 6 152 -62 -116 -304 133 -94 158 191 227 18 -144 -87 78 -294 -207 186 91 38 -143 89 -131 99
3404I9K7l72K09K59J6J2j72k50N8K81k80J29j58Q9J42M3nk60L62n03O52n26m4
$$ 99 126 -246 -37 222 238 250 78 -172 -114 167 -113 16 -142 -53 89 132 127 -133 229 -274 378 -148 -192
3427a92J77K99j58r6k04j47j16L54l84P93j54l83J47N6J34q3l3J62J8k52J35j18
$$ -192 -15 284 126 30 -174 -321 -437 -83 -467 326 172 -211 -64 -8 126 43 10 172 190 -62 73 -45
3449d5J93k33Q4p5O0K92k60K91l14M4J12l63K78J03l29L0K53j29J37j67K19m77
$$ -45 148 -85 -1 -76 -16 276 16 307 -7 37 149 -214 64 167 -162 -132 121 -8 129 -38 181 -296
3471b96K89l50O87pm78P1J43p3Pj16N9J87l01L0K77j98l3J85o3n1m32M90J09L6
$$ -296 -7 -357 330 323 -155 -84 59 -14 -7 -123 -64 123 -178 -148 129 -69 -102 83 20 -31 -463 27 136 172
3495A72j81j34L97j98l6k4r4J67l97K08K19K8L6K8k82L43k77J19J37m58J54K21
$$ 172 -9 -143 254 56 20 -4 -98 69 -328 -120 99 127 163 191 -91 252 -25 94 231 -227 -73 148
3517A48j81R0J48m05J87l78J97K99o9p3o2K75l23J59k76M48j69k06j05K56j3l4
$$ 148 -33 57 205 -200 -13 -391 -194 105 36 -37 -99 176 -147 12 -264 184 15 -191 -296 -40 -53 -87
3539h7O1PJ79K2o00N32J75l10P7j70j76L53m24J82J36J35k45L66j28K32n5l66
$$ -87 -26 -19 160 182 -418 114 289 -21 56 -114 -290 63 -361 -179 -43 92 -153 213 85 317 262 -104
3561a04OJ36J08K3q2k17J85j44pj2M8K52k27m9J00j53n3L58m29L76m9q9O7L0n63
$$ -104 -98 38 146 169 87 -130 55 -89 -96 -108 -60 192 -35 -84 16 -137 -190 168 -261 115 66 -23 44 74 -489
3586d89K26N91l75J03l1k3RK52l87k0N2J08k82K92L5K10k55m93M05K9r8J53m7
$$ -489 -263 328 -47 56 25 2 11 263 -124 -144 -92 16 -266 26 61 271 16 -477 -72 -43 -141 12 -35
3609c5K15j71K17k18l18L47k9j31J91l02K08J31p9r0J20Q3l02L27k80J88j74l56
$$ -35 180 9 226 8 -310 37 8 -123 68 -234 -26 105 26 -64 56 139 -163 164 -116 72 -102 -458
3631d58L43K79l11J10R0K76l47N16o69J89K27j75l64O19k82k14N06k15o3Q0l3
$$ -458 -115 164 -147 -37 53 329 -18 498 -171 18 245 70 -294 325 43 -171 335 120 57 137 104
3652A04K58j72k30J07J6O5n33J77J69K02o8J62k87r2K80j28kr0J47j74J75l60
$$ 104 362 190 -40 67 83 148 -385 -208 -39 163 95 257 -30 -122 158 30 28 -62 85 -89 86 -274
3674b74J20R7L20l05J23l29J36o6J35PP6j07k03Q9R2J23j61L37j61j61K09m3m3
$$ -274 -154 -57 263 -42 81 -248 -112 -178 -43 -36 40 -67 -270 -181 -89 34 -127 210 49 -112 97 54 11
3697A1L36l08k82J78M8p2J56K39k68K29k78p5R0J29j18L1jQ8k03L7k99J67pL5
$$ 11 347 39 -243 -65 -17 -89 67 306 38 267 -11 -86 4 133 15 46 45 133 -70 -33 -332 -165 -172 -137
3721a37K20n4qj38J16Q5o6L8j68K29k63n6J2K02k17J43NK24k20j00j6lL37J22
$$ -137 83 29 21 -117 -1 84 18 56 -112 117 -146 -202 -190 12 -205 -62 -57 167 -53 -153 -169 -172 165 287
3745B87k17k6J34j46J35k78K62k0J80j68n58L86L2j96n7K19P2l5J80l30J56k04
$$ 287 70 44 178 32 167 -111 151 131 311 143 -415 -29 3 -193 -250 -31 41 6 186 -144 12 -192
3767a92K60k3j22K2j36K03ln6J7j33L40Jo4J12j56L4n6K51k94M5l37k6N91k05
$$ -192 68 45 -77 -55 -191 12 9 -47 -30 -163 177 178 114 226 70 104 48 299 5 50 -287 -313 278 73
3791G3J86p55O14j76j71R8J65O9r9J31j79K61j75k93L0L03j63L9J15j1o8M2j94
$$ 73 259 -496 118 -58 -229 -131 34 103 4 135 -44 217 42 -251 -221 82 -81 -42 73 62 -6 36 -158
3814a58L52Ll41jL33j08m49K14M88m40m6M3K53k87K00J67j75J97l29K5J59l7l19
$$ -158 194 197 -144 -145 188 80 -369 -155 333 -107 -153 -110 143 -144 56 223 48 245 -84 -59 100 63 -256
3837b56P1L00j1k09oJ21j28O5m0P7M0k59L1J78L35j28m69J04L78J12j93j08R8
$$ -256 -185 115 104 -105 -111 10 -118 -53 -93 -16 24 -235 -204 -26 309 181 -288 -184 194 306 113 5 103
3860A03j53j11L1L63j98j14R9m1J40l18M2J22J94m10mK20J44L20m88J81o0l12
$$ 103 -50 -161 -130 233 35 -79 20 -21 119 -199 -157 -35 159 -251 -255 -35 109 429 -59 122 62 -250
3882b50R5L83j9l54J43K0j79L45n3k65j5O8J42k51J74r9l6J53J21l2l93K93k97
$$ -250 -155 228 209 -145 -2 18 -161 184 131 -134 -149 -81 61 -190 -16 -115 -151 2 123 91 -302 -9 -306
3905c06J7L44k41O03j88n82N62K1k30j26K66L5m5k68L6K80n6o3k5j47M23r9j23
$$ -306 -289 55 -186 417 229 -353 209 230 0 -126 140 175 130 -138 -102 178 122 59 34 -113 310 211 88
3928H8K55m10p1K7J02j33R7k10K77k73n4K88k6L1k87j0N80k99J33k82o6K02J05
$$ 88 343 -67 -138 -111 -9 -142 -45 -255 22 -251 -305 -17 -43 -12 -299 -309 271 -28 105 -177 -243 -41 64
3951F4r7K67l10L39l24L0L24k26K13j98l17J93p1K7ok2L04J44k72k17L70j46p7
$$ 64 -33 234 -76 263 -61 -31 293 67 280 82 -235 -42 -113 -86 -92 -114 190 334 62 -155 215 69 -8
3974hJ6L57l42L0m4q8P7j4q7L78p6m59L25j67K36o3K24Om67L09J56k47K80n25
$$ -8 8 365 23 53 9 -79 -2 -16 -103 275 199 -260 65 -102 134 71 295 301 -166 143 299 52 332 -193
3998a93L0R3K77r5k12J18j69M03q3l45p2P0j18L59P0N0J21k84J53k31J46%o7J15
$$ -193 -163 -70 207 112 -100 18 -151 252 169 -176 -248 -178 -296 63 133 183 304 20 173 -58 88 88 21 136
4022A36l12M16j05J00N7l10K6N1j56P3O0k77L84m06K58k75J84J00K27j84P7o05
$$ 136 -176 240 135 235 292 -18 8 59 -97 -24 36 -241 143 -263 -5 -280 -96 4 231 47 124 -481
4044d81M32m4J60K25o81K24M66l25l46N51J84p52M72M9j30O0j05J53k95L05o9
$$ -481 -49 -93 67 292 -389 -165 301 -24 -370 181 365 -387 85 134 4 64 -41 112 -183 122 53
4065E3k13K27k3q0M2J2NM5J62m26K68j57J17J49j72K14j31l19J20Q9P7k95M35
$$ 53 -160 67 44 -36 6 18 23 68 230 -196 72 -85 32 181 9 223 92 -227 -107 -18 59 -236 199
4088A99q1j19j57L57l55K28J8j91R6j50L69m36J85j01J56k8O1L2k80K10j19r4
$$ 199 118 -1 -158 199 -156 72 90 -101 -5 -155 214 -222 -37 -138 18 -10 51 83 -197 13 -106 -200
4110b00k3J56K47j77k06J02J03j8J02k07j2J19J16k02K43m05N3L69j38n7m7K42
$$ -200 -223 -67 180 3 -203 -101 2 -16 86 -121 -133 -14 102 -100 143 -262 -209 160 22 -35 -82 160
4132A60MP1l76L42n65N00O5n8n3m9N09m48j30r0J17j48K50j57J17j60o2%P1L72
$$ 160 164 235 -141 201 -364 136 201 143 90 41 550 102 -28 -118 -1 -149 101 -56 61 -99 -161 -161 -90 282
4156B82m74QJ70j99M3K23j7l4k24r6L71j31o6J36j25K42p0J95l43K85P9m89M04
$$ 282 -192 -184 -14 -213 -170 53 36 2 -222 -318 53 -78 -144 -8 -133 109 39 234 -109 176 255 -234 170
4179A70P9j95Q4k18J05K05l08K38l6m0j92L11j4j71Lk44K05j65K16J45l72L32
$$ 170 249 54 138 -80 25 230 -78 160 124 84 -108 203 189 18 21 -223 -18 -183 33 178 -194 138
4201A38j97k2M1l85N05j94J8n8R8J8K32j34q5k22L45j72q1J2kP8j97O53m6k83
$$ 138 -59 -81 -40 -425 80 -114 -96 -154 -56 -38 194 60 -25 -247 98 -74 -155 -143 -145 -67 -264 389 343 60
4225F0j74RK62n5l18L49j6J29l79j09N25r2k34L12k52j09K66k7j32K09m31J62
$$ 60 -114 -105 157 102 -216 133 117 246 -133 -242 283 191 -43 269 17 -92 174 147 15 224 -207 -45
4247d5O4J09k17L14j54N9m61J36j17N85j62k94K58k18M12k38j73p3k2k0K73r4
$$ -45 19 128 -89 225 71 130 -331 -195 -312 273 111 -183 75 -143 269 31 -142 -215 -237 -257 16 -78
4269g8MJ3j13J10Q2j83J68j27j57K32j27K27j14K88m76N7L69k45Pk48N28k5j56
$$ -78 -74 -61 -174 -64 18 -165 3 -124 -281 -49 -176 51 -63 225 -251 -194 175 -70 -63 -311 217 192 36
4292C6J91k12J2j12J49j89J66m80L75K64j67k69N3J86l61M21k01J51L04m64M1
$$ 36 227 15 27 -85 64 -125 41 -439 -64 200 33 -236 -183 3 -358 63 -138 13 317 -147 -106
4313a06K47k31K05m56M87j71L31l41p6K24q9k46K71J04O4k37k9P1r2j17M29q0
$$ -106 141 -90 115 -341 146 -25 306 -35 -111 113 24 -222 49 153 217 -20 -49 22 -70 -187 242 162
4335A62k85p6R1J36j65K10j32J57OJ36lk80j47K75k40J32J04j96j00J42L06n24
$$ 162 -123 -199 -108 28 -137 73 -59 98 104 240 237 -43 -190 85 -155 -23 81 -115 -215 -73 233 -291
4357b91M72k64R3r1J79p6J2K07l07J51k16P0j55J77L74m0l48k7N2K25j34k2k48
$$ -291 181 -83 10 -81 98 22 34 241 -66 85 -131 -61 -216 -39 335 295 -53 -80 -28 197 63 41 -207
4380b07K92k78L87j75K32O3l94N0n7K71k31J36J57l31J32L5K89l51J31k83J55
$$ -207 85 -193 194 19 251 314 -80 -30 -87 184 -47 89 246 -85 47 82 371 20 151 -132 23
4401B3k38K06k09kJ62K51m19L70p1k59J22K82M7m77L78l11N1J5K10j7P1l51k47
$$ 23 -215 -9 -218 -220 -58 193 -226 144 73 -186 -64 218 265 -212 166 -145 -94 -79 131 114 185 -166 -413
4424d13L96M07l94Kj43L31l14J41q7J45l31K74P1k81L38k39Q8L37k92k51J39K89
$$ -413 -17 390 -4 -2 -145 186 -128 13 -74 71 -260 14 85 -196 142 -97 -9 328 36 -215 -76 213
4446B13k10k17K97r5K5k69L35k56K49mj11J05Rn67L63j20K71L03m9m28p6N58m57
$$ 213 3 -214 83 -12 13 -256 79 -177 72 68 -43 62 71 -496 -133 -253 18 321 272 -156 -232 326 -131
4469a31P7L99k56q5J38j23p9J27m0N5j19L4L9k5q0J72j90p9L77k33k00M18j88
$$ -131 -54 345 89 4 142 19 -60 67 27 82 -37 -3 36 11 -69 103 -87 -166 211 -22 -222 196 8
4492HJ39J05j77p9J12j32j58L78k30o9K71m24K90j12l56K56N1K28q7j11L5kk0
$$ 8 147 252 75 -4 108 -24 -182 196 -34 -103 168 -256 34 -78 -434 -178 -127 101 14 -97 -62 -64 -84
4515h4l6J53l77O81m42K42n18M3M78n7n5n1L24j84M0k25K59m70N16m65J87K63
$$ -84 -120 33 -344 337 -105 137 -381 -338 140 83 28 -23 301 117 157 -68 191 -279 237 -228 -41 222
4537B22L8n16P9P4l2KL61k00j13K09q9l43L88K8J44j25p8O8m22N49n32M36l02
$$ 222 260 -256 -177 -103 -135 -133 228 28 -85 124 35 -308 80 108 252 127 49 117 -305 244 -288 148 -154
4560a54J41O9k98K43Q3o0O9k3m1MQ0q2j66J21J7j80L43J81k25P4m66K50L1j63
$$ -154 -13 56 -242 1 84 24 93 70 29 33 113 31 -135 -14 3 -177 166 347 122 196 -270 -20 11 -152
4584a52J53L11k68q5M1M30n35K67j54k6J41p3K79j46q1j09o5J84J92j29N9k74
$$ -152 1 312 44 -41 0 430 -105 162 8 -18 123 50 329 183 102 -7 -72 112 304 175 234 -40
4606d0J95M9k20k66M91l15J08J08j33K76n5k71J19k29O3L46j38l51M33j62j53
$$ -40 155 204 -16 -282 209 -106 2 110 -23 253 198 -73 46 -183 -120 226 88 -263 170 8 -145
4627a45L75j93m9j57J60J64l2r6j52K95l75N5J11J98m35M56k70M42j23l7M1m4
$$ -145 230 37 -12 -169 -9 155 123 27 -125 170 -205 -150 -39 159 -276 180 -90 352 229 192 233 189
4649A89j37J46j96m1J57P3j12j00m1J38j34Q9j92j6L70P1k49M7j44r4J28j78J32
$$ 189 52 198 2 -39 118 191 79 -21 -62 76 -58 31 -161 -177 193 264 15 62 -82 -176 -48 -226 -94
4672i4K9J48K5N0j58J73J15m23M4O1j04L20j5j26J95m18N3K04j08j07L8p0M6L87
$$ -94 -65 83 108 158 0 173 288 -135 -91 -30 -134 186 171 45 240 -178 -125 79 -29 -136 -98 -168 -122 265
4696B65m18m9K64P3J53m69J93j8j2R0l8j76n1K54J38l25K23l22K9J20R8P6Q6l08
$$ 265 -153 -202 62 135 288 -181 12 -6 -18 72 34 -142 -193 61 199 -126 97 -225 -196 -76 22 98 184 -124
4720a24L7K44m43M45k9j79jK60k39j78J92j74K54j77J31j10J65l37J86J39Nj11
$$ -124 -87 157 -286 159 130 -49 -50 210 -29 -207 -15 -189 65 -112 19 -91 74 -263 -77 62 67 -44
4742d4J80k47K89P0m50nJ77Qn5j37J74j84N4L87n5q6j23M19l95q9Q1J06J6k59
$$ -44 136 -111 178 248 -202 -207 -30 -22 -77 -214 -40 -224 -170 217 162 76 -47 372 -23 -112 -31 75 91 -168
4766a68L56J26m53K63r3j49J6J22k7j12QK23m1k74J81K21l00M0J24j47K2n1K50
$$ -168 188 314 -139 124 31 -118 -102 20 -7 -119 -111 112 71 -203 -22 199 -101 -61 63 -84 -62 -113 137
4789A37l17K73k35J46jq3J68o2M5M7j37j57L63M2r0m25K68J52n7o9l05J43L52
$$ 137 -180 93 -142 4 3 -80 88 26 71 118 -19 -176 187 229 139 -286 -18 134 77 8 -297 -154 198
4812A98m08K02k11L73L9m19L64j89j61J42K09N3l41l1r0K08J97l5J57m17P7K71
$$ 198 -210 -8 -219 154 193 -226 138 -51 -212 -70 139 192 -149 -180 -270 -62 135 100 257 -160 -83 188
4834A88m32M8J22P5J74j85L17m09K01Ql5J91m99j5K37k31k65L73K7M09k92J81
$$ 188 -244 -196 -74 1 175 -10 307 -102 99 107 72 263 -236 -251 -14 -245 -510 -137 -110 299 7 188
4856A88j32k28M61j78r1J73j88l67M50k92L00k49L56o6k16J77j06r2K41k62J40
$$ 188 56 -172 289 111 20 193 5 -362 88 -204 96 -153 203 137 -79 98 -8 -100 141 -121 19
4877A9J33M7j53q1p6P9jN3m5Q4J02j85j17r2L01n0N7L6j37Q2J71j98L21n88K30
$$ 19 152 199 46 -35 -111 -32 -33 20 -25 59 161 -24 -141 -233 68 18 75 111 -26 56 227 29 350 -238 -8
4902hJ63j74J20m4n1j4j87K19K2j10K37j97O9qJ87K1j88RO9J83l93j82L09q3m3
$$ -8 155 -19 101 57 6 -8 -195 24 46 -64 173 -24 45 37 224 245 57 66 135 318 -75 -257 52 -31 -74
4927g4P6J06q3k9N2J20j8m2l20j69L48j72K97j12q9K69l18P4J29N7M2m78K02P4
$$ -74 2 108 25 -4 48 168 150 108 -212 -381 -33 -205 92 -20 -109 160 -158 -84 45 102 144 -334 -132 -58
4951e8k00K59j21J15p3K42q7j11K61m00J51J83J03l36L03J70m00J23n2k77M92
$$ -58 -258 1 -120 -5 -78 164 77 -34 227 -173 -22 161 264 -72 231 401 1 124 72 -205 287
4972B87l54P5K97j93j01k5m0L44k06Pk7j87J36Q2R6j59q7L96k51p3j1j45K31m2
$$ 287 -67 8 305 112 11 -14 -54 290 84 91 64 -123 13 95 191 32 -55 341 90 17 6 -139 92 50
4996E0J57j5j5n4Q5o6N4l25K77l54J4K58M9k36K56o6Q8j16Q2L5j89J22N5n6l5
$$ 50 207 192 177 123 208 142 196 -129 148 -206 -192 66 115 -121 135 69 157 41 123 158 -31 91 146 90 55
5021E5J5%j63O7L0o4R5L18k96L6j82j91K54J69p6N4n0K86k48k83j30K88r2j4L27
$$ 55 70 70 -93 -26 4 -60 35 353 57 93 -89 -280 -26 143 67 121 71 357 109 -174 -304 -16 -108 -122 205
5046B05m5l73k5L78l60j4J97j37K15j75J38K02j54j57J42k96K47o5M2MKl00M69
$$ 205 160 -213 -238 140 -220 -234 -37 -174 41 -134 4 206 52 -105 37 -259 -12 -77 -35 -31 -29 -329 140
5069A40q7o6R2O6m94L31J57j70J8R5J26k52P3J01q2j15P7M6j37J52P7l20J90l6
$$ 140 53 -13 79 145 -349 -18 139 -31 -13 82 208 -44 29 130 48 -67 10 56 -81 71 148 -172 18 -18
5093a8O5j01K08n3j46N2L70o00J90Np4j54pO5O5J44j1K5j40J38k53K96K05m84
$$ -18 47 -54 154 101 -45 7 377 -223 -33 -28 -102 -256 -263 -198 -133 11 0 25 -115 23 -230 66 271 -213
5117b13K87j92N39m23K59l46p4K63j96M98j40Ol68l12O89l79J33K05k57l1J31
$$ -213 74 -118 421 -2 257 -89 -163 100 -96 402 262 268 -100 -412 277 -102 31 236 -21 -52 79
5138G9j9j31K45l3j26J90p0j7R3q2j45K71j72J59l94L98k93L70k81j29j32K95
$$ 79 60 -71 174 141 15 205 135 118 211 129 -16 255 83 242 -152 246 -47 323 42 -87 -219 76
5160G6l05J72p3pk65M85k10J60J70p2K61m19M1j80K50j01K00l91K34J04j51O8
$$ 76 -229 -57 -130 -137 -402 83 -127 33 203 131 392 -27 14 -166 84 -17 183 -208 26 130 -21 47
5182D7K23k94q4J24J05M8j7l53J87j93J64k63L44k9L3N3q1j00j09K41J91n9k63
$$ 47 270 -24 -108 16 121 169 152 -201 -14 -207 -43 -306 38 9 42 95 14 -86 -195 46 237 178 -85
5205h5l4J38O0L1j49J49l06J35k14L03j22J5k18J57n4O3K70k1j4k85K50L7J07
$$ -85 -119 19 79 110 -39 110 -196 -61 -275 28 -94 -79 -297 -140 -194 -131 139 118 104 -181 69 106 213
5228B13j94j70L03l47N8K47l49N80j60m95L41j23M1J67jm7J40j63q4N5m4J70N8
$$ 213 19 -151 152 -195 -137 110 -239 341 181 -314 27 -96 -55 112 111 64 204 41 -43 12 -32 138 196
5251A96r6k21M0L10k88K47j07j85j43J76J61j18p9N18m09pJ89ok58n0J40l87L86
$$ 196 100 -121 -81 229 -59 188 81 -104 -247 -71 90 -28 -107 411 2 -5 184 178 -80 -130 10 -377 9
5274IJ00R2jq3NJ9j88O3j58M10m61mP0p3J65m3M0j12O9K95j36j89L78j12j80K2
$$ 9 109 201 200 117 122 141 -47 16 -142 268 -193 -197 -127 -200 -35 -78 -38 -150 -81 214 78 -111 267 155 -25 -3
5300cJ64k43P8j93j48J98n9J32J21Q5LJ49l10j12M15l48k6J37n4l12J34L36k06
$$ -3 161 -82 -4 -197 -345 -147 -206 -74 47 132 135 284 -26 -138 277 -71 -97 40 -14 -326 -192 144 -62
5323f2P5o2N7j61K32Rl72L95O4o9k11J1OL26o0oO0j99L85qm93J11N0J5n6kL94
$$ -62 13 -49 8 -153 79 88 -284 111 175 106 -105 -94 -88 238 178 172 232 33 418 410 -83 28 78 93 37 35 429
5350D29o04N6pL0QL19j00k2k42M4J77k18m0L17Q9k21l72M95j54O9m41J26M32K49
$$ 429 -175 -119 -126 -96 -88 231 131 109 -133 -89 88 -130 -170 147 236 15 -357 138 -16 53 -388 -262 170 419
5374D19n54K77m13k10O21M5k67K40M3m30K51M1O6K0N8n32K16K61j67K8j01J65
$$ 419 -135 142 -271 -481 140 185 -82 158 201 -229 22 63 129 149 207 -325 -109 152 -15 13 -88 77
5396G7j40L95m52J00j16K1j48K94J48k88J70J83l30J79Q8k56N0J4R7r2K11j29
$$ 77 -63 332 -120 -20 -136 -115 -263 31 179 -109 61 244 -86 93 181 -75 -25 -11 86 -6 205 76
5418G6j31q9nL37j18k40L01L0J8l51K60k0o3j76M36k45j25j12K30J20O7k5j89
$$ 76 -55 -144 -149 188 70 -170 131 161 179 -172 88 68 5 -171 265 20 -105 -217 13 133 200 175 -14
5441a4p9L03m36J89O8P7j40j58J76J14j26j56K34n61M48M46k59o3J2k57L00K18
$$ -14 -93 210 -226 -37 31 108 -32 -190 -14 100 -26 -182 52 -509 -61 385 126 63 75 -182 118 336
5463C36k43j5J26m66K20M9J79J21k45K96n40M14l90N32l37k13M5j17K56o5K6k9
$$ 336 93 78 204 -262 -42 7 186 307 62 358 -182 232 -158 374 37 -176 -131 -248 8 -57 -31 -60
5485f0R4k17J6L17l20L27j95J47q3j0r9j24K98O2j59j72K14l82L00J7K20m08N49
$$ -60 34 -183 -167 150 -170 157 -38 109 26 16 -83 -207 91 153 -6 -178 36 -346 -46 -29 191 -217 332
5508C32n00O8P1m2L28l87K41n2l05N26o44J30K56J82o3m9j12j50N7N0l2J3r3M55
$$ 332 -168 -100 -29 -71 257 -130 111 59 -246 280 -364 -234 22 204 141 92 -20 -170 -113 -63 -95 -82 -175 280
5532B80Q1m17p5L73Pj0m17M27k82K98r4k41q6K59O2k50K7Lj00J92lk4k0J27J96
$$ 280 361 -56 -131 242 249 239 -178 249 -33 265 171 -70 -156 103 165 -85 -58 -55 -155 37 34 10 -10 117 313
5557C13j87j44K3m7L08m08N7J44J0j96K49On7l96M14J38l26J10K2r6l9q1J14J47
$$ 313 126 -18 5 -42 266 -142 -85 59 69 -127 122 128 71 -325 89 227 -99 11 33 -63 -102 -183 -69 78
5581G8j46k21L16l4J81j59k44M22l94J69r9K83J92j92l63R6l4R3j20J46l8O0l7
$$ 78 -68 -289 27 -7 174 15 -229 193 -201 -32 -131 152 344 152 -211 -115 -149 -56 -176 -30 -68 -8 -45
5604d5J02J04j22N7j98M2J25JK64m55K22m02L02j03N2J18N6j83j77K95l39O96
$$ -45 57 161 39 96 -102 -60 65 66 330 -125 97 -305 -3 -106 -54 64 120 -63 -240 55 -284 412
5626D12j93k41%Q2k08K77k51Q3K43n0p8l79J69J05J57M0L9p1q1k06JK24j9j23
$$ 412 219 -22 -22 60 -148 129 -122 -39 204 154 76 -303 -134 -29 128 168 207 136 55 -151 -150 74 55 -68
5650f8m7L01j18k61J41N0J3m8K51k30l7j8l0M25k98k74K81k23N70m40K80r8j71
$$ -68 -115 186 68 -193 -52 -2 11 -37 214 -16 -53 -71 -101 324 26 -248 33 -190 380 -60 220 122 -49
5673d9n9J95m4r6K74k26l30K07J6K25p9k94J23K69j69K79j50N5j13J53m10J76
$$ -49 -108 87 43 -53 221 -5 -335 -128 -112 113 34 -260 -137 132 -37 242 92 147 34 187 -223 -47
5695d7J11j49M4p0j25L50J96j98o8J38j02j51k40K59k0L22L0l95O0k62J95K48
$$ -47 64 -85 -41 -111 -236 114 310 112 44 182 80 -71 -311 -52 -72 250 280 -115 -55 -317 -122 126
5717A26m42O1L28k27L16k98L63L1k85P0j54k1o9N32l41J12q5j91K73q1l8m3j03
$$ 126 -316 -255 73 -154 162 -136 227 258 -27 43 -111 -132 -201 331 -10 102 17 -174 99 18 -20 -63 -166
5740a66L32N4p7k97J88j16J03q5K38M9j93K5o2K43j8k38j78P1J01l0K94j85K33
$$ -166 166 220 143 -154 34 -82 21 -64 174 223 30 55 -7 236 218 -20 -198 -127 -26 -56 238 53 286
5763B86l77K94j53j91J74J16l35M2M0k4J03N1J37j61K1J4p9L6Kk20K97k95j27
$$ 286 -91 203 50 -141 33 149 -186 -144 -104 -128 -25 26 163 2 23 37 -42 -6 -4 -224 73 -222 -349
5786c49J98K49n8M1j60k22O22n36N24k25j12J96k81Q4r4J96J3K48j53p7j75j63
$$ -349 -151 98 40 81 -79 -301 321 -215 309 84 -28 168 -113 -29 -123 73 86 334 181 104 -71 -234
5808b34J30K02j11O6O3p3j97O1k25K10J12K4O1o5O4r3j9K99k13J86p1J56j99j21
$$ -234 -104 98 -13 53 116 43 -154 -93 -318 -108 4 28 89 24 88 -5 -24 275 62 248 177 333 134 13
5832A3K44m24O60l17j18J14Q6m93K33J52k32L81j62o4k64J53J05j63N7J45l17
$$ 13 257 -167 493 176 58 172 258 -235 -2 150 -82 299 137 73 -191 -38 67 -96 -39 106 -211
5853b11N54P1j78k90L4L2L7J36l27J52p1J48k48K39J84m89j1K71O0j38RR9n6J07
$$ -211 343 414 236 -54 -20 12 49 185 -142 10 -61 87 -161 78 262 -227 -238 33 93 -45 -36 63 7 114
5877A14r5j39R8r1j34K34p1M7K39n6k02J2m3k52K00K03r5K87j00J13l24P5r4p7
$$ 114 19 -120 -22 -113 -247 -13 -84 -37 202 146 -56 -44 -87 -339 -139 64 -31 256 156 269 -55 20 -74 -151
5901a51P7o7j55M55p7j42o8J20nk79O53n34J2J31N0j64MJ98j25K07J4k78J85L6
$$ -151 -74 -141 -296 159 82 -60 -128 -8 -13 -292 361 -173 -161 -30 20 -144 -140 58 -67 140 154 -124 61 97
5925I7m0j76J55K7q7N3O3j06J7M4j53K32k51M7q6K8l5j15J21L2L01j90q5L4K5
$$ 97 57 -119 36 63 -24 29 92 -14 3 47 -106 126 -125 -78 -164 -136 -171 -286 -165 -133 168 -22 -107 -73 -48
5950d8nmj11M24l20J32k08kJ23l73M43J36l15o1J10J66k77J61j26M4O3k26J66
$$ -48 -53 -57 -168 256 -64 68 -140 -142 -19 -392 51 187 -128 -189 -79 87 -190 -29 -155 -111 -48 -274 -108
5973a08L31k45J49j62P9p3j20L45l59j6m3M90q2n4J19k00k0j68Jm9K76j4Qm7k25
$$ -108 223 -22 127 -35 44 -29 -149 196 -163 -179 -222 268 186 132 251 51 31 -137 -136 -185 91 77 85 38 -187
5998a87K44Mq2l18L31J00j01j0J39p4o6k00K52l96M94k21j45J81j44K35J42Q5
$$ -187 57 61 -21 -339 -8 92 -9 -19 120 46 -20 -220 32 -364 130 -91 -236 -55 -199 36 178 263
6020B63k69j97J15Q7j73L08q9j37L24j58o4j42K60j5m82M57l68M84p5j63J7j1
$$ 263 -6 -203 -88 -1 -174 134 45 -92 232 74 10 -132 128 113 -369 88 -280 204 129 -34 -17 -28
6042b8m5J77j20j80j22L93l6P7l17L70j58l41L40J9J1j60oK68l15J9P9L6L83k69
$$ -28 -73 104 -16 -196 -318 75 39 116 -201 169 11 -330 10 29 40 -120 -126 142 -173 -154 -75 -39 344 75
6066G5j41m54P02lj60m59L94Q8l64M84l13L80k39l09R2J00qK22J20l33J21Q3q2
$$ 75 -66 -520 182 179 19 -440 -46 42 -322 162 -151 229 -10 -319 -227 -127 -135 87 207 -126 -5 78 -4
6089dk44K7M08n4k42OL05j64Q4j98L04l32j69N03L0l57L6M4j61P6o6J64J5J28
$$ -4 -248 -221 187 133 -109 -103 202 38 122 -76 228 -104 -273 230 260 -97 -61 -17 -178 -102 -168 -4 11 139
6113A39r3K1j18k27O39j55k10J79j28J33m72O49n56J74J53m36K48j29L28j79Q4
$$ 139 46 67 -51 -278 361 206 -4 175 47 180 -292 357 -199 -25 128 -308 -60 -189 139 -40 44
6134D4j4M23o78OL27p8Q2k10K26k83j3J47j01R8R8k43j76L36%l13M18l61K97J72
$$ 44 30 453 -225 -219 108 30 112 -98 128 -155 -168 -21 -122 -24 74 -169 -345 -9 -9 -322 96 -265 32 204
6158B04o27M83l67K23J23k58L96j88L1r9K11k31J02j3M0J64j58L9J20k58O2P4
$$ 204 -423 60 -307 -84 39 -219 177 -11 20 -79 132 -99 3 -10 30 194 36 75 195 -63 -1 73
6180G3J5J08j07j19L0M4K44l54j31J02lR8j00oP4j30J21K7k91K00K08r8r1K49
$$ 73 88 196 89 -30 0 44 288 -66 -197 -95 -98 0 -100 -106 -32 -162 -41 -14 -305 -105 103 5 -86 163
6204A63k97J03j20J6M57n98J26k7K53k82K22m5m7J70J19k46O0j02r1L98q0j46
$$ 163 -134 -31 -151 -135 322 -276 -150 -177 76 -206 16 -29 -76 94 213 -33 27 -75 -166 232 152 6
6226Fk30K83J9k29r5J79J48k08L3J33j43J30J28n09M22l07K81j39q3j95M45q0
$$ 6 -224 59 78 -151 -246 -67 81 -127 -94 39 -104 26 154 -355 67 -240 41 -98 -181 -376 69 -11
6248a1J61j61j39J63K29l26L85k18j72L95l81L36l01L92j92q6j84L58k16j61k
$$ -11 150 -11 -150 13 242 -84 301 83 -89 306 -75 261 -40 352 160 74 -110 248 32 -129 -131
6269a31K51J73r3k7o5L4k2J06k62P7o3K6n6n5j15M13j77k52J32j62J10L57j46
$$ -131 120 293 200 173 108 142 120 226 -36 41 -22 4 -52 -107 -222 191 14 -238 -106 -268 -158 199 53
6292E3j35R1j26K11k42J33m6J51m38L12l39K60K20j13k06M28k91j88L31J62k89
$$ 53 -82 9 -117 94 -148 -15 -61 90 -348 -36 -375 -115 105 -8 -214 214 -77 -265 66 228 -61
6313f1K24%n08K05J29JJ5k4N2p9M38l29J30j50J06q1o3l05K19K07J4k77J38k37
$$ -61 163 163 -345 -140 -11 -10 5 -19 33 -46 392 63 193 43 149 68 5 -300 -81 126 140 -137 1 -236
6337b36L2K96j82j26R8J26r9K61j31j71j86K74J27o3m7N5j28J37K85n19J68j15
$$ -236 -204 92 -90 -216 -118 8 -91 170 39 -132 -318 -44 83 20 -27 28 -100 37 322 -197 -29 -144
6359a44K58l63J17K51l36L13p3J72j83J88j16J82jj32NM8j22L3n5l01K81K7j10
$$ -144 114 -249 -132 119 -217 96 23 195 12 200 84 266 265 133 138 186 64 97 42 -259 22 49 -61
6382f1K94p2m43J94j38L65j58J40l4OQ2j44m56K35L75j8p6P8M0q4J36j39k8m7
$$ -61 233 161 -282 -88 -226 139 -19 121 87 93 175 31 -425 -190 185 167 91 169 209 125 261 122 94 47
6406D7k00K32m2j38O4q7K86K38l96N0Qp3j38J07l2J12r0j11K25J30q1j34p1kO2
$$ 47 -153 79 37 -101 -37 -124 162 400 4 54 62 -11 -149 -42 -74 38 -52 -163 62 192 111 -23 -94 -96 -34
6431c4L04l17K38j10j6j36J48O6j36J56k70l3Q3K73p1j06K18l20l3L10j56k26
$$ -34 270 -47 191 81 65 -71 77 143 7 163 -107 -140 -57 216 145 39 257 -63 -96 214 58 -168
6453a68K14J16j47k34R4k52J86P7k21M44k41o5o4L14J21m38L87k36J55J59j31
$$ -168 46 162 15 -219 -125 -377 -191 -114 -335 109 -132 -197 -261 53 174 -264 123 -113 42 201 70
6474G0k68L15j25j2K0m6q1L01j53k18M44k71j69K28j54J94j55l1k27L22k9j47
$$ 70 -198 117 -8 -20 0 -46 -127 174 21 -197 247 -24 -193 35 -119 75 -80 -111 -338 -16 -45 -192
6496a92l5J19K82j91p5j23K83M8l34K4L71k48K03j80J94m18N12p6k21j2J67k36
$$ -192 -227 -108 174 -17 -92 -215 68 116 -218 -194 177 -71 132 -48 146 -272 240 164 -57 -69 98 -138
6518a38KJ34L51l72K25m72L17J88k69OK41k75K85l0l12J45o0M7m4j11J9K60N7
$$ -138 -136 -2 349 -23 202 -270 47 235 -34 -28 213 -62 223 193 -119 26 -34 13 -31 -142 -123 137 194
6541A94l77J25O1L3J21p7P2P1k19j22P3j86L52l95J59J98j19L0R8k34L41k06l0
$$ 194 -183 -58 3 36 157 80 152 223 4 -118 -45 -231 121 -274 -115 83 -36 -6 92 -142 199 -7 -37
6564c7L81l20J11k07K40k52J36L8J27j55O3k57mJ07oJ3j81L77k31L72m02J46J1
$$ -37 344 24 135 -72 168 -84 52 90 217 62 125 -132 -136 -29 -35 -22 -203 174 -57 315 -87 59 70
6587G0r1k3J73k44Lj0O7R4J84m5j45j04M1K2k16J47K36l60N7L85k98J42q5l0Q7
$$ 70 -21 -44 129 -115 -112 -122 -55 39 223 178 33 -71 -30 -8 -224 -77 159 -201 -144 241 -57 85 0 -30 57
6612E7j49J81j26l7L16l82J03J71k63L15k85M46l08J8M5j43N5j14J10K02l56q7
$$ 57 -92 89 -37 -74 242 -140 -37 134 -129 186 -99 347 39 57 102 -41 14 -100 10 212 -144 -231
6634b31L21q4n3j6Q3k89L64m21P08n09J14rJ75j27l81L52K00j49k73K61k30j1
$$ -231 90 6 -47 -63 20 -269 95 -326 382 -127 -13 -22 153 26 -355 -3 197 48 -225 36 -194 -205
6656b05J62P3J39p8Q6j34Pn5k32K73l54R1K78j60j33K10j53m2J95R3k08J03J29
$$ -205 -43 30 169 91 177 43 50 -5 -237 36 -318 -227 51 -109 -242 -32 -185 -227 -32 61 -147 -44 85
6679H5n6J95k78K15j08J84j68j05qK9k00J49k57J66k0M9mK94o3k15J76j29K38
$$ 85 29 224 -54 161 53 237 69 -36 -44 -15 -215 -66 -323 -157 -177 -128 -132 162 99 -116 60 -69 169
6702A69k17K31k85J27Pq8OK41l10M10j74J87k73o4j25j32K33N6L83n19K56k68
$$ 169 -48 183 -102 25 32 -56 -50 191 -119 291 117 304 31 -33 -158 -290 -57 -1 382 -137 119 -149
6724a49J87m24K23J71Q5K15l62q9J77j33r0m0K09j10J90k58J51j47L95jm7k50
$$ -149 38 -386 -163 8 93 308 -54 -143 34 -99 -189 -229 -20 -130 60 -198 -47 -194 201 200 153 -97
6746i7R6n9J23R9m13J24J41j44K85j36n2J12l30M8J25L09k69L29k99q2n6r3L87
$$ -97 -1 -60 63 162 -251 -127 14 -130 155 19 -33 79 -251 -203 -78 231 -38 291 -8 -90 -146 -239 148
6769A48j34p8j07J72J50j91O5Q2K3Mj37L9k6Q6l71N23j91n1o3K51k37m0J36J93
$$ 148 14 -64 -171 1 151 -40 25 107 130 134 -3 36 10 96 -275 248 57 6 -57 194 -43 -83 53 246
6793B46l0l10j7l9J01k5q5P4K15m29J18M77l11j92N3K0K48k67L29m02J62K2K15
$$ 246 216 -94 -111 -150 -49 -74 -159 -85 130 -299 -181 296 -15 -207 -154 -134 114 -153 176 -226 -64 -42 173
6816A73r5J20j91K3K7Q2j54J73k25O9K81n21N5j42M56k13m2J96l95L88l2J27J9
$$ 173 78 198 7 30 57 139 -15 158 -67 2 283 -238 -183 -325 131 -82 -124 72 -323 65 33 160 179
6839A79l84K60oM3r5L90l23M5k89J4M15O3k25n8l9J08j34k23J26J62j48N2M39
$$ 179 -205 55 49 92 -3 387 64 109 -180 -166 249 312 87 29 -10 98 -36 -259 -133 29 -119 -67 372
6862C72m81j1K03Rk08R4M25l26M5j53P0q2J81q3j76R2K18M4j96n1K9J11k78l4
$$ 372 -109 -120 83 92 -116 -22 403 77 122 -31 39 -43 138 55 -121 -29 189 233 37 -14 15 126 -152 -186
6886a86N3M36j12k67p8M37m37J54R7J34n24L14j08Kj7L65j68M9j66j42J68J45
$$ -186 -133 303 191 -76 -154 283 -154 0 97 231 -293 21 -87 -85 -102 263 95 144 -22 -164 4 149
6908A49m3j41k2k0J23M5R8l09K39n9L9Q8L41o60%J51k39N32l60P7l15K24J58j49
$$ 149 106 -35 -57 -77 46 91 189 -120 119 60 99 187 528 -132 -132 19 -220 312 -48 29 -286 -62 96 -53
6932e3j37J76J68l99o5K08K20k36LJ26o6j5q2K58M8q8p7K08Kp9k05q2K15j50k19
$$ -53 -190 -14 154 -245 -310 -102 118 -118 -115 11 -55 -70 -152 106 154 66 -11 197 199 120 -85 -167 48 -102 -321
6957c21K63n2L58l61J04j61J28L6K79j90l54K39K10jJ29l28Q8M3k00R6j53J13
$$ -321 -58 -110 248 -113 -9 -170 -42 -6 273 83 -271 -32 178 177 306 -22 66 109 -91 5 -148 -35
6979c5j18J87k32L51p3R2l71rL37m81N96j37k5j84R1M9k09K48k51L23j41j89M03
$$ -35 -153 34 -198 153 80 172 -199 -208 129 -352 244 107 82 -102 -11 38 -171 77 -174 149 8 -181 222
7002B22k94ro6j05J06q1K58j59K90j01r9L48J35n89l5K13RJ93j22j88j36M1O8
$$ 222 -72 -81 -147 -252 -146 -227 31 -128 162 61 -38 310 445 -144 -179 34 43 236 114 -74 -210 -169 -101
7025a01K36k08n3K20j54J32J78j41j33j14O9K0J50J04k80o7L22k80K50j22l45
$$ -101 135 -73 -126 94 -60 72 250 109 -24 -138 -69 -49 101 205 -75 -142 180 -100 150 28 -317
7046c17L60J60k3o19O02j89J48k36P4k76J19j33O58l35J02k58M05k68k6j35K2
$$ -317 43 203 180 -439 163 -26 122 -114 -40 -316 -197 -330 328 -7 95 -163 242 -26 -52 -187 -165
7067a65J47L37m06j97K68m7j77J89j78K77L6p4J19j10J98n52L72Q1j07k3J16J7
$$ -165 -18 319 -87 -284 -16 -63 -240 -51 -229 48 84 10 129 19 217 -335 37 118 11 -12 104 121
7089A21k03Jl6J45K19n07J10K32n7j80jJ5J86n3j9m6j2J12j77K10j99L85l40J19
$$ 121 -82 -81 -117 28 247 -260 -150 82 25 -155 -156 -141 45 -8 -27 -73 -85 27 -150 60 -139 246 -94 25
7113B5p3J03n2R6L9k67K54J14J27n02J78k1j20K62m8l39K16p9j17J92J29M2k25
$$ 25 -48 55 3 99 138 -129 125 239 366 -136 42 21 -99 163 115 -224 -8 -87 -204 -12 117 159 -66
7136f6k10K74J87k83k17K28%k83M54j51K58k34K42j44l58M53j38k3K04j43j90
$$ -66 -276 -2 185 -98 -315 -87 -87 -370 84 -67 191 -43 199 55 -303 150 12 -11 193 50 -140
7157a40J31O7J20l38K40j28m11M78n9R6K33J04l14p0q5p5l6M19l63P2K27J90k03
$$ -140 -9 58 178 -160 80 -48 -459 19 -40 56 289 393 79 9 -76 -151 -187 232 -131 -59 168 358 155
7180A55j14j53j54L52j62j28J03j47J33M9K30J41k31j35K39k09K6J0R8r3J36k81
$$ 155 41 -112 -266 86 -76 -204 -101 -248 -115 -66 164 305 74 -61 178 -31 -5 5 103 10 146 -135
7202a35L3n6K98J44m09n5J05n7K24m2J7j94J62M7j45k62K16N6J72o1K58o88O28
$$ -135 -102 -158 140 284 -125 -180 -75 -132 92 50 67 -127 35 82 -63 -325 -109 -53 119 58 316 -372 256
7225B56m1l36J85o8m05L60J5m3N48n60J67p9J33k56j18M45j52Q8k26l6K04k0j36
$$ 256 215 -121 64 -4 -409 -49 -34 -77 471 -89 78 -1 132 -124 -242 203 51 139 -87 -123 81 61 -75
7248g5m4K64l52J48NQK9k35J79J43L4m6j74j13L54r6L62n92J50J0J42k35K0Q6
$$ -75 -119 145 -207 -59 -54 -46 -17 -252 -73 70 104 58 -116 -229 125 29 391 -201 -51 -41 101 -134 -114 -28
7272b8k67K36J98j34P6j1k0j97L05j24o0l41J89J24K2L84l14K31m82O44l41l49
$$ -28 -295 -59 139 5 81 70 50 -147 158 34 -26 -367 -178 -54 -32 352 38 269 -213 431 90 -259
7294b59J58K33j15j04K55j47j47m5N89m04N0K91j85n9r8j08J01j16m3o4J84o0
$$ -259 -101 132 17 -87 168 21 -126 -171 418 14 64 355 170 111 13 -95 6 -110 -153 -217 -33 -93
7316i3J49N0l02N09n5k75m2K11o2j51J15m5n7O0PJ3q7R0J57k22K13J11l24J5m8
$$ -93 56 106 -196 313 258 -17 -59 152 90 -61 54 9 -48 12 19 32 -55 35 192 -30 183 294 -30 -15 -63
7341f3J31j42K41kR4p5N2k32L67l74K3J89j62k6J2R8j43j96K33j00L14Ok58J24
$$ -63 68 -74 167 165 259 184 236 4 371 -3 20 209 47 21 33 131 -12 -208 25 -75 239 245 -13 111
7365A11m56K43j54J08Q1L00m0n66P2L91l56N6j39m6O19j67Rj18j51J86K32J59
$$ 111 -345 -102 -256 -148 -67 233 193 -373 -301 90 -266 -210 -349 -395 224 57 66 -52 -203 -17 215 374
7387C74j53l05J56M2M5P4k08K14p0k23K34l51K32p8J77k43K93j61j21j7j03L98
$$ 374 221 -84 72 114 159 233 25 239 169 -54 180 -171 61 -17 160 -83 210 49 -72 -89 -192 206
7409B06k51J12k81L48j84k70L87n8J13n4K2m13N18l33k36J30J53J20q7J83p5J5
$$ 206 -45 67 -214 134 -50 -320 67 9 122 68 90 -323 195 -138 -374 -244 -91 29 -58 125 50 65
7431F5k14j30L28J02k69J6O6P2J22P2l37R1J9l8l4J6K03k6K10m01mL40k93J95
$$ 65 -149 -279 49 151 -118 -102 -36 36 158 230 -107 -16 3 -35 -69 -53 150 124 334 -67 -71 269 -24 171
7455A71J25k26j19n6K33L6m4k68m3J51Q9k49L12l39L6L35n48L96J26l6k05Q6J15
$$ 171 296 70 -49 -105 128 164 120 -148 -191 -40 49 -200 112 -227 -191 144 -404 -8 118 82 -123 -37 78
7478G8l73O9J54PK2K52m6r6J1k46J47j47N48l80k5N2Mk18K03R0k85L91l70J44
$$ 78 -295 -226 -72 -65 -43 209 163 67 78 -168 -21 -168 380 0 -25 27 31 -187 16 106 -179 212 -158 -14
7502a4K13J70n79L75k89K70m5j26m9K00j77J10j84K07l26M92l50r6M14k67J58
$$ -14 199 369 -210 165 -124 146 101 -25 -74 126 -51 59 -125 82 -244 248 -102 -198 216 -51 107
7523A07j98K32j66K5m1j34M35j81n9j44L45n0j88j72J84l52K99J56k54L97k53
$$ 107 -91 141 -25 0 -41 -175 260 79 20 -124 221 171 -17 -189 -5 -357 -58 98 -156 241 -12
7544a2J03o4J36m37O91n73L98m61N34k84J49L6l42%M00l86k6J31L11l37k63M05
$$ -12 91 27 163 -274 417 -156 242 -219 315 31 180 216 -126 -126 274 -112 -138 -7 304 -33 -296 109
7566A09j23N4j28L2R6j27q0K10j60K22P4J0j18m10L76k71N1K10q4K83n5j95RJ25
$$ 109 -14 40 -88 -56 40 -87 -167 43 -117 105 179 189 71 -339 37 -234 -183 27 -57 226 171 -24 -15 110
7590A10j85j75L45o8rO6N7j73k2m7l08J84M12K19m52J35k02L42n12K09K44j83
$$ 110 -75 -250 95 27 18 84 141 -32 -54 -101 -409 -225 187 406 -46 89 -113 229 -283 -74 170 -13
7612a3K37j81l2R8m53M78k84L70m27J55P4m0pq1J10J47j82j60M05k63J26r9j66
$$ -13 224 43 11 109 -344 134 -150 220 -207 -52 22 -18 -25 -106 4 151 -31 -191 214 -49 77 -22 -188
7635a88K72j52K15m75M25L9K29m55N4j5J82j07J14j5j86n0J69j3K8l06L82j50
$$ -188 84 -68 147 -328 97 136 365 -90 -36 -51 131 24 138 123 -63 -113 56 43 71 -235 147 -3
7657ck52K23p1J92j10k19N55k29l61J48n5L7O3k42L35M6j83J84k36K47O4m01K00
$$ -3 -255 -32 -103 89 -21 -240 315 86 -275 -127 -182 -145 -82 -324 11 57 -126 58 -178 69 133 -268 -68
7680f8J97o1j65L3K78k87j62K97L2l35l7L31j14l2K99j74R0m21K68P3J94j87m58
$$ -68 129 68 -97 -64 214 -73 -235 62 94 -241 -278 53 -61 -93 206 32 122 -299 -31 42 236 49 -409
7703d09J90K22j24K95k12N1K57m04J15O3j27K86l03J64j49K50J00l72J40q7K14
$$ -409 -219 3 -121 174 -38 13 270 -134 -19 44 -83 203 -100 64 -85 165 265 -107 33 -54 160
7724A60M4nk25O0l52J06J08K6p3K33m8Q7j12J60j04j87J95j24K17l02N86l47l20
$$ 160 204 199 -26 34 -318 -212 -104 -78 -151 82 34 121 9 169 65 -122 73 -51 166 -136 450 103 -217
7747b17K99p3j91J88R7M8j17J59l78J83R9j52Q4P0j89J9L1L53n88K40J00M6m09
$$ -217 82 9 -182 6 103 151 34 193 -185 -2 97 -55 29 99 -90 -71 -40 313 -275 -35 65 111 -298
7770b98L05n5J12j70j27J77m7J69mk46K58Kj05M3l9K09l76K38l02j2L14K6Q3j79
$$ -298 7 -48 64 -106 -233 -56 -103 66 62 -184 74 76 -29 14 -25 184 -192 46 -256 -268 46 72 155 -24
7794b4l0K87N3l24n2j62J89j85M36k22L83k92J69l98K69k70J3Q5J2K21R4m23n5
$$ -24 -54 233 286 -38 -90 -252 -63 -248 188 -34 349 57 226 -172 97 -173 -160 -75 -63 158 252 -171 -226
7817b26J52N28m44K07l26J72J0m3J06j55J64j45N1j25j37K67K05l17K00k96K39
$$ -226 -74 454 10 217 -109 63 73 30 136 -19 145 0 51 -74 -211 56 261 -56 144 -152 87
7838H7j11O4k68K77K64l34L71l51K25j50k50M11Q7k21k44J67O0p7Q3k67K50j0
$$ 87 -24 40 -228 49 313 -21 350 -1 224 74 -176 235 322 101 -143 24 84 7 90 -177 73 63
7860F3k3J88j64O6j06j5q1k6m3K71q4L5O3O9l01q6K74l5J0J42m85l1K50J52k06
$$ 63 40 228 64 130 24 9 -72 -98 -141 130 46 81 144 213 -88 -174 100 65 75 217 -268 -299 -49 103 -103
7885a03J79P0O0k5n18K67l04K26K60l10J94Q9r1j26K3J34j43K91m56L67m03K93
$$ -103 76 146 206 181 -337 -70 -374 -148 112 -198 -4 85 -6 -132 -109 25 -118 173 -283 84 -319 -26
7907b6J17k54R8K14m74L38J45k55J02K6j4j4r6N0N4M0j02J71Nj19K22l80j6K41
$$ -26 91 -163 -65 149 -325 13 158 -97 5 31 17 3 -93 -43 11 51 -51 120 125 6 228 -152 -168 73
7931G3M2p5K2K44m39J46K39j20j78l16K07N70l84q0m1Pj38L58l68L38Mk93L89
$$ 73 115 40 62 306 -133 13 252 132 -46 -362 -155 415 31 -49 -90 -83 -221 137 -231 107 111 -182 207
7954B07k01P7L2oJ65P2m27Q8R1j32L4j31K25j63j80L48m27K92J0q4J5L9K08R7
$$ 207 6 83 115 109 274 346 -81 7 98 -34 0 -131 94 -69 -249 99 -328 -36 -26 -110 -95 -56 152 249
7978B49p4l34J62l25L67j02R8k78J92K57n10K28l9N1q6L92l18M6k60K75L4j47
$$ 249 175 -159 3 -322 45 -57 41 -237 -45 212 -298 -70 -109 -58 -144 248 -70 -24 -284 -9 25 -122
8000a22k89L57p5N7L22l09K71m46P6K40j49m3P1pk82J27J13J53K37j50k29l8J74
$$ -122 -411 -54 -129 -72 250 -59 212 -234 -158 82 -67 -110 -39 -46 -328 -201 -88 65 302 152 -77 -115 59
8023E9j89K91k47K0R1J7K24k65Q1J1k79J31K55j44lN0j87n7J28L1j01k32P6K59
$$ 59 -130 161 -86 -66 25 42 266 1 82 93 -186 -55 200 56 53 103 -84 -141 -13 18 -83 -315 -239 20
8047B0r6L6L45k79J40l26m7k3p4O58n90J23k48M87j07j9R3k11J94K0k16m0K33
$$ 20 -76 -40 305 26 166 -160 -207 -230 -304 354 -236 -113 -361 126 19 0 93 -118 76 96 -120 -160 73
8070G3j45K69j84J7m0M8R4k50J87k57J0l1L68j70P1J02o7Q7k50j13L04n2o3M06
$$ 73 -72 197 13 30 -10 38 132 -118 69 -188 -178 -209 159 -11 60 162 95 182 -68 -181 123 71 8 414
8094D14l90J06J4k88K50j21j03j98L84l0p0L6p3j4R1lM3k36J53lR8j42k6K04k
$$ 414 24 130 144 -144 106 -15 -118 -316 68 38 -32 4 -69 -83 8 5 48 -188 -35 -38 60 -82 -108 96 94
8119I4NM0j76j27Q7j3K01j8o0J07m9j00j92M04M3l60LQ0R5k52K90K42k58j9j17
$$ 94 99 139 -37 -164 -77 -90 111 93 33 140 91 -9 -201 203 246 -114 -111 -31 64 -188 102 344 86 67 -50
8144e0J04k28J38J74n6j58J89p7J70m43Q4k4J87J99m1k8J41k34K76k11k06J36
$$ -50 54 -174 -36 138 82 -76 113 36 206 -237 -153 -177 10 209 168 140 281 47 323 112 -94 42
8166D2q5L73m16J23j78j1K85j18J08j50k93M93q1j80J27J8j14Q6K6r0Q5j07k29
$$ 42 -43 330 -86 37 -141 -152 133 15 123 -27 -320 173 92 -88 39 57 -57 29 55 -35 50 -57 -286
8189b86L42k17
$$ -286 56 -161
8191a61
$$ Imaginary data points
##PAGE= N=2
##DATA TABLE= (X++(I..I)), XYDATA
0@%%%%%%%%%qJ6j6J6k4L2l2M0m8N6p2Q6r4J07j29J50j68J92k22K52k84L19l59
$$ 0 0 0 0 0 0 0 0 0 0 -8 8 -8 8 -16 16 -16 24 -24 32 -40 46 -48 59 -70 80 -88 104 -118 134 -150 169 -190
32a90M03m51N03n60O24o95P72q55R47j049J162j286J423j578J754j952K176k437
$$ -190 213 -238 265 -295 329 -366 406 -449 498 -551 611 -675 748 -830 924 -1028 1148 -1289
50a289K745l111L554m108M823n782P146r256J2984k1504P7448K200j35936L0649
$$ -1289 1456 -1655 1899 -2209 2614 -3168 3978 -5278 7706 -13798 63650 65850 -70086 -39437
64c9437L0495L6254K9900n4798p7992M7170O7749J3530m4266n6329N321O4280
$$ -39437 -8942 27312 57212 2414 -75578 -28408 39341 52871 8605 -47724 -42403 21877
76B1877K3423k1971n3357k7214N7088N5881l0990m1921k0019R992O2650J8709
$$ 21877 45300 23329 -30028 -57242 -154 55727 24737 -17184 -37203 -27211 35439 54148
88E4148o9435l2227K8046L3706K9231k1729o5239K575N7327K5690j8311n0006
$$ 54148 -15287 -47514 -19468 14238 43469 21740 -43499 -40924 16403 42093 23782 -26224
100b6224k4453N1014M4096k1226l6437k4819J5492N8015R274n7201k8257K1353
$$ -26224 -50677 337 44433 23207 -13230 -38049 -22557 35458 44732 -12469 -40726 -19373
112a9373L7164K1962l1381m5936J0692L9464J9491j1013m2793j8397M1338L3716
$$ -19373 17791 39753 8372 -37564 -26872 12592 32083 21070 -21723 -40120 1218 34934
124C4934j5669l1616j9446J6865M1029M873l4931k5410P455L6054K1794l1026
$$ 34934 19265 -12351 -31797 -14932 26097 30970 -3961 -29371 -21916 14138 35932 4906
136D906l4101P824K5883K2744n219m1398j4788L5695K5486q140k5386k3858J5376
$$ 4906 -29195 -21371 4512 27256 22037 -19361 -34149 1546 27032 18892 -6494 -30352 -14976
149a4976L9772J498l0892k0016O267K9636J9121k4891k9398L336K4877K1494r690
$$ -14976 24796 26294 -4598 -24614 -18347 11289 30410 5519 -23879 -20543 4334 25828 16138
162A6138l4537o822K6069J9351k330k3015k1873J5929L1485j02k2753j7084L329
$$ 16138 -18399 -25221 848 20199 17869 -5146 -27019 -11090 20395 20293 -2460 -19544 -16215
175a6215K6065J4285j9455k2041l04J8934K1091q778k8566n129J8593J6805J974
$$ -16215 9850 24135 4680 -17361 -17665 1269 22360 13582 -14984 -20113 -1520 15285 17259
188A7259k1053j9608J5078K4188N72j5708j7818J019K5149J1520j6853j7931q06
$$ 17259 -3794 -23402 -8324 15864 16436 728 -17090 -16071 9078 20598 3745 -14186 -14992
201a4992J5690J8530p691k3563m989J5004J5518J117j9435j4274J2864J7329L278
$$ -14992 698 19228 11537 -12026 -17015 -2011 13507 14624 -4811 -19085 -6221 11108 14386
214A4386j2273j7099J844K1153Q168j2117j4551l320J3826J6454p068j8595m168
$$ 14386 2113 -14986 -13142 8011 16179 4062 -10489 -13809 17 16471 9403 -9192 -13360
227a3360R944J4421K335j7036j1860R609J4760L993j0495j5222J974J7074P333
$$ -13360 -3416 11005 13340 -3696 -15556 -5947 8813 12806 2311 -12911 -10937 6137 13470
240A3470r327j3482l346J2854J3361o105j4000m973Q028J3191J571j4197r495
$$ 13470 4143 -9339 -12685 169 13530 7425 -6575 -11548 -3520 9671 11242 -2955 -12450
253a2450O932J1784N128r385j3096K001J3743O421o137j1962m228J1426J0928
$$ -12450 -5518 6266 11394 2009 -11087 -9086 4657 11078 4941 -7021 -11249 177 11105
266A1105m350j1959m505O149J2099J186j1786p966M580J0395N203q470j0840J596
$$ 11105 6755 -5204 -9709 -3560 8539 9725 -2061 -10027 -5447 4948 10151 1681 -9159 -7563
280g563J0822O038m748j0442l849R679R080l253r345n281N489J0608J145j0019
$$ -7563 3259 9297 4549 -5893 -9742 -63 9017 5764 -3581 -8862 -3373 7235 8380 -1639
294a639o596L235Q751M921o845r275P92Q733N734l448r798k148P519P085j516
$$ -1639 -8235 -5000 3751 8672 1827 -7448 -6656 2077 7811 4363 -5435 -7583 -64 7021 5505
309E505p949n717M868R644N69p985n543J934Q035M460o243q038P10P396N096k949
$$ 5505 -2444 -8161 -3293 6351 6920 -1065 -6608 -4674 3361 7821 1578 -6460 -5750 1646 6742 3793
325C793p969k720O576O519j171o814m965M020P419J199o137n591J486P160L711
$$ 3793 -4176 -6896 -320 6199 5028 -1786 -6751 -2731 4688 5887 -250 -5841 -4355 2805 6516
340F516m998o294l47N721N454k800o606k395N058N804m10o255m520L568O321J030
$$ 6516 1518 -4776 -5123 598 6052 3252 -3354 -5749 -691 5113 4703 -1552 -6072 -2504 3817 4847
356D847m642n124P71O479L333l939n903k92M769M653j578o356k007L987N026j24
$$ 4847 205 -4919 -4148 2331 5664 1725 -4178 -4470 299 4952 3374 -2982 -4989 -1002 4024 3900
372C900n136l661K842N223J335l876n169Q93N617K905l178n079p51M536L897j467
$$ 3900 -1236 -4897 -2055 3168 4503 627 -4542 -3649 1968 4873 1695 -3384 -4135 401 4298 2831
388B831n142k138L628M352M90m963l120K181M180J835l697m343Q48M385K694k516
$$ 2831 -2311 -4449 -821 3531 4021 -942 -4062 -1881 2299 4134 437 -3906 -3058 1327 4021 1505
404A505m110r57L791L555j445m218j608K386M055J42l956k401J192M301J194k934
$$ 1505 -2605 -3562 229 3784 2339 -1879 -3487 -1101 2954 3096 -860 -3261 -2069 2232 3426 492
420D92l703J71M162K323j724m216p79L211L195p41l830k219K845L238L58l111
$$ 492 -3211 -3040 1122 3445 1721 -2495 -3274 -63 3132 2391 -1439 -3658 -813 2425 2783 -328
436c28k499Q55L474J578k163l253o4L270J944j383l331q10K392K761J3l624j626
$$ -328 -2827 -1972 1502 3080 917 -2336 -2400 870 2814 1431 -1900 -2710 -318 2443 2456 -1168 -2794
453b794K024K879L47k277k742P34L347J285k261k895j73L126K275j441k975q17
$$ -2794 -770 2109 2456 179 -2563 -1829 1518 2803 542 -2353 -2526 600 2875 1434 -1541 -2358
469b358J866L026n11k763j587J531K539P76k361k556J225K406J000j662k008m30
$$ -2358 -492 2534 2023 -740 -2327 -796 1743 2519 158 -2398 -1173 1233 2233 571 -1437 -1867
485a867K211J922j103k111r57J524K389p0k496j501J175K038P54j738k034R06
$$ -1867 344 2266 1163 -948 -1905 -381 2008 1938 -558 -2059 -884 1154 1908 170 -1864 -958
501i58J925J175j240k572l09K033J987j025k224q52J819J792mk168j570J271K195
$$ -958 967 2142 902 -1670 -1979 54 2041 1016 -1208 -2060 -241 1551 1547 -621 -2191 -920 1275
518A275O95j908j391r4K161Q84r27k204m18K386R30m75j766j259J685J977j57
$$ 1275 1970 62 -1329 -1423 738 1622 695 -1509 -1927 459 1389 914 -852 -2111 -426 1551 1394
535A394j651j876J486J725K81j261j375K44J232J048n39j943o4J227J595n61j562
$$ 1394 -257 -2133 -647 1078 1359 98 -1277 -1033 199 1247 708 -1235 -1299 -72 1523 962 -600
552f00j131J189J750l11o76j367j14K288O91j813j360N35J121J212p80j521l53
$$ -600 -1731 -542 1208 897 221 -1146 -1260 1028 1719 -94 -1454 -919 202 1414 634 -887 -1240
569a240J447J215k69j919p43J260J605l12j024j186K66J718M95j115j690M38J058
$$ -1240 207 1422 1153 -766 -1509 -249 1356 1044 20 -1166 -900 818 1313 198 -1492 -1054 4
586DJ216m19j785j18J075J071l80j292p45R99J430l25r45j048J2J977L85p90j111
$$ 4 1220 801 -984 -1102 -27 1044 664 -628 -1373 -374 1056 731 -214 -1262 -1250 727 1112 322 -789
605g89j81J136R01o01j043l64N93J073R4j354o33P01J238K41j068r19N46R70L48
$$ -789 -970 166 1067 466 -577 -941 -348 725 819 -535 -1168 -467 771 1012 -56 -975 -429 541 889
624H89p29q67j75J064R14k59j464l36Q07R59J60j225p54P45R85J70o09r33J45
$$ 889 160 -707 -882 182 1096 837 -627 -963 -156 803 963 -262 -1016 -271 714 884 275 -658 -513
643e13R83L41m13j150l10J336P14p25o87l73M28J170kj047r05N39Q66M98p33q65
$$ -513 470 811 398 -752 -1062 274 988 263 -424 -797 -369 801 799 -248 -1153 -614 252 750 17 -848
663h48L19Q20M63p21o98rR59O42n53q10o67P99J214j62q77o54L76Q77L89o24j071
$$ -848 -529 291 754 33 -665 -674 285 927 374 -436 -1103 -304 910 748 -129 -783 -407 470 859 235 -836
684h36O07N49L17j31j351N66M59M08j50q13n84M94J372l44p83m51P3R09N52q65
$$ -836 -229 320 637 506 -845 -279 180 588 438 -375 -959 -465 907 563 -220 -671 -598 311 863 -2
704bn07J18M82O01p16q37Q2R18Q89o67q34k96M46J053l19l47m69K33N49J39n75
$$ -2 -509 -391 91 692 -24 -861 -779 139 1028 361 -473 -769 -323 730 411 64 -405 -172 377 516 -59
725e9p03M84N39N70m63p86l90Q39L95L5q02m11M82Q98l01o09o16J87R23M57n71
$$ -59 -762 -278 261 831 368 -418 -808 31 426 461 -341 -752 -270 628 327 -282 -898 -711 212 669 98
746I8p27p5R24K71j07r36k78J018J6J97l76p78M70Q82l43k96p24L61P69J90r50
$$ 98 -629 -704 220 491 384 -552 -830 188 204 401 25 -753 -283 599 256 -40 -764 -403 366 556 -394
767c94J63j29M42L89j44o90l2M69M90j74p01o42P06M07L78m20m04K9J047p19j34
$$ -394 -231 -360 82 471 327 -363 -395 74 564 390 -311 -953 -247 160 538 118 -286 -257 790 71 -63
788f3k22o7O08M58l35q28J29O2Q61l42p49k86P96M57m7o66j53K32L48K10j53p93
$$ -63 -285 -352 256 714 379 -449 -320 -258 603 261 -488 -774 22 479 432 -234 -387 -155 193 403 250 -543
810e43L22L59N18r39J03N3K5P92j11p71l33M65O27m17r8o15K61P09j38k0o64J6
$$ -543 -221 138 656 -283 -180 -127 -102 690 579 -192 -525 -60 567 150 52 -563 -302 407 269 249 -415 -399
832c99L93M50k14r66M80K59L47j67n80j0L87M32j26k49n29K29N85j92j21m78P0
$$ -399 -6 444 230 -736 -256 3 350 183 -397 -407 -20 412 286 37 -492 -263 322 130 9 -469 -399
853c99M80O1P9j44o82N08J62K61l50l20J57L64L88m55k97N3M03q0J07m98j15Q7
$$ -399 81 142 221 77 -605 -97 65 326 -24 -344 -187 177 565 110 -187 -134 269 189 296 -202 -317 -230
875b30O14m16j93k21K67L41J45n01J0j72O35K05n96ON1r8L73j89m29M31L95J12
$$ -230 384 -32 -225 -446 -179 162 307 -194 -184 -356 279 484 -112 -106 -55 -153 220 31 -398 33 428 540
897E40j05m86k29M06L21j23m57k82N81m1J69L0o01M18j6n5J02j72m02M24J62j14
$$ 540 435 -51 -280 126 447 324 -133 -415 166 125 294 324 -277 141 125 70 172 0 -402 22 184 70
919G0j98j62J30N23l22j22j11L43L31k44n76L08l64L25K91k46j40m4K82K20j52
$$ 70 -128 -290 -160 363 41 -81 -192 151 482 238 -338 -30 -394 -69 222 -24 -164 -208 74 294 142
940A42m05M0N39k91j29m2j05K40M30Q7n88j25j83M85L32l10m54K25J40K21l68
$$ 142 -263 -223 316 25 -104 -146 -251 -11 419 506 -82 -207 -390 95 427 117 -337 -112 28 249 -119
961a19K9k07N27k79L7j53K18l66N61o5m34Q5k55Q00j94j25l38J0M85j92j89K09
$$ -119 -90 -297 230 -49 -12 -165 53 -313 248 183 -251 -166 -421 379 185 60 -278 -268 217 25 -164 45
983D5k31R2L18o2m32J57l3L39J22l13k60J97j22N12r5k79L2n5K29k06m3r7J19
$$ 45 -186 -94 224 162 -270 -113 -146 193 315 2 -258 -61 -183 329 234 -45 -13 -68 161 -45 -88 -185 -66
1006f6L30j98K5k25J00j31N90m37j18M12r0J52m29Nl0J97j09j12L70o80N13j02
$$ -66 264 66 91 -134 -34 -165 425 -12 -130 282 192 344 -85 -80 -110 87 -22 -134 236 -444 69 -33
1028c3n0l3q3K56K40l19M3k34R4k33M81O7k05j95J93L72l06n2j87K80J10k9l50
$$ -33 -83 -116 -199 57 297 -22 21 -213 -119 -352 129 196 -9 -204 -11 361 55 3 -184 96 206 177 -173
1051a73l6K11J74j64R0J22m47N77j80j43j88p3L94L07l79m32J07j2L82j00j49
$$ -173 -209 2 176 12 102 224 -223 354 174 31 -157 -230 164 471 92 -340 -233 -245 137 37 -112
1072a12j05L9L86j58j4k21Q0K21j59J74l09J81r0J14j02p3O7J59Q8K71l52k62
$$ -112 -217 -178 208 50 36 -185 -105 116 -43 131 -178 3 -87 27 -75 -148 -81 78 166 437 85 -177
1094a77K21L27m30o5j85K52J91J99j65j76k84M22k0q6K72m29K39J79j66o8k19
$$ -177 44 371 -59 -124 -309 -57 134 333 168 -8 -292 130 110 24 296 -133 106 285 119 51 -168
1115a68j17N46j56l69K93n6L60k28k08J10j26K36j01K97m1k44J69J62l13k75K34
$$ -168 -285 261 105 -264 29 -27 333 105 -103 7 -119 117 16 313 272 28 197 359 46 -229 5
1136Eo8J95K5M4m23P1j6L64n9l32L48k65L11j91j14m5j09M94k29j1k71L5L82j29
$$ 5 -63 132 157 201 -222 -151 -167 197 138 -194 154 -111 200 9 -105 -150 -259 235 6 -5 -276 -241 141 12
1160A2R5o05L03K08L1J7k04P8J82lN6m33J90J63M7j17J54j99P1Q2j6j80m63O02
$$ 12 107 -498 -195 13 44 61 -143 -65 117 114 170 -263 -73 90 137 20 174 -25 46 128 112 -68 -531 71
1184G1k52R3J64n1j16M7M34l48j71J04k06N52r6J3m69L09P7L2k36q3P5o9L12K9
$$ 71 -181 -88 76 25 -91 -44 390 42 -129 -25 -231 321 225 238 -231 78 155 187 -49 -132 -57 -126 186 215
1208B15n47M88j1j24K08j96K12o16N41j39J15k73k1J89oj78mL29l39N07k23l2
$$ 215 -332 156 145 21 229 33 245 -371 170 31 146 -127 -148 41 35 -143 -147 182 -157 350 127 95
1230I5l93j6N46j23l12l5K13K88m51j15Q9K05K83k31j71Q0j75K50QJ09k95l33
$$ 95 -298 -314 232 109 -203 -238 -25 263 -188 -303 -214 -9 274 43 -128 -48 -223 27 35 144 -151 -484
1252d84N55j04P0k73M5o5K35j1j52P4j74M49k32J8K43j00o9l2J98l83M49o8m73
$$ -484 71 -33 37 -236 -191 -256 -21 -32 -184 -110 -284 165 -67 -49 194 94 25 -7 191 -192 257 189 -284
1275b84M19j26p5mJ48J4l77K98J65n04K41J73k48L3J50J11k46J38j11j26L67R8
$$ -284 135 9 -66 -70 78 92 -285 13 178 -326 -85 88 -160 -127 23 134 -112 26 -85 -211 156 254
1297B54l32K2m49N03r5njj34J79Q2J28p2Rk40L17R8m73l6K48m6K61k00L2k55K01
$$ 254 -78 -56 -505 -2 -97 -102 -103 -237 -58 24 152 80 89 -151 166 264 -209 -245 3 -43 218 18 50 -205 -4
1322dJ49j80j52J11L25p6l80J06J20m0M33m1l62r7J88J2Jl44L70o7j1M8J9o9K29
$$ -4 145 -35 -187 -76 249 173 -207 -101 19 -21 412 371 9 -88 100 112 113 -231 139 72 61 109 128 59 288
1347B88k09j50L05k19j83K92o5J5j5m58O00l9P6l06k26K56J63j37J61m49L38R
$$ 288 79 -71 234 15 -168 124 59 74 59 -399 201 162 238 -68 -294 -38 125 -12 149 -300 38 47
1369D7K37m73N3R2M3J08N0m6k39K58n0k02o4k82L73L32l24J53M6k08M4J37l59
$$ 47 284 -189 -136 -44 -1 107 157 111 -128 130 80 -122 -186 -468 -95 237 -87 66 112 -96 -52 85 -274
1392b74L89j01q4K14p4J21l32M14n8l50M8q0K76k12N05l07j65J37J3k79N2K65
$$ -274 115 14 -70 144 70 191 -141 273 215 -135 -87 -167 109 -103 402 95 -70 67 80 -199 -147 118
1414A18k35J27M8pk72K60J0J2N2N4J8k16n5J89J84m57M35k08M31k45n10J42KJ51
$$ 118 -117 10 58 51 -221 39 49 61 113 167 185 -31 -86 103 287 -170 265 57 488 243 -267 -125 -123 28
1438B8K7L7N3j57K31m4k74L5J59K53k11L7k69K3K88j77k83J91J97k6J0L8q4j19
$$ 28 55 92 145 -12 219 175 -99 -64 95 348 137 174 -95 -72 216 39 -244 -53 144 118 128 166 82 -37
1462c7JK28k79N5L11l91J38J11J2n45M19R6P1j39rk5j32J04RL2p0L2J38k6r6j71
$$ -37 -36 192 -87 -32 279 -112 26 137 149 -396 23 119 190 51 42 17 -115 -11 -2 30 -40 -8 130 104 8 -163
1488a63Q6K38jM5k61K9k71N52r7k73K01R8k88O8k8q6K20o4J62k4p9j71K48Kk57
$$ -163 -77 161 160 205 -56 -27 -298 254 157 -116 85 183 -105 -37 -65 -151 69 5 167 143 64 -107 141 143 -114
1513a14J96j31M23l03r5J6K12o9mj68k29N6L00J39m28J35J33m0J1k7Rk46J32K21
$$ -114 82 -49 374 71 -24 -8 204 135 131 -37 -266 -210 90 229 -199 -64 69 29 40 13 22 -224 -92 129
1537A29j13k6j89L00k11L38k06Op6J41J05r5j20j46K02l15N21m15k7L6j2M71n40
$$ 129 16 -10 -199 101 -110 228 22 28 -48 93 198 103 -17 -163 39 -276 245 -170 -197 -161 -173 298 -242
1560b42J23K18M6j40J95J30m21J33M8q6L13o62L6M79n2n8K7K0J52m06L8J96k45
$$ -242 -119 99 145 5 200 330 -91 42 90 4 317 -345 -309 170 118 60 87 107 259 -147 -109 87 -158
1583a58J83l4J41K6K25m03J3m0l0L8K26l58L17J20m77J17j12J83p0p2JL34j80
$$ -158 25 -9 132 158 383 -20 -7 -47 -77 -39 187 -171 146 266 -211 -94 -206 -23 -93 -165 -164 170 -10
1606a0J06L19k33o6M3k72j85PJ98J23k05J43Q7k4N5k47k41K07J45M8J19o6M7j66
$$ -10 96 415 182 116 159 -113 -298 -291 -93 30 -175 -32 55 31 86 -161 -402 -195 -50 -2 117 51 98 -68
1630f8M8O2K89n52O2J13k20O9lJ28O9K78k81Q4l75J54K25K5J13rj81k37L25r3
$$ -68 -20 42 331 -221 -159 -46 -266 -197 -200 -72 -3 275 -6 78 -297 -143 82 107 220 211 30 -207 118 25
1654B5j61r6J13J76k3J44l43M45j24k4j52j08M22m42K87l17J29p7J82j53r8P0
$$ 25 -136 -232 -119 57 34 178 -165 280 156 132 -20 -128 294 -148 139 -178 -49 -126 56 -97 -195 -125
1676a25j9L09j58L39n35k3K65j4J11j65j40M8J80l0K11m06J51j51J05P8l0o0k19
$$ -125 -144 165 7 346 -189 -212 53 39 150 -15 -155 -107 73 43 254 -152 -1 -152 -47 31 1 -59 -278
1699b78M19l8k2l48K62K56j99Nj36J77p4j23m5K28m6k43K68k30N8m6j38L48k5
$$ -278 141 103 81 -267 -5 251 52 57 -79 98 24 -99 -144 84 38 -205 63 -167 -109 -155 -293 55 30
1722C0O7r0l38K44J78K36n26K67p3k43P6J28j01J86J6j02k70M46N8k76J10J57
$$ 30 97 7 -331 -87 91 327 -199 68 -5 -248 -172 -44 -145 41 57 -45 -315 131 189 -87 23 180
1744A80j17j51L08k35o2J62m8M9j15K38k25J30k52k30M12K02l77j2J15pj54m0
$$ 180 63 -88 220 -15 -77 85 37 86 -29 209 -16 114 -138 -368 44 246 -131 -143 -28 -35 -189 -229
1766b29J87L0J50R1l61j3J85p3j89M31l36J97j22j19J38j35P5l8L10j38m2K35
$$ -229 -42 -12 138 229 -132 -145 40 -33 -222 209 -127 70 -52 -171 -33 -168 -93 -131 179 41 -1 234
1788B34j17J71l14J98N3j93J48N7k54N7L0L7J92k57j32j16L19q2K6j40L2K29q4
$$ 234 117 288 -26 172 225 32 180 237 -17 40 70 107 299 42 -90 -206 113 31 57 -83 -51 178 94
1811I4m4L3l62J69K65j44j7P8k63L44j81J47J34j20k81m4K75k07l03J47K78k2
$$ 94 50 83 -279 -110 155 11 -6 72 -191 153 -28 119 253 133 -148 -192 83 -124 -427 -280 -2 -24
1833b4j03P1L32m77p6K9O23k32k35j03M20l05N1K54J32r2k96Q9j48L22k24P7j35
$$ -24 -127 -56 276 -201 -277 -248 375 143 -92 -195 225 -80 -29 225 357 265 -31 58 -90 232 8 85 -50
1856e0n1L9J29j77N8o3K5M8j26J69n8R2J00k57K65r9l9J74l75L25l18K69J23m66
$$ -50 -101 -62 67 -110 -52 -115 -90 -42 -168 1 -57 35 135 -122 143 44 5 179 -196 129 -189 80 203 -263
1880b63P5L24l24L43r4Q4j90j15J69r6R6k01L05K0k81J20J00j78J98K8j36N9Q5
$$ -263 -188 136 -188 155 61 145 -45 -160 9 -87 9 -192 113 133 -148 -28 72 -106 92 120 -16 43 128
1903A28q8k55M41j68J68m13J02O6J17j76K14o4K2J52k25j76Q8K26m19L51q8J25
$$ 128 40 -215 226 58 226 -187 -85 -19 98 -78 136 72 94 246 21 -155 -67 159 -260 91 3 128
1925A28m8q2qK52m09j3K74l52K58J97k15M08m50J35J8M4k62R6Q0j86K17jN7k32
$$ 128 80 -2 -10 242 -167 -180 94 -258 0 197 -18 390 -60 75 93 137 -125 -29 51 -135 82 81 138 -94
1949i4J99J82l68J08n0l9J25J30K6j93J96R3m04K0J72j14J7K24J4J8l30j34K59
$$ -94 105 287 -81 27 -23 -62 63 193 219 26 222 315 -89 -69 103 -11 6 230 244 262 -68 -202 57
1972E7K05K03j39j64j86j02K15N2k64q8K32K34j80r6J95M9L8l46k54O40j77j44
$$ 57 262 465 326 162 -24 -126 89 141 -123 -211 21 255 75 -21 174 223 261 -85 -339 301 124 -20
1994b0Mj2j98JK48J03j41R8N4m36N68k29n9j87J32P3Q7P4q2J35m24K76N3k70K83
$$ -20 -16 -28 -226 -225 23 126 -15 83 137 -299 269 40 -19 -206 -74 -1 86 160 78 213 -211 65 118 -152 131
2019A31q8r1J14m5O3k3k10J86J20k99J5J90k57j15L49j37J38L15o01K58Nj38M06
$$ 131 43 -48 66 21 84 61 -149 37 157 -142 -127 63 -194 -309 40 -97 41 356 -245 13 18 -120 286
2042B86n15m7L14m7P2o2J18K5j65M0%l57L19M40l67K2k06J30Rj78L6J56J6j0j99
$$ 286 -229 -276 38 -9 63 1 119 144 -21 19 19 -338 -19 421 54 76 -130 0 9 -169 -133 23 39 29 -170
2067a70M20l96J07j77J72K8j52M66j28k95K69ol16L61m71M2L12k05Q1j00J76R6
$$ -170 250 -146 -39 -216 -44 -16 -168 298 170 -125 144 138 -178 183 -288 -246 66 -139 -58 -158 18 114
2089A14K67l15q7K97k95o2K74m46K68J64p2k16mK50l8j86k47K34J29R7k38K48
$$ 114 381 66 -21 276 -19 -81 193 -253 15 179 107 -109 -113 137 99 -87 -334 -100 29 126 -112 136
2111A36j26j87q1J85N9l0JJ98n31K66n3L16l50L50j91j67L69j44k19J58J77q7
$$ 136 10 -177 -258 -73 -14 -44 -43 155 -376 -110 -163 153 -197 153 -38 -205 164 20 -199 -41 136 49
2133D9J81k31k38K17K20o5k58J86k86J26j10K71N6R4N0m24J27r2J77J13p9PJ03
$$ 49 230 -1 -239 -22 198 133 -125 61 -225 -99 -209 62 118 212 262 -162 -35 -127 50 163 84 91 194
2156A94k22j98K4J32K80j33k8j85M16M1l83l6K54j16m9J6k75K12k7J02k56L60
$$ 194 -28 -226 -202 -70 210 77 49 -136 280 321 -62 -98 156 40 -9 7 -268 -56 -83 19 -237 123
2178A23K78k76k2j99R2J03K3k22l2J29J25J3J60m1l50M29m41O31l63J37l76M4
$$ 123 401 125 103 -96 -4 99 122 -100 -132 -3 122 135 295 254 -96 333 -108 523 160 297 -79 -35
2200c5j7k4j44N56m07J41q5k1k05L15j88j13N06m36r4K59J20m8l8q1j13J60l54
$$ -35 -52 -76 -220 336 -71 70 -15 -36 -241 74 -114 -227 279 -157 -251 8 128 80 42 -39 -152 8 -346
2223c46K65J69N8j68k05M14m56M86J52l94LlK59k98N8J80k43P8j30K89j57L13
$$ -346 -81 88 146 -22 -227 187 -269 217 369 -25 -22 -25 234 -64 -6 174 -69 9 -121 168 11 324
2245C24l18Ok30j14K26K23o2J29k21J41j6J5j89m9K31J64j96j0k62J77qJ13n1
$$ 324 6 12 -218 -332 -106 117 55 184 -37 104 88 103 -86 -135 96 260 64 54 -208 -31 -39 74 23
2268B3j13J21o4K7K31k13n9J70m00K03L95m99L57j70J39j07l1j39M1j28L83j00
$$ 23 -90 31 -33 -6 225 12 -47 123 -277 -74 321 -178 179 9 148 41 10 -129 -88 -216 167 67
2290F7o38P63j82j50L12j90J33k43N7L1rN6j63J82j61J04J75j05k56K83r4J71
$$ 67 -571 192 10 -140 172 -18 115 -128 -71 -40 -49 7 -156 26 -135 -31 144 39 -217 66 -28 143
2312A43j12k55M78n21N83k1k29K0k4l27L48nJ05n34N28n47J38M65j16l8J57k72
$$ 143 31 -224 254 -267 316 295 66 86 62 -265 83 78 183 -351 177 -370 -232 233 117 79 236 -36
2334c6mQ3k75L13k03J27q0K90k85j08P5R8j56K71p4K25m80J36N0j11J82R7j09
$$ -36 -40 43 -232 81 -122 5 -75 215 -70 -178 -103 -5 -161 110 36 261 -219 -83 -33 -144 38 135 26
2357B6J34j87K5M18m94L10o4j06j20r6%k92M57o6q9%m5K82k12N6O4J41K0j29l36
$$ 26 160 -27 -2 416 -78 232 168 62 -58 -154 -154 -446 11 -55 -144 -144 -189 93 -119 -63 1 142 162 33 -303
2382c03J02M54j77RP1p4J8l8k23P3L90j38o4q2j66l6k32L80k33K56J50k28j9O5
$$ -303 -201 253 76 85 156 82 100 62 -161 -88 302 164 100 18 -148 -184 -416 -36 -269 -13 137 -91 -110 -45
2406d5k54K68L17m06J03n3J75p0K36m31j18M55k53R2j20J01l7k24M79m00J72K15
$$ -45 -299 -31 286 -120 -17 -70 105 35 271 -160 -278 177 -76 16 -104 -3 -40 -264 215 -185 -13 202
2428B02j93K8K13l00j28K29L50k90l98L47M8k27J61N9l22J06N9j7K04q7k22J35
$$ 202 9 37 250 -50 -178 51 401 111 -287 60 108 -119 42 101 -221 -115 -56 -73 131 44 -178 -43
2450d3j32M70m72K68k13Q9K1Q7R4P8l23k06K80j63Kj20J25LJ15K05n7Q2j43r7
$$ -43 -175 295 -177 91 -122 -33 -12 75 169 247 -76 -282 -2 -165 -163 -283 -158 -155 -40 165 108 190 47 -50
2474e0k00J99J94l5l81M21l9k67L81k96M5J77j69K28j73j85L40J04m86L04N3j29
$$ -50 -250 -51 143 108 -273 148 109 -158 223 -73 -28 149 -20 208 35 -150 190 294 -192 112 165 36
2496C6k94K40n4Q9O6J8j0j92j05K07l8O5J98l61K02J4k18J08k9k1K67j01J9l45
$$ 36 -258 -18 -72 17 83 101 91 -101 -206 1 -37 28 226 -135 67 81 -137 -29 -58 -79 188 87 106 -239
2520b39O55l94L17k56k02N3K58l40J14L05l10O2m1r5q6M96l91m8J07l97P45l76
$$ -239 416 22 339 83 -119 -66 192 -148 -34 271 -39 23 -18 -113 -199 297 -94 -142 -35 -432 313 -63
2542f3k16N09j78K00p9j1lM2l3k39J08L61n79L69k07k73K93M3l1l6J16m5J98m29
$$ -63 -279 230 52 252 173 162 159 201 168 -71 37 398 -181 188 -19 -292 1 44 13 -23 93 48 246 -183
2566a83J64J73k97J11J58K3k66O0k2m0L15k67j2M9k1P6j47J94l1p7k60N46m40
$$ -183 -19 154 -143 -32 126 149 -117 -57 -79 -119 196 -71 -83 -34 -55 21 -126 68 37 -40 -300 246 -194
2589a94M10k03P7j21n1J44J63q3k15k4J59j63j23K54K15j03l96qj09K86J70K0
$$ -194 216 13 90 -31 -82 62 225 142 -73 -97 62 -101 -224 30 245 142 -254 -262 -371 -85 85 105
2611A05p9L0M2j66O1K20l59L32n30L96m85M41M0J49m88K65m4O9j62rM34l04m7
$$ 105 26 56 98 -68 -7 213 -146 186 -344 52 -433 8 48 197 -291 -26 -70 -1 -163 -172 262 -42 -89
2634h9r8N45l10l8J84j37n0K1K1j7K35j12j03k11K16k25L34N0l09J63n0l0n6L22
$$ -89 -187 358 48 10 194 57 7 28 49 32 267 155 52 -159 57 -168 166 216 -93 70 20 -10 -66 256
2658B56q9k57o6K26o9L8J37l55J14P9O9J26l39L32m25K80k29n2J64Q9l71L60j33
$$ 256 167 -90 -156 70 1 39 176 -179 -65 14 83 209 -130 202 -223 57 -172 -224 -60 29 -342 18 -115
2681a15k4K51N7k4l76K80J61k44K80j7l22M29k83P0k70nJ35n8j79N11Np5k90J22
$$ -115 -139 112 169 145 -231 49 210 -34 246 229 -93 336 53 123 -147 -152 -17 -75 -254 257 262 187 -103 19
2705A9m10L93j94L21o0k38J82k2O1l0L1J12o8O8n5j21j29K11kM2N0k87J76m0o5
$$ 19 -391 2 -192 129 69 -169 13 -9 52 22 53 165 97 165 110 -11 -140 71 69 111 161 -126 50 10 -55
2730e5k78M68J55j31K02l10j31K36J80l28O7p8k03J89Jj14J14J46j40M3k8M4k5
$$ -55 -333 135 290 159 361 51 -80 156 336 8 75 -3 -206 -17 -16 -130 -16 130 -10 33 5 49 24
2753B4m24K0M62M3q7Pn3Ml0j86J58J41j57k56O20k86J78k74N6j73J15J42j1q5
$$ 24 -400 -380 82 125 38 45 -8 -4 -34 -220 -62 79 -78 -334 286 0 178 -96 -40 -213 -98 44 33 -52
2777e2K27K5M8l85o4L60q3p0Q3j92j65J68J36m5J22m7r8n2L8p3m1L23m7k29n6
$$ -52 175 200 248 -137 -201 159 76 6 89 -103 -268 -100 36 -9 113 66 -32 -84 -46 -119 -160 163 116 -113 -169
2802a69K74mk27L02p6k3j40M11l99J03K10K0k54J50l91J69r7M45n87K09K19O4
$$ -169 105 101 -126 176 100 77 -63 348 -51 52 262 282 28 178 -213 -44 -141 304 -283 -74 145 209
2824B09l84J73L31m27J39n0O7J93l69J06K14j53M9k87K99k73l4R9J19j21J96l8
$$ 209 -175 -2 329 -98 41 -9 58 251 -118 -12 202 49 98 -189 110 -163 -197 -98 21 -100 96 58
2846E8N0j29k60K22l2N0O4J78k90K35O2m22P9K25K6J18k57O4rN8j62o5M07n01
$$ 58 108 -21 -281 -59 -91 -41 23 201 -89 146 208 -214 -135 90 116 234 -23 41 32 90 -72 -137 270 -231
2870b31K54J52q2n0k50J25K7J78j37k53K45Kj20J83j16J44k35N7P7R7j48N4k6
$$ -231 23 175 93 43 -207 -82 -55 123 -14 -267 -22 -20 -140 43 -73 71 -164 -107 -30 67 -81 -27 -53
2893e3K50l0q6J5k92Q9N7J24j35qK27L55m48j43K42J40n06J9K34O3k14K09l4j95
$$ -53 197 167 81 96 -196 -107 -50 74 -61 -69 158 513 65 -78 164 304 -202 -183 51 114 -100 109 75 -120
2917a20J07J23l46L14J35l74J87N3NK3l10l8J08j09K83J60J1M0j87j40j05J74
$$ -120 -13 110 -236 78 213 -161 26 79 84 107 -203 -241 -133 -242 41 201 212 252 65 -75 -180 -6
2939fqJ90j97j5KK07n2p0o8P6j71M59j65m06N26l19q3J61k03l6J67J69k16o6R9
$$ -6 -14 176 -21 -36 -34 173 121 51 -17 59 -112 347 182 -224 302 -17 -100 61 -142 -178 -11 158 -58 -124 -25
2964b5K27j92l9Q5O2j68k52O65l30M70m28k71o9M70j40l3o1q1j29J80K36l64L39
$$ -25 202 10 -29 56 118 -50 -302 363 33 503 75 -196 -265 205 65 32 -29 -110 -239 -59 177 -187 152
2987A52l7o9r9J16J45j63L1k80J18J66J84l76J57k02K8R6J0m4J19k37J43j46L66
$$ 152 115 46 -53 63 208 45 76 -204 -86 80 264 -112 45 -157 -129 -33 -23 -67 52 -185 -42 -188 178
3010A78m07K55j00O9J7j39P2J56j33l30M06l08O2L37l12N92l69o1j20K8L7j4r5
$$ 178 -229 26 -74 -5 12 -127 -55 101 -32 -362 44 -264 -202 135 -177 415 46 -15 -135 -107 -70 -84 -179
3033a79M8P2J00L62m57p1K44k7p2j88N3r8J86J15j68J05j70J48K74k90l37M89
$$ -179 -131 -59 41 403 -54 -125 119 92 20 -168 -115 -213 -27 88 -80 25 -145 3 277 -13 -350 139
3055A39m43M01J78k09l22J88j47R6J51L5k81J22L05l74K46j13K04L4j2kK4l73
$$ 139 -304 97 275 66 -256 -68 -215 -119 32 67 -214 -92 213 -161 85 -28 176 210 198 196 220 -153
3077a53O8p6J70L22l49j69K36J76j14j93J92k93K98P2J12k39j95K03J61j55j21
$$ -153 -85 -161 9 331 -18 -187 49 225 111 -82 110 -183 115 187 299 60 -135 68 229 74 -47
3098d7N4k42L02k34K53k69%M02k45p6R4P4J76Kn0j68j56k1K17M3k46L35o95J48
$$ -47 7 -235 67 -167 86 -183 -183 219 -26 -102 -8 66 242 244 194 26 -130 -151 66 109 -137 198 -497 -349
3122c49N76j74J00k47n3M37l68KK14K21o78L56J11k95Jj13K13m2j1Q1j66L85k50
$$ -349 227 53 153 -94 -147 290 -78 -76 138 359 -319 37 148 -147 -146 -259 -46 -88 -99 -18 -184 201 -49
3145d9K31k5j9l95o5J15J27k52L52J07k93J36j97L50J46k88k10M05k84K89J51
$$ -49 182 157 138 -257 -322 -207 -80 -332 20 127 -166 -30 -227 123 269 -19 -229 176 -108 181 332
3166C32k24oJ5O0j49n8l5K95n5M4m14O0kR8K81l04j1j20J37j2n6J81j0J8N5J5
$$ 332 108 102 117 177 28 -30 -65 230 175 219 -195 -135 -137 -39 242 -62 -73 -193 -56 -68 -124 57 47 65 120 135
3192A35J72m66J97o1j90K71k7K76k11j27k23L77j18k83J33m2L72j84J36j03K44
$$ 135 307 -159 38 -23 -213 58 31 307 96 -31 -254 123 5 -278 -145 -187 185 1 137 34 278
3213B78k28l42K15J24J25j47K4j08l4m0j6J48J30j50K47k86N36n29j86J90P8N2
$$ 278 50 -292 -77 47 172 25 49 -59 -93 -133 -149 -1 129 -21 226 -60 476 -53 -239 -49 29 81
3235H1l6pJ79P7l47J38O9M4l52J56j41R5K73j94Q7j73Q4K1m2J0k33K35J30q2o5
$$ 81 45 38 217 294 -53 85 154 198 -154 2 -139 -44 229 35 122 -51 33 54 12 22 -211 24 154 72 7
3260GRM6J40l32J80R5k07m0r1K70r1j9j77J81L11j58k37J3QJ89k9K8j42Q7j19
$$ 7 16 62 202 -130 50 145 -62 -102 -193 77 -14 -33 -210 -29 282 124 -113 -100 -92 97 68 96 -46 41 -78
3285g8M3K52k52J35k72K65k3l2J38k51j99M17j58QK29m61J98L29j09o7l66K78
$$ -78 -35 217 -35 100 -172 93 70 38 176 -75 -274 143 -15 -7 222 -239 -41 288 179 112 -254 24
3307B4j52J18J19j93K69k74J23p2k08N28O3j58j61p1L91k35j19q9J27j63Q1N3
$$ 24 -128 -10 109 -84 185 -89 34 -38 -246 282 345 187 26 -45 346 111 -8 -97 30 -133 -52 1
3329Ap3l04K48NL52r9l32p9K22m2K50k07pl3K29j06k4J93k33J94j01Q9l33P4J34
$$ 1 -72 -376 -128 -123 229 130 -202 -281 -59 -101 149 -58 -65 -98 131 25 1 194 -39 155 54 143 -190 -116 18
3354A8L98m89MJ46j04j43L86l23K61n2j70nM00l88P2L93n86K75j51J88l5J34%
$$ 18 416 -73 -69 77 -27 -170 216 -107 154 102 -68 -73 327 -61 11 404 -182 93 -58 130 95 229 229
3377B29k07k55L04J12m24J39j5L31j04j52O1j64q9K28J84j63L63m64j59J27J16
$$ 229 22 -233 71 183 -241 -102 -117 214 110 -42 19 -145 -234 -6 178 15 378 -86 -245 -118 -2
3398bj49o1l07O11Pk88r8K97K07o9O9j29P6oM56l78j73k88N65l42M2J59j85k73
$$ -2 -151 -212 -519 92 99 -189 -287 10 217 148 217 88 164 158 614 236 63 -225 340 -2 40 199 14 -259
3422b59J16J63j63q5rJ11K88L39k63j56j2j76J43k12J76k21L78j12l3P7k01J17
$$ -259 -143 20 -143 -228 -237 -126 162 501 238 82 70 -106 37 -175 1 -220 158 46 13 90 -111 6
3444Fp4J94J76k31j24J1J41j44J67L0j50K02l98M06j33rJ50k94n3j78K65J03k23
$$ 6 -68 126 302 71 -53 -42 99 -45 122 152 2 204 -194 212 79 70 220 -74 -127 -305 -40 63 -160
3467a60K07K03k27M1k08M59k19j70M2m09O31j59m3l64L11K7j30L18m32M73k23
$$ -160 47 250 23 64 -144 315 96 -74 -32 -441 190 31 -12 -376 -65 -38 -168 150 -282 191 -32
3488c2J6L46l37j27K40J82k54j73LR8k04J93K61j24M0J6O2l00J42m75L15J22L16
$$ -32 -16 330 -7 -134 106 288 34 -139 -136 -38 -242 -49 212 88 128 144 206 -94 48 -427 -112 10 326
3511C26o38N42j87J58k56QM8K05l71J3K92m21K14K88k66J06M9k7l3k15j65K99
$$ 326 -312 230 43 201 -55 -47 1 206 -165 -152 140 -281 -67 221 -45 61 110 83 50 -165 -330 -31
3533c1J88j49K97M7k61k60J66M08m42J65k4J6j71J50l0P1j20J11m13K68j67o3
$$ -31 157 8 305 352 91 -169 -3 405 -37 128 104 120 -51 99 69 140 20 131 -282 -14 -181 -244
3555b44N2K71l8J19q7P2J70k46k42J6L30J61n87K28k85L94J2m4j92M26j99MK21
$$ -244 -192 79 41 160 73 145 315 69 -173 -157 173 334 -253 -25 -310 84 96 52 -140 286 87 91 312
3578C12n43R9P1P4j9J50q8j48o2J01J36k17K90k59J42o48Q06k54k85N21j17J37
$$ 312 -231 -132 -61 13 -6 144 56 -92 -154 -53 83 -134 156 -103 39 -609 197 -57 -342 179 62 199
3600A99j72N9k5k20L7j36K01L9Q7p5J08j40J02J69j85q6K8N2Q5j72j77rJ53K2
$$ 199 27 86 61 -159 -122 -258 -57 -18 69 -6 102 -38 64 233 48 -38 -10 42 127 -45 -222 -231 -78 -56
3624e6n9K3K40k6m0j8j78j01K89j16J97j01K2Q5j58kj87L62j17k40J4j00J04N3
$$ -56 -115 -92 148 122 82 64 -114 -215 74 -42 155 54 76 161 3 1 -186 176 59 -181 -167 -267 -163 -110
3648a10L86J22m36l0Q2J56k25OO6Q3j04P4l73M25k34J91p3r8j08K84M0m44M99
$$ -110 276 398 -38 -68 14 170 -55 -49 17 100 -4 70 -303 122 -112 79 6 -92 -200 84 124 -320 179
3671A79k22J06l40L58J24n07M15q0J10O3m55J95J66l06m0K56j32r3M19j74j03
$$ 179 -43 63 -277 81 205 -302 113 33 143 206 -249 -54 112 -194 -234 22 -110 -203 216 42 -61
3692f1J57j43PJ68J57j64j02J53l3k02J66k08P1j86O92o50M09j99l4Q8M9P3o1
$$ -61 96 -47 -40 128 285 121 19 172 139 -63 103 -105 -34 -220 472 -178 231 32 -2 86 135 208 147
3715A47j03P0K69m37J0j64L50j30J89l19J37J21k61Q6L05p8j48N7J15k60nO7J48
$$ 147 44 114 383 -54 -44 -208 142 12 201 -118 19 140 -121 -35 270 192 44 101 216 -44 -49 18 166
3738A66m76M62j93J3L7l94Q1L01J90l91L24J28n13K38qj77J42Q8J15m4J58r0l71
$$ 166 -310 152 -41 -28 9 -385 -304 -3 187 -204 120 248 -265 -27 -35 -212 -70 18 133 89 247 157 -214
3761b14m5K39k04K17J80K3k13mj23n7J37L09l98J49K29j32K3O5p8M8nk25L72o31
$$ -214 -259 -20 -224 -7 173 196 -17 -21 -144 -201 -64 245 -153 -4 225 93 116 181 103 151 146 -79 293 -338
3785c38J67K07J06k15r0K78l8j85J64L49o12L21k0j88L73j77j46L12l90K41j2
$$ -338 -171 36 142 -73 -163 115 77 -108 56 405 -207 114 94 -94 279 102 -44 268 -122 119 107
3806A07o5J09l57J08J26J90n84M48k4rm14L84O9K04k49L9j9j48J84j55J22J66
$$ 107 42 151 -206 -98 28 218 -366 82 58 49 -365 19 88 292 43 82 63 -85 99 -56 66 232
3828B32k12J1P0L47l05k76K10j21L28l80K17J29k22j69r3J33Q2K0l4j45M2N1J00
$$ 232 20 31 101 448 143 -133 77 -44 284 -96 121 250 28 -141 -234 -101 -19 1 -33 -178 -136 -85 15
3851A5j23L68l14L91j71p5r1j5r6J27Po7j81j20L82m99N02m1kM8j21M18k78l03
$$ 15 -108 260 -54 337 166 91 0 -15 -111 16 23 -44 -225 -345 37 -462 40 -1 -3 45 -76 342 64 -239
3875b39M46p5j94k6k59L22N8k14K39k61mlJ51J26P9l48L65l03r4K6K57j22k07
$$ -239 207 132 -62 -88 -347 -25 33 -181 58 -203 -207 -210 -59 67 146 -202 163 -140 -234 -208 49 -73 -280
3898b80M94k89J23k80L25j5j09J26q8j52Q4J35K5j06NQ8K72j70l28r5Q2J86o7
$$ -280 214 -75 48 -232 93 78 -31 95 7 -145 -61 74 99 -7 -2 86 358 188 -140 -235 -153 33 -34
3921c4j61J04L86m06k08K06J92K40m66K02J4l70N92j22j32j85M56k57j84R7J67
$$ -34 -195 -91 295 -111 -319 -113 79 319 -147 55 69 -301 291 169 37 -148 308 51 -133 -36 131
3942A31j3k48J04m4M04o16J69K29Oj68K35k42J8K61r0j92K20P0j29k14o9O0K01
$$ 131 118 -130 -26 -70 334 -282 -113 116 122 -46 189 -53 -35 226 136 -56 164 234 105 -109 -178 -118 83
3965H3j80L5l59N00k49K09j62K43l42K12n9l00J35J82N23k70N7k63m7j98L36k80
$$ 83 -97 -62 -421 79 -170 39 -123 120 -222 -10 -69 -369 -234 -52 471 201 258 -5 -52 -250 86 -194
3987a94Q8Q6m18L41M5p1M60k56j57N4J2O5k0r3K83k75K04Qj87O2j42J12o6J09
$$ -194 -106 -20 -438 -97 -52 -123 337 81 -76 -22 -10 55 35 -58 225 -50 154 162 -25 37 -105 7 -59 50
$$ [...]
8191G6
##END NTUPLES=NMR FID
##END=
