##TITLE=1H_DE-43H_2
 D2O
 8 sc, 
 30.10.2024
##JCAMPDX= 6.0         $$ Bruker NMR JCAMP-DX V2.0
##DATA TYPE= NMR FID
##DATA CLASS= NTUPLES
##ORIGIN= UXNMR, Bruker Analytische Messtechnik GmbH
##OWNER= root
$$ XWIN-NMR		Version 3.5
$$ Wed Oct 30 15:16:57 2024 Russian Standard Time (UT+4h)  she@DPX200
##.OBSERVE FREQUENCY= 200.1318
##.OBSERVE NUCLEUS= ^1H
##.DELAY= (6, 6)
##.ACQUISITION MODE= SIMULTANEOUS
##.ACQUISITION SCHEME= undefined
##.AVERAGES= 8
##.DIGITISER RES= 18
##SPECTROMETER/DATA SYSTEM= spect
##.PULSE SEQUENCE= zg30
##.SOLVENT NAME= DMSO
##.SHIFT REFERENCE= (INTERNAL, DMSO, 0, 15.7039)
##AUDIT TRAIL= $$ (NUMBER, WHEN, WHO, WHERE, WHAT)
$$ ##TITLE= Audit trail, XWIN-NMR		Version 3.5
$$ ##JCAMPDX= 5.01
$$ ##ORIGIN= Bruker BioSpin GmbH
$$ ##OWNER= she
$$ F:/spectra/data/she/nmr/H-F/1/audita.txt
$$ ##AUDIT TRAIL=  $$ (NUMBER, WHEN, WHO, WHERE, WHAT)
(   1,<2024-10-30 15:16:05.92 +0400>,<she>,<DPX200>,
      <created by zg, POWCHK disabled, PULCHK disabled
       configuration hash MD5:
       00 E9 B6 7A A2 85 ED C7 34 08 36 98 17 FE 4E 26
       data hash MD5: 16K
       2E 21 F4 D8 EB CA 80 9C 13 EB 62 54 20 DC D2 2D>)
$$ ##END=
$$ 
$$ hash MD5
$$ 4C 71 4E 2D 05 B3 7E 04 BD 08 1E A5 A2 6F A3 44
##$RELAX= 
##$RELAX= 
##$RELAX= 
##$RELAX= 
##$RELAX= 
##$RELAX= 
$$ Bruker specific parameters
$$ --------------------------
##$DU= <F:/spectra>
##$EXPNO= 1
##$NAME= <H-F>
##$PROCNO= 1
##$TYPE= <nmr>
##$USER= <she>
##$AMP= (0..31)
100 100 100 100 100 100 100 100 100 100 100 100 100 100 100 100 100 100 
100 100 100 100 100 100 100 100 100 100 100 100 100 100 
##$AQSEQ= 0
##$AQ_mod= 1
##$AUNM= <au_zg>
##$AUTOPOS= <>
##$BF1= 200.13
##$BF2= 200.13
##$BF3= 200.13
##$BF4= 200.13
##$BF5= 200.13
##$BF6= 200.13
##$BF7= 200.13
##$BF8= 200.13
##$BYTORDA= 1
##$CFDGTYP= 0
##$CFRGTYP= 5
##$CHEMSTR= <none>
##$CNST= (0..31)
1 1 145 1 1 1 1 1 1 1 1 1 1 1 1 1 1 1 1 1 1 1 1 1 1 1 1 1 1 1 1 1 
##$CPDPRG= <>
##$CPDPRG1= <>
##$CPDPRG2= <>
##$CPDPRG3= <>
##$CPDPRG4= <mlev>
##$CPDPRG5= <mlev>
##$CPDPRG6= <mlev>
##$CPDPRG7= <mlev>
##$CPDPRG8= <mlev>
##$CPDPRGB= <>
##$CPDPRGT= <>
##$D= (0..31)
0 1.2 0 0 0 0 0 0 0 0.06 0 0.03 0 0 0 0 0.0002 0 0 0 0 0 0 0 0 0 0 0 0 
0 0 0 
##$DATE= 1730286965
##$DBL= (0..7)
120 120 120 120 120 120 120 120 
##$DBP= (0..7)
150 150 150 150 150 150 150 150 
##$DBP07= 0
##$DBPNAM0= <>
##$DBPNAM1= <>
##$DBPNAM2= <>
##$DBPNAM3= <>
##$DBPNAM4= <>
##$DBPNAM5= <>
##$DBPNAM6= <>
##$DBPNAM7= <>
##$DBPOAL= (0..7)
0.5 0.5 0.5 0.5 0.5 0.5 0.5 0.5 
##$DBPOFFS= (0..7)
0 0 0 0 0 0 0 0 
##$DE= 6
##$DECBNUC= <off>
##$DECIM= 24
##$DECNUC= <off>
##$DECSTAT= 4
##$DIGMOD= 1
##$DIGTYP= 9
##$DL= (0..7)
0 120 120 120 120 120 120 120 
##$DP= (0..7)
150 150 150 150 150 150 150 150 
##$DP07= 0
##$DPNAME0= <>
##$DPNAME1= <>
##$DPNAME2= <>
##$DPNAME3= <>
##$DPNAME4= <>
##$DPNAME5= <>
##$DPNAME6= <>
##$DPNAME7= <>
##$DPOAL= (0..7)
0.5 0.5 0.5 0.5 0.5 0.5 0.5 0.5 
##$DPOFFS= (0..7)
0 0 0 0 0 0 0 0 
##$DQDMODE= 0
##$DR= 18
##$DS= 0
##$DSLIST= <SSSSSSSSSSSSSSS>
$$ [...]
##$SUBNAM2= <"">
##$SUBNAM3= <"">
##$SUBNAM4= <"">
##$SUBNAM5= <"">
##$SUBNAM6= <"">
##$SUBNAM7= <"">
##$SUBNAM8= <"">
##$SUBNAM9= <"">
##$SW= 24.0689170037331
##$SWIBOX= (0..15)
0 0 2 0 0 0 0 0 0 0 0 0 0 0 0 0 
##$SW_h= 4816.95568400771
##$TD= 16384
##$TD0= 1
##$TE= 0
##$TE2= 300
##$TE3= 300
##$TEG= 300
##$TL= (0..7)
0 120 120 120 120 120 120 120 
##$TP= (0..7)
150 150 150 150 150 150 150 150 
##$TP07= 0
##$TPNAME0= <>
##$TPNAME1= <>
##$TPNAME2= <>
##$TPNAME3= <>
##$TPNAME4= <>
##$TPNAME5= <>
##$TPNAME6= <>
##$TPNAME7= <>
##$TPOAL= (0..7)
0.5 0.5 0.5 0.5 0.5 0.5 0.5 0.5 
##$TPOFFS= (0..7)
0 0 0 0 0 0 0 0 
##$TUNHIN= 0
##$TUNHOUT= 0
##$TUNXOUT= 0
##$USERA1= <user>
##$USERA2= <user>
##$USERA3= <user>
##$USERA4= <user>
##$USERA5= <user>
##$V9= 5
##$VALIST= <valist>
##$VCLIST= <CCCCCCCCCCCCCCC>
##$VD= 0
##$VDLIST= <DDDDDDDDDDDDDDD>
##$VPLIST= <PPPPPPPPPPPPPPP>
##$VTLIST= <TTTTTTTTTTTTTTT>
##$WBST= 1024
##$WBSW= 4
##$XGAIN= (0..3)
0 0 0 0 
##$XL= 0
##$YL= 0
##$YMAX_a= 247288
##$YMIN_a= -212781
##$ZGOPTNS= <>
##$ZL1= 120
##$ZL2= 120
##$ZL3= 120
##$ZL4= 120
##$ABSF1= 10
##$ABSF2= 0
##$ABSG= 5
##$ABSL= 3
##$ALPHA= 0
##$AQORDER= 0
##$ASSFAC= 0
##$ASSFACI= 0
##$ASSFACX= 0
##$ASSWID= 0
##$AUNMP= <proc_1d>
##$AZFE= 0.1
##$AZFW= 0.1
##$BCFW= 1
##$BC_mod= 2
##$BYTORDP= 1
##$COROFFS= 0
##$CY= 11.3945322036743
##$DATMOD= 1
##$DC= 2
##$DFILT= <>
##$DTYPP= 0
##$F1P= 15.6554695791079
##$F2P= 12.8336369535428
##$FCOR= 0.5
##$FTSIZE= 0
##$FT_mod= 4
##$GAMMA= 1
##$GB= 0.15
##$INTBC= 1
##$INTSCL= 1
##$ISEN= 128
##$LB= 0.24
##$LEV0= 0
##$LPBIN= 0
##$MAXI= 10000
##$MC2= 0
##$MEAN= 0
##$ME_mod= 0
##$MI= 1.114404
##$NCOEF= 0
##$NC_proc= 0
##$NLEV= 6
##$NOISF1= 3.799351
##$NOISF2= 2.8
##$NSP= 1
##$NTH_PI= 0
##$NZP= 0
##$OFFSET= 15.70392
##$PC= 1
##$PHC0= -26376.83
##$PHC1= 47.78743
##$PH_mod= 1
##$PKNL= yes
##$PPARMOD= 0
##$PSCAL= 0
##$PSIGN= 0
##$REVERSE= no
##$SF= 200.130013532006
##$SI= 16384
##$SIGF1= 3
##$SIGF2= 2
##$SINO= 400
##$SIOLD= 16384
##$SREGLST= <1H.CDCl3>
##$SSB= 0
##$STSI= 0
##$STSR= 0
##$SW_p= 3612.71676300578
##$SYMM= 0
##$S_DEV= 0
##$TDeff= 0
##$TDoff= 0
##$TI= <>
##$TILT= no
##$TM1= 0
##$TM2= 0
##$TOPLEV= 0
##$USERP1= <user>
##$USERP2= <user>
##$USERP3= <user>
##$USERP4= <user>
##$USERP5= <user>
##$WDW= 1
##$XDIM= 8192
##$YMAX_p= 0
##$YMIN_p= 0
$$ End of Bruker specific parameters
$$ ---------------------------------
##NTUPLES= NMR FID
##VAR_NAME=  TIME,          FID/REAL,        FID/IMAG
##SYMBOL=    X,             R,               I
##VAR_TYPE=  INDEPENDENT,   DEPENDENT,       DEPENDENT
##VAR_FORM=  AFFN,          ASDF,            ASDF
##VAR_DIM=   8192,          8192,            8192
##UNITS=     SECONDS,       ARBITRARY UNITS, ARBITRARY UNITS
##FACTOR=    0.0002076,     1,               1
##FIRST=     0,             0,               0
##LAST=      1.7004516,     0,               0
##MIN=       0,             -212781,         0
##MAX=       1.7004516,     247288,          0
$$ Real data points
##PAGE= N=1
##DATA TABLE= (X++(R..R)), XYDATA
$$ plain form
0 0 0 0 0 0 0 0 0 7 -8 8 -8 15 -16 16 -24 24 -32 40 -46 55 -64 72 -86 101 -114 132 -150 171 -195 220 -249
31 -249 279 -313 353 -394 442 -490 544 -607 671 -741 823 -911 1008 -1116 1239 -1372 1526
48 1526 -1699 1900 -2134 2411 -2741 3150 -3666 4340 -5266 6622 -8802 12971 -37864 230912
62 230912 205999 -74375 -48220 -123155 -85898 183662 186757 -88166 -158911 -94973 36491
73 36491 165659 80825 -97258 -118710 -61238 85136 185394 19885 -152531 -96237 -18204
84 -18204 91413 172669 -30727 -212781 -53516 93327 101335 101931 -54805 -208511 -36554
95 -36554 160139 111927 -10355 -129625 -141632 56495 166694 53435 -50605 -111589 -94316
106 -94316 95581 169376 -10221 -119356 -85357 -24032 102006 132369 -37165 -127757 -56688
$$ packed form
0@%%%%%%%Pj5J6j6K3l1L2m0M8n6P2q6J01j19J36j58J87k15K46k82L21l66M15m69
31b49N28n92O66p47Q36r32J034j151J278j412J564j734J919k124K355k611K898
48A526l225L599m034M545n152N891o816Q006r606J1888j5424K1773n0835K68776
62B30912k4913k80374K6155p4935L7257K69560L095k74923p0745O3938J31464
73C6491J29168q4834j78083k1452N7472J46374J00258j65509j72416N6294P8033
84a8204J09617Q1256k03396j82054J59265J46843Q008N96j56736j53706J71957
95c6554J96693m8212j22282j19270j2007J98127J10199j13259j04040o0984J7273
106i4316J89897P3795j79597j09135L3999O1325J26038L0363j69534r0592P1069
$$ plain form
117 -56688 26800 119298 102758 -89294 -153876 -10948 83466 94981 42374 -108186 -136513
128 -136513 34847 134611 75723 -33921 -128506 -78152 86848 120343 16482 -72917 -109930
139 -109930 -28731 116735 102658 -30445 -91246 -76781 14318 126823 67709 -81119 -92995
150 -92995 -29720 37547 115102 49578 -112035 -102052 26130 82286 78405 -2635 -117702 -77060
162 -77060 61641 97858 43746 -50182 -116899 -29375 101493 81917 -8736 -69036 -86538 5238
174 5238 111804 60549 -48783 -81006 -52573 40572 110487 26763 -81305 -70023 -11051 60659
186 60659 94523 -3764 -102635 -55284 30328 73330 63146 -38484 -106924 -24162 66320 68994
198 68994 26662 -61242 -96642 9888 92382 48112 -20151 -70850 -64785 39156 94282 22666
$$ packed form
117e6688Q3488R2498j6540j92052o4582J42928R4414J1515n2607j50560k8327
128a36513J71360R9764n8888j09644r4585N0354J65000L3495j03861q9399l7013
139a09930Q1199J45466j4077j33103o0801J4465R1099J12505n9114j48828j1876
150i2995O3275O7267P7555o5524j61613R983J28182N6156l881q1040j15067M0642
162g7060J38701L6217n4112r3928o6717Q7524J30868j9576r0653o0300j7502R1776
174E238J06566n1255j09332l2223K8433R3145O9915q3724j08068J1282N8972P1710
186F0659L3864r8287r8871M7351Q5612M3002j0184j01630o8440Q2762R0482K674
198F8994m2332q7904l5400J06530Q2494m4270o8263n0699O065J03941N5126p1616
$$ plain form
210 22666 -48293 -65946 -31774 62240 86593 -10460 -72648 -50374 1564 70796 66459 -38298
222 -38298 -82181 -23522 36870 70392 36888 -62080 -79059 6189 59261 52825 2203 -72791
234 -72791 -60196 35898 71229 30613 -27181 -71843 -33224 58036 65455 -252 -48914 -59747
246 -59747 -6068 72140 54598 -28130 -59257 -35166 21583 71742 31008 -53379 -61201 -8351
258 -8351 42878 61396 5686 -65910 -47532 21309 55558 40404 -20718 -69651 -29106 43093
270 43093 53779 14381 -39923 -60287 -3221 60277 44649 -11338 -50334 -44129 18465 64092
282 64092 25746 -36549 -51115 -20056 37232 60286 5483 -52027 -42308 6240 47794 43419
294 43419 -18031 -59683 -26689 28217 49438 23900 -34807 -55168 -4508 45126 41429 -231
$$ packed form
210B2666p0959j7653L4172R4014K4353r7053o2188K2274N1938O9232m337j04757
222c8298m3883N8659O0392L3522l3504r8968j6979Q5248N3072o436n0622p4994
234g2791J2595R6094L5331m0616n7794m4662L8619R1260P419o5707m8662j0833
246e9747N3679P8208j7542q2728l1127K4091N6749N0159m0734q4387p822N2850
258h351N1229J8518n5710p1596J8378O8841L4249j5154o1122m8933M0545P2199
270D3093J0686l9398n4304k0364N7066O3498j5628n5987l8996O205O2594M5627
282F4092l8346o2295j4566L1059N7288K3054n4803n7510R719M8548M1554m375
294D3419o1450m1652L2994N4906K1221k5538n8707k0361N0660M9634l697m1660
$$ plain form
306 -231 -46263 -45046 15373 53576 25276 -21812 -46332 -25354 32575 53867 7347 -39888 -41125
319 -41125 -3017 42281 41520 -12420 -48322 -28416 17969 48145 25589 -30795 -46950 -9083
331 -9083 32425 41731 6037 -42908 -39847 10405 41678 29209 -11595 -46226 -25573 28660 43106
344 43106 11070 -28122 -41949 -9010 39699 37111 -7198 -37416 -29741 9924 44522 24807
356 24807 -24162 -39738 -14277 24232 40441 9014 -35584 -35602 3177 35530 30969 -8685 -40151
369 -40151 -23450 17692 37487 18278 -23665 -40277 -7739 31596 32891 1005 -32326 -31698 7963
382 7963 38080 22668 -15274 -35367 -18795 20587 37106 9741 -27048 -32319 -3040 31381
394 31381 30272 -5939 -33487 -23499 10928 34252 19494 -18939 -34726 -10226 23833 31331 5250
$$ packed form
306b31m6032J217O0419L8203k8300m7088k4520K0978N7929K1292m6520m7235j237
319d1125L8108M5298p61n3940l5902J9906M6385L0176k2556n6384j6155L7867
331i083M1508R306l5694m8945L061N0252L1273j2469m0804l4631K0653N4233J4446
344D3106l2036l9192j3827L2939M8709k588m4309l0218P675L9665L4598j9715
356B4807m8969j5576K5461L8509J6209l1427m4598j8L8779L2353m561l9654l1466
369d0151J6701M1142J9795j9209m1943j6612L2538L9335J295l1886l3331O28L9661
382G963L0117j5412l7942k0093J6572L9382J6519k7365l6789n271K9279L4421
394C1381j109l6211k7548R988L4427K3324j4758l8433j5787K4500L4059P498k6081
$$ plain form
407 5250 -27582 -29382 2598 31900 24379 -10455 -33238 -18020 16119 32142 12801 -21754 -31039
420 -31039 -4897 26018 27297 -1203 -28569 -24812 7607 30687 18513 -13642 -30411 -13308
432 -13308 19238 29580 6584 -22645 -26811 -1268 26796 23908 -6400 -27846 -18728 11164 29366
445 29366 14571 -17212 -28325 -7839 20321 26714 1981 -25089 -22450 5067 25367 19297 -8633
458 -8633 -28144 -14197 15976 25773 8480 -17508 -25937 -3357 23440 22024 -2532 -23159 -19237
471 -19237 7373 26638 14659 -12950 -24320 -10385 15734 25328 4063 -21095 -21085 549 21848
484 21848 20613 -6774 -25140 -13451 10561 22599 11718 -14775 -25044 -4391 18558 20145
496 20145 1765 -19888 -20381 5439 23010 13502 -8116 -21663 -12818 13099 22891 5267 -15510
$$ packed form
407E250l2832j800L1980K9302p521l4834k2783J5218L4139J6023j9341l4555r285
420c1039K6142L0915J279k8500k7366L757L2419K3080j2174l2155j6769J7103
432a3308L2546J0342k2996k9229m166K5543K8064k888l0308k1446R118K9892J8202
445B9366j4795l1783j1113K0486K8160O393k4733k7070K639K7517K0300o070k7930
458h633j9511J3947L0173R797j7293k5988q429K2580K6797j416k4556k0627L922
471a9237K6610J9265j1979k7609j1370J3935K6119R594k1265k5158J0K1634K1299
484B1848j235k7387j8366J1689K4012J2038j0881k6493j0269K0653K2949J587
496B0145j8380k1653m93K5820J7571r508k1618j3547Q845K5917R792j7624k0777
$$ plain form
509 -15510 -19853 -3758 19491 19648 -4556 -20059 -14275 4972 22150 13267 -13274 -21450 -5323
522 -5323 12412 20120 5118 -18904 -18969 3773 17471 14304 -3287 -21105 -13355 11283 19171 6993
536 6993 -10942 -19845 -5365 17377 16969 -1153 -15619 -16174 3057 20892 11459 -8878 -16980 -8986
550 -8986 9536 20503 5072 -16395 -15466 -470 14174 16572 -2408 -19814 -10978 7528 15569
563 15569 10026 -8502 -19242 -4735 13740 14841 2393 -13743 -16596 2320 17130 10681 -5045
576 -5045 -15498 -11056 8825 18258 4003 -11213 -13962 -4247 13064 15913 -2403 -15893 -10144
589 -10144 3265 14723 11362 -8339 -16885 -4439 10078 13854 4391 -12504 -15170 1141 13899
602 13899 10789 -1831 -14784 -10561 7819 15061 5180 -7538 -14381 -5326 12444 14067 -1484
$$ packed form
509a5510m343J6095K3249J57k4204j5503N784J9247J7178q883k6541q176J6127
522e323J7735P708j5002k4022o5K2742J3698l167j7591j7818P750K4638P888j2178
536F993j7935q903J4480K2742m08j8122j4466n55J9231J7835r433k0337q102P994
550h986J8522J0967j5431k1467R29J4996J4644K398j8980j7406Q836J8506Q041
563A5569n543j8528j0740J4507J8475J101j2448j6136k853J8916J4810o449j5726
576e045j0453M442J9881R433j4255j5216k749R715J7311K849j8316j3490N749
589a0144J3409J1458l361j9701q546J2446J4517L776r463j6895k666J6311J2758
602A3899l110j2620j2953M223J8380P242r881j2718o843R055J7770J623j5551
$$ plain form
615 -1484 -11585 -10484 481 14780 10999 -7549 -13925 -5507 5765 13962 5564 -11848 -12837 520
629 520 9945 11370 307 -14107 -9848 6025 12033 6481 -4762 -14522 -5184 11007 11551 1185
643 1185 -8179 -12482 -555 14104 8652 -4785 -10270 -8399 4033 15015 4515 -9943 -9912 -2745
657 -2745 7749 13241 -146 -12964 -7826 2678 9474 9170 -4354 -13487 -3671 7364 9475 4971
671 4971 -7804 -13259 314 10977 6974 -485 -9649 -10300 4668 12951 3732 -5282 -9373 -5885
685 -5885 8059 12112 -789 -9165 -7842 -1010 9816 9849 -4672 -10574 -4150 3576 10052 5580 -7830
700 -7830 -10508 -291 6749 8455 1816 -10474 -8321 3543 8864 5593 -2630 -11055 -5325 7950
714 7950 8910 1119 -5516 -9084 -1695 10218 7975 -3260 -7883 -6058 2343 10822 5188 -6913 -8347
$$ packed form
615a484j0101J101J0965J4299l781j8548o376Q418J1272Q197q398j7412r89J3357
629E20R425J425j1063j4414M259J5873O008n552j1243r760R338J6191N44j0366
643A185r364m303J1927J4659n452j3437n485J871J2432J0982j0500j4458L1P167
657b745J0494N492j3387j2818N138J0504O796l04j3524r133R816J1035K111m504
671D971j2775n455J3573J0663m003p459r164o51J4968Q283r219r014m091L488
685e885J3944M053j2901q376J323O832J0826L3j4521n902O424P726O476m472j3410
700g830k678J0217P040J706o639j2290K153J1864N321l271q223q425N730J3275
714G950R60p791o635l568P389J1913k243j1235m623J825Q401Q479n634j2101j434
$$ plain form
729 -8347 -2328 5149 9552 1356 -9157 -7128 1391 7085 6997 -1777 -10297 -4670 5402 7882 3061
744 3061 -4830 -9172 -1580 8353 7011 -863 -6860 -7047 2187 9500 4321 -4742 -7504 -3765 4703
759 4703 9255 1267 -7081 -6080 -252 6769 7334 -2010 -8720 -3902 3156 6648 4787 -4309 -8819
774 -8819 -1165 6513 5711 1126 -5723 -7426 1502 8171 3752 -2584 -6847 -4755 4411 8473 1148
789 1148 -5178 -6104 -1630 6140 7078 -2262 -6841 -3946 1231 6899 4892 -4365 -7298 -1262 3856 6042
805 6042 2810 -6645 -6729 1811 5837 4495 -543 -7113 -4798 4573 6129 1792 -2460 -6830 -2286 6433
821 6433 5347 -1132 -4592 -5473 339 7286 3442 -3655 -4871 -2606 2599 7117 1564 -5463 -4459
836 -4459 -404 3711 5818 -258 -6790 -3339 2734 5059 3464 -2841 -7532 -1634 4941 4511 1214
$$ packed form
729h347O019P477M403q196j0513K029Q519N694q8q774q520N627J0072K480m821
744C061p891m342P592R933j342p874n997j87R234P313n179r063k762L739Q468
759D703M552p988q348J001N828P021N65r344o710M818P058L492j861r096m510
774h819P654P678q02m585o849j703Q928O669m419o336m263K092R166M062p325
789A148o326r26M474P770R38r340m579K895N177N668k007r257k933O036N118K186
805F042l232r455q4Q540M026j342n038o570K315R371J556m337m252m370M544Q719
821F433j086o479l460q81N812O947l844p097j216K265N205M518n553p027J004
836d459M055M115K107o076o532L451O073K325j595o305m691N898O575m30l297
$$ plain form
851 1214 -4188 -5906 489 5986 3452 -1424 -4979 -4041 3011 6610 1335 -3593 -4651 -1754 4299
866 4299 5629 -541 -4757 -3485 987 4987 4171 -2509 -5606 -2043 2976 5184 1910 -4353 -5240 -27
882 -27 4537 3669 -425 -4987 -3997 2466 4957 2056 -2549 -4865 -1838 3864 4566 178 -4114 -4176 425
899 425 4607 3953 -1918 -4826 -2189 1718 4691 2496 -3674 -4764 -355 3632 3626 -33 -4461 -3563 1963
916 1963 4543 2202 -1510 -4721 -2380 3282 4604 749 -2904 -4097 -344 4329 3472 -1461 -3734
931 -3734 -2569 1171 4852 2225 -3311 -3885 -865 2279 4047 697 -4007 -3335 969 3491 2848 -868
947 -868 -4314 -1947 2740 3503 1226 -2355 -4157 -680 3848 2900 -707 -3073 -3445 1168 4496 1485
963 1485 -2266 -3214 -2103 2042 4109 170 -3413 -2885 -290 3266 3319 -934 -3856 -1699 1230 3435
$$ packed form
851A214n402j718O395N497k534m876l555R38P052L599n275m928j058K897O053
866D299J330o170m216J272M472M000q16o680l097L563N019K208l274o263q87N213
882b7M564q68m094m562R90O463K491k901m605k316L027N702P02m388m292o2M601
899D25M182o54n871k908K637L907K973k195o170j090M409L987ol659m428Q98N526
916A963K580k341l712l211K341N662J322l855l653j193L753M673q57m933k273
931c734J165L740L681k627n536n74L020L144J768l350m704O72M304K522o43l716
947h68l446K367M687P63k277l581j802L477M528r48l607k366l72M613L328l011
963A485l751r48J111M145K067l939l583N28K595L556N3m253k922K157K929K205
$$ plain form
979 3435 2191 -2415 -3965 -353 2429 2666 229 -3210 -3082 654 3060 1941 -744 -3418 -2074 2316
995 2316 2880 696 -1900 -2743 -971 2997 3063 -920 -2707 -2418 558 3330 1749 -1896 -3045 -688
1011 -688 1889 2905 643 -2761 -2777 715 2370 2207 -667 -3443 -1615 1580 2659 1411 -1496 -3362
1027 -3362 -893 2508 2529 -169 -2567 -2628 446 2853 2032 -1404 -2901 -1483 1541 2872 1289 -2145
1043 -2145 -2730 -322 2127 2495 -424 -2531 -1787 769 2475 1508 -1477 -2543 -909 2002 2577 301
1059 301 -2269 -2140 389 2710 1848 -638 -2447 -1835 1113 2706 931 -1719 -2307 -301 1885 2425
1075 2425 3 -2079 -2077 101 2156 1703 -784 -2528 -988 1287 2548 612 -1646 -2017 82 2162
1091 2162 1629 -268 -1986 -1700 1012 2308 917 -1116 -1974 -640 1644 2318 -70 -1703 -1900 163
$$ packed form
979C435j244m606j550L612K782K37k437l439J28L736K406j119k685k674J344M390
995B316N64k184k596q43J772L968O6l983j787K89K976K772j581l645j149K357
1011f88K577J016k262l404j6L492J655j63k874k776J828L195J079j248k907j866
1027c362K469L401K1k698k398o1L074K407q21l436j497J418L024J331j583l434
1043b145n85K408K449L68k919k107P44K556J706r67k985j066J634K911N75k276
1059C01k570J29K529K321q62k486j809O12K948J593j775k650n88K006K186N40
1075B425k422k082KK178K055m53k487j744J540K275J261j936k258l71K099K080
1091B162n33j897j718K86K712J296j391k033q58J334K284O74k388j633j97K063
$$ plain form
1107 163 1992 1651 -526 -1979 -1158 902 2010 1015 -1443 -2064 -220 1887 2121 -222 -1824 -1423 430
1124 430 2229 1316 -970 -2214 -516 1177 1812 201 -1216 -1502 -163 1797 1880 -483 -1944 -1074 1210
1141 1210 2248 987 -857 -1438 -472 1322 1496 60 -1418 -1959 394 1955 1197 -485 -1866 -968
1157 -968 965 1684 572 -1435 -1145 37 1401 1593 209 -1502 -1331 340 1926 856 -862 -1673
1173 -1673 -195 943 1583 422 -1473 -1198 39 1452 1322 -369 -1545 -929 774 1639 631 -954
1189 -954 -1638 -443 1120 1550 120 -1233 -1253 -65 1223 1108 -342 -1383 -961 523 1384 552 -1429
1206 -1429 -1176 -269 1244 1217 -208 -1589 -755 520 1293 834 -580 -1264 -931 1137 1283 12 -940 -1661
1224 -1661 -116 1332 996 -260 -1603 -839 618 1610 747 -980 -1136 -689 851 1375 -80 -1134 -726
$$ packed form
1107A63J829l41k177j453Q21K060J108r95k458o21J844K107K34k343j602M01J853
1124D30J799r13k286j244J698J693O35j611j417k86J339J960Q3k363j461Q70K284
1141A210J038j261j844n81R66J794J74j436j478n41K353J561p58j682j381Q98
1157i68J933P19j112k007K90J182J364J92j384j711J71J671J586j070j718q11
1173a673J478J138O40j161j895K75J237J413j30j691j176O16J703Q65j008j585
1189i54o84J195J563M30j430j353k0J188J288j15j450j041M22J484Q61q32j981
1206a429K53R07J513k7j425j381Q34J275P73m59j414o84L33K068J46j271r52p21
1224a661J545J448l36j256j343P64J457R92q63j727j56M47J540N24j455j054M08
$$ plain form
1241 -726 86 1200 1146 -885 -1642 -733 950 1064 421 -681 -1269 122 709 690 22 -1259 -918 688
1259 688 1549 433 -371 -908 -441 934 1158 16 -946 -523 175 895 1479 -821 -1503 -427 562 959
1277 959 747 -1062 -1181 137 1005 900 42 -1061 -1005 652 1096 863 -295 -1082 -470 894 1160 71
1295 71 -777 -1144 -310 1169 677 -712 -644 -731 592 1292 747 -600 -623 -185 669 1188 37 -736 -832 124
1315 124 402 668 -325 -994 -221 460 919 -41 -563 -940 -17 829 719 222 -784 -805 225 1071 72 -366
1335 -366 -908 -793 451 696 70 -1460 -687 -301 559 806 -383 -873 -466 55 729 557 -352 -772 213
1354 213 796 636 122 -446 -827 295 824 397 -28 -837 -654 501 1211 -22 -320 -1006 66 436 576
1373 576 -221 -817 -601 292 653 526 -345 -892 -80 441 454 176 -838 -379 211 722 440 8 -899 -562
$$ packed form
1241g26Q12J114n4k031p57R09J683J14o43j102n88J391N87j9o68j281L41J606
1259F88Q61j116q04n37M67J375K24j142r62M23O98P20N84k300o82J076R89L97
1277I59k12j809j19J318Q68j05q58j103N6J657M44k33j158p87O12J364K66j089
1295G1q48l67Q34J479m92j389O8q7J323P00n45j347k3M38Q54N19j151p73r6R56
1315A24K78K66r93o69P73O81M59r60n22l77R23Q46j10m97j006k1J030Q46r99m38
1335c66n42J15J244K45o26j530P73L86Q60K47j189m90M07N21O74j72r09m20R85
1354B13N83j60n14n68l81J122N29m27m25q09J83J155P10j233k98o86J072L70J40
1373E76p97n96K16Q93L61j27q71n47Q12N21J3k78j014M59N90N11k82m32r07L37
$$ plain form
1393 -562 568 701 28 -339 -524 -291 814 724 -151 -541 -427 85 798 704 -258 -613 81 358 431 577
1413 577 -636 -463 -2 366 612 -39 -747 -280 433 486 448 232 -674 -355 660 333 248 -207 -487 -75
1433 -75 703 224 -371 -599 -553 239 1020 344 -328 -50 -128 -90 356 144 -719 -553 -165 435 658 -36 -961
1454 -961 -111 165 531 184 -344 -572 300 277 351 212 -561 -613 301 711 308 -87 -132 -347 526 681 220
1475 220 -220 -261 -81 880 171 -252 -552 -221 242 476 -1 -387 -408 -177 258 161 -13 -539 -327 173 157
1496 157 310 22 -437 -313 324 400 -57 -400 -556 -72 310 117 -202 -318 -342 12 530 232 -225 -311 -377
1517 -377 99 737 -71 -342 -188 140 420 460 -287 -439 -523 332 387 235 -208 -524 -185 395 47 -74 -352
1538 -352 -507 45 852 6 -220 -500 -337 460 465 58 -454 -150 -65 386 209 125 -571 -65 122 91 105 -390
$$ packed form
1393e62J130J33o73l67j85K33J105r0q75l90J14N12P13r4r62l55O94K77P3J46
1413E77j213J73M61L68K46o51p08M67P13N3l8k16r06L19J015l27q5m55k80M12
1433g5P78m79n95k28M6P92P81o76o72K78p8L8M46k12q63J66L88O00K23o94r25
1454i61Q50K76L66l47n28k28Q72k3P4j39p73n2R14M10m03l95m5k15Q73J55m61
1475B20m40m1J80R61p09m23l00L31M63K34m77l86k1K31M35r7j74n26K12N00j6
1496A57J53k88m59J24O37P6m57l43j56M84L82j93l19j16k4L54N18k98m57q6o6
1517c77M76O38q08k71J54L28K80M0p47j52q4Q55N5j52m43l16L39N80l48j21k78
1538c52j55N52Q07q46k26k80J63P97Nm07n12L04Q5M51j77q4o96N06J87l1J4m95
$$ plain form
1560 -390 -453 117 55 6 139 -422 -533 48 426 -107 -135 -235 -496 361 396 24 -112 -427 -29 723 16 25
1582 25 -228 -217 13 552 367 -228 -106 -355 390 447 340 -527 -310 50 278 371 204 -133 24 31 379 437
1604 437 7 -399 -64 244 94 -70 -187 -263 -108 631 -163 -21 380 -86 252 281 -145 -23 -326 -237 367
1625 367 488 -24 -55 -190 -106 333 234 -338 -280 -45 132 120 -50 -518 -353 -33 426 -94 71 -570 -551 180
1647 180 117 78 -50 -411 51 498 172 -186 -94 -175 -128 231 50 -247 -167 -135 29 52 173 -302 -249 222 102
1670 102 567 -158 -579 10 -109 176 65 -149 -222 65 363 170 -211 -154 39 16 -61 363 -72 -456 -147
1691 -147 157 124 190 172 -82 -137 103 47 -181 -111 -82 277 -207 201 -207 -125 -52 172 248 -219 -122 -217 -213 50 295
1716 295 129 -234 -201 178 350 -198 -58 -74 1 189 298 -98 -241 67 161 572 219 165 -558 -107 91 229
$$ packed form
1560c90o3N70o2m9J33n61j11N81L78n33k8j00k61Q57L5l72j36l15L98P52p07R
1582B5k53J1K30N39j85n95J22k49P45N7j07q67K17L60K28R3j67l37J57PL48N8
1604D37m30m06L35L08j50j64j17p6J55P39p94J42M01m66L38K9m26J22l03Q9O04
1625C67J21n12l1j35Q4M39r9n72N8K35J77j2j70m68J65L20M59n20J65o41J9P31
1647A80o3l9j28l61M62M47l26l58R2q1M7L59j81k97Q0L2J64K3J21m75N3M71j20
1670A02M65p25m21N89j19K85j11k14p3K87K98j93l81N7J93k3p7M24m35l84L09
1691a47L04l3O6j8k54n5K40n6k28P0K9L59m84M08m08Q2P3K24P6m67R7r5MK63K45
1716B95j66l63L3L79J72n48J40j6P5J88J09l96j43L08R4M11l53n4p23M51J98J38
$$ plain form
1738 229 496 -213 -123 40 61 382 50 -53 -125 432 472 74 -92 -115 -69 -45 219 -31 -435 -53 -206 315
1760 315 339 174 52 -418 -57 496 -117 -168 -187 442 185 -79 -98 -399 4 -61 507 116 -209 -195 76 23
1782 23 421 -51 -193 58 317 389 156 -50 58 -169 -76 78 86 157 -135 254 -195 173 -222 -90 -328 263
1804 263 407 135 -173 -103 -358 278 217 93 -216 -15 -97 -163 -1 -621 -80 -15 -17 182 -83 158 48 -306
1826 -306 139 383 -22 -211 16 -18 195 85 42 -19 -61 224 305 328 -130 -146 -183 32 92 -22 -297 -279 5
1849 5 -114 22 -338 -260 69 269 269 180 159 -444 208 -84 -112 6 -257 -381 106 136 174 -168 190 21 -48 60
1873 60 -266 -241 -69 26 61 -81 -193 -19 144 38 -46 -76 22 -108 297 -109 81 -41 138 -177 -124 46 -245
1896 -245 -8 -173 33 262 18 -61 -58 -137 -457 -249 230 -124 -15 -119 -201 180 -176 -39 -2 -242 -89 -41
$$ packed form
1738B29K67p09R0J63K1L21l32j03p2N57M0l98j66k3M6K4K64k50m04L82j53N21
1760C15K4j65j22m70L61N53o13n1j9O29k57k64j9l01M03o5N68l91l25J4K71n3
1782B3L98m72j42K51K59P2k33k06J08k27R3J54QP1k92L89m49L68l95J32k38N91
1804B63J44k72l08P0k55O36o1j24l09K01q2o6J62o20N41O5kJ99k65K41j10l54
1826c06M45K44m05j89K27l4K13j10m3o1m2K85Q1K3m58j6l7K15O0j14k75J8K84
1849Ej19J36l60P8L29K00%q9k1o03O52k92k8J18k63j24M87L0L8l42L58j69o9J08
1873F0l26K5J72R5L5j42j12J74J63j06q4l0R8j30M05m06J90j22J79l15N3J70k91
1896b45K37j65K06K29k44p9Lp9l20K08M79l54J09j04q2L81l56J37L7k40J53M8
$$ plain form
1918 -41 -353 -102 -17 -179 -115 -48 25 -120 -171 -153 -15 142 -246 -328 258 -123 31 154 -90 -75 -318 282 -138
1941 -138 236 -515 -241 192 159 -66 81 188 140 176 27 -28 -179 -3 -280 36 -121 103 -84 -112 -178 87
1963 87 74 -174 -56 17 10 221 -17 247 90 289 51 101 218 -50 -165 23 -95 381 49 -330 -96 60
1985 60 286 -157 -371 -361 -100 -155 40 -86 -86 158 292 73 252 131 -67 91 -28 313 -83 -517 -278 46
2007 46 229 -104 -24 147 -271 64 11 -30 94 -371 604 242 -309 -79 57 99 -55 18 93 -138 -274 -301 -181
2030 -181 79 242 -255 -135 55 -103 200 113 -4 151 -78 -155 269 168 -73 -117 107 -83 -223 -10 -12 84
2052 84 -160 74 -63 -197 88 -223 317 -218 -119 84 -140 110 -17 171 221 -79 -116 33 -141 -120 -524 -348
2074 -348 106 367 145 -21 -231 161 296 62 -380 -10 -251 265 -95 -76 -25 -71 -35 45 16 66 -192 63
$$ packed form
1918d1l12K51Q5j62O4O7P3j45n1J8J38J57l88q2N86l81J54J23k44J5k43O00m20
1941a38L74p51K74M33l3k25J47J07m8L6j49n5j51J76k77L16j57K24j87k8o6K65
1963H7j3k48J18P3pK11k38K64j57J99k38N0J17k68j15J88j18M76l32l79K34J56
1985F0K26m43k14J0K61n5J95j26%K44J34k19J79j21j98J58j19L41l96m34K39L24
2007D6J83l33Q0J71m18L35n3m1J24m65R75l62n51K30J36M2j54P3P5k31j36k7J20
2030a81K60J63m97J20J90j58L03q7j17J55k29p7M24j01k41m4K24j90j40K13kR6
2052H4k44K34j37j34K85l11N40n35R9K03k24K50j27J88N0l00l7J49j74K1m04J76
2074c48M54K61k22j66k10L92J35k34m42L70k41N16l60J9N1m6L6Q0k9N0k58K55
$$ plain form
2096 63 368 -67 313 6 106 -6 220 269 -52 8 -99 -105 87 20 -96 -329 27 -370 68 15 38 -36 -168
2119 -168 -152 -137 139 13 7 105 198 -67 -104 27 -274 32 84 -92 -38 -11 269 -227 297 -187 -377 133 -51
2142 -51 57 -112 -269 82 -69 -65 253 94 -141 419 -52 -165 52 -29 114 66 66 -146 49 -167 56 -48
2164 -48 100 183 95 139 256 169 110 10 -155 -265 -46 -255 -13 19 -82 212 -126 129 -42 -97 -107 -213 167
2187 167 -462 -8 -109 -346 71 57 -79 -121 249 198 -300 65 122 -100 -267 83 -156 10 145 -226 -220 142
2209 142 58 -171 1 -150 -305 284 -30 -14 -8 -124 -157 -235 -181 54 -170 -38 -48 233 151 -32 -140 -192 136
2232 136 146 -230 -128 24 -23 182 81 -148 -63 -140 -71 225 71 -56 -171 -166 -100 -142 33 52 -369 29 7 -20
2256 -20 -135 -207 -43 269 53 -90 -213 159 48 32 105 -64 -228 -250 -30 -144 125 -39 174 -47 38 28
$$ packed form
2096F3L05m35L80l07J00j12K26M9l21O0j07oJ92o7j16k33L56l97M38n3K3p4j32
2119a68J6J5K76j26oR8R3k65l7J31l01L06N2j76N4K7K80m96N24m84j90N10j84
2142e1J08j69j57L51j51ML18j59k35N60m71j13K17q1J43m8%k12J95k16K23j04
2164d8J48Q3q8M4J17q7n9j00j65j10K19k09K42L2j01K94l38K55j71n5j0j06L80
2187A67o29M54j01k37M17j4j36m2L70n1m98L65N7k22j67L50k39J66J35l71OL62
2209A42q4k29J72j51j55N89l14J6Oj16l3p8N4K35k24J32j0K81q2j83j08n2L28
2232A36J0l76J02J52m7K05j01k29Q5p7O9K96j54j27j15NO6m2J75J9m21L98k2k7
2256b0j15p2J64L12k16j43j23L72j11j6P3j69j64k2K20j14K69j64K13k21Q5j0
$$ plain form
2278 28 -180 -16 27 -412 -17 73 147 -75 -124 218 290 -103 -41 64 106 32 -201 -118 26 -37 62 -58 19 65 179
2303 179 -75 156 76 47 203 -64 57 243 -83 -39 -62 -218 303 103 411 237 -95 79 -74 192 331
2324 331 -158 -33 -193 68 -57 190 126 -207 212 54 30 89 81 -62 97 182 -60 -298 197 -103 -160 237
2346 237 48 -248 134 132 -54 184 -50 -262 4 -23 -121 -136 71 -384 215 223 -273 27 15 -143 -122 -175 -109 153
2370 153 17 -103 -78 -215 -231 228 159 147 -238 -359 -18 -96 -411 -7 -85 -251 -59 -310 -390 -225 78 -39
2392 -39 103 -182 -93 -97 -389 -31 112 78 119 9 479 26 -51 20 40 219 -90 98 16 -100 56 55 -235 -13
2416 -13 -33 83 338 -171 42 -232 -128 54 22 219 -112 -189 153 331 26 -60 49 16 118 -86 -314 242
2438 242 -141 -40 41 118 70 -108 3 114 99 2 -76 -172 187 -196 122 -21 -200 -92 231 94 124 -179 83
$$ packed form
2278B8k08J64M3m39L95R0P4k22m9L42P2l93O2J05M2p4k33Q3J44o3R9j20P7M6J14
2303A79k54K31q0k9J56k67J21J86l26M4k3j56N21k00L08j74l32J74j53K66J39
2324C31m89J25j60K61j25K47o4l33M19j58k4N9qj43J59Q5k42k38M95l00n7L97
2346B37j89k96L82kj86K38k34k12K66k7r8j5K07m55N99Qm96L00j2j58K1n3O6K62
2370A53j36j20K5j37j6M59o9j2l85j21L41p8l15M04p8j66J92k51q0J65L03j17
2392c9J42k85Q9mk92L58J43l4M1j10M70m53p7P1K0J79l09J88q2j16J56jk90K22
2416a3k0J16K55n09K13k74J04J82l2J97l31p7L42J78l05q6J09l3J02k04k28N56
2438B42l83J01Q1P7m8j78J11J11j5r7p8r6L59l83L18j43j79J08L23j37L0l03K62
$$ plain form
2461 83 88 188 -51 21 -43 235 131 341 163 151 -104 -221 -486 14 85 121 286 146 27 -278 -145 58 453
2484 453 74 9 214 -137 -174 -117 -83 -102 553 186 -68 -2 -72 223 -433 130 110 12 -114 -140 -206 493 65 92
2508 92 -90 -22 72 126 -235 -101 32 -127 111 -170 88 -108 -231 -5 -303 31 -131 98 -19 21 -119 301
2530 301 123 36 -65 54 116 -9 122 83 293 126 162 -114 -56 -117 -147 -66 196 102 -182 85 188 317 79
2553 79 154 -112 -131 -93 -286 -211 49 -239 186 -32 80 -321 134 -139 -117 -83 73 358 -130 -16 -5 153 -49
2576 -49 23 -81 431 84 435 113 -175 -67 -21 -110 178 -203 -188 239 -46 46 -150 46 -260 -110 308 197
2598 197 -207 -344 50 -240 -120 205 8 -311 -173 101 284 58 288 -171 111 -173 -141 -82 -136 234 -109
2619 -109 93 135 204 193 47 1 -314 -201 -58 -8 -122 -273 -171 120 49 -23 -203 -70 95 153 -164 39 24
$$ packed form
2461H3NJ00k39P2o4K78j04K10j78j2k55j17k65N00P1L6J65j40j19l05J33K03L95
2484D53l79o5K05l51l7N7L4j9O55l67k54O6p0K95o56N63k0r8j26k6o6O99m28K7
2508I2j82O8R4N4l61J34J33j59K38k81K58j96j23K26k98L34j62K29j17M0j40M20
2530C01j78q7j01J19O2j25J31l9K10j67L6k76N8o1l0Q1K62r4k84K67J03J29k38
2553G9P5k66j9L8j93P5K60k88M25k18J12m01M55k73K2L4J56K85m88J14J1J58k02
2576d9P2j04N12l47L51l22k88J08M6q9K88l81J5M27k85R2j96J96l06J50M18j11
2598A97m04j37L94k90J20L25j97l19J38K74J83k26K30m59K82k84L2N9n4L70l43
2619a09K02M2O9j1j46m6l15J13J43N0j14j51J02K91p1p2j80J33J65N8l17K03j5
$$ plain form
2642 24 -305 -78 -184 46 -78 134 125 15 140 208 208 -155 -122 155 100 257 -47 181 57 -331 18 17 -18 132
2666 132 56 25 196 -95 30 82 -89 -90 -20 225 84 -260 -126 301 148 101 -41 78 -392 63 -15 159 -40
2689 -40 -158 99 466 224 168 83 133 -59 -149 -115 -273 -70 -391 -307 10 212 -21 109 259 118 3 165
2711 165 -11 -73 -29 85 -169 157 57 9 159 183 -52 20 11 193 -14 -183 -191 178 -168 82 237 -230 28
2734 28 -100 -45 43 298 418 -33 120 -38 306 10 -230 -48 -21 5 -48 -139 116 -18 206 260 -158 49 37
2757 37 341 -102 -5 263 301 24 15 47 -133 383 48 -7 10 -265 4 -206 82 154 21 -95 83 -22 -160
2780 -160 96 -128 8 91 21 -194 380 97 -131 160 -116 -119 240 226 -162 -109 -321 -227 -127 253 102 -73
2802 -73 67 -187 136 -68 -132 76 11 50 89 31 -307 -216 -74 114 2 61 -2 -39 -266 -126 147 -74 196
$$ packed form
2642B4l29K27j06K30j24K12rj10J25O8%l63L3K77n5J57l04K28j24l88L49jl5J50
2666A32p6l1J71k91J25N2j71jP0K45j41l44J34M27j53m7j42J19m70M55p8J74j99
2689d0j18K57L67k42n6q5N0j92r0L4j58K03l21Q4L17K02k33J30J50j41j15J62
2711A65j76o2M4J14k54L26j00m8J50K4k35P2rJ82k07j69qL69l46K50J55m67K58
2734B8j28N5Q8K55J20m51J53j58L44k96k40J82K7K6n3r1K55j34K24N4m18K07j2
2757C7L04m43R7K68L8k77rL2j80N16l35n5J7k75K69k10K88P2j33j16J78j05j38
2780a60K56k24J36Q3p0k15N74k83k28K91k76lL59j4l88N3k12R4J00L80j51j75
2802g3J40k54L23k04o4K08o5L9L9n8l38R1J42J88j12N9o3l7k27J40K73k21K70
$$ plain form
2825 196 243 69 249 -234 -205 -227 -34 221 124 -47 84 261 -31 -56 135 -56 79 100 -137 329 40 135
2847 135 105 79 58 21 -40 -68 201 428 140 -33 -19 -56 6 -3 134 -38 -73 -282 -261 -71 107 -48 -208 -197 116
2872 116 22 81 -179 -231 77 48 -152 203 -313 265 -30 -34 125 47 213 -101 -42 70 332 -26 -92 -36 -12 -106
2896 -106 273 -194 202 -53 -161 -134 114 1 -106 67 -110 -25 37 178 -4 -174 25 169 189 191 -147 3
2918 3 -50 -317 66 -272 -72 81 -19 -176 -64 145 16 172 -167 -19 176 -142 -71 -376 78 74 -173 234
2940 234 3 144 -94 -5 111 48 84 148 88 -80 -115 85 104 -130 89 33 270 80 -35 86 79 35 345 -56
2964 -56 -182 -175 244 177 -116 104 95 -78 170 63 272 -47 78 -111 100 -47 360 -268 174 -260 -27 50
2986 50 104 50 -145 30 100 115 200 115 -17 -115 -30 185 -203 155 50 -264 63 -105 -6 328 -174 275 -46
$$ packed form
2825A96M7j74J80m83K9k2J93K55r7j71J31J77k92k5J91j91J35K1k37M66k89R5
2847A35l0k6k1l7o1k8K69K27k88j73J4l7O2rJ37j72l5k09K1J90J78j55j60J1L13
2872A16r4N9k60n2L08k9k00L55n16N78k95mJ59p8J66l14N9J12K62l58o6N6K4r4
2896a06L79m67L96k55j08K7K48j13j07J73j77Q5O2J41j82j70J99J44K0Kl38J50
2918Cn3k67L83l38K00J53j00j57J12K09j29J56l39J48J95l18P1l05M54mk47M07
2940B34k31J41k38Q9J16o3L6O4o0j68l5K00J9k34K19n6K37j90j15J21pm4L10m01
2964e6j26PM19o7k93K20rj73K48j07K09l19J25j89K11j47M07o28M42m34K33P7
2986E0N4n4j95J75P0J5Q5q5j32r8Q5K15l88L58j05l14L27j68R9L34n02M49l21
$$ plain form
3009 -46 3 224 32 -56 108 -324 -252 143 24 28 391 50 -54 -123 -21 -105 238 -199 -2 154 -178 -244 -52
3032 -52 118 13 120 99 243 410 110 261 21 -57 -153 -57 99 -147 -35 -182 -29 -163 -108 -187 -48 -108 -115
3055 -115 -58 48 -87 -167 -185 -162 -142 -205 -11 -73 -56 92 -110 7 -291 -135 57 -198 426 42 -193 265 -224
3078 -224 -58 -102 -276 -205 212 -63 -7 -133 49 67 44 -139 57 265 182 232 201 -208 239 -1 -31 93 244
3101 244 -167 286 -8 249 -214 92 -13 -57 -4 -168 -185 -87 -98 -44 -217 348 60 332 174 312 116 -53
3123 -53 277 -100 7 -146 150 92 -160 150 -52 -138 -132 13 95 -97 -19 -483 -77 -217 10 99 -120 -77 -25
3146 -25 310 -12 -11 -85 204 390 -379 42 18 -384 -4 10 273 -62 167 22 -57 123 -28 -28 -59 -12 157 -208
3170 -208 55 94 42 324 62 51 -98 118 -146 -50 213 55 -173 -4 -138 86 87 -102 275 -163 33 96
$$ packed form
3009d6M9K21j92q8J64m32P2L95j19ML63l41j04o9J02q4L43m37J97J56l32o6J92
3032e2J70j05J07k1J44J67l00J51k40p8r6R6J56k46J12j47J53j34N5p9J39o0p
3055a15N7J06j35q0j8K3K0o3J94o2J7J48k02J17k98J56J92k55O24l84k35M58m89
3078b24J66m4j74P1M17k75N6j26J82J8k3j83J96K08q3N0l1m09M47k40l0J24J51
3101B44m11M53k94K57m63L06j05m4N3j64j7R8j1N4j73N65k88K72j58J38j96j69
3123e3L30l77J07j53K96n8k52L10k02q6OJ45Q2j92P8m64M06j40K27Q9k19M3N2
3146b5L35l22Jp4K89J86p69M21k4m02L80J4K63l35K29j45p9J80j51%l1M7J69l65
3170b08K63L9n2K82k62j1j49K16k64R6K63j58k28J69j34K24Jj89L77m38J96O3
$$ plain form
3192 96 -40 78 117 55 -51 25 231 13 -63 131 115 268 349 -184 -18 -438 -217 -182 -294 -62 -109 -50 134
3215 134 284 25 -280 49 137 -153 96 -408 226 -225 -96 -308 -458 -214 -75 138 -12 -98 85 134 91
3236 91 10 210 -97 43 -75 27 -256 86 25 145 132 4 350 -166 -187 303 122 184 273 -177 -140 72 228
3259 228 -83 13 -261 -146 -43 30 186 87 -102 53 -4 -335 -257 71 170 130 2 -42 78 160 -97 -23 -32 -103
3283 -103 -182 -34 -266 21 210 188 -234 -11 123 0 213 158 229 174 -195 137 -163 120 51 -123 109 70
3305 70 -82 -42 45 138 1 186 146 155 113 293 -2 -150 -9 289 -93 107 -19 59 5 84 -10 3 23 -114 217
3330 217 -202 42 -31 -261 -19 -267 -344 -182 -257 16 35 115 169 58 102 -76 128 -10 48 125 -121 -47 14 -150
3354 -150 -205 -29 84 17 329 92 -113 -25 253 234 -303 -25 -366 -4 88 -13 -30 -115 -268 -18 295 -66
$$ packed form
3192I6j36J18L9o2j06P6K06k18p6J94j6J53Q1n33J66m20K21L5j12K32m7N9J84
3215A34J50k59l05L29Q8k90K49n04O34m51J29k12j50K44J39K13j50q6J83M9m3
3236I1q1K00l07J40j18J02k83L42o1J20j3j28L46n16k1M90j81O2Q9m50L7K12J56
3259B28l11R6k74J15J03P3J56r9j89J55n7l31P8L28R9m0j28m4J20Q2k57P4rp1
3283a03p9J48k32K87J89k2m22K23J34j23K13n5P1n5l69L32l00K83o9j74K32l9
3305G0j52M0Q7R3j37J85m0Rm2J80k95j48J41K98l82K00j26P8n4P9r4J3K0j37L31
3330B17m19K44p3k30K42k48p7J62p5K73J9Q0N4j11M4j78K04j38N8P7k46P4O1j64
3354a50n5J76J13o7L12k37k05Q8K78j9n37K78l41L62R2j01j7q5j53K50L13l61
$$ plain form
3376 -66 97 -50 106 383 -88 49 -41 -24 122 44 -220 -50 374 -127 -180 -76 -238 -115 -100 -109 -254 92 16
3399 16 -131 316 -21 -136 64 -26 110 -214 6 -176 -247 103 -43 -21 -108 -30 86 278 83 50 118 275 1
3422 1 -17 81 69 206 -80 239 266 34 355 357 47 -47 -109 -339 -151 -16 163 110 270 -5 127 65 242 81
3446 81 73 -23 83 -123 -180 -213 -53 27 139 -4 128 -80 -18 256 -204 190 26 -109 -321 47 -110 -228 -307
3469 -307 59 -16 -216 -43 46 330 199 -68 -137 -222 -217 114 -72 3 45 17 304 208 118 -11 -18 -39 -124 213 59
3494 59 219 84 -109 -254 -141 -114 -136 -31 62 -226 44 123 -101 245 -90 351 95 -32 -167 70 57 181
3516 181 84 147 26 -390 2 -86 -79 -237 186 -59 -57 -234 136 57 -106 -142 83 75 -52 98 -280 232 -217 -19
3540 -19 46 23 72 -96 77 -170 -7 -188 -154 -136 -196 47 -86 -36 98 109 -138 -377 4 -52 149 67 -227 -82
$$ packed form
3376f6J63j47J56K77m71J37r0J7J46p8k64J70M24n01n3J04j62J23J5rj45L46p6
3399A6j47M47l37j15K00r0J36l24K20j82p1L50j46K2q7P8J16J92j95l3O8J57k74
3422Aj8R8j2J37k86L19K7k32L21Kl10r4o2k30J88J35J79n3J60k75J32o2J77j61
3446H1qr6J06k06n7l3J60Q0J12j43J32k08O2K74m60L94j64j35k12L68j57j18p9
3469c07L66p5k00J73Q9K84j31k67o9q5NL31j86P5M2k8K87r6r0j29pk1q5L37j54
3494E9J60j35j93j45J13K7k2J05R3k88K70P9k24L46l35M41k56j27j35K37j3J24
3516A81r7O3j21m16L92q8Pj58M23k45Kj77L70p9j63l6K25qj27J50l78N12m49J98
3540a9O5k3M9j68J73k47J63j81L4J8o0K43j33N0J34J1k47k39L81n6K01q2k94J45
$$ plain form
3564 -82 -46 89 -43 -90 -66 60 -140 266 -35 -68 145 -129 39 62 163 -87 98 194 441 61 -73 242
3586 242 83 -104 135 -21 -126 -541 -210 367 -117 -10 -159 136 43 -162 -64 -75 -4 -47 -253 148 167 -307
3608 -307 65 -93 -53 -56 -217 259 114 123 -105 -25 -66 -228 -154 -254 -63 95 9 11 -195 -9 -118 46 362 -23
3632 -23 118 -66 203 89 146 333 -181 -208 -59 -167 114 -83 -306 272 104 -102 80 -212 -252 -258 -58 96
3654 96 -27 69 -62 -53 107 229 110 29 55 143 112 143 -91 9 190 -33 -443 24 111 -39 114 -145 -14
3677 -14 171 -38 -18 139 -115 -253 159 -150 313 209 60 227 119 153 -101 284 196 135 -64 57 152 422
3699 422 164 16 -43 -31 29 386 -319 127 101 60 -108 95 225 188 308 -83 -37 -383 8 47 85 -249 253
3722 253 9 -107 -120 307 91 92 -9 6 41 -113 50 275 136 -221 57 -287 219 70 -47 83 321 -132
$$ packed form
3564h2L6J35j32m7K4J26k00M06l01l3K13k74J68K3J01k50J85R6K47l80j34L15
3586B42j59j87K39j56j05m15L31N77m84J07j49K95r3k05R8j1P1m3k06M01J9m74
3608c07L72j58M0lj61M76j45Rk28Q0m1j62P4j00J91J58q6Kk06J86j09J64L16l85
3632b3J41j84K69j14N7J87n14k7J49j08K81j97k23N78j68k06J82k92m0oK00J54
3654I6j23R6j31RJ60J22j19q1K6Q8l1L1k34J00J81k23m10M67Q7j50J53k59J31
3677a4J85k09K0J57k54j38M12l09M63j04j49J67j08L4k54L85q8o1j99J21R5K70
3699D22k58j48n9J2O0L57p05M46k6m1j68K03J30l7J20l91M6l46L91L9L8l34N02
3722B53k44j16j3M27k16Jj01J5L5j54J63K25j39l57K78l44N06j49j17J30K38m53
$$ plain form
3744 -132 -60 152 -63 -153 -11 27 161 -348 -56 -13 -93 192 -62 -161 -53 57 144 -67 -315 -276 8 -298 -468
3767 -468 18 13 -39 -92 72 55 -167 -184 -130 -241 181 187 158 -96 -123 -131 46 129 140 205 192 -289 153 -237 54 234
3793 234 -6 295 192 -47 246 -213 -70 284 -48 -75 -57 -212 209 -163 484 -144 172 1 -45 158 143
3814 143 -84 -34 19 525 -66 93 -315 145 2 254 142 -133 25 -147 82 -314 -6 221 -21 -147 237
3835 237 63 -93 85 163 146 -35 -164 357 -371 80 -45 175 -226 71 -101 248 -303 117 49 -134 -28
3856 -28 177 -80 -112 16 -91 -120 239 115 58 -166 285 88 -159 36 34 119 -77 23 -411 -64 -102 -243 88
3879 88 205 -66 -227 -157 -69 61 48 296 -184 14 -310 -64 -157 -116 -111 -109 115 -98 228 -4 -214 6 94 -211
3903 -211 -93 -27 -335 -34 173 111 145 123 -314 -136 97 -6 -31 -157 178 -157 363 -29 241 69 62 83 35
$$ packed form
3744a32P2K12k15r0J42L8J34n09K92M3q0K85k54r9J08J10Q7k11k48L9K84l06j70
3767d68M86nn2n3J64j7k22j7N4j11M22Ok9k54k7qJ77Q3J1O5j3m81M42l90K91J80
3793B34k40L01j03k39K93m59J43L54l32k7J8j55M21l72O47o28L16j71m6K03j5
3814A43k27N0N3N06n91J59m08M60j43K52j12k75J58j72K29l96L08K27k42j26L84
3835B37j74j56J78P8j7j81j29N21p28M51j25K20m01K97j72L49n51M20o8j83J06
3856b8K05k57l2J28j07k9L59j24n7k24M51j97k47J95kQ5j96J00m34L47l8j41L31
3879H8J17k71j61P0Q8J30j3K48m80J98l24K46r3M1NKK24k13L26k32k10K20Q8l05
3903b11J18O6l08L01K07o2L4k2m37J78K33j03k5j26L35l35N20l92K70j72pK1m8
$$ plain form
3926 35 -185 -206 -122 108 -30 -247 211 -13 187 11 100 -177 241 95 -159 111 -113 78 177 -73 -145 -173
3948 -173 5 12 -123 138 -185 18 -73 39 -358 -188 -18 -247 -167 -69 66 -135 -297 80 -55 57 52 402
3970 402 37 -193 40 -29 -414 -159 44 -173 -69 -216 170 196 315 -111 71 77 -167 13 42 15 -116 -198
3992 -198 153 145 -134 84 104 -430 88 -82 -74 347 -23 -99 -61 12 294 138 171 345 -190 201 61 31 -116
4015 -116 -183 145 -94 60 -23 72 406 208 112 212 190 204 -339 5 78 405 -182 -64 92 -197 -6 -216
4037 -216 -206 -38 56 -58 -112 218 63 -86 126 -4 18 -174 88 267 214 84 -174 -122 -188 -78 -16 32 73
4060 73 38 125 -59 -173 -56 1 -76 -374 -146 -189 -223 -55 29 117 91 168 -214 -213 1 237 -159 -53 -193 -111 -242
4085 -242 -57 24 152 203 -250 -34 -236 65 348 -117 -57 88 -316 146 1 232 -56 108 153 45 184
$$ packed form
3926C5k20k1Q4K30j38k17M58k24K00j76Q9k77M18j46k54K70k24J91R9k50p2k8
3948a73J78Pj35K61l23K03r1J12l97J70J70k29Q0R8J35k01j62L77j35J12nL50
3970D02l65k30K33o9l85K55K03k17J04j47L86K6J19m26J82Ok44J80K9k7j31q2
3992a98L51qk79K18K0n34N18j70QM21l70p6L8P3K82j56L3J74n35L91j40l0j47
4015a16o7L28k39J54q3R5L34j98r6J00k2J4n43L44P3L27n87J18J56k89J91k10
4037b16J0J68R4j14n4L30j55j49K12j30K2j92K62J79n3j30k58N2o6J10O2M8M1
4060G3l5Q7j84j14J17N7p7k98K28m3l4J68Q4Q8k6P7l82JK14K36l96J06j40Q2j31
4085b42J85Q1J28N1m53K16k02L01K83m65O0J45m04M62j45K31k88J64M5j08J39
$$ plain form
4106 184 0 -195 343 -134 93 89 0 -62 -91 110 249 72 -60 -93 -93 -7 37 -336 -18 301 124 365 -36
4129 -36 3 15 206 -218 -104 195 95 -77 134 -38 -293 185 -323 -75 248 -191 -20 21 -124 -73 53 -31
4151 -31 96 115 -59 65 313 37 -7 -168 -190 128 162 -14 228 54 -73 -296 80 -113 -196 210 189 26
4173 26 -210 81 -319 9 184 -129 -336 130 -137 156 -194 38 427 -30 133 128 -73 -94 165 -17 305
4194 305 230 64 -7 12 131 280 -228 -234 50 62 93 -97 -46 112 32 84 -234 -173 39 17 -51 102 255 -145
4218 -145 92 -2 -146 -327 -79 104 281 -142 151 158 -150 379 -222 -116 215 67 60 -66 16 101 -283 222
4240 222 -24 15 -4 166 -95 91 -23 141 244 61 235 -72 182 -78 59 111 -242 -107 101 -224 50
4261 50 91 -10 69 -8 -393 132 5 -118 199 68 98 32 28 -240 2 87 -165 301 65 198 -9 48 23 0
$$ packed form
4106A84j84j95N38m77K27mq9o2k9K01J39j77j32l3%Q6M4l73L18L19j77K41m01
4129c6L9J2J91m24J14K99j00j72K11j72k55M78n08K48L23m39J71M1j45N1J26q4
4151c1J27J9j74J24K48k76m4j61k2L18L4j76K42j74j27k23L76j93q3M06k1j63
4173B6k36K91m00L28J75l13k07M66k67K93l50K32L89m57J63nk01k1K59j82L22
4194C05p5j66p1J9J19J49n08oK84J2L1j90N1J58q0N2l18O1K12k2o8J53J53m00
4218a45K37r4j44j81K48J83J77m23K93Pl08N29o01J06L31j48pj26Q2Q5l84N05
4240B22k46L9j9J70k61J86j14J64J03j83J74l07K54k60J37N2l53J35K08l25K74
4261E0M1j01P9p7l85N25j27j23L17j31L0o6mk68K42Q5k52M66k36J33k07N7k5k3
$$ plain form
4285 0 -94 157 -231 -155 -37 39 246 -104 -108 28 101 -98 134 -14 -100 239 -130 -147 138 220 -212 115 -17 21
4309 21 -38 -282 211 76 -127 -118 -103 22 -75 108 0 138 -89 62 153 53 239 93 -386 81 14 69 -187
4332 -187 -162 51 -266 -1 279 -151 -114 112 98 212 58 -140 -6 -123 64 -43 350 -99 69 166 120 42
4354 42 -320 230 -261 -95 -68 -55 202 -4 100 51 128 -465 74 -84 205 -159 -137 21 -158 177 -256 -230
4376 -230 3 -336 111 -100 6 -49 -178 -403 102 -47 359 47 -142 -179 198 -146 -50 157 214 135 5 5
4398 5 171 -211 -251 46 -180 -203 -147 42 41 195 275 0 130 -1 -176 9 238 -98 -132 26 28 160 89 12
4422 12 -102 -86 37 -5 245 -182 -128 -229 -2 -245 193 -23 -278 -33 216 127 30 66 16 154 -94 5 17
4445 17 219 -89 145 -19 110 26 -218 -212 -95 -200 -134 71 -12 26 360 -226 -135 4 142 -8 14 29 -52 36
$$ packed form
4285@r4K51l88P6J18P6K07l50mJ36P3j99K32j48q6L39l69j7K85Q2m32L27j32L8
4309B1n9k44M93j35k03RJ5J25r7J83j08J38k27J51R1j00J86j46m79M67o7N5k56
4332a87K5K13l17K65K80m30L7K26j4J14j54j98J34j17J87j07L93m49J68R7m6p8
4354D2l62N50m91J66K7J3K57k06J04m9P7n93N39j58K89l64K2J58j79L35m33K6
4376b30K33l39M47k11J06n5j29k25N05j49M06l12j89l7L77l44R6K07N7p9j30%
4398EJ66l82m0K97k26k3N6J89jJ54Q0k75J30j31j75J85K29l36l4J58KJ32p1p7
4422A2j14J6J23m2K50m27N4j01K27k43M38k16k55K45K49q9r7L6n0J38k48R9J2
4445A7K02l08K34j64J29q4k44OJ17j05O6K05q3L8L34n86R1J39J38j50K2J5q1Q8
$$ plain form
4469 36 -319 217 292 228 -400 18 280 -387 -104 -142 171 -126 -4 112 158 -62 49 -120 141 29 118 266
4491 266 181 159 42 14 225 226 -25 220 12 79 148 -239 -100 -35 -26 68 -137 126 -300 119 18 -246 -97 -11
4515 -11 269 65 -164 394 -251 -484 160 -4 -117 -147 -44 -66 101 27 94 167 85 -159 69 102 -27 -133 -66
4538 -66 -120 -93 -46 -59 39 187 15 -1 -28 124 195 -306 -67 172 88 -60 66 -115 60 -74 5 69 -66 324
4562 324 -25 -234 -200 97 -31 187 311 53 -65 -261 -136 209 1 -16 -47 -113 87 14 106 -85 213 -557
4584 -557 11 -140 -244 144 -24 29 -259 -14 95 -110 -18 71 1 33 -183 155 -299 33 311 223 87 -53
4606 -53 -12 250 -12 -101 30 -70 161 229 -30 -190 151 -115 407 -181 -245 -209 -110 -84 -385 162 -254 93 159
4629 159 -132 -289 233 52 295 -70 462 -88 144 279 226 159 219 122 2 171 -107 -101 -95 318 12 167 196
$$ packed form
4469C6l55N36P5o4o28M18K62o67K83l8L13k97J22J16M6k20J11j69K61j12Q9J48
4491B66q5k2j17k8K11Jk51K45k08O7O9l87J39O5RR4k05K63m26M19j01k64J49Q6
4515a1K80k04k29N58o45k33O44j64j13l0J03k2J67p4O7P3q2k44K28L3j29j06O7
4538f6n4K7M7j3R8J48j72j6k7J52P1n01K39K39q4j48J26j81J75j34P9O4j35L90
4562C24l49k09L4K97j28K18J24k58j18j96J25L45k08j7l1o6K00p3R2j91K98p70
4584e57N68j51j04L88j68N3k88K45J09k05R2Q9p0L2k16L38m54L32K78q8j36j40
4606e3M1K62k62q9J31j00K31O8k59j60L41k66N22n88o4L6R9K6l01N47m16L47O6
4629A59k91j57N22j81K43l65N32n50K32J35n3o7O0r7j20J69k78OOM13l06J55K9
$$ plain form
4652 196 359 166 18 -231 92 -37 410 171 351 127 -43 -9 -159 -143 186 -148 -136 -205 108 112 -105 -108 203
4675 203 -213 119 -146 -383 -49 -522 318 145 -97 -162 -126 -162 -122 -126 -187 -204 -188 32 -25 -237 -7 80 -30 88
4699 88 -102 318 277 83 -236 -37 -134 56 383 -195 -100 -44 81 -163 -80 297 32 -115 -125 354 -257 -115
4721 -115 -13 -338 -142 -144 -101 354 255 34 319 -338 -187 121 74 194 -9 70 -248 -458 238 308 41 -20 0
4744 0 33 -108 -23 115 -129 -246 25 50 -43 114 63 -330 8 -251 179 -157 -50 232 -28 -50 49 244 342
4767 342 344 60 -20 -67 -104 -7 -63 -96 81 -117 55 59 -126 -296 72 162 140 -67 -73 -51 208 -207 189 274 -112
4792 -112 222 242 89 -173 -236 -25 -239 -138 -104 -96 213 -27 -81 -167 126 36 -80 112 59 206 51 148 -131
4815 -131 -39 100 109 -26 -125 248 138 53 -114 109 51 -42 17 -54 -205 -221 -118 112 -11 26 -60 188 -62 326
$$ packed form
4652A96J63j93j48k49L23j29M47k39J80k24j70L4j50J6L29l34J2o9L13Mk17lL11
4675B03m16L32k65k37L34m73Q40j73k42o5L6l6M0mo1j7J6K20n7k12K30Q7j10J18
4699H8j90M20m1j94l19J99r7J90L27n78R5N6J25k44Q3L77k65j47j0M79o11J42
4721a15J02l25J96kM3M55r9k21K85o57J51L08m7J20k03P9l18k10O96P0k67o1K0
4744@L3j41Q5J38k44j17K71K5r3J57n1l93L38k59M30l36J07K82k60k2R9J95R8
4767C42Kk84q0m7l7R7n6l3J77j98J72Mj85j70L68R0k2k07oK2K59m15L96Q5l86
4792a12L34K0j53k62o3K11k14J01L4QL09k40n4q6K93r0j16J92n3J47j55R7k79
4815a31R2J39Rj35r9L73j10q5j67K23n8r3N9p1j51j6J03K30j23L7q6K48k50L88
$$ plain form
4839 326 78 -33 -274 133 5 286 -166 -122 99 -149 -105 4 -16 15 -53 -6 84 -7 80 49 -186 15 -70 -127
4863 -127 -127 -83 27 99 -242 -272 143 -88 -10 449 115 309 342 -185 65 54 -26 260 2 210 -13 -121 10
4886 10 -15 -97 -61 135 38 -67 300 104 -100 109 82 75 132 146 79 225 -171 104 236 -236 -209 79 22 284
4910 284 275 -109 -146 -95 -56 11 -7 30 155 -7 329 -182 157 15 -29 45 -197 71 222 -234 -353 79 -64
4933 -64 -29 -61 240 -193 -295 -225 4 -32 34 380 -108 229 254 -252 -139 112 179 -323 -3 -87 -56 230 -36
4956 -36 46 214 -65 62 -461 60 -183 104 -62 -198 -303 -121 52 3 86 -126 -27 -70 77 -55 -28 19 165
4979 165 194 -95 -51 146 180 -257 58 17 -81 72 -168 209 184 -58 35 21 -72 224 -93 27 -194 49 216
5002 216 18 142 65 233 -444 207 72 119 59 9 -193 12 102 -339 74 106 -55 -210 -116 42 -235 167
$$ packed form
4839C26k48j11k41M07j28K81m52M4K21k48M4J09k0L1o8M7R0r1Q7l1k35K01q5n7
4863a27%M4J10P2l41l0M15k31P8M59l34J94L3n27K50j1q0K86k58K08k23j08J31
4886A0k5q2L6J96r7j05L67j96k04K09k7pN7J4o7J46l96K75J32m72K7K88n7K62
4910B84rl84l7N1L9O7j8L7J25j62L36n11L39j42m4P4k42K68J51m56j19M32j43
4933f4L5l2L01m33j02P0K29l6O6L46m88L37K5n06J13K51O7n02L20q4L1K86k66
4956c6Q2J68k79J27n23N21k43K87j66j36j05J82J73m9Q3k12R9m3J47j32K7M7J46
4979A65K9k89M4J97L4m37L15m1r8J53k40L77k5k42R3j4r3K96l17J20k21K43J67
5002B16j98J24p7J68o77O51j35M7o0n0k02K05R0m41M13L2j61j55R4J58k77M02
$$ plain form
5024 167 -170 82 -110 -12 80 33 124 -105 239 112 38 62 -237 163 12 -112 285 77 24 29 -43 -44 238 215
5048 215 -90 333 92 -211 -10 66 45 224 5 -278 93 -164 105 217 67 -47 -292 -45 -164 -242 241
5069 241 5 -136 -136 134 31 -144 -7 10 45 272 118 34 -256 239 18 -88 117 174 69 196 -330 88
5091 88 -2 -107 118 -208 149 105 46 145 -327 135 88 -92 143 -72 -5 114 77 67 189 -14 -7 168 63 276
5115 276 51 69 63 -12 176 42 -64 207 119 -5 -280 -91 -13 146 43 -88 -40 207 -53 -53 35 -176 -100 201
5139 201 145 -153 -161 -161 200 102 231 210 78 109 -289 -23 237 -137 -26 269 5 -76 121 -171 84 112 -78
5162 -78 242 81 -62 -70 -202 172 -158 -18 49 -1 -270 15 -54 -29 75 -270 -49 94 -175 -308 21 188
5184 188 -211 -35 94 -143 -41 260 123 -258 186 -91 135 143 -217 -5 -137 -116 2 210 -15 186 47
$$ packed form
5024A67l37K52j92R8R2m7R1k29L44j27p4K4k99M00j51j24L97k08n3Np2jK82k3
5048B15l05M23k41l03K01P6k1J79k19k83L71k57K69J12j50j14k45K47j19p8M83
5069B41k36j41%K70j03j75J37J7L5K27j54q4k90M95k21j06K05N7j05J27n26M18
5091H8r0j05K25l26L57m4n9R9m72M62m7j80K35k15O7J19l7j0J22k03PJ75j05K13
5115B76k25J8op5J88j34j06K71q8j24k75J89P8J59j03j31M8K47k60%Q8k11P6L01
5139B01n6k98q%L61r8J29k1j32L1l98K66K60l74J11K95k64q1J97k92K55K8j90
5162g8L20j61j43qj32L74l30J40O7n0k69K85o9K5J04l45K21J43k69j33L29J67
5184A88l99J76J29k37J02L01j37l81M44k77K26Ql60K12j32K1J18K08k25K01j39
$$ plain form
5205 47 -348 -182 -170 189 205 26 -282 29 4 -183 -124 105 131 68 -155 42 45 -62 -156 -29 163 -252 -327 -99
5229 -99 -124 21 14 -11 141 34 42 -385 -19 106 -230 -11 192 -201 -118 -157 -43 -26 -121 17 -10 160 -121 -109
5253 -109 -338 162 103 42 -152 67 326 -131 117 -192 -1 -225 -7 -206 -1 107 -316 -245 281 164 30
5274 30 321 25 178 -93 -11 -163 476 330 30 34 128 27 -316 -157 2 -62 -27 59 297 6 82 -185 -256
5297 -256 94 5 161 13 -11 138 85 64 -185 -123 76 3 -17 178 56 33 158 82 -317 -36 128 22 -46
5320 -46 -90 89 315 129 57 391 -125 75 -88 0 117 -72 149 390 188 -107 72 161 -6 -267 167 425
5342 425 198 0 177 -57 -30 206 -1 -183 37 -27 -93 -5 -118 -255 0 -120 240 -243 -145 -220 89 157
5364 157 -344 48 103 -21 37 -6 286 64 -249 -66 -134 -37 -55 254 -103 39 174 42 -62 214 -118 -2
$$ packed form
5205D7l95J66J2L59J6j79l08L11k5j87N9K29K6o3k23J97Lj07r4J27J92m15p5K28
5229i9k5J45pk5J52j07Qm27L66J25l36K19K03l93Q3l9J14J7r5J38k7J70k81J2
5253a09k29N00n9o1j94K19K59m57K48l09J91k24K18j99K05J08m23P1N26j17j34
5274C0K91k96J53k71Q2j52O39j46l00MR4j01l43J59J59o4L5Q6K38k91P6k67p1
5297b56L50q9J56j48k4J49n3k1k49O2J99p3k0J95j22k3J25p6l99K81J64j06o8
5320d6m4J79K26j86p2L34n16K00j63Q8J17j89K21K41k02k95J79Q9j67k61M34K58
5342D25k27j98J77k34K7K36k07j82K20o4o6Q8j13j37K55j20L60m83R8p5L09O8
5364A57n01L92N5j24N8m3K92k22l13J83o8R7j8L09l57J42J35j32j04K76l32J16
$$ plain form
5386 -2 66 48 -1 -258 -46 -72 -297 -27 214 -47 20 167 22 -18 -379 -128 0 -177 -19 -305 156 82 -74
5409 -74 -87 172 106 355 69 -131 229 135 -447 -116 -5 -268 171 139 158 119 136 -118 312 -98 138 130 -290
5432 -290 134 -202 144 64 -17 535 -139 -291 -11 -216 -89 137 65 -129 -131 -108 -187 120 170 216 283 -283 47
5455 47 269 -216 -108 6 -219 -175 -101 80 -178 72 155 -17 156 123 -115 -25 43 -91 153 14 -109 105
5477 105 66 -188 -101 -65 -30 -118 135 187 502 122 245 -138 46 31 -79 212 -31 298 -71 323 201 3
5499 3 -171 -274 -263 -37 -26 -157 39 -138 -86 -59 229 -218 28 -176 -32 -355 -145 167 149 66 -152 172 305
5522 305 -115 -130 -72 162 201 -66 94 233 -106 242 -160 39 -140 89 -221 16 -324 -84 -75 130 131 -22
5544 -22 22 161 -313 -83 93 59 47 -55 51 -275 357 -40 283 -74 -180 173 46 63 114 7 73 -70
$$ packed form
5386bO8j8m9k57K12k6k25K70K41k61O7J47j45m0l61K51J28j77J58k86M61p4j56
5409g4j3K59o6K49k86k00L60r4n82L31J11k63M39l2J9l9J7k54M30m10K36qm20
5432b90M24l36L46q0q1N52o74j52K80k05J27K26p2j94kK3p9L07N0M6O7n66L30
5455D7K22m85J08J14k25M4P4J81k58K50Q3j72J73l3k38R0O8j34K44j39j23K14
5477A05l9k54Q7L6L5q8K53N2L15l80J23l83J84j5j10K91k43L29l69L94j22j98
5499Cj74j03J1K26J1j31J96j77N2K7K88m47K46k04J44l23K10L12j8q3k18L24J33
5522C05m20j5N8K34L9k67J60J39l39L48m02J99j79K29l10K37l40K40RK05Jj53
5544b2M4J39m74K30J76l4j2j02J06l26O32l97L23l57j06L53j27J7N1j07O6j43
$$ plain form
5566 -70 9 -8 -122 121 -151 -91 -300 -175 -193 0 -52 -206 90 -81 57 255 -180 85 374 107 59 65 134
5589 134 117 -15 -88 -164 -142 355 -87 84 -30 17 -18 -97 -64 43 47 49 99 -190 260 81 -175 54 -87 42
5613 42 -189 -74 211 -52 -119 -54 -130 -129 -166 115 -73 -288 72 -28 -111 192 30 273 -72 -58 110 -280 -59
5636 -59 -59 -264 10 -11 -198 24 31 -85 -126 17 2 108 149 148 -70 133 -182 -17 110 190 266 230 239 -131 217
5661 217 -23 92 -110 -49 -437 8 272 108 99 75 63 180 -113 391 116 -352 15 15 176 5 173 -106
5683 -106 300 -75 86 246 -157 72 26 -70 -248 -78 173 11 -187 -368 -236 -202 64 7 -137 309 -3
5704 -3 12 -44 145 14 121 -165 165 102 -181 -149 453 177 -366 232 -101 -46 -256 9 21 86 -37 29 2 -86
5728 -86 -42 152 -74 46 95 -78 -253 -6 -80 53 263 180 -39 121 -10 -4 124 -2 -34 304 218 -33 259
$$ packed form
5566g0P9j7j14K43k72O0k09J25j8J93n2j54K96j71J38J98m35K65K89k67m8OO9
5589A34j7j32p3p6K2M97m42J71j14M7l5p9L3J07MKN0k89M50j79k56K29j41J29
5613D2k31J15K85k63o7O5p6Jl7K81j88k15L60j00q3L03j62K43l45J4J68l90K21
5636e9%k05K74k1j87K22Pj16m1J43j5J06M1jk18K03l15J65J27Q0P6l6Rl70L48
5661B17k40J15k02O1l88M45K64j64rk4j2J17k93N04k75m68L67%J61j71J68k79
5683a06M06l75J61J60m03K29m6r6j78J70K51j62j98j81J32L4K66n7j44M46l12
5704cJ5n6J89j31J07k86L30o3k83L2O02k76n43N98l33N5k10K65J2O5j23O6k7q8
5728h6M4J94k26J20M9j73j75K47p4J33K10q3k19J60j31OJ28j26l2L38q6k51K92
$$ plain form
5751 259 235 33 -163 132 106 -184 -120 -62 61 88 -216 357 126 76 -237 186 88 -134 -274 195 -17 -336
5773 -336 241 -143 43 139 79 -544 -44 113 95 34 -32 -317 -233 -111 -140 59 238 -142 -203 -50 -16 -101 -153 -16
5797 -16 -56 -46 138 -208 -260 -138 -27 378 -63 248 -169 -272 221 -128 467 190 87 180 287 134 101 -36
5819 -36 -343 318 109 -153 468 99 137 -73 -112 235 110 59 216 -35 -400 -21 -188 -52 -65 -97 -173 -236 -134
5842 -134 63 -313 105 305 129 -69 -311 10 84 -17 461 348 162 95 348 46 101 138 91 -53 285 97
5864 97 266 46 -220 315 206 167 4 -92 104 -3 -148 -318 -43 14 -3 226 112 -217 62 -88 -51 -51 -392
5887 -392 -361 34 103 -74 -25 -225 69 -54 -16 -189 343 4 -40 1 369 27 286 -123 -42 -201 245 -132
5909 -132 2 100 217 127 85 307 27 194 -27 -119 -17 -121 -230 -83 -137 282 5 66 -175 375 261 19
$$ packed form
5751B59k4k02j96K95k6k90O4N8J23K7l04N73k31n0l13M23r8k22j40M69k12l19
5773c36N77l84J86R6o0o23N00J57j8o1o6k85Q4J22k9J99J79l80o1J53L4q5n2J37
5797a6m0J0J84l46n2J22J11M05m41L11m17j03M93l49N95k77j03R3J07j53l3j37
5819c6l07O61k09k62O21l69L8k10l9L47j25n1J57k51l65L79j67J36j3l2p6o3J02
5842a34J97l76M18K00j76j98k42L21P4j01M78j13j86o7K53l02N5L7m7j44L38j88
5864I7J69k20k66N35j09l9j63r6J96j07j45j70K75N7j7K29j14l29K79j50L7%l41
5887c92L1L95O9j77M9k00K94j23L8j73N32l39m4M1L68l42K59m09Q1j59M46l77
5909a32J34R8J17r0m2K22k80J67k21r2J02j04j09J47n4M19k77O1k41N50j14k42
$$ plain form
5931 19 -173 114 -237 53 363 -178 -234 27 -149 -263 -129 -49 66 273 -313 -103 -349 103 145 310 -64
5952 -64 136 281 -237 -75 -107 -213 -35 12 99 12 -145 238 -50 185 -49 -13 84 108 -171 -83 -66 121 -202
5975 -202 154 -31 68 -53 -156 256 -279 44 -160 -88 121 38 -6 -131 1 80 -30 -33 -319 156 -88 -186 110
5998 110 398 -26 128 45 -154 128 110 -65 -231 -89 4 45 -9 102 59 40 -120 -31 175 181 -279 179 -254
6021 -254 135 -200 -21 50 -366 -170 -23 -254 9 -110 11 -68 -140 86 263 -9 -167 117 59 -80 -283
6042 -283 344 83 107 46 -267 -172 -43 178 -495 -84 16 228 -26 236 86 -128 -253 236 219 -272 -152
6063 -152 -134 -340 8 424 -18 154 36 -319 185 -80 -194 -323 -11 -10 396 -246 167 -222 -312 -158 -91 70
6085 70 197 116 -392 43 -15 206 -222 -106 -208 -93 -300 8 -193 -190 -44 62 2 145 -116 47 -116 60
$$ packed form
5931A9j92K87l51K90L10n41n6K61j76j14J34Q0J15K07n86K10k46M52M2J65l74
5952f4K00J45n18J62l2j06J78M7Q7q7j57L83k88K35k34L6R7K4k79Q8J7J87l23
5975b02L56j85R9j21j03M12n35L23k04P2K09q3m4j25J32P9j10lk86M75k44r8K96
5998A10K88m24J54q3j99K82j8j75j66J42R3M1n4J11m3j9j60Q9K06Om60M58m33
6021b54L89l35J79P1m16J96J47k31K63j19J21p9p2K26J77k72j58K84n8j39k03
6042b83O27k61K4o1l13R5J29K21o73M11J00K12k54K62j50k14j25M89j7m91J20
6063a52J8k06L48M16m42J72j18l55N04k65j14j29L12JM06o42M13l89r0J54O7J61
6085G0J27q1n08M35n8K21m28J16j02J15k07L08k01LJ46J06o0J43k61J63j63J76
$$ plain form
6107 60 16 -232 156 247 17 -183 21 25 -243 -52 -211 187 -193 -127 -196 -154 335 -286 -44 46 89 67 47 78
6131 78 -296 -200 85 37 101 -118 -69 -34 -127 326 -124 -336 178 66 69 -64 258 29 98 88 -218 -94 114 -89
6155 -89 56 -7 -274 62 97 -433 -70 -124 -152 55 23 86 109 -11 -136 176 21 111 -93 98 144 17 -93
6178 -93 -9 -170 294 114 110 -117 218 -102 -177 91 57 55 -162 -217 -203 -102 68 91 294 164 -24 30 47 85 -143
6203 -143 50 -56 -172 -102 22 -290 245 -30 -462 2 -385 -52 188 381 47 -209 -69 185 -210 88
6223 88 -35 27 36 144 217 51 -105 13 -8 -11 84 -144 125 -77 -176 -3 -22 115 -207 -94 77 -4 -55 -242
6247 -242 211 15 -214 148 324 -76 -75 -66 -64 -40 42 63 -3 -202 224 0 -177 -56 -96 -144 64 -203 -264 65
6271 65 59 30 131 -111 -26 60 -65 94 -51 64 244 280 177 -307 56 -21 15 -274 8 -11 -213 -72 -427
$$ packed form
6107F0m4k48L88R1k30k00K04Mk68J91j59L98l80O6o9M2M89o21K42R0M3k2k0L1
6131G8l74R6K85m8O4k19M9L5r3M53m50k12N14j12Lj33L22k29O9j0l06J24K08k03
6155h9J45o3k67L36L5n30L63n4k8K07l2O3K3j20j25L12j55R0k04J91M6j27j10
6178i3Q4j61M64j80mk27L35l20p5K68l4kk17n5J4J01J70K3K03j30j88N4J7L8k28
6203a43J93j06j16P0J24l12N35k75m32M64l87L33K40J93l34k56J40K54l95K98
6223H8j23O2RJ08P3j66j56J18k1lR5k28K69k02r9J73j9J37l22J13J71q1n1j87
6247b42M53j96k29L62J76m00JRKK4Q2K1o6j99M26k24j77J21m0m8K08k67o1L29
6271F5ok9J01k42Q5Q6j25J59j45J15J80L6j03m84L63p7L6k89K82j9k02J41l55
$$ plain form
6294 -427 62 116 40 -109 220 14 73 38 61 144 -209 197 -155 -267 85 107 310 -22 -382 -122 -56 284 -92
6317 -92 -210 236 -241 37 -240 -91 94 141 -73 46 -37 43 28 48 171 -90 402 -42 123 241 141 39
6339 39 -123 116 200 45 -8 23 147 -277 -95 -31 43 45 252 -41 159 -144 89 200 -172 -57 -92 -109 205
6362 205 188 -213 -74 -311 102 -47 47 -128 -58 -53 131 -159 -47 377 191 -38 6 194 245 98 -46 155
6384 155 167 172 -257 -28 280 12 68 123 125 -297 -100 483 183 -108 195 229 -141 13 67 87 -487 -162 18
6407 18 -193 5 -169 -98 15 39 -82 133 103 -186 60 373 11 -82 -64 -17 -31 -63 -258 -115 -44 -298 56
6430 56 38 -286 120 270 40 24 79 -138 115 -59 -173 35 76 -40 214 175 -221 310 -103 -133 151 -213
6452 -213 -111 16 -206 -237 -50 88 -90 -122 90 -157 -70 34 -301 38 -49 -235 -45 -197 -127 181 -126 84
$$ packed form
6294d27M89N4p6j49L29k06N9l5K3Q3l53M06l52j12L52K2K03l32l60K60O6L40l76
6317i2j18M46m77K78k77J49J85M7k14J19q3Q0j5K0J23k61M92m44J65J18j00j02
6339C9j62K39Q4j55n3L1J24m24J82O4P4KK07k93K00l03K33J11l72J15l5j7L14
6362B05j7m01J39k37M13j49R4j75P0NJ84k90J12M24j86k29M4J88N1j47j44K01
6384A55J2Nm29K29L08k68N6N5Km22J97N83l00k91L03L4l70J54N4K0n74L25J80
6407A8k11J98j74P1J13K4j21K15l0k89K46L13l62r3J8M7j4l2j95J43P1k54L54
6430E6j8l24M06J50k30j6N5k17K53j74j14K08M1j16K54l9l96N31m13l0K84l64
6452b13J02J27k22l1J87J38j78l2K12k47Q7J04l35L39q7j86J90j52P0L08l07K10
$$ plain form
6474 84 175 216 2 321 -75 -189 -24 -237 -105 237 321 -35 19 -14 -63 -79 125 96 -144 76 158 98 149 -94
6498 -94 218 18 301 -40 167 -3 210 92 -512 -114 215 -4 -47 -326 -325 -32 41 -82 -142 -65 119 -77
6520 -77 170 129 197 230 -23 267 27 -198 69 -25 -102 -84 126 -194 175 366 238 27 175 115 -154 -151 245
6543 245 3 125 -240 28 -96 -162 131 13 42 -79 344 382 -316 12 143 -476 -77 -175 240 -6 394
6564 394 61 -197 -14 80 -158 137 218 -47 -203 104 -106 22 -38 -99 107 -51 98 1 231 261 -280 -22
6586 -22 -105 222 399 -92 215 223 8 -212 209 -17 215 236 142 118 181 -136 105 -34 -38 118 61 17 -243 41
6610 41 -15 -41 83 163 -355 147 23 -10 -191 -43 43 195 39 -38 -28 -179 8 -20 -224 -51 -194 67 102
6633 102 -92 4 87 -185 16 18 28 164 153 282 255 -258 -85 -36 42 332 -193 193 -141 132 174 -118 -20 -20
$$ packed form
6474H4R1M1k14L19l96j14J65k13J32L42Q4l56N4l3m9j6K04k9k40K20Q2o0N1k43
6498i4L12k00K83l41K07j70K13j18o04L98L29k19m3k79JK93P3j23o0P7J84j96
6520g7K47m1O8L3k53K90k40k25K67r4p7J8K10l20L69J91j28k11J48o0k69LL96
6543B45k42J22l65K68j24o6K93j18K9j21M23L8o98L28J31o19L99r8M15k46M00
6564C94l33k58J83R4k38K95Q1k65j56L07k10J28o0o1K06j58J49r7K30L0n41K58
6586b2q3L27J77m91L07Qk15k20M21k26K32K1r4k4O3l17K41j39mJ56n7m4k60K84
6610D1n6k6J24Q0n18N02j24l3j81J48Q6J52j56p7J0j51J87k8k04J73j43K61L5
6633A02j94R6Q3k72K01KJ0J36j1J29k7n13J73M9P8K90n25L86l34K73M2k92R8%
$$ plain form
6657 -20 -44 -106 -11 -31 37 164 0 -184 -263 -137 -36 -62 -18 64 -274 -468 25 -217 408 -202 220 -205 -158 86
6681 86 181 -28 -32 -204 310 6 -138 224 -279 -203 -66 63 301 112 -137 205 -45 179 6 10 188 73
6703 73 -45 -8 -35 -271 205 -256 242 75 90 -211 -123 -40 -224 33 232 -54 83 116 213 78 223 92 -131
6726 -131 101 -203 172 -26 66 99 196 196 144 282 -183 135 29 134 -66 -131 -249 -130 210 -94 -350 132
6748 132 8 -347 -90 -112 -33 -1 24 21 -261 -128 0 -146 257 117 -140 -255 -151 203 -332 -192 -145 285
6770 285 138 12 -75 -133 172 141 -17 -36 97 -69 150 18 -83 85 181 266 -190 20 234 -144 -71 -149 165
6793 165 66 -59 -86 -3 87 52 -192 -100 -34 58 -377 42 -13 293 -111 149 153 -103 120 161 8 83 146 88 -130
6818 -130 -45 106 79 86 179 -43 -25 192 -13 -392 -82 -81 -33 255 125 -205 -21 4 50 -39 118 -29 -98 117
$$ packed form
6657b0k4o2R5k0O8J27j64j84p9J26J01k6M4Q2l38j94M93k42O25o10M22m25M7K44
6681H6R5k09mj72N14l04j44L62n03P6J37J29K38j89k49L42k50K24j73MJ78j15
6703G3j18L7k7k36M76m61M98j67J5l01Q8Q3j84K57J99k86J37L3R7j35J45j31k23
6726a31K32l04L75j98R2L3R7%n2J38m65L18j06J05k00o5j18J19L40l04k56M82
6748A32j24l55K57k2P9L2K5lk82J33J28j46M03j40k57j15J04L54n35J40M7M30
6770B85j47j26q7n8L05l1j58j9J33j66K19j32j01J68R6Q5m56K10K14l78P3p8L14
6793A65r9j25k7Q3R0l5k44R2O6R2m35M19n5L06m04K60Mk56K23M1j53P5O3n8k18
6818a30Q5J51k7PR3k22J8K17k05l79L10JM8K88j30l30J84K5M6q9J57j47o9K15
$$ plain form
6842 117 -41 -89 -39 -284 -198 18 -118 104 -20 151 -62 193 -106 -5 -337 157 -67 -220 17 -315 280
6863 280 -114 -145 21 -108 25 -175 42 -237 -179 3 104 108 602 240 -175 116 76 -198 -2 112 -84 -23
6885 -23 71 161 -40 73 -210 170 119 -465 -109 267 -63 58 -57 -155 42 94 171 -117 8 -97 -2 -62 20
6908 20 45 -64 -125 54 77 -423 116 195 12 226 -331 258 -49 66 77 -23 163 -8 -173 294 -70 -23
6930 -23 83 0 -8 -77 -133 -34 9 15 -62 84 183 208 38 -14 178 -75 235 -467 -160 115 -56 261 163 -13 57
6955 57 36 117 140 -95 -99 230 -104 498 130 -80 93 -38 -9 343 10 -216 -31 90 236 126 -88 55
6977 55 157 -50 137 253 26 13 106 -82 -243 -358 143 124 -269 176 -7 -282 156 47 197 -107 17
6998 17 -89 -245 -169 -289 14 -413 202 101 343 -117 58 -17 -10 90 -89 4 11 -140 -231 -248 68 120 189 -61
$$ packed form
6842A17j58m8N0k45Q6K16j36K22j24J71k13K55k99J01l32M94k24j53K37l32N95
6863B80l94l1J66j29J33k00K17k79N8J82J01MM94l62m15K91m0k74J96J14j96O1
6885b3R4R0k01J13k83L80n1n84L56L76l30J21j15r8J97N2P7k88J25j05R5o0Q2
6908B0K5j09o1J79K3n00N39P9j83K14n57N89l07J15J1j00J86j71j65M67l64M7
6930b3J06q3qo9n6R9M3Op7J46R9K5j70n2J92k53L10p02L07K75j71L17r8j76P0
6955E7k1Q1K3k35mL29l34O02l68k10J73j31K9L52l33k26J85J21J46j10k14J43
6977E5J02k07J87J16k27j3R3j88j61j15N01j9l93M45j83k75M38j09J50l04J24
6998A7j06j56P6j20L03m27O15j01K42m60J75p5PJ00j79R3Pj51r1j7L16N2O9k50
$$ plain form
7022 -61 294 69 -49 2 -322 17 -127 -193 -60 -130 -351 -209 219 65 50 61 176 81 136 237 -322 -107 -559
7045 -559 -15 153 62 -301 -86 14 -154 82 -350 -69 -25 -50 -71 8 -343 -65 -22 51 160 -440 -143 312
7067 312 102 124 267 -2 -15 -157 38 -101 93 86 118 -179 -264 0 -162 -269 -42 -151 -116 99 -204 33
7089 33 81 90 75 -416 107 -19 371 87 66 -114 116 227 -44 -181 78 -170 -7 260 101 -193 -119 191
7111 191 -99 -39 125 65 18 -58 195 6 -97 -42 272 -145 -48 169 -151 -67 -103 -199 225 20 -78 76 23 64
7135 64 342 -50 71 -92 149 -253 -1 97 -173 197 228 98 221 56 172 138 102 88 -86 -344 -69 78
7157 78 -74 -21 105 109 90 67 162 111 -37 564 -282 343 -96 -31 -132 -120 16 169 67 -145 42 115 -108 -9
7181 -9 58 -195 -338 -278 148 -226 -110 -46 -79 -146 -130 -25 -17 -184 88 43 50 -45 133 -41 245 -80 -326 -42 -129
$$ packed form
7022f1L55k25j18N1l24L39j44o6J33p0k21J42M28j54j5J1J15r5N5J01n59K15m52
7045e59N44J68r1l63K15J00j68K36m32K81M4k5k1P9l51K78M3P3J09o00K97M55
7067C12k10K2J43k69j3j42J95j39J94pL2k97q5K64j62j07K27j09L5K15l03K37
7089C3M8Rj5m91N23j26L90k84k1j80K30J11k71j37K59k48J63K67j59k94P4L10
7111A91k90O0J64o0m7p6K53j89j03N5L14m17R7K17l20Q4l6r6M24k05r8J54n3M1
7135F4K78l92J21j63K41m02K52R8k70L70L1j30J23j65J16l4l6j4j74k58K75J47
7157G8j52N3J26Mj9k3R5n1j48O01q46O25m39O5j01J2J36J53j02k12J87P3k23R9
7181iO7k53j43O0M26l74J16O4l3o7J6J05Qj67K72m5Pr5J78j74K86l25k46K84q7
$$ plain form
7206 -129 -92 321 362 -369 100 -212 145 -30 474 -134 -298 -189 142 -226 -293 -162 -312 -85 -239 104 -176
7227 -176 270 171 -143 -108 176 -13 117 -42 -75 51 -102 182 116 -150 -62 -15 73 183 -28 -92 67 69 -87
7250 -87 105 -236 -103 110 -90 185 -44 223 51 -92 180 219 11 -261 -36 -137 -55 -91 -106 -119 53 80
7272 80 -68 60 -182 436 90 -48 185 47 3 58 -178 -136 43 -35 46 107 -227 135 -27 -2 102 -186 -103
7295 -103 -354 142 289 -249 230 262 26 -79 -196 208 -20 -30 -38 -18 270 51 40 330 146 272 -60 85
7317 85 -208 -109 -69 158 256 67 -15 -72 -34 201 130 -112 61 -35 -162 52 148 134 344 166 -239 179 -91 136
7341 136 13 -75 -252 118 -130 134 -111 -21 253 127 -174 56 338 -169 -249 1 -180 -138 112 127 -262 495
7363 495 23 -220 314 -183 -65 58 105 124 -127 373 401 156 -114 -229 91 98 -151 -222 -17 -248 94 -194
$$ packed form
7206a29L7M13M1p31M69l12L57j75N04o08j64J09L31l68o7J31j50K27j54L43k80
7227a76M46r9l14L5K84j89J30j59l3J26j53K84o6k66Q8M7Q8J10k11o4J59Kj56
7250h7J92l41J33K13k00K75k29K67j72j43K72L9k08k72K25j01Q2l6j5j3J72K7
7272H0j48J28k42O18l46j38K33j38m4N5k36M2J79p8Q1O1l34L62j62K5J04k88Q3
7295a03k51M96J47n38M79L2k36j05j17M04k28j0qK0K88k19j1K90j84J26l32J45
7317H5k93R9M0K27R8j89q2n7L8K35p1k42J73r6j27K14R6j4K10j78m05M18k70K27
7341A36j23q8j77L70k48K64k45R0K74j26l01K30K82n07q0K50j81M2K50J5l89P57
7363D95m72k43N34m97J18J23M7J9k51N00K8k45k70j15L20Pk49p1K05k31L42k88
$$ plain form
7385 -194 23 -73 140 -24 -11 -105 204 52 -206 -338 110 121 -1 -51 -340 -30 -81 -164 -96 -122 149 221 144 10
7409 10 30 -232 -318 -8 60 -4 225 -118 119 -269 18 207 15 -297 -256 382 -8 -241 -134 17 -281 33
7431 33 185 -101 160 -52 -63 92 -277 -82 -163 214 -392 171 -34 207 -11 234 -268 67 -266 69 107
7452 107 -251 -122 -2 168 -103 163 58 -218 112 90 360 18 96 103 -47 -99 -218 324 13 82 -75 -149
7474 -149 243 -86 -2 -138 -151 232 81 24 66 -94 -192 259 -293 -257 13 -293 101 -321 256 -258 -182 150
7496 150 -102 -83 30 -239 -152 -40 -170 176 158 120 -167 39 132 -147 -84 54 177 -144 28 149 273 -103
7518 -103 -40 285 -41 342 -69 -99 179 -44 103 46 -396 204 -38 80 125 -59 79 -174 -63 -209 -91
7539 -91 -181 -129 -71 155 -241 -154 0 -37 238 -132 -54 39 31 215 301 -243 102 -356 172 -156 -190 -128 188 -1
$$ packed form
7385a94K17r6K13j64J3r4L09j52k58j32M48J1j22n0k89L10n1q3O8k6K71P2p7j34
7409A0K0k62q6L10O8o4K29l43K37l88K87J89j92l12M1O38l90k33J07J51k98L14
7431C3J52k86K61k12j1J55l69J95q1L77o06N63k05K41k18K45n02L35l33L35L8
7452A07l58J29J20J70k71K66j05k76L30k2K70l42P8Pj50n2j19N42l11O9j57p4
7474a49L92l29Q4j36j3L83j51n7M2j60r8M51n52L6K70l06L94m22N77n14P6L32
7496A50k52J9J13k69Q7J12j30L46j8l8k87K06R3k79O3J38J23l21J72J21J24l76
7518a03O3L25l26L83m11l0K78k23J47n7m42O00k42J18M5j84J38k53J11j46J18
7539i1r0N2N8K26l96Q7J54l7K75l70P8R3qJ84Q6n44L45m58N28l28l4O2L16j89
$$ plain form
7563 -1 -63 94 -90 57 -116 -10 78 98 42 158 -187 3 -123 -3 -278 -160 -12 -200 -22 33 -2 56 -188
7586 -188 -4 -203 166 119 2 295 293 6 152 -7 -176 103 -64 121 66 -80 107 50 77 -121 -88 14
7608 14 -188 -91 -187 7 -237 69 98 -354 134 -128 -45 59 -5 37 190 198 -70 193 -107 104 -214 85 -221
7631 -221 -103 -185 -201 -11 -114 99 -70 -170 132 -41 41 212 116 -118 -207 182 -155 32 317 -95 -80 61
7653 61 165 -79 -1 -175 -252 -94 -148 192 -131 76 -216 252 -349 -455 231 -293 -229 208 12 -255 -129 -52
7675 -52 35 -217 -64 142 -87 -93 70 -61 -52 110 -106 -154 -217 -203 58 169 82 -256 -170 164 -241 -39 -196 167
7699 167 342 218 130 65 -34 238 84 -118 -24 -208 22 30 28 143 158 -241 -164 256 46 -50 -292 58 3 123
7723 123 146 -50 -183 58 -10 -24 -335 119 -140 46 -288 79 201 92 117 -130 38 -50 -183 -142 23 21 -70
$$ packed form
7563ao2J57j84J47j73J06Q8K0n6J16l45J90j26J20k75J18J48j88J78N5l5N8k44
7586a88J84j99L69m7j17K93kk87J46j59j69K79j67J85n5j46J87n7K7j98L3J02
7608A4k02R7r6J94k44L06K9m52M88k62Q3J04o4M2J53Qk68K63l00K11l18K99l06
7631b21J18q2j6J90j03K13j69j00L02j73Q2J71r6k34q9L89l37J87K85m12J5J41
7653F1J04k44P8j74p7J58n4L40l23K07k92M68o01j06O86n24O4M37j96k67J26P7
7675e2Q7k52J53K06k29oJ63j31RJ62k16m8o3J4K61J11q7l38Q6L34m05K02j57L63
7699A67J75j24q8o5r9K72j54k02R4j84K30QkJ15J5l99P7M20k10r6k42L50n5J20
7723A23K3j96j33K41o8j4l11M54k59J86l34L67J22j09K5k47J68q8j33M1J65kr1
$$ plain form
7746 -70 70 18 154 -60 69 154 100 -26 182 -66 -37 44 -128 138 -28 -149 -179 162 -38 274 58 -75
7768 -75 -38 98 -50 422 40 -179 -122 -265 205 99 -83 255 220 2 320 146 -206 -167 -63 124 -120 -103
7790 -103 -9 -239 -341 -30 131 190 8 196 -103 360 36 39 -23 210 -394 11 198 -60 254 256 -66 -51 -129
7813 -129 92 115 95 -76 -175 318 -62 -43 -26 -26 -197 -146 -18 -20 192 -69 304 -59 205 -177 -150 20 316 -35
7837 -35 8 -167 -11 244 -55 45 244 -156 162 189 -116 163 -241 218 319 21 -202 62 -160 -50 -166
7858 -166 -204 33 -145 175 -245 258 377 2 -89 -185 395 -150 72 -101 -470 -297 -200 -186 102 42 5 -129
7880 -129 107 -316 165 -145 60 -106 181 96 -120 185 158 27 -453 174 31 83 29 64 55 55 105 -212 155
7903 155 -4 -39 -25 42 296 -137 39 15 -6 193 34 -37 206 194 -10 307 16 91 27 141 -377 25 -19
$$ packed form
7746g0J40n2J36k14J29Q5n4j26K08k48K9Q1j72K66j66j21l0L41k00L12k16j33
7768g5L7J36j48M72l82k19N7j43M70j06j82L38l5k18L18j74l52L9J04J87k44J7
7790a03R4k30j02L11J61N9j82J88k99M63l24Lo2K33o04M05J87k58L14Kl22J5p8
7813a29K21K3k0j71r9M93l80J9J7%j71N1J28kK12k61L73l63K64l82K7J70K96l51
7837c5M3j75J56K55k99J00J99m00L18K7l05K79m04M59J01k98k23K64k22J10j16
7858a66l8K37j78L20m20N03J19l75r1r6N80n45K22j73l69J73R7J4K88o0l7j34
7880a29K36m23M81l10K05j66K87q5k16L05k7j31m80O27j43N2n4L5r%N0l17L67
7903A55j59l5J4O7K54m33J76k4k1J99j59p1K43j2k04L17k91P5o4J14n18M02m4
$$ plain form
7926 -19 221 -314 266 -151 115 139 79 309 153 285 -268 41 74 -165 282 -68 161 -348 146 43 -168
7947 -168 127 -110 87 -14 -186 -120 233 -241 152 101 376 159 -104 148 -309 275 1 -56 -85 211 -211
7968 -211 15 -54 -182 51 24 -114 35 -33 -25 132 -102 147 -116 244 -10 -52 -52 -331 -61 190 -137 -90 -168
7991 -168 -46 28 -79 396 -414 1 -214 133 7 283 192 -37 118 263 -73 208 -21 84 -28 59 -227
8012 -227 -47 -28 -16 158 217 175 226 91 -260 -320 -43 -49 231 -161 -259 122 -126 -134 -189 110 -57 16 139 55 257
8037 257 -57 -60 18 99 142 237 -267 176 -107 -107 18 202 -176 -138 185 -121 174 107 345 -262 -140 -258 -174 130
8061 130 -68 -287 66 52 -119 -55 170 -61 -207 -172 -46 85 -92 332 -48 4 69 109 -91 -119 246 401
8083 401 251 108 14 388 -12 145 -33 -133 17 -133 -8 -142 -81 -1 -128 7 71 -161 -86 -201 -228 -151
$$ packed form
7926a9K40n35N80m17K66K4o0K30j56J32n53L09L3k39M47l50K29n09M94j03k11
7947a68K95k37J97j01j72O6L53m74L93n1K75k17k63K52m57N84k74n7k9K96m22
7968b11K26o9j28K33k7j38J49o8QJ57k34K49k63L60k54m2%k79K70K51l27M7p8
7991a68J22P4j07M75q10M15k15L47j26K76r1k29J55J45l36K81k29J05j12Q7k86
8012b27J80J9J2J74N9m2N1j35l51o0K77oK80l92r8L81k48qn5K99j67P3J23q4K02
8037B57l14lP8Q1M3R5n04M43k83%J25J84l78L8L23l06K95o7K38o07J22j18Q4L04
8061A30j98k19L53j4j71O4K25k31j46L5J26J31j77M24l80N2O5M0k00k8L65J55
8083D01j50j43r4L74m00J57j78j00J50j50J25j34O1Q0j27J35O4k32P5j15k7P7
$$ plain form
8105 -151 141 71 147 174 134 -73 -151 94 -77 -248 231 -465 40 -90 119 -530 -182 223 237 70 -195 -30
8127 -30 -122 -77 155 -164 166 -141 -155 104 -113 95 102 -79 212 152 -165 79 6 108 -451 -79 -74 -65 -90 292
8151 292 -360 -212 -47 206 -13 6 186 -411 339 109 12 -133 -131 103 86 -122 65 283 64 55 -272 231
8173 231 -128 117 10 -218 -169 -52 -200 14 21 -57 -84 187 372 -71 -244 -102 -21 289
$$ packed form
8105a51K92p0P6K7m0k07p8K45j71j71M79o96N05j30K09o49L48M05J4j67k65J65
8127c0r2M5K32l19L30l07j4K59k17K08Pj81K91o0l17K44p3J02n59L72NRk5L82
8151B92o52J48J65K53k19J9J80n97P50k30r7j45KK34j7k08J87K18k19rl27N03
8173B31l59K45j07k28M9J17j48K14Pp8k7K71J85m43j73J42Q1L10
8191B89
$$ Imaginary data points
##PAGE= N=2
##DATA TABLE= (X++(I..I)), XYDATA
$$ plain form
0 0 0 0 0 0 8 0 8 -8 8 -16 16 -24 28 -35 40 -49 64 -72 88 -104 120 -137 161 -185 213 -243 278 -315 359
29 359 -404 455 -511 572 -641 714 -795 883 -981 1091 -1205 1335 -1481 1637 -1813 2011
45 2011 -2230 2478 -2763 3088 -3467 3920 -4460 5127 -5972 7080 -8608 10852 -14479 21309
59 21309 -38609 170779 247288 -186890 -118784 -44608 -13273 165740 152643 -161456 -185965
70 -185965 -10693 107693 146920 32882 -149656 -106573 21399 114251 135139 -35210 -194219
81 -194219 -66503 73742 104426 104127 -64921 -211917 -10111 171027 88036 4703 -88351
92 -88351 -174231 10487 201744 78904 -93129 -131035 -74311 103625 175102 1127 -120459
103 -120459 -92208 -25746 113443 145073 -59533 -161558 -42819 52188 105868 90366 -76345
$$ packed form
0@%%%%QqQj6J6k4L2m0N2o3P5q9J13j36J60j92K24k57K98l46L98m56N21n93O74
29C59p63Q59r66J083j213J355j509J678j864K072k296K540k816L118l450L824
45B011m241M708n241N851o555P387q380R587j1099J3052j5688J9460k5331L5788
59B1309n9918K09388P6509m34178O8106P4176L1335J79013j3097l14099k4509
70a85965J75272J18386L9227j14038j82538M3083J27972R2852K0888j70349j59009
81a94219J27716J40245L0684k99j69048j46996K01806J81138q2991q3333r3054
92h8351q5880J84718J91257j22840j72033l7906N6724J77936P1477j73975j21586
103a20459K8251O6462J39189L1630k04606j02025J18739R5007N3680j5502j66711
$$ plain form
114 -76345 -144658 -9294 86172 96430 41030 -117817 -143939 42875 131302 59310 -21600
125 -21600 -112107 -97864 81510 150179 21818 -92792 -114155 -27079 118463 110569 -38858
136 -38858 -107453 -69667 24308 126716 74310 -81219 -108184 -26069 57482 112708 30535 -116211
148 -116211 -90565 28645 73425 80801 6477 -125900 -83557 76640 101713 29420 -46660
159 -46660 -109946 -41771 99884 96676 -10341 -81518 -88971 10549 121302 62627 -60846 -84312
171 -84312 -43888 40947 110783 30342 -89555 -78472 -2545 67096 91174 -7448 -106923 -53603
183 -53603 39014 72620 59000 -35598 -110175 -29072 73642 71025 18632 -61631 -94502 8008
195 8008 96808 51720 -21812 -71939 -68645 38639 104492 21095 -62069 -66251 -25846 61572
$$ packed form
114g6345o8313J35364R5466J0258n5400j58847k6122J86814Q8427p1992q0910
125b1600r0507J4243J79374O8669j28361j14610k1363Q7076J45542p894j49427
136c8858o8595L7786R3975J02408n2406j55529k6965Q2115Q3551N5226q2173j46746
148a16211K5646J19210M4780P376p4324j32377M2343J60197K5073p2293p6080
159d6660o3286O8175J41655l208j07017p1177p453R9520J10753n8675j23473k3466
171h4312M0424Q4835O9836q0441j19897J1083P5927O9641K4078r8622r9475N3320
183e3603R2617L3606j3620r4598p4577Q1103J02714k617n2393q0263l2871J02510
195H008Q8800m5088p3532n0127L294J07284O5853q3397q3164m182M0405Q7418
$$ plain form
207 61572 89620 -9026 -79365 -49023 8697 70857 65888 -41228 -88867 -22168 41130 67437
219 67437 36881 -60333 -82991 8865 66717 52326 166 -74216 -65225 37682 76772 25815
231 25815 -31420 -69649 -34490 60907 73275 -2746 -54717 -57126 -4434 71547 55153 -32690
243 -32690 -63530 -32634 24178 73683 34031 -55284 -63099 -4129 44675 59484 5026 -69924
255 -69924 -51180 25239 58288 39197 -20162 -70258 -29433 48442 57077 10406 -42531 -61599
267 -61599 -5125 62701 46303 -15770 -51667 -41284 20684 66996 27079 -39909 -52972 -19034
279 -19034 37723 60165 3946 -55885 -42553 9236 49747 45065 -17509 -62700 -26635 32104
291 32104 49627 20733 -36852 -57916 -5123 49120 42508 -1853 -46445 -44030 16900 55855
$$ packed form
207F1572K8048r8646p0339L0342N7720O2160m969j07116m7639O6699O3298K6307
219F7437l0556r7214k2658R1856N7852j4391n2160p4382Q991J02907L9090n0957
231B5815n7235l8229L5159R5397J2368p6021n1971k409N2692P5981j6394q7843
243c2690l0840L0896N6812M9505l9652q9315p815N8970M8804J4809n4458p4950
255f9924J8744P6419L3049j9091n9359n0096M0825P7875Q635m6671n2937j9068
267f1599N6474O7826j6398o2073l5897J0383O1968M6312l9917o6988j3063L3938
279a9034N6757K2442n6219n9831J3332N1789M0511m682o2574m5191L6065N8739
291C2104J7523k8894n7585k1064N2793N4243o612m4361m4592K415O0930L8955
$$ plain form
303 55855 25345 -25202 -49032 -25211 34411 54838 5712 -41660 -39614 -2073 44184 43910 -14217
316 -14217 -52198 -26978 19692 46264 25427 -30341 -49692 -8642 36608 42520 4417 -43562
328 -43562 -40133 11811 43590 28227 -14532 -47044 -25561 29833 45434 10430 -29357 -41873
340 -41873 -7767 41151 38431 -9968 -39783 -29204 10766 45215 25702 -25821 -40866 -12528
352 -12528 26466 41737 8521 -38243 -35817 5591 35212 30498 -7842 -42366 -24451 21695
364 21695 39501 15836 -24668 -40191 -8608 31940 33732 -16 -34217 -32471 8764 39891
376 39891 22858 -16976 -36512 -18426 22316 38724 7923 -29687 -32268 -2306 31053 31095 -5899
389 -5899 -35625 -23427 12954 35503 18572 -20895 -35421 -9969 24707 31966 4816 -29653
$$ packed form
303E5855l0510n0547k3830K3821N9622K0427m9126m7372K046L7541M6257k74n8127
316a4217l7981K5220M6670K6572k0837n5768j9351M1050M5250N912l8103m7979
328d3562L429N1944L1779j5363m2759l2512K1483N5394J5601l5004l9787j2516
340d1873L4106M8918k720m8399k9815J0579L9970L4449j9513n1523j5045K8338
352a2528L8994J5271l3216m6764K426M1408K9621m714l8340l4524J7915M6146
364B1695J7806k3665m0504j5523L1583M0548J792l3748l4201J746M1235L1127
376C9891j7033l9834j9536J8086M0742J6408l0801l7610k581K9962L3359M2l6994
389e899k9726J2198L6381K2549j6931l9467j4526K5452L4676P259k7150l4469
$$ plain form
401 -29653 -30025 5030 32875 23348 -10176 -32804 -19296 16949 33869 12104 -23376 -32139 -4450
414 -4450 27537 27928 -1809 -29652 -24370 8899 31657 18129 -15005 -31109 -13023 20064 30674
427 30674 6449 -24501 -27058 247 27675 23664 -7167 -29472 -18612 11770 29747 14041
439 14041 -18215 -28494 -6746 21497 26525 1702 -26051 -23696 5190 27067 19082 -10151 -29118
452 -29118 -13536 16731 26655 8457 -18729 -26354 -2886 24474 21990 -4087 -24131 -19137 7817
465 7817 27723 14049 -14346 -24881 -9185 16857 25635 4083 -22137 -21212 1710 22097 19631
478 19631 -6659 -25808 -13755 11954 23946 11061 -15542 -25163 -3701 20074 19916 524 -20623
491 -20623 -20553 5977 24390 13167 -9260 -22252 -12347 14249 24041 4573 -17307 -19338 -2623
$$ packed form
401b9653l72L5055K7845r527l3524k2628J3508L6245J6920k1765l5480q763K7689
414d450L1987L91k9737k7843N282L3269K2758j3528l3134j6104J8086L3087J0610
427C0674k4225l0950k557K7305K7428m011l0831k2305J0860L0382J7977j5706
439A4041l2256j0279K1748K8243N028k4823k7753K355K8886K1877p985k9233j8967
452b9118J5582L0267R924j8198k7186p625K3468K7360k484k6077k0044M994K6954
465G817J9906j3674k8395j0535J5696K6042Q778k1552k6220R25K2922K0387k466
478A9631k6290j9149J2053K5709J1992j2885k6603r621K1462K3775j58j9392k1147
491b0623P0K6530J8413j1223k2427j2992R905K6596R792j9468k1880k031J6715
$$ plain form
504 -2623 19695 19748 -4941 -21552 -13887 6463 21879 13290 -13132 -21864 -5450 13677 20336 4693
518 4693 -19441 -19346 4320 19118 13912 -4039 -21346 -13262 12439 20228 6058 -11619 -19616 -5545
532 -5545 18450 17803 -2274 -16700 -15074 3340 21192 12189 -10458 -17873 -8241 9961 20070
545 20070 4879 -16507 -15944 13 14704 16436 -2326 -20589 -11115 8625 16266 9734 -9177
558 -9177 -20139 -4784 15574 14844 1702 -13677 -16157 1973 18309 11029 -6385 -15812 -10525
571 -10525 9018 18724 4830 -12363 -14258 -3313 13252 15782 -2383 -16407 -10390 3603 14721
584 14721 11474 -8412 -17914 -4422 10841 13825 4331 -12835 -15963 2388 15034 10046 -2771
597 -2771 -14464 -11021 8038 16135 5038 -8959 -14029 -5222 12613 14352 -1798 -13010 -10745
$$ packed form
504b623K2318N3k4689j6611P665K0350J5416q589k6422q732J6414J9127O659j5643
518D693k4134R5K3666J4798n206j7951j7307Q084K5701P789j4170j7677p997J4071
532e545K3995o47k0077j4426J626J8414J7852r003k2647p415R632J8202J0109
545B0070j5191k1386N63J5957J4691J732j8762j8263R474J9740P641o532j8911
558i177j0962J5355K0358p30j3142j5379k480J8130J6336p280j7414r427N287
571a0525J9543R706j3894j7193j895J0945J6565K530j8165j4024O017J3993J1118
584A4721l247j9886r502J3492J5263K984r494j7166l128J8351J2646m988j2817
597b771j1693L443J9059Q097j1097j3997n070Q807J7835J739j6150j1212K265
$$ plain form
610 -10745 1077 14814 10870 -7282 -14294 -5510 6621 14140 5766 -12472 -13892 868 11222
623 11222 10971 -250 -14409 -10069 6947 12730 5796 -5493 -13815 -5760 11240 12280 194 -9241
637 -9241 -11735 -347 14375 9334 -5759 -10600 -7747 4149 14624 4986 -10584 -10743 -1550 8093
651 8093 13146 440 -13865 -8146 3770 9577 8556 -4110 -14631 -4192 8664 9261 3672 -7776
665 -7776 -13058 283 11896 7643 -1278 -9520 -9981 4566 13557 3568 -6097 -9043 -5472 8126
679 8126 12740 -607 -9928 -7345 -500 9873 9899 -5111 -11749 -3960 4784 9788 5845 -8021 -11333
694 -11333 390 7774 7950 1259 -9703 -8869 4075 9994 5293 -3089 -10487 -5764 8083 9533
708 9533 701 -6121 -9556 -1734 10604 7926 -3924 -8157 -5752 2279 10638 5098 -7403 -8526
$$ packed form
610a0745J1822J3737l944j8152p012Q784J2131P519q374j8238j420J4760J0354
623A1222k51j1221j4159M340J7016N783o934j1289q322Q055J7000J040j2086r435
637i241k494J1388J4722n041j5093m841K853J1896J0475r638j5570j59R193R643
651H093N053j2706j4305N719J1916N807j021j2666j0521J0439J2856N97n589j1448
665g776n282J3341J1613m253q921q242m61J4547Q991r989r665k946L571J3598
679H126M614j3347r321K583O845J0373K6j5010o638P789Q744N004l943j3866l312
694a1333J1723P384J76o691j0962Q34J2944N919m701q382p398M723J3847J450
708I533q832o822l435P822J2338k678j1850m233K405Q031Q359n540j2501j123
$$ plain form
722 -8526 -1844 5666 9131 1298 -9355 -7200 2356 7389 6209 -2156 -10250 -4750 5801 8013 2787
737 2787 -4976 -9386 -1539 8554 6860 -1092 -7007 -6846 1602 9820 4746 -5025 -7737 -3290 4889
752 4889 9217 1482 -7530 -6602 375 6945 7245 -1836 -9053 -3848 3829 7063 4177 -4594 -9081 -913
768 -913 6409 6096 771 -6120 -7576 1970 8513 3732 -3022 -6771 -5107 4023 9001 1335 -5715 -5746
784 -5746 -1752 6351 7876 -1681 -7784 -4098 1684 7077 4667 -4619 -7689 -1239 4501 5705 2122
799 2122 -6003 -6681 1763 6600 4168 -311 -7301 -5442 4559 6885 1703 -3254 -6443 -2590 6406
814 6406 5990 -1209 -5077 -4912 135 7213 4878 -4089 -5862 -2217 2839 7150 1898 -6088 -5142 614
830 614 4408 5405 -496 -6887 -3523 3287 4821 3754 -2526 -7246 -2004 5269 4384 459 -4214 -6259
$$ packed form
722h526O682P510L465p833j0653K155R556N033j180q365q094N500J0551K212n226
737B787p763m410P847J0093j694p952n915J61Q448Q218n074r771k712M447Q179
752D889M328p735r012R28O977O570L00r081p217N205P677L234k886q771m487Q168
768i13P322l13n325o891j456R546O543m781o754l749J664R130M978p666p050l1
784e746L994Q103J525r557o103L686N782N393k410r286l070O450N740J204l583
799B122q125o78Q444M837k432m479o990J859J0001K326n182m957l189L853Q996
814F406m16p199l868J65N047P078k335q967j773L645N056M311n252p986R46N756
830F14L794R97n901o391L364O810J534j067o280m720N242P273q85l925m673k045
$$ plain form
846 -6259 634 6305 3586 -2127 -4991 -3959 2782 6885 1538 -3983 -4232 -1558 4354 5724 -679
861 -679 -5524 -3012 1249 4809 4157 -2849 -5872 -1531 3094 4636 2145 -4169 -5641 524 4813 4180
877 4180 -709 -4940 -4072 2639 5219 2091 -2528 -4953 -1994 3907 5118 -266 -4221 -3962 190 4613
893 4613 3945 -2287 -4606 -1917 2193 4503 2107 -3521 -4617 -137 3656 3914 333 -4737 -4149 1880
909 1880 4725 2075 -2032 -4517 -2268 3589 4531 340 -3096 -3735 -59 4470 3442 -1434 -4064 -2530
925 -2530 1521 4702 2621 -3063 -4169 -895 2808 3920 882 -4194 -3218 1499 3391 2943 -930 -4577
941 -4577 -1977 3122 3903 1207 -2641 -3866 -662 3917 2786 -739 -3072 -3421 901 4506 1986 -2284
957 -2284 -3159 -1589 2167 4311 367 -3732 -2626 -8 2688 3682 -944 -3955 -1604 1679 3133 2309
$$ packed form
846f259O893N671k719n713k864J032O741M103n347n521k49K674N912J370o403
861f79m845K512M261L560o52p006l023M341M625J542k491o314j472O165M289o33
877D180m889m231Q68O711K580l128m619k425K959N901J211n384l955K59M152M423
893D613o68o232k319K689M110K310k396n628j096M480L793K58l581n070N88O029
909A880K845k650m107k485K249N857R42m191l436o39L676M529j028m876k630J534
925b530M051L181k081n684j106L274L703J112l038n076R76M717J892m48l873l647
941d577K600N099P81k696l848j225L204M579j131l525k333l49M322L605k520m270
957b284q75J570L756K144l944m099J106K618K696R94m626l011K351L283J454q24
$$ plain form
973 2309 -2402 -4002 -363 2945 2801 421 -3123 -3444 972 3790 1879 -1091 -3405 -1764 2486 3832
989 3832 710 -2021 -2792 -714 3034 2951 -1165 -2912 -2295 800 3411 1979 -2426 -3135 -460 2120
1005 2120 3254 1019 -2926 -2674 368 2655 2332 -474 -2920 -1859 2111 2865 1212 -1394 -3150 -324
1021 -324 2771 2441 -193 -2559 -2564 637 3138 1405 -1436 -2612 -1547 1616 3029 919 -2286 -2288 75
1038 75 2323 2328 -307 -3034 -1762 914 2505 1525 -1654 -3090 -646 1624 2261 322 -2004 -2221 305
1055 305 2863 1849 -629 -2524 -1383 1466 2729 887 -1767 -2504 -347 1742 2516 -68 -2618 -1497
1071 -1497 724 2355 1316 -1091 -2566 -928 1773 2305 595 -1699 -2191 190 2468 1619 -512 -1939
1087 -1939 -1469 585 2806 1258 -1345 -2077 -869 1482 2167 193 -1654 -1755 204 1793 1641 -902
$$ packed form
973B309m711j600L639L308j44k380l544l21M416K818j911k970k314J641M250J346
989C832l122k731p71K078L748q3m116j747O17L095K611j432m405p09K675K580
1005B120J134k235l945K52L042K287l23k806k446J061L970P54j653k606j756K826
1021c24L095l30k634k366nL201K501j733k841j176J065L163J413k110l205kK363
1038G5K248Nk635k727J272K676J591r80l179j436K444K270O37j939k326k17K526
1055C05K558j014k478j895J141K849J263j842k654p37K157K089P74k584k550J121
1071a497K221J631j039k407j475J638K701N32j710k294m92K381K278q49k131j427
1087a939M70K054K221j548k603p32J208K351O85j974j847j01J959J589j52k543
$$ plain form
1103 -902 -2172 -845 1410 1996 882 -1221 -1942 -371 1816 1553 -342 -1725 -1450 447 1806 1577
1119 1577 -1058 -2186 -489 1421 1804 467 -1443 -1761 -149 1941 1566 -508 -1584 -1153 689 1965
1135 1965 874 -1121 -1769 -618 1442 1703 100 -1664 -1699 82 1747 1206 -707 -1539 -804 1008 1898
1152 1898 321 -1231 -1501 -304 1462 1808 -318 -1660 -1121 364 1428 1028 -1118 -1844 -453 1045
1168 1045 1617 555 -1559 -1837 -283 1214 865 -212 -1907 -1220 713 1587 592 -1096 -1507 -676 1194
1185 1194 1631 21 -1369 -1132 407 1418 828 -871 -1537 -279 678 1419 758 -1291 -1146 -109 1179
1202 1179 1310 -118 -1665 -922 577 1317 389 -413 -1381 -400 903 1234 43 -1049 -1133 155 1662
1219 1662 870 -467 -1206 -1158 793 1683 807 -1002 -987 -51 906 1461 30 -1240 -928 506 1027 988 -333
$$ packed form
1103i02j270J327K255N86j114k103p21J571K187k63j895j383K75J897J359k29
1119A577k635j128J697J910L83j337j910l18J612K090l75k074j076M31J842J276
1135A965j091j995o48J151K060K61j603j764l5J781J665n41j913q32P35J812Q90
1152A898j577j552k70J197J766L46k126j342N39J485J064m00k146p26J391J498
1168A045N72j062k114k78J554J497l49j077j695O87J933Q74r95j688m11Q31J870
1185A194M37j610j390K37J539J011n90j699o66J258R57P41o61k049J45J037J288
1202A179J31j428j547P43J499P40r28q02r68R81J303L31j191j092q4J288J507
1219A662p92j337p39M8J951Q90q76j809J5R36R57N55j431j270L12J434N21l9j321
$$ plain form
1238 -333 -1446 -469 1080 1338 489 -641 -999 -192 1362 834 -212 -1066 -1047 425 1466 545 -563 -1038
1256 -1038 -655 1048 1424 142 -953 -796 -120 1122 1058 -344 -1287 -578 326 919 604 -761 -1455 -19
1274 -19 835 846 5 -909 -1031 609 1162 309 -466 -1219 -427 819 978 -117 -713 -1084 -300 1115 541
1293 541 -342 -811 -452 71 1126 649 -811 -1016 -21 708 842 448 -892 -678 307 432 926 -203 -1103
1312 -1103 -545 638 737 305 -333 -1015 48 736 773 -1 -772 -738 135 1226 324 -364 -734 -627 166 1050
1332 1050 165 -661 -840 190 680 937 -257 -898 -673 347 648 536 -308 -1029 -36 429 520 140 -732
1351 -732 -581 172 1008 269 -540 -977 -552 644 919 98 -421 -526 -204 763 894 -2 -841 -491 -101 518
1371 518 244 -589 -843 167 284 619 368 -432 -892 -134 801 559 30 -512 -465 318 670 253 29 -653
$$ packed form
1238c33j113R77J549K58q49j130l58Q07J554n28j046q54J9J472J041r21j108m75
1256a038L83J703L76j282j095J57O76J242o4j402r43P09R04N93l15j365o94J436
1274a9Q54J1q41r14j22J640N53q53p75p53P92J246J59j095n96l71P84J415n74
1293E41q83m69L59N23J055m77j460k05R95P29J34l94j340K14R85J25M94j129r00
1312a103N58J183R9m32o38o82J063O88L7p74p71L4Q73J091r02o88l70J07P93Q84
1332A050q85q26j79J030M90K57j194o41K25J020L01j12q44p21R93M65R1l80q72
1351g32J51P53Q36p39q09m37M25J196K75q21n19j05L22R67J31q96q39L50L90O19
1371E18k74q33k54J010J17L35k51q00m60P58R35k42n29n42M7P83L52m17k24o82
$$ plain form
1391 -653 -476 521 506 -297 -346 -372 -47 1017 465 -361 -546 -288 478 442 202 -770 -869 252 304 479 345
1412 345 -805 -651 424 247 395 -220 -1128 -455 427 900 -30 -379 -618 -336 633 275 -260 -173 -531 51
1432 51 766 170 -401 -606 -322 474 764 1 -768 -177 195 541 767 -407 -429 49 301 465 251 -465
1452 -465 -672 14 474 410 45 -666 -580 102 725 149 -482 -511 -213 510 612 -133 -352 -406 -153 415 634
1473 634 -383 -358 -464 -36 751 518 -649 -352 59 208 478 34 -661 -722 260 389 331 376 -792 -72
1493 -72 525 373 270 -231 -621 -211 460 474 255 -430 -258 347 630 405 -204 -296 -269 218 496 131 -598
1514 -598 -366 -238 288 290 -280 -530 -375 354 276 174 -325 -244 -99 613 295 -160 -314 23 14 112 411 -331
1536 -331 -155 -273 -23 628 202 -662 -344 86 271 414 -58 -365 -248 444 87 530 -208 -482 -180 295
$$ packed form
1391f53J77R97j5q03m9k6L25J064n52q26j85K58P66l6k40r72r9J121N2J75j34
1412C45j150J54J075j77J48o15r08O73Q82M73r30l49k39K82R69l58n35Q7l58N82
1432E1P15n96n71k05K84P96K90p63p69N91L72L46K26j174k2M78K52J64k14p16
1452d65k07O86M60o4l65p11Q6O82O23n76o31k9K98P23J02p45k19n4K53N68K19
1473F34j017K5j06M28P87k33j167K97M11J49K70m44o95o1R82J29n8M5j168P20
1493g2N97j52j03n01l90M10O71J4k19o85J72O05K83k25o09r2K7M87K78l65p29
1514e98K32J28N26Kn70k50J55P29p8j02m99Q1J45P12l18m55j54L37rR8K99p42
1536c31J76j18K50O51m26q64L18M30J85J43m72l07J17O92l57M43p38k74L02M75
$$ plain form
1556 295 -27 45 -156 -173 47 331 -82 -227 -234 -448 533 514 -301 -344 -287 -700 623 399 47 -364 7 49
1578 49 547 494 14 -212 -129 390 657 46 -859 -580 0 70 239 -311 -343 29 509 294 9 3 -303 76
1600 76 354 316 84 -307 -391 346 429 111 -327 -275 -202 -114 383 -88 -176 -232 -201 91 266 315 -5 -69 246 373
1624 373 105 5 -268 81 -89 340 236 -420 -258 -157 277 498 -90 -225 -124 -266 484 269 -390 -272
1644 -272 -149 -25 505 -70 -174 -360 132 172 322 -99 -313 -132 61 25 44 -382 147 -69 403 403 -238 -156
1666 -156 -231 -112 64 39 -52 -188 -153 247 95 276 -226 -132 -351 148 -31 -225 -559 -224 -165 -17 226 -4
1688 -4 -509 188 -123 20 232 -501 -168 -204 415 33 120 -269 116 206 437 58 110 -635 226 400 -65 235
1710 235 -345 -296 41 261 129 -125 -270 -20 89 183 367 -249 -465 -222 165 20 113 -126 -88 300 392 64
$$ packed form
1556B95l22P2k01j7K20K84m13j45pk14R81j9q15m3N7m13J323k24l52m11L71M2
1578D9M98n3m80k26Q3N19K67o11r05K79N80P0J69n50l2L72M80k15k85ol06L79
1600G6K78l8k32l91q4P37Q3l18m38N2P3Q8M97m71q8n6L1K92J75M9l20o4L15J27
1624C73k68j00k73L49j70M29j04o56J62J01M34K21n88j35J01j42P50k15o59J18
1644b72J23J24N30n75j04j86M92M0J50m21k14J81J93l6J9m26N29k16M72%o41Q2
1666a56p5J19J76k5r1j36L5M00j52J81n02R4k19M99j79j94l34L35N9J48K43k30
1688dn05O97l11J43K12p33L33l6O19l82Q7l89L85R0K31l79N2p45Q61J74m65L00
1710B35n80M9L37K20j32k54j45K50J09R4J84o16k16K43L87j45R3k39L8L88R2l28
$$ plain form
1732 64 -23 -114 -118 303 -24 -147 -63 14 375 591 28 -61 -295 -110 -28 52 -86 -532 142 187 101 161 -18 -371
1756 -371 43 101 298 234 -41 -134 76 267 121 183 126 -43 307 -193 -88 -89 -281 -41 146 56 -84 38 -125
1779 -125 87 189 418 568 -225 -137 183 193 160 -488 -261 -301 -82 -18 -56 -181 -190 268 490 -238 -89 25 -4
1802 -4 176 328 4 -176 73 280 190 -76 99 -240 114 175 -223 -112 -23 110 -119 56 108 -4 -389 -127
1824 -127 22 168 -26 -388 86 -56 181 83 217 -252 -119 150 202 61 89 -109 -7 43 318 178 -22
1845 -22 -247 -103 21 27 -178 117 -124 40 368 -71 -25 -278 -250 265 -70 293 -198 -3 -136 53 27 -15
1867 -15 -84 -475 112 36 88 -71 -402 -236 98 21 -19 35 97 -17 161 126 -51 -123 -197 47 71 59 178 -463
1891 -463 -266 169 -127 -59 -88 -39 115 -29 129 -29 -146 0 -132 246 -155 -44 82 -102 227 -17 228
$$ packed form
1732F4q7r1mM21l27j23Q4P7L61K16n63q9k34J85Q2Q0j38m46O74M5q6O0j79l53
1756c71M14N8J97o4k75r3K10J91j46O2n7j69L50n00J05jj92K40J87r0j40J22j63
1779a25K12J02K29J50p93Q8L20J0l3o48K27m0K19O4l8j25rM58K22p28J49J14k9
1802dJ80J52l24j80K49K07r0k66J75l39L54O1l98J11Q9J33k29J75N2j12l85K62
1824a27J49J46j94l62M74j42K37r8J34m69J33K69N2j41K8j98J02N0K75j40k00
1845b2k25J44J24Ok05K95k41J64L28m39M6k53K8N15l35L63m91J95j33J89k6m2
1867a5o9l91N87p6N2j59l31J66L34p7m0N4O2j14J78l5j77p2p4K44K4j2J19o41
1891d63J97M35k96O8k9M9J54j44J58j58j17J46j32L78m01J11J26j84L29k44K45
$$ plain form
1912 228 -183 -461 -396 154 -141 -301 -42 -179 13 144 -184 -146 -80 -266 100 2 -109 -31 43 223 -21 353
1934 353 -315 -453 -3 12 213 178 183 64 -9 311 306 -50 -350 -97 47 -149 228 -109 -202 -103 -77 90 26 104
1958 104 -522 -153 127 179 -219 -108 51 -95 -88 233 -48 87 -38 64 148 -233 -307 -17 -282 8 -48 -37
1980 -37 -71 -103 37 153 -150 -124 -162 -270 200 193 -179 -4 -33 190 32 232 -241 -186 70 113 3 -251 -391
2003 -391 -239 -70 137 -159 -262 -256 -303 145 63 65 -132 45 -202 -2 195 -61 144 -100 204 198 75 11 181
2026 181 -244 -124 -9 -186 -81 -454 110 -144 79 25 -262 -25 -118 -128 48 -90 72 -359 168 -12 58
2047 58 -9 163 -199 81 -81 -106 -377 -99 -127 87 169 -145 -58 -34 72 -141 -6 -217 -86 -47 -125 143 -15
2070 -15 -47 100 -113 -267 -141 154 171 -124 37 -65 271 -85 -136 -48 270 -29 -278 -125 -45 -89 -70 -93 76
$$ packed form
1912B28m11k78O5N50k95j60K59j37J92J31l28L8O6j86L66r8j11P8P4J80k44L74
1934C53o68j38M50J5K01l5Nj19p3L20nl56l00K53J44j96L77l37r3R9K6J67o4P8
1958A04o26L69K80N2l98J11J59j46PL21k81J35j25J02Q4l81p4K90k65K90n6J1
1980c7l4l2J40J16l03K6l8j08M70pl72J75k9K23j58K00m73N5K56M3j10k54j40
2003c91J52J69K07k96j03Om7M48q2Kj97J77k47K00J97k56K05k44L04oj23o4J70
2026A81m25J20J15j77J05l73N64k54K23n4k87K37r3j0J76j38J62m31N27j80P0
2047E8o7J72l62K80j62k5k71K78k8K14Q2l14Q7K4J06k13J35k11J31L9p8K68j58
2070a5l2J47k13j54J26K95J7k95J61j02L36l56n1Q8L18k99k49J53Q0m4J9k3J69
$$ plain form
2093 76 -44 -158 81 -145 39 -407 221 -104 -6 -22 -214 -107 157 185 -157 -108 -256 119 36 181 -248 -198
2115 -198 -268 -27 146 22 116 -55 227 302 50 96 174 96 156 237 -21 108 165 51 116 317 139 232 7 -116
2139 -116 -125 -33 -104 58 132 -23 -174 25 -95 -36 -18 -522 -93 119 -200 91 -129 241 -108 252 91 -196
2161 -196 195 -28 270 165 -86 -73 -273 -252 228 -17 262 -85 -253 175 17 -11 -37 210 -59 157 -4
2182 -4 -25 182 203 -119 -16 131 -36 -421 -19 -9 -51 25 63 -122 -22 -66 206 53 404 -113 113 110 -54 -213
2206 -213 327 304 -25 -11 -103 -244 -77 185 159 230 -236 38 -32 -46 128 78 -264 109 106 -312 111 61 -7 -120
2230 -120 -91 196 -32 -294 20 -16 -111 25 -127 -91 -213 30 252 194 -41 -10 134 -179 194 -257 -90 -162
2252 -162 -103 -118 23 -121 18 -118 105 186 117 -196 -203 -264 -102 -390 -126 46 -47 -146 -31 -115 -28 -52 -14 -101 -62
$$ packed form
2093G6j20j14K39k26J84m46O28l25R8j6j92J07K64K8l42M9j48L75q3J45m29N0
2115a98p0K41J73j24R4j71K82P5k52M6P8p8O0Q1k58J29N7j14O5K01j78R3k25j23
2139a16rR2p1J62P4j55j51J99j20N9J8n04M29K12l19K91k20L70l49L60j61k87
2161a96L91k23K98j05k51J3k00K1M80k45K79l47j68M28j58k8k6K47k69K16j61
2182dk1K07K1l22J03J47j67l85M02J0m2P6L8j85J00m4K72j53L51n17K26lj64j59
2206b13N40k3l29J4r2j41J67K62k6P1m66K74p0j4J74n0l42L73lm18M23n0o8j13
2230a20K9K87k28k62L14l6r5J36j52L6j22K43K22n8k35L1J44l13L73m51J67p2
2252a62N9j5J41j44J39j36K23Q1o9l13po1J62k88K64J72r3r9J15q4Q7k4L8q7L9
$$ plain form
2277 -62 53 -58 39 243 339 -62 -81 265 -75 -68 61 -158 -38 -143 -161 87 -75 -253 -64 -69 -110 127 102 -164
2301 -164 -74 -78 22 133 82 -25 -244 133 76 97 -51 125 318 -56 202 -46 -283 -3 -214 -308 -44 79
2323 79 -32 117 98 -67 27 132 -102 165 38 -4 273 -84 123 -18 138 46 282 285 -292 16 -147 71
2345 71 152 -86 243 240 46 -47 -60 11 19 288 16 279 23 -197 318 250 52 301 127 -336 -51 449 -76
2368 -76 -165 95 54 -86 -112 -48 151 -267 117 -52 -32 -84 -288 -35 -86 166 350 255 -28 91 -359 73 -172
2391 -172 94 119 50 -126 128 -274 73 69 -37 64 -191 39 -32 101 -20 -195 -35 -116 -12 33 438 291
2413 291 -573 -144 104 92 -142 -317 -222 -41 -127 261 -49 109 -364 -215 -79 145 34 -102 31 -37 34 45
2435 45 260 -36 -101 -71 -18 287 81 382 54 256 -85 225 -18 -194 141 -83 380 260 179 353 134 152
$$ packed form
2277f2J15j11R7K04R6m01j9L46l40PJ29k19J20j05j8K48j62j78J89nm1K37k5k66
2301a64R0mJ00J11n1j07k19L77n7K1j48J76J93l74K58k48k37K80k11r4K64J23
2323G9j11J49j9j65R4J05k34K67j27m2K77l57K07j41J56r2K36Ln77L08j63K18
2345G1Q1k38L29lj94r3j3P1QK69k72K63k56k20N15o8j98K49j74m63K85N00n25
2368g6q9K60m1j40k6O4J99m18L84j69K0n2k04K53n1K52J84r5k83J19m50M32k45
2391a72K66K5o9j76K54m02L47mj06J01k55K30p1J33j21j75J60q1J04M5M05j47
2413B91q64M29K48j2k34j75R5J81q6L88l10J58m73J49J36K24j11j36J33o8P1J1
2435D5K15k96o5L0N3L05k06L01l28K02l41L10k43j76L35k24M63j20q1J74k19J8
$$ plain form
2457 152 273 5 -31 76 133 -89 -76 -61 -26 -14 -60 347 -40 -3 67 -1 -4 -376 -55 -40 -99 -132 171 -150 113
2482 113 -368 244 -22 168 120 -388 -44 -65 169 -132 -60 -49 53 317 -147 -29 284 25 168 -120 79
2503 79 35 72 132 155 -397 284 105 55 52 -236 -67 -214 -68 -295 36 56 171 -40 -7 -220 -22 298 -74
2526 -74 195 -339 139 -26 93 294 147 51 -246 -68 -165 112 -449 -185 -152 92 239 154 -25 -173 16 15
2548 15 187 9 -46 -5 -112 -58 29 234 203 71 134 76 -62 -21 -49 -170 147 -37 -122 221 -212 -137 -27 385
2572 385 40 -97 -1 176 181 38 203 70 86 -209 146 -43 -246 39 -183 -44 36 65 190 -78 -252 183
2594 183 91 154 -148 24 -177 -51 -487 35 -72 15 -168 340 -243 -325 196 -64 186 116 115 108 189 -124 -3
2617 -3 -91 -245 -254 -124 204 49 -203 12 310 165 -266 87 120 268 21 94 -62 -104 186 7 -89 45 242
$$ packed form
2457A52J21k68l6J07N7k22J3J5L5J2m6M07l87L7P0o8ll72L21J5n9l3L03l21K63
2482A13m81O12k66J90m8n08L44k1K34l01P2J1J02K64m64J18L13k59J43k88J99
2503G9m4L7O0K3n52O81j79n0lk88J69j47J46k27L31K0J15k11L3k13J98L20l72
2526g4K69n34M78j65J19K01j47r6k97J78r7K77n61K64L3K44J47q5j79j48J89j
2548A5J72j78n5M1j07N4Q7K05l1j32O3n8j38M1k8j21L17j84q5L43m33P5J10M12
2572C85l45j37R6J77Nj43J65j33J6k95L55j89k03K85k22J39Q0K9J25k68j74M35
2594A83r2O3l02J72k01J26m36N22j07Q7j83N08n83q2N21k60K50p0jpQ1l13J21
2617cq8j54rJ30L28j55k52K15K98j45m31L53L3J48k47P3j56m2K90j79r6J34J97
$$ plain form
2640 242 -161 -191 107 -287 14 -96 -136 -12 400 -76 -72 176 196 87 91 -6 -68 -141 42 -196 -102 -156 -14 -71
2664 -71 292 -147 -108 32 -214 1 -26 12 29 15 201 31 104 -111 -253 148 -239 115 60 118 170 197 139 -154
2688 -154 266 -158 -64 32 173 -62 -2 -48 196 328 28 201 -37 63 -185 228 193 -284 149 98 28 154
2710 154 34 -330 -171 -139 19 28 -203 -58 3 -19 -127 31 200 39 87 -124 -242 -98 -192 -206 164 40 -399
2733 -399 -172 -194 87 -16 -85 -62 -115 215 -91 -72 192 -77 -90 21 -22 -127 93 -275 168 -247 -68 376
2755 376 3 -96 -244 -165 -14 -200 109 -133 21 228 77 -165 -296 21 83 -238 99 70 -88 -143 -35 115
2777 115 -225 -145 -104 -72 140 -199 265 -125 -126 -421 301 -153 40 1 237 127 -194 340 -177 -89 -23 5 19
2800 19 -80 64 207 -76 153 -266 -161 40 -247 -137 -118 123 155 -181 110 -33 -126 -22 236 47 29 65
$$ packed form
2640B42m03l0K98l94L01j10m0J24M12m76MK48K0j09Mr7o2p3J83k38R4n4J42n7
2664g1L63m39L9J40k46K15k7L8J7j4J86j70P3k15j42M01l87L54n5N8N2K7n8k93
2688a54M20m24R4R6J41k35O0m6K44J32l00J73k38J00k48M13l5m77M33n1p0J26
2710A54j20l64J59L2J58Rk31J45O1k2j08J58J69j61M8k11j18J44r4j4L70j24m39
2733c99K27k2K81j03o9K3n3L30l06J9K64k69j3J11m3j05K20l68M43m15J79M44
2755C76l73r9j48P9J51j86L09k42J54K07j51k42j31L17O2l21L37k9j58n5J08J50
2777A15l40Q0M1L2K12l39M64l90jk95P22m54J93l9K36j10l21N34n17Q8O6K8J4
2800A9r9J44J43k83K29m19J05K01k87J10J9K41L2l36K91j43r3J04K58j89j8L6
$$ plain form
2822 65 82 141 -184 356 -187 146 -44 -107 0 49 -222 -103 121 -91 314 -43 -177 -504 -62 203 35 -165
2844 -165 -29 -118 -159 -60 16 -133 -17 -50 22 75 -314 51 -269 -7 -69 252 186 262 262 -70 142 -52 -122 -3
2868 -3 -232 -99 110 -105 -48 178 16 -90 -152 -9 -110 -100 -231 -68 -59 -87 489 105 297 -35 -162 19 -211
2891 -211 271 -279 152 258 11 200 -341 78 86 -318 -104 -355 -216 -29 325 -263 138 -467 212 80 3
2912 3 110 203 -213 -47 85 394 289 -59 37 -283 151 -87 -389 180 -60 -153 124 -131 131 339 -50 -58
2934 -58 -100 51 -94 -162 -284 16 -224 96 155 154 -363 -137 -84 -217 -121 -123 -39 247 236 49 -128 -89 10 -176 183
2959 183 43 -41 255 -168 -257 -186 369 -336 -1 -246 -505 113 -173 72 98 -17 -59 -22 17 -60 -136 -101 -310
2982 -310 106 -35 133 127 -114 84 201 62 166 -12 318 327 20 180 72 4 139 -166 -11 172 71 -11
$$ packed form
2822F5J7N9l25N40n43L33j90o3J07M9k71J19K24k12M05l57j34l27M42K65j68k00
2844a65J36q9m1R9P6j49J16l3P2N3l89L65l20K62o2L21o6P6%l32K12j94p0J19
2868ck29J33K09k15N7K26j62j06o2J43j01J0j31J63Rk8N76l84J92l32j27J81k30
2891b11M82n50M31J06k47J89n41M19Qm04K14k51J39J87L54n88M01o05O79j32p7
2912CJ07R3m16J66J32L09j05l48R6l20M34k38l02N69k40r3K77k55K62K08l89q
2934e8m2J51j45o8j22L00k40L20N9jn17K26N3j33R6kQ4K86j1j87j77L9R9j86L59
2959A83j40q4K96m23q9P1N55p05L35k45k59O18k86K45K6j15m2L7L9p7p6L5k09
2982c10M16j41J68ok41J98J17j39J04j78L30Rl07J60j08o8J35l05J55J83j01q2
$$ plain form
3004 -11 7 122 13 -366 184 -147 -29 -251 226 -239 -61 129 87 352 -85 -8 -217 80 11 -195 321 63
3026 63 -135 -70 -80 17 281 86 -93 -122 -80 -130 -49 44 -68 59 -199 137 -67 -67 -205 -159 97 118 -19 -63 -21
3051 -21 163 154 3 203 -45 384 31 -212 119 -212 1 79 -5 37 -231 -176 48 -146 37 200 -106 41
3073 41 53 -121 187 33 -40 110 85 -64 25 86 -181 -265 -490 165 -49 -183 278 -359 187 122 -11 -353 42
3096 42 26 -9 75 -83 -169 11 -78 128 -24 -263 208 -56 -266 359 -81 -207 436 -73 116 -44 -45 -96 41
$$ packed form
3004a1J8J15j09l79N50l31J18k22M77m65J78J90m2K65m37P7k09K97o9k06N16k58
3026F3j98O5j0R7K64j95j79k9M2n0Q1R3j12J27k58L36k04%j38M6K56K1j37m4M2
3051b1J84rj51K00k48M29l53k43L31l31K13P8q4M2k68N5K24j94J83J63l06J47
3073D1J2j74L08j54p3J50k5j49Q9O1k67q4k25O55k14j34M61o37N46o5j33l42L95
3096D2j6l5Q4j58q6J80q9K06j52k39M71k64k10O25m40j26O43n09J89j60jn1J37
$$ [...]
8191D03
##END NTUPLES=NMR FID
##END=
