##TITLE=1H_DE-43EA_D2O
 D2O
 8 sc, 
 12.7.2024
##JCAMPDX= 6.0         $$ Bruker NMR JCAMP-DX V2.0
##DATA TYPE= NMR FID
##DATA CLASS= NTUPLES
##ORIGIN= UXNMR, Bruker Analytische Messtechnik GmbH
##OWNER= root
$$ XWIN-NMR		Version 3.5
$$ Fri Jul 12 13:56:46 2024 Russian Standard Time (UT+4h)  she@DPX200
##.OBSERVE FREQUENCY= 200.1314
##.OBSERVE NUCLEUS= ^1H
##.DELAY= (6, 6)
##.ACQUISITION MODE= SIMULTANEOUS
##.ACQUISITION SCHEME= undefined
##.AVERAGES= 8
##.DIGITISER RES= 18
##SPECTROMETER/DATA SYSTEM= spect
##.PULSE SEQUENCE= zg30
##.SOLVENT NAME= CDCl3
##.SHIFT REFERENCE= (INTERNAL, CDCl3, 0, 15.7039)
##AUDIT TRAIL= $$ (NUMBER, WHEN, WHO, WHERE, WHAT)
$$ ##TITLE= Audit trail, XWIN-NMR		Version 3.5
$$ ##JCAMPDX= 5.01
$$ ##ORIGIN= Bruker BioSpin GmbH
$$ ##OWNER= she
$$ F:/spectra/data/she/nmr/H-F/1/audita.txt
$$ ##AUDIT TRAIL=  $$ (NUMBER, WHEN, WHO, WHERE, WHAT)
(   1,<2024-07-12 13:55:34.85 +0400>,<she>,<DPX200>,
      <created by zg, POWCHK disabled, PULCHK disabled
       configuration hash MD5:
       00 E9 B6 7A A2 85 ED C7 34 08 36 98 17 FE 4E 26
       data hash MD5: 16K
       15 0C B2 C6 42 C3 E6 FC 92 BB 4A D3 38 71 1D 9E>)
$$ ##END=
$$ 
$$ hash MD5
$$ EA 75 EA 7A 85 7A E4 39 D3 25 0D 58 4D C7 BF CA
##$RELAX= 
##$RELAX= 
##$RELAX= 
##$RELAX= 
##$RELAX= 
##$RELAX= 
$$ Bruker specific parameters
$$ --------------------------
##$DU= <F:/spectra>
##$EXPNO= 1
##$NAME= <H-F>
##$PROCNO= 1
##$TYPE= <nmr>
##$USER= <she>
##$AMP= (0..31)
100 100 100 100 100 100 100 100 100 100 100 100 100 100 100 100 100 100 
100 100 100 100 100 100 100 100 100 100 100 100 100 100 
##$AQSEQ= 0
##$AQ_mod= 1
##$AUNM= <au_zg>
##$AUTOPOS= <>
##$BF1= 200.13
##$BF2= 200.13
##$BF3= 200.13
##$BF4= 200.13
##$BF5= 200.13
##$BF6= 200.13
##$BF7= 200.13
##$BF8= 200.13
##$BYTORDA= 1
##$CFDGTYP= 0
##$CFRGTYP= 5
##$CHEMSTR= <none>
##$CNST= (0..31)
1 1 145 1 1 1 1 1 1 1 1 1 1 1 1 1 1 1 1 1 1 1 1 1 1 1 1 1 1 1 1 1 
##$CPDPRG= <>
##$CPDPRG1= <>
##$CPDPRG2= <>
##$CPDPRG3= <>
##$CPDPRG4= <mlev>
##$CPDPRG5= <mlev>
##$CPDPRG6= <mlev>
##$CPDPRG7= <mlev>
##$CPDPRG8= <mlev>
##$CPDPRGB= <>
##$CPDPRGT= <>
##$D= (0..31)
0 1.2 0 0 0 0 0 0 0 0.06 0 0.03 0 0 0 0 0.0002 0 0 0 0 0 0 0 0 0 0 0 0 
0 0 0 
##$DATE= 1720778134
##$DBL= (0..7)
120 120 120 120 120 120 120 120 
##$DBP= (0..7)
150 150 150 150 150 150 150 150 
##$DBP07= 0
##$DBPNAM0= <>
##$DBPNAM1= <>
##$DBPNAM2= <>
##$DBPNAM3= <>
##$DBPNAM4= <>
##$DBPNAM5= <>
##$DBPNAM6= <>
##$DBPNAM7= <>
##$DBPOAL= (0..7)
0.5 0.5 0.5 0.5 0.5 0.5 0.5 0.5 
##$DBPOFFS= (0..7)
0 0 0 0 0 0 0 0 
##$DE= 6
##$DECBNUC= <off>
##$DECIM= 24
##$DECNUC= <off>
##$DECSTAT= 4
##$DIGMOD= 1
##$DIGTYP= 9
##$DL= (0..7)
0 120 120 120 120 120 120 120 
##$DP= (0..7)
150 150 150 150 150 150 150 150 
##$DP07= 0
##$DPNAME0= <>
##$DPNAME1= <>
##$DPNAME2= <>
##$DPNAME3= <>
##$DPNAME4= <>
##$DPNAME5= <>
##$DPNAME6= <>
##$DPNAME7= <>
##$DPOAL= (0..7)
0.5 0.5 0.5 0.5 0.5 0.5 0.5 0.5 
##$DPOFFS= (0..7)
0 0 0 0 0 0 0 0 
##$DQDMODE= 0
##$DR= 18
##$DS= 0
##$DSLIST= <SSSSSSSSSSSSSSS>
$$ [...]
##$SUBNAM2= <"">
##$SUBNAM3= <"">
##$SUBNAM4= <"">
##$SUBNAM5= <"">
##$SUBNAM6= <"">
##$SUBNAM7= <"">
##$SUBNAM8= <"">
##$SUBNAM9= <"">
##$SW= 24.0689651099613
##$SWIBOX= (0..15)
0 0 2 0 0 0 0 0 0 0 0 0 0 0 0 0 
##$SW_h= 4816.95568400771
##$TD= 16384
##$TD0= 1
##$TE= 0
##$TE2= 300
##$TE3= 300
##$TEG= 300
##$TL= (0..7)
0 120 120 120 120 120 120 120 
##$TP= (0..7)
150 150 150 150 150 150 150 150 
##$TP07= 0
##$TPNAME0= <>
##$TPNAME1= <>
##$TPNAME2= <>
##$TPNAME3= <>
##$TPNAME4= <>
##$TPNAME5= <>
##$TPNAME6= <>
##$TPNAME7= <>
##$TPOAL= (0..7)
0.5 0.5 0.5 0.5 0.5 0.5 0.5 0.5 
##$TPOFFS= (0..7)
0 0 0 0 0 0 0 0 
##$TUNHIN= 0
##$TUNHOUT= 0
##$TUNXOUT= 0
##$USERA1= <user>
##$USERA2= <user>
##$USERA3= <user>
##$USERA4= <user>
##$USERA5= <user>
##$V9= 5
##$VALIST= <valist>
##$VCLIST= <CCCCCCCCCCCCCCC>
##$VD= 0
##$VDLIST= <DDDDDDDDDDDDDDD>
##$VPLIST= <PPPPPPPPPPPPPPP>
##$VTLIST= <TTTTTTTTTTTTTTT>
##$WBST= 1024
##$WBSW= 4
##$XGAIN= (0..3)
0 0 0 0 
##$XL= 0
##$YL= 0
##$YMAX_a= 85631
##$YMIN_a= -75532
##$ZGOPTNS= <>
##$ZL1= 120
##$ZL2= 120
##$ZL3= 120
##$ZL4= 120
##$ABSF1= 10
##$ABSF2= 0
##$ABSG= 5
##$ABSL= 3
##$ALPHA= 0
##$AQORDER= 0
##$ASSFAC= 0
##$ASSFACI= 0
##$ASSFACX= 0
##$ASSWID= 0
##$AUNMP= <proc_1d>
##$AZFE= 0.1
##$AZFW= 0.1
##$BCFW= 1
##$BC_mod= 2
##$BYTORDP= 1
##$COROFFS= 0
##$CY= 11.3945322036743
##$DATMOD= 1
##$DC= 2
##$DFILT= <>
##$DTYPP= 0
##$F1P= 15.6554695791079
##$F2P= 12.8336369535428
##$FCOR= 0.5
##$FTSIZE= 0
##$FT_mod= 4
##$GAMMA= 1
##$GB= 0.15
##$INTBC= 1
##$INTSCL= 1
##$ISEN= 128
##$LB= 0.24
##$LEV0= 0
##$LPBIN= 0
##$MAXI= 10000
##$MC2= 0
##$MEAN= 0
##$ME_mod= 0
##$MI= 1.114404
##$NCOEF= 0
##$NC_proc= 0
##$NLEV= 6
##$NOISF1= 3.799351
##$NOISF2= 2.8
##$NSP= 1
##$NTH_PI= 0
##$NZP= 0
##$OFFSET= 15.70392
##$PC= 1
##$PHC0= -25655.3
##$PHC1= 16.18747
##$PH_mod= 1
##$PKNL= yes
##$PPARMOD= 0
##$PSCAL= 0
##$PSIGN= 0
##$REVERSE= no
##$SF= 200.130013532006
##$SI= 16384
##$SIGF1= 3
##$SIGF2= 2
##$SINO= 400
##$SIOLD= 16384
##$SREGLST= <1H.CDCl3>
##$SSB= 0
##$STSI= 0
##$STSR= 0
##$SW_p= 3612.71676300578
##$SYMM= 0
##$S_DEV= 0
##$TDeff= 0
##$TDoff= 0
##$TI= <>
##$TILT= no
##$TM1= 0
##$TM2= 0
##$TOPLEV= 0
##$USERP1= <user>
##$USERP2= <user>
##$USERP3= <user>
##$USERP4= <user>
##$USERP5= <user>
##$WDW= 1
##$XDIM= 8192
##$YMAX_p= 0
##$YMIN_p= 0
$$ End of Bruker specific parameters
$$ ---------------------------------
##NTUPLES= NMR FID
##VAR_NAME=  TIME,          FID/REAL,        FID/IMAG
##SYMBOL=    X,             R,               I
##VAR_TYPE=  INDEPENDENT,   DEPENDENT,       DEPENDENT
##VAR_FORM=  AFFN,          ASDF,            ASDF
##VAR_DIM=   8192,          8192,            8192
##UNITS=     SECONDS,       ARBITRARY UNITS, ARBITRARY UNITS
##FACTOR=    0.0002076,     1,               1
##FIRST=     0,             0,               0
##LAST=      1.7004516,     0,               0
##MIN=       0,             -75532,          0
##MAX=       1.7004516,     85631,           0
$$ Real data points
##PAGE= N=1
##DATA TABLE= (X++(R..R)), XYDATA
0@%%%%%%%%%%%%%%%%%%%Lj0J5j6J6j6J6j9K5k9L2l6M1m8N4o1O8p6Q5r3J04j17
41f2J29j42J58j74J91k12K35k61K88l17L51l89M33m82N33n81O01m99k09R311P6729
62H5631m0193p1189J1544j377K3559N4654l5786q9139L973O1833L0336j5187l8097
75a9438j8898K9640M9161J5514m8867n3026K4376N1146p559k7787k1794k2134
87d9666L8805O7856k7613o5393J1838L8285J6793R197l8311n6282K1420N7053
99B3982N813k9385l6389r579N5657M8315k8980m7375j1585J9806M0506Q723m9637
112a0128l9281J5836M2096K9296k2691m7426N521M2834J9648o441l3267l6778
124d0781K5789M5764j4425l3963j0444J139L5628L6586l3074m4586J9048L2615
$$ y = [0, 0, 0, 0, 0, 0, 0, 0, 0, 0, 0, 0, 0, 0, 0, 0, 0, 0, 0, 0, 3, -7, 8, -8, 8, -8, 8, -11, 14, -15, 17, -19, 22, -26, 28, -33, 35, -41, 44, -49, 55, -62, 67, -75, 83, -91, 100, -112, 123, -138, 150, -167, 184, -205, 228, -254, 279, -302, 299, -200, -409, 8902, 85631, 45438, -25751, -14207, -15584, 7975, 62629, 26843, -62296, -58323, 3510, 33846, 18659, -19438, -38336, -8696, 40465, 55979, 7112, -45914, -21538, 29608, 22049, -5738, -27532, -49666, -10861, 56995, 29382, -36011, -24173, 14112, 30905, 40102, 1791, -54491, -33071, 23982, 29795, 410, -35979, -45558, 10099, 58414, 29434, -17941, -29526, -9720, 30786, 39509, -10128, -49409, -33573, 8523, 37819, 15128, -32298, -26777, 16057, 35705, 29264, -4003, -40781, -14992, 30772, 16347, -17616, -28060, -26921, 8707, 45293, 12219, -32367, -13319, 19296]
136A9296Q599p822l5858k7509K8660M1829m139l5768k4321J9802M4533J2037k6661
149A2678l1122j0398K9317L8135k0101m8803n452K3856K5052J8960k5127m1779
161c4784J8810M5569Q25k2010k0917j7325K1041L5868j3680l7148m928K3290K6797
174B1408N661k5594k1288J0007K5914J2889k4572l6156M410L2219J3322o759k2252
187a0791j9827K5484M2779r851l5784j1231M132K1160K3632k2870m1822N722L5057
200E790J6597m548k2291j9682J7896L3104l36k8787k3062N745K6395J1689j5219
213C291k1587m024K3983K7231j0722k9986l647J5994J2824N178k1337k8718J3281
226a8239L4013J474j8219j2569l537K2198K7167j4345l4000o135J8537J9256J317
$$ y = [19296, 27895, 20073, -15785, -43294, -14634, 27195, 23056, -12712, -37033, -17231, 27302, 39339, 12678, -18444, -28842, 475, 38610, 18509, -30294, -35746, -11890, 13162, 32122, 6995, -34784, -15974, 29595, 30420, 8410, -12507, -29832, -8791, 27077, 13397, -23751, -28679, -5389, 21408, 27069, 1475, -19813, -9806, 16108, 28997, 4425, -31731, -27321, 4898, 18220, 11461, -10791, -30618, -5134, 37645, 27794, -7990, -19221, -15089, 6071, 29703, 6833, -34989, -29267, 5790, 22387, 17839, -4452, -24134, -6238, 26866, 26530, -2257, -25319, -19574, 6821, 18510, 3291, -18296, -22320, 1663, 28894, 18172, -11814, -15461, 533, 13357, 18535, -2802, -31520, -18239, 15774, 17248, -971, -13540, -17077, 5121, 32288, 17943, -16057, -22192, -3655, 15601, 16918]
239A6918k3556k2138J0678L0499J3996j7402k5354N99K3093J4863o934k3877j9021
252b7636J5178K9294k529k1960q934N081J9391J8531j4622k8459K905K1767O650
265A4657q231j7570j2916J5337K6227j608k2197j0506J1199K1388O908j6799k3250
278a7361j845K1385J7475j3070k4667k990J7367J9914N811j9788k2812J0507K6466
291A6392K625j7060j7341o398J7339K3069o993k4582l468J6116J6537K604j6927
304A913j8068N358J9858N655j6064j6799K365J8689J3147n571j7742p613J6302
317A430J9078o134k1286j1122O928J8264R627j6542k0792N872K2494J2270p344
330A2743j9122j1304J4293K1171l152k2043j2842P043J9154J0798j1560j8614
$$ y = [16918, -6638, -28776, -18098, 12401, 26397, 8995, -16359, -15760, 7333, 22196, 15262, -8615, -27636, -12458, 16836, 14307, -7653, -16587, -11506, 7885, 26416, 11794, -16665, -13760, 8007, 14657, 6426, -11144, -24060, -8723, 17504, 15896, -6301, -16807, -5608, 15780, 22688, 5889, -17361, -19206, 2179, 19654, 6584, -18083, -21073, -3706, 16208, 22019, 2231, -20581, -10074, 16392, 19017, 1957, -15384, -21782, -4443, 18626, 11633, -12949, -16417, -301, 16236, 18840, 1913, -16155, -10797, 9061, 14716, -1348, -18147, -15782, 2907, 16054, 10483, -7259, -14872, 1430, 20508, 14374, -6912, -18034, -11106, 7158, 16785, 243, -20549, -14677, 7817, 20087, 12743, -6379, -17683, -3390, 17781, 14629, -7414, -20256, -13213, 5941, 16739, 5179, -13435]
342a3435j6J9351J3750q764j8494o958R353J4799K098j7128j4325J1194J9539
355A0964L378j1067j1884j755J5513J3957j1169k2075k303J4244J3202r66j5174
368e135j2457R529K2435N531j6892j6139J909J5222J1323p014k0342q739J5710
381e059J9421j834j5117r894N219J6831Q989j3424j8923P23J4744Q987n206j3975
395h518p083J2695J6797j512j4696q351O931J2693M352j2611j5940J067J8342
408D166Q961r255j3179k771J1744J6039l22j9405j1832J0326J5279J493j0633
421F11j5052j205J8261J4556r153j6810k288J0993J2133J224j4189j4530M893
434a0556J7739M335j2502j0294K446J1151J0883k716j6832n375J3173J0354n657
$$ y = [-13435, -13451, 5900, 19650, 10886, -7608, -14566, -5213, 9586, 11684, -5444, -19769, -8575, 10964, 14342, 3275, -8609, -10364, 5149, 19106, 7937, -14138, -16441, -2197, 11005, 10039, -5135, -17592, -8063, 14372, 19903, 3011, -13128, -11219, 4003, 15326, 8312, -12030, -20769, -5059, 14362, 12528, -2589, -12483, -7264, 9567, 18556, 5132, -13791, -13068, 1676, 10663, 5457, -8518, -15601, -2906, 13891, 12379, -2317, -10668, -3737, 8956, 13308, 697, -15243, -14176, 4166, 13127, 3872, -9307, -12078, -334, 15705, 15383, -4022, -15854, -5528, 9751, 11244, 611, -14441, -15646, 2615, 17171, 8018, -8792, -11080, -87, 12046, 13270, -919, -15449, -10556, 7183, 11518, -984, -11278, -8832, 2319, 13202, 10486, -6346, -11721, 1452, 11806, 6149]
447F149j1274p696M142J5436N771j2915j2331O297J3921O765p180j4720n928J1621
461a942J3869l180j6432p617Q942J4371N539r196j4599M40J5829Q356q682j3424
475g726n336P760J4066J172j4284q466Q883J2357L101p107j2051j625J2990P727
489A1461q885j1983j859R466J0558m15j1599p202P785J3899J049j2703j0128K068
503h488J0495Q488n695j5747k563J5123J0380k984r985q822L205J5664M269j4228
517h88j1378L158R793Q118k200j2864m951J1210J1791k525j1405o586M275R435
531D983K986p932j1277K127J3516N794p583p647j112O151J0704j099j5481o189
545a2059R520Q499L40o373j0526J116J5514P536r022j0836j607P693R268j180
$$ y = [6149, -5125, -12821, -8679, 6757, 12528, -387, -12718, -6421, 7500, 14265, 7085, -7635, -13563, -1942, 11927, 8747, -7685, -15302, -6360, 8011, 13550, 4354, -10245, -9805, 6024, 14380, 5698, -7726, -13062, -5302, 8764, 9936, -4348, -12814, -3931, 8426, 11527, 4420, -7631, -9256, 3734, 11461, 2576, -9407, -11266, -1800, 8758, 8343, -3256, -10458, -2673, 11226, 12275, -428, -10556, -8488, 2007, 10495, 4800, -10947, -13510, 1613, 11993, 9009, -976, -9798, -6593, 9071, 13340, -888, -12266, -9108, 685, 8803, 6603, -6261, -11212, -2, 11789, 9264, -2141, -8727, -4452, 4983, 7969, 37, -11240, -9113, 4403, 10197, 2614, -5033, -6145, 6, 10710, 9611, -5870, -12059, -2539, 5960, 6300, -73, -10599, -9483, 6031, 13567, 4545, -6291, -7898, -205, 9063, 7883]
559G883j2171q551O083J3211L420r561q076J852Q528Q262l033j3913m538J0594
573a0P196l804n940o080K203J3219L939j1172o987M836O745M088m060j2018k815
588a0660J0686Q231l678r664l930O608J0516K071q702j0120J492J2007M835q298
602A394q699j743N922J1666J018j3264n596Q484P257J398m512j1052j910J2120
616B483O077p488p295o50N777Q635n9r229n346N193Q339N17q694o776K732P581
632A797M983l757j0048j171J1487O725n243o927n131K400J1170K875j2200p061
646a0101M825P558N405j969j0545l875R935P738l152q691n163L542Q297K382o318
661a32o894R94R814M985o107o524o93L940O328J74j0838m405Q481N688n59l373
$$ y = [7883, -4288, -12839, -6756, 6455, 9875, 314, -7762, -5910, 2618, 10880, 7847, -6066, -10604, -10, 7186, 3382, -2558, -8638, -6435, 6784, 10723, -449, -7436, -2600, 4145, 8233, 4173, -7845, -10660, 26, 8257, 4579, -5085, -9015, -2407, 8109, 10180, 1478, -8642, -7150, 4857, 9692, 1394, -7305, -9048, -3126, 8540, 9558, -3706, -9302, -818, 6439, 7837, 3325, -7727, -9637, 2483, 8560, 1072, -6223, -6873, -1096, 7539, 7480, -1749, -7095, -1902, 6437, 6954, -1740, -8516, -5784, 1797, 6780, 3023, -7025, -8196, 3291, 10016, 4773, -2154, -7285, -4885, 6285, 9160, -3040, -10101, -5276, 2282, 7687, 5718, -4827, -8702, 1233, 8971, 5819, -2872, -8035, -4493, 3804, 6186, -132, -7026, -6032, 3782, 8767, 2660, -3864, -4557, -617, 5711, 5885, -4953, -9358, -877, 4811, 4252, 879]
677H79o804M66J1298M235q834p129P55M499O854j017j0102m956P360R024J052
692G580p253o570K243P157N055m107j0293k563Q739N836l333m323l643J135J0312
707E972L092r648n706M578L490J968r12q360k620Q806O116m414n306j347L215
722a076P188J188p954o634K475Q679K426o791n517L35N424P653k29j0210m468
737g511P574N383q56m015p124j095J0031M898o590n503P73L695O282P11q515m576
753f438N293N133o72m463m726J348O916L325l582o507K20P210L351m213n000k648
769e453J967P714J474q701m385N767N180K138j634q128k334Q371M712m330o076
784c718k282K150P357K413o005n355K356O767K807m234n919q59L478M553L71p488
$$ y = [879, -5925, -5459, 5839, 10074, 1240, -5889, -5134, -635, 6219, 5202, -4900, -9856, -2496, 6528, 7580, 327, -6243, -4000, 3157, 8212, 4105, -6188, -8751, -12, 5824, 2491, -1832, -5475, -4340, 5972, 9064, -584, -6290, -1712, 1778, 3746, 2834, -5526, -8146, 660, 6776, 2362, -2944, -4291, -1076, 6112, 7300, -654, -7288, -4813, 3866, 6292, -499, -6016, -5681, -257, 7396, 7167, -3043, -7511, 63, 5446, 4590, 575, -6549, -7644, 2387, 7285, 695, -4808, -4035, -340, 5942, 6653, -1862, -6438, -1145, 3988, 3316, -1147, -5873, -4525, 2391, 5716, 2134, -4373, -4153, 3057, 6408, 2195, -2805, -5453, -3486, 4228, 5702, -2999, -7384, -1617, 3563, 5701, 4067, -4061, -6395, 1976, 6688, 2358, -3718, -6000, -3850, 3507, 5920, -85, -5440, -3084, 3683, 6490, 2256, -3663, -4522, -1044, 3509, 3880, -3608]
800c608l027O378M412q52k589l736m73O924K754o510n015J731L436L888j80p026
816c493k854O604N668j094n281m181J443N633L033m623o188o78O577M877k480
831B963m812k171K240O220K018p098m855K954L354K280j472m895k479O772M362
846E381l254l857r76J521M523R26n626m269K839N103J187l083m213M35N072L924
862E633j951o396k567N043L772o86l953l959N42P151L530n408m027Q13L044L595
878D176J38o322l982M269M811n90l320k978Q75N058K844l020m748o4M061K386
894C594k321l649j509J855N177L68n244k456L711L713N82k222n106j124N480L577
910D426l717l948l62K269M953R23m845m086K605M508J356l115m337j084L788L984
$$ y = [-3608, -6635, -257, 4155, 3303, 714, -3022, -3495, 3429, 6183, -327, -5342, -3611, -175, 3713, 3533, -3493, -6347, 257, 5925, 4831, -450, -4631, -3188, 2445, 5478, 855, -5333, -6011, 566, 5443, 2963, -1849, -4020, -1780, 4440, 6458, -640, -5495, -2541, 813, 3093, 1621, -3274, -5753, 1019, 5381, 2127, -1730, -2706, -1185, 3338, 4264, -1362, -5631, -2792, 2311, 3498, 415, -3798, -3363, 1709, 5633, 3682, -2714, -5281, -238, 3534, 2848, -1105, -5064, -4522, 2629, 6159, 751, -3276, -2463, 581, 4176, 4314, -2008, -5990, -1721, 3090, 2500, -820, -3798, -2923, 2135, 4979, 1959, -2789, -2853, 1208, 3594, 1273, -2376, -3885, -2030, 3147, 3515, -1729, -4185, -474, 3239, 3821, 1599, -3507, -4631, 849, 4426, 709, -3239, -3601, -1332, 3621, 4544, -301, -4387, -1782, 2726, 4082, 967, -3370, -4454, -666, 3318]
926C318p27m920j752L777L585o0k515l402k7M790J522m208l136J146K834K585
942B810l43m230j455L828L538j714l382k300J154L804J843m024l460R01M262L008
958D240k106l760j563K370M120L69n004l123K290L255J921j412m336n34M671K605
974D003j850l091j736J220L662K72l651k867K452L189J033j841k519J4K973K138
990C401j714l986q73K878K294k69k688k678J717M989J186l707l374J150K419K346
1006C091j129m527j990L900L185l44k553j918O19L886J654k833l693J04K723J679
1022A854o83l071p53J799L297l6l315j242J559K323O35k275k933L19L299J786
1038B563k068k786p3K860K656j64l812j810J609L030O44k817k622r9L109L144
$$ y = [3318, 2591, -2329, -4081, -304, 3281, 3221, 706, -2696, -2723, 2067, 3589, -619, -3755, -2609, 225, 2810, 2467, -1763, -3218, 610, 4148, 2434, -948, -3248, -2094, 1710, 3553, -471, -3931, -3030, 1232, 4240, 2134, -1626, -3189, -819, 3301, 3670, -1334, -4457, -2167, 1088, 3009, 1597, -2739, -3273, 1398, 4003, 2153, -938, -2674, -1454, 2208, 2480, -1171, -4038, -1586, 1603, 2636, 795, -1724, -1710, 1263, 3401, 1687, -2299, -3172, -294, 2000, 1731, -957, -3635, -1918, 3071, 4257, 550, -2824, -1674, 745, 3091, 1962, -2565, -4555, -655, 2530, 2186, -367, -2285, -1666, 2220, 3874, 1041, -2652, -2548, 175, 1854, 1171, -1900, -2653, -854, 2443, 2407, -908, -2150, -591, 1732, 2367, 92, -2841, -2522, 777, 2563, 495, -2291, -2364, 496, 3152, 2988, -824, -2634, -1025, 2005, 2649, -168, -2790, -2889, 220, 3364]
1054C364j733l308o61K569K230l2k732k651J007L376N58k187j916M21J836K623
1070B764p89l279n61K333J475j021j669j531Q38K623J234k914j682J300K323Q86
1086B330p69k813j171K385K590j536k955q78J718K595J088j613l252L73L340J046
1102B478j680k173r18O92K803N77k948j316J756K049M02r23j929l10K398J325
1118B283k023k138K27J689J131qj665j479J448L100n94k247j565N56J691J736
1134B142j654k941j56K927J817k06j889j885Q01K691R84k667k482O74K170J103
1150A429n75k021o76J744K494j095j370j213L68J501R25j425k331Q87K381N58
1166A581j554r40m40J456K133q20k916p7J270J526j32j440j725K95K758J856k224
$$ y = [3364, 1631, -1677, -2338, 231, 2461, 2429, -303, -2954, -1947, 1429, 1987, -200, -2116, -1695, 141, 2764, 1975, -1304, -1865, 468, 1943, 922, -747, -2278, -1440, 1183, 2417, -497, -2179, -879, 1444, 2330, 1561, -1252, -2423, -38, 2552, 1016, -1939, -2817, -1099, 1496, 2584, 971, -2281, -1908, 1432, 2478, 798, -1375, -2293, -1601, 1202, 1779, -1169, -2485, -729, 1320, 1722, 799, -1130, -1440, 958, 2283, 260, -1878, -1651, 38, 1169, 1161, -504, -1983, -535, 2565, 1971, -276, -1841, -1285, 406, 2142, 488, -2453, -2609, 318, 2135, 1929, 40, -1845, -1044, 1647, 2631, -36, -2518, -1844, 326, 1429, 854, -1167, -1843, -99, 2395, 1300, -70, -1283, -915, 586, 1511, 86, -2245, -1358, 1023, 1581, 27, -913, -1353, 103, 2236, 1416, -1500, -1577, -307, 1219, 1087, -353, -2078, -1783, 975, 2831, 607]
1183F07k255N22J143J520K33k231k324J537K555Q8j545r24j24J467K063j177k361
1200a206m61J947O75o05r22q31M04J971N53j310j359J331J129j90n34j494j204
1217b106J797J997j314j701q6J087J751P29j768k346Q11K272J61r35j559j071
1233b281J641K282j48j753j169J168J528K84j014j526k63J306J398j154j474L17
1249h58Q50N49R30j542j371J270K121j540j087l77R3J030J319j082k091R50J645
1266H09M81m32r11j242Q59J917j96k012j560J356J196R75m62j342j026J994J609
1283B013j118j428n06J29N74J624j260j261O00J711l50l87k43r88R50J510o76
1300H94j885K24P48O22k04n56n32J70J795M42j819j438R10J073J54K03j425j557
$$ y = [607, -1648, -1126, 17, 1537, 1770, -461, -2785, -1248, 1307, 1395, -150, -1074, -1198, 269, 2332, 1155, -1206, -1667, 280, 955, 350, -572, -1403, -999, 972, 1525, 215, -1144, 187, 1316, 1126, 592, -902, -2106, -309, 1688, 374, -1327, -1413, -326, 1425, 2154, 386, -1960, -1149, 1123, 1284, 349, -1210, -2281, -640, 1642, 1494, -259, -1428, -260, 1268, 1552, 538, -988, -1251, 55, 1453, 299, -1175, -858, -8, 541, 1471, -71, -1442, -172, 1949, 409, -678, -1055, -962, 68, 1387, 305, -1786, -836, 809, 1290, 858, -53, -1295, -436, 1481, 1285, -727, -2287, -931, 265, 1240, 778, -564, -1590, 404, 2013, 895, -533, -1039, -910, -336, 1288, 28, -1233, -633, 1078, 728, 341, 98, -890, 60, 1570, 894, -991, -767, -19, 603, 399, -157, -689, -519, 1276, 1718, -101, -1539, -629, 444, 598, 801, -624, -2181]
1318b181J751J861m33j422J39l14Q27J474r76k383M02J165M29J32l63j293L85
1335h00J853j61p43o07L58M60M23r07o67l13J112J153q48j109M44P38K07N71j358
1354a94j769J665J380o33o20n46o00J364J942j208j198j99Q26N05K74j229r88
1371a228K95J369L12m62q65k1N65P01L26q11j258R18J228j312m16K88Q4J42J162
1390A017q42r09R89Q28n63m53j22o24KJ552n23j138l6N64P44M32l79j262m4J086
1410C19R78j054r75O6k9N14J037n31j469J173J037l82l69J05r97P8J125n13j000
1429h87M44L03M92O4j6r16J56R07j08o56l99M86K90L6m7o51n56J374R63p36q86
1450c43L65j37L82N37q86j021L16J061k23K76l58o02O00J110l43n95l45j74J87
$$ y = [-2181, -430, 1431, 998, -424, -285, -599, 228, 1702, 726, -1657, -1255, -90, 339, 471, 108, -1185, -800, 1053, 892, 149, -458, -100, 360, 783, -124, -791, -1104, 8, 1161, 313, -796, -352, 386, 593, 1164, -194, -1963, -298, 1082, 449, -171, -717, -1317, 47, 1989, 781, -417, -616, 210, 715, 989, -240, -1228, -933, 436, 748, 286, -579, -600, -35, 666, 992, 181, -1077, -159, 1069, -243, -659, -371, -287, -145, 1017, 175, -734, 255, 1083, 520, 67, -55, -679, -677, 875, 352, -786, -822, -258, 486, 918, 539, -723, -767, 319, 1297, 243, -732, -666, -695, -181, 856, 325, -1144, 29, 1066, 684, 315, 420, -577, -499, 626, 113, -887, -443, -140, 352, 416, 400, -516, -360, 547, 439, -217, -616, -130, 160, 196, 149, -502, -1058, 316, 1279, 543, -343, 22, -115, 267, 804, -82, -1103, -787, 274, 51, 327, -31, -633, -33, 1077, 734, 139, -206, -380, -193]
1469a93L52O1p28l29N23J208m96k99K22l18j25K46k75n14O31L67l59m85N36k38
1489b13N69M15n50o45J45L69j6pl94p59P33N64N84p85l28L55J37K36J9o34n23
1510g28L52L32L7k98L47n21P18M67l78o66K74M56l39j67k08k53N52J99k62l62
1530d48N37J61L40k69l82n67M89M70O7n15l52K17L27K81P1n09k83N83K68l28q4
1551G4m13j14L7Q38l00n29K58l9Q8N51j47m42q4M0L94m95l4j04O93k66r3K41k05
1574e1O17j70m11q4o1K3K33K94p07m40O04L91q6j92K48n89J98R49m70o26K33j07
1596b04M3Q2M41n93J70J21M38j91m43L83j37l58J18K46l23j29N62l77k15P65q2
1617C17Q2m9j47l52L57R4n36J89n6k73L39J30j02Q1Q8m9O3j39k7j96J51q9L37
$$ y = [-193, 159, 220, -508, -837, -314, 894, 398, 99, 321, 3, -122, 124, -151, -665, -34, 333, -26, -511, 25, -213, 356, 771, 221, -424, -279, 90, 74, 67, -327, -1086, -353, 211, 795, 10, -318, 37, 174, 410, 429, -205, -728, -376, -44, -7, -305, 42, -479, 239, 706, 328, -338, -64, 392, 53, -114, -322, -575, -23, 176, -86, -448, 89, 250, 590, 321, -61, -628, -139, 331, 398, -117, -469, -252, 75, 356, 427, -82, -365, 218, 486, 158, 74, -339, -453, -416, 422, 122, -407, -149, -188, -100, 451, 304, -138, -222, -182, 212, -283, -317, -421, 272, 6, -87, 154, -51, 566, 396, -15, -99, -160, -137, 96, 390, -317, -757, -153, 238, 152, -40, 208, -381, -183, 766, 296, -330, -97, -204, -161, -79, 362, -231, -61, 60, 498, 307, -136, 247, 110, -248, -130, 116, -207, -336, 226, -151, -366, 399, 317, 399, 350, 203, -149, 208, 302, -234, -45, -101, -374, -35, 95, -7, 74, 162, 113, 176, 37, 10, -186, -35, -124, 213]
1640B13o6p8J02j15N7K82k30k23J13k67j4J70j01M58m04K73k77n1P29l50mj49
1662F8k05p0J28J20m81L05K1L20m3J52j58j41n2o9J57R9l64J28n32Q57j52j01
1684a3o3K64J69n24K87j02m46L21K5m08R2L80J29m18K73J79R1J64k02q2l86J99
1706g1K17n6m59j17L82K45R1O4l92K36j52l0R3J16l81l41L82J80j99J85R3P3M6
1729B05K42o27L64p0m2o61K60Q0K6L57m6l8l6L08K56o46R6k02j50M32k92O9k35
1752c50jK08M11K88m2o73K7L50j41m8l16o4K42j69M02mj36K02K90o39k17M35j79
1775a24j21J68j58j15J85o8L68J17m61M14R5K80m22l74%m6J29M37l85l26p5R96
1797E14j25o90L84q2L9M54Q7j031k2J72%J30K89l00K15L57k20j73N3O5j21M3j56
$$ y = [213, 147, 69, 171, 56, 113, 395, 165, -58, 55, -212, -226, -56, -157, 301, -103, 170, -107, -158, 571, 221, 217, 68, -137, -207, -79, 41, -440, -135, -114, 206, 163, 315, 157, 16, -36, -105, 52, 151, -213, -85, -617, 240, 88, -13, -76, 188, 357, -167, 120, 18, -428, -107, -82, -490, -398, -18, 111, -307, -34, 145, 236, 400, 198, 116, -270, -71, 146, 90, -369, -486, -104, 141, 232, 296, -96, 140, -12, -42, 51, 167, -214, -555, -173, 7, -192, -7, 86, 159, 205, 447, -180, 184, 114, 72, -589, -329, -249, -223, 134, 88, 50, 14, 322, 578, -68, 28, -174, -324, 108, -184, -115, -350, -351, -143, 268, 556, 514, -159, -132, 218, 77, 29, -287, -351, -109, -278, 124, 120, -16, 186, 476, -163, -380, 55, -124, -245, -77, -235, -350, -165, -233, 135, 252, -209, 205, 300, 580, 158, -216, -216, -262, -133, 304, -81, -407, -482, 514, 389, -301, 83, 1, 40, 494, 581, -450, -472, -300, -300, -170, 119, -181, 34, 391, 171, -2, 51, 116, -5, 38, -118]
1820a18k07j8M66J24j75k53J57J52M0rJ98q87P0O20K17m08k66P0K86L61m7j41
1842B32n77M05l9j39L65m29k45L76K41j17j8j50K24J94j67J31m09p6K58j00m58
1863d98L64L9K01J0k1j57j02L94J50o56K31m39M4N88K36p59j86P16q5L71l81P3
1885A33n08P28o4j83o63L18k69N40J51L9l66J45K40K12k87l16J32l78K61M04m74
1906b05j89L09M86j12J03k46l81K69L72o01n04N12K65n7K19k49k92J72N56o0l74
1927gl32nK01J09L3l96k5L06J83K07j36l22J58J99L38m89j36j11o3K09J26k99
1949b52J00J27J83J54l22k4O9J49n2m71p9J54M10J42m14o1J24K1M02k27o49J30
1971c86O24M7Q4l79m18P5O56J65l93k07m6K3K35L24m07k73K30K43K14o33j32P33
$$ y = [-118, -325, -343, 123, 247, 72, -181, -24, 128, 168, 159, 357, -530, -460, 160, 377, -31, -297, -227, 59, 420, 373, 232, -345, 60, 21, -118, 247, -182, -427, -51, 190, 73, 55, -95, 129, 323, 156, 287, -122, -198, 60, -40, -498, -134, -95, 106, 116, 95, -62, -164, 230, 380, -276, -45, -484, -440, 148, 384, -375, -561, 155, 70, 441, 60, 133, -375, 353, 289, 106, -557, -239, -508, 32, 183, 222, -144, 1, 241, 453, 166, -150, -18, -396, -135, 269, -205, -394, -85, 401, 289, 392, 146, -235, 34, 406, -195, -699, -187, 78, 21, 240, -9, -301, -129, 427, 367, -7, -339, -344, -143, -34, -1, -397, -422, -116, 67, 274, 138, -184, -26, 173, 511, 22, -114, -225, -288, -79, 47, -252, -152, -25, 158, 312, -10, -34, 35, 184, 132, -339, -418, -264, 146, 288, -126, -187, -63, -42, 360, 133, -516, -386, 238, 285, 369, -10, -428, -353, 303, 468, 75, -132, -178, -155, 80, 404, -3, -276, -46, 197, 411, -222, -354, 379]
1993C79l30K27Km49J32Q6J40k13o3l73K24M81L35n32m48K96M15O6j90o89r4N32
2015f6J47k75j45j23J92M02L72l65m65L1K00L35j38m61J44m9L21L43n19k01M85
2036A65L71n16J00k5n12P31L8l90n40M59K34J88J6p02K36M24J82j62k88n37N75
2057D7KJ31J71m29n06O62O23m56n57J47q0P09k63o71J23O1m4P14R2p51k47N84
2079F2K33l15j17j84J12K13qk6k86J65L78L5k89j2l0JJ66K98j047J78O23L10k91
2102A69m9k87M69L3K15m80l0k89K51M96k04o07j5J27N83j17j90m54J63L88J76
2123C48k03k62l78L11M23l96J25j15J86O4J59n58l9M39J98O5l47j79k19L87O00
2144F09o96j55Q2M56K36k89m07n5K4N39l8l07m65RL82L80m1l15j40J77N06M4p02
$$ y = [379, 49, 276, 278, -171, -39, 47, 187, -26, -89, -462, -238, 243, 578, 46, -402, -106, 309, 375, 185, -504, -598, -66, 81, -194, -339, -462, -270, 132, 504, 139, -326, -295, -95, 240, 102, -359, -215, -264, 57, 400, -119, -320, 165, 536, 20, 120, 95, -417, 314, 352, -38, -578, -119, 115, 303, 319, -383, -147, 277, 459, 297, 9, -528, 47, 49, 180, 351, -78, -584, 78, 701, 245, -312, -165, -245, 464, 201, -470, -347, -286, -330, 384, 476, -275, -522, 62, 295, -20, -137, -321, -209, 4, -4, -30, -316, -151, 227, 262, -27, -39, -69, -68, 98, 396, -651, -473, 150, 460, 169, 120, -167, 302, 335, 550, 70, 40, -249, 2, 498, 294, -313, -328, -201, 382, 265, 75, -379, -216, 172, 348, 145, -117, -495, -184, 239, -157, -32, -147, 39, 103, 262, -296, -335, 104, 302, 367, 20, -159, -378, 9, 609, -87, -242, -160, 296, 532, 243, -164, -219, -195, 344, 306, -1, -466, -457, -75, 305, 264, -51, -191, -14, 492, 536, -166]
2167a66k96j5P00J51j59k80k00O61n46N09l32j7MK27k20O7j44k80N32n3p8m50
2189c85L03N18J32l38k93k98J44M23J57m20k22L65L45l07K66k74k93J08L66j96
2209A01m02J26m5K40K85j47n75L62J81L31m56k80K93r4N99m09m59L2K2M99k89
2230h5R4j93M4L84j68j73k90K01O5N11m63j25l71M80M71k55p4m01L0O79k42k39
2252a20j29m65O05O85m78l47j48M97K9L34l40k91kO74l61n14J37r1M48J95k12
2273A06o00L17K43J65J05l59l69K38K67K57m27k89n8N22L41p4q06kL17N31k85
2294A40m36k71O0Q39P8n01l87O38ln3j67k95J31K25JK11r5m42M7N24j1J11n90
2317b46j11L42L03l76j67J69n7O10k29l87j0J21M40J25k27p47K86L48K38l45j28
$$ y = [-166, -462, -477, 223, 374, 215, -65, -265, 396, -150, 359, 27, 10, 14, 241, 21, 88, -56, -336, 196, 143, 65, -385, -82, 436, 568, 230, -63, -361, -217, 206, 363, -57, -279, 86, 431, 124, 390, 116, -177, -69, 297, 101, -301, -175, -220, 20, 305, 158, -417, -55, 126, 457, 1, -279, 14, -80, 519, 110, -349, -317, -295, 204, -85, 9, -184, -140, 244, 76, -97, -387, -186, -121, 390, -73, -198, -569, -89, 382, 127, 53, -348, -318, 361, 119, -120, -249, -714, -109, 576, 98, -249, -397, 100, 129, 463, 123, -168, -170, 504, 143, -371, -234, -325, 123, 318, 106, -494, -177, 66, 231, 336, -23, -392, -154, 113, 370, -57, -346, -404, 118, 459, 385, -421, -423, -106, 425, 140, -296, -567, -507, 332, 410, -91, -478, 160, 157, 104, -63, -358, -227, -2, -1, 210, 115, -327, -280, 244, 233, 344, -246, -357, -15, 288, -88, -255, -86, -143, 467, 238, -149, -159, -38, 402, 527, 300, -447, -161, 187, 425, 80, -48]
2338d8J44l99K82L50n34p6L11J36j19j34j48J06J75qq2m43M79P3M12j12l46j08
2360h9L2K74J28m01l51N54j26L6R8n38k5O77K34m94k97O9K32R4J21m76j22J45
2382b25M43J7k38l6k51L88m7K21l06j32j21O35j93p6l56K48L04Mj50j53k83L01
2404fM8J77n71o1L55L31j44j46l42J05N52O3l74k19p4L98L77k11o57K7K70M36
2426C34j53o69K32KL17K84n88J32p4J39J96j80L8m03N81K9J49k53k99J13N07k13
2448B21q5n66J15M60j95J96m17M41L6J96k47l75R1k09K92Q1n5m23N8N52K86l98
2470E5K8l68J47K53j51J04n48K32R9N11m14k03O1L37O9n2j74j7Q3J00j35J00l08
2493a91qL83J5l05q4n8M81J99j14r51M28J57O15n11j26l59M17L21j78j43M7k20
$$ y = [-48, 96, -303, -21, 329, -205, -281, 30, 166, 47, -87, -235, -129, 46, 38, -44, -487, -8, 65, 477, 365, 19, -89, -57, 217, 345, -56, -407, 147, 21, 57, 155, -383, -408, 269, 503, 9, -288, -219, 13, 107, 228, -248, -370, -225, 218, 235, -3, -39, -290, 98, 51, 272, -34, -166, -287, 348, 155, 79, -277, -29, 275, 279, 129, -24, -307, -6, 42, 219, -352, -413, -58, 273, 129, -17, -359, -254, 298, 361, -13, -232, -306, 92, 469, 258, -399, -372, -102, 334, 181, -488, -256, -254, 63, 347, -241, -109, -183, -44, 152, -28, 10, -393, 188, 217, 366, 113, -186, -73, 434, 221, 136, -430, -315, 145, -50, 146, -271, 170, 206, 402, 155, -220, -129, -338, -46, 35, -20, -443, -385, 167, 453, 55, 83, -285, -138, 115, -36, 68, -480, -248, -149, 362, -52, -255, -194, 143, 212, 160, -14, -31, 52, 152, 17, 117, -191, -199, 184, 199, -106, -190, -248, 233, 432, 318, -633, -205, -48, 567, 56, -70, -429, -12, 309, 131, -12, 35, -185]
2515a85J07M01j14m09j83M66L5P9k26Qj14L58j14r5O7j24J17j33L37l35m47M58
2537d6J92j6k83R0j50L55p6Q6n42K69M10J32l71j18J03K4K77j14j80n2L1P7J29
2560B27j21k92J31K16L82k14p52J98J75L38m49J32k39J40K64K41o48J95j01M4
2580a33K68K76n20K27K33j68M9k20j39l16P55j72k24J0L3K43J88m76P2m55N72
2601A03r1K18k21j33l17N51j55J05j72R9k12O53m31l31J44j9P14on18j34K20j88
2623a21J47K83l82o7N1K76l20Jr0L82K48p4m05n69M87N53q5m29j91k8J02K04J15
2646H8Qj37K2O0K01k09k86O2K99J68k32j18k02J93L78k94p6K4K54J61J61l82r8
2669D5m67M29j55R2J9j85J37N05j26p67K39L20R0l14J15k60L36m5J74k54k18k25
$$ y = [-185, -78, 323, 209, -200, -383, 83, 118, 197, -29, -21, -135, 223, 109, 14, 81, -43, 74, -59, 278, -57, -504, -46, 146, 130, -153, -63, -213, 142, 66, 152, -390, -121, 289, 421, 50, -68, 35, 59, 336, 222, 42, -10, 21, 98, 227, 106, -186, -55, 161, 543, 329, -423, -225, -50, 288, -161, -29, -268, -128, 136, 377, -271, -76, -177, -133, 135, 411, -109, 118, 351, 183, 232, 12, -127, -443, 312, 140, -84, -74, -41, 202, 390, -86, -14, -469, 103, 12, 230, 9, -124, -441, 110, -45, 60, -112, -13, -225, 428, -3, -334, -190, -209, 505, 499, -19, -153, 67, -121, 26, 309, -73, -140, -89, 187, -133, -132, -222, 160, 408, 334, -71, -640, -153, 400, 315, -114, -305, -333, -231, -27, 88, 96, -41, -19, 41, 242, 33, -253, -191, 108, 276, 44, -74, -276, -83, 295, 1, -75, -51, 203, 364, 525, 143, 45, -422, 7, -148, -56, -37, -222, -85, 420, 294, -473, -234, 86, 176, -138, -23, -283, 53, 8, 182, -72, -290, -515]
2691e15L68N18j47l37k61L07P1O1k11j41O4K93J91l66l3m5M82r9q9r7k00J85n4
2714e5L18j62k53J76N2j11Q4k51J46K53J07m2n41J31K08k01O8J9k80L47o7J86
2736A32j60j02k17K23J65N7j21l16K15J87L33m29L8K01l76K70j23j40k69K76K85
2757A29j99Q2Q5j60J34n6k08J78k93L36J62j55k38o0J37O11l81q1m43M98j87J74
2779F5p8k5J10K77m51J94k3j68J80mJ95n52K33j4K38j51q1J2K88k28j79M67m11
2802a06J28N9p4J96j27k30K42K8j19n0N2J69l43N06k32k63M0J47J22k83qP2j82
2825b56K93j77%Q9j40K62Q8l53J46j61P5N03m01r5l54N49j21J58j31L6j05P9N05
2848D89n82J32m28L89J80R7n91J58L78k85k64K63K10k88j5M78l38j9k25M40l23
$$ y = [-515, -147, 371, 224, -113, -374, -67, 4, 65, -146, -287, -223, 70, 261, -105, -138, -183, 299, 200, 111, 14, -186, -1, -55, 263, 101, -152, 24, 76, -35, 49, -202, -56, 197, 304, 262, -279, -148, 60, -141, -73, -54, -334, 13, -54, 132, -28, -130, -347, -124, 41, 98, -23, -339, -124, 63, 396, -33, 5, 206, -170, 100, -23, -163, -432, -156, 129, -70, 12, 97, -63, 71, 15, -193, -15, -308, 28, 190, 35, -203, -263, -126, 485, 104, 23, -420, 78, -109, 65, -13, -38, 72, 349, -102, 92, 69, -99, 81, 77, 272, -280, -47, -61, 177, 26, -55, -43, 245, 17, -162, 305, -106, 22, 81, 7, 203, 76, -154, 88, 116, -3, -53, -1, 168, -175, 331, 99, -164, -124, 23, 145, -138, -146, -74, -256, 37, -140, -140, -51, -191, 71, 159, -194, -48, -209, -134, 369, -32, -127, -481, 68, -53, 105, -26, 10, -95, -16, 489, -93, 39, -389, 0, 180, 277, -314, -156, 222, -63, -327, -64, 146, -142, -157, 321, -17, -36, -261, 179, -144]
2869a44n9K12P4k9mN0m52N36m43M47K2j26l13j47O72k19l29N05k91N3J10K04m58
2892a29j67M10jl6P6k33k7J16Q2j21k53K81j19PJ20j7J3j51J32K78j52k94J85
2915@J1k35K75j71R2p9L23J05k88p6n9K66N9j53J3k75L15J05J87m86q7N8k2K74
2939A52q1k50J44P0J29j64jn9K91J16n55M41j36k51K93l38L77j47m0M17k39J42
2961C11n18M87k61l14K56j66K42J31k20M9J1k4K8j64J11K04j67J94m63P19k85
2982A61j91j21J15j55L39N1q6l32K59K65k74n6jr4J05Q7l23J57J10O4k71J51k60
3005c00K79m7O7K52l27j31K15r3k9L1m3K48k13L33k67k43K98k13L93k15j33k76
3027d14J72K34n6J28o7J13l36N0j2K04R4j47K8l16J81P2qK20l45j61M48n2Q1q3
$$ y = [-144, -203, 9, 83, 54, 50, 100, -352, 184, -259, 188, 210, 84, -229, -376, 296, 77, -252, 253, -38, 15, 125, 329, -129, -296, 114, 113, 77, 153, -80, -107, 9, 91, -30, -283, -2, -121, -114, 6, -11, 2, -149, -17, 261, 109, -185, 0, 11, -224, 51, -120, -28, -107, 216, 321, 33, -43, -102, 164, 223, 70, 83, -192, 123, 228, 415, -71, -158, -100, -122, 152, 71, -179, -35, 35, 164, 0, -1, -60, 231, 347, -208, 233, 97, -154, 139, -199, 178, 31, -9, 408, 169, 311, -207, 280, 19, -295, -39, -205, 37, 168, -52, -3, 8, -16, 12, -152, -41, 163, -4, 190, -273, 446, 161, -30, -151, -36, -191, 148, 199, 113, -219, 40, 305, 31, -25, -26, -120, -15, 72, -251, -94, 16, 80, -191, -40, -300, -21, -68, -1, 251, -76, -207, 8, -85, -114, -83, -126, 122, -91, 242, -25, -268, 30, -183, 210, -5, -138, -414, -242, -8, -64, 64, -3, 110, -226, -176, -188, 16, 110, -37, -9, -325, -144, -72, -80, 140, -205, -366, 82, 30, 111, 28]
3051B8r4J29l9n3m0j02Q4o0k5J87j1j00K55j49k41K50Oj37L62m97K95L7l34K08
3075d1k29J71Q3n6J3k44K1K58k1P3j37K66l13J73l3J1J88k9j72J35n6l6Q5J58
3099B68j36l93M00j44K81k4l63j18P3r4L78k92M68k41K49m62M30k61k16K04l2
3120b5j26n8Q8J04m4j13P3q4J37O4J38j68L3j01N02o49J65N1J71p1k81K37J47
3143A90k87M5J2J6l00M60l05N3K99qk47k87N37m09L95J55n48J50J8J13k80L21
3165I3j9J11K10l81l48N80j07k27K04j88j2K51L5l3k59j8K01k4L35p48J61j04
3187b87K35J4L2j57L0j57O21l24j9M47n64J30R7l86J46J8J63k10Q3K66l91J67
3209d6p7j82L83j64J34m1j2J13j06L17j83r6O2j73j14L61j7L9k15L51l79Kn4L57
$$ y = [28, -66, 63, 24, -29, -69, -171, -87, -147, -172, 15, 4, -96, 159, 10, -231, 19, 25, -112, 250, -247, 48, 85, -249, -41, -270, -99, -16, -72, -59, -303, -282, -24, -45, 28, -109, 157, -156, 17, -16, -5, 183, 154, -18, 117, 61, 25, 110, 268, 132, -261, 139, -5, 276, 252, -111, -229, -156, -250, 128, -164, 304, 63, 312, -150, 280, 19, -197, 7, -25, -151, -209, -121, -17, -61, -174, -101, -185, -48, 16, 154, -14, 19, -82, 420, -229, -64, -13, 158, 87, -194, 43, 190, -97, -52, -40, -24, -324, 136, -169, -116, 183, 175, -72, -359, 178, -231, 164, 319, -229, -79, -61, 52, -228, 93, 74, 185, 395, 14, -334, 246, 139, -88, 116, -72, -84, 167, 202, 169, -90, -108, 93, 69, 404, -344, -183, -287, -52, -38, -6, -163, -133, -290, 331, 7, -12, 435, -129, 1, 98, -288, -142, -124, 39, -171, -88, 178, -213, -46, -123, -305, 78, -86, 48, 7, -5, 108, 2, 319, 136, 40, 102, -71, -185, 176, 159, 198, -17, 334, -45, -43, -97, 260]
3233B60J34j82J23j4j99K05l52r3K15l2j00m6J87k96Q4m28O63j32l3o8m2R6K16
3256A66l60P2J06k1J15jK0p5K3k46K24k3l24J10J68Q1P5l76J57j32o8M34j20O6
3280G1j92r6j80K81K05M9k21J88j43k0L51k27j54K05j42K8P4l05K76RR1k52n9
3303a63J17L3j01j14J46L19nl73L00j4j76j51J3K21j8j37r0J74J29k45L6K44j64
3326a9J2j41N2K64j87n8l0J8K39M3j2m16L22J18l97O3j09P4K16N46m01q8K47l69
3350a3P6OO1j73J7m1J94k76Q0p8K5J72k51J98j91M11J40k93n0k7j20J40k20L63
3374A50Ok37j28N09n2l11j9J78q0M5N5n5L0J00k20K45j34R7k64j30N49l10j47
3397a23K53j99J24K12o75K64l9J85J44j10j52r6Q4J40k22m0L53m5k31K7K66j32
$$ y = [260, 394, 212, 335, 321, 122, 327, -25, -118, 97, 65, -35, -81, 106, -190, -106, -534, 129, -3, -36, -104, -146, -50, 166, -194, -122, -16, -37, 78, 77, 97, 22, 45, -201, 23, 0, -324, -214, -46, 35, 110, -266, -109, -241, -309, 125, 5, 71, -121, -217, -397, -116, 89, 138, -83, 105, -38, -58, 293, 66, -88, 117, -25, 3, 77, -228, 48, 57, 148, -104, -163, -46, -13, -114, -228, -82, 237, 232, -141, 159, 145, -31, -182, -169, 52, 34, -103, -193, -19, 110, -135, -99, 145, -19, -7, -148, -96, 168, -19, -77, -107, -89, 150, 193, 181, -235, 87, 205, -192, -129, -238, -164, 52, 598, 197, 109, 356, -13, 63, 69, 130, -43, -26, -67, 127, -149, -69, -147, -122, 50, -201, -3, -194, 217, 357, 64, 14, -13, -133, 7, -213, 150, 156, -81, -209, 300, 248, -63, -82, 96, 16, 61, 116, 61, 91, 191, -29, 216, 82, 179, -85, -215, 334, 24, -123, 130, -69, 55, 267, -408, -144, -183, 2, 146, 36, -116, -212, -128, 12, -210, -250, 103, 58, -173, -146, 120, -12]
3419a2l6l5P5O8j98K53m89M79m54L62k0J68K1%K34m04L8J42J06m41Q3K41k20L31
3443B92k66j26j36M90k20K66j80j82K47J07n49L63Qn84O73k91J8j01K10M4j74
3464i1n6J69oj5KL2m0J85j11j64J74j55K83J7l48o1J72K7J54k81L4K50j56n6J67
3489A26j89M2k02K58K7M9n0mk26l0K31P1k23K5L45k79K0R3l88L53j12O3K12O4
3513B76k96K9K5l1l6LJ31l33P3J22J01o8j70J29J09j91J59j70K68R5j10J53L8
3536C06l44M2m6j16J86l3k30J35O1J31Lj02j09J09j0k30L45n1k56R7L22l05L85
3559B90k66p8J56l68Q7j39Q8J90j2Q4O0k43q7N54l34r9J77K7J11k41rL68l28j2
3583b4J33q4j8k26K66q1r3JK42k51LN2l04N32k72j09M0K06K19p6l02J00J19m6
$$ y = [-12, -48, -83, -8, 60, -138, 115, -374, 105, -349, 13, -7, 161, 182, 182, 416, 12, 50, 192, 298, -143, -60, 181, -39, 292, 26, -100, -236, 254, 34, 300, 120, -62, 185, 292, -257, 106, 114, -470, 203, -88, -70, -171, 39, 83, -91, -147, 22, 16, 1, 3, 35, -5, 180, 69, -95, 79, -76, 207, 224, -124, -185, -13, 14, 168, -113, -79, 171, 15, -41, 126, -63, -21, -223, 35, 62, 111, 61, 57, -169, -199, 32, 103, -120, -95, 250, -29, -9, 84, -304, 49, -63, 0, 212, 276, -20, 9, 34, 3, -33, -30, 101, -232, -159, -37, 64, -4, -174, -45, 64, -127, 32, -138, 130, 225, 115, 268, 306, -38, 4, -42, -158, 28, -5, -235, -100, -39, 92, 95, -7, -116, -7, -17, -247, 98, 47, -209, -112, 210, -95, 290, 24, -54, 102, -266, -179, -318, -230, -40, -52, 32, 92, -151, -238, 316, -18, -117, 60, 87, 198, -43, -52, 316, -12, -24, 109, 25, 7, -219, 47, -34, -127, -126, 116, -135, -132, -80, -384, 148, -124, -233, -193, 13, 232, 156, -146, -46, 73, 27]
3607B7r2Q0P7k79J55Jk89M17k26j44Q8K25j3j00J71Q3Q8k12j43J29j87M66m87
3630a65K75j6N5j47K9k50P1J55J52r3kN8k46m0M50j38j62M12q8m08L13j25m56
3653c66M34P3L10m61J89k24K6Q3rM7j34Q9K14m79J69J82np6Q1k29J3L71j30l24
3677a56L3J97k05M02k57k14J5L84m82K57J16p2j24K33j16l46L03q3m9J0J27K24
3699A97k69J39q6J43l16K38k32K29k4J38k03l1K42Nk87K31m8j22L05j39O6J1j63
3722B4q3k85L14K5j02K40kk08K90k88o5L27p1k03J11k12J56O2L7J10n08L23J1
3745Cj44M3j99M92l90J89m2p5L38l27j54J39L27k98L90J48o54K26j88K05o2Q8
3767E5R2j46K5j47J61k18L66l18k3K69j75L3J36k09Q9j7K7L51l86K01l76K93J51
$$ y = [27, -65, 15, 92, -187, -32, -31, -320, 97, -129, -273, -185, 40, 27, -73, 98, 181, 269, 57, -86, 43, -144, 322, -165, 110, 94, 149, 2, 31, -219, -148, 7, 159, 66, 64, 122, -124, -164, 286, 148, -14, 398, 310, -98, 215, 90, -366, 68, 141, 451, -10, 179, -45, -19, 64, 55, 102, -32, 57, 271, -208, -39, 143, 138, 62, 143, -86, -73, 298, 168, -156, -123, 74, -131, 271, 14, -200, -185, 199, -283, -26, 90, 18, -106, 127, 11, -335, -32, -115, -164, -154, -27, 197, -72, 67, -19, 124, -192, 46, -186, 43, 19, 157, -46, -77, 165, 170, -117, 114, 66, -56, 249, 110, 176, 187, 24, -59, -344, -30, -5, -107, 133, 131, -77, 213, -75, -140, 187, 116, -87, 24, -188, -32, 30, 67, 177, -331, -8, 3, -141, -98, -297, 195, -195, -6, -48, -123, 215, -112, -266, -127, 200, -98, 292, 440, -214, 12, -176, 29, -33, 55, 147, 1, 26, -121, 40, -178, 188, -130, -153, 116, -59, -26, 110, -99, -10, -27, 0, 351, -35, 166, -210, 83, 234]
3790B34l51M13l32J27j39K27m81N3K34J25j17j14J31J17k02r8J37M7J69k38K4
3811c4J6J03k65K00M3k44PJ97M8L4k42k06L56Q2K8K57k97j31L49j3q7m09p1K42
3835c7L19n72J96L97m24K18l9k46L7K30m1k5k52K06J43m7l23M58n10K94P7l11
3857b52K87P3k91M68n2O7o7O1n06L14k36J74K50m44n5K75j95L8m8K58K7O8l79
3880a65K49j10J78J17l14o2M6K7J90j76j12J45k22J13j9N3r2J31k21L66m75N70
3902B17k22j1q7K95j51J6o5R7J06j44J67k16n8P9K04k14L5L4j89K7J11o1p6N0
3926e6Q1r3NP9j47M22p6l1r7j72r8O9q7K3L40j43J65l92K88j18k04K52l17K92
3950a5p6q8R1K34J28n05K04k3j36m6J99K3mj87L07k9r8O7J15l7m47QJ21M50l58
$$ y = [234, -117, 296, -36, 91, -48, 179, -302, -249, -15, 110, -7, -121, 10, 127, -75, -173, -36, 11, 180, -58, -34, -18, 85, -180, 20, 63, -181, -174, 23, 71, 105, -137, -343, 13, 95, 123, 380, 83, -48, 301, 288, 201, -208, -279, -37, 282, -290, -94, 303, -121, 97, 58, -188, -151, 79, 38, 13, -239, -33, 110, 63, -260, 198, -312, -18, 59, -252, 35, 108, -183, 285, 233, 300, 233, 294, -212, 102, -134, 40, 290, -154, -209, 66, -129, -91, -139, 119, 146, 214, -165, 84, -26, 152, 269, -45, -107, -61, -34, 156, -20, -132, 13, -209, -96, -115, -62, -154, -23, -244, 122, -353, 217, -5, -16, -103, 192, 41, 57, -8, 89, 195, 51, 218, 2, -56, 23, 227, 13, 48, 82, -107, -80, 31, -30, -106, -56, 25, -68, -63, 16, -131, 291, 215, 184, 87, -85, -183, -114, -201, -178, 162, 19, 184, -208, 80, -38, -242, 10, -307, -15, -91, -179, -88, 146, 274, -231, -27, -50, -186, -232, -33, -10, -14, -201, 106, 77, -21, 46, 161, 124, -323, -315, -194, 256, -102]
3975a02O9l8J79l77N23l87J93j3M9J31j1m20P7j12k69L30O3Q9k4J78m11L12j64
3998a35l3O4K81k67q5J18J75j93J43K19o10L2L37j46K44l37K75q3Q7l3R9l43K56
4021F5J59j1O6l44pL5J76l09L15j04K9J20J21l28N1k6N4k64J07j2K63R9k17J27
4045A65k91J2Q7j31K74j80J16k95K39n3j50k2K2n1L35jo9K10P6pl65K32O8k40
4069a9K3K5l24K18K07m0k1m2l5J33r3J90K79p01K29j29J79O3rj17k54K00k77M56
4093A41j03j48K0j41n8J53K9n3M20n12L89l13J3J72j04L68m52j25L15J8K2m0j04
4116i3k9K99j81p4k94L90j34k07N69l71J3J84J3j16K15k4R7k35J31k90L10j56
4138A7J50j58j54J18j00J52J20J30l23J30kP8j61o9n3L9K35j7L5k2K40k48j45
$$ y = [-102, -33, -71, 108, -269, 254, -133, 60, 47, 96, 227, 216, -204, -127, -239, -508, -178, -115, -26, -50, 128, -283, 29, -135, -168, -104, 177, -90, -175, -57, 118, -75, 68, 287, -323, -291, 46, -100, 144, -193, 82, -1, 86, 53, 152, -191, 65, 224, 213, 279, -65, -72, -37, 139, -170, 145, 41, 70, 190, 311, -17, 34, 8, 62, -202, -95, -107, 156, 255, 38, 165, -126, -114, -27, -158, 116, -64, 52, -243, -4, -57, -207, -229, -207, -258, 77, 76, 7, 217, 293, 286, -79, 153, 221, -19, 4, 29, -295, -77, 130, 90, 69, 27, -8, 125, 32, 222, 501, -200, 29, -100, 79, 142, 133, 16, -238, -38, -315, 141, 38, -110, -90, -231, -289, -136, -107, -160, 260, -252, 137, -176, -163, 9, -95, 273, -179, -304, 11, 29, 51, 11, -93, -122, 177, -4, -78, -372, 18, -116, -323, 246, -125, -112, 72, 85, -31, 184, 160, 257, 22, 153, -137, 173, 17, 167, 9, -145, -27, -127, 25, 145, 275, -48, 82, 80, 158, -3, -72, -125, -86, 149, 132, 167, 145, 385, 137, -8]
4161hK2o6K09J95j92r1j21J44L2k3k75K63o7k55K60j53K32j1J04j40k21J34n5
4184h3p1J08P0J16k33L6J40J73l65k02M03K20m89L24L7j99k28L18K33m40J52J15
4206A35k20r1M4L47l26Q8lK39k00L50l49k2J43P3k03J51l26J80q5n6J39n4o8j3
4230a27q6K61K0J02k13K77m40K06J44k05K62l34J58J13j09l1Q0J0k3r1j90K78
4252F2j13j88K19L01n5p9j75J38k74J96J3R3J0j04k24J74m7k17M65l45J45J38
4274A33k95L26O0l10K0j11L09k05R9R7k14L8L20k62o7L28k26r6q7J07J48l7N5
4297A30l04K17p9J66k96R0K29p2n9N9R5j20K9m9o8K04L9k20L91k70J73l49J30
4320F6M8k18J51l39L63j75l6Q9J82j67J24jj98K12q7l0j6J49K84n02J87j39L7
$$ y = [-8, 14, -52, 157, 352, 160, 69, -52, 92, 124, 101, -174, 89, 22, -233, 27, -126, 106, 95, 199, 59, -162, -28, -83, -154, -46, 24, 140, -93, -57, 83, 256, -109, -311, 92, 312, -177, 147, 184, -15, -243, 75, 308, -132, 20, 135, -85, -176, -132, 215, -111, -23, -26, 213, 13, 363, 14, -8, 135, 208, 5, 156, -170, 10, -75, -131, 8, -46, -114, -127, -213, 48, 68, 170, -43, 234, -206, 0, 144, -61, 201, -133, 25, 138, 29, -2, 78, 88, 65, -26, -216, 62, -51, -239, -20, 281, 226, 147, -28, 110, -164, 32, 45, 138, 148, 44, -180, -6, -53, -270, 195, -150, -5, 133, -162, 164, 224, -86, -66, -177, 132, -73, 26, 123, -91, -53, 267, 5, -62, 266, 40, -56, -143, -36, 112, 75, 130, -174, 43, -36, 130, -166, -76, 153, 81, 22, 81, 176, 56, 85, 36, -32, 172, 211, -9, 382, 112, 285, -64, 66, 114, -104, 47, -292, 71, -104, -140, -51, 131, -36, 88, 87, -111, 101, 14, -16, -32, 117, 401, -101, 86, -53, -16]
4343a6l9J11l49O30m80j80Q0k4L72k10K22l82K95k26J20K65J0j07m54J51K17j85
4365a79J46m5k19N05j86j77K04k07K80m4j21k2j60J64L0j32L9K31J12l80K97J08
4387B44j79J20J28j19k33k55M56k50N06m48p8j23L29J2r0J39k4J05n01K31L33
4408C03l01M6K48j99q3K0L2j95J20r4J7J50j58K46m4oo6k9J59l0k71o5K50Q3k76
4433a43K17m3J70k89K95l15J56J33k19J36K3L07m11j83l2j3J19j0N5L5J53O6j24
4456H3j58M21k74r1j9R1j39J03L9k59K54r4j17J93k68K43j86K80j38k7L6k52M18
4479A39j42k06K47J11q6K27m37J36J88k02J15k55j90N68l28M19o14r7P59k60j23
4500c1J19J26l36J5J78q0J57p1l1L7j0k30R0J1Pk62L45m93N75j39M6M59l67P2
$$ y = [-16, -55, 56, -293, 337, -143, -323, -243, -267, 105, -105, 117, -265, 30, -196, -76, 189, 199, 92, -362, -211, 6, -179, -33, -78, -297, 208, 22, -155, 49, -158, 122, 78, -43, -65, -225, -61, -31, -163, -124, 107, 219, -161, 136, 244, 65, 185, 313, 194, -39, -294, 162, -88, 418, -30, -108, -231, 98, 110, 20, 159, 135, 240, -261, -30, 303, 2, 48, 296, 97, 14, 34, 66, -129, -9, -103, -86, 64, -94, 152, 108, 102, 36, 7, 166, 136, -135, -200, 50, 133, -143, 74, 31, 201, -88, 207, -108, 48, 181, -38, 98, 121, 428, 17, -166, -198, -211, -92, -102, -47, -12, 141, 207, 83, -75, 346, 72, -19, -38, 53, -86, 17, 56, -203, 51, -43, -160, 33, -235, 8, -178, 102, -36, -63, -27, -279, 139, -3, -209, 38, 149, 63, 290, -147, -11, 177, -25, 90, -165, -355, 213, -115, 304, -310, -407, 352, 92, -31, 88, 214, -122, -107, 71, -9, 148, 77, 46, 83, 73, -157, -67, -56, -49, -311, 34, -459, 116, -23, 23, 482, 115, 187]
4524A87m8l16L74n4k30p5M51l45J56k33Q2J37q2o6n8M53p8m03k99J56J91j74Q9
4547a85J83J02k30p0L99j32k00J56k68J69K8o4L77l14k8J13P4J39k79O6K7J55
4569B18l07K55k72K45m5j64O5l11K16K75p5k01J38k68K91l3J37r2m31K22J99K82
4591C44m11J10J05p3l52K66L47l54K51l3k36Q1l8k27J17K22k68K29j89K33j46
4612b2J67J89k87j68j28J56J97K07l12K53j85k87K4L23R2l25N90k64k27pl30K81
4634f3Q2L46l96L3l5j07M87k92o6J71J20K2k31J36k13O9N6j02k13J71J8p0j88
4657b65K14K99m28J02m5L3N6j14q2J51R6j7k24P7J32K89l32L69l07m0q7K34k3
4680H8k67J24R2m9J57k85M35o5k87J10j12j22j19K30k01JL02j94K07O4P6j03l29
$$ y = [187, 139, -177, 197, 143, -87, -162, 289, -56, 100, -133, -51, 86, 4, -62, -120, 333, 255, -148, -447, -291, -100, -274, -185, -2, 100, -130, -200, 199, 67, -133, 23, -245, -76, -48, -112, 265, -49, -77, 36, 110, 249, -30, 36, 63, 218, -89, 166, -106, 139, 94, -70, -5, -316, -100, 175, 100, -101, 37, -231, 60, 27, 164, 72, -359, -137, 62, 344, -67, 43, 148, 75, -277, -11, 336, -18, 233, 200, -36, 45, 7, -220, -103, 119, -149, 80, -109, 124, -22, 145, 334, 47, -121, -249, -93, 104, 311, -1, 252, 67, -220, -196, 127, 219, -106, 484, 220, -7, -14, -344, -63, 19, 365, -31, 2, -33, -140, 347, 55, -11, 160, 280, 302, 71, 207, -6, 63, 119, 17, -196, -25, -7, -77, -265, -51, 248, -180, -78, -123, -90, -34, -148, -230, -79, 17, 0, -224, -147, -15, 274, -58, 311, 4, -36, -123, 111, 88, -179, -55, 37, -12, 145, -140, 295, 230, -57, 53, -59, -181, -300, -70, -271, -270, 32, -162, 45, 109, 185, 82, -247]
4703b47L00q1j75M31l38J28P4j65l2K0K28k73J31J80j81J55L2mq7j54k22M66l28
4726a42J29L57n68M01k99J88j65q9K51K14l03r4K51l21J77n9P0r5Q1J63k99J76
4748B4K66m9l01R5o0qL00k25K0k44J29J6k53L74k87m1J71J58k85N6oQ9L4M02q2
4773B93k77K22j25j39J93l07L88nj70J01j83O8n2K0m7Q0k29K98n9k96M61k00P
4796D2l48O4J2K63J12m28M10L3l08J65P3p2j2kJ20oj91k9j14J35K24q7k0oK22
4821B52l9k26p4K49l0N3l23K18k60K20l35M49n80L44O7L0J00O7J1k18Jk06M20
4844A90l4m6j91k08M12j74J48m9K9j80k6K11p2Q3k93m1K52Oj3q7Lp3k8M33k54
4869bK56k88j07L19P4l15K62p2l24K58j30q0p2M33k58j81M8L31j32J48l09K05
$$ y = [-247, 53, -28, -203, 228, -110, 18, 92, -73, -105, -85, 143, -130, 1, 181, 0, 155, 187, 183, 96, -58, -280, 186, -142, -13, 344, -224, 177, -122, 66, -99, -188, 63, 277, -26, -120, 131, -190, -13, -72, -2, -97, -16, 147, -152, 24, 290, 241, -60, 35, -25, -33, 267, 42, 62, -182, -53, -37, -290, 84, -203, -244, -73, 85, -200, -144, -150, -61, -27, 375, 293, 16, 238, 113, -26, 167, -140, 248, 243, 73, 174, -9, 59, 7, 27, -20, 60, -169, 129, 70, -226, 235, 35, 42, -306, -242, -230, 33, 145, -283, 127, 160, -148, 17, 90, 18, 6, 4, 124, 118, -73, -102, -216, -81, 143, 56, 36, 30, 252, 213, -13, -87, 162, 132, 185, -138, 80, -180, 40, -295, 154, -426, -82, -15, 15, 115, 182, 193, -25, -24, -230, 190, 156, 110, -81, -289, 123, -51, 97, 48, 77, -103, -129, 82, 10, 93, -200, -241, 11, 17, 4, -83, -80, -153, -181, 252, -2, 254, -34, -141, 178, 252, -63, 199, 127, -197, 61, -69, -149, -221, 212, -46, -227, -179, 152, 20, 168, -141, 64]
4891F4k14n4J22p2K07l5k13LK52J98k03j42J20%Ql2p1j61K35j32K26L6k57J68
4915E3J1K3j48M31l51m4l0l2J63Jj20N09o53L74j22j18j37K47m08M14j96L3J94
4938I4k44o8p9M99q1l2l72M99j56o8K04l13M24k60l86L16m6J71k38K05p2J86P3
4961B56m21K78j95J17J72k35r6K29j51K8k54J59L11P0l96J37J0M3q4N2l26K57
4983c9J42P9l13J88q5L5J01O6m3k57n2L51l35J73l17M66l9n19l3N21k11l6K71
5006A14k97r3J20K75k75J19J39m9oj14L15m07J70j4J98j80J85l62Po8J03M85m93
5029a28J20j21K77j94N7M4j60k0K42qo1K96m14n1k27K30M09n45J42QK41J9j83
5052b7P3k65M12j98K4k53K36K05k14J51k09k4J6P0k21K55M4J6K16j03K2l5l2l4
$$ y = [64, -150, -204, -82, -154, 53, 18, -195, -192, 60, 258, 55, -87, 33, 33, 41, 9, -62, -223, 12, -120, 106, 142, -115, 53, 64, 87, -61, 370, 19, -25, -55, -87, 76, 77, -43, 466, -187, 187, 65, -53, -190, 57, -351, 63, -133, -100, 94, -150, -218, -297, 202, 121, 89, -283, 216, 60, -8, 196, -117, 307, 47, -339, -23, -69, 102, -136, 69, -3, 183, 256, -165, 113, -82, 35, 207, -28, -124, 105, -46, -18, -272, -113, 198, 268, -128, 9, 19, 62, -22, 30, -296, -39, 103, 182, -131, 57, -28, 7, 108, 174, 131, -126, -178, 173, -162, 11, -306, 160, 121, -398, -431, 90, -121, -157, 114, -183, -276, -156, 119, -156, -37, 102, 53, 47, -67, 248, -159, 11, -3, 195, 15, 200, -162, -155, -223, -120, 365, -128, -8, -129, 148, -46, 11, 55, -105, -125, 117, 109, 48, 344, -70, -121, -348, -118, 291, -254, -112, -104, 137, 156, -27, 46, -219, 193, -5, 19, -234, 2, 207, -7, 144, -65, -89, -73, -3, -224, 31, 75, 91, 307, 204, 226, 191, 159, 125]
5076A25j91J15j22M92o25Q5K70m52M5L33j12J01Lk42J59K64j71j32J48j98M6j1
5098g0J3Q5k14L00k23J40l6NM1J11p0p8j93p1M42n5m45L47Q4p1N0R8l08P2K29
5123A83l04O5o6J65K66j78k22l01j18O42j00L02o53K59m7J2J77k74J38j6K53l2
5145A51R1l32j31L92JJ53m65J53K29R4k89J03J52l00p9o2J69N1K1j97j25L23r7
5168Fk43L04j40K26P5k24o5l9J08K32l49L33m83K92J47M7j45j79mM0J18k6J37
5191A68p0k15K54k6l66J97K5j31o5J56K68l41J56j27J12q4J07l22L30L9j30j8
5213h3n7Q6Rj35K8M4Q0nl8L47K3n13K56k19K06k5J55O4l45L55l80j54K18k54P9
5238b58J10K56j34j07j47k1L20k59N22o05R0K77j14O3J51m8q3O3j58K05k35L15
$$ y = [125, -66, 49, -73, 419, -206, -121, 149, -303, -258, 75, -37, 64, 67, -175, -16, 248, 77, -55, 93, -105, -59, -70, -57, 28, -186, 114, -109, 31, -5, 0, 41, 152, 82, 4, -189, -260, 182, 127, -318, 29, 113, 42, 92, 190, -118, -46, 183, -121, -56, -122, 43, 309, 131, -91, -392, -510, 132, 32, 334, -319, -60, -107, -95, 82, -192, -54, -70, 183, 151, 242, -90, -221, 171, 172, 325, -140, 13, 242, 336, 47, 150, 302, 2, -77, -139, 30, 81, 102, -95, -220, 103, 6, -237, 67, -73, 153, 228, 4, -61, -100, 8, 240, -109, 224, -259, 33, 180, 227, 82, -97, -101, -61, 57, 31, 168, 98, -117, 137, 111, -255, -58, -33, -164, -229, -73, 195, -146, 10, -117, -5, -89, 18, -304, 26, 65, -65, -83, -140, -54, -45, -180, -152, -108, -28, -33, -71, 276, 299, -214, 42, -177, 29, 4, 159, 223, -122, 233, -147, -301, -83, -337, -258, -148, 108, -26, -133, -280, -301, 19, -240, 282, -323, -233, 44, -70, -7, 144, 96, 13, 76, -82, 123, -112, 203]
5260B03pj28n7l5k2J97kL6j47o3l97K61L43l08l6n2N0L30p3N2Q3j03M5J0q9j80
5286h9L13O2k40j5n6l84K03lj6R6n0K24q9r6J21O7J15j0O8l74j15M11l8k66K86
5311A25j2j26l42K53r3K32P9j92K92n4k7m0m20M56j89K5j92J78J37O1j54k11P3
5334a41K34j14l3r8J03KK4O9j07Q8p8K20m8J60j63k49M6l6M35n49J83J69l0k24
5358a37N20l35O5k48P2l7J36n3P1k6J55N8k00k0Q2m7Rn9K28m94M80k68n8o3J16
5383e3j02L45j11o3j00K58J52m54J25o4j18J18L89l57Q1J80k65j13M48l56K90
5404B30k56j39K34j03L28k83J12k2J5J7j06j3j55Q9k4j32K67q4q6J79MR4l92L68
5428A42k68J9kL47l79q7K04n7J18j02J80l47J58J24k56L15rK6k18j39K89K64l93
$$ y = [203, 196, 68, 11, -24, -46, 151, 149, 185, 38, -25, -422, -161, 182, -126, -162, -214, -164, 166, 93, 145, 228, 125, 170, 180, 91, -89, 224, 286, 46, 31, -25, -409, -206, -209, -225, -129, -179, 45, -44, -140, -19, 48, 163, 153, 221, -153, -268, 143, 105, -161, 125, 113, -13, -355, -102, -195, 37, 116, -76, 216, 162, 135, 95, -325, 131, -58, -33, -225, -47, 90, 151, -3, -214, -141, 93, -21, -54, -152, -49, -47, -23, 46, -61, 27, -51, 169, 121, 281, 118, -131, -85, -121, 314, -235, -52, 117, 87, -137, 383, 48, 113, -135, -63, -100, 36, -17, 54, 28, 183, 241, 41, 21, 103, 56, 65, 6, 234, -260, 220, -48, -106, -169, -53, -155, 190, 79, 16, -84, 174, 326, -128, -3, -67, -185, -67, 322, -35, 46, 226, -39, -152, 296, -60, 230, -26, -165, 69, -34, 294, 11, 123, 101, 116, 133, 27, 14, -141, -52, -76, -208, 59, -25, -111, 68, 72, 166, -226, 142, -126, -107, -109, 238, -141, -228, -24, -81, 37, -65, 115, -232, -74, 50, -206, 109, 100, 126, -92, -231, 58, 322, -71]
5451g1J74j42K27k57J88l14j56L30R9m4k73J68r8J63k86N23k42j72K91j97Pq2
5473a64K86Q2K9o1l54P5L07l71K3j46J27k05L86k72M14k67J95l42L50Q8j95j29
5495a44Q0r5O3O8j59M28k85M4l4L9oJ65j32j42K50m80L09K01r5r5l55M72J06j91
5519A2K7j89P9j09L97o9n17L75M1j18j99J97J15j21j29J5N4K16k87M71l55l2k26
5542c52M70l56R1L87j06k51M8l30n1N14P5j32P7k64J34J66R1j66L7n3M9k49L0
5565a41K91k54M3l69O03m55M43p3r1K2O4o5K70k25J19R3l70K57k14L14n26M31
5587A67k95L21l34K65L1j04l46L87J1k18L6L43m40J36J48j80N1K37j44q3J09l0
5609F8%l26J92J58j35L8k92K84J63k47M11m14J55k61J2K50k43M55m21J35nk6L8
$$ y = [-71, 103, -39, 188, -69, 119, -195, -351, -21, 78, 34, -239, -71, -169, -6, -292, 231, -11, -183, 108, -89, -82, -164, 122, 204, 233, 172, -182, -107, 200, -171, -148, -294, -167, -372, 14, -258, 156, -111, 84, -258, 92, 180, -15, -144, -64, -159, -96, -28, -187, 241, -44, 0, -34, 5, -1, 164, 32, -110, 140, -340, -31, 170, 75, -20, -375, 97, 203, 12, 39, -150, -71, -180, 217, 148, -369, 6, 47, -71, -270, -73, 42, -79, -208, -193, -139, 77, -210, 261, -94, -126, -352, 118, -238, -147, 240, 134, -117, -69, -399, -450, 64, 139, 7, 84, -180, -46, 120, 211, 45, 82, 29, 78, -171, -141, 150, -104, -61, -430, 173, -282, 161, 88, -3, 19, 83, 18, 288, 63, 182, 275, -95, 162, -52, 262, -264, 167, -128, 193, -141, 124, 155, 51, -295, 92, 103, -115, -79, 264, -176, -40, 108, -72, -21, 216, 72, -11, 98, 68, 68, -258, -66, 92, -43, -5, -297, -13, 150, -97, 314, -100, 55, -206, -194, 56, -187, 268, -153, -18, -23, -49, -11]
5632a1J80Q8l03q1L62n01M35J95l67j8J88k94J44oM2j61K16L5k22L35l4m98J27
5655a49J76k1o6K27k97K30J86l94kJ19j51L0K26lJ64k97k54K45L55l30J13q0M
5678C1l57J04L68J90m08j0Q4N3j11K17k02l56K19K31j35n3rL0J99J01j32k93K61
5701B2j56K76j78nJ98j35k56K83m6J13k81J60j82N77j24k83M2k33K74l60L61l20
5723b53J17K91r8l30J27p3J72M16m95J15K23k22K10j93kj33L5K21k38K56q2J23
5745A87k65j33J67j2n6O2J71J3l32K49p2q5J77k3j69J20j20N55m65j13R1J60j25
5768a8m5N1j9J0nJ94K9j70k60J5J88J95j69m4Oj49L22j55p7J0k8L1jK42k54K61
5794A60j74j30M8K13m54K17R3O5j6k5k02K21K16j02j82K20J22l00o9N4j50K97
$$ y = [-11, 169, 257, -46, -127, 235, -266, 169, 364, -3, -21, 167, -127, 17, 11, 53, -108, 108, 143, -79, 256, 222, -276, -149, 27, 6, -60, 167, -130, 100, 286, -108, -110, 9, -142, -112, 114, 111, 275, -22, -276, -31, 324, -6, 107, 27, 31, -326, -222, 146, 336, -72, -82, 2, 55, -56, 161, -41, -397, -178, 53, -82, -135, -144, -114, 85, 186, 54, -239, 22, -134, 142, -36, -41, 157, 22, -234, 49, 3, 116, -165, -5, -187, 390, 266, -17, 25, -208, 66, -294, 67, -253, -136, 155, 57, -273, -146, -219, -47, 369, -126, -11, 212, -10, 200, 7, 5, -128, -93, 128, -110, 146, 64, 187, -78, -211, -44, -56, -112, -50, 121, 134, -198, 51, -21, -106, 71, 48, -121, -1, -121, 434, -31, -144, -53, 107, -18, -63, -12, -31, -21, -26, 168, 197, 27, -233, -218, -30, 165, -4, -48, -42, -191, 131, -24, -101, -91, -119, -88, -89, 153, -101, 160, -14, -144, -96, 117, -337, -120, -27, 38, 22, -3, -205, 16, 232, 130, -52, 168, 290, -10, -79, -25, -175, 122]
5816A22k05K30Qj78P2L4m0Mk40M3J89j84M86n20J65K99l39m1L41m85J22P1o1K19
5840A12l3N4j44j94J85M06m23Q1Q7Q0j38l4J89l24K77k30k5J88J9k43o2K27K03
5863B58J55m26Q4Mj89j01R2j17J6K79k13J43J45P7N9l63l5L54k40K73m86K00J69
5886A38JJ33l33R1P0%k22J06K71k1k2m05J11k03P5L24j28j94K80M0L15n08J44
5909F3j81l5O3N6J49L43n25N7J90n51K21J75m8J00N5j70L8K1krJ76k42K7J30p7
5934B4j37J13Mj47K11J32j60k11K2LK94q3k38P2r0L63l94K2K03k62L87l46M22
5957B04l50J3P5q9M5L30k04k61L18r6J53l09L40j09l20K89L40k26M3P1k09N4j09
5980gJ22rl1r3L5J11q9K4J65l84L98m46j11Q15m85k27K79J20J4k78J45J70j68
$$ y = [122, -83, 147, 155, -23, 49, 83, 43, 47, -193, -150, 39, -145, 341, -179, -14, 285, -54, -95, 246, -239, -117, -46, -107, 112, 79, 133, -11, -205, -20, 386, -37, 44, 131, 211, 73, 39, 228, -96, 181, -49, -74, 114, 133, -110, -172, 55, 258, 413, -13, 71, 75, -114, -215, -123, -240, -224, 55, -158, -15, 130, 207, 266, -97, -132, 222, -18, 255, -231, -31, 138, 139, 272, -61, 30, 100, 100, -122, -16, 255, 234, 212, -193, -82, -285, -210, 114, -14, -208, 72, 112, 427, -81, 63, -118, -153, -90, -34, 115, 458, -67, -10, 180, -371, -150, 25, -23, 77, 132, -38, 0, 21, 19, 10, 186, -56, -29, 101, 24, -113, 0, 4, -143, 68, 200, 40, -171, -149, -146, 148, 65, -173, -101, -191, 172, -222, -200, 3, -259, 128, -218, 204, -146, -133, -58, -147, -102, 228, 24, -237, 81, -15, 138, -171, 169, 60, -260, 29, 369, 143, 186, 257, 48, 102, -7, 115, 106, 75, -18, 17, 128, 39, 63, 228, -156, 242, -204, -315, 500, 15, -212, 67, 187, 201, -77, 68, 238, 70]
6003G0K72n32L45k12R8j15o6R4M7J81k72%qK58k56L1O6l68L94J88l30J28O2j32
6027e7m9N2M2O8k18J89m1P1J26n2j42n7k0M98p24L27o0qL5j80L24j99j2K35k0
6052A28j73j68P7l9j29K77k04K44L46k84K7j37p1R5n0Q4j44oK27J62l04j9m4o0
6076a65K69K01n46K52k13K53R2j73j52J68J77j75J60k94J31J7mk64R5J40J28k25
6098a28r0J71K02l10K94m6L0k2k42K02J54k38K16k76J71K47k28nj33J01J38Q1
6120B89l47Q4J32k03l2L30k80P6j07L41l27J08K76l85O5j08k03M92l05Q5l52N34
6142A63K0j82o2J46j19k3K95m14j78K25K18J46k14J05k78O2J12J5L5j03K20m94
6164c05L34m85J89j61M70k39K37J93k03j87P5Q8k9J36j77R7j66M9j20K70m09P8
$$ y = [70, 342, -190, 155, -57, 41, -74, -140, -46, 1, 182, -90, -90, -98, 160, -96, -65, 1, -367, 27, 215, -115, 13, 75, -57, -106, -54, -12, 56, -162, 27, -14, 57, 183, 131, -11, -68, -88, 410, -314, 13, -47, -55, -20, -200, 124, -75, -87, 148, 128, -45, -213, -136, -175, -304, -27, -231, 13, 359, 75, 102, -35, -106, -11, -61, 23, -121, -127, 100, 262, -42, -61, -105, -165, 104, 305, -241, 11, -202, 51, 143, -30, -182, -14, 163, -12, 148, -146, -15, 2, -2, -266, -171, -31, 97, -128, -218, -47, 155, -155, 139, 93, 123, 101, -141, 61, 215, -23, 193, -83, 88, 335, 107, 102, -31, 70, 208, 289, -58, 26, 158, -45, -77, 253, -27, 49, -58, 283, -44, 64, 340, -45, 20, -88, -291, 201, -104, -19, -371, 163, 183, 1, -61, 85, -34, -57, 238, -176, -354, -129, 89, 235, 21, 126, -152, -90, 22, 37, 72, -31, 189, -305, 29, -456, -267, -428, 42, -197, 40, 233, 30, -157, -82, 6, -23, 113, -64, 33, -133, -84, -204, 66, -343, -265]
6186b65m3L13p4o8K95j28o3N6L5q6K3L4k94K78k39j1L10j31r8L12q0k26J54K39
6210B43n90K69Q2L08l05K78p21N64Qj84J58J05k92J98Q8m60Q9J91J05j11J11m75
6232c41K61O18n68k70L33j04LK19j22j26m4P4J00j7K6K4k35k5J10L21k53J86k17
6255d7j29L33n0P5k54N8o0R3K00m00K81j45J15m52K70K60k46R1j10K63k2l18o7
6278b61P34j15o17N71j03n62M67k7N3k7J65l21n4J50r9Pj7j07L92k18K72k61L03
6301C25l23J53k34O4P0o2k26M05j81j52K85j52j61L80k45j01j67L86j15q6M13
6322B76l86J30L2j46QJ76n4l72K85nJ10j4l36K10k19M16j22J43k35K49k6j43J10
6345H7p6J09k29L93k61N4l29j23J55K95o1l37L46K65k51m4J02K39j28k96N5M5
$$ y = [-265, -308, 5, -69, -137, 158, 30, -33, 23, 58, -28, -5, 29, -265, 13, -226, -237, 73, -58, -156, 156, 76, -150, 4, 243, -347, -78, 4, 312, 7, 285, -436, 128, 136, -48, 110, 215, -77, 121, 209, -251, -162, 29, 134, 23, 134, -341, -80, 538, -30, -300, 33, -71, -68, 151, 29, -97, -141, -67, 33, 16, 42, 66, -169, -194, -84, 237, -16, 170, -47, -176, 157, 107, 182, -72, -14, -74, 19, 219, -181, 100, -45, 70, -382, -112, 148, -98, -7, -117, 146, 124, -194, -261, 473, 358, -259, 312, 209, -353, 114, 87, 140, 113, 278, -43, -97, 53, -46, -39, -56, -163, 229, 11, 283, 22, 325, 2, 155, -79, -15, 55, -7, -233, 172, -9, -161, 124, -28, -189, 191, -54, -155, -322, 64, -51, -137, 276, -110, 20, 52, -94, -86, 90, 36, -336, -51, -56, 54, 40, -296, -86, -305, 111, -11, 132, -103, 146, 120, -23, 87, 11, 120, -109, 284, 23, 77, -252, -375, -220, 75, 14, -323, 23, 288, 37, -7, 95, 334, 206, -90, -35, 10]
6367A0j45J88l08M9J0K63j05L0j46J21O7J21r5j50j05J41K68l94K02j10O1k08
6389b35L55k44J44O7k43K80j10p8o9K81k45L39q9L2m41N29m48K65J20l93P3mK45
6412A31j03K2j85M7J05j76K70R2l89q4j8M65k08l62K68K25K5j33J0K04l25n9%
6435a78Q7L64j80P7j95r0L81j49k6k92Q6j48j47M88n1j16J37k17K68K49j20k8
6457B00Qj67K09k43J9J82m45M32R2k29p7P6j67J16j39J49r0J48p8j56J53O2J84
6480B39j91J82m17L35k45Q0J35J62l16j94J43j34K33Q3k99N6O4N0J32j01lJ4j21
6503a13O1J85j32k50L08k99J62N4j8K09j74J20P7l38Q5J59j20q3K41m3k91K78
6525G8J1j50J31k8m21m4P85k67k15J61K54k83j27P3Q9K73l37K20j77k56j19J41
$$ y = [10, -135, 53, -255, -206, -196, 67, -38, -8, -154, -33, 34, 155, 60, -90, -195, -54, 214, -180, 22, -88, -27, -235, 120, -124, 20, 87, -156, 124, 14, -64, -133, 148, -97, 242, 153, 185, -256, 273, -175, 90, 210, -183, -110, -114, 131, 28, 50, -135, -88, 17, -159, 111, 203, -186, -270, -288, 177, -31, -393, -125, 100, 125, -8, 2, 206, -119, -178, -178, -91, 273, 93, 170, -25, -115, 266, 117, 91, -201, -115, -263, -410, 78, 27, -89, 48, -169, 99, 348, 228, 200, 208, 41, 250, 7, 26, 208, -237, 195, 287, 58, -19, 57, -110, 6, -133, 16, -74, 74, -4, -160, -7, 55, 239, 48, 230, -187, 148, -97, -17, 118, 280, -36, -230, -87, -221, 12, 95, -204, -148, -84, -34, 98, -3, -6, 8, -113, -52, 133, 1, -249, 59, -240, -78, -24, -42, 167, -7, 113, 190, -148, -63, 96, -24, -107, 134, 91, -200, 78, 89, -61, 70, 42, -379, -423, 362, 95, -120, 41, 295, 12, -115, -42, 47, 320, -17, 203, 26, -230, -349, -208]
6547b08J52k44L11K41l92J62q5j64J07L20l1r0O3j67l95L85K19k99J24J55l02
6568a38R0L6K24q9P1l55J07j43L42jl18L62k1j49p4K83o1N1l29J06K22k16J57
6591A57j70J86k16k1p0J79K61n35J5K47J11p0j6J49k24K52J7l66Lk29L24J93Q9
6614B66m77J16k37L13j53K44J93l84J54R3l8k2q6l97M23K43j98j73L37j52k73
6635b08M13j00Op3j02j11J10%K18k42M10m05K23l12K1J12K64k43OO0m4n3J37j12
6659b5j51L95k56J39l37K58k32J18M1j30j3L94l17L51j59R0l42J26J77k91J32
6680c2n9L04k68L24l48J10Q1p5N5k88P4K49l05Q8J70m34N62l26R7%p2J63p5r4
6704i9n2k24P07l19j78L3L19ql33L74l00j3k44M61o35N23Pk36L17q7NJ6J31j5
$$ y = [-208, -56, -300, 11, 252, -140, 22, -63, -227, -120, 200, 169, 79, 142, -25, -420, -35, 184, -115, 9, 164, -138, -48, -12, 212, 123, 194, -161, -54, -197, 145, 144, -174, 188, 167, 18, -56, 227, 166, 217, -112, -6, 216, 0, 157, -13, 173, -43, -64, -134, 45, 306, -229, -214, 33, 144, 74, 58, 207, -17, 235, 252, -114, -111, -340, -16, 177, 266, -211, -95, -332, -19, -172, 72, 265, -119, 35, 128, 90, 68, -18, -415, 8, 251, 53, -120, 217, 65, -208, 205, 105, 111, 38, -64, -175, -65, -65, 153, -89, 321, -84, 139, -173, -152, -40, 224, -19, -13, 47, 3, -50, 87, -25, -176, 219, -37, 102, -235, 23, -209, -91, -50, -180, -193, 201, -116, 235, 76, 166, -176, -50, 127, -164, -32, -91, 213, -55, 269, -79, 31, 112, 37, 92, -196, -122, 127, -178, -90, 80, -354, 208, -118, -21, -21, -93, 70, -5, -99, -151, -375, 332, 13, -165, -132, 187, 179, -154, 220, -80, -93, -337, 124, -511, 12, 19, -217, 100, 13, 18, 34, 165, 150]
6728A50l65K05J31l59J40OO4k8p7P4J07m99M76r0k32M40j37J31j09J05J71r2l56
6751a44L51l97J43K73j65k87K3L14Q9L2l74J93J34k38j74K68o9j44J89K60j24
6772A53j23j57J44O7k04j8L40j02k43n1J80M1l61L30M7j13j09R3N9j87K44J18
6794A48K37l11r7J6J06k21J60J78j64J48o3m76K59R3j9J05j1Q3k94p4L62J53l61
6817d3L5J06l03L2J4K32J0M6k25K58M9l39n6N78l45n8p7K17k60K82k01j58K85
6840G9O0l2P3m19J06K81j23J95k37K69l39K13k32K40p1j71K3J88j94N1P8J48l98
6863b12L14n2OJ41k01J07j30O8P2K2Nl10N6J00j49J85L2o8J36Q5k91J75J03R3
6887B87l97J59m58N20j25j81l7J81Q4L2N5k53r0L9J99j22K8K35o0j13m29L15J85
$$ y = [150, -215, -10, 121, -238, -98, -92, -28, -56, -133, -59, 48, -451, 25, -65, -297, 143, 6, 137, 28, 133, 304, 212, -144, 207, -190, -47, 226, 61, -226, -203, 111, 200, 232, -142, 51, 185, -53, -227, 41, -28, -172, 17, 277, 153, 30, -127, 17, 84, -120, -138, 202, 100, -143, -194, -14, 27, -334, -4, 43, -70, -179, -86, -27, -214, 30, 148, 385, 74, -23, -7, 99, -122, 38, 216, 52, 200, 137, -339, -80, 13, -6, 99, 88, 171, -123, -197, 165, 318, -43, -8, 98, -205, -173, -159, 73, 83, 129, -96, 162, 211, -128, -184, 394, 49, -9, -86, 131, -129, 153, -48, -206, 79, 139, 107, 180, -239, -133, 148, 25, 220, -17, 252, -87, 126, -106, 134, 63, -108, -85, 103, -91, -40, 38, 186, -212, 102, 50, 56, 197, -4, 103, -27, 41, 113, 135, 140, -170, -114, -14, -163, 22, 54, -14, 122, 207, -84, 91, 194, 287, -110, 49, -409, 111, -14, -195, -232, -51, 33, 65, 120, -133, -223, -184, 15, -107, -79, 156, 96, -17, -446, -131, 54]
6910E4m3P1p2j33L63k16J07p3O2k31J61k9j5j11KL34k68R0j54K43k37L53j27l04
6934a73R2o1m9K60l49M6J29j16J85M2o1LJ10L4L9k42M42m45L26k88L13J3j79k02
6958a31M41k63l73K69J02k03j50L64M5j10q8nJ87J77K47o68K59j80K24Mj69J12
6980I1J5L6k45J24n3J36Lr9K02O6j23m23L53m61L52J13J06q5l10k8J19L48k34
7003CK6j44J26L30o50J72Q3Q5P9r7P7j0j84L65l19j98M02l78K00R6k86K83L2k40
7027a47M19p95Q10k08k9J85j36l54L47M4K5P2l37m6k7J06j14K71j88J01Q3p4O8
7050G6j11k7j66O5r5J83O0j54L22p1L5O0j6l57L06j01N3J13O3m79J94J38r0k88
7074b87L93k65L16L10o26k59L65J35J75j92q6J41j57O5j08K48l16j60K48Mj62
$$ y = [54, 11, 82, 10, -123, 240, 24, 131, 58, 120, -111, 50, 21, 6, -105, -103, 231, -37, 53, -101, 142, -95, 258, 131, -173, -81, -142, -191, 69, -280, -234, -105, -221, -36, 6, -55, -52, 58, 92, 131, -111, 331, -114, 212, -76, 237, 250, 71, -131, 310, 47, -326, -57, 45, -158, -308, 56, 101, -9, -97, -102, 85, 262, 509, -159, 100, -80, 144, 148, -21, 91, 106, 142, -103, 21, -32, 104, 107, 8, 210, 276, 153, -270, 83, -378, -26, 87, 193, 108, -202, -230, -111, 237, 3, 29, -115, 11, 341, -309, -137, -54, 31, 110, 13, 90, 80, -104, 261, -58, -256, 146, -232, -32, 64, -222, 61, 93, -147, 272, -523, 287, 79, 50, 235, 99, -255, 92, 136, 161, 233, -104, -150, -177, -71, -185, 86, -102, -1, 82, 8, 76, -35, -62, -228, -163, -258, -75, -15, -169, 153, 82, 117, 177, 161, -196, 110, 9, 62, 175, 238, -241, -47, 91, 1, -287, 106, -159, 157, 467, -159, -418, -53, 82, 257, 65, -21, 120, -37, 28, -80, 168, -148, -308, -60, -56, -218]
7095b18L13k0J77l08Jj07J29Jr7M82j92J3K9l26J80P1q9M0nj41K41p8K72j34N5
7120B89j66m99L19j3O0l22K84j9N6K3Q9j1o6j37p1K69L0k07J69Ok73K06k48R9
7144a33J85j89K64j18K84m7m85L69K49n38P2M8q4K71j18l9K56k03L0J50j95J4
7166D3J57j69J36k16j11J93j33K80l57J44K63n38K80p7J10L1P0l2M81o13K58j01
7188I9q0k66J31L03j89k66K84N8m5K73j31k21j2J88l44K1k11O37m30r5J94R1J78
7211A67Q3m2l52K39k78j00N24l21J02M9k80M5k2K91j28k17J37K11k75o6L15j55
7233g3K02k38K0J69j09P4n8K29m05L54k56M07m51J38L9J27k05P9J41j88k9r6N4
7256g5K24K0j06k1k1j26J50Lj35p2K92m17L54k07J66j10J30Q5j51j70L3K08k65
$$ y = [-218, 95, 75, 252, -56, -55, -162, -33, -32, -129, 353, 161, 174, 203, -123, 57, 128, 39, 79, 74, -67, 174, 96, 368, 234, 289, 123, -376, -57, -70, -10, -332, -48, -67, -11, 12, 101, 90, 24, -113, -184, 85, 115, -92, 77, 83, -190, 16, -232, -133, 52, -137, 127, 9, 293, 246, -239, 130, 379, -159, -87, -39, -123, 148, 30, -9, 247, 44, 74, 224, 29, 43, 200, 31, 167, -49, -160, 33, -100, 180, -177, -33, 230, -308, -28, -105, 5, 36, 106, 74, 555, -58, 200, 99, 19, -247, -116, 187, -2, -268, 16, 74, 29, 302, 171, -50, -62, 126, -218, -197, -408, 229, -201, -296, -102, -11, 167, 250, 208, -144, 95, -183, -283, 241, -80, 22, 71, -209, -164, -186, 105, -23, -240, -103, 108, -167, -233, 82, -73, 129, -109, -89, 80, -29, 45, -13, 216, -189, 165, -91, 316, -135, 3, 42, 169, -36, 43, 184, -4, -33, -129, -75, 149, 169, 63, 42, 21, -105, 45, 48, -87, -159, 133, -284, 70, -137, 29, -81, 49, 134, -17, -187, -154, 54, -211]
7279b11K85j58J34r2M17J73p19K52l06J35K18k38K73k56k81M55j24J92L3k81K6
7300g3oL76n19J41J80n9q5J38K7k18k72K60K91l18K7O3R5K05k43j31L02K0l9l08
7324a46J12M30l94O9j96L08k86K1j05J11l5K25J70k51J57j68L6j76L21j81P0l33
7346b41K31p5J48l8j71P6j2L41Ql82J10J69J66q4j50p4j94M49k76L6j46L6K02
7369A29j34pj23k65Q4L98M2k31L59j73r9k13L84k64M67m27Q8jj51j21K87J9N0
7392I8n2o3%J73K45j92j10k26K0K20j72Q1k31J14J77j41n5O4J43j31QJ22j1l3
7416D8m92M47j11J87M59l91m89n0M63M2j03k08K96M4j11l11M09j48J19l63O15
7437C52m54j56M45j49K70l38K5N8J13j09j58K27K2m31N35k65K42l87L15r7M3j78
$$ y = [-211, 74, -84, 50, -42, 375, 548, -171, 81, -225, -90, 128, -110, 163, -93, -374, 81, -43, 149, 182, -99, -73, -79, 297, -222, -81, 99, 40, -45, 93, 120, -98, -370, -110, 181, -137, -110, -47, 48, 253, 10, -121, 181, 201, 162, -146, -34, 396, 2, 71, -125, 183, -103, -82, -187, -76, -111, 114, 284, 33, 190, 22, 58, -118, 203, 22, 92, -241, -10, -85, 63, 25, -146, -70, -82, 259, 267, -115, -5, 164, 330, 246, 96, 22, -172, 277, 1, 37, -109, -73, 129, -5, -12, -135, -400, -316, 82, 124, -107, 252, 79, -20, -233, 151, -113, 354, -73, 15, 14, -137, -258, 29, 48, 98, 46, -17, -17, 156, 401, 209, 99, -127, -107, 113, -59, 22, -209, -95, 82, -59, -114, -50, 93, -38, -30, 92, 81, 48, -444, 3, -108, 79, 538, 147, -342, -392, 71, 113, 10, -198, 98, 142, 31, -280, 129, -19, 100, -263, 352, -102, -258, 187, 38, 308, -30, -5, 53, 166, 57, -101, 126, 148, -283, 252, -13, 229, -158, 157, 60, 103, -75]
7459g5K67m57K06J8k6p1m7j25K66J66J7k78J18J25j47L26k62l06M49k29J88k71
7481a48L72k79O1J20j27rPJ62J5k89J0j41K19Pl2n1J48k8l5O7k1K82n50M24k37
7506e3j26N8K61n18L89j48J74R0j99j11n3K75l13N62j18j49k8J6j02P2L19K8l00
7529B6l06L13J6k38J7K99l0k86K01k17n4J91n48O85n4J45k28L1J50J8k59L81j90
7552F3j69J42j19L2R9K02m22Q6J69J85k89q5J33K52p0j84p2r3K43J48p5j70L08
7575C14n62M1K59j40N6J48J0k60L40k45Q7K08l06r8Q7K55j73m28L43M9m3j25M18
7598B35k4N6l1m75K24k13R9N0J28nn6Q1j47J92k73K35K5L03l47m1j32r2L39l34
7622b03L86j69r1J48J41pk65J17j66O5j37K21N6K24m79QO3J25k01Q7lJ84K25n52
$$ y = [-75, 192, -265, -59, -41, -67, -138, -185, -310, -44, 122, 139, -139, -21, 104, -43, 283, 21, -285, 164, -65, 123, -148, 224, -55, 6, 126, -1, -10, -3, 159, 174, -115, -105, -246, -27, -20, -52, -103, 45, 17, -18, 49, 28, 310, -240, 184, -53, -179, -121, 140, -378, 11, -137, 37, 127, -72, -183, -236, 39, -274, 288, 170, 21, -7, 9, -93, -21, 298, 326, 26, -280, 33, 49, -189, -172, 127, 97, -189, 12, -205, -259, -68, -616, 69, 15, 160, -68, -37, 113, 131, -128, 253, 63, -106, 36, -83, -51, 48, 250, -172, -86, 83, 268, -21, -106, 27, 279, 209, 25, -47, -140, 103, 251, 176, 6, 314, -248, -207, 52, -88, -32, 116, 126, -134, 206, -39, 48, 256, -50, -148, -61, 194, 21, -407, -64, -15, -58, -183, 235, 211, 267, 236, -239, -15, -228, -129, -79, 49, 44, -12, 69, -78, 114, -159, 76, 101, 404, 57, 16, -116, -208, 131, -203, 183, 14, -77, 71, 212, 205, -60, 57, -109, -44, -181, 40, 96, 320, -159, -151, -88, 37, -164, -77, -80, 104, 329, -223]
7646b23L32q5P3m92L28J78j52j05J39l00L09R8p6j08P7k01K46l06P0K22J6p9K69
7669B30k95o2O1p9L9K15l25J51j21o4L06q9o8p6L65l02J82l5j32j69M60O4j77
7692G9j63j5K75j57J57m01J91J50r3J44k65j99J95J91q3l4J98l49j35L58q2j18
7714a56L47j01j03MK72l00J00j20L28l15k1L36l68J13RJ11j41LJ74R2k52j18J49
7737D3K64o14K76N4m64N11j34J17Q3l04K52k29J42j49L68k96J19j39R6O4J46m80
7759b74J08k24M75k93K49l02K7K83M6p1j19Q5o9k09J21L8l5L5L66j70Nl2K9K20
7783B89l53P0j6qR9Q1j69J57j05j8J3l32j13PM80m8J1J95k53N8q7M4J14k34M4
7808g4N5j58J85j37L91l32l0L76m19J20p3j90J44O8n8K06k42K56k00m0K13n9J63
$$ y = [-223, 109, 24, 97, -395, -67, 111, -41, -146, -7, -307, 2, 100, 24, -84, -7, -208, 38, -268, -198, 24, 40, -39, 230, -65, -127, -66, -145, -106, 109, -216, -65, -186, -250, 56, -33, -101, -177, 188, -114, 68, 33, -99, -268, 192, 256, 79, -84, -99, 176, 19, 176, -225, -34, 116, 23, 167, -98, -297, -102, 89, 6, -28, 170, -179, -314, 44, -38, -156, 191, 90, -13, -9, 263, -37, 63, -57, 271, -44, -65, 271, -97, 16, 25, 136, -5, -2, 172, 264, 12, -106, 43, 307, -307, -31, 23, -441, 70, -64, 53, 136, -168, 84, -145, -3, -152, 216, -80, 39, -100, -4, 60, 206, -274, -166, -390, 85, -208, 41, -261, -234, 49, 95, 24, -95, -10, -79, -288, -167, -129, -164, -129, 237, 67, 72, 40, 69, 289, -64, 6, -10, -18, 81, 162, -7, 150, 45, 27, 40, -292, -405, -398, 82, 34, 45, 240, -13, 45, -42, 2, 116, -118, -74, -19, -177, 8, -129, 262, -70, -100, 276, -143, -23, -96, -286, -142, -74, -132, 74, -168, 88, -112, -152, 61, 2, 165]
7831A65ql21L60k79N2K06J20l4k74r3k24L23K77l47J68N8l4k85K88P5l92L28l6
7854I3j0J69j90j91O22p36L68L7j61j11K45j8k46K90k21K19k19j24J99j33K83
7875A65m2l70M19l16L4L60l68J58J58j99K51j09q5j77K66l91L61l03K04K12m47
7896b19J86kJ31J78l19J79j03K9R9k91kK99j8j41R7k93p4J87K35L24m29r0j22
7919a59K78p4j24o4K2K8J8J34K9m06L84j26J35K0l74N96n85K4L86j31j19K66j16
7942D2J60J05k16k6j81Q4l66M62j68rK61J39k35p2j2J01j31j02J46k13K3K89k14
7965a33K21J14j48J8k81k20J99K63L9j79J80J30K46l51o0r9j7K95l24oL49l38
7987a02L5p7J13J93J06l81j87L71K25l61k30L06J04L0k00K08k80M3R1n6j0r0J59
$$ y = [165, 157, -164, 196, -83, -31, 175, 295, 261, -13, -106, -330, -7, 270, -77, 91, 149, 115, -170, 118, 193, -199, 129, 93, 83, 252, 62, -129, 493, -243, 125, 162, 1, -110, 135, 117, -129, 161, -60, 159, -60, -184, 15, -118, 165, 123, -247, 172, -144, -110, 250, -118, 40, 198, -1, 250, 141, 56, -121, 145, -246, 115, -188, 16, 228, -219, -33, -35, 96, 274, -45, 134, 31, 60, 159, -132, -134, 165, 147, 6, 103, -190, -264, -77, 158, 482, 53, -37, -159, 119, 45, -79, -143, -121, -93, -75, 59, 88, -318, 66, -60, 75, 95, -279, 317, -268, -244, 142, 11, -108, 158, 42, 202, 307, 91, 65, -116, -32, -398, 64, -104, -113, 148, 287, 52, -20, -32, 69, -62, -164, -18, -231, -208, 81, -133, 88, 202, 54, 72, -209, -429, -230, 33, 72, -107, 73, 203, 449, 98, 38, -61, -78, 217, -107, -113, 236, -102, -67, -144, -31, 162, 268, -113, -300, 71, 296, -65, -295, 11, 115, 145, -55, 153, -127, -84, 7, -49, -59, -149, 10]
8010A0j38L03l05r8K89L02k91P5R4r0m25L97Q8J38m77K57j05m80N14M6l18J36
8032g8l8j59j5N63j21j23k1l14N48j79J7L1q3r6k9Qq0N1Jr5L71N8k08J6J51j61
8058A5P4l07L90j22j76Q2j34N9n3K34O3Q2k18j23J94q0J46l5P4l11Q0K1L16o72
8082d01J06M47k59K09P8j12J93l63K33N2k77m8LJ32M24n31J80o9j21J92j53L02
8104B17j45k36j17J39K97Ql21KPK48J63k18l37N26k67j52J91k5J91k50J10j33
8126a02K10n0p5PJ04j98J96m8j95j28K84J00J43l02K19k07K00p0j11j01r7K96
8148G5q8J48j72J64j54O8lK81k12o9K32k96R2K8J2P4j93K20l83Q6K72j31J55j96
8172A0L4k22K48l1J84l00J0M93q0m60K36j61o7K7J88j32q0j07J
$$ y = [10, -128, 175, -130, -228, 61, 363, 72, 147, 241, 151, -274, 123, 211, 349, -128, 129, 24, -456, 58, 104, -214, -78, -116, -275, -290, 273, 152, 29, 8, -306, 242, 63, 80, 111, 28, -68, -97, -89, -169, -118, -117, -212, 159, 217, 9, 25, 176, 15, 89, -218, 172, 50, -126, -44, -178, -119, -172, 62, 125, 207, -11, -134, 60, -20, 126, 91, 165, -146, -66, -45, 271, -401, -295, 152, -107, 102, 180, 68, 261, -102, 131, 183, -94, -142, -139, -7, 417, -114, 66, -3, -124, 68, -85, 217, 72, -164, -281, -142, 155, 163, -158, -156, -149, 99, 262, 44, -293, 233, -34, -186, 5, -20, 171, -79, 31, -102, 108, 58, -17, -10, 94, -104, 92, 44, -151, -279, 5, 105, 248, -54, 165, -42, 158, 88, -23, -124, -221, 75, -13, 135, -37, 127, -27, 41, 38, 319, 107, 38, 270, -26, 66, 94, 106, 180, -13, 207, -176, -90, 182, 51, 206, 10, 44, -178, 70, 39, 223, -77, -67, 426, 346, -114, 122, -39, -106, -79, 109, -23, -103, -210, -209]
8191b09
$$ Imaginary data points
##PAGE= N=2
##DATA TABLE= (X++(I..I)), XYDATA
0@%%%%%%%%JrJ6j6J6k4L2l2M0m9N7p1Q2r2J06j26J48j68J91k18K47k81L16l53
32a87L97m46M98n55O20o87P61q45R36j037J149j272J407j559J731j926K149k407
50a273K710l070L508m053M755n697P035r101J2736k1014P5781m274j20900L8499
64b4358K3440J3632K2835k9838q1243K7401P9246J9838l9726l3651m487L9152
76A2241L4438r513n5650l8237L5284N6684j7177m0641o192O276L4223N0317l5214
89B6839p1749J9924N3890l6j6922l1911l7137L4090O3143q420m4119k0488J2141
102b0755N0363L1653m7561n3809P379L4254K7301n989m9384k5153L8162M5382
114C1843R188l3291m1269J4405M8382N929k8422k9855j8507L1169M4827k0011
$$ y = [0, 0, 0, 0, 0, 0, 0, 0, 0, 1, -8, 8, -8, 8, -16, 16, -16, 24, -25, 32, -39, 43, -49, 57, -69, 79, -89, 102, -116, 131, -150, 166, -187, 210, -236, 262, -293, 327, -360, 401, -444, 492, -545, 604, -668, 739, -820, 911, -1015, 1134, -1273, 1437, -1633, 1875, -2178, 2577, -3120, 3915, -5186, 7550, -13464, 62317, 58043, -62857, -24358, -918, 12714, 35549, 5711, -75532, -48131, 31115, 50953, 11227, -22424, -26911, 12241, 46679, 37166, -18484, -56721, -21437, 35247, 18070, -22571, -28763, -22487, 11736, 62053, 26839, -44910, -24986, 28904, 28868, 11946, -19965, -57102, -23012, 40131, 31711, -12408, -32896, -20755, 29608, 61261, 13700, -40109, -32730, 1524, 28825, 22836, -26548, -51701, -13539, 31843, 41031, 7740, -33529, -19124, 29258, 35187, 6765, -23090, -41597, -10428, 34399, 14388]
126A4388m2001M130K0409K6069J9726l7089m4743K6811L9732p079k3006k4720
138b7373j0660L6277L8882j6980m0098r253L0182L7302m327m0783k5300Q013L1105
151F987K5954k6151m6658Q797M1423J7874j821k6001l3799K3242M6353j1487l7153
164a2440j3089J186K2829L0104j7874l7791O200L3473J7441r186k9134j6146J8445
177e982K4383n44k7471k5716J5970L8205O122k0301j7835o308K5501L3112k0256
190A8880m3526k385K0587J7523J0659k3313l4784J7258M2651O173j9971k1938
202a2186r289K1567K7388j1079l4162j2237J8338K7276M225k1646j6612P322K3745
215A2650J6947j8545l2143K712K3738Q087o451j8095j7762K0055L5043n874k7731
$$ y = [14388, -27613, -23483, -3074, 22995, 42721, 5632, -39111, -12300, 27432, 20353, -2653, -27373, -38033, -1756, 37126, 20146, -19952, -29205, 977, 38279, 33952, -6831, -32131, -24118, 6987, 32941, 6790, -39868, -31071, 10352, 28226, 26405, 404, -33395, -10153, 36200, 24713, -12440, -25529, -24343, -1514, 28590, 10716, -27075, -20875, 12598, 30039, 20853, -8281, -24427, -5982, 18401, 17857, -9614, -35330, -19360, 18845, 24967, 4666, -13169, -19477, 6024, 39136, 18880, -24646, -27031, -6444, 11079, 21738, -1575, -36359, -19101, 23550, 29723, 9752, -12186, -21475, 92, 27480, 16401, -17761, -29998, -11660, 15616, 19841, -1805, -18417, -11095, 12650, 29597, 11052, -21091, -18379, 5359, 13446, 6995, -11100, -28862, -8807, 26236, 20362, -7369]
228g369o989P744J8284J5934k0957l4593M443K8208J3415q487k2432j1789J9581
241e007K9027J973k5173k2247Q307K6039O863j6928k1654o469K1631K6526q266
254A4622k6649l158J5277J5007O879j8566k6869Q729K6514J475j5826j2874j951
267a7390J8785K2099q799k5696m668J7869J6405l634k1234j7629Q284K4371J1222
280A9985j8029k2169N986K3884J2974o812k2117j6339J5740K5662m601k4113j0526
293b0475O086J9780J6969j2951k4661K124K1338J0663p912j8741j2203J1433K0156
306A1606L76j8625j1694J0677K0125O750j3360j7238j084J7744J3272j2480k2370
319a6301l322J5842J6307K162j8273j5546J2641K3641K993j6697j7838k387J7933
$$ y = [-7369, -14358, -6614, 11670, 27604, 6647, -27946, -23503, 4705, 18120, 9633, -12799, -24588, -5007, 24020, 25993, 820, -21427, -13120, 12919, 19782, 2854, -18800, -25269, -3638, 22888, 14622, -12027, -15185, 92, 15099, 21978, 3412, -23457, -14728, 11786, 13261, -2565, -15439, -17390, 1395, 23494, 14695, -11001, -15669, 2200, 18605, 14971, -6263, -23892, -15608, 8763, 19985, 1956, -20213, -14227, 9657, 22631, 15819, -6298, -22637, -6897, 18765, 14164, -9949, -20475, -14389, 5391, 22360, 9409, -15252, -13128, 8210, 18873, 10961, -7780, -19983, -8550, 11606, 11982, -6643, -18337, -7660, 12465, 19215, 5855, -11383, -12467, 5277, 18549, 6069, -16301, -19623, -3781, 12526, 14688, -3585, -19131, -6490, 17151, 20144, 3447, -14391, -16778, 1155]
332A155J6760r937k2768m895J6046J8275K648j6283j5548N935K0158O769j5632
345B683j8066k65J5113J2352l695j6557p975J5582J8320l458j6683r158N341J3513
359G047P684j4871j9208N159J9659R329p905j4792n800J3603J8552k221k1794
372e558j3008R613J7024N057j1721j7223j46K0215J5743r475j8068m999J0628
385a918J4362J239j6984j5294P366J8217N218j0350j1798m66J5075J2525p814
398I378j7629l763J1416J0694k178j3545j0833P967J8628M113j3905j1265L945
411f977J3493R154o712k0198o449J5882J4318m377j3678q921O046J8220R105j4689
425D217j6890K670J5144P257o206j4507q631J0768J7665J33j5648p696Q400J1568
$$ y = [1155, 17915, 7978, -14790, -19685, -3639, 14636, 17284, 1001, -14547, -8612, 11546, 18315, 2683, -15383, -15648, -535, 11817, 8122, -8435, -16410, -828, 17492, 14034, -2649, -11807, -6466, 7047, 14731, -140, -19348, -14189, 5470, 14799, 6894, -7898, -13698, -95, 18457, 16236, -5558, -18566, -8953, 8071, 13128, 1407, -15816, -15962, 4253, 19996, 10521, -7547, -12546, -1918, 12444, 13683, -3301, -18595, -11229, 6988, 12206, 1856, -9942, -10408, 4667, 17192, 9378, -8251, -12014, -598, 10096, 7918, -5627, -16460, -8493, 10135, 14248, 343, -10922, -6977, 6516, 15670, 8958, -11240, -17689, -1807, 12511, 8134, -5544, -14465, -8419, 9801, 18906, 4217, -12673, -10003, 5141, 12398, 6192, -8315, -16946, -6178, 11487, 11620, -4028, -11724, -3324, 8244]
439H244M746p607j5745j750J5415Q501j0280j1570r29Q724J3047J655j5457r667
453a2673J0450J3667k1j1811j1859J52J3916J1121p969j5645k190J3817J2579
466A3534j322j3354j1171M713J6461L624j3314j2186J960J1502J0543j943j5294
479f247n094J2681J0646l297j0590q731K703J3275M210j1001j0059M051J1973
492D520P069n201j2070l449J0215J0617m006j4663o262Q095J1175L468q550j2219
506a1261K016J6939P172r897j1745l274P069J2759J36j6094q696R507J2014L472
520A0117o333j1424j184J3049Q465p721j2624k420P740Q760m83r046p493N609
534d988J3512K662j1405p147L129P406N681m260j4528k703J3902Q131m552q102
$$ y = [8244, 12990, 5383, -10362, -12112, 3303, 11804, 1524, -10046, -10975, -2251, 10796, 12451, -3006, -12673, -2223, 11444, 11423, -388, -12247, -12095, 1821, 12942, 4973, -10672, -12862, 955, 13534, 12212, -1142, -12313, -7600, 8861, 12485, -829, -13015, -11055, 447, 10990, 9047, -6247, -11341, 1340, 11986, 8689, -1901, -10632, -7929, 5346, 9556, -1445, -11504, -7453, 4520, 11589, 6388, -5682, -9131, 1084, 11701, 7695, -6968, -13230, -5135, 6040, 9508, 958, -11261, -9245, 7694, 14866, 4969, -6776, -10050, -2981, 9778, 9914, -6180, -14876, -5369, 6645, 10117, 3784, -7640, -8824, 4225, 12690, 4969, -7655, -10075, -2335, 6425, 5942, -3104, -10597, -4988, 8524, 11186, -219, -7366, -4237, 3169, 8850, 4590, -9938, -12641, 1261, 9392, 4840, -3262]
548c262n336M332J3826L799j4083j0516M493R740N898n034j2022l802J0470J2241
562A0744r95j2094o467N930R344K517o849j1682j279J3314O337p736o422r46M815
577a469J0630P67j3167o413Q743O674l47o134r108J131J2381O338p364r101k36
592f675Q690Q042k713j0804p147N366J1820J775j1025p244M010Q835O967k665
606G232j2661m183J1595O960m441o771o577J238J2185M234r583o677L960O666
620C177N046k986j0077k872P617P044l019r169l497O546Q011J043n610q086J454
635e378J1594L914r452p552rM710R099J98j2405n401R974P829q5m402q858q62
651g086J0791N545p551q863j238O631P978n82p242n163M113Q858K423q662o673
$$ y = [-3262, -8598, -4266, 9560, 13359, -724, -11240, -6747, 2993, 8891, 3857, -8165, -11967, -1497, 10744, 9749, -2345, -8812, -2882, 6462, 8979, 2130, -9552, -10831, 2483, 8820, 1084, -5338, -6284, -1469, 9161, 9928, -3239, -9652, -909, 5765, 5418, -716, -9824, -8693, 3688, 10026, 2662, -6439, -6675, 2015, 10057, 7344, -3460, -10607, -5241, 6579, 8354, -2671, -9915, -5905, 2930, 9897, 7232, -5429, -9612, 1983, 8943, 4502, -2269, -8846, -7608, 4577, 8811, -772, -7449, -3489, 3177, 8223, 5237, -4840, -7712, -95, 6949, 3930, -5239, -8736, -2190, 5821, 6864, 1254, -6832, -5378, 6216, 10130, 678, -6874, -6883, -2173, 6926, 7124, -5281, -10682, -708, 7121, 7036, 2634, -6224, -7086, 3705, 9250, 1699, -7164, -8402, -1771, 6207, 5625, -1617, -6780, -2667, 6191, 8614, -48, -6721]
666f721K868N111L518j739r648j703J0395N830m651n019l040J730R744J853j1595
681c067o037N106O033L494k591r147j801R833P596l463q689m056M207P312J306
696F036n984q088K98J0674N182o362n523k37L101P122J448j1114n024P667M681
711C877j222k336n720q14J0036M548o816n914J100M693M088j380p971m464N746
726b549Q037J56p529m535M050O317L878l657r811k200R679M974m442n657l275
741f564J476R642L692q960n344M097M829K707j861q363k798P276N238k934m644
756b511k569L442O375J322n421n576J717P183J648o191n090Q53L925N980m72q355
772c740k946P895M952j822l781o075j68Q765L869p353n702J367M598N709K03p341
$$ y = [-6721, -3853, 1258, 4776, 3037, -6611, -8314, 2081, 7911, 3260, -1759, -4799, -3069, 6675, 8528, -3067, -9104, -3998, 2035, 5529, 2938, -6209, -8010, 1823, 9419, 5956, -2733, -6789, -2582, 4730, 6036, 52, -8036, -7738, 2936, 8118, 1756, -3767, -4004, -903, 6219, 7667, -3447, -8471, -804, 3877, 2655, 319, -5401, -6215, 3821, 8369, 1553, -4361, -3261, 1432, 5520, 4140, -3831, -8295, -2549, 5488, 5644, -1885, -6420, -2370, 3947, 7825, 4168, -5643, -7843, 1836, 6810, 2368, -3289, -6564, -5088, 4554, 8246, -714, -6058, -1961, 2868, 5575, 3714, -4649, -7447, -171, 5067, 2133, -2511, -5080, -1638, 4737, 6059, 638, -4938, -3221, 3962, 5610, -581, -5671, -4818, -893, 5087, 4615, -3740, -6686, 1209, 6161, 4339, 558, -5517, -5685, 3080, 6949, -404, -6106, -4739, -141, 5568, 5771, -1570]
788a570m452M858O333j55n764m776J625M817L146j702o516j263P469M228l770
803B508m105j705R34N657J504p585m271M895M506J677j924n729j112P466M150
818F866m105o387j707L185N763O21n220m971J935P213L469m774n375qL892L925
834D322l60p181l051M662M726l62k240l681o89O730L387n323m361R55K438K941
850B913m66n191k797M730N190q93m024l607K516N240J066l502n763o56O106L589
866D451k801m457j547K577O546J472p183l971L385L826J378k015n285k191N668
881a47M871k451m158j442K511M341P40m429l995J255M682J441l511l265K62L713
897D18L558r37n423j562M790L173j357l714l080P54N459K438m940l691J479M374
$$ y = [-1570, -6022, -1164, 5169, 5014, -750, -5526, -3901, 916, 4062, 2360, -4156, -5419, 2050, 6278, 2508, -1597, -3302, -2368, 3289, 4793, -2792, -7063, -2168, 2338, 4015, 2091, -3638, -4750, 2716, 6866, 2761, -3626, -5333, -2148, 3615, 4236, -984, -5955, -4020, 3193, 6662, 1888, -3487, -3495, 397, 4322, 3962, -3219, -6270, -1608, 3118, 2756, 516, -3165, -3854, 2876, 6263, 940, -3421, -2466, -28, 2913, 2447, -2744, -5541, -811, 4379, 3486, -538, -4145, -1629, 3611, 4677, 1175, -4588, -5244, 862, 4451, 1650, -2807, -4354, -1777, 4769, 6241, -942, -4913, -1528, 2298, 3676, 1661, -3624, -5815, -147, 4724, 2273, -1885, -3327, -816, 3525, 4265, -164, -4159, -2904, 1778, 3219, -292, -3557, -3295, 418, 3976, 3039, -2384, -3946, 844, 4017, 2660, -1054, -4134, -3380, 2079, 4517, -423, -4114, -2635, 1739]
913A739K929j045n620k976M283M382q08m211k961R13M710K867k219n027j78M523
929A301L356k457l912j375R40L967J100m251k878K867L600P03j354l848p70M741
945A730K306l124m001k62K415L520M21l935k963K314N063R80l528l831k49L446
961C02L278j509n074j501M100L501o7k798l161M28N134J214l493l195M4K496K343
978B042M8l669j840L262K902m50k543k158J002L255J161l271l745J542L751J632
994B921j977k769p72K502L924l83m730k416K366K873R32j914l859k59M262L096
1010C797k336k915q76J826L030Q62m093k868J312L303P83j681k146m3K811K359
1026C125j127l320r88K490J779j003j939k007J334L409O88k586k072P98K983J645
$$ y = [1739, 4668, 3623, -1997, -4973, -690, 3692, 2884, -1327, -4288, -3375, 1335, 4202, 1983, -3044, -3222, 1301, 4657, 2200, -1712, -3087, -2147, 1820, 2920, -1331, -4209, -1342, 2258, 2961, 1607, -2241, -3011, 1730, 4036, 912, -3089, -3351, -936, 2584, 3005, -930, -3893, -1579, 3484, 4464, 936, -2895, -3144, 302, 3580, 2071, -3003, -4504, -404, 3097, 3030, 232, -2929, -2501, 2633, 3847, 354, -2841, -2797, -301, 2042, 2090, -1579, -3419, -157, 2745, 2295, -248, -2406, -1404, 1851, 3012, -259, -4004, -2462, 1289, 2921, 944, -1825, -2597, -95, 3829, 3446, -1284, -3700, -1334, 1539, 2471, 557, -3302, -3561, 701, 3797, 1461, -1454, -2330, -504, 2526, 3388, -705, -3573, -2261, 1042, 1825, 144, -2002, -2045, 766, 3125, 1998, -1322, -2310, 180, 1959, 956, -983, -2990, -1656, 1753, 2441, -145, -2217, -1419, 1564, 3209]
1042C209j796l540j284K943K720o32l179j559K008L222J511k467l604N42K782
1057H76J747j380l034j416J828L447n3k989j183J522K240J005j564k693k84K727
1073G96J277k135k019K3J540K470K60l049j613K668K088o28j928k013jK713K072
1090B521j503l530L97K651K026j26k677k526J294L651J07k744k013N36J717K157
1106A938K2l177j049K640J820n90j910j309J34K165R90j838k305J253K261O62
1122A707p54j904j013K281K066r72l033n00J256J716R11j884k472J387K813J042
1138B647j990j654r85J587K190k96k410j948J848K152P06j059j580p67J860K443
1154B744j926k176r5M81J634L84j588j580J209K628l64j461p64J06J210J135j073
$$ y = [3209, 1413, -2127, -3411, -468, 2252, 1620, -1559, -3118, -1110, 2112, 3623, 1156, -2448, -1906, 876, 2623, 1243, -1791, -3207, -1379, 2068, 2015, -974, -2157, -635, 1605, 2610, 1046, -1647, -1931, 796, 2073, -62, -2081, -2058, -518, 1952, 2212, -837, -2450, 218, 2306, 1678, -250, -2263, -2264, 449, 2521, 1018, -2512, -2115, 536, 2562, 2436, -241, -2767, -1473, 2178, 2285, -459, -2472, -1936, -219, 1938, 1960, -1217, -2266, 374, 2194, 1604, -306, -1615, -1481, 684, 1674, -164, -2469, -1216, 1045, 1707, 953, -951, -1964, 317, 2383, 1411, -1622, -2122, -866, 850, 1761, -123, -2595, -1208, 1605, 2647, 657, -997, -1982, -395, 1795, 1499, -911, -2859, -1011, 1141, 1847, 788, -792, -1559, 301, 2744, 818, -1358, -1453, -972, 662, 1046, -542, -2122, -913, 1715, 1351, -110, -874, -768, 442, 1577, 504]
1171E04k738K76K106J292q49j438o65M78K904O93k762k089J261J761O46o80k112
1188a412j161J968L208q38k729m28R92J298J043j401k481O8K461P07j086j106
1204h97j58P44K086n5j663j579J708J068m60j396p01J24J622J329j622j730Q72
1221g08J862M18l32j740j789J416K578n47j650j000J87J484K205j550j901J04
1237i63J258J036m83j075j352M50J649Q94j386j461Q38J341K90k6j172j074J233
1254cJ529j578j230M59N09O16J275j340k071J561J972l88j257r69r18J685J357
1271A209l86j893o33J741J386l23p01j225l70J770J579j811j996N81Q26O10N61
1288I25r29j500J237K110p09j494k33j95M28R55j60j784L88J684L54p69l32n44
$$ y = [504, -2234, -1958, 148, 1440, 591, -847, -1512, -1034, 1870, 2563, -199, -2288, -1027, 734, 1380, 700, -1412, -2573, -605, 2603, 1765, -964, -1392, -400, 898, 1941, 540, -1941, -1873, 588, 1295, 209, -897, -1055, -311, 1775, 1720, 57, -1522, 186, 1254, 794, -602, -1303, -1179, 443, 1772, 150, -1580, -708, 1154, 1572, 1240, -500, -2289, -873, 1705, 1158, -492, -1492, -1305, 179, 2384, 834, -1067, -963, 295, 1331, 848, -227, -1579, -1129, 520, 1414, 28, -1433, -595, 746, 1036, 1010, -162, -1236, -3, 1526, -52, -1282, -823, -314, 302, 1577, 237, -1834, -273, 1699, 1311, 54, -915, -1833, -148, 1209, 823, -1070, -1703, 38, 1424, 1101, 400, -825, -1195, 575, 2154, 343, -1653, -1072, -246, 364, 925, -4, -1504, -267, 1843, 1134, -360, -593, -788, -360, 595, 435, -1349, -961, 723, 1077, 308, -24, -568]
1306e68R89O62K45j785j320J406J093k57k15p82q71J530K095j086k166M71N09
1323e0M32O85q61j929L86J712L96n20l18n72N56J239k85j446l47M42Q27r6p51
1342e00J5j55J194K90n60q10M55P56jm46o40j352J325J672j399o07M68n9J007
1361F53R36p78j814P6J323K59m62q09m05N7J895Q9j109o14M63Q29o6l70l82p72
1381a001P71J307r34j148P60M29j18P86p72p47O10Q69l16o78o51L83N81R78r10
1400A99j168N02Q33O83l16o14n21o7O24O66j032r27O53O88K50L00o26j165Q31
1419b07J280n32p65j05m30K76J143m98j035O67O68p3P1k57m06K83N56n52p14k13
1439h43Q69M32k55j16o33J73Q40Q33q12j131L84L13l01Q92q19j344J048J229j62
$$ y = [-568, 421, 1083, 1328, -457, -1777, -371, 722, 465, 250, -532, -1403, 127, 2222, 1136, -1030, -559, -50, 382, 1067, 206, -1723, -1337, 375, 771, 251, -67, -639, -83, 1156, 871, -575, -922, -480, 347, 251, -500, -485, -640, 554, 844, 284, -526, -71, 685, 684, 238, -402, -1754, -429, 1243, -156, -763, -295, -354, 653, 1589, 811, -1003, -927, 396, 655, 193, -616, -1021, -964, 931, 1020, -89, -703, -240, 589, 523, 153, -229, -1001, -230, 1077, 143, -1005, -245, 184, 66, 852, 80, -667, -57, 812, 496, -182, -833, -450, 131, 1109, 199, -969, -467, 366, 1049, 733, 119, -402, -469, 155, 821, -211, -1138, -485, 203, 453, 753, 127, -1038, -207, 1073, 541, -224, -329, -759, -483, 660, 162, -873, -206, 462, 389, 460, 203, -203, 80, 636, 84, -630, -843, 26, 458, 203, 87, -546, -373, 467, 1300, 488, -643, -259, 54, -247, 645, -174, -1518, -470, 759, 597]
1458E97l07J37q41K38R12k55j042m64Q34M28P0k40m91K59L84M91l12m84L14Q7
1478C15q17M43l11k40L70R86o45o37N07L00q2N31p98q51P73M53m0m35l28l35Q07
1499c4N12J03p38k35K08O92l41j9p36j19N38R87p10l78R8L25J73M02o63m06L12
1520b9K59m62m09M80P2nN05l47l76L91K55j75j98m63J31k5M31K15l32n81N07M76
1542C20k3J48n68j60M66M66p12l18P0j57J91R89o44j16J85R2k5K97l65l80K91
1563D7m5k12P0j80M37J25r1j29j10N9J83M55q54m07M93J06j09K43j03l77M51O87
1585G39l99m71J5o7l6N45k07p76J31K49L30K33k8l28K62N2K23j76m35j97J67q
1607a82j29K39r1R3O67m22k97P17m03n26O6m6q0M15L13m90m8K15K05J49N2l43
$$ y = [597, 290, 427, -414, -176, 736, 481, -561, -1025, -191, 237, 307, 67, -424, -165, 219, 710, 398, -86, 228, 315, -502, -59, -370, -610, -240, 746, 101, -536, -29, 271, 189, 720, -78, -929, -156, 297, 257, -178, -506, -841, -34, 478, 581, -157, -392, -184, 508, 167, 148, -588, -707, -169, 818, 108, -270, -172, 153, 326, 728, 65, -341, -29, 230, -232, -641, -161, -89, -94, 411, 64, -312, 79, 334, 159, -39, -502, -371, -396, 35, 250, -82, -663, -156, 320, 297, 445, -123, -283, 183, 649, -63, -381, -311, -468, -277, 712, 68, -48, 137, 229, 204, 501, 136, -244, 47, 2, -210, -140, -320, 117, 242, 151, 22, -88, -29, 154, 609, -245, -652, -159, -53, -162, 81, -22, -399, 52, 739, 340, -131, -116, -183, -219, 326, 119, -657, -526, -277, 53, 286, 258, -70, 192, 244, 467, 291, -144, -341, -174, -182, -311, -72, -163, -70, 597, 175, -122, 595, 192, -334, -268, -314, -394, 21, 334, -156, -204, 11, 216, 365, 417, 74]
1629G4j99R7Q6P9r2j44Q1n67P53J19j88k9N8K97n28K62k00l04n9L51L2k81O50
1652C48m45R4L62N6k02L55m37m70L04r4r1K60k8k59l5J54L84J34pk69m11K51K6
1675b0M46q12j40O61j69K10J32l15k67O19J4n79L57l49p9J15j36P8J81M77m07
1696A7j68Q9M54j21j61j7m10o3K85J19m0j51o3R7K51M94m09l15p2K18q4JM1k28
1720b36M1M45Rl14L53j79k75Q1M14k11l68j59j31K16L2L51k51M49K68m34k65K28
1742F4L75m81k1k81L5M33P4k59J37O9L96l10j87j66m5j68O80k43o03m5K52J87
1764a07M87o0p0r5L50k53j94K30m99o7L95p2k22M7K58K70m54J05J94l04L75J67
1786D81m75n14L64J52rK06m03k6J85N85n8n48J10m02L17R6K54p43p7K99P12n80
$$ y = [74, -125, -28, 58, 137, 45, -99, -18, -585, 168, 287, 99, 70, 128, 425, -103, 159, -41, -345, -404, -53, -21, -302, 348, -97, -3, 359, 415, 213, 568, 131, -339, -35, -129, -220, 40, 12, -247, -282, -128, 256, 390, 383, 114, -297, -46, -20, 426, -386, -526, 135, -34, 176, 308, -7, -274, 345, 359, -220, 137, -212, -291, -176, -312, -234, -53, 424, 17, -151, -62, 392, 271, 110, 93, -317, -380, -95, 24, -16, -167, -230, -133, 118, 612, 203, -112, -184, 34, -50, -49, -8, -236, -195, 250, 259, -55, 298, 119, -156, -75, 339, 128, -240, -399, -530, -314, -282, 69, -182, 267, 535, 101, -164, 64, 439, -42, -63, -344, -309, 124, 198, -61, 76, 145, 541, 231, 44, -122, -167, -335, 345, 102, -501, -546, -294, -107, 380, 320, 250, 155, 505, 252, 58, 288, -211, -278, 117, 45, -177, -130, 128, 398, -56, 49, 243, -61, 314, 481, 6, -508, -144, 8, -1, 205, -198, -224, -39, 546, 488, -60, 50, -352, -35, 61, 315, -428, -505, -206, 506, -74]
1808g4J2J3J15j37O47p33k94K72O2L29j43j67k2J81K81L4o09L23K92k69j18k19
1830b24j62K05J82M21p43K47K92Mo7L49q41k90N11K00j10l35L47j8K52L03k42
1851B81n03J84K05j80L58l65m28l6N59Q2m60J1J35L25L08l39l97mN32j80l89j56
1873d57O7J06N29L49r09PL63J90J16j33n04l58O87J30l96j76J54J21L15J41k60
1894H2k70J30M49k6m99mk67J83J29K97k1l03K49J77o9k09j09p6L32o4k81k91J94
1917b67P46n26J17q5k52N31J65R9r53k9J91M29j7l31K4l4L55M91j40p10M8j56
1939c04L70M19p37k31O95m3J61k26j38k93L09N91l52l66O3o2L03l6p62K50R8M90
1961A99J19m67j38K35K78J30J0o44m2O05n9j35r8m34J85M98L01o66k25L23r0R8
$$ y = [-74, -62, -49, 66, -71, 576, -157, -451, -179, -117, 212, 69, -98, -120, 61, 342, 376, -233, 90, 382, 113, -5, -224, -386, -181, 1, 422, -321, -74, 218, 222, 155, 504, -337, -627, -116, 84, -26, -361, -14, -32, 220, 523, 281, -222, -38, 167, -13, 345, -20, -448, -484, 75, 157, -303, -292, -157, 168, 476, 137, -260, -264, 268, 88, -301, -457, -390, -284, 245, 594, -315, -308, 55, 245, 361, 228, -276, -634, 53, 183, -213, -389, -235, -114, 201, 342, 82, -188, -58, 391, 365, -134, -138, -405, -222, -93, 204, 183, -120, 129, 306, 237, 28, -81, -157, 175, 111, -170, -461, -267, 479, -47, 70, -15, -267, 264, 429, 528, -425, -454, -263, 166, 149, -182, -158, -192, 163, 654, 514, -196, -148, -304, 66, 485, -252, -483, 212, 169, 330, 104, -34, -327, -18, 573, 221, -145, -82, -144, 159, 123, -639, -389, -291, 199, 318, -149, -287, -52, 226, 356, 366, -278, -320, 285, 226, 91, -7, -441, -256, 242, 543, -123, -348, -25, -115, -17]
1983a7J45n51j73M85N51N3l47p5j98L08J83l18l82Q7L15L06m80j72O8M86K46J29
2005F49q04k35O32k84p7J9o9k32K60M50k40m90J86O17K7j0m73k06k3K13J60l42
2027b72j95L33J82K00K16n04m40N98L93n58l31M49l09L52L11o79J70J45L49k7
2047C83l86l22k32Q77q6m5p06J70J08M42j00m8lk39N48L9m00l64K94m24O68jm17
2070b44j08J50N39k08P9k49k95J14N58k63m52K19p2K16r5r2L29k07L60k0l72k41
2092c54M47J48j1l44k74K17M25J82m25k18M3L6N46K02j139J2M54M49l18N2p1m83
2114d24M97N36m58m48l30N16J67L23k52l39p3K64L44o00l1K29M02J8j3o2p71N86
2136H1Q3k66k00j84Q40l90L66l98k86P2N13M04o10m97J6K84L30K89l80l98N4K51
$$ y = [-17, 128, -423, -596, -111, 440, 493, 146, 71, -127, 181, 364, 46, -336, -249, 66, 372, -108, -280, -212, 274, 520, 649, -155, -390, 242, -42, -119, -100, -169, -401, -141, 309, 69, -421, -235, 382, 409, 399, -74, -280, -303, -90, 70, -272, -467, -134, 48, 248, 464, -40, -480, 118, 511, -47, -378, 71, -238, 114, 425, -254, -84, 61, 410, 383, -3, -325, -557, 320, 234, 189, -517, -347, -239, 203, 103, 55, 52, -187, 361, 400, 0, -364, -70, -494, 174, 173, -244, -352, -202, 337, 129, 208, -41, -336, -222, 336, 73, -379, -160, -232, -16, -111, -203, 126, -81, 279, 259, -113, -354, 93, 241, 230, -114, -388, -171, 254, 436, 11, -207, -164, -128, 418, 620, -519, -507, -53, 396, 78, 130, 59, -424, 73, 609, 151, -297, -627, -111, 56, 379, 127, -212, -285, -21, 323, -277, -308, -79, 323, 341, 328, 266, -505, 81, 164, -102, -302, -486, 354, -36, 330, -68, -354, -282, 231, 635, 25, -472, -456, -172, 158, 447, 67, -331, -277, -26]
2158b6L12K16o04j60N16J77k36j87l54q2M09N21m43j43J63M64n27J99l81j71N53
2179B16k90j00J26j40K64K10n0j24j8j41J73K17j95j42m77P40J01n1q28l43R99
2200A47J30M18q95p6J22M5O48m12m83RL49J25m3j59k86Q2O02j63l47k11L92K52
2222B46j78j68j01l04J057l78q6j86k9k47Q93j35l84p66O21O11k28j11m84M00
2242D3J83L59l96m69j2lM57j42o2l26L3O86J60l35j42m09M81J07L15n86j48L62
2264A56j86K13q4m80N10K96m11K05l70K45K43k13j32k29j97J64M86k41l63J39
2284b49k3P80j89n90K97k33K82J81j30n47R9M02L01M3l60l36K21L3L39k74l49
2305c02M0K36mM62o16p0L85J36k93L6m4k0M07r2o32j03K84N29j06l27J71m70P58
$$ y = [-26, 286, 502, -102, -262, 254, 431, 195, 8, -346, -428, -19, 502, 59, -84, 79, 543, 16, 215, -166, -337, 216, -74, -174, -48, -188, 76, 286, 236, 112, 94, -47, 126, 343, 148, 6, -471, 269, 370, 319, -509, -852, 147, 277, 695, -200, -276, -154, -109, 539, 127, -356, -347, 2, 127, 84, -75, -361, -279, 323, 160, -187, -398, -6, 246, 68, -100, -201, -505, 552, 174, 88, -98, -127, -374, 519, 384, 0, -766, -145, 466, 238, 127, -357, 43, 226, 585, 189, -280, -292, -295, 162, 20, -42, -368, -335, 351, 511, 176, 34, -375, 106, 213, 528, -58, -206, 156, -30, 183, 99, -381, 129, 425, 14, 219, -151, 94, 337, 124, -8, -237, -434, -270, 216, -25, -388, -249, -272, 508, 319, -271, 26, -207, 75, 256, 126, -421, -322, 80, 381, 424, 64, -272, -51, -18, 321, 47, -302, -262, -26, -30, 432, -184, -254, 131, 267, -26, 10, -34, -54, 353, 261, -371, -474, -190, 339, 233, -94, 77, -393, 365]
2328C65R0l26j92k69J13N15K91n37l56j5N91J77l74j01j48J43M54j92m59P0J81
2349B1L43j00j31j79L2K42l20L26l40l25J24M15k06k67R3L83N6n3q7m02O6M74
2371A65k48Q6l69j29N93M7Ml94N7L21r7J96k21m41J51N44m30L30n51K78J59M10
2393D61n12Q9j85J18J19J69Rm94L92pJl77J43k11K70M41l16j88l59L97M59k52
2415A67k93k61K23L6L41j90m94K75L37K66j06n85J79KK86K8j47l35k62P57R1j09
2437B06j01k97J56Q9K39k15l37O04m0j39R9o66L30N74j82l10o69L66M41J46l04
2458a0K01m34P8L59J06k97k29J63N50n3l46l36P1J52M16l61j85L97k19r5M45m29
2480e6k60L01J17K45k75k26j22J64M50j99j27j67m6L46p2N9l61J00K86O5m16R6
$$ y = [365, 455, 129, -63, -332, -219, 296, 587, 50, -306, -321, 270, 447, 73, -28, -176, -33, 421, 229, -230, -160, 21, 364, 264, 133, -46, -14, 228, -92, 234, -106, -431, -307, 108, -98, -365, -272, 111, 167, 114, 27, -375, -309, 165, -83, 3, -366, -495, 98, 145, 149, -245, -188, 133, 36, 232, 11, -430, -279, 265, -165, 165, -386, -108, 51, 461, -51, 38, -147, -29, 90, 259, 268, -226, 166, 159, 160, -217, -74, -285, -15, 426, 110, -78, -437, -40, 419, 167, -126, -387, -164, -128, 213, 23, -471, -196, 141, 407, 301, -284, -105, -103, 183, 211, 64, -271, -533, 224, 315, 206, 105, -192, -36, 53, 292, 77, -260, 344, 304, 165, 264, -402, -72, 502, 320, 10, -659, -293, 148, 294, -10, 191, -243, -165, 194, 300, 3, -226, -63, 487, 434, 88, -248, -177, -25, 391, 30, -155, 242, 23, -72, 373, -56, -316, -15, 102, 347, 72, -154, -276, -112, 338, 139, 12, -155, -201, 145, 73, 132, -229, -129, 157, 222, -194, -98]
2502i8j13M15k13l7k03m7K43L36r3k74L6k17N87k4n52q1O3K71K28R0l89j65J79
2525e8L68l29k62j5M09M8m8j38k48K16J66J83K22p65L0J71p0M41m96l9K59J11
2547A56J02n48K87m12O05n8j37k83j29M81Op6J03o9j72J65K03q2k91K74j78L12
2569B59k75J53m57J27K27K26k49k86M5M60K87m50k98L50k34J69L2j54k3j1N90
2590D88m34l18J74J25p7J07J50l73j70L59J25j89k13j54N24K02j92l13k30J2M49
2611E2J25j03j90k20L80K08On46L16o6l3K55k08k80K14L96j33k17k11M6M42r8
2633A35K01l39q0j19L80k50j7J10l39M07k1k47Q3k22J17N04m36K63m02L72L43
2654D43j55qm76l6L4M98l25qL6M89j3o90J35j99J25K90k9k06K29k37O2K01o7j13
$$ y = [-98, -211, 204, -9, -46, -249, -296, -53, 283, 190, -84, -48, -265, 322, 298, -254, -335, -272, -1, 227, 317, -72, -237, -58, 310, -19, -281, -296, 113, 161, 113, -25, -273, -57, 109, 292, 514, -251, -221, -50, -120, 321, -175, -214, 45, 156, 258, -290, -3, -415, 190, 132, -5, -288, -417, 64, 70, -6, 97, 28, -144, 21, 224, 142, -149, 125, -53, 259, -16, 137, -320, -193, 34, 260, 11, -275, -230, 230, 517, 67, -231, 119, -115, 54, 86, -68, -91, -102, 488, 54, -264, -90, 35, -42, 65, 215, -158, -328, 31, 156, -33, -246, -400, 124, 326, 134, -179, -409, -397, 52, 177, 74, -116, -336, 44, 252, 258, -288, 28, -38, -71, 184, -24, -304, -90, 306, 173, -44, -255, -209, 233, 135, 336, -3, -83, -202, 178, -72, -89, 21, -318, 89, 68, -179, -96, -318, -201, 303, -133, 130, -272, 100, 443, 288, 280, -196, -232, -198, 300, -25, -33, 3, 492, 479, -211, -76, -275, -150, 140, 111, -95, 134, -103, -41, 160, 93, -20]
2678b0O0R1J41n5n76L14p4K65K2l37k15L53P1K62m99l6L5L13j3j11k5k20K27L43
2702C16l29j09K24k10J14K97l32J39j24j65M05o73L64R6j27L28P0m24J07m3P0
2723fK08j87k80K12J24O5k29J47k02K76M4j75j49k0J64K88j19k38k23J57MM46
2745C07j86j65q1NL04p4m22K03P3J20k55q8J59Q3O2k19K90l37J48j29J52J56j26
2768b0j28M68k17K63m25J0l24N55K39o94J42R3L30k5k02j47j8N0K2J01k00k59
2790c86K96K19J26O5n10Q5O2L82l35k74L05j7K04m11R2M9l78K84L05n2k55m0L64
2813A80j86J95K6k67M7L86k47j24j27M11m4k64L69l12j3j50Q3K75k92j65J98J44
2835A23l7r0l6R3R8m6j04j38J85j63K66O3p8n57L70J55l22K31k89L49q6L39j25
$$ y = [-20, 40, 131, 272, 217, -359, -45, -119, 146, 168, -169, -384, -31, 40, 302, -197, -233, -198, 115, 102, -9, -34, -254, -27, 316, -13, -122, 102, -108, 6, 303, -29, 110, -14, -179, 226, -447, -83, 13, -114, 214, 284, -140, -33, -76, -6, 202, 15, -265, -53, 71, 136, -93, 54, -148, 128, 172, -3, -152, -172, -8, 280, 161, -77, -300, -143, -139, 307, 121, -44, -125, -120, 184, 110, -312, -109, -36, 84, -171, -259, -100, -17, 45, -174, 116, -221, -73, -202, -50, 106, -20, -148, 320, 103, 366, -59, -49, -373, 182, 421, -273, -131, -38, 292, 267, 65, -82, -100, -50, -28, 73, -127, -386, -90, 129, 255, 320, -190, -105, -43, 339, 4, -270, 35, 18, 222, -189, -97, -48, -426, -142, 163, 111, -144, -184, 180, -6, 189, 215, -52, -5, 381, 134, 10, -117, 294, 250, -14, 355, 43, 30, -120, -37, 238, -54, -219, -21, 123, 86, -4, -40, 53, 151, 105, 1, -137, 48, -115, 151, 214, 136, -421, -51, 104, -218, 13, -276, 73, -13, 326, 201]
2858B01k06K14l72K52q8j69J0K02l0k0l44L12J63R6l19L91m0l56K4M10k15j24
2880hj74JM73j96o0m40N04rj74J42k83J12L40n0j00m71K72k13P24j50n93L53j47
2903a47J94OJ07k71l93P51R7j07k56k60M66n9k25J4n6J04L2N6O3p4j66k18M01
2926E9n5Q0K05k76p3P8LL0l49M91j06O0k70K20n1j07j73L43q5l58M74j15l97J68
2950b04O1L38j41n1Q8j10L7L34k63q6k46M09r9J60k56J81j18k4J14l1j67j32M2
2973a64M17j53k74K32j69J01k22J5P0rR0M6N3r3k74M98L6j72p0N5l61M09k60J44
2997e5K06k57K60P5o4k04j24M1K02r2m1k3J25l5J92j28k43J6l3L93m09J97J76
3020A75L6j80l06N08j14k02m1K20rn53L25P8L2K61l16o7J04J94Q0k69M4j21J84
$$ y = [201, -5, 209, -163, 89, 1, -168, -158, 44, 14, -6, -350, -38, 125, 221, -98, 293, 253, -103, -79, 331, 116, -8, -182, -181, 292, 96, 36, -404, 100, 91, -83, 59, -224, -112, 228, 178, 78, -393, -121, -334, 390, 240, -353, 0, -147, 47, 53, 160, -111, -504, 247, 344, 237, -19, -279, 187, 128, -97, -83, -139, -35, -3, 53, 116, 42, -124, -342, 59, 4, 84, 289, 13, -60, 18, 21, 51, -298, 193, 87, 147, -123, 97, 46, -61, -234, 109, 24, -334, 140, 25, -372, -204, -143, 195, 54, 3, 91, -19, 18, 352, 89, 3, -243, 166, 67, 227, -29, 152, 34, 10, 124, 93, -74, -206, -164, 253, 100, -174, 58, -111, -10, -232, -217, -147, -156, -66, -20, 33, -60, -334, 164, 200, 28, -42, 13, -348, 61, -199, -55, 151, -106, 154, 229, 165, -39, -163, -122, 80, -12, -53, -76, 49, 14, 206, 78, -165, -149, -182, 211, -198, -1, 175, 211, 31, -275, 233, 119, -83, -124, 96, 87, -466, -141, -63, -31, 230, -86, -153, -49, 145, 225, -44, 0, -121, 63]
3043F3J57m96J98j93K37L68n25L12k56K09P7ok45j92J17rP0K29m00K49K80M5j99
3066I0j77M26o94J21O75j97k21o7J45k2P6r0m0k8K20l53j4J60K09J49q2l92j57
3089b63r8L18j46M04k11p7J2J18Q1l4j12kQ3k56j36L14k30K69jR5k1q1K6P7J0
3114A39L1l04P5J90k99K75j34M29m45L47l07j19M22m49M23l1l78J77J28l21L53
3135B02m13J18K58j20j63K45j95L7o8J37k9J0j32K34k42M3P1j58O6J94J08q3J7
3158A37j22j3m9L58j54R3n16J51J49J7J36m30O0J33j03L08j55qp2K93o8N6k57
$$ y = [63, 220, -276, -78, -271, -34, 334, -191, 121, -135, 74, 151, 145, -100, -292, -175, -184, -114, 115, -285, -36, 244, 289, 90, -87, 339, -355, -234, 441, 244, 23, -44, 101, 79, 155, 65, 25, -3, 217, -136, -150, 10, 219, 368, 286, -106, -263, -361, -43, -189, 215, 4, -73, -61, 57, 138, 104, -8, -10, 73, -183, -319, -5, -235, 34, 33, 128, 107, 26, 52, 129, 139, 170, -134, -59, 131, -168, 107, -27, 402, -43, 304, -3, -122, 300, -149, 274, 243, -135, 42, 170, -151, 202, -211, -93, 165, 45, -118, 127, -68, -31, -99, 38, 9, 19, -113, 121, -121, -78, -7, -165, -99, 95, 203, 120, 137, 15, 2, -47, 311, 157, 250, -266, -115, 34, 51, 187, -243, -183, -50, -153, 155, 0, -8, -80, 213, 145, 201, -56]
$$ [...]
8191I7
##END NTUPLES=NMR FID
##END=
