##TITLE=1H_DE-41spext
 D2O
 8 sc, 
 1.4.2024
##JCAMPDX= 6.0         $$ Bruker NMR JCAMP-DX V2.0
##DATA TYPE= NMR FID
##DATA CLASS= NTUPLES
##ORIGIN= UXNMR, Bruker Analytische Messtechnik GmbH
##OWNER= root
$$ XWIN-NMR		Version 3.5
$$ Mon Apr  1 15:37:28 2024 Russian Standard Time (UT+4h)  she@DPX200
##.OBSERVE FREQUENCY= 200.1312
##.OBSERVE NUCLEUS= ^1H
##.DELAY= (6, 6)
##.ACQUISITION MODE= SIMULTANEOUS
##.ACQUISITION SCHEME= undefined
##.AVERAGES= 8
##.DIGITISER RES= 18
##SPECTROMETER/DATA SYSTEM= spect
##.PULSE SEQUENCE= zg30
##.SOLVENT NAME= D2O
##.SHIFT REFERENCE= (INTERNAL, D2O, 0, 15.7039)
##AUDIT TRAIL= $$ (NUMBER, WHEN, WHO, WHERE, WHAT)
$$ ##TITLE= Audit trail, XWIN-NMR		Version 3.5
$$ ##JCAMPDX= 5.01
$$ ##ORIGIN= Bruker BioSpin GmbH
$$ ##OWNER= she
$$ F:/spectra/data/she/nmr/H-F/1/audita.txt
$$ ##AUDIT TRAIL=  $$ (NUMBER, WHEN, WHO, WHERE, WHAT)
(   1,<2024-04-01 15:36:06.32 +0400>,<she>,<DPX200>,
      <created by zg, POWCHK disabled, PULCHK disabled
       configuration hash MD5:
       00 E9 B6 7A A2 85 ED C7 34 08 36 98 17 FE 4E 26
       data hash MD5: 16K
       71 F4 2E 40 FF C7 DD 6C 82 7B 06 47 BC D4 80 D9>)
$$ ##END=
$$ 
$$ hash MD5
$$ A8 FC 32 6D 4B C1 45 67 93 4C 73 A4 35 4A 9D C6
##$RELAX= 
##$RELAX= 
##$RELAX= 
##$RELAX= 
##$RELAX= 
##$RELAX= 
$$ Bruker specific parameters
$$ --------------------------
##$DU= <F:/spectra>
##$EXPNO= 1
##$NAME= <H-F>
##$PROCNO= 1
##$TYPE= <nmr>
##$USER= <she>
##$AMP= (0..31)
100 100 100 100 100 100 100 100 100 100 100 100 100 100 100 100 100 100 
100 100 100 100 100 100 100 100 100 100 100 100 100 100 
##$AQSEQ= 0
##$AQ_mod= 1
##$AUNM= <au_zg>
##$AUTOPOS= <>
##$BF1= 200.13
##$BF2= 200.13
##$BF3= 200.13
##$BF4= 200.13
##$BF5= 200.13
##$BF6= 200.13
##$BF7= 200.13
##$BF8= 200.13
##$BYTORDA= 1
##$CFDGTYP= 0
##$CFRGTYP= 5
##$CHEMSTR= <none>
##$CNST= (0..31)
1 1 145 1 1 1 1 1 1 1 1 1 1 1 1 1 1 1 1 1 1 1 1 1 1 1 1 1 1 1 1 1 
##$CPDPRG= <>
##$CPDPRG1= <>
##$CPDPRG2= <>
##$CPDPRG3= <>
##$CPDPRG4= <mlev>
##$CPDPRG5= <mlev>
##$CPDPRG6= <mlev>
##$CPDPRG7= <mlev>
##$CPDPRG8= <mlev>
##$CPDPRGB= <>
##$CPDPRGT= <>
##$D= (0..31)
0 1.2 0 0 0 0 0 0 0 0.06 0 0.03 0 0 0 0 0.0002 0 0 0 0 0 0 0 0 0 0 0 0 
0 0 0 
##$DATE= 1711971365
##$DBL= (0..7)
120 120 120 120 120 120 120 120 
##$DBP= (0..7)
150 150 150 150 150 150 150 150 
##$DBP07= 0
##$DBPNAM0= <>
##$DBPNAM1= <>
##$DBPNAM2= <>
##$DBPNAM3= <>
##$DBPNAM4= <>
##$DBPNAM5= <>
##$DBPNAM6= <>
##$DBPNAM7= <>
##$DBPOAL= (0..7)
0.5 0.5 0.5 0.5 0.5 0.5 0.5 0.5 
##$DBPOFFS= (0..7)
0 0 0 0 0 0 0 0 
##$DE= 6
##$DECBNUC= <off>
##$DECIM= 32
##$DECNUC= <off>
##$DECSTAT= 4
##$DIGMOD= 1
##$DIGTYP= 9
##$DL= (0..7)
0 120 120 120 120 120 120 120 
##$DP= (0..7)
150 150 150 150 150 150 150 150 
##$DP07= 0
##$DPNAME0= <>
##$DPNAME1= <>
##$DPNAME2= <>
##$DPNAME3= <>
##$DPNAME4= <>
##$DPNAME5= <>
##$DPNAME6= <>
##$DPNAME7= <>
##$DPOAL= (0..7)
0.5 0.5 0.5 0.5 0.5 0.5 0.5 0.5 
##$DPOFFS= (0..7)
0 0 0 0 0 0 0 0 
##$DQDMODE= 0
##$DR= 18
##$DS= 0
##$DSLIST= <SSSSSSSSSSSSSSS>
##$DSPFIRM= 0
$$ [...]
##$SUBNAM2= <"">
##$SUBNAM3= <"">
##$SUBNAM4= <"">
##$SUBNAM5= <"">
##$SUBNAM6= <"">
##$SUBNAM7= <"">
##$SUBNAM8= <"">
##$SUBNAM9= <"">
##$SW= 18.0517418723606
##$SWIBOX= (0..15)
0 0 2 0 0 0 0 0 0 0 0 0 0 0 0 0 
##$SW_h= 3612.71676300578
##$TD= 16384
##$TD0= 1
##$TE= 0
##$TE2= 300
##$TE3= 300
##$TEG= 300
##$TL= (0..7)
0 120 120 120 120 120 120 120 
##$TP= (0..7)
150 150 150 150 150 150 150 150 
##$TP07= 0
##$TPNAME0= <>
##$TPNAME1= <>
##$TPNAME2= <>
##$TPNAME3= <>
##$TPNAME4= <>
##$TPNAME5= <>
##$TPNAME6= <>
##$TPNAME7= <>
##$TPOAL= (0..7)
0.5 0.5 0.5 0.5 0.5 0.5 0.5 0.5 
##$TPOFFS= (0..7)
0 0 0 0 0 0 0 0 
##$TUNHIN= 0
##$TUNHOUT= 0
##$TUNXOUT= 0
##$USERA1= <user>
##$USERA2= <user>
##$USERA3= <user>
##$USERA4= <user>
##$USERA5= <user>
##$V9= 5
##$VALIST= <valist>
##$VCLIST= <CCCCCCCCCCCCCCC>
##$VD= 0
##$VDLIST= <DDDDDDDDDDDDDDD>
##$VPLIST= <PPPPPPPPPPPPPPP>
##$VTLIST= <TTTTTTTTTTTTTTT>
##$WBST= 1024
##$WBSW= 4
##$XGAIN= (0..3)
0 0 0 0 
##$XL= 0
##$YL= 0
##$YMAX_a= 87253
##$YMIN_a= -82287
##$ZGOPTNS= <>
##$ZL1= 120
##$ZL2= 120
##$ZL3= 120
##$ZL4= 120
##$ABSF1= 10
##$ABSF2= 0
##$ABSG= 5
##$ABSL= 3
##$ALPHA= 0
##$AQORDER= 0
##$ASSFAC= 0
##$ASSFACI= 0
##$ASSFACX= 0
##$ASSWID= 0
##$AUNMP= <proc_1d>
##$AZFE= 0.1
##$AZFW= 0.1
##$BCFW= 1
##$BC_mod= 2
##$BYTORDP= 1
##$COROFFS= 0
##$CY= 11.3945322036743
##$DATMOD= 1
##$DC= 2
##$DFILT= <>
##$DTYPP= 0
##$F1P= 15.7292609196834
##$F2P= 12.9074282941183
##$FCOR= 0.5
##$FTSIZE= 0
##$FT_mod= 4
##$GAMMA= 1
##$GB= 0.15
##$INTBC= 1
##$INTSCL= 1
##$ISEN= 128
##$LB= 0.24
##$LEV0= 0
##$LPBIN= 0
##$MAXI= 10000
##$MC2= 0
##$MEAN= 0
##$ME_mod= 0
##$MI= 1.114404
##$NCOEF= 0
##$NC_proc= 0
##$NLEV= 6
##$NOISF1= 3.799351
##$NOISF2= 2.8
##$NSP= 1
##$NTH_PI= 0
##$NZP= 0
##$OFFSET= 15.70392
##$PC= 1
##$PHC0= -25300.58
##$PHC1= 6.587305
##$PH_mod= 1
##$PKNL= yes
##$PPARMOD= 0
##$PSCAL= 0
##$PSIGN= 0
##$REVERSE= no
##$SF= 200.130013532006
##$SI= 16384
##$SIGF1= 3
##$SIGF2= 2
##$SINO= 400
##$SIOLD= 16384
##$SREGLST= <1H.CDCl3>
##$SSB= 0
##$STSI= 0
##$STSR= 0
##$SW_p= 3612.71676300578
##$SYMM= 0
##$S_DEV= 0
##$TDeff= 0
##$TDoff= 0
##$TI= <>
##$TILT= no
##$TM1= 0
##$TM2= 0
##$TOPLEV= 0
##$USERP1= <user>
##$USERP2= <user>
##$USERP3= <user>
##$USERP4= <user>
##$USERP5= <user>
##$WDW= 1
##$XDIM= 8192
##$YMAX_p= 0
##$YMIN_p= 0
$$ End of Bruker specific parameters
$$ ---------------------------------
##NTUPLES= NMR FID
##VAR_NAME=  TIME,          FID/REAL,        FID/IMAG
##SYMBOL=    X,             R,               I
##VAR_TYPE=  INDEPENDENT,   DEPENDENT,       DEPENDENT
##VAR_FORM=  AFFN,          ASDF,            ASDF
##VAR_DIM=   8192,          8192,            8192
##UNITS=     SECONDS,       ARBITRARY UNITS, ARBITRARY UNITS
##FACTOR=    0.0002768,     1,               1
##FIRST=     0,             0,               0
##LAST=      2.2672688,     0,               0
##MIN=       0,             -82287,          0
##MAX=       2.2672688,     87253,           0
$$ Real data points
##PAGE= N=1
##DATA TABLE= (X++(R..R)), XYDATA
$$ [...]
2098a496j176K349K429P73l792j000j22L441J223j641k752r02L121J662K18l781
2114a446j208J549K569J287k774j898k81L028J261n94k948j279K459K029R65l398
2130f79j398J02L395Q23j369k406j376L261J553O79l760j223J269K698J157k861
2146a35j778m96L267J287o04l188r05K138K115O75l015j396j77L561O40j046k763
2163a820q73L031J603K45l445o24J61L517P11k292j970o52L427J010j54l328o26
2180b079J364K365Q63l068j228j15L067R61j025k773r86K562J831K76k773j386
2196b144Q20K867L75j833j891o02L075J163n6l193q71J167K545J210k821j709
2212a898k27L274R61p45k753p44K084J642N50l042j183L49L382O22j750k568m00
$$ plain form
2098 -1496 -2672 -323 2106 2879 -913 -1913 -2035 1406 2629 988 -1764 -2666 455 2117 2335 -1446
2114 -1446 -2654 -1105 1464 2751 -23 -1921 -2202 826 2087 1493 -1455 -2734 -275 1754 2719 -679
2130 -679 -2077 -1975 1420 2243 874 -1532 -2908 353 1906 2585 -1175 -2398 -1129 1569 2726 -135
2146 -135 -1913 -2409 858 2145 1541 -1647 -2552 -414 1701 2376 -639 -2035 -2212 1349 1989 943 -1820
2163 -1820 -2693 338 1941 2186 -1259 -1883 -1722 1795 2506 214 -1756 -2408 1019 2029 1875 -1453 -2079
2180 -2079 -715 1650 2513 -555 -1783 -1898 1169 2130 1105 -1668 -2654 -92 1739 2015 -758 -2144
2196 -2144 -1324 1543 1918 85 -1806 -2408 667 1830 1774 -1419 -2290 -1123 1422 2632 -189 -1898
2212 -1898 -2125 1149 2110 1365 -1388 -2132 -48 1594 2144 -898 -2081 -1732 1650 2272 522 -2046 -2446
2229b446L042J192J30l190q49P48K981P44k469j472o73L387Q75n43k976q75K218
2246a76J938M85l089j049J91L230N99j369k336m25K158J488K30l240m99R46K703
2263A785N44j987j982r28L730O47k12k966q10J561K086O10k625j126P1K962N07
2280A867p40k475o83K223J355L56l131p23P58K528P86j686k175k90K805R43M1
2297A759l232l97J289K081N08k736r80j60L093M77q54k488m20J938J605O32l287
2314a172q22P70K599O00j507k141l76K560J228J09l241k97R28K469L82k360j382
2331a653pK703N62n90k378o63J693J779K66k877p00L30L022L44r90k391k47K386
2349E89J179l38k757m09J007K273N95k049j833n9K726P11m20k548n36J779J410
$$ plain form
2229 -2446 596 1788 1918 -1272 -2121 -1373 1608 2352 -117 -1589 -2262 1125 2000 1457 -1519 -2394 -176
2246 -176 1762 2247 -842 -1891 -1700 1530 2129 760 -1576 -2001 157 1645 1875 -1365 -1864 -918 1785
2263 1785 2329 342 -1640 -2568 1162 1809 1597 -1369 -2179 -618 1468 2078 -547 -1673 -1602 1360 1867
2280 1867 1127 -1348 -2031 192 1547 1903 -1228 -1951 -1193 1335 2121 435 -1740 -2030 775 1718 1759
2297 1759 -1473 -1870 -581 1500 2008 -728 -1708 -1868 1225 1702 848 -1640 -2060 -122 1483 2115 -1172
2314 -1172 -1994 -1224 1375 1975 468 -1673 -2049 511 1739 1848 -1393 -1690 -762 1707 2089 -271 -1653
2331 -1653 -1660 1043 1605 1015 -1363 -2026 -333 1446 1712 -1165 -1865 -1535 1487 1831 841 -1550 -1797 589
2349 589 1768 1430 -1327 -1736 -729 1544 2139 90 -1743 -1802 924 1635 1215 -1333 -1869 -90 1320
2366A320N72k533r58l7K832O41j043k552j13K133J199K11k764n52N63K722J45
2383A786j774j656l4K730P04j96l138j60J055K537K11k828q79J10K947L64j057
2400G22k230j64J606J467m6k440l41N20K454K12j677j654j83K648O91l66k817
2417a598K39R13K053l2k116j109N81K094L19n60k316J75J378J376K78k532p52
2434a609N03K409J04j125j969J46K084J019m85k366j09Q79K185m7j799j189j11
2451a480K584N24q36j979m91J538J546K3k133r60M23K580M9j125j789K55J837
2468E66J087l67k389l24Q39J902L6j484j385j4K581L91l78k594J79J164J627J7
2486A454k010o26J15K575r1r28j856qJ737J420n13k254m75N97K232P8j220j589
$$ plain form
2366 1320 1892 -641 -1599 -1636 1196 1837 794 -1758 -1871 262 1461 1672 -1092 -1644 -1081 1641 1786
2383 1786 12 -1644 -1678 1052 1756 1560 -1578 -1738 -683 1854 2065 -763 -1642 -1532 1415 1779 722
2400 722 -1508 -1672 -66 1401 1355 -1085 -1426 -906 1548 1760 83 -1571 -1754 894 1585 1219 -1598
2417 -1598 -1359 -446 1607 1575 -541 -1650 -1069 1025 1344 784 -1532 -1357 21 1397 1675 -857 -1609
2434 -1609 -1106 1303 1407 282 -1687 -1541 543 1562 1077 -1289 -1398 -519 1666 1619 -180 -1369 -1480
2451 -1480 1104 1628 792 -1187 -1678 -140 1406 1429 -704 -1664 -1241 1339 1388 263 -1526 -1271 566
2468 566 1653 1286 -1103 -1427 -588 1314 1350 -134 -1519 -1533 1048 1439 1061 -1533 -1354 -190 1437 1454
2486 1454 -556 -1182 -1067 1508 1417 489 -1367 -1375 362 1782 1269 -985 -1460 -863 1369 1447 227 -1362
2504a362j16K210O57l35k232k56J103J898r3j903j079L26K253N69r28k211L6J533
2522G0J310n7k173q52J058J890P0j152j582J37J626J001l88j966l06P81K044l57
2540A154j383j389L18K213P24p34k303o1J708J252l66k231k10M19K209p1j115
2557A34j518K52J782P39k71k126JM29K288l92j477j211K29K093N86q45k289L30
2575a266J336J381j96j731j020L28K244K48r34j973K22J639J094l89k078q3Q24
2592c54J691k10j210j268K0K017O77n22k249M40O38K062m51j886m61M26J666M89
2610A515j209j516J12J408P63m30j462n90P88J747M0j065j667N09J945L05m19
2627G74k048J60R53J745m40j816r46R06J942j47m98j805O8J347J136n00j474n61
$$ plain form
2504 -1362 -1478 732 1389 1054 -1178 -1434 -331 1567 1474 -429 -1508 -1182 1071 1640 712 -1499 -1463 70
2522 70 1380 1323 -850 -1702 -644 1246 1316 164 -1418 -1281 345 1346 958 -1008 -1314 -533 1511 1154
2540 1154 -229 -1618 -1300 913 1637 903 -1400 -1461 247 1499 1133 -1098 -1308 -889 1320 1249 134
2557 134 -1384 -1132 650 1389 1118 -1008 -1007 -578 1710 1318 -159 -1370 -1141 952 1538 693 -1596 -1266
2575 -1266 70 1451 1255 -476 -1496 -1168 1076 1324 390 -1583 -1361 278 1372 983 -1095 -1178 -354
2592 -354 1337 1127 -83 -1351 -1331 686 1363 841 -1408 -968 -330 1732 1281 -605 -1066 -640 1026 1515
2610 1515 306 -1210 -1098 310 1073 643 -819 -1409 -621 1126 1166 101 -1566 -1057 888 1193 774
2627 774 -1274 -1114 -161 1584 1144 -672 -1618 -712 1230 1083 585 -1220 -1152 195 1331 831 -643 -1204
2645a204N40J749q9p91j583K58J513P04r0k274N4J085J364m49r90j403P84J663
2663H41L15p62j844N60Q87J487p05j553k19K06K169j53j058j469L65J593N19j05
2681A074k146J39M36J715k60j291j063N10J687K54n71j917L36J061J672j063j247
2698f74n91L58K192k58p40j564M03J244R01l31k033J68N33J525j66j207r88M78
2716g50J485K11m36j534J19Q28J209m46j063q35N07J805j42o10j672N61J066Q52
2734A155n99j422m65J143J211k2q96j310L25J656L30n84j598K86N80J355j55j335
2752c45o39K72J330K77o85j336L92P06J226p84r63o67L66K069n52p69j091M23
2770g70J287N96q39j304J68R28J196o75q25j149P00J509K01n75j777L77J155J272
$$ plain form
2645 -1204 -664 1085 996 205 -1378 -1120 393 1097 1007 -1267 -1213 -128 1236 787 -203 -1606 -822 841
2663 841 1156 394 -1450 -890 -3 1484 779 -774 -993 -787 1382 1229 171 -1298 -933 660 1179 1074
2681 1074 -1072 -933 -497 1218 958 -333 -1396 -886 801 1055 484 -1433 -1097 -36 1636 573 -674
2698 -674 -1265 -907 1285 1027 287 -1277 -874 370 1271 940 -1093 -925 -392 1133 967 -240 -1228 -750
2716 -750 735 946 510 -1024 -905 -77 1132 686 -377 -1212 -705 1100 958 348 -1324 -763 303 1155
2734 1155 556 -866 -1331 -188 1023 1001 105 -1205 -880 776 1106 522 -1076 -790 -210 1145 990 -345
2752 -345 -984 -712 618 895 210 -1126 -734 -28 1198 414 -549 -1216 -850 1219 667 -102 -1193 -770
2770 -770 517 1113 274 -1030 -862 66 1262 587 -238 -1387 -687 822 1023 448 -1329 -952 203 1475
2788A475p46j264k70N17J539k55q51j557Q14J056M20l28j460J61M27J505n92q65
2806b74j028P54J309K30n09j677M39O89J305l67j051p92O77J245j37p41j412O86
2824f54Q05Q43o52j130l42Q25J515m43r73j040N52J367N42o22j657J31Q63J543
2842A473r01j130n70O87J489j60o17j443N89Q37J183p21j549O4N46J640p85j043
2860d11o76N81J111J89n25j186J67O34J268l32j184n16M38J328j15o85j305N03
2878g16J029Q16q64r39k51P56J044kq34j101O55J017L21r93q26M13L10J328q10
2897C53q49n18M62J303j44k93j470M66R11Q90o27r02o33J048R59j52o91j278Q54
2916c11O86O77o58j225K21N82R22j34j085o95R06R73L12j036r36J30P28R22o32
$$ plain form
2788 1475 729 -535 -805 -288 1251 996 145 -1412 -598 458 878 550 -910 -749 -322 1183 591 -274
2806 -274 -1302 -548 761 991 482 -1195 -756 -67 1238 871 -180 -972 -295 950 813 72 -1340 -654
2824 -654 151 994 342 -788 -1130 -305 1210 767 -206 -1246 -694 673 1215 593 -1064 -933 -70 1473
2842 1473 572 -558 -1128 -441 1048 888 271 -1172 -583 254 1437 716 -833 -769 -223 1417 632 -411
2860 -411 -1087 -506 605 794 269 -917 -750 -116 1152 820 -364 -880 -442 886 771 86 -1219 -716
2878 -716 313 1129 265 -674 -925 -169 875 873 39 -1062 -407 610 931 -62 -888 -475 -165 1163 353
2897 353 -496 -1014 -552 751 607 314 -1156 -690 221 1111 484 -418 -1051 -3 956 804 113 -1165 -311
2916 -311 375 1052 394 -831 -610 -28 894 760 -325 -1020 -114 859 1171 135 -801 -671 57 979 347
2935C47q19n64Q84O33J59q17p71M14M66J074o50r48k38R37Q80m68n92j023P46
2954c50J070J42o73j007J16O05J121o77p57n53P10Q08P5m16r38J48Q67O38q25
2973A04p34k15O21J327o62r99l88M90R66K44p59o42K72M55P92l56r78m97R22N58
2993E21K65m39j078J30P92Q96p58j038k44O76J377o62n12r57P40P77K99p31p07
3012f53JQ50P54n04o79q79R59P28J57o02r08K92L90J059n59r61k45P14R59m51
3032D22m75j032O66R01K76m24j091K59N64N96j00q19q25Q84O93L12q61q65J86
3051g33P68P34o96m51l46M53R94j08o44r28N86O87M36o65p98k7Q79P71o25l91
3071a04o82M83P00M37p98r03M15M25R77o76o22k64M80N95J44p39p03M69P45P06
$$ plain form
2935 347 -472 -1036 -152 481 640 -177 -948 -534 -68 1006 356 -592 -830 107 987 519 -73 -1096 -350
2954 -350 720 862 189 -818 -702 -97 1024 347 -410 -963 -253 555 630 214 -724 -576 291 929 104
2973 104 -630 -845 -224 1103 441 -558 -946 -456 510 754 -5 -647 -375 80 872 516 -462 -959 -37 521
2993 521 786 347 -731 -601 191 1087 329 -709 -953 -277 1100 438 -74 -1031 -291 486 785 54 -653
3012 -653 -652 198 952 448 -231 -1110 -151 577 734 132 -776 -484 -94 965 406 -555 -800 -86 873 422
3032 422 -53 -1085 -419 482 758 334 -757 -498 66 662 562 -257 -1082 -198 495 807 -54 -919 -733
3051 -733 35 769 73 -378 -724 -271 723 615 -29 -957 -371 316 752 87 -711 -738 141 912 287 -104
3071 -104 -786 -303 397 834 36 -867 -452 -27 950 274 -348 -612 -132 463 607 -132 -835 -366 379 1085
3091A085o50r36J12L20P63j74q55n31O45P32K02m66q89K28M93Q62q10k26n21N40
3111g6O69k04k71r17M29N54M88j62q82n68R90O89k74m35r19O65N14O18q58n97
3131e47P3L65P70l31n49m89O68N45K0n54r17N65O48L78o37o31L5O66L36K14n60
3152F8r76M58Q11M95n59p52m3O99M43l44n35l39L26P38J56o71n49oO66O35n67
3173A54m79j84N12O62k04p56m44N96N79J82n06m80j77P58O13l32n63p42Q43O09
3193F41j88n41n95L27M33R06o60n36p36R52K64J50m40n26J75P04N58p83m38o3
3213c96L92O26L3r51p06R55M06M71o71r19L44K37J021o11l06n39N25N15N9m13
3233G2n92J48M00R41o52o72j39M84N05l0p43l92M71L63N12n30p73L28O30j00q4
$$ plain form
3091 1085 435 -501 -389 -69 694 520 -335 -866 -221 511 713 247 -642 -414 79 941 131 -95 -616 -76
3111 -76 593 389 118 -799 -370 184 672 510 -372 -940 50 739 465 30 -889 -224 290 908 50 -547
3131 -547 -474 -109 661 330 -219 -708 -40 505 525 -29 -946 -381 267 645 8 -623 -588 78 414 628 68
3152 68 -908 -450 361 856 297 -455 -498 201 644 300 -235 -574 -248 490 646 -25 -574 -580 86 721 154
3173 154 -325 -509 3 665 461 -295 -739 -143 436 618 112 -368 -545 213 826 494 -69 -811 32 641
3193 641 453 -88 -683 -356 77 983 323 -213 -949 3 267 417 -23 -549 -374 330 888 105 -333 -396
3213 -396 -4 622 655 -296 -1002 -47 359 830 159 -760 -416 -179 842 231 -75 -614 -89 426 485 72
3233 72 -520 -372 28 969 317 -355 -494 -10 495 465 -278 -670 -199 164 676 146 -627 -299 331 231 147
3254A47m35m09O36Q2L57m89n34K69L58O98o55m26j92N95N80k74l07o28L39O48
3274C60K07n48o01K26N85L07m20j87k54J91O34j89l79n75J32O80M40o40j83m07
3294f21N94N18j15n82j74P8M79L13n40p7k85L10M68l37k41m82N47L65K50n09l27
3315c68Q7N59K11m59r2m38L90N64p3m67m92K98M01P20q15k36j96L82M77k48l01
3336i6l17L92M30j24l11k03l28P14O49n51m08m95J045j31O9n81j93K00M99K23
3356D83m79l26j05N74M05l11l13l82L84L95jj41m98o9M28M50n20k69k3K62L56
3377C00n0l22l45N41O2M91n39m06k62L10N19j81j50n58M21L93J79m27l54q0O86
3398B28L60k76l79m16L12L83j79r6l29L0N30J65l26pk66J58K67k9l27k09K75K33
$$ plain form
3254 147 -288 -697 -61 21 378 -111 -645 -376 -18 680 25 -401 -593 2 582 308 1 -627 -288 360
3274 360 567 19 -582 -356 229 536 116 -71 -325 -134 500 311 -68 -643 -511 169 609 -31 -214 -621
3294 -621 -27 491 376 -206 -380 -302 177 490 -50 -127 -412 -102 366 29 -212 -694 -147 218 468 -41 -368
3315 -368 -281 278 489 30 -62 -500 -110 454 381 -86 -578 -280 121 841 26 -210 -406 -24 453 205 -96
3336 -96 -413 -21 409 285 -26 -229 -557 157 806 255 -153 -648 397 266 335 -246 -439 -239 260 483
3356 483 4 -322 -427 147 552 241 -72 -454 -70 325 324 183 -315 -384 44 494 -26 -295 -318 -56 300
3377 300 250 -72 -417 124 186 677 138 -268 -530 -220 299 118 -32 -590 -169 224 403 -24 -378 -458 228
3398 228 588 312 -67 -483 -171 212 33 -63 -392 -362 168 333 7 0 -266 -108 159 130 -197 -406 -131 102
3420A02M44k98k92k60L56M51n16j62m93N75L58J86o66P9n5J68M27l66N0n05P09
3441B92R9j67k98l64L00L29K19n23L2k61N89K37j94l20l11K28L65rj72m17J81
3462a65L64K08l80j3l15O36Mm10k5k28J69M95O2k82l12j3L50K04j61k58j4p6K05
3485D5L18p54J15J62K19M89l18m52q8L32J71k27L3m96N29K2J21k26l61R4L16K75
3507C19J4o16m4M46j46K13j69m16J35J21L96R3m20l99L33K91J07l55K4o3R8N00
3529D62m19k08o8K97J76j7l80k19P3N68J32n66Qk52K70L11j04kp06P30J41J30
3551C57n16r4oM34J24l62l9k09L03L59l01k32k41J37P02q6l96Lm03L25O61n18
3573BJ09l88J23N07km46k84M59j39L89k18l14M1K59O4J93o00o7J16L86M25q25
$$ plain form
3420 102 546 248 -44 -304 52 503 -13 -175 -668 -93 265 451 -215 -136 -191 -23 404 38 88 -417 292
3441 292 391 224 -74 -438 -138 191 410 -113 -81 -342 247 484 290 -30 -341 -113 252 243 71 -346 -165
3462 -165 199 407 27 14 -301 335 339 -71 -96 -324 -155 340 402 120 -192 -205 145 349 188 -70 -84 -160 45
3485 45 363 -391 -276 -114 105 594 276 -176 -264 68 239 12 45 -451 78 100 221 -5 -366 -272 44 319
3507 319 333 -283 -327 119 -27 186 17 -399 -264 -143 253 346 -74 -473 -140 151 258 -97 -73 -136 -38 462
3529 462 43 -165 -233 64 240 223 -157 -376 -303 265 397 -169 -161 -413 -143 168 64 62 -644 86 227 357
3551 357 -159 -253 -259 175 299 -63 -102 -311 -8 351 50 -182 -423 -286 416 330 -66 -63 -466 -141 520 2
3573 2 111 -277 -154 353 351 -95 -379 80 -59 330 112 -202 -161 98 162 355 -245 -312 -196 190 615 -210
3595b10L2n1L94j46K08n11Q2O4J95J82j27m61m6L83J44k6n1l45K25pK61j71k89
3618b71K81k24M88l48o3j00L94L30l14m17N7J58J59M1o0m25K14J90K40k68k63
3639b01P2K19k9J17k23l08J81K33K33m47M2j72L19L93j15l65j74J77m4L17l18
3660i3O2m97N82M14k98j92o0J70j77K85m70MJ27K46j91K6k30K43J36j03L70m66
3682a12j41J0N03j97J18k04LJ4L53R7o07J18k22L79j45j32K69n05O35j18k26K54
3704A44k89K64Nkl06K95N7n4O2j53k62j37M82J32q2j91j86J54J22Q7q5j48k16
3727c07L24K99L2l43l91K97M7L31m46K9J18O6K3j9j60j23K41J51j9j28j71K40
3749I1p5L48l45O3m72N02J23l5k08n5j00K56J26k9j64j57J16K14q4j99R6j5J79
$$ plain form
3595 -210 -178 -229 165 19 227 -284 -202 -138 57 239 112 -349 -395 -12 132 106 55 -290 -65 -72 189 18 -271
3618 -271 10 -214 274 -74 -137 -237 157 487 173 -244 -187 -29 130 171 111 -314 -100 90 330 62 -201
3639 -201 -129 90 61 178 -45 -353 -172 61 294 -153 -111 -283 36 429 314 -51 -225 -48 -92 225 -93
3660 -93 -31 -528 54 468 170 -22 -82 88 -89 196 -274 -270 -143 103 -88 -62 -292 -49 87 -16 354 -112
3682 -112 -253 -243 260 63 181 -23 -20 -6 347 444 -163 -45 -267 112 -33 -165 104 -401 234 116 -110 144
3704 144 -145 119 124 122 -184 111 168 114 176 23 -239 -376 106 238 156 -35 -221 -67 55 142 57 -91 -307
3727 -307 17 316 348 5 -386 -89 -42 289 -157 -128 -10 56 79 60 -100 -223 18 169 150 22 -149 91
3749 91 16 364 19 82 -390 112 235 200 -8 -63 -163 93 219 190 26 -131 -15 199 115 -84 12 -3 176
3772A76j84j18k22qK78M18p4l39k78M59K75l56k08r7M91k91J48J63l09q2K70K74
3794C86m25rl2j62L02J69k73m3q2M53k22J22k51l25N12N9K4m34p2K92k6K40j35
3817F8N1j97J25l6RN8j90P3J76J40k27q2Jo2P8J48r4K01J67m76K36k74m20O33
3841A06J77r5l23Lj91L81K35l12j03p9J32K17J38n05L45k71J84J11R7k40l0R2
3863F9M5J4j59l82J74J99K59n34J43M4j8J77O8j91K00l6j37L56j72k11J41J43
3885A92m27K56q2m8K18k92K70m87L23o0J12N2J32l20q9L81L2Nm11K88J57j78J88
3908B12l85K20j05K4J93O1l79p8L67p8J59j43m43M53k17J52J90k98o2K66k07J20
3930B2j93J73j34J17K24j4k99r9Q8K12J77j64k74J08K84J61l79o4J42n04N02j74
$$ plain form
3772 176 -8 -126 -348 -356 -78 340 266 -73 -351 108 383 27 -181 -278 213 -78 70 233 -76 -158 112 386
3794 386 -39 -48 -80 -242 60 229 -44 -87 -169 284 62 184 -67 -392 120 179 203 -231 -303 -11 -37 203 68
3817 68 119 -78 47 11 20 78 -112 -39 137 277 50 -32 -31 -93 -15 133 39 240 407 -69 167 -107 -527 106
3841 106 283 188 -135 -132 -323 58 293 -19 -122 -201 -69 148 286 -219 126 -145 39 150 247 7 -23 69
3863 69 114 128 -31 -413 -239 -40 219 -315 -172 -128 -146 31 99 -92 108 72 -65 291 119 -92 49 192
3885 192 -235 21 -61 -109 109 -183 87 -400 -77 -137 -25 27 159 -161 -250 131 163 168 -243 45 202 24 212
3908 212 -173 47 -58 -34 159 220 -159 -237 130 52 211 68 -375 78 -139 13 203 -95 -157 109 -98 22
3930 22 -171 2 -132 -15 209 195 -104 -203 -115 97 274 110 -164 -56 228 389 10 -54 88 -416 86 -88
3952h8r1N8j40M41j51p5m4J21j41J60r1K55l42J8K31O1k4l36k0O6J63J23p1m8
3976C5j11K27j07j69k03J96j39N06k58r6M5p2K01j8j35j4M7n6M3J27j81J01O6
3999C5K16l28j77l3M79j08J74l64K39j59K66k39j34j48K82M2m4P5l60L71l59K71
4021cJ09j31l2J04O3q3qj7J1J07p5L7l2k7j64K15R6j47J47l46J45J82n6j45k6
4046g6M9M18k83j84m7Q6L17n14J98k2k10Q5J85k41K98q1K1R3j76K6J5N4N5J45
4070B11k59M7m4J43j40K63l71J07K2l00N43l06PL06k08K18j46j24L6n6J60M7l9
4093A17j43J35k32M1Q6k51M10l24l1K69k9Q8P8l74K52J0m78L88k83K18J51N0l54
4116b06K33P1m2k01m2K67r0KJ00j40Q2K1k25K20Q3l18J10j33J90q0P0o1J08J41
$$ plain form
3952 -88 -179 -121 -261 180 29 -46 -90 31 -110 50 -41 214 -128 -110 121 182 158 -178 -198 -132 31 154 83 35
3976 35 -76 151 44 -125 -328 -132 -271 235 -23 -119 -74 -146 55 37 -98 -112 -65 -121 -78 49 -132 -31 35
3999 35 251 -77 -254 -287 192 84 258 -106 133 -26 240 1 -133 -281 1 43 -1 74 -286 85 -274 -3
4021 -3 106 -25 -57 47 110 27 19 2 13 120 45 82 50 23 -141 74 170 23 170 -176 -31 151 95 -50 -76
4046 -76 -27 391 108 -76 -123 -37 280 -234 -36 -58 -268 -183 2 -239 59 -22 -1 92 -84 -58 -43 11 66 211
4070 211 -48 -1 -45 98 -42 221 -150 -43 -21 -321 222 -84 -77 229 21 239 93 -31 5 -51 109 156 117
4093 117 -26 109 -123 -82 4 -247 163 -161 -192 77 48 136 214 -160 92 102 -376 12 -271 -53 98 148 -206
4116 -206 27 98 56 -145 -187 80 -10 -8 92 -48 34 55 -170 50 133 -185 -75 -208 -18 -98 -28 -89 19 160
4140A60L4k87j12j46K25L04j00j89K4J21q7J20J63l17J04k70M57n01N0J99j47
4161a95J21J8N1n2j64J19K19q5j12l1K83J53m95P8j55L73j89J85m27J82R3J53
4183A23R4Kk74j90N5J1J84m9J34k13J53j9K03m35J33J03K7Q1j02k25j64K33J46
4206A1Jk95K56j6J74o8l9j13L43j45j96Q8L1n4J11k14J77k83K80O0o1J51k77j17
4230a95J27K26r3j82K07j66R0O5Np8j36j4K19om1j18K49K8J28l86N9j15J08K83
4254B64m25P5j68j9N67j73j38j75L66j68k26J52LJ36j22l0K56l47L27l03J10P0
4276C2j12l1M2M0J6R8L3P0j48L6m7O1j97L2L1J69j12J85k06p8jO7k22K11l56K53
4302a34L17j28M9k64K31j79M92m31M4k45M03o3j49j8Oj08L82l18K92m23K73q4
$$ plain form
4140 160 194 -93 -205 -351 -126 178 78 -111 -87 34 -53 67 230 -87 17 -253 204 -297 -247 -48 -195
4161 -195 -74 -56 -5 -57 -221 -102 117 32 -80 -111 172 325 -170 -92 -247 126 -63 122 -305 -123 -30 123
4183 123 217 219 -55 -245 -190 -179 5 -44 90 -123 30 11 214 -221 -88 15 42 123 21 -204 -368 -135 11
4206 11 12 -283 -27 -43 131 63 24 -89 254 109 -87 1 32 -22 89 -125 52 -231 49 109 48 199 -78 -195
4230 -195 -68 158 65 -117 90 -76 14 79 84 6 -130 -144 75 69 28 -90 159 187 315 -71 -12 -127 -19 264
4254 264 -161 -86 -254 -273 294 121 -17 -192 174 6 -220 -68 -65 71 -51 -81 175 -172 155 -148 -38 32
4276 32 -80 -111 -69 -29 -13 85 118 188 40 76 29 90 -107 -75 -44 125 13 198 -8 -86 -87 -20 -242 -31 -387 -134
4302 -134 183 55 104 -160 71 -108 384 -47 -3 -248 155 92 -57 -75 -69 -177 205 -113 179 -244 29 -55
4324e5J56j85Q0k55K40K23j04k29l6q6J50J47r9K4J53k99L94j01k13J34j32J38
4346D5J06m5j31oK32m3j50l6l76L90K72j12o6j11k76Q8L4M59l05q5O5N3K35j93
4370D4l60L48J75j92q8j68M00j66M4J45l41M3J78Lq7Q6l5j62p0M48n2l95Q5L4
4394h3J37k2k49J47K03n6J1l18K60P4j74K99q6l00j62M07N4J16j71j40RJ11j47
4417h0L12l90qj20K43J87L38l21k81K97K4j25j72J68o0J85j73Jr3j43K98j65L9
4440c9M9k02K96J07l9l15l20K00L95p4%K29l48J31J80j10j80JJ26l7M4j00j52
4463a58P4L73k73O3j54m2K46J47k49pj73J95Jp0M4k05J73j62K47J9j98q0K01R5
4487A07P4j69j12K00n2L5j37l22L87N3n6J86k45L9o2L05L0j16j69K06n3K5l0j06
$$ plain form
4324 -55 101 -84 -4 -259 -19 204 100 -129 -165 -251 -101 46 -53 -29 124 -175 219 118 -95 39 -93 45
4346 45 151 106 -25 -31 201 158 8 -28 -404 -14 258 146 80 -31 -307 -219 -185 274 -31 -116 -51 2 237 44
4370 44 -316 32 207 15 -73 -241 159 -7 37 182 -159 -116 62 65 -22 64 29 -133 -203 245 193 -202 -117 -83
4394 -83 54 32 -217 -70 133 77 88 -230 30 104 -70 229 143 -157 -319 88 142 258 87 -53 -44 67 -80
4417 -80 232 -158 -166 -286 -43 144 482 161 -120 177 201 76 -96 72 12 197 24 25 -68 -211 87 -78 -39
4440 -39 10 -192 104 211 172 -143 -463 -263 132 58 58 287 -61 70 250 140 -40 -39 87 50 94 -6 -158
4463 -158 -84 289 16 79 -75 -117 129 276 27 20 -153 42 43 -27 17 -188 -15 -177 70 89 -109 -189 12 107
4487 107 181 12 -100 100 48 83 -54 -376 11 64 8 194 -51 -12 -74 231 261 145 -24 182 129 154 124 18
4511A8J51j06j1J7k24l0J67j65J17J41l2k71L80O1l57K61p2k34L75k57N9m4R0
4534C4J59P5k77k76J77K11K21Kl76J6m8j4K1K0j11K3J25L31m15L56m19K53L0J88
4558C06j30k80j01L26J3j50J40j25J32p0Qk05N0J80j17J31n4j16j09J01p8K42
4580I4k39o6J20K61q0J3k6m78M48l1q8j46O5LR3L60k42j49L19j47J51k41j07Q4
4604b9RP8O8j01j86L68q0J26o25K27l4N1N9K54j88J26k39J94J73j67l4m74N93
4627A69k12O0R9l78J0M17q0P1m43L05K0o2M8q0j73K12N2K16k33N3j93J24J3lk9
4652a7k03O52m11K31k30J6NJ8M6k06M1J45j32K24n1n08K92n2M60o3k61L4k91K74
4676A3J01m8k66K91r9N6K14l32p2K53n5j71p3P7q9K00O1j18J56n7j1k0j43L01
$$ plain form
4511 18 169 63 52 69 -155 -185 -18 -183 -66 75 43 -228 152 213 -144 117 45 -189 186 -71 -12 -56 34
4534 34 193 268 -9 -285 -108 103 324 326 -50 -34 -82 -96 -75 -55 -166 -143 -18 313 -102 254 -165 88 118 306
4558 306 176 -104 -205 121 134 -16 124 -1 131 61 69 -136 -86 94 -23 108 54 -62 -171 -70 -148 94
4580 94 -145 -211 -91 170 90 103 77 -401 47 16 -72 -218 -153 -150 -57 303 61 -88 231 84 235 -6 -113 -29
4604 -29 -20 58 126 25 -161 207 127 253 -372 -145 -179 -128 -69 185 -3 123 -116 78 251 84 50 -424 169
4627 169 -43 17 116 -262 -252 165 85 156 -287 18 38 -24 24 -56 -229 -17 35 251 18 71 -122 2 15 12 -17
4652 -17 -220 432 21 252 22 38 43 61 107 -99 -58 87 -45 179 128 -380 -88 -140 320 257 -4 30 -261 13
4676 13 114 66 -200 91 -8 48 262 -70 -142 111 56 -115 -188 -111 -200 0 61 -57 99 42 31 11 -132 169
4700A69m8k18K30m7k9m54L10J8L71j61J6k19K8O25k45k71L3j16j19K00j70n4M
4723a47N5L32j2k91j0J74j67N3J64k87j59K47P2P4r7l20J30K21q8J69j97J03J83
4746B02j54k9k93J34R8pJ63k32K9N8K67l46J70J3m3m7lL6mr4q8o2M87j55j85l
4772h8L20j33j13j12j99J22R8L31m42J19r9M95k86m8P1k64K87Q9j10M3j29p4K47
4795A25k88J76j39J73R4J91l94K0m1m4K65J15k21j76R2j65L74Q3l64m7K39n9Q7
4818I6J75j22j15J36j83K6j64j16K64R2k97L16j41j10K66K96n45J26k3j51N29
4839C55k46j26J0k70L44J6k72n8M17m9K6N7j60k34L78O3m09Q7n8m2M4L12Ll59
4863a71M4J20J38j99l51L10J81j00L60m41J81q5l23L36m0q8M2J21K25k06N7m40
$$ plain form
4700 169 121 -97 133 86 57 -397 -87 -69 302 141 157 -62 -34 591 346 75 108 -8 -127 73 -97 -151 -147
4723 -147 -92 240 228 -63 -73 101 -66 -13 151 -136 -295 -48 24 98 1 -319 -189 32 -56 113 -84 19 202
4746 202 48 19 -274 -140 -42 -49 114 -118 -89 -31 236 -110 60 73 30 -17 -20 16 12 -82 -170 -232 255 100 -85 -88
4772 -88 232 99 -14 -126 -325 -203 -105 226 -216 -97 -196 299 13 -35 36 -228 59 148 38 81 -48 -122 125
4795 125 -163 13 -126 47 141 332 -62 -42 -83 -127 138 253 32 -144 -52 -217 157 240 -124 -171 68 9 96
4818 96 271 149 34 170 -13 13 -151 -267 -3 89 -208 108 -33 -143 123 419 -126 0 -23 -174 355
4839 355 109 -17 -7 -277 67 83 -189 -247 170 121 147 204 44 -190 188 251 -158 -71 -129 -171 -127 185 188 -171
4863 -171 -127 -7 131 -68 -419 -109 72 -28 332 -109 72 -13 -336 0 -40 -128 -86 35 260 54 111 -329
4885c29Q9K07pQ8opj53M44m09Lk91N61k81J43J3o1O3l4p1j84L06j23k74N30q9
4910A28L8j57k98L90J9j96k80J81N5J62j38j80K35Q9j1K65n42L2J18K89k59J84
4932A24m3k52J54J0J48O7k63j76K51M49l84j28k29K91j0j07q4j1J78J16l8j76
4954a13k8O7k08K77k32J57M5l7M09k72O4k91M46l83l8J80O7k57J31J62n8k72K2
4977a62n2J87J4J24k79l8K92R2j19j01k10J27K12j92k4j28L21q4J80k30R0N9J58
5000B37p7j5k78q6J63l6L36k21n3K5O5L58n37o8J32K3M20k02l6l59j03L62j23
5023g3J47l38N8N0K53j82j61L21k23K9L31k81k13K26J72j46j06K37k30K82J08
5044B61j10l85QN17l70M27l66k38N79j91J08k9k26q9J58J43j5k24N1l58K58J26
$$ plain form
4885 -329 -240 -33 -40 48 42 35 -118 326 -83 -80 -371 190 -91 52 65 4 67 33 -38 -222 84 -39 -313 217 128
4910 128 166 9 -289 101 120 -76 -356 -175 -120 42 -96 -276 -41 48 37 302 -240 -208 -90 199 -60 124
4932 124 81 -171 -17 -7 141 208 -55 -231 20 469 85 -43 -272 19 9 -98 -182 -193 -15 101 63 -113
4954 -113 -141 -74 -282 -5 -237 -80 -35 -72 337 65 129 -162 284 -99 -137 43 110 -147 -16 146 88 -184 -162
4977 -162 -214 -27 -13 111 -168 -206 86 178 59 -42 -252 -125 87 -105 -129 -257 64 -20 160 -70 20 79 237
5000 237 160 145 -133 -219 -56 -92 244 23 -30 -5 60 418 -119 -187 -55 -32 388 186 150 -209 -312 50 -73
5023 -73 74 -264 -206 -156 97 -85 -246 75 -148 -119 212 -69 -282 -56 116 -30 -136 101 -129 153 261
5044 261 151 -234 -226 291 -79 348 -18 -256 323 132 240 211 -15 -104 54 197 182 -42 9 -349 -91 35
5066C5j10N2j82L18l4J66k21k45K86n0K70k49k28k19L91K21m5r2j21R0K0op8k10
5090b41K54J95j22J53n11R5M80m61K80p3l80K56j46K58J82l19J94j68J16J02k61
5111a17k0n7K34J74j32m03L08J28q3j39p3LM5K61j74K12k12j84M07p9j31O3M8
5134G9k14K66O3m39k47M72K39j05k61O4o6J32K68o8m18K13J33J6o3j03K18k10
5156c1J64j10J95k96j6K93J29k84k72j9L51j73Q0J9J42l51J78k19J17K43l69L03
5178G4o4o2k5L6N7j96M93l77K86l77K29l7m6K16j64j45K82nJj71nR9n9P3k43J24
5204fJ70k57K73j57k47J13J6J61r1o7j42J72O3j2J4j03l5J50K30k77j7j32L18
5227A37k32R8J78k50L1J39J8k20n3K07j06M65n82J99m56K70L15O3k78k01M91k78
$$ plain form
5066 35 -75 -23 -205 113 79 245 24 -221 65 15 285 36 -192 -411 -20 201 156 64 -57 33 53 47 -31 -241
5090 -241 13 208 86 239 -272 -177 303 -158 122 49 -331 -75 -221 37 219 -100 94 -74 42 144 -117
5111 -117 -137 -194 40 214 82 -321 -13 115 32 -107 -180 -177 -132 129 -45 167 -45 -229 178 99 -32 31 79
5134 79 -135 131 194 -245 -492 -20 219 114 -147 -83 -149 -17 251 183 -235 -22 111 127 64 -39 179 -31
5156 -31 133 23 218 -78 -94 199 328 44 -228 -247 104 -69 11 30 172 -179 -1 -220 -103 140 -229 74
5178 74 10 -52 -77 -41 16 -180 313 -64 222 -155 74 37 -9 207 43 -102 180 175 176 5 0 99 40 113 -130 -6
5204 -6 164 -93 180 23 -224 -111 -95 66 -25 -92 -234 -62 1 -11 3 -100 -135 15 245 -32 -49 -181 137
5227 137 -95 3 181 -69 -38 101 119 -101 -154 53 -53 412 -170 29 -427 -157 158 221 -57 -258 233 -45
5249d5K81l61J82l34L97J42k06M7j83K23K17m11L27l69lJ92J02N3j72l24O3J86
5271DJ02k15O6J37k96O24n00kJ25J7j63L27k03j81K7K71j30Q5j22j18K40n3R5
5294A37k06Q2k55L06j76J37o7P8j01J4J76j23j75L71l4p8l77L46j48K26n7j70
5316i4J40l02K20J8l8o4J16NN6J26r5l88L26j44L03j23j35p7J95%O5M8q2n3n1
5341b8J46l28L1J49J98m09L63l6l28L61j39J57o8k31KL2P4L98l65L4J5n5J0Q5
5365F8l21K74k11L64J7k04j11K33M0K69m82L9Q6j47M62m34qj1L93j08K6m48j06
5388c20L67n5K32k27k01K55j02K1L46m41j61J87J20n7J72m65L55Q8J36k78l01
5409c29J73K84J41l45R9n54M30J76Oj94p7L66q7o0j7j6j98J72l5k00K52m8q5K78
$$ plain form
5249 -45 236 -125 57 -277 120 262 56 103 -80 143 360 -51 276 -93 -96 96 198 251 79 -245 -182 4
5271 4 106 -109 -43 94 -202 422 -78 -80 45 62 -101 226 23 -158 -131 140 10 95 -27 -145 95 42 137
5294 137 -69 13 -242 64 -112 25 -42 36 -65 -51 125 2 -173 198 164 86 -291 55 -93 133 76 -94
5316 -94 46 -256 -36 -18 -56 -120 -4 1 57 183 88 -300 26 -118 185 62 -73 -150 45 45 110 158 76 23 -28
5341 -28 118 -210 -179 -30 168 -241 122 86 -242 119 -20 137 69 -162 -160 -128 -54 344 -21 13 28 -27 -17 68
5365 68 -253 21 -190 174 191 -13 -124 109 149 418 -64 -25 61 -86 376 -58 -66 -77 316 208 234 -214 -320
5388 -320 47 -8 224 -3 -204 51 -51 -30 316 -125 -286 -99 21 -36 136 -329 26 114 250 -28 -329
5409 -329 -156 128 269 -76 23 -531 -101 75 81 -113 -190 176 89 29 12 -4 -202 -30 -65 -265 -13 -61 -146 132
5433A32l5J6j94p2P2M44m04K16j71k04L25r4j64nN1J8K49k07J95l32J17L1k4P7
5457C7m88L58M25N2l79q2j44N61l22J29m0K15m11L04j34j74O1j23K35K50j40k62
5479g2K23j12Q7k95J24L0K37k02l9j05mJ87mj02J66l59M6L26m8N7K5Ok14J58l9
5504G7rk21J92l9K48p3J3l98K35J26k45J68m0j61K86j84j80m1Q7J85K08j99k9
5527Fj9j9J31l8K5j15k8K32k34%n1K45k89R8j08r0M03k51M4K3K61l54K7J62NR6
5553A62k88M10m70K77L2k15K27k61k35L15J06J06j86j30R1L8j08K15k91J36J41
5574G2j4l68K62M8J59j03j25J88k62K60k0j84j30M15k80K09j33j14J95j12mN7
5596A6j07j19L9K5K53k06R7j13l2Q7N3k10J35n5j06L69l33R6J44Q9J51k55j63
$$ plain form
5433 132 97 113 -81 -153 -81 363 -41 175 4 -200 125 31 -133 -138 -87 -69 180 -27 168 -164 -47 -16 -40 37
5457 37 -451 -93 332 384 5 -77 -221 340 18 147 107 322 -89 215 81 -93 -32 -155 80 330 190 -72
5479 -72 151 39 126 -169 -45 -15 222 20 -19 -124 -128 59 55 -47 119 -240 -194 132 84 141 166 172 -42 116 77
5504 77 68 -153 39 0 248 175 188 -210 25 151 -94 74 34 -127 159 -25 -205 -246 -159 26 234 35 6
5527 6 -13 -32 99 61 86 -29 -57 175 -59 -59 -110 135 -154 -56 -164 -254 149 -102 -58 -35 226 -128 -101 61 66 162
5553 162 -126 284 -186 91 123 -92 135 -126 -361 -46 60 166 -20 -150 -59 -21 -129 86 -205 -69 72
5574 72 58 -310 -48 0 159 56 -69 119 -143 117 97 -87 -217 198 -82 127 -6 -120 75 -37 -41 16
5596 16 -91 -210 -171 -146 107 -99 -2 -115 -147 -60 -7 -217 -82 -137 -243 126 -207 -111 33 122 273 18 -145
5619a45p4K08J65j75r0O3J49k53l4J93l6j5L3j40L95l55J27j61J39j01K7K61k13
5642c2p3J3J27j19R0k45M75l08J3j23L40m5L31k48k48J33l15L19N2J23k07p7l27
5665c51L11r5J51j48Q1J07Q6j28l6k71M77J12r4l27n2J90n2pK59j95j54Q7pJ53
5689I7o01O60N6j07k18j09L24q5N3QL3l75K99m4j58J85j23j10J78N9K02p3j02
5712D9k53L38q8o4J2M7%j29L47k23k9J44p8rj51J44R1j04j55J04K15j26Pp7k03
5737a91J51O2J37j83K28j69j26j53K03N8R6k55J93O9l39N60m55rJ10J83J14j38
5759A46J64m38J78m7N4N3j33N5k6J62q6K52k67Q1Q8P8k25k97K18J48J11j66k3
5782H0k15J50J46j88r9M84k01j57J49P7k07q6m3K19o0LM31l44l21K39K09n4Rk13
$$ plain form
5619 -145 -219 -11 154 -21 -111 -48 101 -152 -186 7 -29 -44 -11 -151 244 -111 16 -145 -6 -107 -80 181 -32
5642 -32 -105 -92 35 -84 6 -239 236 -72 -59 -182 158 113 444 196 -52 81 -234 85 137 260 53 -24 -351
5665 -351 -40 -135 16 -132 -51 56 142 14 -22 -293 184 296 202 -125 -177 13 -39 -46 213 18 -136 -49 -56 97
5689 97 -504 156 212 105 -113 -222 102 17 70 78 111 -264 35 -9 -167 18 -105 -215 -37 22 224 151 49
5712 49 -204 134 46 -18 -6 41 41 -88 259 36 7 151 73 64 -87 57 148 44 -111 -7 208 82 89 12 -191
5737 -191 -40 22 159 -24 204 35 -91 -244 -41 17 113 -142 51 120 -219 341 -114 -123 -13 170 284 146
5759 146 310 -128 50 3 57 110 -23 32 6 168 82 334 67 148 236 314 89 -208 10 158 269 103 80
5782 80 -135 15 161 -27 -126 358 157 0 149 226 19 -67 -110 109 49 52 483 139 -182 57 266 212 221 8
5806HK39l96R4p9J47J74Ol44K46k24K28o6j45K90k53K24lr9n3n9J06q8j22N8j63
5831b74O08k79K30k69J36k83K52l1j94Q8J37r2k28M30m68Q4J27J1K9pk08KL95
5854A96k56N9Q8J14j90K80k00J1j19nj06O6K00q5k72K04J25lj71l5J20r2N3j38
5878a56J19O4k10K92o3L5k44m9K69J06l5Q4j79J96k78K36p5j1J36m82K64RJ51
5901A79k99J24j82P0J45L1k4p5P7j14K57j20n5Q1j57k10L95j75P8K04k41J06l7
5924E8J84j82Lj63k0J63j6l3j93L37k30K28m23Q9L25q3j5Q4J19k51r3O0J21m8
5948B1M4k43J21K57k31j52O0J86n9J57l0k66J33P3J6J26j97J00k68RJ64p6n8j35
5972b48%L64n3k2M9m6P4l18J01K9q9J65J00o0j61K53L2J18j07j52k12K1J65j03
$$ plain form
5806 8 247 -149 -55 -134 13 187 193 -151 95 -129 99 33 -112 178 -75 149 146 47 -6 -65 41 -47 -169 -111 -274
5831 -274 334 55 285 16 152 -131 121 90 -104 -16 121 29 -199 231 -237 -153 -26 -15 14 7 -201 -199 196
5854 196 -60 -1 87 201 11 291 91 102 -17 -22 -128 -62 138 53 -219 -15 110 107 -64 -99 21 -71 -18 -156
5878 -156 -37 27 -183 109 46 81 -163 -212 57 163 128 212 33 229 -49 187 112 101 237 -245 19 28 179
5901 179 -120 4 -178 -108 37 68 44 -31 46 -68 189 69 14 95 -62 -272 123 -52 26 230 -11 95 58
5924 58 242 60 63 -100 -120 43 27 -6 -199 138 -92 136 -287 -198 127 44 29 113 232 -19 -112 -52 69 21
5948 21 65 -178 -57 200 -31 -183 -123 63 4 161 131 -135 -2 71 87 213 16 116 -152 -143 21 -55 -113 -248
5972 -248 -248 116 63 41 90 44 118 -200 -99 -70 -159 6 106 46 -115 138 170 288 181 29 -183 -162 3 -100
5996a00O4J47j8J52k01j38J95j34k03ML60j78q1K02j66J97l68L05R3j90L23k83
6018a8l38L34J20j57N8L8j89K48j76O8K12j19l65o0N21k48J28j07M5o4J79L2j79
6041c7%J19m5K91n08R5K68m1o9j1K0k04K06j77K66n1j52l08L87no4J21l02K0j7
6066a98M9L13k10j2J41J32k27j64N36l09J98o6j88j83P3J29q4R5j09J7j80N5J08
6089h4PK61l25j09N05j82j7K2m7J63j53j17K8P9K10p3l10J54k2P3k01K50OM1k72
6114a13J85N9l9J53l3j89R0j46l7l7K62K1o1M7J33P8j45q0j23J38p9on7N4k35
6139a60L04p0q2Q9J3NJ84l37j04K3J16k5j46L57n1k03m3O7L50m39J17np7K21o6
6164C8l51L26M5n8O6j08J80k32J60J82l05o4k27K78J26K03k17N7j83J1J55l13
$$ plain form
5996 -100 -36 111 93 245 44 -94 101 -33 -236 -232 128 -50 -131 71 -95 102 -266 39 132 -58 265 -18
6018 -18 -356 -22 98 -59 -1 37 -152 96 -80 -12 200 81 -284 -344 177 -71 57 -50 -5 -69 110 142 -37
6041 -37 -37 82 37 328 -180 -85 183 142 73 62 82 -122 84 -93 173 122 -30 -338 49 44 -20 101 -201 -181 -198
6066 -198 -149 164 -46 -58 83 215 -12 -176 360 51 249 183 -5 -188 -115 14 -70 25 -84 -67 -247 -192 -84
6089 -84 -77 184 -141 -250 255 73 56 78 31 194 41 -76 -48 31 241 168 -142 12 -10 63 -138 112 118 159 -113
6114 -113 72 131 92 245 212 23 113 -33 -70 -107 155 176 115 162 295 373 228 148 25 163 84 78 21 75 -160
6139 -160 144 74 -8 81 94 99 283 -54 -158 -135 -19 -44 -190 167 116 -87 -130 -63 287 -152 -35 -40 -117 104 38
6164 38 -313 13 58 0 66 -42 138 -94 66 248 -57 -121 -348 -70 56 259 42 99 -84 -73 82 -231
6186b31L3J33n5J11K18k76K2j54J22K28M7l73J62K28k33K30j70q1P6J17o5P9l5
6209A33j80k1J11k9k9j63l5K08o7J10k02J81j56N7J19o0M7l0J30m23M46m6m10
6232c09M82m90J81m2N6K26j88K21j73j6J57m2j5K52l71N78o99K47k05k4J97j25
6254a02Q8J53o7j83J03J73k1j42o4K3K65j68N0q0Jm67L31K97k60J56m3L4J19k05
6278ij47N0K64J11k29q1q3J80j23lm9Q6k2j8P9j07j46J62%R9J10j30p2M9j71n
6304b05N0K3J66J68m58L86j70j1J8j23J99j53K40j1k53M22k07j63N3p7K74K5K4
6327B17K8l44J80k56K80q9k23N5P7M6n4J89k68Q6j0N9p7K16nk3q7j88%J52j3K48
6353A96k82PK9j22L59L1m98L01j67O5q0M2J05O9l5ro7J74r9k12r4K93j43j0J23
$$ plain form
6186 -231 -198 -65 -120 -9 209 -67 -45 -199 -77 151 198 -175 -13 215 -18 212 42 -39 37 154 89 168 133
6209 133 -47 -68 43 14 -15 -178 -213 -5 -72 38 -164 17 -139 -82 37 -23 24 -6 124 -299 147 101 -309
6232 -309 173 -317 -136 -178 -122 104 -84 137 -36 -52 105 63 48 300 -71 507 -192 55 -150 -174 23 -102
6254 -102 -14 139 72 -111 -8 165 144 2 -62 -39 226 58 108 28 29 -438 -107 190 -70 86 43 77 196 -9
6278 -9 -156 -106 158 269 40 -41 -124 56 -67 -70 -119 -33 -55 -73 6 -101 -247 -85 -85 14 124 -6 -78 -29 -200 -205
6304 -205 -155 -132 34 202 -256 130 -40 -51 -33 -156 43 -110 130 119 -134 288 81 -82 -29 -106 168 193 217
6327 217 245 -99 81 -175 105 16 -207 -152 -75 -29 -83 106 -162 -76 -86 -27 -104 112 107 84 -3 -191 -191 -39 -52 196
6353 196 -86 -79 -50 -172 187 218 -280 21 -146 -81 -161 -119 -14 55 20 11 -56 118 19 -193 -287 6 -137 -147 -24
6378b4k5J98k13N8k02J36J72o3n0K6k2L2K2j56K01K6m2l19L43k13J66k51l3K72
6402C9o1k86j02L35M5j16j5j10M68k19q4J03K1P2j13J47j52j6J17N0q1J06n28
6425c80J68J44J53N5l76O4J16N8j48Q7M8j55l2K91nj52j8O3q6R5J10l13k6K12
6449b7Q7k33j4K05k7J03j6N4M3j03k17n3J32l1N8l06K90q1K36k05j3J07K23k19
6473gJ45k38K48j4j77k03J41j8k14K31L17l84J31m9k1K20n7o2J3J80p7J47n24
6496b72K10J29M8j16j3J5k56K47J8m9O3k93K95k67q6K09L9MM32k86k38K19n2o9
6520f9K4j3j56J33K2M3R4k81K36rJ1j09j79N24k25k61L78q4r8Mj80K68l2j11K55
6545A85N7r1o5Mj11O8p8J65N2j81l2J2R2j97R0N2r8K75j77j7oP1L4R6m16K75p1
$$ plain form
6378 -24 -49 149 -64 -6 -208 -72 100 37 -13 13 -9 23 45 -111 90 116 74 -245 98 -115 51 -200 -233 39
6402 39 -22 -308 -410 -75 -30 -146 -161 -271 197 -22 -106 -3 18 90 -23 124 -28 -44 73 123 42 148 -380
6425 -380 -212 -68 85 140 -236 -172 -56 2 -146 -59 -11 -166 -198 93 88 -64 -82 -19 -105 -10 100 -213 -239 -27
6449 -27 60 -173 -187 18 -9 94 78 132 175 72 -145 -198 -66 -97 -39 -345 -55 -136 100 -105 -118 -11 212 -7
6473 -7 138 -100 148 134 -43 -246 -105 -123 -337 -106 211 -173 -42 -91 -112 108 51 -11 2 182 105 252 -272
6496 -272 -62 67 115 -1 -14 1 -255 -8 10 -39 24 -269 26 -241 -327 -118 -79 -75 357 71 -167 52 0 -69
6520 -69 -45 -58 -214 -81 -59 -16 78 -203 33 24 35 -74 -253 271 46 -215 163 79 -19 -15 -195 73 41 -70 185
6545 185 242 151 86 90 -21 47 -31 134 186 5 -27 -15 77 -120 -30 22 -76 199 22 5 -1 70 104 200 -216 59 -12
6572a2lK0k2j52K44k23J6K50l8k80L76k09o8O3l2J88k6K0o4l5j23K76mk59M58
6597C61m93J23k12K87j45M1j76J2K95k83L21k15k5J05m4J68j82J74K2j49MK70
6619B59m37P0J93l16K42L05m06K18o3q3N5m09M86k05L15k57Q6J8j24K71Nj59l05
6642b41J25R5p7K81l64K28k23J81j7L1J36kOj86Q3q0P6Q8j93J28k06r3L64q6j87
6667a33K15p1K12j69r9j41P6M7J39L2O1n1k12J58p1J02k03K1J78J45k97J58m65
6690c68L00K19K06k91q7r4M41k86R7k22J95j34K84k66k9j67l5M14nk52K5P5j55
6713a35mL75k29k0j08J25M4n2J04j07J65j37Q5l82K63J29j35j30M6L54m24k2M2
6736a53J14O4k10L9J26R9k61J66J6k11J73k67M81k46K64j43n0P4j07k9J7l3J09
$$ plain form
6572 -12 -15 5 -17 -169 75 -148 -132 118 80 -200 176 -33 -101 -38 -70 118 92 112 48 13 -110 166 162 -97 361
6597 361 -132 -9 -221 66 -79 -38 -214 -202 93 -190 131 -84 -109 -4 -48 120 -62 112 134 -15 -11 259
6619 259 -178 -108 85 -231 11 316 -90 128 65 -18 37 -372 114 -91 224 -33 53 71 -53 218 223 64 -241
6642 -241 -116 -21 -98 183 -181 47 -176 5 -12 19 155 153 159 -27 56 -24 52 140 -53 75 -131 -224 140 54 -133
6667 -133 82 11 223 54 -45 -186 -110 -63 76 108 169 118 -94 64 -7 95 -108 -87 91 236 -61 97 -368
6690 -368 -68 151 357 66 -21 -115 326 40 137 -85 110 -24 260 -6 -35 -202 -237 177 172 -80 -55 20 -135
6713 -135 -139 236 7 -13 -121 4 48 -4 100 -7 158 21 106 -276 -13 116 -19 -149 -103 251 -173 -195 -153
6736 -153 -39 25 -185 -146 -20 79 -182 -16 0 -211 -38 -305 176 -70 194 51 1 75 -32 -61 -44 -77 32
6759C2K0J39r4q7J6j13J12p5j06n1M06l10J39q1J15L0j54M6mj39J0J61K9j19j98
6784b76J33M64Ml85j77P9J18N7K5k65p0L79J6l33N5O7K09j9q5o5K1O1j46J05k22
6809b50k32K00K63K45l28J73J65l82J7P8m4q0J58J35j5n35M77k17P9R0R5Nr2L1
6833C6n0p9J04J74k80L3L7Nj93K7R3k5J99J66k05K2j72K0R3j27q6M24k97m3J03
6858b1R3O9k80P2K22K27m36J65O6j16m3L0Q2k26K20k20L46j70nj63j16K18R2n0
6882E6M4j89J95j64J57j58O2K51j83J90j74k0J2j19J5O9Lm1k98L63j52m9J40j68
6906a58Q1K00j1M3j01j75j30K94n2K5O4j85J90j8N4j37O3kj06k6K07m08R0K05
6930GJ04k04J3j37N70m85Q0j95K66l3o1J23k16q9K57J44j38J4k18K22k19K94J73
$$ plain form
6759 32 52 191 97 10 26 -87 25 -50 -156 -207 199 -111 28 -53 62 92 -62 -16 -20 -159 -149 12 41 -78 -276
6784 -276 -143 321 325 -60 -237 -158 -40 17 42 -223 -293 86 102 -231 -176 -109 100 81 -4 -69 -48 13 -133 -28 -250
6809 -250 -482 -282 -19 226 -102 71 236 -146 -129 -51 -95 -175 -17 118 103 -432 45 -172 -93 -3 92 97 5 36
6833 36 -14 -93 11 185 -95 -62 -25 -20 -213 -186 -93 -118 81 247 42 64 -108 -88 5 -122 -208 216 -81 -124 -21
6858 -21 72 141 -139 -67 155 382 -54 111 177 61 18 48 130 -96 124 -96 250 80 75 -88 -204 14 106 56
6882 56 100 -89 106 -58 99 -59 3 254 71 261 87 67 79 -40 -25 44 47 6 -292 71 -81 -130 10 -158
6906 -158 -77 123 112 155 54 -121 -251 43 -9 16 80 -105 85 67 121 -16 47 45 -61 -87 120 -288 -198 7
6930 7 111 -93 -80 -217 353 -132 -52 -247 19 -14 -75 48 -168 -257 0 144 6 20 -198 24 -195 99 272
6953B72l5j55j10NK65l20K52l06J84lJ04P8l08K9Q3j24K61j26q3p6Q8j29J70O6
6977H2N0j19J98k50r4r8QK79K29k72k6n4O4J88J4r9j61N8P9J73m14K21J68k54
7001c0Q4p6J32j47l9L71m52K15j74M0K07k14L38k94J24N0l18M4J10N1k50L37j86
7024g7j1J64J8k59L18p7r7J0m03M92J74o7j13l6Q3K2l6j57J35N5k7o7M7j43J52
7049A00J42j99j09Q4j55J38Q1o3J83k59M7J60j41o4N2m7Q1p5Q7j97K13j1J62k54
7073d4Jj10N71l40n9j04n8J56K42l80J11L9o3J66R4l04p6P3J7J94j70o8J81k26
7097a57M83l74K0j80K86L2o2L25p06N23j30l7O2J2j05K6K64l48p2N8J45k4j89
7120a48L12j10N4k12K99n4l24J96j54l4J65K8Q8m13K37Q7K5K73n34J19L32k81
$$ plain form
6953 272 237 82 -28 -23 242 -78 174 -132 52 49 153 231 -77 -48 35 -89 172 46 -37 -113 -25 -154 16 82
6977 82 132 13 211 -39 -133 -231 -223 56 285 13 -13 -67 -3 185 199 100 -61 -3 76 249 -165 56 224 -30
7001 -30 54 -22 110 -37 -76 295 -157 58 -116 -76 131 -83 255 -39 85 135 -183 -139 -29 22 -228 109 -77
7024 -77 -88 76 94 -165 153 76 -21 -11 -414 78 252 185 72 36 119 141 105 -52 83 138 111 44 91 -52 100
7049 100 242 43 -66 18 -137 1 82 19 202 -57 -10 150 9 -55 -3 -50 31 -44 43 -154 59 48 210 -44
7073 -44 -43 -153 418 78 19 -85 -143 13 255 -125 -14 25 -38 128 222 -82 -158 -85 -68 126 -44 -112 69 -157
7097 -157 326 -48 -28 -208 78 110 48 373 -333 190 60 23 85 97 -8 18 282 -66 -138 -80 65 41 -148
7120 -148 164 54 108 -104 195 141 -183 13 -141 -175 -10 18 106 -307 -70 17 42 315 -219 -100 232 -49
7142d9L38l60J80Oj16l0K46j73M2M6l07J43o3j55J31J16k32L75j5j46J45j49N6
7165B9m7n0RJ57j77M01l75J51k49M46n22qJ80J25j57J06P4o5P3l8O6j27j45L63
7189B20l61P8m3Q5p1J16j07j44R7J9K30k25O8L6j72K20L24j37l58J97n7r4R8k9
7213a0K53j81O6k59R7J82l52K13j07K59m1j08K6N3j19O3j12J3M32k12k20Rn7J63
7237E1o1r4J40k83J44p3J84J94m50K80R0j21J23k0k13J25j89J29J03j01k4K29
7259A63K55o11J56n2O8r2Q6K55k44Q1J1k29K73k43k47L87j56J3L43k28J32n7L4
7282I8K14j33k90j86L63J49J48k68n5RJ04j48lj32J76j11O0m4r0J18j40K66mj13
7306a2j18O5K55M2j99j29J66j0k6j34Q2J13j64J62o0k20J22p2OL03k30R9P5k44
$$ plain form
7142 -49 289 -71 109 115 -1 -31 215 42 84 130 -177 -34 -97 -252 -121 -5 -237 138 123 -23 122 -27 29
7165 29 -18 -68 -59 98 -79 322 -53 98 -151 295 -227 -235 -55 70 -87 19 93 28 101 63 129 2 -143 220
7189 220 -141 -63 -106 -21 -92 24 -83 -227 -130 -111 119 -106 -38 -2 -174 46 370 233 -125 72 15 -79 19 -10
7213 -10 243 62 128 -131 -34 148 -204 9 -98 161 120 12 38 91 -28 35 -77 -64 368 156 -64 -55 -112 51
7237 51 -10 -104 36 -247 -103 -176 8 202 -248 32 122 1 124 104 -109 16 -173 -44 59 -42 -66 163
7259 163 418 -193 -37 -89 -21 -113 -27 228 -16 65 76 -153 120 -123 -370 17 -139 -126 217 -11 121 64 98
7282 98 312 179 -111 -297 66 215 363 95 40 49 153 5 2 -130 46 -65 -5 -49 -139 -21 -161 105 101 -12
7306 -12 -130 -65 190 232 33 -96 70 60 34 -100 -18 95 -69 93 33 -187 -65 -137 -131 172 -58 41 116 -128
7330a28K90K6r1j26NJ82k85L7N0NK70l24J45j23J36N5j2o8L9j08J10j09L00o7
7354B09l44K34j02j48NK80q1K2j21k91N03j86J32l44K09R0J68j40l14J62l7m9
7376a43q6qJ95J78j23q7J56k84K97l4K36L4l30O3k44J26J8R1j06N8K03j23j38
7399e1n9L15k21o8M8K3Q8j51J82Pj7k61K20l8R8r7l03K59L6j32K38j56m2r1J34
7424c9m8M9J76m3n4qK8J6q6J05j87J82j77K45l48J98K1J36l41J39k67K36j00K64
7448I7j94J68j46L4J4J2rl1L1l8P1M2k2J89l38J55k38J54K75k22n3M8j39L19P6
7473B55l85J27j08j38J76K02k43K53j03j00J32j7k9j38L85m24J03K03j76K63q8
7494A50J01k70p4N8P4Q9P6k73o2J21k6N9N0o8j08K08j29m8k30P29m57L28l26K3
$$ plain form
7330 -128 162 188 97 -29 -24 158 -127 -90 -40 -35 235 -89 56 -67 69 124 112 44 83 -25 85 -24 276 209
7354 209 -135 99 -3 -151 -146 134 53 75 -46 -337 166 -20 112 -232 -23 67 235 95 -219 -57 -94 -143
7376 -143 -229 -237 -42 136 13 -74 82 -202 95 61 297 331 1 64 -180 -54 -36 55 -51 7 210 87 -51
7399 -51 -110 205 -16 -84 -36 -13 75 -76 106 113 96 -165 55 17 115 18 -285 -26 10 -122 116 -40 -82 -173 -39
7424 -39 -87 -38 138 95 41 33 61 77 -9 96 -91 91 -86 159 -189 9 30 166 -175 -36 -303 -67 -167 97
7448 97 -97 71 -75 -41 -27 -15 -24 -55 -24 -62 9 51 29 218 -120 35 -203 -49 226 4 -49 -1 -140 179 255
7473 255 -130 -3 -111 -249 -73 129 -114 139 36 -64 68 51 22 -116 269 -155 -52 151 -25 238 150
7494 150 251 -19 -93 -35 39 128 204 -69 -131 -10 -36 23 73 5 -103 105 -24 -72 -302 427 -30 298 -28 -5
7518eK10q6j58p9O5R4J5N1j98J8J01n9Q4j60l18M89j67L6K32j22j8j16L0K58k81
7543h4J50k34p2m0J34J59k79J37L3K47l35K26J54r7k23K19j71J67r5j75L40p4
7565H7k14J45o1O5j05MJ7n2p3P8Q7n2o2M3K0q6J59K08n9j23k95J80J09j00J66
7590H6m03L25r7l1P0j15L20j49n6Oj61J04J63r0J71Kj47J88m1p0p2J22p8r2K90
7615B45j77r0j3jp8P1J20lp2J43Kl73J20Q8J20j62K2q6J71o7N1p4J6j15J08k8
7641f2M5J96j75j3K7J08k47K50p0J39L7m00M63k57O0p3j42J5K79j70k2J88K1k10
7665a3K2j80K12k93J43j1K61Q7k45J51J74m47L98j74Q2l34K98Jk97O8j23K18p8
7688h0K9R8k26M84k87OJ16k32J14k8n3o4LK7K84m69J96K86m35N03k94J45k0r2
$$ plain form
7518 -5 205 119 -39 -118 -53 41 56 107 -91 -73 28 -31 53 -107 -425 64 -103 -67 165 43 25 -91 -61 197 -84
7543 -84 66 -168 -240 -280 -146 13 -266 -129 -96 151 -184 42 196 99 -124 95 -76 91 -4 -179 161 87
7565 87 -127 18 -43 22 -83 -79 -62 -114 -187 -109 -22 -74 -136 -93 -73 -159 0 208 149 26 -269 -89 20 -80 86
7590 86 -317 8 -89 -120 -50 -165 155 6 -50 -44 -205 -101 62 -28 143 145 -2 186 145 75 3 125 47 -45 245
7615 245 68 -22 -35 -36 -114 -43 77 74 2 145 147 -226 -106 -18 102 -60 -38 -124 47 -20 31 -43 -27 -142 -34 -62
7641 -62 -17 179 4 -9 18 126 -121 129 59 198 235 -165 298 41 101 28 -114 -99 180 10 -12 176 197 -13
7665 -13 9 -171 41 -252 -109 -120 141 228 -17 134 308 -139 259 85 167 -167 131 132 -165 -97 -220 -2 -80
7688 -80 -51 47 -179 305 18 24 140 -92 22 -6 -59 -123 -120 -93 191 -278 -82 204 -231 272 -22 123 103 11
7712A1j92J49J11%K5j03m2K0J09n1j5J34j98O9Jj64K93k28J58Ll7K70m91M79k50
7737F1q1m5J36K2k26K63m7l15O9L81m58J6J04L6l60M12N8j06J36j94K04lj88J10
7761a5p5P4J28j32M5j62r3L54k16J13j24L51j38k14K71j76j64J24J73l0n5Oj35
7784i0J2O6k31J46j53J60P0j12j6P1L75k92R1L5K23k24m74O64k68J34k9k36J58
7807H0J77k41r8j50J35J34k1Q4J95k40j25J67J38k56JJ26K55l01K04j24j65M2
7829A7QK14k16P4m02J09K78Q7m08L67j70J43j9p0q1l0L94j02j6j39o7j71J76k10
7853b34K04J05J4j19L3M0k6PJ01k27R1K1j71L61l68j1P3L41k84J0j51L6L00o6
7877H0k08L75j84p4J29k08J23N1k13K1J2K37l3j00j48K6n8J12l2J04r7R8m5o4
$$ plain form
7712 11 -181 -32 79 79 104 1 -41 -21 88 37 22 156 -42 27 28 -136 157 -71 87 90 53 323 -168 311 61
7737 61 -20 -65 71 93 -133 130 83 -232 -163 218 -240 -224 -120 -84 -444 -32 26 -80 56 -138 66 63 -125 -15
7761 -15 -90 -16 112 -20 25 -137 -230 124 -92 21 -103 248 110 -104 167 -9 -173 -49 124 94 39 45 -90
7784 -90 -78 -12 -243 -97 -250 -90 -20 -132 -148 -77 298 6 97 132 355 131 -343 321 53 187 158 -78 80
7807 80 257 16 -82 -232 -97 37 16 100 295 55 -70 97 235 -21 -20 106 361 60 264 140 -25 17
7829 17 25 239 23 97 -305 -196 82 169 -239 128 -42 101 82 12 -69 -99 295 193 177 38 -29 -200 -24 -234
7853 -234 -30 75 89 -30 3 43 17 24 125 -102 -11 10 -161 200 -168 -179 -106 235 -49 -39 -190 -154 146 80
7877 80 -128 247 63 -11 118 -90 33 84 -129 -108 -96 141 108 8 -140 -114 -172 -60 -92 12 -85 13 -32 -96
7901i6J30R6qj63J15j49L8r3K56o8o4J5K52k88q0K72Ml22m8K92k3l6J29k46J10
7926B5J34l64K76p9K06j86j66K18k07K65K32m45j39J24r9L13r9M6j8QP0j31K00
7949A84k58rj62J93J42p0J5k29L02k33J9j05K96j72o3N6P0M4K58o77J94K32j38
7972a11R0r2l7j4J74k3K9j18L15p0m9n7L3p0N4r0k0L56l69J04j55J59l4J34k38
7997i9p7J7J51o9K03o2m44L66j32K37k8J94k65n5J07q9N5JR1PN1k47k9J29j06
8022i3j39K9j5K67O4j80J00K46M7j59k26J39j28K18k93K42kJ89m15k6j16K64M5
8045E8j03J51qo5KM8J8N9j21j23k00K71p8J4k30M32j29j52j2j8K55n5J21q6j03
8070e4j61K83j8J87k76r8M37r1j08L4m1k65K39K3P0k64L3Q9J40R4l35K6L3o0j21
$$ plain form
7901 -96 34 130 122 -41 74 -75 -37 -130 126 58 -6 9 261 -27 -107 165 169 -153 -201 91 68 32 161 -85 25
7926 25 159 -205 71 -8 198 12 -154 64 -143 122 354 -91 -230 -106 -205 108 9 55 37 45 115 -16 184
7949 184 -74 -83 -245 -52 90 20 35 -194 108 -125 -106 -211 85 -87 -150 -94 -24 20 278 -399 -205 27 -111
7972 -111 -21 -113 -150 -164 10 -13 16 -102 213 143 94 37 70 0 54 -36 -56 300 -69 35 -120 39 5 139 -99
7997 -99 -176 -159 -8 -77 126 64 -380 -14 -146 91 63 257 -8 -63 44 -45 10 11 102 109 160 -87 -116 13 -93
8022 -93 -232 -203 -218 49 113 -67 33 279 326 167 -59 80 -48 170 -123 119 117 306 -109 -135 -251 13 58
8045 58 -45 106 98 33 35 83 101 160 39 -84 -284 -13 -91 -77 -307 125 -4 -156 -168 -186 69 14 135 49 -54
8070 -54 -215 68 50 237 -39 -137 300 209 101 135 94 -171 68 91 161 -103 -70 19 159 253 -82 -56 -23 -83 -204
8095b04M43k28j86L18o5N5q9j34J72P4O4j78O2k15J52n7r3P9j31L79k67J99j16
8118C4K0P4Q6j02k09J01q4J10l00M15j37Q8k22Q4J93n3j58pM03k82k1J42M7j65
8142E7M0j54J11k20J61m7j8lJ14n0O3J15p8j09K2J35L8j31M0j84J66K9l49K49
8166cN7k50L19j17J26m51M63r5p8J16n5j24J76o6J10K0K0k13nR6p7m06K04J86
8190d7R5
$$ plain form
8095 -204 239 11 -175 143 78 133 44 -90 82 156 220 42 104 -111 41 -16 -109 -30 -161 218 -49 150 34
8118 34 54 128 214 112 -97 4 -80 30 -270 145 8 96 -126 -42 151 98 -60 -67 336 54 33 175 222 57
8142 57 97 -57 54 -166 -5 -52 -70 -73 41 -9 54 169 91 -18 4 139 177 46 86 -98 68 97 -252 -3
8166 -3 54 -196 123 6 132 -319 144 49 -29 87 32 -92 84 18 128 148 168 -45 -50 46 -31 -437 -233 -47
8190 -47 48
8191D8
$$ Imaginary data points
##PAGE= N=2
##DATA TABLE= (X++(I..I)), XYDATA
0@%%%%%%%%%%%%%%Oj4J6j6J6k4L2l2M0m8N6o5P3q8J04j20J36j53J75j99K24k54
36a35K86l19L58m03M48m98N54o14O80p53Q32r17J011j114J225j348J486j640J811
55I50j998K212k457K734l057L441l902M467n183O125p429R380j2681J9841o7436
70e4993K6509Q0829J2531n6609q0781K1830N9124P8813o6315m5362n5241O7787
82a1878O8954M059o3386o9666L8366N0978O2994o1419o2005j7161N3915P0000
94F3751j9288n3561o6525N4029M8957L9071n4680o6880M364N3144O3679l7944
106B8117m6508n2193N4188N8394J1114m9800o2794K2745M7371N7981n0370m8064
118b9819k7433M9218O0794j0668m5592n8280L8885M3931M0905m9452n4380k904
$$ plain form
0 0 0 0 0 0 0 0 0 0 0 0 0 0 0 0 6 -8 8 -8 8 -16 16 -16 24 -24 32 -33 40 -48 56 -64 72 -81 94 -105 119 -135
36 -135 151 -168 190 -213 235 -263 291 -323 357 -396 436 -481 530 -584 641 -707 779 -861 950
55 950 -1048 1164 -1293 1441 -1616 1825 -2077 2390 -2793 3332 -4097 5283 -7398 12443 -54993
70 -54993 -28484 52345 64876 8267 -72514 -50684 8440 87253 20938 -24424 -79665 -11878
82 -11878 57076 61135 -2251 -71917 -33551 17427 80421 19002 -43003 -60164 -6249 63751
94 63751 44463 -9098 -75623 -21594 27363 66434 11754 -55126 -50762 2382 66061 28117
106 28117 -18391 -70584 -16396 41998 53112 3312 -59482 -36737 10634 68615 18245 -29819
118 -29819 -57252 -8034 52760 42092 -3500 -61780 -22895 21036 61941 12489 -41891 -44795
130d4795M3918N7141k6909m2536m8191M7332M5050J6816m2701n5444J4987M1833
142F501M9797l9135l9955l1054M5017N0802l972m0392n0476L0352L8703L9203
154E5391m4829m3444q403M0532M9853k0736l8873m1858M0654L7071K1669m2642
166D385m7196J1650L7130M3933l3141l5999l0918M3595M1010J79l7372m4703K4942
179b2505L5897L5860m1684l5208j3112L9635M4508j7409l5222l7989L5463L3865
191B2099K3571m2849l8597O489L4811M1353k9311l3867k9746M1793L4073N503
203C5322l7274m1269K1433L3770L3168l7216l2129j7058M0286L8425j2845l2857
215h244l6924L1367L2344K4124m0764l3469J340L4630L8708k5649l1514k8539
$$ plain form
130 -44795 -877 56264 29355 -13181 -61372 -14040 31010 47826 5125 -50319 -35332 6501
142 6501 56298 17163 -22792 -53846 -8829 41973 38001 -2391 -52867 -22515 16188 55391
154 55391 10562 -32882 -41285 -753 49100 28364 -10509 -52367 -11713 25358 47027 4385
166 4385 -42811 -31161 5969 49902 16761 -19238 -50156 -6561 34449 34628 -2744 -47447 -22505
179 -22505 13392 49252 7568 -27640 -40752 -1117 43391 25982 -9240 -47229 -11766 22099
191 22099 45670 2821 -35776 -29287 5524 46877 17566 -16301 -46047 -4254 29819 35322
203 35322 -1952 -43221 -21788 11982 45150 7934 -24195 -41253 -967 37458 24613 -8244
215 -8244 -45168 -13801 18543 42667 1903 -31566 -30226 4404 43112 17463 -14051 -42590
227d2590L7813L0970J0507l8324l6675J7756L1216L2759l3368l1356j8054L9745
239C99L2723p396l2553l5902K8395L0440K3950l8170l0184m170L6095L4929k1610
252A6946k9807k8357L4726K9696J2734l8401l1322J2351L0502L2242l0642k8750
264a8082j8663L7323K8869j943l3058l2691K4693K8067K4069l4940k8388p230
276c1974L6049L0322j7313k8233k8449L1913K7721J3771l6630k7566O482L1263
288G356L0433k7697k6670j9079L4715K7047K315l4062k8900K0820K6358K4758
300C7394l2521k6422q910L4894K6870j1657k8812k7695K9792K5041J4784l4191
312a433k5879K733L1892K7408k4709k4852k0406L3164K5219M015l3658k4813J5866
$$ plain form
227 -42590 -4777 26193 36700 -1624 -38299 -20543 10673 43432 10064 -21292 -39346 399
239 399 33122 25726 -6827 -42729 -14334 16106 40056 1886 -28298 -32468 3627 38556 16946
252 16946 -12861 -41218 -6492 23204 35938 -2463 -33785 -21434 9068 41310 10668 -18082
264 -18082 -36745 578 29447 27504 -5554 -38245 -13552 14515 38584 3644 -24744 -31974
276 -31974 4075 34397 17084 -11149 -39598 -7685 20036 33807 -2823 -30389 -23907 7356
288 7356 37789 10092 -16578 -35657 -942 26105 28420 -5642 -34542 -13722 12636 37394
300 37394 4873 -21549 -30459 4435 31305 19648 -9164 -36859 -7067 17974 32758 -1433
312 -1433 -27312 -24579 7313 34721 10012 -14840 -35246 -2082 23137 27152 -6506 -31319 -15453
325a5453K6208K4938l1200k4122j0185L3657K4245p150k9832k4993K7382K3167
337A6662J5945l2739k4158L20L2116K3294j9646k4686k1426L1869K3552N645l2652
350e904k3278J1532K7999K2787k9061k2275j1790L2283K3294m467l0731k1946
362c1557K3331K2443J8079l2433k2179j558L1534K1736j5370k5535k0585L0718
374a376K0704Q110l1780k2031Q643K8280K0504k5641k1112j4279L1594K1524k463
387B0677k9758k0443J9068K2991J8414l1074k0382l819L0274K0872j1848k6253
399a1281j8977K7319K0023J0716l0878k0750O104K7853J8940k1311k1390j5145
411b8777L0733J9638N3k8901j9831J5008K4171J6740k8571j8237p310L0018J9655
$$ plain form
325 -15453 10755 35693 4493 -19629 -29814 3843 28088 20938 -8894 -33887 -6505 16662
337 16662 32607 -132 -24290 -23970 8146 31440 11794 -12892 -34318 -2449 21103 26748 -5904
350 -5904 -29182 -17650 10349 33136 4075 -18200 -29990 2293 25587 21120 -9611 -31557
362 -31557 -8226 14217 32296 -137 -22316 -23874 7660 29396 14026 -11509 -32094 -1376
374 -1376 19328 27438 -4342 -26373 -17730 10550 31054 5413 -15699 -29978 1616 23140 20677
387 20677 -9081 -29524 -10456 12535 30949 -125 -20507 -24326 5948 26820 14972 -11281
399 -11281 -30258 -2939 17084 27800 -3078 -23828 -17724 10129 29069 7758 -13632 -28777
411 -28777 1956 21594 21647 -7254 -27085 -12077 12094 28834 263 -17974 -25284 4734 24389
424B4389r837k5728j7344K3674J9623J2034l0582j8386L821K7086J8046j7825
436H971k1747j4558K9129J7156L321k8465j8266J2912K3655J5208k5086j8069
448a5839q742K9634J7148o843k5464j6295K0192J9974J1687k9084j6022M12K6947
461G705J6694j5663k1641j3112K6424J5977N437k8170j6280J0789K2968J4657
473B5785k2033j8040r108K8872J4954l976k5168j5349J7628J9906J0922k6804
485b411j4875k078K6841J5288j3437k1456j2661K3527J6309O234k8115j4067P383
498a3518K3131J4231j9891j8171r010K7515J3748q03k5621j4225J5899J9774J0840
511B3899k4712j5083l179K7004J3313j0714k1349j2527K1870J6218O085k6822
$$ plain form
424 24389 14552 -11176 -28520 -4846 14777 26811 -3771 -22157 -18336 8750 26796 8971
436 8971 -12776 -27334 1795 18951 22272 -6193 -24459 -11547 12108 27316 2230 -15839
448 -15839 -24581 5053 22201 15358 -10106 -26401 -6209 13765 25452 -3632 -19654 -19242 7705
461 7705 24399 8736 -12905 -26017 407 16384 21821 -6349 -22629 -11840 11128 25785
473 25785 3752 -14288 -23396 5476 20430 16454 -8714 -24063 -6435 13471 24393 -2411
485 -2411 -17286 -19364 7477 22765 9328 -12128 -24789 -1262 15047 21281 -6834 -20901 -13518
498 -13518 9613 23844 3953 -14218 -23228 4287 18035 17232 -8389 -22614 -6715 13059 23899
511 23899 -813 -15896 -19075 7929 21242 10528 -10821 -23348 -1478 14740 20825 -5997
523e997j2806M371K3739J2959j7905j8194q462K5212J3547Q66k6317j2325J3273
536h039J9572J0940k2803j5020l859K7023J1526p529k2180j1336J9638J6539O563
549B1035k5752j1959K369K4060J1291j5373j8161r117K3628J3677J607k5940j0876
562a9511R857K0155J0727k1515j4408m513K5322J1125m426k3056j0893J7960J6030
575A2854P271k3647j2314Q94K4460J0083j2437j8382r192K2289J3234K193k4653
588g347j0295P523K0779R857j9340j4836n304K3977J0821l116k3118r203J4984
601d618J6494P388k2709j1780n1K3962R155j0160j8803q608K0924J2688L359k3817
615f576r687N413K1811Q319j7154j4410n647K3040J0462k199k3097p794J1997
$$ plain form
523 -5997 -18803 -14432 9307 22266 4361 -13833 -22295 2917 16464 17330 -8987 -21312 -8039
536 -8039 11533 22473 -330 -15350 -19209 7814 19340 11811 -10369 -21705 -2067 14472 21035
549 21035 -4717 -16676 -14307 9753 21044 5671 -12490 -21607 2021 15698 17305 -8635 -19511
562 -19511 -9654 10501 21228 -287 -14695 -19208 6114 17239 12813 -10243 -21136 -3176 12854
575 12854 20125 -3522 -15836 -14942 9518 19601 7164 -11218 -20410 1879 15113 17306 -7347
588 -7347 -17642 -10119 10660 20517 1177 -13659 -18963 5014 15835 12719 -10399 -19602 -4618
601 -4618 11876 19264 -3445 -15225 -15276 8686 17841 7681 -11122 -19730 1194 13882 17241 -6576
615 -6576 -16263 -10850 10961 19280 2126 -12284 -17931 5109 15571 13372 -9725 -17519 -5522
628e522J7137P217k1650j1534q92K2605Q762p582j9941o975J8377J2507L933k2705
642f263r353M668K1661O469j3577j5161n805K2188R952j336k2014p388R812J7713
656A1566O268j9575j1233k066K2590P835o070k0469n845J5844J3225L998k2305
669f237q633L339K1353O185j1912j6093n010K0625R474N06k1841p117Q420J8669
683A1728N055j7542j1218k632K1800P560m943j9778n628J3460J4401L866k1270
696e141q098J408K0776O167j0273j6588m500J8510J0061Q76k1531o746P069J8791
710A0781M223j4665j2473k462K1300P124l968j9351n194J1783J4922L497j9516
723c999q110N96K0299N827q655j7088l576J6256J0469J618k1326o049N414J8580
$$ plain form
628 -5522 11615 18832 -2818 -14352 -15244 7361 16123 8541 -11400 -18375 2 12509 16442 -6263
642 -6263 -15616 -10948 10713 17182 3605 -11556 -17361 4827 14779 13443 -8571 -15959 -6147 11566
656 11566 17834 -1741 -12974 -15040 7550 15385 9315 -11154 -16999 -1155 12070 16068 -6237
669 -6237 -14870 -11531 9822 16007 4095 -11998 -17008 3617 13091 13597 -8244 -15361 -6941 11728
683 11728 16783 -759 -11977 -14609 7191 14751 9808 -9970 -15598 -2138 12263 16129 -5141
696 -5141 -13239 -11831 8945 15112 4839 -11749 -16249 2261 12322 13198 -8333 -15079 -8010 10781
710 10781 15004 339 -12134 -14596 6704 13828 9860 -9491 -14685 -2902 12020 15517 -3999
723 -3999 -12109 -11513 8786 14613 5958 -11130 -14706 1550 12019 13637 -7689 -13738 -8324 10256
737A0256M217j3263j3025k782J9967O807j843k0015m636J0170J5376K808j7045
750c008r112j05K0325N627p187j6844l471J4422J1324J305j9721n933L965J8412
764I999L933j1858j3603k080J8104P305j234j9886m260Q925J5206K739j5527j0088
778a2325%K0039M341n297j7220k976J3238J1652R71j8104o056K682J9049L304
792A3298j0153j4090j719J6507Q075q17j9910l773P395J5915K149j4270j0015
805a1408n70J9058M376m154j7755k461J1649J2270Q83j7121o385J861J8994K850
819A2087q287j4093k130J5148Q895n79j8761l605N599J6286J875j2937j0359K9
833a0832J6985N099l041j8217j687R813J2587R72j5968o907J592J8168K242o752
$$ plain form
737 10256 14473 1210 -11815 -14597 5370 12177 10334 -9681 -14317 -4147 11229 14037 -3008
750 -3008 -12120 -12225 8100 13727 6540 -10304 -13775 647 11971 13276 -6445 -12378 -8413 9999
764 9999 13932 2074 -11529 -13609 4495 11800 10566 -9320 -13580 -4655 10551 13290 -2237 -12325
778 -12325 -12325 7714 12055 6758 -10462 -13438 -200 11452 12423 -5681 -11737 -9055 9994 13298
792 13298 3145 -10945 -12664 3843 11918 11101 -8809 -12582 -5187 10728 12877 -1393 -11408
805 -11408 -11978 7080 11456 7302 -10453 -12914 -1265 11005 11888 -5233 -11618 -9757 9237 12087
819 12087 3800 -10293 -12423 2725 11620 11041 -7720 -11325 -5726 10560 12435 -502 -10861 -10832
833 -10832 6153 11252 8211 -10006 -11693 -1880 10707 11679 -4289 -11196 -9604 8564 10806 4054
847D054j4665j377J3873Q835o62j7563l623M382J6885J316j1147j0641l08J6110
861E469N849k938j7692j322P750J3577R45j4687p822J699J7241K383n268j5747
875a0563m14J2137R287l86j6731m228L909J6671O07r133j1837r1J5257N768k138
890H115j6623j929O736J4193K56j3076p863J234J5975L603m760j5920J40J0338
904D19R947o09j5493m500L160J6257M34p731j2353M88J3629N999j861j6090j782
919a0086N987J4050k70j1417q347J304J5205L464m143j5175j1Q966J0851n99j4457
934d678m680K592J5538P86o614j3108J053J1989O796j444j5647k093M767J4657
948I914r83r725r278J359J4401L459l639j4615j67P571J1937j364j3018n303K362
$$ plain form
847 4054 -10611 -11988 1885 10720 10058 -7505 -11128 -6746 10139 11455 308 -10333 -10641 5469
861 5469 11318 8380 -9312 -10634 -2884 10693 11638 -3049 -10871 -9172 8069 10452 5184 -10563
875 -10563 -10977 1160 10447 10061 -6670 -10898 -6989 9682 10289 1156 -10681 -10772 4485 10253 8115
890 8115 -8508 -10437 -3701 10492 10748 -2328 -10191 -8957 7018 10621 5861 -10059 -9919 419
904 419 10366 9757 -5736 -10236 -7076 9181 9615 1884 -10469 -9981 3648 9647 7786 -8304 -10086
919 -10086 -4099 9951 9681 -1736 -10083 -8779 6426 9890 5747 -9428 -9439 -473 10378 9779 -4678
934 -4678 -9358 -6766 8772 9558 2944 -10164 -9111 2878 9674 8230 -7417 -9510 -4743 9914
948 9914 8931 -794 -10072 -8713 5688 9147 5508 -9107 -9274 -1703 10234 8870 -4148 -9451 -7089
963g089J5273J165n856j3378J489J0916P392j749j4675k343M239J4184q00q571
977A97j0236J723J3445M071l367j4738j38O668J1950j577j1373o088K139J4503
991G179J484n194j3198J209R577Q508j915j3916k328L788J3910o22p419j0796
1005i733K304J1889M364k537j4179m23N978J1802j763j0080p288K577J4078J124
1019H113m184j3386J374Q228R195k416j2435l039L079J4058o59o457j0916K296
1033g149J0495N848k882j3999K64M823J2203j911r014p795K598J2582J983l331
1047D715j3353R96P603R300k726j0861m447K949J3877l80o010j1312K521R587
1061B459O558l156j3094n71M586J2446k197q111q094L519J1054K806l518j2851
$$ plain form
963 -7089 8184 9349 3493 -9885 -8396 2520 9912 8163 -6512 -8855 -4616 9568 8768 197
977 197 -10039 -8316 5129 9200 5833 -8905 -9043 -2375 9575 7998 -3375 -9463 -7324 7179
991 7179 8663 3469 -9729 -8520 1057 9565 7650 -6266 -8594 -4806 9104 8482 1063 -9733
1005 -9733 -7429 4460 8824 6287 -7892 -8315 -2337 9465 7702 -2378 -9666 -7089 6989 8113
1019 8113 3929 -9457 -8083 145 9340 6924 -5511 -8550 -5471 8587 7928 1471 -9445 -7149
1033 -7149 3346 9194 6312 -7687 -7423 -2600 9603 7692 -1322 -9117 -6519 6063 8046 4715
1047 4715 -8638 -7642 -39 9261 6535 -4326 -8773 -5824 8053 7673 1663 -9649 -7128 2459
1061 2459 9017 5861 -7233 -7804 -3218 9228 7031 -1080 -9174 -5655 5399 8205 4687 -8164
1075h164J227O311R747k754r824m983L434J2588m77m777j1311K072Q878O631k945
1090E653j1854j529M173J2080k049p151q491L149J0492L526l358j2715J433N475
1104a166J0227k665r351n420L502J1804K17m198j1451K179P879P347l614j0512
1118e222k442L851J1967j854o084q861K387R938M100l693j1681P06M826J0550
1132H488k769p994o025L318J0864J208m273j1087K418O587Q016l535r923k525
1146g232L619J1488j474n506r488L345Q567M392l541j0822N9M404J0760l241p076
1161a746o622L460J0222J520m052j1141K444N879Q446l340r091l646M101J0529
1175F963q21m822r515L306P391N439l519j0262r57M756J0299k767o487p102L221
$$ plain form
1075 -8164 -6937 -626 9121 6367 -3457 -8440 -5006 7582 7105 2328 -8983 -6911 1967 8598 5653
1090 5653 -6201 -7730 -3557 8523 6474 -677 -9168 -6019 4473 7999 4641 -8074 -6641 -1166
1104 -1166 9061 6396 -2955 -8375 -4873 6931 7148 2950 -8501 -6322 1557 8904 5290 -5222
1118 -5222 -7664 -3813 8154 6300 216 -8645 -6258 3680 7780 4087 -7594 -6888 -2062 8488
1132 8488 5719 -2275 -8300 -4982 5882 7090 2817 -8270 -5852 735 8751 5216 -4707 -7232
1146 -7232 -3613 7875 6401 895 -8593 -5248 3319 7711 4170 -6652 -6593 -2189 8571 5330 -1746
1161 -1746 -8368 -4908 5314 6834 2782 -8359 -5915 -36 8410 5070 -4021 -7667 -3566 6963
1175 6963 6142 1320 -8195 -4889 2502 7941 4422 -5840 -6797 -2041 8258 5491 -996 -8098 -4877
1190d877R939J846l834j0383J610N201Q765l690q051l883L442J0249j69m820r749
1205h404L231P051N683l541r429j184M273R922k258n786p504L601Q525L130m395
1220B915r764J252N100Q680l890p110m603L460R889M1m482r439L297N910O352
1235G608l704r009j384M161R576k033n237p883M025P229L699m102r274J048M427
1250h53Q781l609o242n269M062Q553P95m466q861K750N392O760m125p782k227
1265f341L740R317j651n048p890L823O653M309m136q958N75M242Q564k688o192
1280a681n567L994Q040J272m090q674K272N239O847m143o695l311M248Q670j135
1295E286m912p812L612N921M915m197q312k63M333Q558l094n396n796L733P410
$$ plain form
1190 -4877 5062 6908 3074 -7309 -5699 -498 8267 4577 -3474 -7357 -3915 6334 6165 1345 -8404
1205 -8404 -5173 1878 7561 4020 -5409 -6593 -2320 7602 5344 -442 -7946 -4345 4180 7310 2915
1220 2915 -6849 -5597 -497 8183 4293 -2817 -7420 -3960 5929 5970 1488 -7951 -4654 1256 7608
1235 7608 3904 -5105 -6489 -2328 7248 5215 -22 -7905 -3880 3349 7048 2946 -6328 -5280 -853
1250 -853 7928 4319 -1923 -7192 -3130 5423 6218 1752 -7109 -4359 1033 7793 3668 -4114 -6341
1265 -6341 -2601 6716 5065 17 -7873 -4050 2603 6912 2776 -6182 -5607 -1365 7199 4511 -1681
1280 -1681 -7248 -3254 4786 6058 1968 -6706 -4434 805 7652 3509 -3186 -6497 -2249 6421 5286
1295 5286 374 -7438 -3826 2095 7010 2813 -5499 -5762 -1429 7129 4035 -1361 -7157 -3424 3986
1310C986J872m042q158J660M887P383m069o277m063M648P950p04m235p938L412
1325c688N530N482m618p198j011L915Q550k726n172o344M269O277K516m065q095
1340f378J661M672P015l655n912m299M596P464j65m146p879L325N253N518m448
1355B622o706j139L782P933k436m249o808M090O031L057m485p090J007M138P283
1370G030l809n370m796M944O632P20m502p223K668M628N959m155o236k377M576
1385a311P131j647m347o465L915N528L562m385o997L10M302P076l387m691n048
1400f454M266O398J162m465p155K677M245O062m522n364k951M481O797r34m543
1415c00o357L973N007L962m528o137m06M326O979l094m411n470L990O276J716
$$ plain form
1310 3986 5858 1816 -6342 -4682 205 7588 3519 -2758 -6821 -2173 5777 5073 838 -7100 -3688
1325 -3688 1842 7324 2706 -4492 -5503 -1588 6962 4236 -936 -7280 -3011 3266 5782 1717 -6378
1340 -6378 -4717 -45 6970 3315 -2597 -6896 -2300 5164 4999 853 -7026 -3701 1552 7070 2622
1355 2622 -4084 -5223 -1441 6492 4056 -193 -7001 -2911 3120 6177 1692 -5398 -4391 -253 7030
1370 7030 3221 -2149 -6945 -2001 4631 5351 849 -6374 -3706 922 6881 2726 -3510 -5887 -1311
1385 -1311 5820 4173 -174 -6639 -2724 2804 6366 1981 -5016 -4706 -404 6672 3285 -1406 -6454
1400 -6454 -2188 4210 5372 907 -6248 -3571 674 6736 2214 -3150 -6101 -1620 5177 4243 -300
1415 -300 -6657 -2684 2323 6285 1757 -4380 -4786 -460 6519 3425 -986 -6456 -2466 3810 5526
1430E526m264o905K112M093N890m006n019l349M719O115n51m164o806L797M696
1445A884L904m092n847j026M518O340k600l846n635M332N136K210m328o050J118
1460c982M477N825l775m818l337M218N697N52m787n960L103M187M766m609n339
1475c782j280M176O189j950m200n350M041M875K634m553n428N41M445N647l674
1490B331m413l819M720N367M64m281n753K620M049M780m141n041j906M419N779
1505E175j462m426n389M073M307L108m608n398M29M294N141k900l847m541M671
1520a373M931P95m093n506K056M148N046m166m566k281M393N457j007m207n250
1535e623L621M045L747m929m952j68M032N490k498m418m021M297M392J708m387
$$ plain form
1430 5526 1262 -5643 -3531 562 6452 2446 -2573 -5922 -1203 4912 4361 197 -6609 -2812 1884
1445 1884 5788 1696 -4151 -5177 -659 5681 3081 -765 -6400 -2068 3068 5278 950 -5100 -3982
1460 -3982 495 6320 2545 -2273 -5610 -1392 4305 4857 70 -5890 -2787 1400 6166 1557 -3782
1475 -3782 -5062 -886 5303 3353 -847 -6197 -2156 2719 5353 800 -4628 -4087 358 6005 2331
1490 2331 -2082 -5901 -1181 4186 4650 369 -5384 -2764 1285 6065 1924 -3117 -5023 -604 5175
1505 5175 3713 -713 -6102 -2029 2278 5386 778 -4620 -4191 103 5244 2344 -1503 -6044 -1373
1520 -1373 3558 4353 260 -5246 -3190 958 6004 1838 -2728 -5009 -616 4841 3834 -373 -5623
1535 -5623 -2002 2043 5790 861 -4091 -4259 -227 5263 2765 -1653 -5674 -1377 3015 4723 336
1550C36n129J308M377M589l682m084l000M555N077o08m072n063L077L868L999
1565E548m372m730n35L957N402k427l839m522M335M229J751m500n067J315M255
1580H00M606l525m095l300N046M071J61l885n212K885L588M274m286m145j650
1595d667M557N043j932l924m345M084L854K257m441m620R01L603M885k862m338
1610a945l094M040M461O03m327m733K263M018L928m392l636j734M192M485j280
1625B849l887m363L880L917K321m442l878L09L948M411k923l625l449M411L623
1640C102J175m495m242K088L410L818l556m053j615M522L821j025l707m306L267
1655a796L888K527m501l496l49L861M517k537l634l453M165L375J743m595l765
$$ plain form
1550 336 -4793 -3485 892 5481 1799 -2285 -5285 -730 4347 3739 -333 -5396 -2319 1549 5548
1565 5548 1176 -3554 -4089 -132 5270 2843 -996 -5518 -1183 3046 4797 297 -4770 -3455 800
1580 800 5406 1881 -2214 -5514 -468 3603 3764 -121 -5333 -2448 1140 5414 1128 -3017 -4667
1595 -4667 -110 4933 3001 -923 -5268 -1184 2670 4927 486 -4134 -3233 370 5255 2393 -1945
1610 -1945 -5039 -999 3462 4065 -262 -4995 -2732 1286 5214 822 -2814 -4548 -356 4129 2849
1625 2849 -1038 -5401 -1521 2396 4717 275 -3603 -3294 654 5065 2142 -1483 -4932 -521 3102
1640 3102 4277 -218 -4460 -2372 1038 4856 1300 -2753 -4368 154 3975 2950 -757 -5063 -1796
1655 -1796 2092 4619 118 -3378 -3727 134 4651 2114 -1520 -4973 -808 2567 4310 -285 -4050
1670d050J447L482L960l469l529k167M031L925j22m392l613K935L648K539m066
1685E59l771p17M348L567j769l407l487L614L363J909m345l672R38L859L655l429
1701A215l141k334M167L559M9m412l282K185L616L325m122l549j273M642L469
1716D114j828l532l732L965L495J826m516l198J90M297L393l220l066k776M168
1731d20L501L34m330l243K233L432L048m045l145j138M409L246j142l753l462
1746d475L435K976K170m066l186n8M041L446k547l386k623L991L158P45m433l209
1762d021J796L660K796l726k743j862M254L145o67l600l193L020L145K401m394
1777A1k942k24L937L294k372l257k697M014K761J230m226k975R74L572L043l382
$$ plain form
1670 -4050 -2603 879 4839 1370 -2159 -4326 -295 3630 3508 -884 -4497 -1562 2086 4625 559
1685 559 -3212 -3929 419 3986 2217 -1190 -4677 -1063 2300 4209 -136 -3808 -2870 989 4644 1215
1701 1215 -1926 -4260 -93 3466 3515 -897 -4179 -1994 1622 4947 825 -2724 -3997 645 4114
1716 4114 2286 -1246 -4978 -1013 2482 4308 -208 -3406 -3216 1081 4474 1254 -1812 -4588 -420
1731 -420 3081 3415 -915 -4158 -1925 1507 4555 510 -2635 -3773 636 3882 2740 -1013 -4475
1746 -4475 -1040 1936 4106 40 -3146 -3204 837 4283 1736 -1650 -4273 -282 2876 3621 -812 -4021
1762 -4021 -2225 1435 4231 505 -2238 -4100 154 3299 2632 -968 -4161 -1141 2004 4405 11
1777 11 -2931 -3155 782 4076 1704 -1553 -4250 -236 2525 3755 -471 -3446 -2472 1100 4143 761
1793G61k818j828M034K906l02l818k804K261L476K164m265k605l24L883L084k041
1809A764l508k339L777K825J012l655k805L77M021K681l143k842k169M402K316
1824B714J97l904k801K322L181K474m052k842q16L992L021j602l260k656L245
1839g87K781J686m050k800P14L724K884k921k834k156L876K373M50m049k337J913
1855a533L147K217l623k465j206M183K297p03l749k449L090K774J764m155k485
1870b896R8M041K280k065l146k044L711K540M59l619k726J665L445J912k974k583
1886a902j467M159K004l95l778k144K708K709J640m004k142j2L560K359k058k948
1902a711j857L438K205J131m028k278J316L245K096k764k729j642M138K124k7
$$ plain form
1793 761 -2057 -3885 149 3055 2753 -1065 -3869 -1608 1868 4032 -233 -2838 -3162 721 3805 1764
1809 1764 -1744 -4083 -306 2519 3531 -124 -2929 -2552 1469 4150 1007 -1835 -4004 398 2714
1824 2714 2911 -993 -3794 -1472 1709 4183 131 -2711 -3527 465 3486 1884 -1376 -4032 -787
1839 -787 1994 3680 -370 -3170 -2456 1268 4152 1231 -1603 -3759 117 2490 2940 -1109 -3446 -1533
1855 -1533 1614 3831 208 -2257 -3463 720 3017 2314 -1435 -3884 -794 1980 3744 -411 -2896
1870 -2896 -2798 1243 3523 1458 -1688 -3732 -21 2519 2978 -641 -3367 -1702 1743 3655 681 -1902
1886 -1902 -3369 790 2794 2399 -1379 -3523 -815 1894 3534 -470 -2612 -2624 936 3295 1237 -1711
1902 -1711 -3568 -130 2075 3206 -822 -3100 -1784 1461 3557 793 -1936 -3578 560 2684 2657
1917B657l914k114K381K928J908l879k107p15M149K004j692l014k081L229K360
1932B100R76m082j952P14L444J962k532k304j570L801J895J31l842k092K044K971
1948A664J647l293k388m73L933J960j315k985j883K752K565J330m189k005O69
1963b011L665J673k470k653j498L588K159M83m233j847K069K817J722l557k160
1978b253o26L692J624o29l136j820K634K378J243l835j542j21L664J966k048k717
1994a526j790L436K234M51l659j925R96L299J612k919k197r84L879J689m59l709
2010a572j338K284K492J315l952j661J1L808J381j567k951j512L320K020R56l886
2026h52j840J004L261J305k483k010j437L675J572l7l616j445K024K464J522l437
$$ plain form
1917 2657 -1257 -3371 -990 1938 3846 -33 -2140 -2855 1294 3298 1606 -1408 -3489 -260 2100
1932 2100 3076 -1006 -2958 -2244 1200 3162 630 -1674 -3244 557 2452 2583 -1259 -3351 -1307 1664
1948 1664 3311 18 -2370 -2843 1090 3050 1735 -1250 -3133 -381 2184 3514 -675 -2680 -2011
1963 -2011 1654 3327 857 -1796 -3294 294 2453 2936 -1297 -3144 -1075 1742 3464 -93 -2253
1978 -2253 -2879 813 2437 1808 -1328 -3148 -514 1864 3107 -728 -2270 -2391 1273 3239 1191 -1526
1994 -1526 -3316 120 2354 2805 -854 -2779 -1783 1516 3128 209 -1988 -2972 907 2596 2137 -1572
2010 -1572 -2910 -626 1866 3181 -771 -2432 -2421 1387 2768 1201 -1750 -3262 58 2078 3034 -852
2026 -852 -2692 -1688 1573 2878 395 -1615 -3052 623 2195 2158 -1458 -2903 -879 1585 3107 -330
2042c30j999m02L687J740j384k808j462K901J869J030l934j353O46L141J680k471
2058E51k241r31L224J742L5l750j562J895K516J473l163j771n19L498J309o59
2074A647l414j268K762K050J016l725j321K22L345J312j804k874p27L329J510
2089B060L07l524j384J113K969J039k665j683q14L321J828j029l064j251K291
2104d86K223R23l263j428J20L279J131j628k313j474L192J491Q27l836j260J160
2120a342K853J182k478j744j193L573J302n94l167n77J484K717N81l121j465j66
2136b155L496J068j315k850r39K802J685Q63l925j005O74L059J131k432j857p94
2152b494L319R73k09k988j236J851K376Q67k790j470l61L389J158j295k648q14
$$ plain form
2042 -330 -2329 -2731 956 2696 1312 -1496 -2958 -57 1812 2842 -1092 -2445 -1799 1342 3022 551
2058 551 -1690 -2621 603 2345 2380 -1370 -2932 -1037 1479 2952 -211 -1982 -2501 997 2306 1647
2074 1647 -1767 -3035 -273 1777 2793 -932 -2253 -2031 1314 2626 822 -2052 -2779 550 2060
2089 2060 2367 -1157 -2541 -1428 1541 2580 -85 -1768 -2582 739 2567 1538 -1526 -2777 -486
2104 -486 1737 2660 -603 -2031 -1911 1368 2499 871 -1442 -2916 276 1767 2594 -1242 -2502 -1342
2120 -1342 1511 2693 215 -1529 -2722 851 2153 1559 -1608 -2185 -701 2016 2597 -524 -1989 -2155
2136 -2155 1341 2409 1094 -1756 -2695 107 1792 2655 -1270 -2275 -1601 1458 2589 157 -1700 -2494
2152 -2494 825 1798 1589 -1399 -2635 -784 1592 2459 -331 -1801 -2162 1227 2385 1090 -1558 -2372
2168b372K165K030N04l385o64m2L642L38j739k157p94L170J070K65l414p54J151
2185i86K769Q41l002j344n91K988J349n00l101q85K264J849N94k809j130l49L568
2202A525Q07j741k130r69L048J144L91l433q57J039K623O90k497j223n28L163
2218A052J002o43k935p71J880J967O75k923r28j18L050O34j253k288p05K490J982
2235B168J0l532n74P06K929K78j595k008n50L096R05j50l211o73J584K233N95
2252B211k739j193j75K897J076j302k349o20K339J445M07l262o53R50K608N73
2268B213j853j946m78K749J193j10l216n05J285K462N38k471j563J82K587Q16
2284A883r22k531o83K124J673L97k991o46J54L091L45j544k003l46K668J091O0
$$ plain form
2168 -2372 -207 1823 2327 -1058 -1722 -1764 1878 2216 477 -1680 -2474 696 1766 2031 -1383 -2137 -986
2185 -986 1783 2624 -378 -1722 -2313 675 2024 1524 -1577 -2462 -198 1651 2245 -564 -1694 -2043 1525
2202 1525 2332 591 -1539 -2508 540 1684 2075 -1358 -2215 -1176 1447 2137 -360 -1583 -2111 1052
2218 1052 2054 1411 -1524 -2295 -415 1552 2227 -696 -1624 -1742 1308 1942 689 -1599 -2304 186 2168
2235 2168 2178 -1354 -1928 -1222 1707 1985 390 -1618 -2168 928 1833 1683 -1528 -2201 -617 1616 2211
2252 2211 -528 -1721 -1896 1001 2077 775 -1574 -2194 145 1590 1997 -1265 -1918 -968 1640 2213
2268 2213 360 -1586 -2064 685 1878 1768 -1448 -1953 -668 1794 2332 -139 -1702 -1520 1067 1883
2284 1883 961 -1570 -2253 -129 1544 1941 -1050 -1696 -1542 1549 1894 350 -1653 -1999 669 1760 1820
2301A820l174k97Q90K441N03k201j623l00L151N23m37k657o16K057J377N84k834
2318g93o89O3K724O84j312k145n70K387J017K77l040l82N48K716M60k103j455
2335a613j67L051O91p09k831k81J177K119M34k434j042K25K878J76q43k484j52
2352a805K200J163L82l112p50P33K580M28j749j465m21K624N60p0k715m79J241
2369f55K199L71k497j248K42K882M54r76k205k08J796J585N1k671o75K81K600
2386A326M36j688j691j23K437Q46l79k602l18J210K225k5k090j376K14K570O95
2403A667o45k428n64K199J433k5k319o40Q1K427O85j463k067L31J874R46k61k447
2421a216o78J060K377J38j843j230r5K709J74o49k237%J154J830R6k226j116J33
$$ plain form
2301 1820 -1354 -1651 -761 1680 2183 -18 -1641 -1941 1210 1733 1296 -1361 -1977 80 1457 2041 -793
2318 -793 -1482 -1419 1305 1989 677 -1468 -2038 349 1366 1643 -1397 -1779 -1231 1485 1945 -158 -1613
2335 -1613 -1780 1271 1962 1253 -1578 -1859 -682 1437 1871 -563 -1605 -1380 1498 1674 831 -1653 -1805
2352 -1805 395 1558 1940 -1172 -1922 -1189 1391 1819 70 -1395 -1816 808 1368 1298 -1417 -1896 -655
2369 -655 1544 1915 -582 -1830 -1588 1294 1748 772 -1433 -1641 155 1740 1791 -880 -1555 -1274 1326
2386 1326 1762 74 -1617 -1740 697 1543 1164 -1438 -1756 -546 1679 1654 -436 -1812 -1598 972 1667
2403 1667 1022 -1406 -1970 229 1662 1637 -682 -1322 -1241 1186 1871 408 -1659 -1328 546 1492 1231 -1216
2421 -1216 -1894 -834 1543 1681 -162 -1392 -1487 1222 1396 747 -1490 -1490 -336 1494 1590 -636 -1752 -1619
2439a619K741L26j135k074K72J918J272j15k700k63M32K718q5j695j679L06K192
2456H12M22l73k400k06J468J939n64j571j062M11K069O06j035j858m16J875J441
2473A558j15k658l96P81K481j50j320j589j57K335M86j75k377O6J048J646P9j938
2491c95j061J19K439K96l96k462J52J378J414k51k285n65O76K196M3j186j702
2508a590J8K115Q75m25k230j09O81K012j3j844j071M07K097P13p45k259k3J520
2526A29J061L2j873o77L15K449j52q10j865o1K123P84p7k541j30P23K132k79j588
2545c05r49j42K320K29m90k196L94R16J869l85k155n18M19K285k0r21j835Q6J802
2564D04P08J4k176k51P43J939k06j152j259J80J838O85o57k290J62J020J840m53
$$ plain form
2439 -1619 1122 1448 313 -1761 -1489 429 1701 1586 -1114 -1377 -945 1773 1688 -7 -1686 -1380 812
2456 812 1234 861 -1539 -1745 -277 1662 1098 -473 -1535 -1124 945 1551 516 -1342 -1758 117 1558
2473 1558 1443 -1215 -1611 -830 1651 1501 181 -1408 -1565 770 1256 1081 -1296 -1230 -182 1464 1543 -395
2491 -395 -1456 -1337 1102 1398 1002 -1460 -1308 70 1484 1233 -1052 -1617 -941 1255 1298 112 -1590
2508 -1590 -1572 543 1418 993 -1237 -1346 -665 1347 1334 -510 -1581 -1174 923 1636 891 -1368 -1391 129
2526 129 1190 1222 -651 -1328 -1013 1436 1284 474 -1391 -1452 671 1455 1378 -1163 -1293 -570 1562 1283 -305
2545 -305 -1254 -1396 924 1153 663 -1533 -1139 -223 1646 1261 -894 -1412 -993 1292 1272 351 -1484 -1398 404
2564 404 1112 1126 -1050 -1301 -558 1381 1175 23 -1236 -1056 782 1467 810 -1480 -1318 -298 1542 1089
2582A089j621o85L08J920K46p48j811K98J387R98j02k126k92P41J783k46j215
2599g6j613M99K040N58m43k305j4J060J712l74j424j014K27K174R1p08j808M20
2617i98J327J136m12j746p16R43J891l41p86j800O97J621O27n24k040j30J119
2634a32J475l44j183j062L69K012K06q27j854Q3J258J288m16j604q15R19K006
2651A379j78o86j952K67J570Q50l79j695l30N44J903j90j335j310O23J804M36
2668A321p62j609q4J000J557l27j524r39N93K006l12n99j467L59J084Q49l52j901
2686a107K9P39J697l52j016j250L32J728K36m25k008N89Q69J165m03j474n61N99
2704f13J942k66p80j436l5J397J014l06j873k28M75J865m99p26j089M47J215N55
$$ plain form
2582 1089 -532 -1217 -909 1011 1257 509 -1302 -1004 383 1381 1279 -847 -1139 -398 1385 1139 -76
2599 -76 -1689 -1190 850 1408 965 -1340 -1354 -294 1418 1044 -380 -1394 -1167 1007 1098 390 -1418 -998
2617 -998 329 1465 1053 -693 -1409 -466 1425 1084 298 -1502 -805 816 1443 919 -1121 -1251 -132
2634 -132 1343 999 -184 -1246 -877 1135 1341 514 -1340 -1257 1 1289 873 -731 -1546 -627 1379
2651 1379 1201 515 -1437 -1170 400 1250 871 -824 -1154 -610 1293 1103 -232 -1542 -919 885 1321
2668 1321 559 -1050 -1134 -134 1423 1096 -428 -1367 -774 1232 920 321 -1146 -787 297 1146 794 -1107
2686 -1107 -1078 -339 1358 1006 -10 -1260 -928 800 1036 611 -1397 -808 61 1226 823 -651 -1212 -613
2704 -613 1329 1063 283 -1153 -1188 209 1223 917 -956 -1184 -709 1156 657 -69 -1158 -711 504 1059
2722A059o70j258R2Q65J124m22r63j134P06J451K05p86j414L46Q89J451q76j547
2740h82m02Q80J510k86n63j607O58J217N52l60j812J09P37J347k43j368o98O18
2758e93J036O02o00j709N26R40J015o27j259l97N73J618r6r12j324M25J030R00
2776A148o68j473r3P63J499m90q30j069L99J535L90p05j446J88Q37J316m61j336
2794d96n87O52J154J66o35j515N95J040P81m53j655J15O60J387m56q24j322O45
2812g48J455L31p23j316R4P56J221m31j045o14O32J288j28n62j419L24J288R28
2830A331p87j253k70Q26J365o54o78q42N41R38M87o33j332j00J005J285m08j075
2848b54q78N66J155L18q90j142O45M63J257q10j090j81O09J263m01n66j247O82
$$ plain form
2722 1059 389 -869 -777 88 1212 790 -173 -1307 -601 850 1055 269 -1145 -799 90 1541 665 -882
2740 -882 -1284 -404 1106 820 257 -1350 -692 525 1077 717 -1095 -986 -249 1098 855 -513 -1211 -593
2758 -593 443 1045 445 -1264 -738 202 1217 590 -669 -1066 -493 1125 1029 117 -1207 -782 248 1148
2776 1148 480 -993 -1086 -323 1176 686 -144 -1213 -814 721 1111 406 -1040 -852 -15 1301 840 -496
2794 -496 -1083 -431 723 889 254 -1261 -666 374 1155 702 -953 -838 -178 1209 753 -71 -1393 -748
2812 -748 707 1038 315 -1001 -907 -151 1070 639 -406 -1020 -388 900 772 210 -1209 -885 403 1331
2830 1331 544 -709 -979 -153 1212 558 -120 -962 -421 517 1004 371 -961 -1061 -56 1229 821 -254
2848 -254 -1132 -566 589 907 17 -1125 -480 -17 1240 430 -660 -841 -232 1031 630 64 -1183 -501
2866e01J153L89p12j136l49J057J074l46q77q13M10J483J91o36j438O82N89R63
2884A183o40r32o33O91J098qo96j271P01Q76P27o45j352K54J92J567m96j005o52
2903a041N09J270R5l60j453K55Q77R99p27q30k88M71J326j80j141m89M8R45P16
2922A002m27j373l07J044J084k90j098p18Q94P35M64o61j187J8Q18J156q97q36
2940e79m95Q59J079j05o32j184N39P41Q00m73j062l69P83J233p17n86j072O98
2958e42J072L61n14j419L99P22J055n39j033p10J147Q50l38l36q87L84M52J026
2976A150r33o96k34O25P40J8p36j101O01J103N26q91j087K08O49J156o38o44p91
2995i75O45Q18K69q19r24N79N41Q61j015m87j25M63Q15k9p52o95M01M67R72p83
$$ plain form
2866 -501 652 1041 329 -807 -1156 -99 975 629 -248 -1061 -651 832 1023 387 -1051 -369 220 1183
2884 1183 543 -389 -1022 -331 767 759 63 -1208 -507 369 1096 451 -901 -647 -455 1112 616 -389 -1041
2903 -1041 -532 738 833 473 -980 -725 152 1151 424 -406 -694 -223 1103 923 -218 -707 -659 286 1002
2922 1002 575 -798 -1105 -61 1023 733 -365 -1083 -189 546 1010 349 -838 -820 -2 1154 257 -579
2940 -579 -1074 -215 864 759 127 -1057 -518 223 1023 550 -512 -881 -98 1135 418 -168 -1240 -542
2958 -542 530 891 377 -1042 -643 79 1134 595 -438 -1148 -1 849 511 175 -712 -328 124 1150
2976 1150 217 -479 -713 -88 652 670 -66 -1167 -566 537 1063 172 -915 -707 -58 1098 460 -184 -975
2995 -975 -330 488 757 -62 -986 -407 134 995 -20 -507 -632 -169 646 617 -135 -830 -429 38 1010 227
3015B27r25p1O50R65o20n72n92Q34N56L30q94p60M39N08J070q41p91l51P54O59
3035E75J61p17j334R77P21K45n15q43q1O18J093m25l88j128R01N12M77m81j184
3054h16J15P32O76m19n76m53O38Q26J04p74q43J82R06P18o45r84k36R42N96j87
3074E02o35q46Q53M48M97n01j399L65P94J012q23n29m29O34N57j07k60j072N98
3093c41O90L87o35m96k45M55Q45j6p73o86O66L72O58q73o48J91L93R60n87n28
3113b11m16N79M55J46m02j104O58N28M43n14m73k96R48L44k07k91j296P53O85
3132C29N04m35q58k55N08J124m90o72n96P45O21p8m29p62L85M01M51m41j01q04
3152h53R30N58r2n59n05L93K87P50q20n40l0M75P24n17l26o36N58P45o9n95m33
$$ plain form
3015 227 -698 -769 -119 846 226 -346 -938 -104 452 782 -112 -872 -433 75 1145 304 -487 -838 -84 575
3035 575 736 19 -1315 -338 383 628 113 -730 -811 -193 900 475 87 -1041 -140 372 849 368 -816
3054 -816 -701 31 707 288 -288 -741 -103 723 827 53 -790 -608 298 1016 371 -613 -849 93 689 502
3074 502 -133 -979 -126 322 819 318 -1081 -716 78 1090 267 -262 -691 -57 500 393 133 -939 -341
3093 -341 349 736 101 -395 -640 -185 660 644 -129 -815 -149 223 881 8 -640 -449 -56 904 317 -211
3113 -211 -627 -48 407 553 151 -953 -295 233 676 162 -311 -607 341 685 478 187 -1109 -356 329
3132 329 833 398 -460 -715 -207 917 427 -245 -841 -96 525 447 18 -744 -359 42 493 52 -49 -853
3152 -853 77 635 543 -16 -521 -128 159 909 89 -451 -481 -6 718 201 -125 -761 -203 542 473 -122 -555
3173e55K92L10P08n31n66l75P73L96K3n37o78P45M25L37p02o70n4N28Q48j26l84
3194B07j201O24O44J73m38p35J43N22Q40q10j2n93M56O02K79p56n97R3P39O76
3214H56p83n89n4M22J062o83k59p15O44M03L70l84p89J90J91J014p62n69m09P58
3234h6L99J69m83m99J7Q76J58k16o44n82Q03P36l40j34j076O41M74L34o45n00
3254e98K56N65L81k84m60j84J47N50P9n58m38P8N18N17m32n84j09O20L70J7p30
3275b79l62M15L17L84l78o44nO29M68j77p28j85K75N70n2k51m30K01L40L70m66
3296A2l07k76N91K80J55l46m20M5M53L03l15o20p2O45M27m30l1p25Q36J45J93
3317E43n50m29N8K78N11m32J09p95P85N46k76l70p00N50K74O58p38mn77L01R92
$$ plain form
3173 -555 -263 47 755 224 -342 -717 56 452 475 -62 -740 5 430 767 65 -605 -659 -131 717 591 207
3194 207 -994 -370 274 447 9 -726 -583 -61 779 -31 -43 -636 -180 422 701 -55 -652 -559 180 856
3214 856 73 -516 -570 -148 914 231 -28 -743 -99 304 674 290 -499 -309 -118 896 134 -435 -844 -86
3234 -86 313 482 -1 -500 -483 393 551 335 -309 -891 -88 648 308 174 -902 -261 213 547 -98 -598
3254 -598 -342 223 604 320 -140 -324 -177 373 452 -106 -544 -466 52 569 137 -447 -556 64 434 451 -279
3275 -279 -641 -226 91 475 97 -547 -552 77 545 368 -360 -545 -270 300 248 -3 -433 -232 108 478 12
3296 12 -295 -571 20 300 455 109 -311 -266 187 490 175 -445 -517 128 555 125 94 -631 205 350 543
3317 543 -7 -436 -378 -100 411 -21 88 -707 78 624 348 -22 -722 -172 102 760 22 18 -559 -258 734
3338G34n66l89k29M31K36J96k98p21K69O87L69o85k76k40M67N08k22k96m24R7
3358c52N50M92m89n35l31J028J84m32m18j00M69L80m5l81m53L00N51J89l47l98
3378a38k68K0P55n8n41j56N6L09L36j55m29j52L17M99j49k95o99N79J60L20l84
3399g3k68n4O22N7j98m57k02O49K9K80m02m03K15J10N28l59j79l73N70J85j37
3420A40m02k5R2L64N29o00l8p08Q48J95r2k88l42J25L55L97m55n05O0O85L2j68
3442A99l63l07L93M19J62l03n74K00K19M59n61l36P4N01P2J11l00m96L46K26Q6
3463B27n8m19J5L83L75n73j42N2k18N39K20l38k93M2k6P55m95k25j28L51K08j13
3485A39j7m88J99L16R8k42j16k3K95K38k15m34l40N14K80N4m43m33M34L42K59
$$ plain form
3338 734 168 -221 -450 -19 217 413 115 -606 -337 350 719 34 -242 -482 -15 493 271 -25 -449 -352
3358 -352 198 690 201 -334 -665 363 547 115 -303 -403 66 446 401 20 -433 -133 418 607 260 -138
3378 -138 -406 -386 369 311 -230 -386 -330 -21 315 160 -269 -421 -104 395 246 -49 -748 -169 -9 311 -73
3399 -73 -341 -395 227 284 86 -371 -573 76 105 385 -17 -420 -205 -95 433 74 -105 -478 92 277 140
3420 140 -262 -287 -195 169 698 98 60 -648 200 395 303 15 -327 -202 153 550 95 -410 -350 335 367 199
3442 199 -164 -471 -78 341 503 200 -374 -174 45 504 -57 -393 -319 182 254 365 65 -431 -85 141 227
3463 227 169 -250 -235 148 523 -50 -192 -140 -358 181 401 63 -230 -188 -214 541 46 -179 -307 44 252 139
3485 139 122 -366 -167 149 247 5 -111 -134 161 399 184 -250 -590 -76 204 258 -185 -618 -184 158 417
3506D17l79l31R5K04J52Q9j23o05L70M83j19Q3k85j40R0J55J0q7p8k63K62K50
3528B50l18k44OK05N59m66J07q3L41j48L4m98j04J69L18J11k69j59j39K68L58
3549B98j63j90m13N73LL47m72l36K04M7M15m51k7k73M56J7L39l93l0n0m9K02r1
3572c7j28p5L11K40J50o07k27K48L07qp1m65J19L31J83k12j14k85M09j9J61k99
3594h8j62l4N54K2j65m58K5N21j99J49k94j53L17L32m5m54k0j33M22J5o6q0l16
3617c10K30Q8M70p44J03K6K01J02l76L3M3K15J15j40m7j92j11K09N65n51j63k3
3639b57K45K44m9j61l15l6K76L87n53n1J83J17J59k06j29P0J41N5J45m67j69M52
3661H1p5K17J1l56k37L51J44k06J30j95k22O43J3n35J8J51O8K43k44k75j70L46
$$ plain form
3506 417 38 -293 -198 6 158 247 124 -481 -111 372 253 336 51 -89 1 156 166 79 1 -262 0 250
3528 250 -68 -312 -306 -101 458 -8 99 16 357 209 243 -255 -359 -190 128 239 -30 -189 -328 -60 298
3549 298 135 -55 -468 105 108 455 -17 -353 -149 -102 313 -138 -165 -438 18 35 374 -19 -49 -99 -148 54 -37
3572 -37 -165 -240 71 311 461 -146 -373 -125 182 174 103 -362 -243 88 271 59 -55 -340 69 50 211 -88
3594 -88 -250 -284 270 292 127 -331 -306 215 16 165 -129 -282 35 367 322 -132 -152 -285 137 152 86 6 -310
3617 -310 -80 8 478 -266 -163 -137 64 166 -210 -177 -134 81 196 56 9 -183 -294 -85 480 -71 -234 -257
3639 -257 -12 232 183 22 -293 -329 -53 334 -219 -270 -87 30 189 -17 -146 -76 65 120 265 -202 -371 81
3661 81 6 223 234 -122 -359 -8 136 -70 60 -135 -357 286 299 -236 -218 -67 1 244 0 -275 -445 -99
3683i9N3J26k14rJ93K4J12J62o39O1K25J61j2O8k98J26J15N4k36O4l43K67M36
3706C97l72j39k65K54J61L26m40k3J8Q0J26P8l86j3L63j45Q7J24m96J26L07J68
3728C36l30J3l3J0L71j84m20M1K2K85j74j37l26N67Q5R3n0k53J43r2P0OJ40m14
3752b31L4L08KK0l46O4L34o5K2k3k10J50o3J71k01J9m8J26J33n3j43j47K09k26
3776a64K75k21r0J89j9K85l92J23k09K32L39m45Q0j43J34J53L1j38k77J26O4M1
3798b6L2j39k79M35J55o4k08r2N1K30K60m39j48j64L64N4L41l60o36L66M00K5
3820A58p8j19mK52j74K42j87l82K18O4j03J15k18J19M0K50l92J59p7r5K68J16
3842A72j1p4l95L75k32P4K15m11L7L96n9l70K51J53l87N78j73j2j44kJ22K31l10
$$ plain form
3683 -99 -46 80 -134 -143 50 74 186 348 -291 -230 -5 156 144 212 -86 40 155 209 -27 37 -306 -39 397
3706 397 25 -114 -379 -125 36 362 -78 -101 -83 -3 123 201 -185 -198 165 20 107 231 -265 -139 168 336
3728 336 6 19 -14 -4 367 183 -237 -196 -174 111 -63 -200 -526 41 126 219 169 -84 59 -33 37 43 183 -231
3752 -231 -197 111 113 133 -213 -149 185 120 142 119 -91 59 -4 167 -34 -15 -63 63 196 143 0 -147 62 -164
3776 -164 111 -110 -200 -11 -30 255 -137 -14 -223 9 348 -97 -17 -160 -26 127 158 20 -257 -131 -67 -26
3798 -26 6 -133 -412 23 178 114 -94 -186 -135 95 355 -84 -232 -396 -32 22 363 3 -633 -267 133 158
3820 158 80 -39 -43 209 35 277 90 -292 -74 -10 -113 2 -216 -97 -57 193 -199 -40 -117 -212 56 172
3842 172 161 87 -308 67 -165 -91 124 -287 -250 146 87 -283 -32 121 -266 312 139 127 -17 -19 103 334 24
3865B4l15K61L05j15j50k01K97m8K32l28j96K43O3P2k93Q7m30L57K25J35L1l78
3887a22J49oj3o1j19m8Q1N34l94j15j79M40m52K62K23o6q3r0J94J7j56j53K78
3910A21j32m6P6k28O9L36j05lj39J65j68l19P51l78r7j24K50j12L4J37J0J02Q
3933B08k51l1j59J03K20R1j52jK22m02Q2J45l73L28J22j20K02k99k33L2M34R5
3955B63k65L00m15K09M0j53J1n6J82Q2J21k87r1j04L65j56j41K12k00J94m8j14
3977e1J14k19J51J52L0j11j53k48K41K27n1rN2j06J1O3M4j25m45M81m7p7J48J9
4001I1j55%J46l1j96J89l16L85o8r4Q5Jq3J29k32R8j47J62r1J05Pl05P5K28J17
4026A00j72J27p0K69k24j28j56M3J66L70m42J51n1K9J24l25jL11r2J70k56J75
$$ plain form
3865 24 -291 -30 275 160 10 -191 106 58 290 -38 -234 9 72 144 -149 -62 -492 -135 90 225 256 -122
3887 -122 27 21 8 -53 -172 -220 -139 395 1 -114 -293 147 -305 -43 180 114 31 -59 135 152 -4 -157 121
3910 121 -11 -57 19 -209 -140 196 91 88 -51 114 -54 -373 378 0 -97 -221 29 -83 -49 88 98 200 208
3933 208 -43 -74 -233 -130 90 181 29 28 250 -152 -70 75 -298 30 152 32 234 -65 -298 -266 168 263
3955 263 -2 298 -117 92 132 -21 -10 -66 116 198 319 32 -59 -163 202 46 -95 117 -83 111 63 -51
3977 -51 63 -156 -5 147 177 66 -87 -335 -94 133 82 73 125 19 30 93 137 12 -433 48 1 -76 72 91
4001 91 -64 -64 82 51 -145 44 -272 113 45 -49 36 37 -46 83 -149 -51 -198 -36 -127 -22 -15 -320 -245 -17 100
4026 100 -72 55 -15 254 30 -98 -254 -211 -45 325 -117 34 -17 12 136 -189 -190 121 29 199 -57 118
4048A18J25j47j48l0K66m7J61k72O5k37K99k5r0l58K88J63j27m27L15k6J63J14
4070A43j64k15K33K46k54J67l63J6K76J02p7J42n5l47L23p2j40qj03L64pj10l33
4093b36M7J83K04r0r3k33J40P2M4kr6N9j23K43K3m6l17J69J12J48k88Q3J3K41
4117B57j34l69M46j89k22L74j42j49Q2Jj45J17j09M21k23Ml6K53k72j59o0M50
4139A96j1K8n71K30L08r1jl73K43m3K30k23L65l46k4J04J84j81j02m7K35r5J87
4162B02j41n0%L09l85J50k74p2L69k11L48m88K08O5O7j23R9l03J26K60l7l09L9
4185a51J26r9P8J64k41pJ27O2K37k32k31M2J78J64q3l23J35J13L1N5j59J36k12
4208i0k5J25K14k08l6p2j0K23o1m15N73k19o2j27K27P4j82j32L32m65N08p3j32
$$ plain form
4048 118 243 96 -52 -82 184 137 298 26 91 -146 153 128 38 -320 -32 131 4 -423 -108 -134 29 143
4070 143 -21 -236 -3 243 -11 156 -207 -191 85 187 110 252 197 -150 173 101 -39 -47 -150 214 207 97 -236
4093 -236 -189 -6 198 108 15 -218 -78 -6 38 36 -60 -1 -124 119 142 96 -221 -52 60 208 -80 3 16 257
4117 257 123 -246 200 11 -211 163 21 -128 -46 -45 -190 -73 -182 239 16 20 -16 237 -35 -194 -254 196
4139 196 185 213 -358 -128 180 89 88 -285 -42 -85 145 -78 287 -59 -83 21 205 24 -78 -125 110 15 202
4162 202 61 11 11 320 -65 85 -189 -261 108 -103 245 -243 -35 30 97 -26 73 -230 -104 156 119 -190 -151
4185 -151 -25 -124 -46 118 -123 -130 -3 59 296 64 -167 -125 53 217 134 -189 -54 59 90 145 -14 122 -90
4208 -90 -115 10 224 16 -20 -92 -102 121 60 -355 218 -1 -63 -190 37 111 -71 -203 129 -336 172 99 -33
4231c3K11j07k55O2J84l2l3L8p8n6L6j08J11J36j01j29R6J23K5j93K42k62J28
4254EN4j21k37M85j22J24r1k84J00L61J2k99k5K0J62K7k18j86J91k12L06j17N8
4277gm33M76QJ12%l20J40J07J3j27j63M05k20K11r6j43o0K37j45k36L08k48K78
4300I7k68L15M8K7k06O7J80l30J80m80J18J58J35L6j74N9m8J32K8P0l90L68j00
4323B2R0r5j1k17J24L87l24j68K21J45j82K40m15K5K55l37L37j44j90L95j43J70
4345A85j37p1j54J24M09n64K51LQ4m3O3j60j14K04q8J10L1j30J08q7J0K33l51
4368h4J54lO6j06k02K22k57L40N3m73R3J11k4R7j5Q3Q5j67O3J61m6k27K20k31
4392h7O4J26m0j72J57O1n2k7j88p1L93l14N0K35k00r9J64K31J37k86l34J89K60
$$ plain form
4231 -33 178 71 -184 -122 62 30 -3 35 -43 -99 -63 -171 -60 76 -25 -154 -58 65 90 -103 139 -123 5
4254 5 59 -62 -299 186 64 188 97 -187 -87 274 286 -13 -38 -18 144 171 -47 -233 -42 -254 52 -65 -7
4277 -7 -440 36 44 156 156 -164 -24 83 96 -31 -194 211 -9 202 106 -37 -97 140 -5 -241 67 -181 97
4300 97 -171 144 192 219 13 80 260 -70 110 -370 -252 -94 41 77 -97 -38 -86 46 74 144 -246 122 22
4323 22 112 17 6 -211 -87 300 -24 -192 29 174 -8 232 -183 -158 97 -240 97 -47 -237 158 15 185
4345 185 48 -23 -177 -53 356 -208 43 46 130 87 150 -10 -124 80 -8 102 133 3 111 24 34 267 -84
4368 -84 70 67 133 27 -175 47 -210 130 183 -290 -197 -86 -110 -13 -28 55 140 -27 36 197 151 -76 144 -87
4392 -87 -23 103 63 -109 48 109 57 30 -158 -229 164 -150 -100 135 -65 -164 0 231 368 82 -252 -63 197
4415A97j29Ml28M33k74N3J66k70n7r8M21J53j70l46J82J51K50m49o9J67K21l42
4437a34k9J49O7l1L73m80J30l52L06o9O9o8K68p0j95M2M46n16n7L2L6M18M3l50
4461B8j82K31N1J18m54J64j69K19Q0J23j25n0J7K78m03m1j68R8J16K24k62J98
4483I1k54K35K28n42K88j50K07j0J09j94k37j40L70M01n09o2l8J22J84L4j20j94
4505a81K21O2J19j66l46J14M9K82k05n4J0m4N06l34j50k10O9J84J09J03l23J18
4527f7Q8J56K6k0k90rK87j84K25j17j26J33o3N2k94L24k25L93q6k46j28j6K94
4550A07m3J53m22N1J22K78j08L4m92M38k57L51l29P8l14K56J19J94j37l01O5N3
4572a04j8J41Qm3J90p1m5j51k17L51j4o1J49l33L93J62l92J43l51j05L27J55k15
$$ plain form
4415 197 68 72 -256 177 -97 -44 122 -148 -205 -303 118 271 101 -245 -63 88 338 -111 -180 -13 208 -134
4437 -134 -163 -14 53 22 395 -85 45 -307 -1 -70 -1 -69 199 129 -66 -24 422 -94 -151 -119 -83 335 378 28
4461 28 -154 77 128 246 -208 -44 -213 6 86 209 84 34 51 329 -74 -115 -283 -185 -69 155 -107 91
4483 91 -163 72 300 -242 46 -104 103 93 202 8 -229 -369 1 402 -107 -169 -207 -85 99 133 13 -181
4505 -181 40 102 221 55 -291 -177 -128 154 -51 -105 -95 -139 367 33 -117 -327 -258 -74 35 138 -185 -67
4527 -67 21 177 203 183 -107 -116 171 -13 212 95 -31 102 39 91 -203 121 -104 289 203 -43 -171 -187 107
4550 107 64 217 -205 -154 -32 246 138 172 -320 118 -139 212 -117 -39 -353 -97 22 216 79 -222 -157 -104
4572 -104 -122 19 27 -16 174 103 58 -93 -310 41 27 -34 115 -218 175 337 -55 88 -263 -368 -41 114 -101
4595a01j45J62J26J45j85j28j44K99j46Q6k89M94l37M5J40J56J1j21r2o6K64J2
4617A86j55K14l14J25K2k57R7R3j50K46j85J14L4k02K83J1j52P7l3L63l95J70
4639A92k50q1J15J84j49j29J45p4K18k26k16N42l16M8J41k82M8J90j64K36l44
4660a72K3K7N5K25j25Oj46p6O6L72j69l76J52n4M26j37j44n0Q7J19M8k35j79N5
4684b02K29K39j09j20k20M8L34j12k55l6N6J11M23l36m21J40J66K31J8k87n4J30
4706b7K35O5l56K38l89K32K16j77L5j60q9J29J58j14k29q1K37K40R3j93k05O5
4728g7L01p2J3j11p5q7K70L8l52J63N1j30R4j82J83k40L27K8l78k3L97J5j06K08
4752B55l93q1J39J7o7J66j39K7N2L7p2J41j11nJ88J04m63J68q5J32K70l86j03
$$ plain form
4595 -101 -246 -84 42 187 2 -126 -270 29 -117 -31 -320 174 -163 -118 22 178 189 68 -24 -90 174 186
4617 186 31 245 -69 56 78 -179 -82 11 -139 107 -78 36 70 -132 151 162 10 87 54 417 22 192
4639 192 -58 -139 -24 160 11 -118 27 -47 171 -55 -271 271 -45 3 144 -138 -90 100 -64 172 -172
4660 -172 -149 -122 -67 158 33 39 -107 -183 -117 255 86 -290 -138 -192 234 97 -47 -97 -10 109 157 -78 -257 -202
4684 -202 27 266 157 37 -183 -135 199 87 -168 -204 -148 -37 386 50 -371 -231 -65 166 184 -103 -157 -27
4706 -27 208 273 -83 155 -234 -2 214 37 72 -88 -177 -48 110 -4 -233 -314 -77 163 256 63 -142 -77
4728 -77 224 152 165 54 -21 -108 162 200 -152 11 62 -68 26 -156 27 -213 114 142 -236 -259 138 153 47 255
4752 255 -138 -219 -80 -63 -130 36 -103 -76 -24 13 -59 82 -29 -34 154 258 -205 -37 -122 10 280 -106 -209
4775b09j11Q3L46K06j83p2m8qJ04j10k74J76K08J87j94j74L1k5R0K34l67P5KJ63
4799A30l05Q1m9m2L3K44j33J26n06K93L11m9O7l46N0J23k7J56m13J50k34M79j06
4822C3k27Q9K53j13N6K31n92M6L08O8n9k23q7K32L02l17j31O4O1J50J3r6o1j9
4846a9OM3J58j67k03J83J41J41l37o0l3q3N10o7j10m05J55K35J61k45k12J42l8
4869a04K3j07J33m2j23M03j55j6q7k15M92k41m5N3r7NL72j20P3n65J70M4N8J95
4893A04k22R7J62L46n63o3L70l67K15q0o8p3j46L20K44j58k01pJ61Q7j19j96J74
4916A7M2j95L07k68m5K63j32K94k02j2j21j03M17k28N2j07j69K89l1m2m16L36
4938e4JJ57q1K09n28Q7J79k36L27k57L69k58K31M6k33J37k20L26j31r6k15J18
$$ plain form
4775 -209 -320 -237 109 315 132 60 12 4 108 -2 -276 -100 108 295 101 -73 -42 -67 23 257 -110 -35 -33 130
4799 130 -175 -94 -143 -185 -152 92 -41 85 -421 -128 183 134 201 -145 -95 28 1 157 -256 -106 -340 139 33
4822 33 -194 -105 148 35 91 322 -270 -224 84 152 93 -130 -217 15 317 0 -131 -67 -6 144 157 61 0 -19
4846 -19 -13 30 188 21 -182 1 142 283 -54 -114 -147 -230 280 213 103 -302 -147 88 249 4 -208 -66 -104
4869 -104 -81 -188 -55 -97 -220 183 28 12 -75 -290 202 -39 -84 -31 -128 -123 249 129 202 -363 -193 -149 -91 104
4893 104 -118 -21 141 487 -76 -139 231 -136 79 -1 -69 -142 -288 32 276 118 -83 -90 71 158 39 -157 17
4916 17 59 -136 171 -97 -142 121 -11 283 81 69 -52 -155 262 34 86 -21 -190 99 68 26 -390 -54
4938 -54 -53 104 23 232 -296 -209 -30 -266 61 -196 173 -85 146 192 -41 96 -124 202 71 -25 -240 -122
4960a22k5L48k58O0l08J35L30k37J64p4L7J97Pp9l00M1J23lM78n94j35K28l8L12
4984B87l61n2L4P5K39j55K2l40J61M0n7J75j77L52k20J78k99j64J28J73j81K48
5006A06j47K2k3J22O6p1k04P4K70J79j08k72o1R8J22L3k52N0M3l3J18j61j9q5
5030a33L02J0m08J97j6k12M13j73L9K7k39J30K63m92K59k61J46O2J18K91n83J62
$$ plain form
4960 -122 -147 201 -57 3 -305 -170 160 -77 87 13 50 247 254 175 -125 -84 39 36 514 -80 -215 13 -25 287
4984 287 -74 -126 -92 -17 222 67 89 -251 -90 -50 -107 68 -109 243 23 201 -98 -262 -134 39 -142 106
5006 106 -41 -19 -42 80 146 75 -129 -55 215 394 286 14 -47 51 173 206 -46 4 47 14 132 -29 -48 -133
5030 -133 169 179 -229 -32 -48 -260 153 -20 19 46 -193 -63 200 -292 -33 -294 -148 -86 32 323 -260 -98
$$ [...]
8191a26
##END NTUPLES=NMR FID
##END=
