##TITLE=1H_DE-41W1
 D2O
 8 sc, 
 1.4.2024
##JCAMPDX= 6.0         $$ Bruker NMR JCAMP-DX V2.0
##DATA TYPE= NMR FID
##DATA CLASS= NTUPLES
##ORIGIN= UXNMR, Bruker Analytische Messtechnik GmbH
##OWNER= root
$$ XWIN-NMR		Version 3.5
$$ Mon Apr  1 14:17:17 2024 Russian Standard Time (UT+4h)  she@DPX200
##.OBSERVE FREQUENCY= 200.1313
##.OBSERVE NUCLEUS= ^1H
##.DELAY= (6, 6)
##.ACQUISITION MODE= SIMULTANEOUS
##.ACQUISITION SCHEME= undefined
##.AVERAGES= 8
##.DIGITISER RES= 18
##SPECTROMETER/DATA SYSTEM= spect
##.PULSE SEQUENCE= zg30
##.SOLVENT NAME= D2O
##.SHIFT REFERENCE= (INTERNAL, D2O, 0, 15.7039)
##AUDIT TRAIL= $$ (NUMBER, WHEN, WHO, WHERE, WHAT)
$$ ##TITLE= Audit trail, XWIN-NMR		Version 3.5
$$ ##JCAMPDX= 5.01
$$ ##ORIGIN= Bruker BioSpin GmbH
$$ ##OWNER= she
$$ F:/spectra/data/she/nmr/H-F/1/audita.txt
$$ ##AUDIT TRAIL=  $$ (NUMBER, WHEN, WHO, WHERE, WHAT)
(   1,<2024-04-01 14:16:14.03 +0400>,<she>,<DPX200>,
      <created by zg, POWCHK disabled, PULCHK disabled
       configuration hash MD5:
       00 E9 B6 7A A2 85 ED C7 34 08 36 98 17 FE 4E 26
       data hash MD5: 16K
       4B B7 9F 58 58 FF 95 37 EB 5F D3 5E 25 04 66 A2>)
$$ ##END=
$$ 
$$ hash MD5
$$ E9 46 52 CC BE 33 00 25 18 74 7E 90 77 67 37 26
##$RELAX= 
##$RELAX= 
##$RELAX= 
##$RELAX= 
##$RELAX= 
##$RELAX= 
$$ Bruker specific parameters
$$ --------------------------
##$DU= <F:/spectra>
##$EXPNO= 1
##$NAME= <H-F>
##$PROCNO= 1
##$TYPE= <nmr>
##$USER= <she>
##$AMP= (0..31)
100 100 100 100 100 100 100 100 100 100 100 100 100 100 100 100 100 100 
100 100 100 100 100 100 100 100 100 100 100 100 100 100 
##$AQSEQ= 0
##$AQ_mod= 1
##$AUNM= <au_zg>
##$AUTOPOS= <>
##$BF1= 200.13
##$BF2= 200.13
##$BF3= 200.13
##$BF4= 200.13
##$BF5= 200.13
##$BF6= 200.13
##$BF7= 200.13
##$BF8= 200.13
##$BYTORDA= 1
##$CFDGTYP= 0
##$CFRGTYP= 5
##$CHEMSTR= <none>
##$CNST= (0..31)
1 1 145 1 1 1 1 1 1 1 1 1 1 1 1 1 1 1 1 1 1 1 1 1 1 1 1 1 1 1 1 1 
##$CPDPRG= <>
##$CPDPRG1= <>
##$CPDPRG2= <>
##$CPDPRG3= <>
##$CPDPRG4= <mlev>
##$CPDPRG5= <mlev>
##$CPDPRG6= <mlev>
##$CPDPRG7= <mlev>
##$CPDPRG8= <mlev>
##$CPDPRGB= <>
##$CPDPRGT= <>
##$D= (0..31)
0 1.2 0 0 0 0 0 0 0 0.06 0 0.03 0 0 0 0 0.0002 0 0 0 0 0 0 0 0 0 0 0 0 
0 0 0 
##$DATE= 1711966573
##$DBL= (0..7)
120 120 120 120 120 120 120 120 
##$DBP= (0..7)
150 150 150 150 150 150 150 150 
##$DBP07= 0
##$DBPNAM0= <>
##$DBPNAM1= <>
##$DBPNAM2= <>
##$DBPNAM3= <>
##$DBPNAM4= <>
##$DBPNAM5= <>
##$DBPNAM6= <>
##$DBPNAM7= <>
##$DBPOAL= (0..7)
0.5 0.5 0.5 0.5 0.5 0.5 0.5 0.5 
##$DBPOFFS= (0..7)
0 0 0 0 0 0 0 0 
##$DE= 6
##$DECBNUC= <off>
##$DECIM= 32
##$DECNUC= <off>
##$DECSTAT= 4
##$DIGMOD= 1
##$DIGTYP= 9
##$DL= (0..7)
0 120 120 120 120 120 120 120 
##$DP= (0..7)
150 150 150 150 150 150 150 150 
##$DP07= 0
##$DPNAME0= <>
##$DPNAME1= <>
##$DPNAME2= <>
##$DPNAME3= <>
##$DPNAME4= <>
##$DPNAME5= <>
##$DPNAME6= <>
##$DPNAME7= <>
##$DPOAL= (0..7)
0.5 0.5 0.5 0.5 0.5 0.5 0.5 0.5 
##$DPOFFS= (0..7)
0 0 0 0 0 0 0 0 
##$DQDMODE= 0
##$DR= 18
##$DS= 0
##$DSLIST= <SSSSSSSSSSSSSSS>
##$DSPFIRM= 0
$$ [...]
##$SUBNAM2= <"">
##$SUBNAM3= <"">
##$SUBNAM4= <"">
##$SUBNAM5= <"">
##$SUBNAM6= <"">
##$SUBNAM7= <"">
##$SUBNAM8= <"">
##$SUBNAM9= <"">
##$SW= 18.0517328524113
##$SWIBOX= (0..15)
0 0 2 0 0 0 0 0 0 0 0 0 0 0 0 0 
##$SW_h= 3612.71676300578
##$TD= 16384
##$TD0= 1
##$TE= 0
##$TE2= 300
##$TE3= 300
##$TEG= 300
##$TL= (0..7)
0 120 120 120 120 120 120 120 
##$TP= (0..7)
150 150 150 150 150 150 150 150 
##$TP07= 0
##$TPNAME0= <>
##$TPNAME1= <>
##$TPNAME2= <>
##$TPNAME3= <>
##$TPNAME4= <>
##$TPNAME5= <>
##$TPNAME6= <>
##$TPNAME7= <>
##$TPOAL= (0..7)
0.5 0.5 0.5 0.5 0.5 0.5 0.5 0.5 
##$TPOFFS= (0..7)
0 0 0 0 0 0 0 0 
##$TUNHIN= 0
##$TUNHOUT= 0
##$TUNXOUT= 0
##$USERA1= <user>
##$USERA2= <user>
##$USERA3= <user>
##$USERA4= <user>
##$USERA5= <user>
##$V9= 5
##$VALIST= <valist>
##$VCLIST= <CCCCCCCCCCCCCCC>
##$VD= 0
##$VDLIST= <DDDDDDDDDDDDDDD>
##$VPLIST= <PPPPPPPPPPPPPPP>
##$VTLIST= <TTTTTTTTTTTTTTT>
##$WBST= 1024
##$WBSW= 4
##$XGAIN= (0..3)
0 0 0 0 
##$XL= 0
##$YL= 0
##$YMAX_a= 88077
##$YMIN_a= -91521
##$ZGOPTNS= <>
##$ZL1= 120
##$ZL2= 120
##$ZL3= 120
##$ZL4= 120
##$ABSF1= 10
##$ABSF2= 0
##$ABSG= 5
##$ABSL= 3
##$ALPHA= 0
##$AQORDER= 0
##$ASSFAC= 0
##$ASSFACI= 0
##$ASSFACX= 0
##$ASSWID= 0
##$AUNMP= <proc_1d>
##$AZFE= 0.1
##$AZFW= 0.1
##$BCFW= 1
##$BC_mod= 2
##$BYTORDP= 1
##$COROFFS= 0
##$CY= 11.3945322036743
##$DATMOD= 1
##$DC= 2
##$DFILT= <>
##$DTYPP= 0
##$F1P= 15.7292609196834
##$F2P= 12.9074282941183
##$FCOR= 0.5
##$FTSIZE= 0
##$FT_mod= 4
##$GAMMA= 1
##$GB= 0.15
##$INTBC= 1
##$INTSCL= 1
##$ISEN= 128
##$LB= 0.24
##$LEV0= 0
##$LPBIN= 0
##$MAXI= 10000
##$MC2= 0
##$MEAN= 0
##$ME_mod= 0
##$MI= 1.114404
##$NCOEF= 0
##$NC_proc= 0
##$NLEV= 6
##$NOISF1= 3.799351
##$NOISF2= 2.8
##$NSP= 1
##$NTH_PI= 0
##$NZP= 0
##$OFFSET= 15.70392
##$PC= 1
##$PHC0= -25309.88
##$PHC1= 15.98731
##$PH_mod= 1
##$PKNL= yes
##$PPARMOD= 0
##$PSCAL= 0
##$PSIGN= 0
##$REVERSE= no
##$SF= 200.130013532006
##$SI= 16384
##$SIGF1= 3
##$SIGF2= 2
##$SINO= 400
##$SIOLD= 16384
##$SREGLST= <1H.CDCl3>
##$SSB= 0
##$STSI= 0
##$STSR= 0
##$SW_p= 3612.71676300578
##$SYMM= 0
##$S_DEV= 0
##$TDeff= 0
##$TDoff= 0
##$TI= <>
##$TILT= no
##$TM1= 0
##$TM2= 0
##$TOPLEV= 0
##$USERP1= <user>
##$USERP2= <user>
##$USERP3= <user>
##$USERP4= <user>
##$USERP5= <user>
##$WDW= 1
##$XDIM= 8192
##$YMAX_p= 0
##$YMIN_p= 0
$$ End of Bruker specific parameters
$$ ---------------------------------
##NTUPLES= NMR FID
##VAR_NAME=  TIME,          FID/REAL,        FID/IMAG
##SYMBOL=    X,             R,               I
##VAR_TYPE=  INDEPENDENT,   DEPENDENT,       DEPENDENT
##VAR_FORM=  AFFN,          ASDF,            ASDF
##VAR_DIM=   8192,          8192,            8192
##UNITS=     SECONDS,       ARBITRARY UNITS, ARBITRARY UNITS
##FACTOR=    0.0002768,     1,               1
##FIRST=     0,             0,               0
##LAST=      2.2672688,     0,               0
##MIN=       0,             -91521,          0
##MAX=       2.2672688,     88077,           0
$$ Real data points
##PAGE= N=1
##DATA TABLE= (X++(R..R)), XYDATA
0@%%%%%%%%%%%%%%%%%%%%%lRj3J4j4J4j4J6k1K6k8L0l5L8m1M7n3N9o6P3q0Q7r6
44e1J06j15J26j38J50j62J79j99K17k37K62k89L18l55M00m53N16n95O98q34J026
65E70j316J794k724N139k0148p4836N9560R5990L954j03698m8981Q1449R0267
78H7020n4513q9933j2531J03600M7105p5381q6703M5960R1798R727r4438n1712
90h0001P6730P5063l1521r6078p152Q6849N5161p6575o8272K3437R6458O965q4301
103b3237n0981O8610P0085k4291q9209j2271Q5066M3906n6489p5827K6635Q2246
115D4243J7733q4825m0717M9307P8392k7280p9477j6467P8843M2832m8591p4034
127f0041K1315Q1857J1458o9644m8464N1481O7634j5289q3101p919O2551N0938
$$ plain form
0 0 0 0 0 0 0 0 0 0 0 0 0 0 0 0 0 0 0 0 0 0 0 -3 6 -7 7 -7 7 -7 9 -12 14 -14 16 -19 19 -22 25 -28 31 -35 38 -42 45 -51
44 -51 55 -60 66 -72 78 -84 95 -104 113 -124 138 -151 167 -188 212 -241 275 -320 378 -456 570
65 570 -746 1048 -1676 3463 -16685 -91521 -31961 64029 67983 -35715 -84696 -3247 87020
78 87020 32507 -57426 -69957 33643 80748 5367 -81336 -35376 56422 66149 -28289 -80001
90 -80001 -3271 71792 40271 -55807 -62959 23890 79051 2476 -65796 -42359 54099 61064 -23237
103 -23237 -74218 -5608 64477 40186 -49023 -61294 23772 67678 11189 -64638 -38003 44243
115 44243 61976 -22849 -63566 -14259 64133 36853 -42624 -59091 19752 62584 13993 -60041
127 -60041 -38726 43131 54589 -15055 -63519 -12038 55596 40307 -42794 -50713 11838 62776
139F2776n1224o4673J4080P8455J1042o1830m8329M6247O6638j7643o9954j7806
151e2221O4559M3764m0649o8235K0178O3244K1482o4128m1614L8197O5642j7609
163C2610o2740k0218O0412M3849m0446n9544J1546O5147J6857n4725m6549M1915
175a1886N4266o791o6074j4908N1914M5910m0654n2754O240O3144J7316n3450
187g727m0831L4665N5429q815n8396k1267N6068L6130k9018n8038J0445N5605
199B4250K1571n4209l5811K8274N5774q161n6473j7820M8913L8248k9607n2015
211c7066L391N9393J4190m3701m1382L1182M9594k238n8476j3900M1946M1085
223D4018k8912n1047M676N3782J7524m3463l8070K4749N3377p485m9169k0937
$$ plain form
139 62776 11552 -53121 -39041 39414 50456 -11374 -59703 -13456 53182 35539 -34415 -52221
151 -52221 12338 56102 15453 -52782 -32604 30640 52122 -12006 -53620 -15423 50219 32610
163 32610 -30130 -50348 10064 53913 13467 -46077 -34531 30616 47473 -7252 -53801 -11886
175 -11886 42380 35589 -30485 -45393 6521 52431 11777 -40977 -34737 28407 45723 -7727
187 -7727 -48558 -13893 41536 32721 -25675 -46942 9126 45256 16238 -41800 -31355 24250
199 24250 45821 -8388 -44199 -15925 39849 31688 -24785 -42605 6308 44556 14949 -37066
211 -37066 -33675 25718 39908 -3793 -45175 -13993 35601 33363 -25113 -39013 2933 44018
223 44018 15106 -35941 -31265 22517 40041 -3422 -41492 -16743 36634 29149 -20020 -40957
235d0957M4768L6346k2877n3493Q103M6603K2015m3566l6852K3480N0000m182
247B9388m8398j9526L8926M0603k6652m5312J95M9818J7736l6288m1303K7064
259a3749M3211J181m8971j8540L6876L8305k3149m5072M83M5690K1674l9346l4801
272c6208J9193M7312k002m3130k3418M0160L2962j7486m7034J148M3324K2132
284C6953l7466l4232J8022M4200J943m5408j8603L3059L6983j9599m1903m341
296c0392M6766J7028l1211l7021J8992M1599L760m4548j8109L1154L5378j6227
308A7169m4092o46M0525K1482l3484l2511J3361M5330q36l7908k2606L2322L3233
321C1339j3410m3932o44L8520K0989k9802l5334J6188M0104L542l9972j8948K6820
$$ plain form
235 -40957 3811 40157 17280 -36213 -28110 18493 40508 -3058 -39910 -16430 33570 29388
247 29388 -19010 -38536 390 40993 14341 -30971 -30776 19042 36778 490 -40813 -13749
259 -13749 29462 30643 -18328 -36868 8 38313 15164 -29908 -29425 16265 37939 -1407 -36208
272 -36208 -17015 30297 28295 -14835 -38253 1907 34869 17383 -29651 -28503 14821 36953
284 36953 -513 -34745 -16723 27477 29420 -15988 -34591 -1532 35451 15852 -26051 -30392
296 -30392 16374 33402 2191 -34830 -15838 25761 29521 -15027 -33136 -1982 33396 17169
308 17169 -26923 -27569 12956 34438 954 -31557 -18196 27134 26298 -11610 -34216 -1894 31339
321 31339 17929 -26003 -26647 11873 32862 3060 -32274 -16086 24018 27560 -12412 -31360 -4540
334d540L7690j7920l7210o336M0896J7837k3890l7954J6019L8126N330l7646k3038
347c2636K9402L2786j1950m0477l075L4444K4288l0330l0503R777M0511L376l3627
360h014k4004K8778L1155j0374l8184n908L5655K1078k5318l3308J1727L5883
372A9166Q605l7404j9594K3654L3879j1740l5230q605L6482J9357k2713l2780
384b6923R547L6414P062l3861k1453K4207L0611p089l8304m460L0768K3012k4464
397E067k9657N857L7944N075l0273k2309K2431L0745p111l5691p075L1697J9763
410B6463j9108l3078R334L3008Q650l1727j9686J8259L3264q804l2913q567L0257
423E352K1370j9861l0519O097L3673P119k6551k4782K2595K7425l169l6039m795
$$ plain form
334 -4540 33150 15230 -21980 -28316 12580 30417 6527 -31427 -15408 22718 28048 -9598 -32636
347 -32636 -3234 29552 17602 -22875 -25950 8494 32782 2452 -28051 -18274 22237 25613 -8014
360 -8014 -32018 -3240 27915 17541 -20643 -26551 9104 30182 4864 -28444 -16717 19166
372 19166 27771 -9633 -29227 -5573 28306 16566 -18664 -27269 9213 28570 5857 -26923
384 -26923 -17376 19038 26100 -7761 -29214 -5007 25604 18515 -19789 -24249 6519 29531 5067
397 5067 -24590 -18733 19211 24286 -5987 -28296 -5865 24880 17769 -17922 -24997 6700 26463
410 26463 7355 -25723 -16389 16619 25269 -6458 -26144 -7885 25379 16575 -16338 -24905 5352
423 5352 26722 6861 -23658 -17561 16112 23231 -3320 -28102 -5507 21918 18749 -17290 -22085
436b2085K3527K7821k5379k3622l16L7870L037k2125k6931K2324K7873n963k7698
449a1667j5451L4629J4405j1837l3168N854L1860P259k4052k2266J5024L3793
461B4383j0326k5493j1294K3339K6289j9839k9073P363K6784R210k0515k6542
473b5714J7375L0123m955l2061m248K0891K0054j1516k8169k412L4304J1042k8571
486c857k0085J7606K6700o146k5610q410K1839J7486q570k8502K98K6005J4665
499B3419k2835k2900J0250L1170M9k9636j3152K3092K4889j3657k9776o39L0249
512A0523J1984k0553k5775J3142K7158K908k7601j2484J8235K2717j0869k4310
524a4925l31K3397J0479k0092j8289J2964K5864l837k6184j2687K4077K1321r840
$$ plain form
436 -22085 1442 29263 3884 -19738 -20054 17816 20853 -1272 -28203 -5879 21994 16031 -11667
449 -11667 -27118 7511 21916 10079 -23089 -17235 14625 21884 -2168 -24434 -9410 24383
461 24383 14057 -11436 -22730 609 26898 7059 -22014 -14651 12133 21343 828 -25714
473 -25714 -8339 21784 16829 -15232 -19480 1411 21465 9949 -18220 -20632 13672 24714 -3857
486 -3857 -23942 -6336 20364 14218 -11392 -19802 2037 19523 10953 -17549 -17251 8754 23419
499 23419 584 -22316 -12066 19104 19153 -10483 -23635 -543 24346 10689 -19087 -19726 10523
512 10523 22507 1954 -23821 -10679 16479 19387 -8214 -20698 -2463 20254 9385 -14925
524 -14925 -15256 8141 18620 -1472 -19761 -6797 19067 15230 -10954 -23641 436 21757 11917
537A1917k7710o91K2481J3119j9957j8425J2194K4996n36k7149j2637J9557K2219
550A9378j0227k2145j809K5773R198j9607k2703J0852K3821L647k4538r853J9373
563A160K0226j0041k6107k306K3359J1635j9646j7804Q005K6325J351k1755j2407
576a8005J9700J8315p910k5704j507K1865J1509j8206j9987P944K4033J924k3031
589i060j0642J6330K1259q934k2009k732K4112J0827j4816k0875R102K2371L244
602A8177k2469j1904J6075K0008p812k3623j768K0304J3503j6994j8923O420K3819
615A4813J169j9567j3903J6796J8640o597k2506k744K0549J3273j5370j9602P171
628g878K1095M814k1555j2232J4486K0170p941k0017n247K0983J1459j3931k0014
$$ plain form
537 11917 -15793 -16484 5997 19116 -841 -19266 -7072 17924 17388 -9761 -22398 -2841 19378
550 19378 9151 -12994 -14803 10970 20168 561 -22142 -11290 12531 16178 -8360 -18213 1160
563 1160 21386 11345 -14762 -17068 6291 17926 -1720 -19524 -11519 14806 16157 -5598 -18005
576 -18005 1695 20010 12100 -13604 -15111 6754 18263 57 -19930 -11986 12047 13971 -9060
589 -9060 -19702 -3372 17887 8953 -13056 -15788 8324 19151 4335 -16540 -7438 14933 18177
602 18177 -4292 -16196 -121 19887 12075 -11548 -13316 6988 20491 3497 -15426 -9006 14813
615 14813 15982 -3585 -17488 -692 17948 11351 -11155 -13899 6650 19923 4553 -15049 -7878
628 -7878 13217 18031 -3524 -15756 -1270 18900 10959 -9058 -14305 6678 18137 4206 -15808
641a5808O233K0707L972k0942j3231J4376J8184m688k2456k978J9119J3878j4647
654A719j6559M044K3232L450j8008j3423J4366J7500m052k1873n282J8661J1665
667A5440j2825j9565M808K0418N724j9145j0500J1740K0464n096j9405n358J8297
680D997J1157j1993j9936L760J9766M862j6782j2462J2994J8695k524k0849m007
693a2322J5454J3596j3642j8073K356K0612M883j5224j2868J2327J8221l603j9451
706g734p061J5940J2262j0449j8000M963J8528P742j6852j2668R014J7622m445
719H862j8395o805J7571J4084r532j6930K144J7883M455j6174j4213J1713J6856
732A1519K81j8477n239J4440J2474j1792j6660J008J9425P422j4451j2634Q640
$$ plain form
641 -15808 -9575 11132 15104 -5838 -19069 -4693 13491 8803 -13653 -16631 2488 16366 1719
654 1719 -14840 -10796 12436 15886 -2122 -15545 -1179 16321 12269 -9604 -14886 3775 15440
667 15440 2615 -16950 -12142 8276 14000 -5145 -15645 -3905 16559 11463 -7942 -13300 4997
680 4997 16154 4161 -15775 -12015 7751 12613 -4169 -16631 -3637 15058 12534 -8315 -12322
693 -12322 3132 16728 3086 -14987 -12631 7981 12864 -2360 -15228 -2901 15320 11717 -7734
706 -7734 -14795 1145 13407 2958 -15042 -10079 8449 16191 -661 -13329 -4315 13307 8862
719 8862 -9533 -16338 1233 15317 5785 -11145 -9001 8882 13337 -2837 -17050 -5337 11519
732 11519 11800 -6677 -11916 2524 14998 3206 -13454 -12446 6979 14401 -50 -12684 -4044
745d044J6200k838j8215o591J6855J2911o869j7985Q70J5808O488j5652j1120
758a4182Q861J8791j565j7726p558J2805J2681p517j5730J762J8307M688j4364
771g47j4670Q684J6657J455j6889n623J1822J2249r099j5852R25J8570O989j3343
785A128j4439O023J7060p47j4121o874J3659J1487p614j8113J752J5952R696j3386
799A463j3837N289J5866K32j4413o268J2748J2624r106j5791p08J7779P868j1086
813B660j5572O867J3754K047j4413o384J1576J2193q101j5355n94J6812R019j3296
827A213j3321M192J6443J485j3176q523J1712J0243n038j4957K94J4873Q137j3377
841B00j2853M985J6338K990j5011q131Q783J2973m462j3314j652J4145N494j0153
$$ plain form
745 -4044 12156 9318 -8897 -15488 1367 14278 7409 -10576 -9706 6102 12590 -3062 -14182
758 -14182 -5321 13470 11905 -5821 -13379 -574 12107 4590 -11140 -9378 8929 13617 -747
771 -747 -15417 -6733 9924 11379 -5510 -11133 689 12938 3839 -12013 -11088 7482 14471 1128
785 1128 -13311 -7288 9772 9025 -5096 -11970 1689 13176 5562 -12551 -10799 5153 14849 1463
799 1463 -12374 -7085 8781 9013 -5400 -11668 1080 13704 4598 -11193 -11901 5878 13746 2660
813 2660 -12912 -6045 7709 9756 -4657 -11041 535 12728 4627 -10728 -11322 5490 14509 1213
827 1213 -12108 -7916 8527 10012 -3164 -11687 25 10268 5230 -9727 -9433 5440 13577 200
841 200 -12653 -7668 8670 11660 -3351 -11482 -2699 10274 5812 -7502 -9154 4991 10485 332
855C32j2697P146J4651J834j6007q091J0167J4400l623j5749k578J2269R089r398
869A745j1288L884J3860j75j1991p728J1403J1880m945j6339r76J3941R555r995
883B831j3635L091J4016M297j2599p866P070J2412m531j1365k768J3100O312r303
897A062j2545N757J4098K220j4121r269R941J3505k411j5002l673J1260J0501
910A1323q530j0874J371J2339K896j0370p824Q667J0154l581j2954j524J2744
923C837P408r915j2252M222J4036L845j4020q389P190J4102k253j3031n522J2022
937A280Q476o093j1815J360J1737L586j0251p626P543J0103k368j2862j287J0910
951B693Q053r321j1123K636J4824K009j1912r353Q067J3314j829j3629n051J1287
$$ plain form
855 332 -12365 -5219 9432 11266 -4741 -12832 -2665 11735 8112 -7637 -10215 2054 11143 1745
869 1745 -9543 -5659 8201 8026 -3965 -11693 -290 11590 6645 -9694 -10670 3271 12826 2831
883 2831 -10804 -7713 6303 10600 -1999 -9865 -2795 9617 5086 -6279 -9047 4053 10365 1062
897 1062 -11483 -5726 8372 10592 -3529 -12798 -2857 10648 8237 -6765 -10438 822 11323
910 11323 2793 -8081 -6710 5629 8525 -1845 -9669 -1002 9152 5571 -7383 -8907 3837
923 3837 11245 1330 -10922 -6700 7336 11181 -2839 -11228 -4038 10064 7811 -5220 -10742 1280
937 1280 9756 3663 -8152 -6792 4945 8531 -1720 -9346 -1803 8300 5932 -6930 -8217 2693
951 2693 10746 1425 -9698 -7062 7762 9771 -2141 -11494 -3427 9887 8058 -5571 -10622 665
965F65R635n605j3306J240J1462N368j0071q046M858J1365j889j0250l532J0052
979A946O714o535j0313K631J1573K597j0637q262Q438J0732j862j3830k521J0604
993A275J0301q643j1518N20J3568M594j0378j0005N985J2264j54j1526n898R374
1007b41R043m118j1507J64R644N825r213p488M317J0232q53r605m090R146O944
1022H200n734r787J198J1650K522r508p752O940J0155r62j2597k971R502R047
1036I903o745j1645O63J3037M440r538r838M861J3011j60j1589o227R274R540
1050H987l474j2614k60R808O485p621r243L315J0606J071r475n492O835Q546l664
1065C810r274j055R707L792o517q367M848Q747L72r977l139P098Q024n347r074
$$ plain form
965 665 10300 4695 -8611 -7371 4091 9459 -612 -8658 -3800 7565 5676 -4574 -8106 1946
979 1946 8660 2125 -8188 -5557 6016 8613 -2024 -10286 -1848 8884 7022 -6808 -9329 1275
993 1275 11576 2933 -8585 -8065 5503 10097 -281 -10286 -4301 7963 7809 -3717 -9615 -241
1007 -241 8802 4684 -6823 -6659 2985 8810 -403 -7891 -3574 6658 5805 -3800 -7890 1256 8200
1022 8200 2466 -7321 -6123 5527 8049 -1459 -9211 -2271 7884 6922 -5675 -8646 856 9903
1036 9903 3158 -8487 -7824 5213 9653 115 -9723 -4862 8149 7989 -3600 -9827 -553 8987
1050 8987 5513 -7101 -7361 2447 8932 1311 -7932 -4617 5989 7060 -2415 -7907 -1072 7474 3810
1065 3810 -5464 -6519 3188 6980 463 -7904 -3056 5691 6063 -3914 -7053 45 8069 2722 -6352
1080f352K59J0101M071q685p753M827J0583n86j0146n172R606P754m282j1801
1094g576N56J0450O234r545q997M230J1259J448j1203o082P717J0305l796j0569
1108e569k843J0951O262o639j0133K635J0269L046r995o271O211R159j806j0050
1122d773k059Q241O091n756q081J293R737J821p703o059N746P305j326r104j369
1137e996P751N091n806p338K292Q749J132q084m465N452Q096l250q509j310Q821
1152B626M038n746q165L850Q458J000q779m512O691P893l622r689l82Q621N766
1167H048p471p709K704J0264O71q757o327P629Q139k104j0389k045R351O496o615
1182A885r350K510R843L032r920n873N552R896k217r827l286R102O470n198r345
$$ plain form
1080 -6352 -6093 4008 8079 -606 -8359 -3532 7051 6465 -3681 -8853 753 8507 4225 -7576
1094 -7576 -7020 3430 9664 119 -8878 -4648 6611 8059 -3144 -9226 -1509 8796 5000 -5569
1108 -5569 -8412 2539 8801 2162 -7971 -5336 4933 7979 -2016 -8287 -2076 7083 5277 -4773
1122 -4773 -6832 1409 7500 1744 -6337 -5044 4693 6514 -1189 -7248 -1502 5803 4477 -4627 -5996
1137 -5996 1755 6846 1040 -6298 -4006 4743 5875 -2209 -6674 -1222 6874 3624 -4885 -6195 2626
1152 2626 6664 918 -7247 -3397 5061 6061 -2718 -7230 -539 7354 3732 -5957 -6339 2282 8048
1167 8048 577 -7132 -4428 5836 6507 -2250 -8577 -948 7191 5087 -5302 -7347 2004 8500 1885
1182 1885 -7465 -4955 4888 7920 -2000 -7873 -2321 7575 5358 -4469 -7755 1347 7817 2619 -6726
1197f726J188R733L559q373p159N048Q876L5r959l550P183P864n002q538p8R578
1213C679L310o876p286M166Q367L21q663l804P043O314l533q531M08P591L965
1228F471o493n583K453Q383l36p127m018O303N661k919p494M4P393K873n545n725
1244e659L440O531K79p579k190N190O203m151o503r5P533K586n872n594M087O679
1260D885p91p102k531O069M893l291p226J221O738K589o607m421L633P125j215
1275C969o573l090O694M811m135o760P92P706K229o468n302M525O692o25p935
1290c470k183N977O029m724o555K50Q429J961o479n369L861P457o93p642l237
1305f388P109N448l518q129J094P434L384o967n947L732Q362o27q177l185O521
$$ plain form
1197 -6726 -5538 4195 7754 -619 -7778 -2730 6146 6181 -3778 -7328 -145 7719 2717 -5821 -5899 3679
1213 3679 6989 113 -7173 -3007 5360 5681 -2982 -6786 257 6571 3038 -5493 -5085 2506 6471
1228 6471 -22 -5605 -3152 5231 4895 -2232 -6250 53 5714 2795 -4699 -4655 2738 5611 66 -5659
1244 -5659 -2219 4312 4591 -2988 -5178 12 6215 2064 -4439 -4534 2999 5585 -287 -5881 -1794 4885
1260 4885 4094 -3008 -5539 530 5423 2132 -5094 -3873 2865 5454 -1153 -5574 -1941 5184 3969
1275 3969 -2604 -5694 1000 5811 1676 -5084 -4292 3414 5643 -825 -6127 -1602 5090 4465 -3470
1290 -3470 -5653 324 6353 1629 -4926 -4676 3753 5714 -765 -6134 -2273 5184 4491 -3151 -6388
1305 -6388 721 6169 2651 -5478 -4384 3050 6434 -533 -6480 -2748 5614 4987 -3190 -6375 146
1320A46O521l729p911j84Q193L034n940o721L717P776O45q556l044N610O928l216
1336C269q343j95P718M158o178o965L003Q495M18p135m856O076O454k318q533
1351d932n47P294M837n575p002K274Q048J150p292m498M740P070k145p139k284
1366f001P533M648m701p584K373P347K383p381m646M428P138j694p285j912O422
1381A068N136m559o683P40P664K328o244n541M811N993n18p654j862O012N175
1396E866l783o850N77O888K630n724m903L120P069p79o907k807O255M501k883
1411B270o638L92O514K585n539m552K735O773m03o683k259M696N414l325o035
1426d055k46O891K258m681n296L240N893q6o199k484M568N022k759o089L70N665
$$ plain form
1320 146 6667 2938 -4973 -5157 3036 6070 130 -6591 -2874 4902 5547 -3009 -6053 -443 6485 3269
1336 3269 -5074 -5269 2449 6607 429 -6536 -3533 4962 5380 -1755 -6611 -535 5919 3601 -4932
1351 -4932 -5479 1815 6652 1077 -5925 -3651 4397 5547 -1745 -6243 -1503 5567 3422 -3717 -6001
1366 -6001 1532 6180 1479 -6105 -3732 3615 5998 -1383 -6029 -1601 5537 3843 -3442 -5354 1068
1381 1068 6204 1645 -5038 -4298 3366 5694 -550 -6091 -1280 4713 4195 -3459 -5321 691 5866
1396 5866 2083 -4767 -4190 2698 5328 -396 -5299 -2179 4890 4111 -2796 -5603 652 5153 2270
1411 2270 -4368 -3976 2538 5123 -416 -4968 -2233 4540 4137 -2546 -4805 -109 5305 1980 -4055
1426 -4055 -4301 2590 4848 167 -5129 -1889 4004 3918 -2281 -4765 -197 4825 2066 -4023 -3653 2012
1442B012K764m956m249K053O421m71n313k950M833M162k200n527l16N727K718
1457D708m378n014K516N613J19n467k322L929M728k530n085o89N622K448l795
1472D03m752K330N498Mn504k086L771M439k152n189J86M616K536m203l603J579
1488b127N274K22m895k771M333L778j721n342j66N069K189l709l948J924M889
1503B999L93n195k025L396M517k318m797j90N019J963l752l844K234M453K09m532
1519a470k422L835L862j908m853j13M497K551m036l368J667M761k51m271k367
1534c886L905L595j881m629j15M590K038l363m008K144M237L59m531k009L480
1549g4L646k000m230p44N082J955l498l862J630M917J75m477k530L640L828j762
$$ plain form
1442 2012 4776 -180 -4429 -2376 4045 3574 -1739 -4689 144 4306 2106 -3421 -3737 1990 4708
1457 4708 330 -4684 -2168 3445 3564 -1903 -4225 -296 4432 1902 -3183 -3872 1750 4198 403
1472 403 -4349 -2019 3479 3483 -2021 -4107 -336 4103 1951 -3238 -3052 1564 4100 -103 -3706 -2127
1488 -2127 3147 3369 -1526 -4297 36 3814 2093 -3249 -3415 1654 3843 134 -3814 -1890 2999
1503 2999 3392 -1803 -3828 -432 4085 1767 -3030 -3220 1799 3762 10 -3834 -1600 2853 3062 -1470
1519 -1470 -3892 -57 3805 1897 -2956 -3069 1428 3979 -57 -3425 -1758 3003 2752 -1519 -3886
1534 -3886 19 3614 1733 -2896 -3011 1579 3617 254 -3754 -1610 2627 2986 -1545 -3554 -74
1549 -74 3572 1572 -2658 -3402 1680 3635 137 -3725 -2095 2822 2997 -1480 -4010 -370 3458 1696
1565A696m399J7L914K795l979l619J556M858q3l975k749L998L483j747m687j16
1581c037M711J842l502l546J936M142N36m576j886L275L687j862m297o59M625
1596A389J908k968l636J321M839M7m192k466L494L490j496m593J36L863K906l837
1612B05l799J667M835j33m129k205L277L661j611m020q73M349K253k933m017J628
1628a845M162R81m470k431K973M151j584m260o92M158K412l068l857J061M799
1643B490M62m132k478L049L866q82m937l93L795K661l078l384Q69M738N41m159
1659i72k566K898M232j817l973j122M360K645l062m043J458M148J216m433k231
1674c262K558L733r18m133j077L883K890l059l768Q10M738Q43l910k976K847L959
$$ plain form
1565 1696 -2703 -2686 1228 4023 44 -3575 -2019 2839 2756 -1219 -3968 30 3513 1766 -2921 -3037
1581 -3037 1674 3516 14 -3532 -1596 2546 3082 -1494 -3380 -105 3582 1720 -2577 -3236 1389
1596 1389 3297 329 -3307 -1986 2853 2900 -1292 -3758 -264 3226 1730 -2863 -2727 1136 4042 205
1612 205 -3594 -1927 2908 2775 -1354 -3559 -282 3379 1768 -2252 -3125 1224 3477 544 -3473 -1845
1628 -1845 2317 3298 -1172 -3603 -630 3521 1937 -2323 -3015 1143 3555 487 -3370 -2309 2490
1643 2490 2952 -1180 -3658 -609 3257 2375 -2562 -2955 840 3501 423 -2961 -2092 2646 3187 -972
1659 -972 -3538 -640 3592 1775 -2198 -3320 1040 3685 623 -3420 -1962 2186 3402 -1031 -3262
1674 -3262 -704 3029 2111 -2022 -3099 784 3674 615 -3153 -2343 2395 3238 -672 -3648 -801 3158
1690C158p97m690q53L916L249l277l931J030M407P51l709k879K390M654j314m158
1706b053j250M216K361k188m285J038M190J227l921k878K752M020r66m234j067
1721c038L517L221k813l748L77M531J187l709l186K673L830k80m446j396L687
1736D07K987k410m249J145L865J602m188k359J919M030m39m010j793L809L004
1751C320k207m159N97L996J581l539l057K237M060k98m376j195L316L311k333
1766A254l824j17M439J557l193l588K199L971P3m490j494L224L384j867m427K84
1782b615M051J918l249l360J787M150j48m056j610L139L156j759m007J19L883
1797A399K140l104l614J730L800L8l719j678K762L728j964m149p9M016J936k998
$$ plain form
1690 3158 2361 -2329 -3182 734 3983 706 -3225 -2195 2212 2963 -746 -3625 -1235 3419 2105 -2053
1706 -2053 -3303 913 3274 1086 -3199 -2161 2029 3256 -665 -3543 -791 3229 2263 -1971 -3038
1721 -3038 479 3700 887 -2861 -2484 2047 3234 -475 -3661 -988 2842 2562 -1884 -3280 407
1736 407 3394 984 -3265 -2120 1745 3347 -841 -3200 -1281 2749 2310 -1700 -3493 316 3320
1751 3320 1113 -3046 -2449 1547 3128 -411 -3468 -1231 2829 2531 -1845 -3040 276 3587 1254
1766 1254 -2570 -2687 1752 3309 116 -3472 -1273 2698 2771 -1719 -3213 11 3395 1528 -2899 -2615
1782 -2615 1436 3354 105 -3255 -1468 2682 2534 -1522 -3132 7 3163 1404 -2603 -2484 1399
1797 1399 3539 435 -3179 -1449 2351 2389 -1330 -3008 -246 3482 1518 -2631 -2710 1306 3242 244
1813B44l560J751L950K63l802k447L518L213j786l787j11L630K332l215l111J176
1829a742M135K16l719k280L052L388j389l982l77L881K080k788l811J635L891
1844B190M49l769k102K610L646j584l467p17L661K150k831l184J128L886N35l426
1860h25k220K427L598p09m482k67L170K607l091k912N58M397O91l820k157K461
1876e74L282q23m023p61L486K599k497l536J089L692R74l752k043K105L801r78
1892B041l973j088L654K463k249l421Q58L616R14k999k969K446L098k84l847j099
1908b839L150K899k624l359Q11L804R94l506k311K183L561o52l423j614L476K205
1924B755j545l903M33L834J566l620k359J958L353k85l694j326L052K648j884
$$ plain form
1813 244 -3316 -1565 2385 2648 -1154 -3601 -83 3130 1344 -2443 -2554 1076 3408 193 -2918 -1742
1829 -1742 2393 2609 -1110 -3390 -338 3050 1661 -2321 -2698 1183 3263 475 -3336 -1701 2190
1844 2190 2639 -1130 -3232 -622 3024 1440 -2027 -2744 917 3067 236 -2948 -1820 2066 2601 -825
1860 -825 -3045 -618 2980 2271 -2211 -2478 692 3299 208 -2704 -2146 2251 2942 -878 -3035 -574
1876 -574 2708 1885 -2138 -2899 587 3186 689 -2847 -1758 1934 2908 -844 -2887 -782 3019 2041
1892 2041 -1932 -3020 634 3097 848 -2573 -1715 1901 2815 -184 -3153 -707 2391 2107 -1740 -2839
1908 -2839 311 3210 586 -2773 -1962 1842 2836 -670 -2981 -798 2763 2111 -1312 -2926 550 2755
1924 2755 1210 -2693 -2260 1574 3140 -480 -2839 -881 2472 2187 -1507 -2833 219 2867 983
1939I83l188n7L534J620l190k733J942L308J8l872j229K894K993k059l131R4L388
1956A315J637l193k591J359M093l54l475j762L211K391j410l546K2L748J523k878
1972I0k862J266L782j56l257j830K968K971j907l185k60L769J313k499k730J366
1988a161L164M45l606j485K470K601j028l621k45L421J738k665k591J254L628
2003B319M6l386j985K901K938j422l733Q8L351J681k502l054J350L535J91l375
2019a057j412K544K636j418l078o86L703J424k317k799J177L033P22l418j711
2034b657K559K471q36l563l53K915K256k580k471K32L784O30l080j979K267K854
2050B449q16l456o23K929K248k222k892R33K896R04l274j616J506L593q54l012
$$ plain form
1939 983 -2205 -2262 1272 2892 -298 -3031 -1089 2219 2237 -1635 -2864 30 3023 964 -2167 -2073 1315
1956 1315 2952 -241 -2832 -1473 2620 2266 -1209 -2971 240 2631 1221 -2325 -2303 1445 2968 90
1972 90 -2772 -1506 2276 2120 -1137 -2967 1 2972 1065 -2120 -2380 1389 2702 203 -2527 -1161
1988 -1161 2003 2448 -1158 -2643 -173 2428 1400 -2221 -2466 955 2693 28 -2563 -1309 2319
2003 2319 2365 -1021 -3006 -105 2833 1411 -2322 -2234 1117 2798 296 -2758 -1408 2127 2318 -1057
2019 -1057 -2469 75 2711 1293 -1785 -2471 1232 2656 339 -2460 -1283 1750 2472 -946 -2657
2034 -2657 -98 2373 1537 -2026 -2379 536 2792 212 -2259 -2027 1757 2387 -693 -2672 -405 2449
2050 2449 1633 -1823 -2446 483 2731 509 -2383 -1450 1446 2350 -924 -2540 -1034 2559 1705 -1307
2066a307j328L320J779j506l559R76L355N72l115j957J836L238m14l543o19K884
2082F12K205k435k760M43L545N67k505k471J985L085o38l061p53K516K172j998
2098E09k850O04L194R09k780k130J697L178n25k819j177K488K107j682k715O6
2114a926L214J071k447k761K161K678j41l106j183K602K317j636k651j17L296
2129A371J110k522k412J639K864j34k864j605K674K303j307l203M92K705J404
2144B515k835k066J103L180L46l150j667K610K294j220l072RL093J076j908k934
2160b626J696K679M08l300j185K484K239j461k670k42L126J208k065k376Q97L111
2176A923j37k629j617K491K008o44l339L33K594J499k305k085P97K648M6k403
$$ plain form
2066 -1307 -2635 685 2464 958 -2601 -1625 1730 2302 -813 -2770 -934 2304 1890 -1653 -2272 612
2082 612 2817 382 -2378 -1935 1610 2177 -328 -2799 -814 2271 1633 -1428 -2181 335 2507 509
2098 509 -2341 -1737 1457 2366 -414 -2544 -847 2331 1806 -1013 -2190 298 2405 723 -1992 -1926
2114 -1926 1288 2359 -88 -2849 -688 1990 1849 -1257 -2440 162 2479 843 -1808 -1925 1371
2129 1371 2481 -41 -2453 -814 2050 1916 -948 -2553 121 2424 1117 -2086 -1594 1111 2515
2144 2515 -320 -2386 -1283 1897 2243 -907 -2574 36 2330 1110 -1962 -1953 1140 2216 308 -2626
2160 -2626 -930 1749 2157 -1143 -2328 156 2395 934 -1736 -1978 1148 2356 291 -2085 -1188 1923
2176 1923 1786 -843 -2460 31 2039 1395 -1944 -1611 983 2482 177 -1908 -1111 1537 1583 -820
2192h20j387K073K503j332k702k69K873J364j830k696P82L100N28l021j542K035
2208c41K706r88k978m79K769J543j909k365N56L432j59k367j851K158K312p96
2224A243k649o01K400J878j996k311Q02K690P10k836j493J582K639p67k574q20
2240b103K873J696j953k698Q52K687R45k777j876K062K379m65k995o94K639J762
2256B334j730k555L50L117N63k367k050J871K511n71k701p60K465J871j833k513
2272a998N48K706P69k672j432J531K633p44k576j092K547J771j130k642L63K443
2288A025J018k257j825J375K402j61k504j077J960K252j636k148J50K716N70j888
2304b8k294J517K383p7k692o17J790K153j200k816L34K564J338k520j652R98K534
$$ plain form
2192 -820 -2207 -134 2369 1037 -1665 -1934 939 2303 473 -2223 -1441 1659 2187 -834 -2376 -341
2208 -341 2365 1377 -1601 -2080 689 2232 323 -2042 -1486 1946 1787 -580 -2431 -273 2039 1243
2224 1243 -1406 -2007 393 2271 275 -2036 -1234 1456 2166 -670 -2163 -581 2058 1291 -1283 -2103
2240 -2103 770 2466 513 -2185 -1333 1354 2299 -478 -2354 -292 2087 1622 -1373 -2067 572 2334
2256 2334 604 -1951 -1601 1516 2079 -288 -2338 -467 2044 1473 -1228 -1988 477 2348 515 -1998
2272 -1998 -1450 1256 2025 -647 -2079 -548 2085 1341 -1235 -2327 220 1991 861 -1781 -1418 1025
2288 1025 2043 -214 -2039 -664 1738 1577 -927 -2004 -44 2208 572 -1576 -1426 1290 1860 -28
2304 -28 -2322 -805 1578 1501 -1191 -1808 -18 2135 935 -1881 -1547 1017 2355 -165 -1817 -819 1715
2321A715l27k368j169K046K370j226k793L17K825Q13k159k092R18K716j80k239
2337h33j127J675K482j583k123r8K664P46j865j999J298K335J93k922j023K287
2353A07J806r52k509j24K245J564k115k105J034K805k98k105j445K099J844j088
2369G63k496K30K223J433j986j990Q35K271O17k544j276J616K272j075k246l59
2385a712K100J626j656k078P70K268M89k409j289J836K169r64k651k57K503J334
2401B079j877k078O64K515J07j847j480J811J790m82k265n48K323J159j264k208
2417a601O98J981O97k178j446J623K213q71k202n24J899J544j138k573O10K641
2433A373P8j597j716J731J853o07k186n69J981J489j221k086J30K370O88k031
$$ plain form
2321 1715 1388 -980 -2149 -103 2267 1041 -1752 -1435 1390 2203 44 -2048 -1130 1586 1406 -833
2337 -833 -1960 -285 2197 614 -1509 -1607 1057 1803 -62 -2061 -763 1572 1765 -1157 -2180 107
2353 107 1913 961 -1548 -1672 573 2137 22 -2083 -1049 1756 1458 -647 -2092 7 1851 763
2369 763 -1733 -1503 720 2153 167 -1823 -988 1283 1900 -644 -1920 -304 1968 893 -1353 -1712
2385 -1712 388 2014 358 -1720 -950 1318 1807 -602 -1891 -55 2114 1150 -1501 -1758 745 2079
2401 2079 202 -1876 -1212 1303 1410 -437 -1917 -106 1684 1202 -1063 -1611 712 1871 607 -1601
2417 -1601 -903 1078 1775 -403 -1849 -226 1987 1116 -1086 -1610 289 1833 695 -1878 -1268 1373
2433 1373 1451 -146 -1862 -131 1722 1115 -1071 -1640 341 1830 609 -1477 -1347 1023 1711 -320
2449c20j598J549K199n19k504n03K316J128j132k333M87K259P98k314j444J508
2465d23K167m72k132r82K047J908j629k061K52K455N38j632j791J328K088l61
2481A300k397k33J352J787r41k323L09K068Q52k113j407J274J790k59j903j080
2497a924K000J555q69k314J59K271Q20j934j445J048K144l12k242n43J438J912
2513A764q96k230J13J915J089j656j894J158J711J68k132j032J678J931r74j816
2529a103o11K179J447j767j585Q75K198l78k009j304J918J849j005k045J04J711
2545D74J503j784j840O87K257K60k245r69J536J582m28k240m73K570P00j206k020
2562a636P46J985M22k217j215J708J810o04k205k07J847J324j683j632O19K089
$$ plain form
2449 -320 -1918 -369 1830 1311 -1193 -1696 620 1748 616 -1717 -1230 1029 1827 -487 -1931 -423
2465 -423 1744 1272 -860 -1842 205 2113 484 -1577 -1325 1130 1668 36 -1755 -427 1661 1300
2481 1300 -1097 -1330 22 1809 868 -1455 -1146 922 1774 -339 -1746 -472 1318 1059 -844 -1924
2497 -1924 76 1631 762 -1552 -1393 878 1698 -236 -1681 -633 1511 1199 -1043 -1586 -148 1764
2513 1764 868 -1362 -1249 666 1755 99 -1795 -637 1074 1242 -890 -1922 -244 1687 713 -1103
2529 -1103 -1714 465 1912 145 -1440 -565 1633 1255 -754 -2058 -140 1709 704 -1341 -1237 474
2545 474 1977 193 -1647 -960 1297 1557 -688 -1657 -121 1461 1033 -1207 -1680 890 1590 384 -1636
2562 -1636 -890 1095 1517 -700 -1915 -207 1603 999 -1206 -1413 434 1758 75 -1557 -938 1151
2578A151L16j840j385J228K213o88k167n6J598J296j530j701O36J967M12k020
2594e70j096J249J903o39j880l93K026J224j266k156P60J664J024k402j016J359
2610b09J758n25k211j08J655J351j578j660L18K374J72j380j499J048J970m02
2626A074k119m93J781J202q07k092N06J680P72k038r78R00K408o92j935q20J723
2643G2J504j148j699K24J903M60j450j518J039J893k62j859o04J628J422j266
2659C39j834K01J828R49j397j692R48K026k94j977o31J643J363j050j748L11J943
2676I28Q56j844j703P89K124L7k006o78J615J317r66j806K57J736R38j710j397
2693a513J142J424K71k303o72J733J548j117j675j56K204Q02j755j366M87K227
$$ plain form
2578 1151 1467 -373 -1758 -530 1683 995 -1172 -1228 370 1666 136 -1565 -929 1038 1450 -570
2594 -570 -1666 -417 1486 847 -1033 -1426 600 1824 558 -1598 -838 826 1850 -552 -1568 -209
2610 -209 1549 1024 -1187 -1295 360 1711 133 -1527 -1209 1165 1337 -43 -1542 -494 1476 1074
2626 1074 -1045 -1538 243 1445 638 -1454 -948 732 1504 -534 -1512 -612 1796 1104 -831 -1651 72
2643 72 1576 428 -1271 -1047 856 1316 -134 -1652 -613 1280 1018 -841 -1445 183 1605 339
2659 339 -1495 -1294 534 1483 86 -1606 -658 1368 1074 -903 -1534 109 1472 422 -1326 -1015 928
2676 928 1784 -60 -1763 -974 1150 1187 -819 -1497 118 1435 469 -1337 -1080 656 1594 -116 -1513
2693 -1513 -371 1053 1324 -979 -1651 82 1630 513 -1162 -1318 886 1688 -67 -1433 -946 1281
2709A281j23j697q24J379J510m69k104j98J695J314j889j427P45J717L87j693
2725c96j012J242J651p85j552m50J557J145j332j353M71K090j41j633q92J279
2741a11J620j026j776J3J685J133j325j444L01K319l6j658j346J671J396o29j867
2758a080l44J832J271j871j250O19J570M94j733j058J266J598m31k120k42J995
2774E16R19r63j937Q21J527N51j814j045J161J671m92j787l87J721J177j288j541
2791a190K71J895K36j704r77J191J628m88j737m83J344J479j077j655K97J960
2807I90N87j979j070R90J700m51j895j48J442J314j293j647M87J561R27j836j140
2824a461J050J675k48j934n03J682J029q71j467n0J963L04j226j195P90J798k35
$$ plain form
2709 1281 1158 -539 -1363 16 1526 1057 -1047 -1245 450 1764 -125 -1552 -807 910 1297 -396
2725 -396 -1408 -166 1485 700 -852 -1302 255 1400 68 -1285 -814 1276 1135 -498 -1390 -111
2741 -111 1509 483 -1293 -1280 405 1538 213 -1231 -930 1389 1353 -305 -1651 20 1416 787 -1080
2758 -1080 -1424 408 1679 -192 -1442 -823 747 1241 -492 -1550 -284 1314 883 -1237 -1479 516
2774 516 1435 472 -1465 -644 883 1434 -380 -1425 -264 1407 915 -872 -1259 462 1639 351 -1190
2791 -1190 -919 976 1212 -492 -1469 -278 1350 862 -875 -1358 -14 1465 388 -1267 -970 990
2807 990 1577 -402 -1472 -482 1218 767 -1128 -1276 166 1480 187 -1460 -973 588 1515 -321 -1461
2824 -1461 -411 1264 1016 -918 -1421 261 1290 419 -1048 -1098 865 1169 -57 -1252 -462 1336 1101
2841A101j867o39J348J514j115j539K96J781K86j264j180L64K024j95j504q27
2857a416J527J244p77j827K92J667N44r89j411M03J772J09j727p99J364J378p81
2874E73j691J5J680L73p47j459P58J565n1j457o45J152J401q72j780N49J241N39
2892A144j199j110N57J543rj307j097J519J219m24k096P6J606O82p67j614N03
2909g74J511M23j945m42R88J734r61j334j15J522P66j224j526P13J637N0j354
2926c31r52J251J104l74j661k2J231Q45q51j655Q26J819m29r32j194J108J144
2943I27m71j236k92J222J271j243j516P16J535M21j723q08J046J186k39j780J25
2960h59J110J027j022j493M43J806L89j600j117J195J218n11j600n4J299R29r81
$$ plain form
2841 1101 -766 -1405 -57 1457 342 -1197 -901 880 1166 -98 -1278 -914 1110 915 -589 -1416
2857 -1416 111 1355 578 -1249 -957 710 1254 265 -1146 -743 1029 1138 -589 -1388 -24 1354 573
2874 573 -1118 -1103 577 950 203 -1256 -498 1067 1016 -441 -1086 66 1467 595 -1185 -636 605 1144
2892 1144 -55 -1165 -608 935 926 -381 -1478 41 1260 836 -1260 -1184 422 1104 337 -1277 -774
2909 -774 737 1160 -785 -1227 -239 1495 534 -800 -915 607 1373 149 -1377 -664 973 1023 -331
2926 -331 -1283 -32 1072 698 -963 -985 246 1091 240 -1415 -589 1230 801 -131 -1325 -217 927
2943 927 456 -780 -1072 150 1421 178 -1338 -622 913 1334 -389 -1197 -151 1035 796 -984 -859
2960 -859 251 1278 256 -1237 -794 1012 1401 -199 -1316 -121 1097 586 -1014 -1068 231 1160 179
2977A79j231k9J968L01j390q59P21J303k30j650j97J431J127j234j395N03J321
2994F39P70j558j206J013J354l07j294n84J488J186j289j211L26J423L51j257
3010a56j078J011J250Q6j662o45J383R94p52j433j38J844L73j182j022O10J414
3027H97k48j376m12J549P33o84j442q2J722N07j035j481R92J181K21j906m06J274
3045DR99n37j353K10J317M98j035j176O74J526N7j574r06J240J122m57j875M04
3063h62J508O50j143j189O22J505k87j496n00J379Q33m82j407J20J266O90j155
3080E2j136O89J284Q8j555n15R36J545q59j497k01K036J16j314r98Q51J250M72
3098A244j751p17R84J468n07j686J37J295P41j189j090L90J573o9j190p70J039
$$ plain form
2977 179 -1052 -1081 887 1188 -202 -1061 -340 963 733 -917 -1114 317 1444 210 -1185 -682 639
2994 639 1409 -149 -1355 -342 1012 705 -589 -1173 315 1501 212 -999 -673 750 1101 -156
3010 -156 -1234 -223 1027 1113 -549 -1194 189 1183 431 -1002 -1140 704 1077 -105 -1127 -517 897
3027 897 649 -727 -1139 410 1143 459 -983 -1065 657 1164 129 -1352 -360 821 1042 -864 -1270 4
3045 4 1003 466 -887 -677 640 1138 103 -1073 -399 1127 1184 -390 -1296 -56 1066 609 -1266 -862
3063 -862 646 1296 153 -1036 -414 1091 804 -692 -1192 187 1020 538 -869 -749 517 1207 52
3080 52 -1084 -395 889 977 -578 -1093 -157 1388 529 -968 -1169 867 983 -331 -1329 -478 772 1244
3098 1244 -507 -1224 -240 1228 721 -965 -828 467 1208 19 -1071 -681 892 823 -367 -1137 -98
3115i8Q20k92j092l01J299O56p49j338N24J360J85j439n76R23J315m64j293m10
3133i70J418O62o92j387M15J302J41j352q79J163J238l50j469l74J651O90o29
3150E78j238p0J448K63j237j005J023J405l50j459l40J149O25p82j134M17J564
3167H57K54j526p19Q43J435p07j076l04J359O21o89j343N11R93M67j184j037J038
3185b07J154j53j225o43J185R56n00j497J3J630N59j407q81N92J159j54j245n12
3203a176J606P41q58j142K42R54N95r21j241Q41J567l66j229m58J011R38p82j328
3221a006L66J150L99j124o90O97J039M7j486k15P43J188o78j527K22J276L74r37
3239a62q51P59J180r9j343n08J390P61p82j403K77J643K5r77p90M71J234%j235
$$ plain form
3115 -98 722 430 -662 -963 336 992 243 -1095 -571 789 974 -465 -1041 -118 1197 733 -560 -970
3133 -970 448 1110 418 -969 -554 748 889 -463 -1342 -179 1059 709 -760 -1134 517 1207 578
3150 578 -660 -730 718 981 -256 -1261 -238 1167 817 -642 -982 167 792 10 -1124 -707 857
3167 857 1111 -415 -1134 -291 1144 437 -639 -943 416 1037 348 -995 -484 509 976 -208 -1245 -207
3185 -207 947 794 -431 -1074 111 1067 567 -930 -917 713 1272 -135 -1016 -424 735 581 -664 -1176
3203 -1176 430 1171 313 -829 -587 367 962 41 -1200 -359 1208 842 -387 -845 166 1104 322 -1006
3221 -1006 -640 510 909 -215 -905 -208 831 878 -608 -823 -80 1108 430 -1097 -875 401 775 -162
3239 -162 -1013 -254 926 827 -516 -1024 366 1127 345 -1058 -781 862 887 -90 -880 -409 825 825 -410
3258d10o88J320R03o18j477J90J194N05j167p18O95J088J49j624l07J224Q31o18
3276D72j334K02J074O72r64q56K21J672l74j209o50R99J087m62j382J26J152R14
3294A360j446j024O03J153J37j186q57J135J140l51j317NR37Q40j074j221R40
3311b26R01L14j536l44P70J160m55j309o0J200N23j007q34L63J254J28j000r87
3329a145R69J052l15j443L8J224O72j046j122N69J372J12j225o33J013Q28m20
3346E00j079m82J298O39o58j290M13J253J24j227n34R40R11l24q75m16J215N47
3364I55r05q60N9J381K06j107p87P46R21O1j460j45J122R07q14j236M19J044N25
3383A032r94j077R58J043m50q76m32Q57O46p76r42N40J314J73j368p14Q15J022
$$ plain form
3258 -410 -1098 222 1125 507 -970 -780 414 919 -248 -966 -271 817 966 -658 -965 259 1090 472
3276 472 -862 -660 414 1086 122 -734 -513 1159 785 -424 -1074 -75 1012 550 -832 -706 446 1360
3294 1360 -86 -1110 -507 646 783 -403 -1260 -125 1015 664 -653 -648 289 1129 55 -1166 -226
3311 -226 675 989 -547 -891 -121 1039 584 -725 -785 415 938 -69 -903 -540 714 842 -158 -1145
3329 -1145 -176 876 561 -882 -844 380 1052 6 -1116 -547 825 937 -288 -921 92 920 500
3346 500 -579 -1061 237 876 218 -1072 -659 594 718 -509 -1043 -103 808 484 -391 -807 408 955
3364 955 50 -810 -751 630 836 -271 -1058 -312 609 670 -790 -935 187 1094 280 -956 -537 507 1032
3383 1032 38 -1039 -81 962 512 -364 -796 61 707 -69 -1011 -471 843 1016 -352 -1066 -251 771
3401G71k80j042M2O74Q54q51j375O13J466O3j142q04R14J154n33j072m54R67J175
3420A140j069q99K39J299K07j247n13P07J238n92j032j39P35Q99p77q54j46J398
3438E94K96j111o76O30J181o7j304k22R25O72p22q26j51J393L33j209o56P00Q46
3457F26J0j047l26N74N78J15j282L26P89O00j121p82M03J409j73r66n64Q20Q79
3476H68p06r28K57J200L24q90j146N02J106L09j265n48J134O04o85o74l01J253
3494D14O37j216r62P37R50K6o98j056R83J237o23r11m58J139N50p70p22L63J242
3513H62l16p89m99P40O63k69j028lJ001M65r23o86L72J048J23j192l48O59J064
3532I44m86j014l20J112M74p24o31J3J206K02j200n40R57R09n45p85k59R55N56
$$ plain form
3401 771 491 -551 -509 165 1019 168 -1207 -594 872 935 -207 -1011 -97 1057 524 -548 -1002 -35 1140
3420 1140 71 -828 -589 710 917 -330 -843 -136 1102 510 -522 -661 74 973 196 -658 -804 594
3438 594 890 -221 -897 -267 914 847 -457 -679 246 918 196 -630 -781 612 945 -264 -920 -220 626
3457 626 636 -411 -737 -163 415 530 -752 -426 363 963 -158 -940 -537 872 699 -267 -831 -11 868
3476 868 162 -766 -509 691 1015 125 -1021 -519 587 896 -369 -917 217 821 136 -538 -839 414
3494 414 1051 -165 -1127 -390 560 586 -112 -1168 -185 1052 429 -482 -940 199 749 -21 -743 -380 862
3513 862 546 -243 -742 -2 661 392 -636 -639 362 827 -96 -782 -410 638 761 -431 -779 -120 944
3532 944 458 -556 -876 236 710 -14 -645 -632 574 776 -424 -964 -7 902 357 -428 -687 268 824
3551H24n79p82M1J188R4r19o40N59J029q8j389q3Q53P97o92r28K34J118n9n76
3571Bp26N10J131m76r28l33J052Q61q07j018L92R13L20r86m39K57J052j45j037
3590d05m98J082Q24o36j008K50R10K19r43p29Q27P82k50p54l86J005P44r12j089
3609i67N35J083L02j157p74M41J146k76r81p1Q55O73n95p84J17R16L29r81o74
3628h63N11J074o1j264O6N35O44k97j080j07J451L85j150n06K65J099p2q68p09
3647i47R45Q31l89j128M6R19O13q06r52N45Q32J91j234k00J036O62n35j096MJ017
3667C54M99r13o04L04J073j71r18j66P95N22k44r55l49R90M60o84p24M38J216
3686I23m07q92k28Q53N60j39j257J48O30Q89j164o54M22Q33J01o19q39O15J164
$$ plain form
3551 824 245 -537 -496 692 786 -133 -773 -214 815 727 -662 -745 108 905 213 -715 -481 637 578 2
3571 2 -724 -214 917 441 -487 -820 232 1093 286 -732 -340 573 893 -93 -532 -275 777 632 -405
3590 -405 -903 179 1003 367 -641 -391 519 738 -205 -934 -107 675 425 -329 -715 290 1034 122 -967
3609 -967 -432 651 953 -204 -978 -537 609 333 -648 -719 136 809 214 -570 -453 463 792 -189 -863
3628 -863 -352 722 661 -603 -537 -2 642 345 -735 -842 609 994 -156 -662 -397 702 630 -238 -947
3647 -947 -2 829 440 -688 -642 277 890 84 -868 -323 509 700 -534 -734 302 964 429 -667 -663 354
3667 354 853 -60 -664 -360 713 542 -376 -542 253 775 531 -424 -773 217 677 -7 -731 -293 923
3686 923 516 -376 -604 249 809 670 -587 -439 191 1080 -84 -738 -316 517 618 -1 -840 -225 939
3705I39o50o28l07J150J93o62q95P04O68P5r12n17O85Q20k32j164r6J213N99j062
3725g9o11M00P60K13r47n01M37J146l40j021j08J053L21n89j064N60R48Q9q51
3744a84n68M63J131m22p77k26O43Q03o53j052M33Q34K90r96p30J170N57k25r02
3763d11j63P14N97n12q60l6J202K95q38p34M45J066m35p55k20P27N81k98j257
3782h92L36R44M15r17m99K33J016k23n07o52P15P48n76r41L27J125j54q63o52
3801a017Q43Q28j88j067P5N99Q52q29n94k09J003L40p98l42K00R10k34q81n07
3820a016J012O97l22r64M20N12N32j274m57O15R38j50q06j67P43N82p23r67r5
3839h90J234O72j115q74N84J040Nq98m04O39R23n15r33L7Q88M32q96n52N09O92
$$ plain form
3705 939 289 -339 -646 504 697 35 -860 -156 512 587 -325 -842 -157 663 431 -733 -829 384 983 -79
3725 -79 -690 -290 470 683 -264 -765 -328 818 478 -543 -651 402 723 134 -930 -370 578 667 -184
3744 -184 -752 -289 842 420 -357 -583 60 863 210 -842 -409 425 715 -281 -1011 159 716 491 -411
3763 -411 -574 140 737 225 -635 -671 531 826 -12 -746 -301 765 330 -425 -645 82 663 365 -892
3782 -892 -556 388 803 -114 -613 -380 636 413 -94 -746 -31 717 141 -800 -473 652 498 -365 -1017
3801 -1017 -174 654 466 -601 -526 73 925 96 -498 -707 296 636 -162 -504 -304 606 372 -509 -1016
3820 -1016 -4 693 371 -593 -173 339 871 -403 -860 -245 693 543 -263 -430 313 895 172 -795 -890
3839 -890 344 1016 -99 -973 -389 651 656 -242 -646 -7 916 401 -532 -495 393 825 -71 -623 -114 578
3859E78p8q34l65Q99N52l34j132p9J082M36p99o45L84R88j5j082l41P47P58l03
3879D17p65m89J139O06q09p27K26J098k04r99r7M71R25m75j031K63R02K42p52
3898e9n24J61R35K48j139l32N15R13l50q89q2N44O82o46q72P36Q52k33q76l66
3918g82P35O59l58o40k65Q67M84m78r15L15Q19J24o90p25O53Q22j79r97J05N22
3938G6O20o97m66Q0P45L0n01o25P87P40m34p61l95J032L59o33m93N4Q85J80q56
3959b73m50M16J103k02q59l44O33Q89q64n97J98O50J07q20k58N04Q88m93n00l41
3979f13P05O94o00o14k01Q68K23o19k53K06O12k26l00q04J007M72m94n00P5P48
3999C86J49o20m72L81P91k75o52n1M92M17m44n43m5Q39K13p35o10N83O49J02q37
$$ plain form
3859 578 500 -334 -699 200 752 418 -714 -793 289 725 -74 -719 -335 653 638 -444 -785 -38 720 417
3879 417 -348 -837 302 908 99 -628 -402 696 492 -507 -604 -133 792 317 -714 -451 451 693 -59
3898 -59 -583 -422 513 761 -378 -710 -195 718 368 -521 -603 -59 623 -23 -895 -159 693 460 -416 -782
3918 -782 -47 612 254 -386 -651 216 700 222 -693 -378 441 565 -125 -850 -197 625 446 -551 -446 76
3938 76 696 -1 -467 -387 358 388 -113 -738 49 789 355 -406 -801 231 590 -43 -536 -482 403 583 -273
3959 -273 -723 -307 796 594 -265 -609 24 913 49 -548 -350 300 407 -413 -671 -167 721 228 -272 -613
3979 -613 92 786 186 -428 -629 239 462 -157 -410 -204 408 182 -118 -922 85 557 63 -437 -362 386
3999 386 535 -85 -557 -176 615 340 -312 -363 129 546 102 -441 -486 353 566 -169 -779 -196 453 555 -282
4020b82r2O12O36m78p09o8O17K63n01o16L63O74R5p32n24Q44K77k41o59K19N56
4041B54N49r30n03M68N24J62r89l27O98P88l82r01N8R72J72p33o09L32P87N6o85
4062b39j53N12P16q82l36j65Q02O04p30q14N14Q55j86q20q6L75N23Q3r16k41Q22
4083B38L04n13o28M13P13n2p69m90Q04N41m50n08j00P64L62m27r14L57R96k72
4103C69n25m64M38Q08k51o82j91Q11M12l65q61K2R58N5r88l43Q21O33l80n56j55
4124d34P24J85k84q37M91Q21l84n49l68O08L31j96m47j07P34J95l53p06L21O92
4144D37J91n41n09L89M08L6r37N2N47L41m27o11L28Q08j09l44m70K07O86Q4j105
4165e39J08M66O60o22q55O84M38K36p67n67Q51O15k51r39p7P95L72o15o71M42
$$ plain form
4020 -282 -374 238 874 396 -313 -381 236 499 -2 -618 -255 419 514 -218 -742 102 379 138 -521 -302 254
4041 254 803 -127 -630 -162 362 524 -465 -792 -94 694 312 -589 -531 441 613 -120 -729 -397 390 446 -239
4062 -239 -392 120 836 -46 -382 -547 255 859 129 -685 -171 684 498 -322 -408 -33 490 573 -343 -584 238
4083 238 542 29 -599 -186 527 475 -294 -784 20 561 111 -397 -497 267 629 202 -712 -355 641 369
4103 369 -156 -620 -182 626 375 -307 -498 313 725 360 -501 -479 479 534 -454 -797 24 657 277 -279 -434
4124 -434 290 475 191 -646 -155 666 282 -267 -635 -27 304 108 -339 -446 288 483 130 -576 -255 437
4144 437 628 87 -422 -33 375 411 -526 -474 73 414 -13 -624 -296 512 403 59 -411 -204 482 566 -539
4165 -539 -431 35 695 73 -782 -98 340 576 -191 -758 93 708 457 -482 -559 236 608 -7 -678 -236
4185b36M15J89m09l89L06N32k08n66j98O50M75n43p82L07R03o6m68o14L89J002
4205F89o5j136r8N71O57m49o82K21M49L24o02j76N5O30J7o52j08J79O48l62l07
4226a97j19R98j17n51o53M60O94k68p29K9O14O06m93q39L83N13J14o40o82P14
4246a63M02K79j091J46L78O95o31l32p3O03L65o37k60P7N72j88m38m88Q45J81
4266B42J80p53Q4M27N19r36j85J57N57K29p28k51J48J046m69n77j06N46N25o03
4286E2o30M66N02K43p90l64O43K82m6q14K10K95O11p24k94O6Q24K0n96n09N63
4307A0O85k65p83P0N65K27o09j77j33P17N3m71j26L56M53m35l52j75N03N90n81
4328A22m80O9L81K00l15m59N24N53k95q62j19P73N24o34m47n5P42L5l15n44N59
$$ plain form
4185 -236 179 368 -41 -430 -124 408 200 -366 -564 86 561 18 -764 -457 446 380 -88 -702 -313 689
4205 689 624 -512 -610 -39 618 169 -513 -292 157 481 -121 -297 -242 388 405 -247 -355 -176 472 110 -197
4226 -197 -316 682 565 14 -639 -179 515 247 -482 -453 161 767 274 -565 -182 331 445 -195 -877 -163
4246 -163 239 518 -573 -427 -49 646 15 -317 -390 213 578 -59 -319 -242 330 142 -296 -784 61 242
4266 242 422 -331 -247 180 699 -237 -422 -265 292 521 -207 -458 -310 736 267 -310 -416 130 655 52
4286 52 -578 -112 390 633 -157 -521 122 404 358 -456 -246 49 660 -64 -358 -292 532 552 -44 -553 10
4307 10 695 430 -353 -283 282 509 -100 -277 -410 307 360 -111 -237 119 572 137 -215 -390 113 703 122
4328 122 -358 -289 92 292 -23 -482 42 595 300 -562 -681 92 616 -18 -465 -520 222 257 -58 -602 -43
4349d3M87k31m95k93P71L60m15n30M0P16K1l96m18O03K20m27j46k77N37J83J58
4370D25q49K30O05j36m20l36N12N64l67o90L8O10L39k88o25j33R77j90k74m93
4390e01N18K91k10k16l58O69K35k89n39j54R44J63q23k27M60O59l27o33j96L86
4410a48L88j50l4k08M56J56m57n08L98O27k67o09k90Q98M2j80n24Q9M26L47n16
4431f4m92K64P52K34q35l58K84N20j10n74J32O22J12n01k79Q2M90K04p98j29L90
4452e4M25k11n76J72K56N23n33l14P7P41m26l72j84R3R86k86o06j54O26L99l75
4473B07p08N15K92J66p74j07M14N22m35m40O3M92J75l62m11L4O92K14p68l68M70
4494a17O64m60l28p0N58K45l96n98L87N93k28n76k33O17L55q8n80j29N63K88j93
$$ plain form
4349 -43 444 213 -282 -575 196 556 141 -389 -349 367 388 -8 -426 177 397 -30 -176 -453 84 267 425
4370 425 -424 -194 411 275 -145 -481 31 595 228 -462 -424 186 525 237 -388 -521 456 266 -8 -501
4390 -501 17 308 98 -118 -476 193 428 139 -400 -554 390 553 -270 -497 -37 622 295 -338 -534 -148
4410 -148 240 90 56 -152 304 460 3 -505 -107 520 253 -356 -646 252 294 114 -410 -321 105 452 -64
4431 -64 -556 -292 460 694 -141 -499 -215 305 195 -379 -247 375 487 -14 -293 -211 279 483 -315 -444 -54
4452 -54 371 160 -416 -244 12 535 2 -312 -235 506 80 -292 -476 -383 603 317 -289 -443 183 582 207
4473 207 -501 14 306 472 -302 -409 5 527 92 -348 -285 207 382 20 -391 -357 335 549 -219 -587 -117
4494 -117 547 87 -241 -311 247 492 96 -502 -115 478 250 -326 -559 58 413 325 -255 -384 179 467 274
4515B74o66j07J107j35q56j73N08L41k9o19J94M95L01n75m34K49L59O7p97J49
4535c47L49K63j51n33R7M33K81m15l58K38K86M33n76p22N17O80j58p45j16O52
4555A08L24n59r4k20Q33l45R5m85J89N76k13j02m36N37K98l54o32M16K30N9m50
4576b25j88L51P24m59o02l0M22M03l24m53K62K52M64o87m53K17M89k6k76j52L51
4597F0N12o68m27L52K99K52l18n01K36L30N38r10q3P56l3l01n10K02N64J40o63
4618a73J53k78M73O7m18j3Q1N38n80j02J65O34l05k41l69K68N03j70m97L7J53
4639g4P67m43l56J1J66K26k49j61p0N11j30n82MK18J37N4l99j68N92M92o65m20
4661e39L18Q47k33o40k6K94N40m46m63j3Q68j42k44l07rK66J72n08J13K01K42
$$ plain form
4515 274 -392 -499 608 473 -383 -556 -48 293 264 -355 -161 334 635 60 -374 -125 234 301 -496 -347
4535 -347 2 265 114 -419 -322 111 392 -23 -381 -143 143 576 0 -722 -205 475 317 -428 -544 108
4555 108 432 -127 -221 -441 392 47 142 -343 -154 422 209 107 -329 208 506 152 -480 -64 166 225 -225
4576 -225 -413 -62 662 203 -399 -429 -7 396 72 -381 -119 133 597 -90 -543 -326 163 137 -139 -291 60
4597 60 572 -96 -523 -171 128 380 62 -439 -203 127 665 -245 -328 428 395 94 -416 -214 350 490 -173
4618 -173 -20 -298 175 242 -176 -189 -108 430 -150 -252 -87 547 242 1 -368 -100 403 233 -264 -227 -74
4639 -74 693 250 -106 -95 71 297 48 -113 -183 328 198 -384 -380 -162 -25 29 -370 -538 54 546 -119 -539
4661 -539 -221 626 393 -247 -273 21 561 115 -348 -361 507 365 121 -186 -195 71 243 -265 -152 49 291
4682B91k55l14j07M14L74o90L2j08P25P2o78l57N71L71j8q44L77L40P8p9l62j02
4704b69P60J12p37k11L55J09J90o00R6K88K10j91n38K50P33j82m80l70M45M80
4724D50l95l88MM81J14j52l50R4M25k10l06j76K27O21k33l21l07O10J39j44n37
4745c54L05J04M13o55j08J43N86m1o98M6K17J24K55m08l7J59L54m47m63K43N85
4766C23pm36l85L92L33l86j59L13K01N6n19RR7M45R2m87k03M22L40j44m96N5K38
4789I4L46n81n22O24L19M6m42o1J98K82l65j66L1M91J46l02l99N9K33L22o05R6
4811a56L87K22m46O6l37N83j09j34k39l10Q50j32m56j74M49O09o05j91j72L05
4831A0K32k94n72M07M95k8k95l64O59J69j08n14j26M89L67m61k37J02J91K52n50
$$ plain form
4682 291 36 -278 -385 29 403 -287 -255 -363 362 434 -244 -601 -30 341 323 -521 -144 196 274 195 -167 -269
4704 -269 491 603 -134 -345 10 119 309 -291 -195 93 303 112 -426 -176 557 375 -105 -475 -30 450
4724 450 55 -333 -329 152 266 114 -236 -142 283 73 -233 -409 -182 439 206 -115 -422 188 327 183 -354
4745 -354 -49 55 468 -187 -295 -152 434 393 -305 -259 -42 82 337 -71 -108 51 405 -42 -505 -262 323
4766 323 316 -120 -505 -113 220 -166 -325 -12 189 245 -274 -265 -168 277 369 -118 -321 101 441 297 -199 -144 94
4789 94 440 -141 -663 -39 280 326 -116 -177 21 303 -62 -228 -197 294 440 138 -261 -202 31 353 -252 -156
4811 -156 231 453 7 73 -264 319 210 76 -163 -473 377 245 -211 -385 64 673 68 -123 -295 10
4831 10 242 -52 -624 -217 278 250 -45 -409 250 419 311 -203 -329 160 527 66 -171 -69 122 374 -176
4852a76j00M17K75l62k91m7M92O4j13o49K77L09K57n44l77P99M39p14k40p9M58
4873I5L49l30k67N0N60k12k29k31Q0O03m30o25LN14M91l10m50j1O04nj93k32J69
4896gN46k49k70l55O96k02l57p1L7Q8M73j39p74N34K29J51l95j54L93J93j78k08
4918a9m32Q08J78l06o76L86N85m11l51k24N18K42p8m65j43O91j1l70m70L11L35
4939I8K5j93k66M92J59l82k48M74J77o5j99k09j7N76l18m23O1K82M47k43n49K
4961c19L90K05l21k38K18L86j92l60J67J98J23j83m27J29K63K18q8n09J2M49J91
4982C12l18m19M65L14l38j28p2L10K10m55k11L28K10Q6o24J94J42L13j59k90k16
5003c46M41K57k66l06o8O99k19l13J97k17M49j30n00q6J015L8m92n09L47J84J38
$$ plain form
4852 -176 -276 141 416 54 -237 -284 208 272 159 -490 -213 96 353 -191 -568 231 670 -44 -284 -363 95
4873 95 444 114 -153 -103 457 245 16 -215 -135 468 38 -587 -584 -70 421 111 -339 -350 254 249 56 -176 -7
4896 -7 539 290 20 -335 361 159 -198 -269 -232 -144 329 190 -584 -50 179 330 -65 -219 174 367 189 -19
4918 -19 -451 357 535 229 -447 -61 524 113 -238 -462 56 298 220 -245 -388 303 292 -78 -548 -237 98
4939 98 123 -70 -336 156 315 -67 -315 159 336 271 72 -137 -154 422 104 -319 -258 24 471 228 -321 -319
4961 -319 71 276 -45 -283 -65 321 129 -231 -64 134 257 74 -353 -224 39 257 169 -340 -328 121 312
4982 312 -6 -425 40 354 16 -112 -184 126 336 -119 -330 -2 208 294 -330 -136 6 319 160 -130 -346
5003 -346 95 352 86 -220 -288 411 192 -121 76 -141 308 178 -322 -408 607 645 153 -356 -9 175 313
5024C13l39k76L13L14j83l30j82L71K99k23l75K66J81Rk31n4K16K32k98k55J06
5045a26J52M04k54l97Q3M10l87j90OK4P35m00m31q0O19Rj90j50R4J62N17m74m98
5068c62L13K07J90l38m90P86N6j00k93P4J60k0n3m58L10L20n4l27k13L31K97l8
5090B98o07J09L99M7m94j68L78Q3K46m24p8o8N36k32l70K27O41l29l76q3K10N15
5112D60k86m13j13K77K59J49o47j20R09k43l12r5J74K17J1l94K27j83L11j08n76
5133d96J52P40j91Lm07j05N98j72n47K36K90K00l7n37j12M89K43o00L32m2M6N3
5155A36k88k29L78K52k49o5J3K64O6k59j55J51L76j81l19k5L27J5l7l28l8K33
5177C8L70p56k4J62O46k07k32q8Q0M05m18k02K05P8J07nm44M0J86L33o70k91O27
$$ plain form
5024 313 -26 -302 11 325 142 -188 -370 1 300 77 -298 -32 149 158 -73 -127 89 321 23 -232 -126
5045 -126 26 430 176 -221 -138 272 -115 -305 -299 -275 460 60 -371 -451 168 177 -13 -163 -69 93 610 136 -362
5068 -362 -49 158 348 10 -480 306 362 262 -31 43 203 183 130 -328 -18 302 248 -79 -292 39 336 298
5090 298 -309 -200 199 246 -248 -416 -38 45 291 -133 -211 -279 257 25 -345 -118 523 194 -182 -265 -55 460
5112 460 174 -239 -352 -75 184 333 -314 -434 475 232 -80 -175 -1 216 227 -167 60 -123 188 80 -496
5133 -496 -344 396 205 208 -199 -304 294 122 -425 -189 101 301 264 -273 -385 104 347 -253 79 37 83 136
5155 136 -152 -381 -3 249 0 -65 -52 212 278 19 -136 15 391 210 -109 -134 193 208 171 -157 -195 38
5177 38 408 -348 -372 -210 436 229 -3 -91 -11 394 -24 -226 -21 57 164 159 -285 -245 -59 274 -396 -687 -60
5200f0J88k57m4J78K58k98L47o60J49L98l5l73j27K93J02j0k77j96O08Kk05l84
5222d03K90L53J66o25J8N2N05j96k70r9K71M08k84n19L3N56pl53k01K69N48m69
5244D3j92l9K33K42k44k79R3K86j5l10o8L34Q3p0l69J03K03K44lm65M6M19n3j91
5268C1k70L25N5J0k69j36K62K53k38j56P3K25J44l27k68L55P0jl71J32J59J70
5290B28l38j45J92J59L3k88k48M12L35j29m58M5J98L65k17l40j59N01Q9n13M6
5311b32J63N34l09l61j48L49K43j94k24M0K62%q3m12K24M10Rm38K8k0L26j2n14
5334c59L41R3L61o52Q1m0L39J59l37k71K19M03l83l00j53L25L78l16l4j96M83
5355A41k02rk52N09K83n88j69J15L63j20R2o06K76O23l64n3n39M79M53m83m83
$$ plain form
5200 -60 128 -129 -173 5 263 -35 312 -348 -199 199 164 -209 -336 -43 59 49 -228 -424 184 186 -19 -403
5222 -403 -113 240 406 -219 -201 -149 356 160 -110 -209 62 470 186 -333 -300 256 249 -104 -305 -36 512 43
5244 43 -149 -188 45 287 43 -236 -143 143 128 -182 -250 84 167 97 -272 -169 34 278 275 -190 -144 275 222 31
5268 31 -239 86 141 151 -118 -254 8 261 23 -133 -60 165 309 -18 -286 69 139 138 -233 -101 58 228
5290 228 -110 -255 -63 96 129 -159 -407 5 340 211 -247 -202 -4 361 144 -196 -355 146 235 -278 -232
5311 -232 -69 465 156 -205 -353 -4 239 45 -179 -139 123 123 40 -372 -148 262 271 -167 -139 -159 167 155 -359
5334 -359 -18 75 436 -216 -135 -175 164 323 -14 -285 -66 337 -46 -346 -499 -174 204 -112 -146 -342 141
5355 141 -61 -70 -322 187 470 -118 -287 -172 191 71 163 -443 -167 456 92 39 -500 -21 432 -51 -534
5376e34L72L17J39k73j01j44L56K46n88J30J34L86k02m99j42M82J86j84m56Q1
5396b94N06J38m61j59L96K90k83k02l87O19N6l31k03M44K4J37m71p9M31j94p1
5417i4n1k36L60J94R7p00L66K87J70k86l62L30L62k43l29k75P20q7j77l09N0M81
5439B68l08j56r2L05L53l57j51j51L84J60m46J02j96N35K4k32q0K22J86j70k63
5460f3k84L90L1n6j78m6K62K10j29j76j49N23l10l14j6K36J84l0n27M13K90j33
5482A28k49j34K19K67j61Kl77L53K49m07k37j16L96qN1k30R0M39l7k39k05l7M01
5505A58n7m80J12L43p4j00j17r0L14R1j80k98K75M84j68o19L29O0L44k31m34N05
5527A67J83k55m00l0L91Q5l30J16j80K68K20l80j73L13O1K52k63k85J14K58n4
$$ plain form
5376 -534 -162 155 294 21 -80 -224 132 378 -210 -80 54 440 238 -261 -403 79 265 81 -375 -294
5396 -294 212 350 -111 -270 126 416 133 -69 -456 163 219 -112 -315 129 153 290 -181 -260 171 -23 -94
5417 -94 -145 -381 -21 173 270 -430 -64 223 393 107 -255 75 437 194 -135 -410 310 223 46 -263 -213 268
5439 268 -40 -196 -288 17 370 13 -138 -289 95 255 -191 -89 -285 250 274 42 -38 184 370 200 -63
5460 -63 -347 43 74 18 -160 -206 56 266 137 -39 -188 335 25 -289 -305 -69 115 85 -442 -29 261 128
5482 128 -121 -255 -36 231 70 72 -305 48 297 -110 -347 -463 -67 -75 -24 -254 -164 275 238 -1 -206 -243 158
5505 158 101 -379 -267 76 2 -98 -215 -305 9 100 -80 -378 -103 381 213 -406 -77 -17 327 96 -338 167
5527 167 350 95 -305 -335 56 141 -189 -73 -253 15 235 -145 -318 -5 56 308 45 -240 -126 132 78
5548G8n00J42K66M84m25k07J02N2M67o42N5J72K17o3l31L4nK94k70k01J3M68N2
5571B52l72Q0J36J16m9l10M5M43j22k22j97L6J03K27n61L85OL18o4n57qM10K07
5594C02m32j83K65M51l29j99k5K13L85m71l64M90j6K35l79%q1N27k47l06JL6J59
5617C2J04l67lN01Q3o8m21j17J90J89j69j47J43K71j1k56j12M6K60Jk00J45m3
5640E1L08l18l72K71j37L05k73q8O4N37k77k19L17m6j7j2l46L53l3K13n59P4K39
5663C5J26k38q2j25N13N4l90k41K34M07j49j42j67K97J95m71no7J94L21n57R9
5685a59O1O6Q5k17J9O5K62k7m31P1M01j19j82l89N67J72J55o62R6K03O0p7l7l24
5709c41N85j63k95j80K37J77J55j9k49J56J43K10n21j94K99J94J2m82K48M14l81
$$ plain form
5548 78 -422 -280 -14 470 45 -162 -60 -8 459 -183 -128 44 261 198 -133 -99 -104 190 -80 -281 -268 200 252
5571 252 -120 -40 96 212 163 -147 -102 341 219 -3 -200 -164 -61 166 -395 -10 -4 314 250 -307 -315 95 302
5594 302 -130 -313 -48 403 74 -125 -150 63 448 -23 -387 103 87 322 -57 -57 -138 389 142 -164 -163 -127 32
5617 32 136 -231 -234 267 350 282 -139 -256 -66 123 -46 -193 -50 221 210 -46 -158 -112 148 149 -51 94 51
5640 51 359 41 -331 -60 -197 108 -165 -253 -189 348 71 -148 169 123 106 94 -252 101 68 281 -278 -204 35
5663 35 161 -77 -159 -284 229 283 -107 -348 -114 293 144 2 -165 132 327 -144 -149 -216 -22 299 -258 -159
5685 -159 -98 -32 53 -164 -145 -80 182 155 -276 -205 196 77 -105 -494 73 245 400 -262 -166 37 97 20 -17 -341
5709 -341 244 81 -214 -394 -157 20 175 156 -93 63 206 416 -105 -299 0 194 206 -276 -28 386 5
5730Em3n9Q6P9L13m56n9J46K75o5k72L1K71Kl61k94J80M32j31k99J76K19m29R
5754b44J02J49J28j19o5p7m5L50J99m93m0O0K58q9j3j53L73N0l65j98L61k0j60
5777e1j32J16L3L08j70n49N06J26L5m91j7J98M12l63j75L32L4J4J57l45p0K63
5799A71K54o35J49j02L84P3o43J77K70M7k69k1nM30l81P7m3j48M76k42j67P1n4
5822a31K30j29K1J9J09q8l12qJ79K46q0l9p8pN45o04j11K19R3J40k74k05M24M0
5846A99J05k88k08K88J13j9k58j15N16q9J6m35J69J67J38m23l56N92J9M7m64L12
5868B6J79j49p6j72k8M63L2m94j08L20J00j29k32K69J61j14k56j20J14O82k83
5889A85m14q2L47O8j22k92R5K95K11m57KJ6J74J56o14P0L00K69j00l82r4N15j7
$$ plain form
5730 5 -38 -97 -11 68 381 -75 -134 12 287 222 -50 -19 252 254 -107 -401 -221 211 80 -219 -43 176 -253 -244
5754 -244 -142 7 135 16 -49 -126 -171 179 378 -115 -155 -95 163 74 61 -92 281 331 -34 -232 129 109 -51
5777 -51 -183 -67 -34 274 104 -445 61 187 222 -269 -286 -88 324 -39 -214 118 152 166 323 -22 -92 171
5799 171 425 -210 -61 -163 221 294 -349 -172 98 145 -124 -145 -150 280 -101 -24 -67 -215 261 19 -148 -77 -131
5822 -131 99 -30 -9 10 119 31 -281 -289 -110 136 56 17 -61 -68 477 -127 -238 -19 74 214 -60 -265 159 199
5846 199 304 16 -192 96 209 190 -68 -183 333 244 260 -175 -6 161 299 -124 -480 112 131 178 -286 26
5868 26 205 56 -20 -192 -220 243 275 -219 -327 -7 93 -36 -268 1 162 48 -208 -328 -214 468 185
5889 185 -229 -311 36 104 -18 -310 -215 80 291 -166 -164 -148 26 182 -432 -362 -62 207 107 -275 -369 146 129
5912A29j62k88M26J50j96j08k40L14M0J81m42k4L58J28n22m5J07L43n0j05j67
5933a73K45q0J98l70N7K07K22j15l04m7L91Mj99m21N77m1j14p5k11L35L81k42
5955B25m47J79L56j05m31L09n2J03J29n29Q6K51J96j44l21J42J03L47o80Q8K39
5976D4J24k86j10J53K60O5k54k10O6J91Q1k63J32J33N1j71j97J11L03M5k24m01
5998c57J77M70j81l09j88N00P7j5m30m2n4O33l97j22L0N57j15k56j48K99N1l06
6020a26j66K54K36O3l15M7n3K83O7m32q5J34M27r0l42k64N19m9k53J3L0J92J30
6043B20k04j33qP9J25l91J95K05j45J64k10o7L71j11j59M6J80mq5n36J82M26n5
6066H5j64m04L61J58K58m35j59K72K93k03l38q3N88q9J08m44P8lM74n68j85N67
$$ plain form
5912 129 -33 -321 105 255 59 -49 -289 25 65 246 -196 -220 138 266 -256 -301 -194 149 99 -6 -173
5933 -173 72 -8 190 -180 -123 84 306 191 -113 -160 231 235 36 -385 192 151 37 -38 -249 86 467 225
5955 225 -222 -43 313 208 -223 86 34 137 266 -263 -177 74 270 126 -195 -53 50 397 -283 -195 44
5976 44 168 -118 -228 -75 185 250 -4 -214 -148 43 124 -139 -7 126 177 6 -191 -80 223 268 44 -357
5998 -357 -180 290 109 -200 -388 112 189 174 -256 -298 -352 281 -116 -238 -208 349 234 -22 -170 129 180 -126
6020 -126 -292 -38 198 261 -54 -7 -60 223 290 -142 -227 -93 334 244 -98 -362 157 108 -145 -132 -102 90 220
6043 220 16 -117 -125 -46 79 -312 -117 88 -57 107 -103 -170 201 90 -69 -23 157 153 68 -468 -286 140 85
6066 85 -79 -483 -122 36 294 -141 -300 -28 265 62 -276 -359 229 140 248 -196 -118 -121 353 -215 -400 167
6088A67qJ19p92J96L66M28m86k26j30L27L7J92m06J89O0J25l60KP7M19j06j26
6110F4p7K29J34n52K10L0L25l97r8m1K72J93k63j23o2K76K83l71o8k52N01j31
6132H2j86l34N16k7Q4l68P1L49J28m49n8L87L3rl92j50K73K55j52k19j24M53O2
6155B25l88k08P5M79N9m25l2J36J95p6Ro0J16P4l42L7m5K14o7k35J01P8L44j89
6179G5j68r6L47l1m23P9K44K39k15k2l3l35L86K19k37j72J33K61m06J48LL58j57
6202A97k14j12L66q0j3l83n9K89J30j60m49M54L49j21l76j86M74J62j06l40L21
6223A43K0r9L1m09K30L76j73l64o2N86m6l81r7K83J45l6j71k51L06K06L0j59m28
6246c20p0P79k74l86k1J49L98o05K36J33Q2r9k20j75L23L72j63P0l67L37N2l36
$$ plain form
6088 167 159 278 -514 -318 48 476 -10 -236 -366 -39 -2 190 -216 -27 33 158 -202 -200 -123 296 190 64
6110 64 -13 216 350 -202 8 38 363 -34 -132 -173 99 292 29 -94 -156 120 403 32 -36 -288 213 82
6132 82 -104 -438 78 51 135 -233 -162 187 315 -134 -192 195 228 219 -173 -323 -50 205 53 -166 -290 163 225
6155 225 -163 -371 -296 183 242 -183 -215 -79 116 40 49 -11 105 179 -163 -126 -171 43 -24 -259 -158 -80 264 75
6179 75 -93 -189 158 127 -296 -217 27 266 51 29 -4 -339 47 266 29 -143 -10 251 -155 -7 -4 354 197
6202 197 -17 -129 237 157 144 -239 -298 -9 121 -39 -488 -34 315 194 -182 -368 106 268 162 -178 143
6223 143 163 64 95 -314 -84 292 119 -245 -307 279 233 -148 -245 38 183 147 -24 -275 31 237 267 108 -320
6246 -320 -390 389 115 -271 -292 -143 255 -350 -114 19 101 2 -218 -393 -70 302 139 209 -158 179 231 -105
6268a05l6o1L69l0o5j40O7J09J1j66MJ15J68k52J33k5L32r7m19l50L43L85k68
6291B2m31K16K17M41m37j80R0L25r7l62L7o0O76m79j61m8L39K2j74k04K42J06
6313A00k8Jl16J66M51j52l08l9J65J13L1k53k8L37j03mk98J31N8L91m19k38K62
6336B0L24k84m60n1Q10l04j08J08k44J2j9J18m02M95m9O0j19m5J72J6q7o7o8K50
6360G8J17l26j61L00M16n15k59J65M85n7k74k29O2L15J34l17j67L19j35J48l47
6381b48J11L11o9j82k50J45L84n2j31k14K53P3m9l25j7L39K80l60rjk3L33l71
6404g2j05J30L14k37l13K62Q5J33j6n64K95M33j21p7l42M67r8l09k02J19M13J6
6426B11k03j10Q2J08k18R2k67L84M11n02k18j09M73k01J64j31j52N59l41l96M79
$$ plain form
6268 -105 -141 -202 167 137 72 -68 -1 108 119 -47 -43 72 240 -12 121 96 428 331 -88 -438 -95 290 22
6291 22 -409 -193 24 465 28 -152 -62 263 166 -196 -159 -219 457 -22 -183 -231 108 130 -44 -248 -6 100
6313 100 72 73 -243 -77 374 222 -86 -125 40 153 184 -69 -97 240 137 133 -165 -34 24 415 -4 -242 20
6336 20 344 60 -400 -451 359 55 -53 55 -189 -177 -196 -78 -480 15 -34 26 -93 -138 34 50 -37 -104 -172 78
6360 78 195 -131 -292 8 424 -91 -350 -185 300 243 -31 -260 -198 117 251 -66 -233 86 -49 99 -248
6381 -248 -137 174 105 -77 -327 -182 202 150 19 -195 58 131 82 -243 -260 79 359 -1 -10 -11 -34 299 -72
6404 -72 -177 -47 267 30 -283 -21 64 197 181 -383 -88 345 224 147 -195 272 174 -135 -337 -218 195 211
6426 211 8 -102 -20 88 -130 -38 -305 79 490 -12 -230 -339 134 -67 97 -34 -186 373 32 -364 115
6447A15j61M55p6n25j07K65L50m66j67K55O1J8j27R4J93L0m16K50j02Q1J98l32
6469a14R5k10K40O2o8j73L8K12Q8k08p5K65m8k8k74J90J66M0k35j60j0J07J61
6492F1j92J19JJ32ok47J63p4K90l71r7K08L5q6j55J48l24J17K93m42M04m6J80
6515A11j56l56K99R4K13l50P6J87o1L0j62rL52J03p5m03L0J61j36M4l18o5O30
6538B39q7k77J85J27J41l01l1k69M33mk21j58L15M4k22k4J7N2m7K0P4N8M3j49
6562d2k2k69L44j26J79k25J2K57r0j80j46J18M33k27l2k09K95L7J7k66j20O70
6584D08l12J27l70o6L14j75k1L1o0K12P7m26j6M82N3k69j18J35L94m49o4j98M35
6607A24p4R5o2k04K49j88R4J16l18K93R5m06K08R1j7j08j47K23R8Q3l10j41K48
$$ plain form
6447 115 -46 409 333 -192 -299 -34 316 -150 -317 -62 -1 17 -110 -16 177 207 -209 41 -61 20 218 -114
6469 -114 -19 -229 11 73 5 -168 -130 82 170 -38 -113 152 104 76 -198 -8 158 198 -37 -197 -207 -100 61
6492 61 -131 -12 -11 121 115 -132 31 -43 247 -124 -221 -13 22 -64 -219 -71 -395 -278 15 -427 -23 -69 111
6515 111 -45 -401 -102 -8 205 -145 -69 118 57 87 -75 -84 268 371 296 -107 -77 84 -52 -8 -326 -391 239
6538 239 152 -125 60 187 328 27 -4 -273 160 156 -65 -223 92 136 -86 -110 -93 -41 -88 -68 6 64 107 -42
6562 -42 -64 -333 11 -115 64 -161 -149 108 18 -162 -308 -190 243 16 -16 -225 70 107 124 -142 -262 408
6584 408 96 223 -147 -213 101 -74 -95 -64 -124 88 165 -261 -277 205 258 -11 -129 6 400 -49 -113 -311 124
6607 124 50 145 83 -121 128 -60 34 150 -168 125 220 -186 22 113 96 -12 -159 64 162 245 -65 -206 42
6630D2L01k97j31j04P1L17j69J26k77L10K02m42j10n3L09k48O4k26K98L80j17
6651B46l24k99M70Q2O7l17J99m5R0n34J14K37J7K59o28r0L91K05n74K94j49L28
6673C9k02J00r0L32J15j84k03J2J97R7j38k44r5O29m5l29LO6k5j12K8o4J34J55
6697A76Lj36J44j44r2o3PJ02J95j76k88J85K2m0q0J7lK82k4p2k50J14L13k69j65
6722b42J08K18jJ3k46j11N70j17l33K62l83K67O1j62j66K89o1J77n3l00M17q6
6744A21k06p3q9K59J48j96l3N1L03l57JJ17J4J11m95Q3L32J35k20l11M8K50J1
6767DM7p2N5J80L42o24r5K45R0l31K3J28j22J51J3J34m47L86L19l09k84L29R3
6790B55j60k95p6L22K19m77K6k9N70j39k97k24O1K53J43k55J63k17L26j33k06
$$ plain form
6630 42 343 46 -85 -189 -118 199 30 156 -121 189 391 -51 -161 -214 95 -153 -89 -315 -17 363 246
6651 246 -78 -377 93 175 242 -75 124 79 169 -365 -251 -14 3 262 -366 -456 -65 140 -434 -140 -289 39
6673 39 -163 -63 -153 179 294 110 -93 -81 116 213 75 -169 -264 365 320 -9 -6 60 35 -77 -49 -113 21 176
6697 176 179 43 187 43 -49 -112 -105 -3 192 16 -272 -87 -65 -105 -185 -168 -171 111 87 15 -235 -121 192 -77 -242
6722 -242 -134 84 83 96 -150 -261 309 192 -141 121 -262 5 66 -96 -262 27 -34 143 90 -210 207 121
6744 121 -85 -158 -247 12 160 -36 -69 -18 285 -72 -71 46 60 171 -324 -241 91 226 6 -305 -257 -7 4
6767 4 51 -21 34 214 556 -68 -163 82 172 -159 -136 -8 -130 21 34 168 -279 107 426 117 -167 162 255
6790 255 95 -200 -276 46 265 -212 -186 -215 355 216 -81 -305 -244 9 152 -103 60 -157 169 36 -170
6811a70J45J21J02j71j26Oj25M26j60m06N46M2J09o89L92M6J4j06j46L2L07j10
6833G9k93J62j02K59j20p8R4K8k1j44j7m8J50K13l04P7j56P6j7J9j32M16q2pK
6858E4R1q3K54l68j60L67J07m17J49j50J97L18k71l48M1L34K58n4n24M1P8K17
6880A31k53j55M50K18m57K30l32L60j70oPJ73J84j71n96J89L61r0j37j47n8K75
6902FN7j00j04J33J24q1M7m29M80l06K68j86J60q3J60j45q0QK36m2j93j73J6K38
6926A1q8k7J72L8Jq9j47K21p2l1k18J94P6J7j07L8j76J98J1K40k46k1J11K66l31
6951D1k84Q7K67j91oPL15J09m32j7K30m8J06m83J61M57l91J47k37J50j83L81k20
6974c4N4j31Q4J00l36K54K87K0q2j49j32K83k79M4k93K4L43k34J52%J63j76j12
$$ plain form
6811 -170 -25 96 198 27 -99 -93 -218 208 48 -358 188 230 339 -350 42 88 102 -4 -150 -118 189 79
6833 79 -214 -52 -154 105 -15 -93 1 29 8 -136 -153 -201 -51 162 -142 -65 -221 -145 -162 -143 -275 141 59 52 54
6858 54 145 62 316 -52 -212 155 262 -155 -6 -156 41 359 88 -260 -219 115 373 319 -205 -164 -86 131
6880 131 -122 -277 173 391 -66 164 -168 192 22 16 23 196 380 209 -387 -198 163 73 -64 -211 -269 6
6902 6 63 -37 -141 -8 116 35 82 -347 133 -173 95 -91 69 -14 146 1 -79 -71 165 123 -70 -243 -227 11
6926 11 -77 -104 68 106 107 18 -129 92 20 -11 -229 -35 41 58 -49 -11 -187 11 22 262 16 -5 106 372 41
6951 41 -243 -156 111 -80 -86 -79 236 345 -87 -104 126 78 184 -299 -138 319 -72 75 -162 -12 -195 186 -34
6974 -34 20 -111 -27 73 -263 -9 278 298 216 67 -65 218 -61 -17 -310 -286 57 -177 -25 -25 138 -38 -150
6997a50K50j86J03n8K07l58L32j83J46l08Q4K99K06p9k04k80J53Q1k24K84P8m8
7019A45k13q7J81P6J57j52k28n9K54L9J2j82K60J00k56j2p3J91k92K48k9l04K18
7042fM85n74J57J3q3J03k42N9k45M45r3J50l41K13k32J66J0M2R3J2m84j56N23
7065A5RK4k14j32J66L5n3K04j48Q1r7L48j31k41L36N9m02J4K93r6L0j06l1K82
7089B45k55o0RoJ79o4j65j84N13k77K58k22j5K10j25j8j74L42l18J51k95J29J04
7112c8K83n22K64K0M0p3R3j09J73R9j83J38l90L24J5l58K91k94N38p6l36K4K23
7135A46m68K63R6m7j01M30l04m56M82l4K1j78K73k57M5K72j80o9P2K54j82oj79
7158a07P3J08j89j11J98J71O7k64l7K57J02k65N8k79K99k5k55L15j52N3J8j76
$$ plain form
6997 -150 100 -86 17 -41 166 -192 140 -43 103 -205 -121 178 384 305 101 -179 -26 55 -169 115 193 145
7019 145 -68 -155 26 102 259 107 -121 -180 74 113 125 -57 203 303 47 35 -38 153 -139 109 80 -224 -6
7042 -6 479 -95 62 75 -8 95 -147 -88 -333 112 19 169 -172 41 -191 -25 -15 27 120 132 -352 -508 15
7065 15 24 48 -166 -298 -132 -97 -150 54 -94 -13 -110 238 107 -134 202 261 -141 -127 166 70 100 -6 -37 245
7089 245 -10 -70 -61 -67 112 48 -117 -301 212 -65 193 -29 -44 166 41 23 -151 191 -127 24 -271 -142 -38
7112 -38 245 -277 -13 7 47 -26 67 -42 131 230 47 185 -205 119 134 -224 67 -227 311 235 -101 -77 146
7135 146 -322 -59 37 -10 -111 319 15 -441 41 7 28 -150 123 -134 -89 183 3 -66 6 260 78 72 -107
7158 -107 -34 74 -115 -226 -28 143 210 -54 -91 166 268 3 61 -218 81 56 -199 116 -36 17 35 -141
7180a41j99Q02n68J27k93J56Q7K63l81O6j1J50J62m94K75m4K96k38R9k60K67m8
7202G3j24j1J71J48j62k28K0M0L69k20n0j14K39n0k5j44L15j76k20N9N4J63L05
7225D32l20l32N9M37k84l6p9M5O8O1k21j21M20%n4m55M00R8J33l22k0o7j62M54
7249A34n1j96K21M5k20L9pJ75k31J72j44L3K79m42J02J33k09M18l56l15L69P1
7271B0J1M1k18K29j60J68k29j19K38K91j85l21J40O2M0m3j90J79J95J46l65j70
7293b40M71p0o0n2J26o7k3l52O8M27l66K61l06J12K9P3k8l61L83q7K10l57J93
7316a6j23J09Q6l72K70J4k0K93j67J7O7j43j63j2J83K05m66K52J06j39J73N0j76
7339B8k61J81J09l04K34M9J33j72l64M75L2K2j86J49J28m21J46j28K22q4j8n1
$$ plain form
7180 -141 -340 462 -106 21 -272 -116 -29 234 -147 -81 -92 58 220 -274 1 -43 253 15 114 -146 121 73
7202 73 -51 -62 109 257 95 -133 -113 -73 296 76 26 -88 151 101 76 -68 247 71 -149 -90 -36 127 432
7225 432 112 -220 -161 276 -8 -44 -123 -78 -10 51 -170 -291 129 129 75 -380 20 118 251 -71 -91 -158 -320 134
7249 134 83 -113 108 153 -67 -28 -35 140 -91 81 -63 -30 249 -193 -91 42 -167 251 -105 -420 -51 20
7271 20 31 72 -146 83 -77 91 -138 -257 -19 272 87 -234 -94 -32 8 -35 -225 -46 149 295 -70 -240
7293 -240 231 161 101 49 175 108 85 -267 -199 228 -138 123 -183 -71 -42 31 3 -358 25 -62 148 -209 -16
7316 -16 -139 -30 56 -316 -46 -32 -52 241 74 91 158 15 -148 -160 23 228 -238 14 120 -19 154 204 28
7339 28 -233 -52 57 -247 -13 36 169 -3 -367 108 140 162 -24 125 253 -168 -22 -150 72 -12 -30 -81
7361h1J4k3m3K73o0k67K01Q2j08J3m14N45k69K63k36Q2J0R1j06N6j18N0L1m3j06
7386a63oQ5J5j11J40k0M1Qn2R0om9j65J28K56k02J55k31M9P2R4J13k39p1j0J5
7412f4K7k45M37q8O8j86J11j4n9j82L31k66P8K13r4k92R4L37j60o6k23L35k61
7435a69J81JK4j21O3J51j43N8j87K64j48jk70K33R9k30L62l89L98J2j8k14J93
7458A49j80o9m6N44k08r4k52L08q7k22R2J74m06L86K14j32j24r5J62j90R4j09
7480i1j4J92j80l9M6J30NP4k82J18K67l63J04n4j08M12k58K84l51M43k79kl10
7503b56J62L24K2k72K61k85N4N6ll12L20j81J82j45kK32j58J0l53J80J51j9LK44
7527B15n81M62k96K32r7J99j57J26l06K9L3N3j83K84k31K74j68r1K8M05j32j62
$$ plain form
7361 -81 -67 -90 -133 140 80 -187 14 96 -12 1 -413 132 -137 126 -110 -28 -18 73 -33 23 -95 -45 -14 -57 -163
7386 -163 -169 -84 -69 -180 -40 -60 -19 -11 -63 27 21 -28 -193 -65 191 -11 144 -87 -38 34 128 241 2 -69 -79 -64
7412 -64 -37 -282 155 67 135 -51 60 46 -13 -195 136 -130 -52 161 67 -225 -131 206 46 -20 -243 92 -169
7435 -169 12 13 37 -84 -21 130 -13 45 -142 122 -26 -27 -297 -64 35 -195 167 -222 176 188 170 -44 149
7458 149 -31 -100 -146 398 190 96 -156 152 65 -157 -65 109 -297 89 303 171 47 -48 114 -76 18 -91
7480 -91 -105 87 -93 -132 -86 44 49 123 -159 -41 226 -137 -33 -87 -195 217 -41 243 -108 335 56 54 -256
7503 -256 -94 230 252 -20 241 -44 10 66 63 -249 71 -110 72 -73 -75 157 -1 9 -344 -164 -13 -32 -29 215
7527 215 -366 96 -200 32 -65 134 -23 103 -203 -174 -141 -88 -271 13 -218 56 -112 -203 -175 230 98 -64
7549f4K39K21k84k3Q8l77L03p6k23J02L0O0n8Q7k35J31K46k11j39J31j24L80j35
7572F9j60J02J9n8r1M0k9n3L51k17j94N31o6m01j46L15P5K7p9k75L64k64L73k40
7596gQ5M7p2Pj34J66P7m2j20L5k36J24O7o2N2r0L56l23lm8J40J10j07M3L5q9J23
7623A34k72mJ44J52l44L97k05K15j27j88m6J94P4O2nl22J70J1K2Rk59K69L9k50
7647a30p6J00K73M0l26J07k1K63k96n3J65j77L21K9j07n9o0J29P3l15J24n2J9
7670b9J77J6o0p0K69l51j89L06m5L3k5r0p6J66k4m2J15j28k04O01n17K71n2N7
7694A09k26Q8J40l03J33J78j51O8J92k29j31K04L4k10j3K73J8j76n6k60K85J12
7716G9j5k22j03N73l62lJ33j25J66nj57k23O24j51m75L72j04r6J59j87O1O0J57
$$ plain form
7549 -64 175 396 112 89 177 -200 103 27 -196 -94 -64 -4 -62 25 -210 -79 167 -44 -183 -52 -176 204 69
7572 69 -91 11 30 -28 -119 -79 -108 -161 190 -27 -221 310 244 -157 -303 12 87 114 35 -240 124 -140 233 -7
7596 -7 78 125 53 60 -74 92 169 127 7 42 -194 -70 -3 -65 -13 -103 253 -70 -73 -121 19 129 22 65 100 11 134
7623 134 -138 -142 2 154 -190 207 2 217 90 -98 -144 50 124 186 181 -141 29 40 62 71 -188 81 120 -130
7647 -130 -206 -106 167 207 -119 -12 -33 230 -66 -119 46 -131 190 219 112 53 -7 122 195 -120 4 -48 -29
7670 -29 148 164 104 34 303 -48 -237 69 24 57 32 -58 -134 32 8 -34 81 -47 -251 350 -167 104 52 109
7694 109 -117 -29 111 -192 -59 119 -32 36 228 -1 -132 72 106 -104 -117 156 174 -2 -58 -318 -33 79
7716 79 64 -158 -261 312 -50 -53 80 -45 121 116 -41 -264 360 209 -266 106 2 -94 65 -122 -61 -1 156
7739A56j67P3j46K90j00J4l51M07j28J08j50j47Q0Q5K4j65j39K60K88m08L06j91
7761aR3K09k16O7r6Q6j73p6J02o2j4J82R6l27K44M0o8k26J08L7j17J77j65j63
7785b63J96L1j40K28k16K06O9j78J47K92j09j68k39J55o5o1o1J8J13K42r5P2j7
7808A57j0J22k66J5L9j10K74j81j54L21j92j63k3L7Q4K17j1k8j67q2K08l48K89
7831B8k80M51k15k3J00r9r4J60K2j49R2k3J75j30P7N7k37P6J02m18K03j78K54
7854d9k24K10K16j39j45J28j62K2m0K43j56O1L87m68J24J15j47j60R7j61K22l24
7876c50k7M13q1P2l30J36K1J25m9J6NJ58rj74M7J50j69J17k47L3J54j3N2k74J01
7901a23J54J18j01K2K6m3J21l14o3J39J55J36k98K27o4j22L1N4L2r6J95k78J15
$$ plain form
7739 156 -11 62 -84 206 106 120 -231 176 48 156 6 -141 -61 24 48 -117 -256 4 292 -116 190 -1
7761 -1 92 301 85 152 56 142 -31 -107 -5 -67 -81 101 197 -130 114 154 86 -140 -32 5 -112 65 -100 -263
7785 -263 -67 -36 -176 52 -164 42 111 -67 80 372 263 95 -144 11 -54 -115 -176 -158 -45 197 102 174 157
7808 157 147 269 3 18 57 -53 221 40 -114 207 15 -148 -171 -134 -50 167 156 128 -39 -121 87 -261 28
7831 28 -252 199 -16 -39 61 -38 -132 28 50 -99 -7 -30 145 15 92 149 -88 -12 90 -328 -125 -303 -49
7854 -49 -273 -63 153 14 -131 -3 -165 -143 -183 60 -96 -35 352 -116 8 123 -24 -184 -87 -248 -26 -350
7876 -350 -377 36 -45 27 -303 -167 -146 -21 -70 -54 -49 109 100 -74 -27 123 -46 71 -176 -143 11 -2 50 -224 -123
7901 -123 31 149 48 70 96 53 174 -140 -203 -64 91 227 -71 156 92 -30 1 55 87 -9 186 -92 23
7924B3l8Q7R1k66k89M41K05m21Q7P8j75nJ35k54K82O8N2k64O8J05K27j94l78L01
7948c4j4K37k96R7k8Q2O0r9L9O5k02j60OK89l1L4Q1j35mr1K06k33O9J95l2R2k85
7975i2j59K44K31j72k0L3k81J16m3M05m48K17R1Q2k67J63j96J83k38J81R3j47
7997b4K60l31O7j6O7N4J6j14M2J33P7j03l2N4j99N5j88K77Kl76O28l43l7J58j05
8022B2O7J21j84O8j87L5k9m1j98L22r5j0J95j44j07M4J69j03P5K62l74L35j52
8045I1j58o6J35j89J59M8O1j54J99J34k65N0J15j37M5j52j88M53j71N6j51n4K42
8068A03r8M9N7j69n1J36O0O4j15j0R5Rp1j16R6mM2k3j10QK03j84k65L06l3J58
8094A37J86m10Q2n3J15r4R9J20j71m3j84J80J78n6j86J38J30k46OL91j00j92L0
$$ plain form
7924 23 -15 72 163 -103 -392 49 254 -167 -80 -2 -177 -182 -47 -301 -19 49 101 -163 -95 10 237 43 -335 -34
7948 -34 -48 189 -107 -10 -38 44 104 5 44 109 -93 -253 -247 42 11 45 126 -9 -13 -104 102 -131 -62 133 101 193 -92
7975 -92 -251 -7 224 52 32 65 -216 -100 -143 262 -186 31 122 204 -63 100 -96 87 -151 30 123 -24
7997 -24 236 -95 -28 -44 23 77 93 -21 21 154 231 128 96 150 -49 6 -182 95 97 -279 349 6 -31 127 22
8022 22 89 210 26 94 -93 -58 -87 -128 -326 -4 -99 -109 86 -58 -165 -121 48 -55 20 282 -92 243 91
8045 91 -67 -133 2 -187 -28 20 81 -73 126 260 -5 45 160 23 68 -84 -272 181 10 66 -85 -139 103
8068 103 5 54 111 -58 -109 27 87 151 36 26 121 130 59 -57 39 35 77 54 -56 -48 155 -29 -294 12 -21 137
8094 137 323 -87 -5 -58 57 -37 62 182 11 -32 -216 -36 142 86 -100 38 168 -78 -72 319 219 27 57
8117E7m5O2m5j58N7r6K59j80J47k13q4q8K12K46j35m8P5j42J18L8q4M5m2J21j84
8142a07L5R4j36K75m7m9K02j91k06N3K69l03L37l38j18K83j03M1J27N4l28k4R0
8165i0N4R5j96J30k0j4J84l48L82k30J80l2R6Q1M8j90J57l13r4J61o7K87j84j57
8189h0j36K42
$$ plain form
8117 57 12 74 29 -129 -72 -168 91 -89 58 -155 -239 -327 -115 131 -4 -52 23 -119 -1 37 -47 -2 -44 77 -107
8142 -107 -72 22 -114 161 114 65 267 76 -130 -77 192 -111 226 -112 -230 53 -50 -9 118 172 -156 -180 -90
8165 -90 -36 59 -137 -7 -27 -41 143 -205 177 -53 127 95 191 272 320 130 287 -26 -120 41 -26 261 77 -80
8189 -80 -216 26
8191B6
$$ Imaginary data points
##PAGE= N=2
##DATA TABLE= (X++(I..I)), XYDATA
0@%%%%%%%%%%%%%%Pj4J4j4J4j9K6k8L5m2M9n7O4p7R1j05J20j38J58j79K03k30
36a22K60k91L26l66M07m53N05n60O20o87P61q40R26j022J126j240J369j511J666
55H74j841K039k263K520k820L173l597M121m788N668o894Q751j1938J8983o6247
70e4259K9748J09081l6926r5832l2225R8339P0151o8620r4834K4626R4650L6459
82H0358r7707o3698N7564R7057k4943q8154l9454R5472N8940n0601r2371J6928
94e0609Q9233L6453q7569o1285N0784Q3382n927r5095k7531P5777O5166n1251
106B1528p7031L70R4627K4208o8163o5196M6152P7824j656q8427k7723O7665O0994
119F5172l7957q3144P688P8873L3191o8898n5505L0955Q4735r406p3472l4461
$$ plain form
0 0 0 0 0 0 0 0 0 0 0 0 0 0 0 0 7 -7 7 -7 7 -12 14 -14 21 -21 28 -29 35 -42 49 -56 64 -74 84 -95 108 -122
36 -122 138 -153 173 -193 214 -239 266 -294 326 -361 400 -440 486 -536 590 -650 719 -792 874
55 874 -967 1072 -1191 1329 -1491 1682 -1915 2206 -2582 3086 -3808 4943 -6995 11988 -54259
70 -54259 -24511 84570 47644 -48188 -80413 17926 88077 19457 -75377 -50751 43899 80358
82 80358 -17349 -81047 -23483 73574 48631 -39523 -78977 16495 75435 24834 -67537 -50609
94 -50609 38624 75077 -12492 -73777 -22993 60389 54462 -40633 -68164 7613 72779 21528
106 21528 -55503 -55133 39494 63702 -4461 -69657 -23505 54319 52663 -35764 -63487 4178 65172
119 65172 27215 -55929 -48241 30632 63823 -5075 -60580 -29625 55110 45704 -27768 -62229
131f2229O5227N6531l0920q0350O021P3416L0280n7652o0476L4564P2016K53p3946
144b7265k7395N1382O3358l6682o6388l673P2428K8216n0833o0174L3339O6004
156D2317J316o5235l3231N3417N4050k7197o7600J288N9210L7209n5494m9606
168d9556K3528O6759m74n8000l5478N2315M9564k3961o1948m330O0479L0875m6452
181C321n2174K6154N6756Q811o2778k7108M2169N2314k5041n5170r655O1517K7271
194D6387m1923m9472K0946N7721N543n5725l0288M3766M4776j5616o0614k479
206c6978N1471L1707m3290m3621J4397N9789L203n1006k9936L9456M5910j6981
218B4121n5102o435N2508K6166l3571m9782J9442N1218R273n2580k5593L2038
$$ plain form
131 -62229 2998 59529 28609 -51741 -45720 27696 57976 324 -60152 -25588 46428 46681 -27265
144 -27265 -54660 -3278 60080 23398 -42990 -46663 25765 53981 3148 -57026 -23687 42317
156 42317 43633 -21602 -54833 -1416 52634 25437 -42163 -40875 18335 55544 50 -49556
168 -49556 -26028 40731 40257 -17743 -53221 -906 48658 24697 -37251 -41581 18898 49773 3321
181 3321 -48853 -22699 34057 42868 -19910 -47018 -4849 47465 22424 -32746 -42401 19116 46387
194 46387 4464 -45008 -24062 33659 39202 -16523 -46811 -3045 41731 26115 -34499 -36978
206 -36978 14493 46200 2910 -40711 -26314 33475 36678 -14328 -44264 -4808 41102 24121
218 24121 -30981 -37416 15092 41258 7687 -42095 -22653 28565 37838 -14742 -40335 -8297
230h297M9533j8841n0704p866M8925K8199l3859m5883J5298N1993N901m4252l2551
243d2404L6492M2640j2200n3431m393M1754L3539l5932m2206J2101N0441P785
255C4186m3302l0879L2359M3994j4094m6001j2103M6188K7685k9469m4775J4875
267b1336M3402J3748m5973k7231K8723M3272j2194m4767j2220M3323K9051l0140
279G658m0001Q270M7561R227l9778l0715L0818L7680n442m8579q794L8812K9786
292C6503k8420l8723O440M6165J0574l9961k7132K4606M1874r388m2791j2833
304c3086M1172K5053k1823m2968R771M1261J3057l9263k6043K2318M1071q009
316B2511m2416j0596L5272K9331k4605l8368N316M3929R212l2854l1157K5423
$$ plain form
230 -8297 41236 22395 -28309 -36175 12750 40949 7090 -38793 -23495 28498 34399 -9853 -42404
243 -42404 -5912 36728 24528 -28903 -33296 8458 41997 6065 -36141 -24040 26401 34186
255 34186 -9116 -39995 -7636 36358 22264 -23737 -35840 10348 38033 8564 -36211 -21336
267 -21336 22066 35814 -10159 -37390 -8667 34605 22411 -22356 -34576 8747 37798 7658
279 7658 -32343 -24073 23488 32715 -7063 -37778 -6960 30720 25278 -23301 -32095 6717 36503
292 36503 8083 -30640 -24200 21965 32539 -7422 -34554 -9948 31926 22538 -20253 -33086
304 -33086 8086 33139 11316 -31652 -21881 19380 32437 -6826 -32869 -10551 30520 22511
316 22511 -19905 -30501 4771 34102 9497 -28871 -23555 20374 29586 -3268 -34425 -9002
328i002L7150m906m2806r941L2786K9990k3218l8333O254L9198J3792l5086k7460
341c1582J9940M1128j0767l7757j1151L3836K7537k0245l8138N658L7046J5251
353C0756l4146k7682K0395L6271k754l8816j3480L1432K9504k1640l3865N71L9638
366A6184J2197k9794k9763K1291L3215R5l8806j3045L0199K7601j7993l5448J680
379b2387L6217J5493l1814k5213J4726L7190k706l4572j5861L1231K4894j4490
391A2708l6682K145L4875J4668k8133k7282J5761L4268J72l5942j2715K5254K8871
404B7968j6551l2791j325L6142J2136k4284k9023J6325L2316Q44l3812j4370K5489
417i36K7571j4243l3843J006L1036J6329k6524k5990J3043L3843r95l0269j5942
$$ plain form
328 -9002 28148 23242 -19564 -29505 3281 33271 10053 -28280 -22026 17172 30964 -4122 -31582
341 -31582 -11642 29486 18719 -19038 -30189 3647 31184 10939 -27199 -21541 15505 30756
353 30756 -3390 -31072 -10677 25594 22840 -15976 -29456 1976 31480 9840 -24025 -23454 16184
366 16184 28381 -1413 -31176 -9885 23330 23425 -15381 -28426 1773 29374 11381 -24067 -22387
379 -22387 13830 29323 -2491 -27704 -12978 24212 21506 -13066 -28927 2304 27198 12708
391 12708 -23974 -21829 13046 27714 -419 -27701 -11940 22328 22500 -13442 -26157 -903 27968
404 27968 11417 -21374 -22699 13443 25579 1295 -27728 -11403 20913 21757 -12055 -26425 -936
417 -936 26635 12392 -21451 -20445 10591 26920 396 -25594 -12551 21292 20297 -9972 -25914
430b5914K4677K7215j4073l1258j966L1469J4720k2365k8438J4363L0353K284
442B1067k9735j7972K6843K2205p770l5633K018K6711J7770k2572k9525J6918
454i675K4803P431l1118j8887K8600J8744n205l1718n733L3070J4011k4685j8742
467a9104L278L3231N099l2446j4544K4777J9163o239k7643q740L0653J8431k4058
480A858k6272J4164K5852K850k5544j3045J3663K7619n944l0648q104L1551J7094
493B5094k1997k7100J1694L0791r3k7242j3173K1194K0532q422k8040M46K2623
506F307J4483j9275k0388P670K6520J103k2965j3820J8544K2353j0072k5873k906
519a8319K6535J3902j8911k6491J0853K7728O887k7795j7401J5705K7284n866
$$ plain form
430 -25914 -1237 25978 11905 -19353 -21319 10150 24870 2505 -25933 -11570 18783 21067
442 21067 -8668 -26640 203 22408 14638 -20995 -18977 7734 25504 2932 -26593 -9675
454 -9675 15128 22559 -8559 -27446 1154 19898 14693 -17025 -22758 10312 24323 -362 -19104
467 -19104 -15826 17405 22504 -9942 -24486 291 19454 13215 -14428 -23168 7485 25916 1858
480 1858 -24414 -10250 15602 18452 -7092 -20137 -6474 21145 15201 -15447 -23551 8000 25094
493 25094 3097 -24003 -12309 18482 18389 -8853 -22026 -832 19700 11278 -16762 -16316 6307
506 6307 20790 1515 -18873 -11203 15317 16420 -6545 -20365 -1821 20532 10460 -15413 -18319
519 -18319 8216 22118 3207 -23284 -12431 15297 22184 -5611 -23012 -7307 19977 14111
531A4111k4910p899K2501J5029j5939k1551P568K6452M175k4297j9557J8080K3365
544A7128k237k5653n570K0824J6239j8595k1982M946K7129Q123k2469j6355J4572
557c900K1819o117k5447q067K4621J5962j2051k3317N772K3943P669k4280j5599
570a8992J2048K2202m131k4613o664K2375J7090j3087k1140L003K5710N794k0084
583d89j7553J3944K0768k865k6132n886J8938J6339j3137k2262K835K4128P033
596A5661j9708j5681J1877K3674l859k1251q719K0902J5572j0716k3327M233K1610
609A0268R037k0086j5990J1962K2100k747k2440p498J8316J7076j2557k0520J154
622a1925K3120O689j7014j8170J2473J9724p09k2827q219J7847J6799j1825k1041
$$ plain form
531 14111 -10799 -18698 3803 18832 2893 -18658 -11090 15362 19537 -4760 -24317 -6237 17128
544 17128 14891 -10762 -16332 4492 20731 2136 -19846 -14900 12229 20352 -2117 -18472 -3900
557 -3900 17919 11802 -13645 -21712 2909 18871 6820 -16497 -10725 13218 20887 -3393 -18992
570 -18992 -6944 15258 11127 -13486 -20150 2225 19315 6228 -14912 -11909 13801 19595 -489
583 -489 -18042 -4098 16670 13805 -12327 -18213 725 17064 3927 -18335 -15500 8628 15661
596 15661 -4047 -19728 -7851 15823 11964 -9287 -18006 2896 18468 7752 -15575 -11342 10268
609 10268 19305 -781 -16771 -4809 17291 14544 -7896 -15394 2922 19998 7441 -13079 -11925
622 -11925 11195 17884 870 -17300 -4827 14897 14188 -8639 -16858 989 17788 5963 -15078
635a5078J334K0772Q841j8900j5724R630K1609j858j9892r956J9241J5308q664
648F663k0966J768K1019R457j7022j5789R777K0295K41k2144q330J5439J6104
661A6512j0326j9624j860K1537P619j5162j6591J0539K0060J187k0092p842J5703
674A660J5837q550k1302j43J8548Q534j6342j5083O961K1858J2j7706q965J6216
688A535J5506p503k1488m66J7781Q719j5106j6153Q917J9716K154j8830p739J3023
702F6J6513r618j8798k802J8922R085j2246j5929R101J8338J687j8410j1238J2942
716b387J5126o649j8433l6J7637J2104j4611j5549M847J8310M13j6882j0310J5271
730a149J5984n382j8107l111J6567Q686j3271j5490P287J8506M501j8294r964
$$ plain form
635 -15078 -13744 7028 15869 -3031 -18755 -9125 12484 10626 -9266 -19222 19 15327 6663
648 6663 -14303 -12535 8484 17941 919 -14870 -5093 15202 15443 -6701 -15031 408 16512
661 16512 6186 -13438 -15298 6239 13858 -1304 -17895 -7356 12704 13891 -6201 -14043 1660
674 1660 17497 8947 -12355 -12498 6050 14584 -1758 -16841 -9880 11978 11990 -5716 -14681 1535
688 1535 17041 9538 -11950 -12416 5365 14084 -1022 -17175 -8258 11458 13612 -5218 -12957 66
702 66 16579 6961 -11837 -14639 4283 13368 1122 -14807 -5706 12632 14319 -4091 -15329 -2387
716 -2387 12739 6090 -12343 -12379 5258 17362 2751 -12798 -7951 10359 10772 -6110 -16420 -1149
730 -1149 14835 9453 -8654 -11765 4802 13488 217 -15273 -7986 10520 15021 -3273 -13237
743a3237J0910J4807o510j6656k560J9320R494j1875j6358L677J7062K830j5973
756e069q564J2968J4833m662k0088k613J5304J1343j1536j3378M186J7986Q14
769A1524j6520j0741J2219J6318k921j7413m246J4841Q866j0330j5316O877J6743
782I901L904j7344j0286Q533J7176l560j5463l480J4123R055j0718j5412N303
795h268J7920L422j4527j3103J0244J4290j815j5487k771J3231J0260j2085j4025
808a2714L932J7673M473j4820j2419Q966J5351k239j4351m707J3961Q713r589
821B230j4724M767J6026N432j5929j1398Q602J5404j292j4501n979J2909R564
834A1111q501j3186K949J6087K794j3845j1428J0250J4620oj7317n247J1598J1537
$$ plain form
743 -13237 -2327 12480 5970 -10686 -13246 6074 15568 3693 -12665 -8988 8074 10904 -5069
756 -5069 -13633 -665 14168 9506 -10582 -13195 2109 13452 1916 -11462 -7276 10710 11524
769 11524 -4996 -15737 -3518 12800 9879 -7534 -11780 3061 11927 1597 -13719 -6842 9901
782 9901 13805 -3539 -13825 -5292 11884 8324 -7139 -10619 3504 12559 1841 -13571 -8268
795 -8268 9652 13074 -1453 -14556 -4312 9978 8163 -7324 -10095 3136 13396 1311 -12714
808 -12714 -8782 8891 13364 -1456 -13875 -4909 10442 8203 -6148 -10855 3106 11819 2230
821 2230 -12494 -7727 8299 13731 -2198 -13596 -4994 10410 9118 -5383 -11362 1547 11111
834 11111 2610 -10576 -7627 8460 11254 -2591 -14019 -3769 10851 10845 -6472 -11719 -121 11416
848A1416p016j2987P45J4278L398j2529r051Q694J4496k663j6166n633J4361J1030
862A2373o113j6515R59J3722O485j0966r840N749J3453k406j3433l386J1984R982
876A2048q872j4005J508J6297N049j1627j2864P304J3534J271j4064n805R440
889g86J0839o094j2058J031J2582M325j1477r331P153J4136k503j3584o967J3810
903A076J0816o212j5198m1J3087P920j0614j0640M697J2398L49j1715m964R391
917C50R274o559j1215M12J3659M026j0772j0949Q157J2355O61j4587o099J0530
931g57J1595m773j4040j382J2209P797r317j0011K893J2730N78j0618o028R431
945C07Q059m455j1785R58J1571N036j0553r416O180J2887j58j3893n462R568J2645
$$ plain form
848 11416 4400 -8587 -7842 6436 9834 -2695 -11746 -3052 11444 8781 -7385 -13018 1343 12373
862 12373 6260 -10255 -9296 4426 10911 -55 -9895 -4146 9307 6901 -6532 -9918 2066 12048
876 12048 3176 -10829 -9321 6976 12025 398 -12466 -5162 8372 9643 -4421 -10226 -786
889 -786 10053 3959 -8099 -7068 5514 9839 -1638 -10969 -3816 10320 7817 -5767 -12734 1076
903 1076 11892 5680 -9518 -9559 3528 11448 834 -9806 -5109 7289 7638 -4077 -9041 350
917 350 9624 3065 -8150 -7738 5921 9947 -825 -11774 -3617 8738 9399 -5188 -11287 -757
931 -757 10838 6065 -7975 -9357 2852 10649 1332 -8679 -5786 6944 7522 -3096 -9124 307
945 307 8366 3911 -7874 -6916 4655 9691 -862 -10278 -4098 8789 8631 -5262 -10724 -1156 11489
960A1489o005j3263k239J3526O631p789j2126L816J2124K337j0569o979P154J0118
974H225l316j1216o39R972N591q863q142M150J2019j180j0284o145J0488Q947
988I607m956j3004j7J2469O781r845j1483M755J2780K306j2590p226P884J2253
1002I714l396j1980l856J1144P642o655j0691K450J0612K759r450o732O944Q732
1016G237k601j0300j053R198N999p879p983K662J1419K70j0170n802Q711Q928
1030H636l486j2400q84J1884N928q202j1178M074J2317K564j2154o773P094J1771
1044I191k826j1768l780J1037P569o094j1406J258J1839L471r326q066O018R735
1058F852n85j0915k408P512P587n838q511Q65J0031J979p340o861N759Q671k340
$$ plain form
960 11489 5484 -7779 -10018 3508 10139 2350 -9776 -5960 6164 8501 -2068 -9047 -1893 8225
974 8225 4909 -6307 -6946 3026 8617 -246 -8388 -4238 7781 6601 -3683 -9828 660 9607
988 9607 4651 -8353 -8370 4099 10880 1035 -10448 -5693 7087 9393 -3197 -10423 -2539 9714
1002 9714 6318 -5662 -9518 1626 9268 2613 -8078 -5628 4984 7743 -1707 -8439 -1495 7237
1016 7237 4636 -5664 -6717 2481 8480 601 -7382 -4720 6699 6969 -3201 -9003 -292 8636
1030 8636 5150 -7250 -8134 3750 9678 1476 -9702 -5628 6689 9253 -2901 -9674 -2580 9191
1044 9191 6365 -5403 -9183 1854 9423 3329 -8077 -6819 5020 8491 -835 -8901 -2883 6852
1058 6852 6267 -4648 -7056 456 8043 2205 -6306 -5441 4590 6569 -771 -7632 -1873 6798 4458
1073D458q953k256Q975N511o369q952L407R369K206j0212n387O489R860l534r956
1088e344k792J0272P005p250j0175K574J1329K798r632q498P470R922p31j2276
1102e328l066R088Q545o462r818M1J1658M160r003q451N005J0362k40r742n325
1117h576Q676P485l579j0456L48Q743N314q011p076L598Q987M15q866l892O721
1132a69P009l507q562l84Q738L304o148p409M715P491M12r058k513O570O421m727
1148B183q012J079Q484K648p439n891M778Q758j843q486l406Q326O197m972r297
1163f893J787Q887L619q637o318M909R352r64j0003l557Q526P350n013r397O7
1178f285J0425L628p611q311N194R114M81j0209m699P846Q349m187r455r53R358
$$ plain form
1073 4458 -4495 -6751 2224 7735 1366 -7586 -4179 5190 7396 -2816 -8203 -1714 8146 4612 -5344
1088 -5344 -8136 2136 9141 1891 -8284 -5710 5619 8417 -1215 -9713 -2243 7679 6948 -5328
1102 -5328 -8394 694 9239 2777 -7041 -7000 4658 8818 -185 -8636 -3631 6731 6491 -3251 -8576
1117 -8576 100 7585 4006 -6450 -6102 2641 7955 -56 -7132 -3534 5453 5868 -2998 -6890 -169
1132 -169 6840 3333 -5229 -5613 3125 6429 281 -7128 -2413 5078 5490 -3568 -6081 489 6910 2183
1148 2183 -5829 -4750 3734 6382 -1057 -6948 -2170 6588 4745 -3741 -7147 1179 7376 2404 -6893
1163 -6893 -5106 3781 7400 -1237 -7555 -2646 6706 5742 -4261 -7818 708 8058 3045 -6352 -6285
1178 -6285 4140 7768 157 -8154 -2960 6154 6635 -3574 -8273 -427 7922 3735 -5720 -6673 2685
1193B685N773q056p943K938J0370O95q550o406P641P937k557r904j257Q472N889
1208G727o284q322K284R270K266q686n423N392Q365k291q202k672Q114M802m602
1223A738p790J727Q216K085p404n000M751P555j533q326j488O824M866m811o745
1238e335J252Q168J065o253m927M721O715j564p823q96O345M181m912o427K414
1253c276O966J424o908l847M513O538k731o480j136O931L367m546o418K820O776
1268C993J190p315l740N097O437k342p399m95O711L993n810n869K449P544N63
1283E007o746m660O112N565k107p449p13O958M195n587o523K726P655J147q018
1298b438l374M952O929l031p106j453P746M041n136p255K533Q064J179p720m544
$$ plain form
1193 2685 8458 402 -7541 -4603 5767 6462 -2088 -8494 -853 7084 4527 -5377 -6634 1838 7727
1208 7727 1443 -6879 -4595 4675 6941 -1745 -7168 -1776 6589 4298 -3904 -6576 1538 6340 1738
1223 1738 -6052 -4325 3891 5976 -1428 -6428 -1677 5878 4345 -3981 -5469 1355 6221 1410 -5335
1238 -5335 -4083 4085 5150 -1103 -6030 -1309 5406 3842 -3981 -4877 1468 5649 737 -5690 -3276
1253 -3276 3690 5114 -1794 -5641 -1128 5410 2679 -3801 -4937 1994 5361 815 -5603 -2783 3993
1268 3993 5183 -2132 -5872 -775 5662 3320 -4079 -4574 2137 6130 320 -5549 -3100 4444 5007
1283 5007 -1739 -6399 -287 5278 3171 -4278 -4991 1967 6162 575 -5948 -3222 4433 5580 -2438
1298 -2438 -5812 -860 6069 3038 -4068 -5521 2225 6266 1130 -6125 -3592 4472 5651 -2069 -6613
1313f613N677O633j683q678r25O950N466n715o819J324Q966Q66o484n749N193
1328a591P456j595q204k113P171N363m523q068J708Q071K504p380m775L611Q627
1343F262j928q083k516P228N751m164q108R59P787K906o367o235M180P229J46
1358E047q501k551O134O623m374p524R0Q076L072o185o432L991P623l33p234l847
1374f325O453N748k844p880OO892M125o193n362K248P559O38p249l851N607O211
1390E783k935p152r16P167L649m971o130K737O483J598p288l484M531O293k105
1405C260o952j319O691L752m697n832J680P189R14o269l843M750N447j459o916
1420c604p80N594M092m408n682J734O115J393n864l528M016N413j422o043j705
$$ plain form
1313 -6613 -936 5697 4014 -4664 -5589 1361 6827 1112 -5707 -4383 4583 5449 -1035 -6784 -1591
1328 -1591 5865 4270 -3934 -6047 1124 6487 1964 -6104 -4396 3675 6179 -1201 -5976 -2365 6262
1343 6262 4334 -3749 -6265 963 6714 2550 -5558 -4599 3188 6094 -273 -6508 -2328 4901 5047
1358 5047 -3454 -6005 129 6752 2378 -5146 -5056 3020 6092 -93 -6525 -2534 5089 4756 -2478 -6325
1374 -6325 128 5876 3032 -4848 -4842 2050 6175 -18 -5380 -3132 4427 5065 -2184 -6035 -428 5783
1390 5783 2848 -4304 -5220 1947 5596 625 -5505 -2768 3715 5313 -1975 -5459 -928 5365 3260
1405 3260 -3692 -5011 1680 5432 735 -5097 -3417 3772 4686 -1583 -5426 -676 4771 3312 -3604
1420 -3604 -4384 1210 5302 894 -4788 -3054 3061 4454 -1410 -4938 -922 4491 3069 -2974 -4679
1435d679N821L705l693n804J694O058J356n492l845L649N369j127n863j343N141
1450I47L651l777m708R83N675J237m634l937L949M473r55n760r51M258M323l630
1466A144m945J052N400J297m994l146K929N246j401n230j624N312L147k849n050
1481c712R78M915J834n044l088K950M767r87n057j341M607L393l279m362M99N606
1497B679Q91m214l380L147M332o58n408q10M021L564l104m812J050M888J719m715
1513h10k829K524N056j650m728j310M828K706k742m782J278M643J247m351l039
1528c959K999L997q31m573j114M186L147k918m136Q21M751R64l770l224K865L917
1544C122n35n008q36L836L144k901m357J182M419J596m516k682K434M058o91m331
$$ plain form
1435 -4679 1142 4847 1154 -4650 -2956 3102 4458 -1034 -4879 -1230 4139 3012 -2851 -4194 947
1450 947 4598 821 -3887 -2904 2771 4008 -626 -4563 -614 3859 2904 -2856 -3807 451 4774 1144
1466 1144 -3801 -2749 2651 3948 -1046 -4192 -1263 3983 2582 -2648 -4272 1040 4187 1338 -3712
1481 -3712 -2734 2181 4015 -1029 -4117 -1167 3600 2613 -2444 -3785 822 4215 936 -3426 -2927 2679
1497 2679 3570 -644 -4024 -877 3455 2797 -2611 -3421 600 4164 1060 -3752 -2702 2186 3905 -810
1513 -810 -3639 -1115 3941 2291 -2437 -3747 1081 3787 1045 -3737 -2459 2184 3431 -920 -3959
1528 -3959 -960 3037 2206 -2367 -3481 705 3852 934 -3202 -2381 2370 3334 -436 -3660 -795 3122
1544 3122 2587 -2421 -3257 579 3723 822 -3535 -2353 2066 3662 -854 -3536 -1102 2956 2265 -2066
1560b066j454M377K917l092m037J114M510J098l892k891K583M066p47m778o16
1575b908L364L415l090l995M98M850R99l865l235L068M169q17m568j446M425K812
1591C676k609m284Q58M187J716m453k533K014M668o89m707j313L778L122k082
1606A349m367M35M444J629l897l298K307M312k10m860j085L354L567k706m030
1621c056M40M557J310l749l069K444M278o80m389j901M187L339k218m456M69M156
1637A662K044m325k975K122M507l31m612j823M090L061j773m452J04M668J493
1652C460l692l232K320L858p8m591j242L229L485k610l729J51M318J806l693l012
1668c252J993M097k25m171j849L726L086j774m698L98M309J924l644l424J856
$$ plain form
1560 -2066 -3520 857 3774 682 -3355 -2241 2269 3367 -525 -3416 -833 3233 2486 -2292 -2908
1575 -2908 456 3871 781 -3214 -2716 2134 3133 -732 -3967 -899 3270 2453 -2115 -3561 864 3676
1591 3676 1067 -3217 -2359 1828 3544 -909 -3442 -1428 3240 2551 -2156 -3469 309 3431 1349
1606 1349 -3018 -2583 1861 3490 -407 -3705 -1398 2914 2704 -2156 -3241 113 3680 974 -3056
1621 -3056 -2616 1941 3251 -498 -3567 -1123 3155 2475 -1914 -3815 372 3711 1493 -2963 -2494 1662
1637 1662 3706 -619 -3594 -1472 3035 2704 -1908 -3731 359 3420 1647 -2805 -2701 1967 3460
1652 3460 -232 -3464 -1144 2714 2636 -1955 -3197 32 3517 907 -2822 -2671 1647 3453 -240 -3252
1668 -3252 -1259 2838 2613 -1558 -3407 319 3405 1631 -3067 -2669 1640 3564 -80 -3504 -1648
1683a648M393k44m126j638L227L547k166l954q1M004J969l324l245J763M096K55
1699B828m424j499K915L730j745m179n61M332J816l236l312J797M048J51m058
1714a397k153L320L477j229m575J66L525K702l753l416J377M390K39l960k199
1729c486L271L676j766m065p80M425K133k978m008K230L417R30m127k289K727
1744f90L891j445m302m11M212K107k892l504J121M293K38l511k722L406L277r94
1760B074m513m58L937K555l080l838J302M318Q84m238k195K636L816j201m204
1775b205p68M232J919k330l931J055M174J051m248k310K539L875j072l957r61
1790b937L648K886k966l620N89M643N12l105l272K934L784p87m472r94L688K976
$$ plain form
1683 -1648 2745 2501 -1625 -3263 -36 3511 1345 -2609 -2690 1314 3283 -41 -3286 -1523 2573 2828
1699 2828 -1596 -3095 -180 3550 1805 -2374 -2935 1397 3213 -23 -3335 -1538 2510 2661 -1397
1714 -1397 -3550 -230 3247 2018 -2557 -2391 1134 3836 83 -3333 -1956 2434 2673 -1287 -3486
1729 -3486 -215 3461 1695 -2370 -3150 1275 3408 430 -3578 -1348 2069 2999 -1128 -3417 -690
1744 -690 3201 1756 -2546 -2957 1255 3362 470 -3034 -1913 2380 2618 -893 -3615 -209 3068 2074
1760 2074 -2439 -2897 1040 3595 515 -3323 -2021 2297 3181 -1057 -3252 -616 3200 1999 -2205
1775 -2205 -2973 1259 3178 848 -3083 -2028 2146 3197 -1051 -3361 -822 3053 1981 -1976 -2937
1790 -2937 711 3597 631 -2989 -2400 2243 2755 -350 -3622 -688 3096 2309 -2163 -3157 531 3507
1806C507k688l737R79L823J327l982k452K320L774q13m057j365L896K509k197
1821H44m049J243L590J717l924k858K581L760n59l955j344L184K941k050l843
1836b722K55M396J104l402k835K285L409k48m146j159L304L175k228m037N74L559
1852A284K036l694k703J791L673j36l697j736L578K619j948l739K10L862J372
1867B772l018l238K525L413J35m193j347K917L174j832l899k34M449J482l120
1882a4k953J348L872m1l863j344K792L013j262m057J23L277K189l207k783J274
$$ plain form
1806 3507 819 -2918 -1939 1884 3211 -771 -3223 -903 2871 2058 -1999 -3364 532 3041 844
1821 844 -3205 -1962 1628 3345 -579 -3437 -856 2904 2345 -1610 -2954 230 3171 1121 -2722
1836 -2722 -2467 1929 3033 -369 -3204 -919 2490 2242 -1904 -3063 241 3416 1188 -2849 -2275 1284
1852 1284 3320 -374 -3077 -1286 2387 2251 -1446 -3182 396 3015 1067 -2672 -2462 1400 2772
1867 2772 -246 -3484 -959 2454 2589 -1604 -2951 -34 3140 1308 -2591 -2825 1624 3106 -14
1882 -14 -2967 -1619 2253 2212 -1651 -2995 -203 2810 1548 -2509 -2386 891 3080 -127 -2910 -1636
$$ [...]
8191D22
##END NTUPLES=NMR FID
##END=
