##TITLE=1H_DE-41EA_D2O
 D2O
 8 sc, 
 12.7.2024
##JCAMPDX= 6.0         $$ Bruker NMR JCAMP-DX V2.0
##DATA TYPE= NMR FID
##DATA CLASS= NTUPLES
##ORIGIN= UXNMR, Bruker Analytische Messtechnik GmbH
##OWNER= root
$$ XWIN-NMR		Version 3.5
$$ Fri Jul 12 13:40:52 2024 Russian Standard Time (UT+4h)  she@DPX200
##.OBSERVE FREQUENCY= 200.1314
##.OBSERVE NUCLEUS= ^1H
##.DELAY= (6, 6)
##.ACQUISITION MODE= SIMULTANEOUS
##.ACQUISITION SCHEME= undefined
##.AVERAGES= 8
##.DIGITISER RES= 18
##SPECTROMETER/DATA SYSTEM= spect
##.PULSE SEQUENCE= zg30
##.SOLVENT NAME= CDCl3
##.SHIFT REFERENCE= (INTERNAL, CDCl3, 0, 15.7039)
##AUDIT TRAIL= $$ (NUMBER, WHEN, WHO, WHERE, WHAT)
$$ ##TITLE= Audit trail, XWIN-NMR		Version 3.5
$$ ##JCAMPDX= 5.01
$$ ##ORIGIN= Bruker BioSpin GmbH
$$ ##OWNER= she
$$ F:/spectra/data/she/nmr/H-F/1/audita.txt
$$ ##AUDIT TRAIL=  $$ (NUMBER, WHEN, WHO, WHERE, WHAT)
(   1,<2024-07-12 13:39:00.60 +0400>,<she>,<DPX200>,
      <created by zg, POWCHK disabled, PULCHK disabled
       configuration hash MD5:
       00 E9 B6 7A A2 85 ED C7 34 08 36 98 17 FE 4E 26
       data hash MD5: 16K
       18 99 90 26 A1 84 93 17 47 57 08 BB 58 16 B0 DE>)
$$ ##END=
$$ 
$$ hash MD5
$$ 99 D2 26 E6 78 64 62 92 3B D4 3A BF BE E5 1A 11
##$RELAX= 
##$RELAX= 
##$RELAX= 
##$RELAX= 
##$RELAX= 
##$RELAX= 
$$ Bruker specific parameters
$$ --------------------------
##$DU= <F:/spectra>
##$EXPNO= 1
##$NAME= <H-F>
##$PROCNO= 1
##$TYPE= <nmr>
##$USER= <she>
##$AMP= (0..31)
100 100 100 100 100 100 100 100 100 100 100 100 100 100 100 100 100 100 
100 100 100 100 100 100 100 100 100 100 100 100 100 100 
##$AQSEQ= 0
##$AQ_mod= 1
##$AUNM= <au_zg>
##$AUTOPOS= <>
##$BF1= 200.13
##$BF2= 200.13
##$BF3= 200.13
##$BF4= 200.13
##$BF5= 200.13
##$BF6= 200.13
##$BF7= 200.13
##$BF8= 200.13
##$BYTORDA= 1
##$CFDGTYP= 0
##$CFRGTYP= 5
##$CHEMSTR= <none>
##$CNST= (0..31)
1 1 145 1 1 1 1 1 1 1 1 1 1 1 1 1 1 1 1 1 1 1 1 1 1 1 1 1 1 1 1 1 
##$CPDPRG= <>
##$CPDPRG1= <>
##$CPDPRG2= <>
##$CPDPRG3= <>
##$CPDPRG4= <mlev>
##$CPDPRG5= <mlev>
##$CPDPRG6= <mlev>
##$CPDPRG7= <mlev>
##$CPDPRG8= <mlev>
##$CPDPRGB= <>
##$CPDPRGT= <>
##$D= (0..31)
0 1.2 0 0 0 0 0 0 0 0.06 0 0.03 0 0 0 0 0.0002 0 0 0 0 0 0 0 0 0 0 0 0 
0 0 0 
##$DATE= 1720777140
##$DBL= (0..7)
120 120 120 120 120 120 120 120 
##$DBP= (0..7)
150 150 150 150 150 150 150 150 
##$DBP07= 0
##$DBPNAM0= <>
##$DBPNAM1= <>
##$DBPNAM2= <>
##$DBPNAM3= <>
##$DBPNAM4= <>
##$DBPNAM5= <>
##$DBPNAM6= <>
##$DBPNAM7= <>
##$DBPOAL= (0..7)
0.5 0.5 0.5 0.5 0.5 0.5 0.5 0.5 
##$DBPOFFS= (0..7)
0 0 0 0 0 0 0 0 
##$DE= 6
##$DECBNUC= <off>
##$DECIM= 24
##$DECNUC= <off>
##$DECSTAT= 4
##$DIGMOD= 1
##$DIGTYP= 9
##$DL= (0..7)
0 120 120 120 120 120 120 120 
##$DP= (0..7)
150 150 150 150 150 150 150 150 
##$DP07= 0
##$DPNAME0= <>
##$DPNAME1= <>
##$DPNAME2= <>
##$DPNAME3= <>
##$DPNAME4= <>
##$DPNAME5= <>
##$DPNAME6= <>
##$DPNAME7= <>
##$DPOAL= (0..7)
0.5 0.5 0.5 0.5 0.5 0.5 0.5 0.5 
##$DPOFFS= (0..7)
0 0 0 0 0 0 0 0 
##$DQDMODE= 0
##$DR= 18
##$DS= 0
##$DSLIST= <SSSSSSSSSSSSSSS>
$$ [...]
##$SUBNAM2= <"">
##$SUBNAM3= <"">
##$SUBNAM4= <"">
##$SUBNAM5= <"">
##$SUBNAM6= <"">
##$SUBNAM7= <"">
##$SUBNAM8= <"">
##$SUBNAM9= <"">
##$SW= 24.0689651099613
##$SWIBOX= (0..15)
0 0 2 0 0 0 0 0 0 0 0 0 0 0 0 0 
##$SW_h= 4816.95568400771
##$TD= 16384
##$TD0= 1
##$TE= 0
##$TE2= 300
##$TE3= 300
##$TEG= 300
##$TL= (0..7)
0 120 120 120 120 120 120 120 
##$TP= (0..7)
150 150 150 150 150 150 150 150 
##$TP07= 0
##$TPNAME0= <>
##$TPNAME1= <>
##$TPNAME2= <>
##$TPNAME3= <>
##$TPNAME4= <>
##$TPNAME5= <>
##$TPNAME6= <>
##$TPNAME7= <>
##$TPOAL= (0..7)
0.5 0.5 0.5 0.5 0.5 0.5 0.5 0.5 
##$TPOFFS= (0..7)
0 0 0 0 0 0 0 0 
##$TUNHIN= 0
##$TUNHOUT= 0
##$TUNXOUT= 0
##$USERA1= <user>
##$USERA2= <user>
##$USERA3= <user>
##$USERA4= <user>
##$USERA5= <user>
##$V9= 5
##$VALIST= <valist>
##$VCLIST= <CCCCCCCCCCCCCCC>
##$VD= 0
##$VDLIST= <DDDDDDDDDDDDDDD>
##$VPLIST= <PPPPPPPPPPPPPPP>
##$VTLIST= <TTTTTTTTTTTTTTT>
##$WBST= 1024
##$WBSW= 4
##$XGAIN= (0..3)
0 0 0 0 
##$XL= 0
##$YL= 0
##$YMAX_a= 114176
##$YMIN_a= -107764
##$ZGOPTNS= <>
##$ZL1= 120
##$ZL2= 120
##$ZL3= 120
##$ZL4= 120
##$ABSF1= 10
##$ABSF2= 0
##$ABSG= 5
##$ABSL= 3
##$ALPHA= 0
##$AQORDER= 0
##$ASSFAC= 0
##$ASSFACI= 0
##$ASSFACX= 0
##$ASSWID= 0
##$AUNMP= <proc_1d>
##$AZFE= 0.1
##$AZFW= 0.1
##$BCFW= 1
##$BC_mod= 2
##$BYTORDP= 1
##$COROFFS= 0
##$CY= 11.3945322036743
##$DATMOD= 1
##$DC= 2
##$DFILT= <>
##$DTYPP= 0
##$F1P= 15.6554695791079
##$F2P= 12.8336369535428
##$FCOR= 0.5
##$FTSIZE= 0
##$FT_mod= 4
##$GAMMA= 1
##$GB= 0.15
##$INTBC= 1
##$INTSCL= 1
##$ISEN= 128
##$LB= 0.24
##$LEV0= 0
##$LPBIN= 0
##$MAXI= 10000
##$MC2= 0
##$MEAN= 0
##$ME_mod= 0
##$MI= 1.114404
##$NCOEF= 0
##$NC_proc= 0
##$NLEV= 6
##$NOISF1= 3.799351
##$NOISF2= 2.8
##$NSP= 1
##$NTH_PI= 0
##$NZP= 0
##$OFFSET= 15.70392
##$PC= 1
##$PHC0= -25651.25
##$PHC1= 15.38748
##$PH_mod= 1
##$PKNL= yes
##$PPARMOD= 0
##$PSCAL= 0
##$PSIGN= 0
##$REVERSE= no
##$SF= 200.130013532006
##$SI= 16384
##$SIGF1= 3
##$SIGF2= 2
##$SINO= 400
##$SIOLD= 16384
##$SREGLST= <1H.CDCl3>
##$SSB= 0
##$STSI= 0
##$STSR= 0
##$SW_p= 3612.71676300578
##$SYMM= 0
##$S_DEV= 0
##$TDeff= 0
##$TDoff= 0
##$TI= <>
##$TILT= no
##$TM1= 0
##$TM2= 0
##$TOPLEV= 0
##$USERP1= <user>
##$USERP2= <user>
##$USERP3= <user>
##$USERP4= <user>
##$USERP5= <user>
##$WDW= 1
##$XDIM= 8192
##$YMAX_p= 0
##$YMIN_p= 0
$$ End of Bruker specific parameters
$$ ---------------------------------
##NTUPLES= NMR FID
##VAR_NAME=  TIME,          FID/REAL,        FID/IMAG
##SYMBOL=    X,             R,               I
##VAR_TYPE=  INDEPENDENT,   DEPENDENT,       DEPENDENT
##VAR_FORM=  AFFN,          ASDF,            ASDF
##VAR_DIM=   8192,          8192,            8192
##UNITS=     SECONDS,       ARBITRARY UNITS, ARBITRARY UNITS
##FACTOR=    0.0002076,     1,               1
##FIRST=     0,             0,               0
##LAST=      1.7004516,     0,               0
##MIN=       0,             -107764,         0
##MAX=       1.7004516,     114176,          0
$$ Real data points
##PAGE= N=1
##DATA TABLE= (X++(R..R)), XYDATA
0@%%%%%%%%%%%%%%mQj2J6j6J6j7K1k6L0l5M1m7N5o2P0q2R1j02J15j27J42j58J74
38I1j96K20k44K70k98L31l65M03m48M96n52O16o85P65q59R72j106J266j461J692
58I08j922J803M199J09188l3400j13291j3171m52M5508R1585j9112j36188m3419
71a07764R0017Q2270q632n4016n7136j1569Q0242Q6316m3721j04193k3034M9834
83b1386N9888K9034n8855r0435J3617R5939M3162l1801n7295m4245K6219R5637
95E9479K5392r6095o6940L3489N1905M1186M264p9492n8185O7321Q6994l992o1724
108C602n4410l038N7881N8113j7917q2848m1481N5911P2565J1598m0556o4696
120d5276j7517P7183O0265l8644o3000l3143J1801P6718M7843o6431p3947J8964
$$ y = [0, 0, 0, 0, 0, 0, 0, 0, 0, 0, 0, 0, 0, 0, 0, -4, 4, -8, 8, -8, 8, -9, 12, -14, 16, -19, 22, -25, 30, -32, 38, -44, 47, -55, 60, -67, 75, -83, 91, -105, 115, -129, 141, -157, 174, -191, 212, -236, 260, -292, 324, -361, 404, -455, 517, -589, 677, -784, 908, -1014, 789, 4988, 114176, 80776, -32515, -45686, -46138, -630, 90955, 71843, -64345, -107764, -17747, 64523, 55891, 1875, -55261, -66830, 13412, 99728, 56007, -48186, -71220, -21386, 38502, 67536, 8681, -81754, -68137, 27802, 70964, 39163, -18132, -62377, -36158, 59479, 84871, -11224, -78164, -44675, 7230, 48416, 52680, -26812, -84997, -17676, 69318, 65326, 3602, -50808, -53846, 4035, 62148, 44231, -38617, -80098, -24187, 48378, 59976, 19420, -45276, -62793, 14390, 74655, 36011, -26989, -60132, -48331, 28387, 76230, 9799, -64148, -45184]
132d5184N8885L8823O9n5899o3375K2162Q6343K1537o4600m9958N303L7220N4937
145D6263J4235o8621n7380L9599O8971J0118m1374n0451j8777M2678O6644l707
157D8198p2179l3574L6358N0652K8932k7592p3345j7058O4232M5672j8264m7148
169a5116m1196J4412P0399L6262m5150o2474l045N1355M2361m410m9453n4066
181f0121J3899P5260K8586m8603m6800n846L4317N8285Q903o5228m9849K6730
193c0467N4740K2570k8080n4726k1499M5412O0828j754n5652l5463J6531M7534
205A9974L3178k7254o3342j6813M6879M5729k915m1355l7936R580N5124L6176
217E7025l2788n7202r310L7443L7831N631m2535m9279J5256O1303K3999k8950
$$ y = [-45184, 13701, 52524, 52593, -3306, -66681, -44519, 41824, 63361, -1239, -51197, -45894, -8674, 46263, 60498, -8123, -65503, -25904, 43067, 53185, 11811, -38640, -57417, -14739, 51905, 48198, -23981, -57555, -21197, 29455, 58387, 30795, -42550, -59608, 4624, 50296, 32032, -15116, -56312, -41900, 28499, 64761, 19611, -42863, -45908, 5447, 47808, 43398, -6055, -60121, -46222, 29038, 57624, 9021, -37779, -43625, -9308, 48977, 57880, -7348, -57197, -30467, 24273, 46843, 18763, -35963, -57462, -12050, 48778, 47024, -8628, -44091, -27560, 19974, 53152, 25898, -37444, -54257, -7378, 38351, 35436, -5919, -43855, -34275, 20849, 57025, 24237, -32965, -42275, -4832, 32999, 38630, -3905, -53184, -37928, 23375, 47374, 18424]
229A8424m1866j8247L2948N1589J791n2002m1085J4812M8714K6963k2135m7389
241b7483k0007L8468N3631P2m8431l5160Q030M1659L4501k1193n7093j6574L9670
254i910M4203M717l5572m1175L967N0234L2659k6377m9942j6039K8264M2812J1503
267C9344l8760m3642J0693M8795K7637j9309m3730k0956K5750M5224Q044m2319
279c229l9467J0849M2216K7698j2247m3116k4467L1597M6469Q43l7752l5241J671
292c4176M0183L3782j7364m6493j6838L0593M1933P676l4178l8904N16M2753L1327
305D0810j9554m5147j7366K5654M1557J3733l4214m0402M624M2706K7411j5494
317B4318m1031k4384K1799M4991J1379l5935l5952M534L6931L1682q971m3588
$$ y = [18424, -23442, -41689, -8741, 42848, 44639, -7363, -48448, -33636, 15078, 42041, 19906, -27483, -47490, -9022, 44609, 44681, -3750, -38910, -30880, 10779, 45280, 24087, -33006, -49580, -9910, 34293, 39010, 3438, -37737, -33770, 16464, 49123, 22746, -27196, -43235, -14971, 27841, 39344, 584, -43058, -32365, 16430, 44067, 24758, -18972, -39928, -14178, 31046, 39090, -3229, -42696, -31847, 10369, 38067, 25820, -17296, -41763, -10166, 36303, 37146, -606, -35847, -34176, 6007, 39789, 22425, -24068, -40906, -10313, 31620, 39296, 5118, -33786, -33270, 9483, 40810, 21256, -23891, -41257, -15603, 25954, 39687, 5473, -34929, -30305, 12401, 39812, 24318, -16713, -41097, -19298, 25693, 37072, 1137, -34815, -30281, 6650, 38332, 29361, -14227]
329a4227k5077K4640M1282P850l1336l5927j866L6658L4790r613m2842k0954K4564
342a2058L8124R553k7459l8726n310L9009L2547j4220l8414j8253J9209L8846
354B2848J6085k9401l9469m76L5942K7915j0663l6954k3290J7589M1672J4856
366C6654l0022l5848O70L3469K9684o817l9281k7206J9552M0440J1163k6992l3227
379b7761m505L3048L4991o769m0594k3057J8985L4926J3888k3899l8028o732L5502
392eL2926p906l5175k1471J4542L6045J7091k4180l9529n006L2869K8336n925
405B2612l1201k5027J2662L9994J7691k6521l4100l385K6291K9119j850l5287
417i002k7297J6133L7814J3685k1711l1763o411K7311L2359k545l7401k4566J4995
$$ y = [-14227, -39304, -14664, 26618, 34468, 3132, -32795, -34661, 1997, 36787, 27174, -15668, -36622, -12058, 26066, 35619, 8160, -30566, -35876, 3133, 35680, 21460, -16954, -35207, -15998, 22848, 38933, 9532, -29937, -30413, 5529, 33444, 22781, -14173, -37463, -19874, 21798, 36654, 6632, -29216, -28546, 4923, 34607, 27790, -11491, -38697, -19145, 21295, 32458, 5466, -27761, -32266, 782, 35773, 29004, -11590, -34647, -15662, 19264, 33152, 9253, -28775, -35507, -5, 32921, 25015, -10160, -31631, -17089, 18956, 36047, 11867, -27662, -32668, 201, 28537, 22612, -8589, -33616, -20954, 19040, 36731, 10210, -23890, -27275, -984, 28135, 26285, -9002, -36299, -20166, 17648, 31333, 9622, -22141, -28552, -1241, 31118, 28573, -8828, -33394, -18399]
430a8399L3258J4346j8760l4001r031L0578L3819n153l3246k2445J0237L3039
442A4242J9063k1046l7926o910K9464K9461q60k9270k6537R592L6787J8669k1940
455A2789l4147q498K4015K9874K279l1003k7949J1473L5666J7061j7517l0823
467a6780j2241K2588L3338L68l3098k4466R505K9947J9710j3531l3587j1737K6840
480c144K9858j324k7829k3727M283L0744K1603j7621l5008o657K4980K6493L686
493B6337k5235k8328M730L5677J8389k0444l0647q345J8825L0061P389k9226k9476
506c0293J0314L3882J5196j4073k8990j5648J9052L3981L237l0229k4291P057
518b0805K8355K1122j0075l2529j5457K2671K9806J622k4347k4779m54K9065K4995
$$ y = [-18399, 14859, 29205, 10445, -23556, -32587, -2009, 31810, 26657, -6589, -29034, -18797, 14242, 33305, 12259, -25667, -32577, -3113, 26348, 25488, -3782, -30319, -20727, 16060, 34729, 12789, -21358, -29856, -5841, 24033, 26312, -4691, -32640, -21167, 14499, 31560, 14043, -16780, -29021, -6433, 26905, 27273, -5825, -30291, -20786, 9161, 28871, 15340, -18247, -29984, -3144, 26714, 25390, -2439, -26166, -21883, 8861, 30464, 12843, -22165, -28822, -3842, 22651, 26337, 1102, -27226, -22496, 13181, 31570, 11126, -19521, -27866, -9041, 21020, 28409, -817, -30293, -19979, 13903, 29099, 15026, -13964, -29612, -10560, 23421, 26658, -3571, -27862, -20805, 7550, 28672, 18597, -13932, -29389, -6718, 23088, 24710, 363, -24416, -24870, 4195, 29190]
531B9190j3273l2521r371J9643K5365P336k1709k9648J003L1623J9196j4681k6896
544a4743j0846J5276K8650R735k5373k7920N738K7872J6996j0066k7788j6274
556b8743J7281L0712O161k5081k3627K651K6381K1940q274l2485j5335J9609K7220
569A8410M499j9728k6281l049L0547K4937j2142k9534j1226J3774K5235J1338
581B6780k0166l1182j026K9984K0539j0099k3677j4727J0068K9811J2750k3774
593E281k7354J497K2959J9179m077k6083j8989J4649K9665P828k0311k2306k161
606b0223K1255K3454m884l0947j5128J6444K3296Q091j4686k5979m764K7221K3567
619B6717r422k6644j3068J0692K3905J2263j7867k9098j563K7360J9857n966k2700
$$ y = [29190, 15917, -16604, -25975, -6332, 19033, 26369, 4660, -24988, -23985, 7638, 26834, 12153, -14743, -25589, -10313, 18337, 28072, 2699, -25221, -19483, 8389, 25385, 15319, -12469, -28743, -11462, 19250, 25411, 330, -23297, -20646, 5735, 27675, 19401, -13084, -28419, -8810, 18410, 22909, 3181, -23100, -26149, 4398, 29335, 17193, -12341, -23567, -9793, 15442, 26780, 6614, -24568, -25594, 4390, 24929, 14830, -8847, -23574, -13506, 16305, 29055, 5281, -22073, -20576, 2383, 21562, 17485, -8598, -27587, -12938, 16727, 24555, 4244, -18062, -20223, 1032, 24486, 19602, -11345, -26473, -10029, 13267, 21358, 6672, -19307, -24071, 3150, 26717, 17295, -9349, -22417, -11725, 12180, 24443, 6576, -22522, -24085, 3275, 23132, 17166, -5534]
632e534j7771Q914K9514J1931k1528k5873k116K1073K1633p42k5787j9680J2712
645a3254K8487R208j6709k2812p311J8947K6085l173k8220j5166J1494K2004J3006
658B2586j1733k6563p047K2963K1996m940k3062j5462O328K3272J4994j4846k7261
671a8775k351K2414J8202j381k0084k0373P100K7434J0656j7494k2362l875J7985
684b904K1861R64k3303j9724J0092K6043Q836j3735k2130q836J7697K5358j613
697A8606k4132j6051P707K3177J4182j1736k5735q436J9237K1793j070k0876j6910
710b0244L320K3700J7121j3307k5111m662J6423J8744L654j9515k1761M956K4617
723G935J2441j1993k0400p359J4159K1747M438k1501j9853P167K0960J0966q868
$$ y = [-5534, -23305, -14391, 15123, 27054, 5526, -20347, -22463, -1390, 20243, 19501, -6286, -25966, -13254, 15233, 24441, 7732, -15080, -22391, -3444, 22641, 19468, -8752, -23918, -12424, 9580, 22586, 10853, -15710, -22757, 206, 22202, 17262, -5800, -21262, -14934, 8338, 23332, 8486, -18775, -21126, 1288, 19490, 18109, -1975, -22348, -15248, 12186, 22842, 5348, -17014, -20889, -2904, 18957, 19921, -3382, -23106, -13014, 13029, 21865, 8130, -14000, -22836, -5139, 20219, 18606, -5526, -21577, -13870, 9307, 23489, 11753, -13982, -22418, -3181, 18612, 17542, -3334, -20244, -16924, 6776, 23897, 10590, -14521, -19183, -2760, 15984, 19638, 123, -21638, -16682, 7935, 20376, 8383, -12017, -19376, -5217, 16530, 20968, -533, -20386, -13219, 7741, 18707, 9839]
736I839k1349j0696J6525K3210N58j9939j6020M016K0612J4702r889k4284r053
749b1768J7199K0455P01j6967j7578P80K3256J7246j1852k3544o633J3109J9471
762A3875N425j8403k0651K176K3361J4869r801k0322r140J1463K1839O312j9925
775A078k0302L608J9444J3532n441k1116j1614J3531K2321L901j7176j7432R04
788a4762J7829J5509o497k2394j0338J4267J9304L475j3632j7970r39K0587J6597
801B1036r486k1272q590J0539J9321O024j5293j9752J166K1253J4174p331j8811
814g022j0969R397K1155O530j8060j8178J492J7509J5125l695k0128j2271J1360
827g755K0977N029j5413j7740j216J6057J7082l843k1447j0717J1807J8529N681
$$ y = [9839, -11510, -22206, -5681, 17529, 18087, -1852, -17872, -13856, 6756, 21458, 11569, -12715, -21768, -4569, 15886, 16587, -380, -17958, -17178, 6078, 23324, 11472, -12072, -18705, -5596, 13875, 19300, 897, -19754, -17578, 5783, 20652, 10851, -9471, -18611, -7148, 14691, 21003, 1078, -19224, -15616, 3828, 17360, 11919, -9197, -20811, -7280, 15041, 18942, 1766, -15666, -14762, 3067, 18576, 12079, -10315, -20653, -6386, 12918, 16393, 2761, -15209, -16148, 4439, 21036, 11550, -9722, -18312, -7773, 11548, 17572, 2279, -17473, -16307, 4946, 19120, 11789, -7022, -17991, -8594, 12561, 19091, 1031, -17147, -15655, 1854, 16979, 13284, -6844, -19115, -7755, 13222, 18251, 2838, -14902, -16118, -61, 17021, 13178, -8269, -18986, -7179, 11350, 17031]
840A7031j1670j8840l009J7937J6326n749j8978j0836Q851J7939Q866j2644j9718
853a4494j053J8121J4424m806j7268j2012O906K0014P606j4374j7339m17J5274
866E82J4930j821j7932j3237Q718J9556N943j3770j6013k831J4389J7374k171
879A3717j9413j1283R726J6959P174j1242j8323m173J6250J5998l451j7069j1289
892a6419O658J7997R635j1303j9426k352J5819J3822j868j5633j4200N803J9772
905H305Q731j1869j6913k509J3392J4790M12j6665j4675O246J8632P230j0212
918D895j5635m670J2837J7391n46j7407j1724O126J5774Q455q973j7578n279J4043
932b291J6078j295j5037j1610M434J6396J0430j0342j8147l602J3411J3690K31
$$ y = [17031, 5361, -13479, -16488, 1449, 17775, 12026, -6952, -17788, -8937, 9002, 17868, 5224, -14494, -15547, 2574, 16998, 12192, -5076, -17088, -10182, 9832, 17438, 3064, -14275, -14692, 582, 15512, 13691, -4241, -17478, -8760, 10796, 16739, 2969, -13044, -15875, -1486, 15888, 13717, -5696, -16979, -7253, 9706, 16880, 5638, -12685, -16858, -608, 15390, 11939, -5130, -16419, -9761, 8236, 17871, 6568, -12858, -15210, 609, 14431, 12563, -3070, -17270, -11467, 8305, 17036, 5167, -11746, -14255, -863, 13927, 14339, -2326, -17001, -10755, 7877, 15107, 4895, -10740, -15410, -2573, 14818, 14272, -3135, -14859, -8733, 7041, 15496, 6523, -11055, -16334, -2291, 13787, 12492, -2545, -14155, -9721, 6675, 17105, 6763, -11384, -14986, -1575, 12115, 12346]
945A2346j4009j3901M411J8434R537j0616j5954l987J0899J5123K157j6157j4920
958a6637N546J7668Q156q079j5251o222J1498J6745J214j6247j3121M538J5192
971E000R469p242j6457o666J2800J5769N25j3806j2117K320J5228J0852q559j6913
985i797m924J1250J4050K038j2735j3678K687J6808R685q217j5144n412R031J5057
999A0699K760j4490j3357L744J5700Q862n985j4670p565J0151J5968J287j4369
1012a265j1999K679J3243J1185n151j6466o839J1405J4751J224j2112j2416l87
1025a2148J4908J2101p000j6075n636R452J3777L755j0848j4865P80J5618J0063
1038A3882o329j4172o752P242J4772M740j2399j3656K439J3516R484l914j3568
$$ y = [12346, -1663, -15564, -11153, 7281, 16818, 6202, -9752, -13739, -2840, 12283, 14440, -1717, -16637, -11091, 6577, 14733, 6654, -8597, -14819, -3321, 13424, 14638, -1609, -14730, -10192, 5000, 14469, 7227, -9230, -15896, -3096, 12673, 13198, -608, -12725, -10405, 4823, 15675, 7116, -9797, -14721, -3471, 10579, 12617, -118, -13796, -11109, 5699, 15384, 7167, -7977, -13389, -4358, 10699, 13459, -1031, -14388, -10644, 5056, 13918, 7933, -6737, -14302, -4151, 11817, 13104, -1265, -13264, -10585, 2658, 13843, 8692, -7774, -14613, -3208, 11543, 12767, 655, -11761, -12148, 2760, 14861, 7861, -8214, -13850, -4398, 9379, 13134, 2286, -12579, -11799, 3819, 13882, 7553, -6619, -13371, -6129, 8643, 13383, 984, -12672, -10233, 3283, 12767, 8853, -4715]
1051d715q964P499J5802L143j2578j1673J070J1718J1476l082j5413p737Q891
1064d563J3964K660j0320j2828j367J3577J1685m669j4195o695P825J3179N283
1077A3536j0548j4533m24J4411R874m562j2895q392O521J5406N063j0999j3279
1090a0821L99J2104J0077k044j4193r927P666J5009L760j0342j1174j404J0747
1103a43J2991k426j4988q213P381J2484M053q051j2581k602J2765J2040l995j3207
1117d492o151M825J2063O286q592j4793p83J2708R540k564j1234q389M763J4366
1131G553N337j0184j2097n60J0230R976q72j2688r773O301J4176M396q660j1013
1145g878k851J0076J2079j808j3180q673N599J1925N605o520j2849l260J1622
$$ y = [-4715, -13679, -6180, 9622, 12765, 187, -11486, -10416, 1302, 12778, 9696, -5717, -13454, -4563, 9401, 12061, 1741, -11087, -12454, 1123, 12808, 8139, -6056, -12751, -4926, 8253, 13536, 2988, -11545, -11969, 2442, 12316, 7754, -5141, -13533, -7012, 8394, 13457, 2458, -10821, -10422, 1682, 11759, 9715, -4478, -14405, -6739, 8270, 12030, 1688, -9486, -10890, -143, 12848, 10422, -4566, -12779, -5398, 7086, 11139, 3088, -9493, -12095, 670, 12710, 8715, -4492, -10643, -5818, 6245, 12531, 3939, -10854, -11637, 1071, 10611, 8047, -3187, -11576, -6813, 7553, 12890, 2706, -9391, -9951, 279, 10255, 9383, -3305, -13078, -6777, 7399, 11795, 3135, -7878, -10729, -653, 11426, 9618, -3562, -12235, -6636, 5289, 10894, 4374, -8475, -11735, -113]
1158a13J1566k560j1508q006L254J2172P182p854j3222j682J0135J0029l11j0468
1172a386r627L515J3652N772q642j1207k004P997J0656J164j1972r674N209J2173
1186E626M982n990j1235m405R273J2079j037j2033p690L935J0422O858m741j3450
1200g406m155J0866J1136j579j0449q230J775J1585Q396p215j2698k354R472R584
1214H728J006r832j0399K537J2134O872o576j1625l209P201J1860J222j0911r519
1228a0511L842J0830N944m633j1485m876Q125J1614J92j0372q123K571R768P512
1242A0398m092j2495m671R088R855J83q868q366R47J1095P453n491j0947l818
1256i729P847J0225R65r243j0195K109J1404O571n376j0157m679O805J1739J728
$$ y = [-113, 11453, 8893, -2615, -10621, -7367, 4805, 11987, 4133, -9089, -10771, -636, 9393, 9082, -1386, -11013, -7498, 6154, 11926, 3284, -7923, -9927, -1930, 8726, 9890, -2082, -11756, -6547, 5626, 10608, 4618, -6617, -11022, -1749, 10330, 9293, -2740, -10430, -6495, 3927, 10785, 6044, -7406, -11561, -695, 10441, 8862, -1587, -9817, -8042, 3543, 11939, 4724, -7974, -10328, -856, 8728, 9734, -98, -10497, -7960, 4174, 11046, 4470, -7155, -10364, -3163, 8697, 9919, -992, -10511, -6669, 4161, 10105, 5472, -6013, -10889, -2764, 8850, 9042, -1330, -9453, -6882, 2886, 10398, 6306, -6189, -10860, -1772, 8083, 8266, -602, -8968, -8021, 3074, 10527, 5036, -5911, -9729, -1882, 8343, 9308, 65, -10130, -8021, 3383, 9954, 4578, -5579, -10258, -3453, 8286, 10014]
1270A0014j0227r107K066R919O762l887j0570n792P389J1168J799r418q700J278
1284g306R085Q380l557j1876n155P146J0082J972q270r046N40J0153P845l704
1298F289j0695n145O177R944K833q556r787R97J0205O842l570r392n897O055J0902
1313G202K527r295q950J330Q605O784k054j0316o269O443J1180J776q127q381
1327g545p0Q753Q228k892j1160n315O378R900K718p346r433m85R776Q175l185
1342F497j0399n701N174R824L398p015r821j60R495P185j774r378o355M636J0346
1357E952L266p825q750l85Q131P684j349r254o804N342R997L056p469q077j286
1372g771P773Q037k055r332n435M362R731K868n753q933j459Q305Q100k310r402
$$ y = [10014, -213, -9320, -7254, 2665, 9427, 5540, -5030, -10822, -3433, 7735, 9534, 116, -8584, -7306, 1779, 10159, 6602, -5274, -10429, -3283, 6799, 8771, 501, -8545, -8005, 2148, 9993, 6289, -4406, -9551, -3374, 6570, 9403, 847, -8940, -7943, 2262, 9104, 5534, -3858, -9755, -3700, 7202, 9729, 434, -8516, -7186, 1419, 8203, 6149, -4167, -10436, -3993, 7187, 8963, 836, -7545, -7615, 1138, 9366, 6474, -4686, -10001, -3623, 6277, 8995, 1649, -7784, -8269, 1507, 9682, 6497, -3902, -9603, -4429, 5395, 8793, 1778, -8043, -8203, 1292, 8477, 6703, -2675, -9030, -4394, 5952, 9218, 1393, -7357, -7742, 389, 8073, 6724, -2530, -9334, -3992, 6005, 9061, 1592, -6485, -7771, 2, 8039, 5984, -3348, -8783, -4421, 5310, 8178, 2425, -6508, -7967, 338, 8438, 6128, -3274]
1387c274n253L779R242M243o302r529o27P920P860j390q892o589L564R964L925
1402H641o373r092r75P647P532o1q806p385M029R479L728n926q560j869P466Q075
1418G550r50q735o293M052Q842M032n397q797k476P385Q189j271q109n846K571
1433e253Q839N068n460q835k079P373P435p07q175o281K942Q353M860n249q398
1448e567j542O708P507J42q361o753K709Q664M112m737q033k806O858Q188K9q570
1464a452o188K718Q029M508m212q560l017O649Q131j1p453o425J939Q675M771
1479H102l772r173l166O336P895L2o751o698J829Q435N088m311q285k573N384
1494a628P350J341p487o895J349Q228M880l833p460k770M993Q115P92p508o309
$$ y = [-3274, -8527, -4748, 4494, 8737, 2435, -7094, -7721, 199, 8059, 6669, -2223, -8812, -5248, 4716, 8641, 2268, -6824, -7799, -152, 7380, 7319, -1487, -8872, -4843, 4636, 8364, 2438, -6122, -7991, -525, 7550, 6600, -2135, -8428, -4376, 4466, 8498, 3101, -5696, -8172, -787, 7402, 6131, -1978, -7824, -5253, 3586, 8654, 3194, -5641, -7720, -347, 7088, 6381, -1794, -8075, -5133, 3220, 8080, 2831, -5567, -7109, -401, 7106, 7248, -1113, -7866, -5157, 3507, 7619, 2882, -5151, -7957, -1099, 7089, 7118, -1452, -7640, -4922, 3107, 7615, 3403, -5157, -8174, -1525, 6606, 6595, -858, -7283, -5344, 3331, 8102, 4330, -4843, -8009, -1673, 6222, 6254, -497, -7195, -5366, 3069, 8157, 3846, -4439, -7012, -1628, 5722, 7063, -424, -7319, -5970, 2258, 7138, 3305, -4155, -6925, -1932, 6183, 6975, -533, -6842]
1509f842K026P150M895l444q171l472O053P640O47o442o416J163P173N545l413
1524D092q214l569N519P248J263n826p193N51Q641N141l544q207k808M637P163
1539D894J939o608p046J118P548M994k601p331l941M413Q069J623o894o827J170
1554e480O493N175j667p715l921M778P636J346n988n981n30O774N854k333q264
1569c823l037M414O996J951n315p195R7P402N504l005p022l437L612P271K132
1584F545n800p172R67P192M518j342p228m410L743P632J895n950o166Q0O007N941
1600F452j446p314m321M267O747J987n150o467j115O435O614k069p413l663L781
1615b675O261K770m476o938r79O591N385j576o619m086K953P229K874n455o450
$$ y = [-6842, -4816, 2334, 7229, 3785, -4386, -7858, -1805, 5835, 6482, 40, -6376, -5213, 1960, 7505, 4092, -4122, -7691, -2172, 5076, 6339, 513, -6680, -6129, 2512, 7653, 4109, -4098, -6906, -2269, 4894, 6833, 225, -6821, -5703, 1845, 6839, 4238, -3093, -7034, -2621, 5448, 7071, 177, -6650, -5480, 1013, 6188, 4521, -3194, -7115, -2337, 5299, 6645, 657, -5324, -5854, 920, 6774, 4441, -3823, -6860, -2446, 4550, 6501, 1186, -6009, -5912, 1490, 6994, 3989, -3033, -6470, -2858, 4413, 6545, 745, -6427, -5460, 1732, 6250, 4908, -2320, -6730, -2987, 4645, 6540, 590, -5576, -5496, 511, 6452, 5006, -2308, -6629, -2362, 4385, 6372, 1222, -5245, -6360, 75, 6689, 4620, -2793, -6456, -2675, 3586, 6356, 1880, -5058, -6037, 554, 5939, 4363, -2256, -6342, -3389, 3840, 6714, 1259, -5191]
1630e191J23N843M652m70o860m547L080P146K069m554n852p73N154O535r35p701
1646b281m132L575O540K154m218o406j505O374N949j699o171l656K346O094L001
1661E965l682p381q70N984N323j294n074m170J160P526L105m578o572p66N000
1676c24N430j45o303n073K452O939K732l765n656j370M363N946n6o576m469K455
1692c420N683L224l455n944k106N877N714j080n395m392J750N794L408l457o201
1707d000j693N531M810l92m942m641J341O868L171m045o033j213M228N390L70
1722D750n700n083K285O359L041l370n440k350M455N781k4n642m768K090N469
1737A853L460k507o002k454M668N951l60m924m391R33N252M282l082o439j313
$$ y = [-5191, -5068, 775, 5427, 4957, -1903, -6450, -3370, 3776, 5845, 1291, -4561, -5334, -180, 6355, 5420, -2281, -6413, -2838, 3702, 5856, 1638, -4768, -6273, 101, 6050, 4351, -1820, -5476, -3130, 2964, 5965, 2283, -5098, -5968, 16, 5339, 4045, -1029, -5199, -4039, 3487, 6592, 2014, -4558, -5324, -324, 5106, 4961, -1342, -6415, -3963, 2976, 5708, 1943, -3713, -5083, -720, 5226, 5170, -1406, -5875, -3420, 2263, 5487, 2032, -3912, -6018, -141, 5573, 4493, -902, -5294, -3544, 2250, 5658, 2201, -4000, -5693, -162, 4648, 4256, -686, -5327, -3986, 2882, 6053, 2008, -4025, -5238, -1010, 4380, 4750, -950, -6033, -3748, 2611, 5652, 2282, -3158, -5508, -1053, 4728, 4704, -938, -5706, -3616, 1853, 5313, 2806, -3196, -5650, -982, 4969, 4609, -315, -4706, -3773, 1479, 5761, 2679, -3760, -5073]
1752e073M495M765P41m621n616J267O489K954l202n282j701L224N293R98n131
1767d00m440J344N551K837k604n017k594L543N928M99n349l930P29N379L933k236
1783C173o104k372M155M982Q40m656m381j40N653M209k323n914j568K955M699
1798C208J686m299n225M76N156L956k307n083k327K813N543J505m626n014Q95
1813c643M997K849j222n079l005L212N487Q63m313l942L8M553L850j365n781k268
1829d769L034M862J022l621m461n79N580M176k250n355j935K740M740J665l993
1844H56n335J50N469L560j818m567k608K294N399J432m225m673L01M378L491r15
1860C189m914l106K543N240J341l432m236n42M101M055j181n055k554K405M734
$$ y = [-5073, -578, 4187, 4928, 307, -5309, -4042, 2447, 5401, 2199, -3083, -4784, -1560, 3733, 4731, -400, -4840, -3496, 2055, 4892, 2288, -2729, -5323, -1780, 4148, 4647, -702, -4632, -3903, 1476, 5409, 3173, -2931, -5303, -1148, 3834, 4674, 18, -4363, -4503, 1150, 5359, 3036, -2878, -4446, -1491, 3208, 4894, 595, -4630, -4154, 1002, 4958, 2651, -2432, -4759, -1946, 3597, 5102, 476, -4538, -3643, 1354, 4203, 2981, -2098, -5103, -1891, 3596, 4459, 146, -3796, -3758, 795, 4645, 3280, -2501, -4769, -1735, 3127, 4149, 528, -3933, -4512, 1068, 5244, 2994, -2361, -4296, -1556, 3184, 4849, 856, -4479, -4329, 1140, 4700, 2882, -1685, -4293, -1999, 3400, 4832, 607, -4066, -3765, 613, 4104, 3189, -1725, -4831, -2288, 2952, 4293, 861, -3375, -3917, 184, 4239, 3058, -1997, -4551, -2146, 2588]
1875B588J783l119m728n90M792M010j597m777k710K165M425K114l230n012l64
1890d250M669L577q97m617k655J941M919J613l396m273o92M030L916m96m762k919
1906d292K114N153J190l099m103j235L799M314m17n011k890K309M531J935k897
1921A401m462q09L998L695n62m582k560J211M693K261k960m542l58L541L552j70
1937C347m013l424J547M709J949k759m234q33L448M049m7m270l375J793M050J917
1953C854k126m642r06L273M449p64l826l325J567M143K361k539m391j273L630
1968e15L992n47l887k655J106M365K412k435m531j092L445L273K42l979l213J146
1984b873M623K114k273m006j137K755M246J62l844l506J339L785K377k025l936
$$ y = [2588, 4371, 1252, -3476, -4066, 726, 4736, 3139, -1638, -4348, -2183, 2242, 4356, 1126, -3886, -4250, 419, 3996, 3099, -1518, -4173, -2232, 2687, 4300, 904, -3369, -4061, -31, 3885, 3389, -1373, -4292, -2178, 2975, 4165, 1066, -3037, -4272, -473, 3841, 3424, -1587, -4477, -2168, 2363, 4298, 1401, -3061, -3870, 128, 3823, 3261, -1321, -3881, -2670, 2023, 4284, 1324, -3218, -3576, -35, 3517, 3347, -666, -4090, -2543, 2166, 4115, 1356, -2878, -3711, -263, 3786, 3739, -531, -3906, -2113, 1937, 3854, 1728, -2914, -3820, -547, 3902, 3138, -688, -4013, -2446, 1697, 4058, 1519, -2872, -4145, -515, 3477, 2930, -957, -3612, -2506, 1859, 4271, 1836, -2695, -3787, -342, 2931, 3173, -806, -4019, -2873, 1750, 3864, 1591, -2415, -3552, -797, 3449, 3611, -233, -3739, -2400, 1385, 3762, 1737, -2199]
1999b199j545L128L499L71l579l178J076L662K386j899m010j391L083L648K84
2014C336l668k960P84L834K382j800m375j014L009L158L66l303l191P91L980K467
2030C796k068m252j073K888L707L8k948l372K54L931K485j504l767j911K858L796
2046B858K51l070l129M88L625K221j303l905j289K022L702R53l420k929O10L261
2062I46K532j301m045j302K166L301Q45k801l094K2L807K477j895l262j729K222
2078a111L592P11l241l028K60L425K618j158l568j973K359L422Q97l044l047K82
2094b604L055K577p64l857k288K647L820M60k418l169m04L062L346p94m283j813
2110c427K280L118J031k237l466K45L133K541j025l733j518J547L199J562k701
$$ y = [-2199, -3744, -616, 2883, 3254, -325, -3503, -2427, 1235, 3621, 1722, -2288, -3679, -596, 3052, 3336, -332, -3292, -2508, 1326, 3708, 1908, -2467, -3481, -472, 2686, 3052, -251, -3442, -2651, 1329, 3796, 1728, -2524, -3597, -709, 2998, 3036, 88, -3284, -3030, 901, 3386, 1882, -1885, -3796, -938, 2858, 3109, 39, -3090, -2602, 1023, 3244, 1941, -1964, -3253, -1231, 2471, 3424, 4, -2925, -2315, 946, 3478, 2177, -1868, -3170, -1004, 2297, 3142, 341, -2753, -2731, 1076, 3553, 1658, -1604, -3333, -1111, 2481, 3192, -49, -3077, -2817, 608, 3226, 2068, -1500, -3473, -1114, 2308, 3205, 161, -2886, -2604, 451, 3028, 2264, -1593, -3881, -1234, 2586, 3046, 628, -2541, -2945, 117, 3463, 2669, -1614, -3427, -1147, 1971, 3002, 765, -2701, -2456, 677, 3218, 2193, -1540, -3058, -1511, 1688, 3250, 549]
2125E49l422L74K731K618q19l153j651J308L756M95k412k755l63K880K824m26
2141B534l702k309J994L298J003k004l039n65L030K763q57l153k029J796K924
2156A684J293k177l405M2K850K562q59l382j294R60L404J504k659k909q8K675
2172B01K387j95l231k383J752L327R40k229k825j99K260K982n27k970k390J618
2188a482L168J036j787l059n94K439K941l37l268j844J612K432J345j637l262
2203b297l66K887K189o36k508j981J121L001J523j959k893l98K266K223N3k943
2219g18k331J471K989J171j579k980r15K534K780J42l225k137J151K711J557j839
2235G82k640q68K578K748k63k615k105P41K548J596j353l176p28K431K345K0k149
$$ y = [549, -2873, -2499, 232, 2850, 2031, -1122, -2773, -1465, 2291, 2786, 374, -2381, -2744, 136, 2960, 2534, -1168, -3477, -1483, 1815, 2818, 814, -2225, -2790, 240, 3003, 2146, -1007, -3036, -1240, 1684, 2977, 800, -2605, -2563, 287, 2849, 1990, -1392, -2686, -1726, 1678, 3182, 523, -2386, -2474, 201, 2588, 2393, -838, -3221, -1469, 1858, 2798, 569, -2256, -2455, -195, 2787, 2260, -710, -3100, -1482, 1686, 2722, 935, -2124, -2718, -279, 2662, 2325, -943, -2787, -1175, 1257, 2602, 965, -2297, -2663, 224, 2413, 1777, -731, -2712, -1591, 1410, 2933, 974, -1919, -2317, -51, 2172, 2225, -718, -3049, -1578, 1411, 2582, 1003, -1977, -2892, -358, 2422, 2564, -661, -2798, -1647, 1064, 2621, 782, -1858, -2726, -148, 2600, 2337, -278, -2383, -1642, 906, 2502, 1149, -2027, -2755, -324, 2021, 2041, -108]
2252a08j947J15K668K013j739k819j80J349K503K94k319k665J155K997R58j154
2268A121k539j504K333K884K10k886k104Q08K671R28m03k867j082J757K959J7
2284B303k582j871M12K449J668j145k661q18K006K356K67k534k082L79K803J543
2300B493j512k323j006J541K370P86k281k250L04K762J248q94k578j037J681K578
2316A882K10k467j877L92K489J642q30k721j180J742K608l5j898j824l21K819
2332F31J655p90k709r87J536J911J066k317j953l4K650J513j000k300j133J722
2348e39K172O55k380k138O83K212J507r74k477j339J727K530M92k176k054N57
2364a542J994J640p31k393j079J517K037O82j781k183k46K367K087j070k296r71
$$ y = [-108, -2055, -1940, 728, 2741, 1002, -1817, -1997, -648, 1855, 2149, -170, -2835, -1680, 1317, 2275, 1121, -1418, -2922, -589, 2295, 2505, -381, -2485, -1677, 994, 1922, 1519, -1348, -2430, -673, 2286, 2303, -279, -2150, -1738, 711, 2379, 1234, -1427, -2245, -239, 2117, 2384, -150, -2232, -1853, 950, 2493, 981, -1342, -2348, -807, 1563, 2349, 68, -2182, -1878, 884, 2132, 1238, -1340, -2377, -696, 1882, 2092, -375, -2252, -1860, 629, 2271, 1441, -1280, -2460, -718, 1890, 1855, -43, -1867, -2188, 631, 2286, 1496, -1213, -2200, -664, 1247, 2313, -4, -1957, -1991, 659, 2172, 1172, -1128, -2261, -539, 1633, 2288, -92, -2230, -1547, 665, 2172, 1198, -1279, -2618, -891, 1639, 2131, -45, -2099, -1542, 452, 2092, 1361, -1032, -2111, -594, 1443, 2125, 344, -1839, -2085, 282, 2369, 1299, -997, -1968]
2380a968J081K233Q48j648k493L24K431J182q63k116j012J263K201O57j984j934
2396a798N6J789J971n15k313j750J198K784M09j790k056K48J922K034n42k418
2412g71j471J557J672Q25j489j944m29K285J796p52k380j089J072K391Q87j689
2428D71k229j65K250J604q07j765j728J260K127J084j620k045l1J659J709l51
2444A423k031j211J064J827J021j513j645n92J458K028q3k403j410J061J746J297
2460B037j494j994m74J893J773j17k075j444Q07K076R31j227k278j10J491J919
2476A714j25j800j632O92K291R15j589k055l4J395J828j71k020j512J114J950
2492I61R40r16j918r48J756J969m53k017j140O88K008O96q66k174l40J657J774
$$ y = [-1968, -887, 1346, 2194, 546, -1947, -1623, 808, 1990, 1127, -989, -2001, -738, 1463, 2120, 136, -1798, -1742, 47, 2018, 1503, -810, -2560, -1362, 1422, 1831, 41, -2015, -1767, 155, 2189, 1647, -771, -2242, -685, 987, 1812, 323, -1621, -2050, 235, 2031, 1279, -1101, -2190, -1118, 1273, 2160, 471, -1758, -1923, 327, 1931, 1124, -641, -2369, -1109, 1018, 2102, 482, -1563, -1594, 65, 1774, 1423, -608, -1819, -755, 1072, 2093, 580, -1065, -1657, -199, 1829, 1746, -657, -2067, -1006, 740, 2037, 543, -1451, -1925, -32, 1741, 1624, -451, -1895, -1088, 988, 1919, 692, -1586, -1696, -205, 1714, 1589, -211, -1843, -1151, 1140, 2055, 466, -1589, -1623, -228, 1600, 1429, -591, -2103, -989, 961, 1901, 985, -933, -1881, -125, 1844, 1391, -626, -1766, -1078, 930, 1626, 760, -1414, -1754, -97, 1677]
2509A677n16j592j151K83K262O09r34k065r8J246J683j7j572j257L72J889P77
2526A596j273j488m28J283J945J78k114j431P20J914P09r92j559j204J899J853
2542A608l60j600j388L74K046R89p15j911p86J475J903j88j789j444O23J732J124
2559A693p98j819o98J105J848L30j707j540K88J928J018r21j534q21J475J642
2575A489J99j563j858O60J724R47p54j992n79J279J991K7j787j394O34J497J089
2592A609p08j956j71Q77J773p2j141j682J12J928R59n39j758j206J698J508N31
2609A762j770j582J42J673J259q65j536o75J273J395L93j639j391M11J530J215
2625A595o65j672q07R65J640N30j517j499N50J205J299q31j656m28Q65J662J34
$$ y = [1677, 1161, -431, -1582, -1299, 963, 1572, 638, -1427, -1525, -279, 1404, 1387, -185, -1442, -1070, 819, 1596, 323, -1165, -1593, -310, 1635, 1813, -301, -1732, -1012, 902, 1611, 619, -940, -2144, -245, 1608, 1248, -352, -1740, -1366, 680, 1669, 954, -957, -1743, -268, 1635, 1447, -342, -1786, -1163, 569, 1693, 895, -924, -1622, -517, 1331, 1661, -46, -1586, -1298, 630, 1648, 727, -807, -1628, -153, 1489, 1688, 125, -1733, -1073, 651, 1598, 844, -1148, -1727, -448, 1543, 1570, -217, -1611, -977, 520, 1609, 901, -1055, -1226, -349, 1424, 1352, 211, -1471, -1359, 569, 1528, 989, -769, -1975, -277, 1231, 1762, -8, -1590, -1448, 225, 1484, 619, -917, -1592, -319, 1076, 1469, -170, -1561, -1150, 380, 1595, 930, -742, -1549, -584, 1056, 1586, 69, -1430, -880, 325, 1624, 793, -863, -1291, -426, 1236, 1370]
2642A370j171j545R3J369J597q21j710r95J592J144K53j021j496J39J618Q97n88
2659G25j385p75R24J771J46j433j067k16J672J273o87j551r96J179J642K24j431
2676A5j035p8J185J303k06j510j370J131J496N89j119j470k24J455J528n51j853
2693g14n37P63J361O27j324j219k56J435J290q14j054p81M22J806L78r76j277
2710h70N3R24J533p29j297j211R45J882n9q40j473j55J351J518l88j832r13J192
2728c69J235K87q96j607k95J708J558q11j161r37O62J474P03j058j794M22R33
2745E4J316l99j415q32N59J584N69j292j254PJ087J399m72j490p40M45J903L01
2763A330j199r80j53J031J373M7j929n63J63J391N48n03j532l93J282J139p8j216
$$ y = [1370, 199, -1346, -1253, 116, 1713, 892, -818, -1813, -221, 923, 1176, 155, -1341, -1202, 416, 1313, 725, -660, -1435, -511, 1260, 1406, -27, -1094, -1310, 362, 1635, 948, -603, -1599, -420, 1222, 1446, 15, -1020, -1098, 87, 1390, 1184, -326, -1696, -565, 931, 1520, 401, -1069, -1293, 162, 1690, 1139, -714, -1251, -488, 873, 1500, 176, -1043, -1299, 136, 1426, 612, -442, -1223, -801, 1005, 1383, 407, -870, -817, 107, 1640, 911, -386, -1597, -652, 1230, 1171, 331, -1142, -1297, 54, 1572, 1184, -648, -1561, -369, 866, 1153, 257, -1350, -1645, 63, 1621, 810, -351, -1288, -626, 848, 1551, 493, -1301, -879, 54, 1370, 971, -444, -1276, -717, 867, 1436, 144, -1110, -1103, -16, 1383, 911, -579, -1319, -874, 1029, 1330, 131, -849, -1002, 29, 1402, 1449, -480, -1043, -880, 511, 1059, 556, -976, -1369, -87, 1052, 974, -242]
2781b42p82K62J050J016p26j969R9J139J378l44j351j003Q03J495O89j503j100
2798a089l73J547J004J48j895q47P56J810k2m73j410m12R24J330J1j554o78L21
2816i02J377J032j079j565r4J278J061j71j140p60J42J498L70n06j407l73J060
2833a79J022J87j149j208N17J435N04m04j688r1J140P64L84j919n13L51J381Q37
2851A371p40j233p96J189J288P1j272j067J45J607M53n99j086o03R31J218O6j240
2869b97q27K41J310J202j232j092l69R18J131j06q43r71k33J816N63n20j541m17
2887a267Q03J620J03j230j118M62J074N53r1j540o17J011J306j65j164p56K62
2904g54J148Q10m60j525n09J019J086N21j589o32j26J608M25m51j250l97P71J152
$$ y = [-242, -1024, -762, 288, 1304, 578, -1391, -1292, -153, 1225, 881, -470, -1473, -670, 825, 1514, 11, -1089, -1462, 85, 1089, 1237, -658, -1505, -749, 1061, 1039, 566, -844, -1256, -332, 998, 1009, -545, -1223, -902, 475, 1507, 428, -1137, -1231, 47, 1108, 937, -203, -963, -821, 677, 1047, 541, -866, -1239, -179, 843, 1030, -119, -1327, -810, 625, 1129, 725, -963, -1054, 86, 850, 1234, -685, -1198, -847, 534, 1371, 631, -602, -1398, -209, 1079, 1150, -122, -1189, -1044, 563, 1016, 417, -669, -1272, -341, 877, 943, -297, -1124, -883, 427, 1629, 397, -695, -1064, -146, 985, 879, 36, -935, -1168, 648, 1211, 691, -850, -1267, -464, 1156, 1259, 29, -1089, -627, 447, 1000, 909, -631, -1248, -237, 1069, 904, -260, -1016, -754, 394, 1204, 744, -781, -1290, -271, 815, 1336, -253, -885, -1011, 597, 1022, 571, -679, -1076, -305, 847]
2922H47J95j002r98M8J167O68k29j333m14P77J191j45r07q71K97J150L38j61j397
2941g79m81Q77J193J97j139p27J73Q47P43l28j116m25P04R84N29j228r81L27Q94
2960B64P93o24j048m50Q97Q10O00q69j484L91R23J019r00n12q76O88J103L20j043
2979Br08L56M76Q56J04j194q79Q89R16N36j125j274L74Q05Q54j32j182o71P99
2998c98J236J28j046n60l16J101O73j33j096l14L33P69P25r49r92LQ14J077m85
3017E70q02q26M91J143M64r32p83j10Q68P66k52r89m67M35Q82N38p45r75l89J102
3037a1J117n86j051k01j50J341N27n46q56n86J127Q51k65o17j129M97R97N00o77
3056B82j076k70J029R43j91j135k30K31J105K53o58j233K22O87O56L75j259p47
$$ y = [847, 1042, 40, -958, -910, 257, 925, 696, -637, -1051, -274, 917, 772, -135, -1006, -709, 441, 779, 618, -779, -1260, -383, 810, 1007, -132, -859, -686, 161, 904, 576, -540, -965, -261, 723, 1252, 24, -957, -630, 264, 1057, 433, -615, -1065, -168, 642, 1242, 373, -1111, -720, 203, 1222, 322, -190, -1066, -378, 725, 1045, 2, -906, -550, -74, 782, 886, -308, -1187, -298, 618, 1154, 29, -1245, -871, -66, 788, 656, -526, -1197, -398, 838, 966, -80, -640, -956, 145, 818, 685, -411, -725, -392, 377, 1102, 153, -839, -836, -22, 1055, 570, -232, -1058, -567, 576, 1040, 108, -675, -785, 83, 849, 597, -392, -859, -424, 458, 996, 251, -724, -1113, -11, 1106, 520, -531, -732, -882, 459, 986, 440, -416, -1002, 125, 976, 711, 94, -1035, -538, 459, 959, 282, -794, -1064, -35, 908, 717, -418, -648, -417, 688, 941, 283, -950, -728, -41, 615, 990, -269, -1016]
3074a016N09R33N24p88r53o0O69P30K84j265n41M87R21P82o54j165j09O18Q89
3093G95j39o93j074N55R83L59m29j056r3P14J028k38p37r95M17J256M17p12j064
3112g06o9Q05P41j99m15j025L14Q69M44n86p28m28O60Q81J48n97r83O45N31O96
3132I98r07p37J62M61R59K1j102j097N84J077M89n69p66m42O28J075k6q68p87
3151h47N76Q95J52n65n00o32Q26O71j09p22l85j01J366J05n48q43r4R26N34L3
3171G38m20j107L98O36O91m58j016o3M26K49O30o69q36L21R87N30q05p72j6L79
3191a77O63J44n90p49o8J339K83o27p50L4L70Q13r8n89n49r8J066M11n76q74m3
3212f65L08J088Q5j029m83J59Q54N46n11q47l17O01L55L82n89n00j33O56J227
$$ y = [-1016, -507, 426, 950, 162, -791, -851, -182, 548, 832, -433, -974, -487, 434, 1216, 562, -603, -712, -94, 795, 656, -37, -1111, -556, 427, 786, 357, -699, -792, -78, 950, 712, -25, -1020, -603, 653, 1070, 358, -706, -775, 30, 771, 572, 157, -868, -554, 315, 759, 173, -555, -983, -323, 558, 706, 109, -874, -229, 302, 998, 91, -646, -484, -23, 936, 957, -145, -1242, -658, 419, 908, 339, -427, -869, -241, 834, 808, -60, -847, -271, 624, 776, 211, -289, -921, -95, 576, 467, -255, -640, -741, 625, 730, 182, -661, -755, 171, 705, 738, 318, -789, -391, 245, 936, 478, -538, -601, -175, 74, 704, 35, -801, -480, 507, 1037, 232, -540, -556, -177, 486, 630, 40, -709, -777, 562, 845, 218, -532, -498, -128, 685, 587, -2, -551, -649, 417, 828, 252, -622, -665, -357, 731, 816, -213, -696, -537, 317, 863, 352, -495, -812, -211, 144, 526, -63, -563, -696, -40, 1187]
3231A187r78q32j54N71R02J17o91j029N18M87O27l92r28m08O97J199k49r16m87
3250g59J72R20P05p02o46k21L48P76R5p30n03R9N26N87j46q54l03M58N60L44q55
3271a29m04r9O54Q48n57p05k91N26Q87J82r26o88L54O08L19k08p78n21R71O39
3291F82N6p98p24N57L35P05m87m25n97P11O05j85k98o76K5O60M58oj223j42N32
3312b35P22M04p81o89J59N09M67k04q07k85J53R05N07m05j001k04J088M81p2j145
3332d33m23P49P90j03m84l81n00R18K22K42q47k57L40P88r8m82n23p2P12P17m91
3353C84n19m92N13J012l89J1r61j38O87L67L8q45n05K12Q26N10q37q43L57P04
3373I2K63N2m02q20L76J016J28p67m20j65P52O22k76q31m51P44L10L31j42q94
$$ y = [1187, 209, -623, -777, -206, 696, 813, 122, -907, -389, 98, 725, 333, -595, -1003, -306, 893, 644, -272, -759, -587, 333, 1038, 336, -310, -531, -183, 593, 688, -42, -545, -446, 80, 667, 521, -333, -636, -178, 382, 726, -129, -533, -632, 22, 870, 313, -392, -683, -157, 730, 912, -14, -702, -348, 260, 579, 371, -407, -928, 43, 682, 738, -60, -784, -227, 108, 813, 326, -99, -696, 15, 620, 435, 137, -539, -514, 146, 604, 598, -625, -767, -235, 487, 891, 110, -579, -420, 89, 556, 352, -455, -740, -587, 318, 825, 420, -581, -785, 303, 784, 712, -433, -856, -107, 683, 580, 96, -285, -785, 133, 355, 597, -250, -507, -167, 621, 523, 41, -482, -554, 158, 875, 384, -135, -627, -114, 898, 509, 520, -441, -579, 108, 475, 513, -332, -837, -625, 201, 711, -126, -969, -612, 92, 355, 407, 5, -815, -439, 577, 705, -62, -482, -647, 105, 727, 451, -380, -831, -87, 223, 554, 412, -482]
3393d82l17P56Q60n36p15k2J44O67J80j82j093K55M28O29l42p41j04L0R96J97
3413F08j75q10k52O97L57K88q36p92N14N90M13m45q06J1P41O61j62o19p89K48
3433e58P16N67l28p54l6K21N17J32k35p19k6N21O03n72o26M0O31J73K46n74k72
3454c33M0M76O67r02m68k16P55N03o8o18n88N9J067L24l44p75k29M02J055k11
3474E96p26n84K41Q52j7k01p49J83L46N69J87n45p33J77O10M70m51o60K66J23
3494d6L79J77n04l52R4O77q8J64p55m66N05N34k6n39k84J14P18K45m26l79k1J36
3516a43N38r0j17o46J57M98L87k78m56r3M74N69m75k74n26R5O93M19m50q11O2
3537d67J93O09J53r09k54R6P93K09k26k60m42L17N34J63m49p41K89P36P9p6p97
$$ y = [-482, -799, -43, 817, 281, -434, -456, -312, 355, 535, 353, -740, -485, -57, 572, 230, -511, -615, -585, 411, 608, 433, -377, -629, 68, 425, 713, -123, -915, -401, 189, 602, 157, -649, -638, 103, 764, 602, -17, -806, -558, 158, 725, 397, -357, -393, -172, 345, 477, 242, -477, -503, 18, 621, 49, -577, -537, 94, 267, 513, -61, -333, -293, 183, 850, -52, -520, -736, 19, 522, 454, -164, -752, -693, 374, 698, 354, -421, -650, -248, 807, 596, -130, -714, -473, 379, 362, 161, -588, -405, -59, 510, 697, 152, -581, -404, 206, 676, 225, -435, -169, -46, 333, 510, 6, -346, -252, 425, 337, 501, -254, -720, -215, 319, 293, -246, -530, -416, 302, 547, 121, -258, -279, -143, 395, 305, 188, -458, -301, 197, 584, 306, -150, -243, 231, 800, 325, 51, -475, -380, 313, 732, 282, -529, -467, -274, 335, 488, -421, -675, -579, 214, 423, 197, -63, -505, -188, 346, 509, 60, -681, -392, 344, 423, 347, -450]
3558d50o4N82K43L34o17m99Q5P16L16j67p10k31N40O37l46l56m34K45M21N12m42
3579C15o45k85K87Q48M9o97j61r5K19N48r7n28k35K83N88M48j017k07m3M69O17
3600F61q9p65m42K26N36M15m49n71L82K10O97m59n54k8l3N20K62k86o28m89N93
3621b91N95k1j59o16K14Q45l12j8o25J77J08L76K75p69k14K52P42j20l45l84j17
3642d07O06K87l57k47k44J78O16j98L9n26k79O75N63o01m03m31O76N61M7o97m02
3663e44j00J111m8k49k16m58L48M83K54p63k36J5O31L55l56o17k07M76N66p1k23
3684A51n74k0L28N31k49o73j15O45j52M28P0p79K01K75jL78m98l51K89M71m6l6
3706B73p98J19M89M37j63o54l29M22N46O1o4q26p3M69K84J68n87R7J41O2L47k72
$$ y = [-450, -514, 68, 311, 645, 28, -471, -386, 330, 646, 479, -231, -462, 78, 715, 369, 13, -421, -176, 245, 757, 315, -330, -615, -328, 520, 569, -128, -289, -384, -165, 383, 286, -242, -477, -194, 394, 842, -175, -382, -425, 44, 661, 572, -193, -635, -409, 127, 542, 93, -478, -96, 114, 811, 352, -202, -230, -263, 257, 519, 233, -395, -884, -291, 304, 283, 124, -492, -278, 567, 255, 237, -388, -211, -103, 273, 548, -221, -435, -183, 559, 439, 94, -290, -407, 199, 486, 129, -118, -362, -184, 432, 234, 273, -253, -532, 143, 706, 105, -298, -729, -53, 508, 555, -142, -544, -644, 467, 419, 170, -46, -504, -156, 327, 581, -182, -418, -403, 228, 583, 227, -390, -597, -121, 445, 374, 151, -423, -443, -115, 416, 167, -506, -621, 24, -128, 300, 370, -409, -208, 67, 66, 444, -54, -405, -116, 355, 309, 273, -525, -406, 83, 520, 357, -297, -626, -204, 342, 403, 339, -487, -560, -91, 193, 361, -226, -129, 12, 74, 421, 149]
3728A49l13l36O24N15l28l39j84J14O20j60k82j51l85Q89j94l4m42j72J94N78
3748C63J7l69m34J29L05O74l01q25P3K17N32q1k92l26k46O60M49o51K64p46L71
3769b17N12K07n73m07J72L80L23L7o34K4j69M50M62n07m02j9M47K76p3n31m20
3790f62O34L75L3Jn06j18K92M55j12p12NJ53J41J30j17q0k28L75L37J28q17m0
3812c33Q6M87L02o20o0m19N00M01J54q21l47N82L76q2l24R8n60M85L89j35m62
3833c03o8K96K44J93k46l34j68M90j91J03k93q8p1O33J31j72m11JJ72N47j47m63
3855a45k66J38N26j27j84k88m8M07R9J24l08k94M08K56m4l10l12j41O30K53l14
3876F0j54m03K90K20N34m10k86P3k85O90n0n15J20j07M24K58m52p73O04L46O0
$$ y = [149, -164, -500, 124, 639, 311, -28, -212, -98, 522, 362, 80, -71, -456, 433, 239, 205, -237, -409, -215, 363, 380, 11, -423, -294, 11, 685, 384, -441, -368, -151, 381, 300, 8, -318, -564, 96, 545, -106, 158, -588, -217, 295, 502, -71, -478, -306, 74, 397, 434, -200, -176, -345, 105, 567, 60, -342, -361, 86, 362, 289, -242, -662, -28, 347, 380, 381, -125, -243, 49, 504, 392, -320, -315, -162, -21, 109, -8, -88, -316, 59, 396, 524, -293, -333, -247, 240, 542, -78, -138, -557, -57, 344, 498, -323, -670, -88, 288, 206, -118, -20, -580, -95, 294, 159, -303, -371, -75, 169, 362, 116, -218, -386, 104, -87, 16, -277, -365, -436, 197, 328, 156, -255, -254, -82, 465, 318, -145, -411, -273, 253, 126, -58, -346, -394, 13, 112, 236, -72, -366, 42, 298, 254, -56, -368, -509, 121, 374, 60, -94, -497, -207, 13, 547, 137, -149, -76, -361, 329, 279, -236, -116, -223, 201, 459, 7, -766, -162, 184, 244]
3897B44K6l90k08K3P5P68k21k96n52M86L67Q0l70m48N0M64J06k34j94j06K74P7
3919B1K98l71j54j46N80P1k2p29oK06O87j6m89j66J97M06L1Mn06l39L79K57J93
3942C86n14p43Q18J26M95l04n97J42J18K47L57n77m6k09M35J92M0o60k15J45N40
3963A76J56J72q49J49J37N15l37l34j88L58N54q7m22j78R4K19j11Lk71M6M40j15
3985A27N10p15k76L9L81J74Kk51m50L28M67k38K58o84J5L34Kk4k99m27O77M34
4007C84j74L1n96J46L77L45n57o9l90N22L37j88l11m64L45L72K9J13k45k96M0
4028b49M13o1p8l40K44L78j92J65m28n16O74J57m7o4k69r1M68oM28q15j88J58
4050b59L65L02o13m18K85K65J02K27o60J6O26K71j23k30m09J74k03P40k82j76
$$ y = [244, 270, -120, -328, -305, -230, 538, 317, 21, -531, -45, 322, 402, 32, -416, -366, 98, 204, -30, -224, -330, -56, 21, 319, -52, -206, -352, 228, 299, 277, -452, -458, -252, 435, 419, -70, -236, -39, 367, 398, 402, -104, -443, -64, 193, 386, -128, -871, -53, 73, 568, 264, -333, -191, -73, 174, 531, -46, -92, -301, 134, 326, 366, -294, -509, -364, 176, 332, 504, -345, -196, -59, 456, 119, -215, -403, -45, 509, 422, 0, -178, -84, 135, 24, 27, -244, -198, 242, 127, 637, -78, -354, -315, 66, 240, 242, -9, -459, -131, 336, 98, 356, -328, -313, 21, 23, -1, -300, -727, -50, 384, 210, 241, -355, -209, 168, 513, -44, -113, -503, 19, 356, 168, -143, -607, -262, 110, 139, 252, 7, -289, -249, 164, 103, 25, -315, -71, 307, 115, 280, -148, -664, 10, 167, 120, 56, -213, -304, 164, 158, 586, -229, -417, -259, 106, 408, -205, -623, -338, -73, 29, 256, -404, -388, 238, 509, 386, 156, -253, -79, -282, 458, 176, 0]
4070@j34j28O01J64p17r6J11K40J59J02l26l19L54m1N19l75m30N4k0N52k03j99
4092a32k13N9N43N8l66m42K32M84p8J06l64l24N98J81l4j97l78n8N32J73k02m37
4114b59j3o4L23N33o50K05k68N40o9m6l20m00K00P15K18o17j13K03j93J32l22
4135b65Q3j07K14J28L72l46l51r4O09K40l01l02K7j89M34J26n17K72N0r1O43n26
4157A09k35L6k51N39n3m11j89R4K78L08q1m52j02J42N34P8l4l76k54J97K48J98
4179C23n50P1P2L41n7j50j88k20M12j5O2l57q5K52LL65j58l36j59L96K93J86j051
4202e50K09K92Q9L69m88r4j15M27K24P8k94m27L67nL57l68m19K32J64N64j89l82
4224D1m60M05L27P9l26k31j79O28K38k62l80k62K63K02J62r5m14J67Q3L23l05
$$ y = [0, -134, -262, 339, 503, -214, -310, -199, 41, 200, 302, -24, -343, 11, -30, 489, 114, -316, -262, -282, 270, 67, -132, -345, -286, 257, 315, -51, -493, -261, 223, 145, 251, -113, -437, 161, 342, 308, 111, -267, -325, 207, 380, 178, -259, -272, -336, -13, 520, -130, 75, -193, 347, 278, 232, -88, -488, -288, 427, 645, 28, -85, 118, -75, 57, -265, -182, -289, -75, 53, 425, 79, -272, -366, 243, 483, 182, -120, -93, -282, 152, 278, -239, 33, 83, -8, 635, 109, -126, -90, -341, 198, 145, -266, -455, -361, -83, 225, 144, -308, -410, -268, 266, 344, 310, -66, -320, -123, 125, 323, -227, -156, -84, 257, 200, 50, -138, -358, 54, 39, 101, -256, -341, -89, -86, 279, 121, -215, -374, 22, 315, 501, -550, -341, -49, 40, 409, -79, -173, -288, 139, 363, 441, 147, -280, 87, 82, 439, 71, -348, -116, 48, 612, 423, 41, -419, -14, 313, 392, 66, -165, -344, 284, 522, 260, -120, -382, -119, 83, 245, 150, -264, -97, -14, 309, 4]
4245DK17q85Q26O3Lj43n74J87M47O5j38k72l67M01N82l15p0j50l01M32L29j28
4267B13n63J48K9M72r9K49m19k10J96J25K82m41k16J9L2N61l10j50o8J10L62j43
4289A79l35m26K21N24J73k40j66j93M51M6N9o3k73l28P42k6n01J11p9L05J09O5
4311C55n82nJ37K79J94j28j65k79ON18k65j15l88L85L19K78n12k67M8M22L29k13
4333C51n54j6N67m10L33k04k99r0N65O3j04o00p3L34M91k01Q3o71J78K24K00m0
4355A27l10k86L66K31Mm4Qk68p0P37j51k04l76J42M0L74j09m01k72L21k7L26k28
4378g0n11M01M69J01l33k96k6K67L02k39p4k26L54L7J05j9m30k3J82L94j58k90
4400h3k13K04J88M39l60j23n35N88K18o4o96q0L94K48K10j95l45L78n11N20O3
$$ y = [4, 221, -664, 162, 225, 228, 85, -489, -302, 145, 210, 72, -200, -567, -166, 416, 101, 31, -119, -420, 12, 341, 213, -350, -202, -173, 299, 200, 449, 30, -180, 16, 141, 423, -18, -234, -215, -183, 378, 68, -82, -150, -40, 322, 179, -156, -582, -361, 163, 336, 96, -70, -263, 188, 234, 293, 230, -43, -371, 371, 345, -156, -45, -124, 181, 290, 355, -227, -232, -95, 184, 378, 250, 85, -194, -188, 330, 65, -50, -438, -53, 266, 544, 32, -235, -187, 235, 564, 351, -203, -219, 348, -62, 271, 67, -232, -322, 243, 306, 202, -398, -471, -137, 354, 153, 236, -435, -257, -33, 167, 127, -183, -469, -103, 128, 132, 88, 96, -172, -242, 495, 344, 140, -236, -94, -54, 320, 211, -190, -462, -141, -168, 158, -70, -581, -180, 289, 390, 57, -239, -265, 2, 304, 65, -9, -235, 119, 156, 261, 242, -188, -211, -29, 365, 207, -83, -296, -92, 96, 535, 175, 52, -483, 105, 323, 259, -437, -517, -123, 125, 335, 140, -205, 173, -338, 182, 245]
4421B45o42K55p3M73o1j69l49J99M33l04M40o77j47M9L34O20l42p20K10J94J9
4442a3K59j84n60P6N46N51l81p18k7K38N27p6j34n18L00L49P6l9n12M1K14L06
4464C21j78l79L7M8M78n3k58j00m90L65O09l18l75j4R1K86K03m91J35l43P09n
4486B78O6k77l19q9M25n1n6l45j57O78j39K30m71q6J17M0O72o2o83l0J58M60J28
4509D87p48l0L47j8L45Qm66l98K94O09R6n12Q3l25L49k0m07R4M1J23J92n2j47
4532e5l32P5L59L41k76k24q3k35N49N8L8j99k75M57p0K47o37M0j22N90R1m70j58
4555b91n2N16J1qk13n28N53K1L44j70n36P5N56L80m63k46k53Q5N74P4j77k54l66
4578c68P11P2l32n56l0P64j80M87n22m56K46K31K14k62l70L5L29M38k06j82m97
$$ y = [245, -397, -142, -215, 258, 197, 28, -321, -122, 311, 7, 447, -230, -377, -328, 6, 626, 284, -436, -226, -32, -13, 246, 62, -498, -422, 124, 675, 294, -424, -451, -213, 314, 238, 104, -414, -114, 235, 311, 272, -240, -199, 15, 321, 143, -236, -199, -151, 327, 274, 16, -84, -574, -209, 400, 82, -293, -307, -216, 70, 273, -218, -83, -426, 283, 278, 344, 67, -252, -341, 84, 33, -23, -368, -525, 153, 14, 244, -227, -313, -196, -156, 516, 454, -229, -259, -101, 359, 487, -261, -291, 56, 38, 383, 391, -75, -473, -179, 430, 526, 14, 97, -228, 121, 101, -306, -212, -171, -48, 144, 92, -55, -387, -312, 47, 388, 112, -112, -195, -430, 119, 177, 215, 16, -259, 198, 128, 375, -262, -222, -344, 246, 337, -133, -291, -343, 173, 184, 176, -37, -565, -12, 9, 353, 183, -353, -278, 278, 658, 195, -51, -304, -219, 355, 429, 252, -2, -368, 343, 415, 83, -473, -503, 261, 81, 568, 46, -410, -164, 67, 281, 19, -351, -316, 13, 451, 245, 63, -434]
4599d34K59K18J26M39q28k51L48K38l8m58J84j84L36M17k17l91K13r1L10M53k58
4620C91q76J55L41L10j46m15j77K90M16k00Q6m04K11j09K01J40l18l21K77J62
4640A4K32N7j92l49N0L66K70k82n15J70K22K86j26m08k05M36J45K28m01m1L3K36
4662B26K5Kl44j73N8O14k80l02p5o0N54J81k46n59R2J94L11k81o5j98J51K00J23
4685A48n5n65J15L83L74k39n52rm0R06j42j70j00j30K12k06M54n70j0N8M65m1
4707B86m72o00L10O54J85ml37n38L38L60J43o0n19p5L87J96J23m23l53K42N92
4728D35Km20m2k09L01J82Q5o00J07l19P75L7j39m21j28N58P6J7j54l01j78K38
4750i8M50k38n42L16n2N57l9o66l6J72K44p6l5j86J3K42M16m84j21j68K45L49
$$ y = [-434, -175, 43, 169, 608, -220, -471, -123, 115, 77, -381, -197, -381, -45, 372, 155, -236, -23, -114, 196, 649, 391, -485, -330, 11, 321, 175, -240, -417, -127, 289, 89, 175, -229, -18, -127, 74, 214, -104, -425, -148, 14, 246, 303, 111, -238, -188, 178, 448, 166, -349, -179, 43, 329, 203, -205, -410, 26, 171, 399, -2, -43, -10, 226, 251, 253, -91, -264, -206, 408, 128, -174, -249, -309, 245, 426, 180, -379, -287, -93, 218, -63, -128, -326, -175, 25, 148, 93, -472, -357, 26, 400, 161, -391, -400, -440, 466, 324, 154, 54, -76, 136, -70, 384, -186, -196, -138, 327, 286, -186, -786, -476, 178, 363, 359, 22, -516, -178, 182, 325, 265, -254, -329, 58, 254, 377, -46, -399, -157, 435, 437, 17, -25, -234, 67, 249, 334, -266, -159, -478, 297, 334, 195, -226, -354, 204, 280, 297, 143, -158, -336, -98, 352, 114, -428, -112, -164, 393, 354, -312, -348, -176, 68, -8, -43, -229, -216, 26, 442, -42, -163, -331, -86, 263]
4772B63J83l26m43m0L02k3P41o88j74K66M0M33n24l37k55P14k76L45l89j99J28
4793b59N94J23n84m4j44R9L97q0n19J95J04M91r5K72j012L94L6J86k22j60K15
4814a3MK34R4k22k77j93N7P47k75k74n7j85N15M37l34l79j91L33J57R6l08l18
4836c52K16O45M4j36m56j89L49K78k38l30k0k81P61l7Q4m61k82K81O3M65m08l84
4858c88J40J48O81m10l85l74M43O01O0o63p2J62J22M77j49l05n22J84N20J19k49
4879A40k44l9M66k83K8k02r8K35K83j33j61n62k2Q24K60m05l02n2K82J81J56m93
4901a41J97m18M15L76n31R7k71j25N71%j48m54N0N46j32O7n66N2L41L66r2k93
4923i3k81R4K11N24m24m75K35J63J25K16k40m97K10M92Q2j86l22j18L30J70J31
$$ y = [263, 446, 120, -323, -363, -61, -84, 657, -31, -205, 61, 101, 534, 10, -327, -582, 132, -144, 201, -188, -387, -259, 335, 458, -126, -170, -314, -215, 182, 102, -417, -222, -118, 373, 278, 550, -462, -68, -32, 154, -68, -228, -13, -9, 225, 319, 97, -180, -373, -316, 431, 156, -118, -175, -360, 155, 592, 258, -121, -312, 21, 178, 274, -34, -352, -136, 509, 553, 417, -39, -228, 121, 399, 161, -169, -189, -470, 291, 254, 338, -123, -405, -124, -61, 404, -4, -388, -248, -100, 581, 171, -214, -588, -145, 456, 516, -147, -219, -57, 65, 542, 393, 88, -434, -250, 270, 389, 140, -104, -143, 323, 40, 68, -134, -232, 3, 286, 153, -8, -570, -592, 232, 492, 87, -215, -267, 15, 196, 352, -141, 56, -362, 53, 429, -102, -5, -276, -401, 170, 170, 22, -432, -382, 164, 32, 99, -467, -415, -74, 292, 200, -93, -374, -280, -69, 455, 31, -444, -209, -46, 79, 295, 55, -442, -232, 260, 342, 156, -166, -284, 46, 216, 347]
4944C47l70k42J33L45P4j68l14j78J48L86R8q5m92n39R72L32p20O4l5j85M87O25
4966F83n39n58K79K26P08o59k89j7J76K42J93k06n94l0O13j09O4j20l38K55L14
4987B94J6m96q6k64O35K81L3j12n23K24J12K88k63k80j0L03J40J62n23l37P31
5008C25l2j39M6o10Q6N09J60p3n12k26N52J97L6k94k88OJ47L12J17n19k97L5P34
5031B72J30k91o97J62K67O52j08l34m38j42P35K33k44o65K31L05J68jm41j83L47
5052d2L3R2J95n94J00M02j05K21j30m67p3M04M04k66n38P1J16M76j46m20J07M6
5074a14R7M80j97m52l12M22N02J69m55m92L0N40L19k95q61N8L43N57j51k48k48
5095c08J22L35j07J80l74k8kM15Q2l52k31L3N54m3j42k92j23M60j8N46n94o23
$$ y = [347, -23, -265, -132, 213, 287, 119, -195, -373, -225, 161, 259, 174, -318, -857, 115, 447, -273, -209, -244, -429, 58, 683, 144, -414, -135, 91, 799, 140, -149, -166, 10, 252, 445, 239, -355, -385, 228, 119, 183, 63, -275, -20, 294, 310, -186, -272, -536, 99, 380, 413, 301, -222, 2, 114, 402, 139, -141, -151, 152, 292, 454, -69, -406, 325, 293, 154, 200, -410, -324, 185, 345, 272, -240, -466, 86, 283, 319, 25, -263, -257, -110, 202, 319, -200, -497, -462, 272, 402, 111, -586, -424, -157, 495, 387, 53, -385, -527, 208, 441, 197, -468, -237, 68, 236, 235, -206, -389, -42, -9, 83, 278, -316, -216, 186, 81, 302, 172, -295, -368, 36, 440, 174, -364, -293, -177, 299, 153, -267, -160, -114, -17, 463, 266, -186, -498, -76, 426, 595, 140, -352, -322, 218, 537, 242, -619, -561, -218, 339, 188, -60, -308, -186, 149, 42, 222, -152, -180, -182, 233, 315, -37, -268, -235, 319, 276, 134, -158, -281, 179, 161, 707, 113, -510]
5117e10M17L66J24j32n53o1K99J30nj53l17L5L89N03n25k78l40N22N65k04k60
5138A2j38j08L81J78K2p98Q8L19J46J15l29j40K02q8L73J67n97qR5J37K02m22
5160a91j64L45L05M4o3l13rj65N63M05q50l45J58o0N17j19k77l6pM29j12lk87
5183b35P5K03L63k13k64n14O00L0M46n47k30K01L9K23j26l81q8L24L49J27l85
5204cm71J03K76M37k53m11j59J30N65P5j33o27K03K81K28j73j27Qj7L81Lm32J01
5227a5k49M68L26l27m24P8K9N67k02k31k70k35N45N13Rm45m42M6O98l71j47k95
5249c74J86J67L57j35m32r9n8N68K11k06n52j52M58L58rk20l66L3N10J18o5k35
5271F3k01m4K57K14m63l94K42L35J73o6m43J51K40L10p4k89k34k02O95k60j5j07
$$ y = [-510, -93, 273, 397, 265, -288, -349, -50, 80, 75, -78, -395, -360, 29, 532, 7, -271, -611, -89, 476, 272, 12, -126, -234, 147, 325, 347, -451, -363, -44, 102, 217, -112, -252, -50, -138, 235, 402, -195, -203, -108, 29, 231, -191, -355, -10, 295, 339, 276, -37, -46, -211, 352, 757, -93, -438, -280, -340, 177, 58, -219, -255, -262, 167, 55, 52, -235, -160, 43, 406, 193, -71, -585, 15, 45, 491, -56, -286, -85, -46, 177, 51, -330, -418, -94, 255, 382, -3, -474, -371, -95, 342, 89, -322, -481, -351, 214, 289, 156, -471, -268, 13, 241, 68, -59, -51, -68, 313, 316, -116, -15, -264, 204, 530, 203, -221, -143, -114, 453, 251, 20, -250, -485, 60, 573, 582, 137, -305, -259, 439, 68, -79, -374, -188, -21, 336, 201, -231, -330, -388, 180, 391, 185, -367, -519, -61, 297, 288, 68, -298, -265, 245, 363, 298, 63, -138, -182, 75, 289, -174, -568, -326, 9, 182, 116, -327, -176, 64, 374, 300, 11, -223, -425, 270, 10, -5, -112]
5293a12k86M02J12L68n18j26K45J36P6m31k88j37K69N43j04R9q23M13L86O5k01
5314H8j82m61J79P43j88q4l55K73N9K66j96m09j36J46M37K58o39P5k68L57K71
5335B34j94j88m00M51J23l5J36k43k61M54J70o7m27N7K1M20K26q28JP2L94M08
5357E24l69m41j19J40N14o1p0k49J4J41K28j70m12j22K70M01K23n05n63J00O01
5378G5L5J52m03l26M50p7K24j47m80J23M55L65l19l51r3J99M79j65j3l66n5L01
5400F3M00l61k61j77L76J83N7m02k41M28J44M4j62n04J71L97J31j27j40k84m46
5421g11Q17N34n84jj62l07L13O22n87k05J54l2N09j49l87j62J67O57j25m29L6
5442c2o04M83M89k07k77l89M25N18k08m3n61J77N20m8J86n09q8J41N2J50k52m2
$$ y = [-112, -398, 4, 116, 484, -34, -160, 85, 221, 297, -134, -422, -559, -290, 253, 149, 248, -575, -162, 224, 289, 88, -94, -555, -376, 367, 179, 95, -260, 13, 72, 338, 142, -267, -403, -257, 180, 438, -201, -126, -394, -37, 234, 40, -148, -548, -97, 26, -9, 127, -116, -377, 77, 247, 180, -247, -190, -169, 251, 477, -351, -350, -278, 116, 524, 155, -286, -405, -265, 249, 188, 118, -131, -117, 24, 252, 82, -330, -452, -182, 219, 442, -63, -626, -526, 75, 110, 262, -141, -467, -17, -94, 130, -17, -497, -374, 81, 446, 127, -224, -317, -118, 361, 196, 183, -183, -238, 63, 463, 102, -159, -336, 40, 223, 280, -122, -363, 65, 209, 253, 91, -413, -242, 155, 286, 159, 19, -265, -711, 106, 640, 56, 55, -107, -414, -101, 521, -66, -271, -117, -149, 360, 211, -176, -338, -171, 486, 361, -68, -32, -636, -153, 336, 129, -148, -537, -112, 406, 198, 155, -406, -229, 291, 243, 429, -80, -168, -27, 25, 175, -77, -119]
5464a19j56Q1M39l53j17P0p4J15J53J80k48o0J36K02k76J94j76q2K04J88m65k08
5486c72L26L0K44k45j47l99M70L62P0l51k67J27K9O04o8m75m15M66K56k64j28
5507a47o8o4L26j94L10m33j27J51L68K04L6o00j74K86O45m64R5l09k06Q39r6M4
5529D22r16r2O76K37O8l56l51M8M74L00l59j35k65J16K33q8m4k61Q9K55K43J9
5551C13p91L30L39j22j6l2j84R5L69Pl4n87K48pM42k13j23k13J23L66j63m8m8
5574E1n16K43N02M3m14o4j09K51L37l13l9j42m1O67j19k15l87J20J30J80L27p02
5596b10O9J6K76j44K6m78J12N14K7k47k87lK43L64l2k17n06n9Q21j11M4l40k72
5619c94K90N19m11K70m07O8K1L55j08j27R7J32J20q8o39k44L39J21M96l13K00
$$ y = [-119, -275, -194, 245, -108, -225, -155, -229, -114, 39, 219, -29, -89, 47, 249, -27, 167, -9, -91, 113, 301, -164, -372, -46, -16, 228, -17, -164, -563, -93, 269, 339, -12, -279, -152, -123, 481, 413, -62, -477, -11, 245, -19, -147, -215, -279, 47, -147, 163, -270, -397, -246, 122, 326, 362, -238, -412, -126, 519, 55, 150, -159, -365, 474, 378, 422, -494, -586, 90, 327, 395, 39, -312, -264, 210, 510, 151, 16, -249, -133, 100, 12, -32, -293, -204, 51, 294, 313, -478, -148, 191, 69, 53, 21, -163, -68, 301, 308, 274, -313, -65, -72, 370, 157, 34, -179, -56, 310, 147, 99, 51, -465, -222, 280, 323, -91, -155, -264, -13, 324, 11, -28, -170, -211, 456, 337, 122, -265, -145, -15, 165, 492, -210, -141, -125, 151, 7, 33, -445, -333, 181, 208, -39, -326, -329, -86, 278, 246, 29, -477, -536, 285, 174, 218, -122, -394, -104, 415, 4, 274, -133, -65, -44, 311, 203, 76, 173, 305, 425, 337, -302, -546, -207, -86, 410, 97, 297]
5640B97o75Q3M68M01k16o87J91J10J96K79p69j47L79L12j71L2k42j80M64L63l44
5661A44k58m33L65K35P2j35k57L4L58L06k97l29l46K69M78o3M4m57R9L94L69l31
5683B61o39j7M82J38P8j08l05K3J2L60O3l72k45r2P50l37k9l24O5o5P02q1m85
5706a65q8mK69n6m4j12r1K73K77j79j51l63M81K77p1k90j05j48L1L69k6k00k10
5729c26Q8M63K88j45p37K48j54L43J71j91k72J93J65J67m32m56N58p0K56P0j58
5750F9n64M84J35M9j25n3l9J15K04J94l59m92n7L68N09m37l3l52K34K36P7L4n05
5773c08O2L09J29P0n86J62Q9L05l11p8l5KK34R0L2o22kL01L99k17L23q10L04K05
5797D7K06j05l63k30L10L06P8n11k00L7L18J05R7j17k85J72L94J76l63m37J35
$$ y = [297, -378, -295, 173, 574, 358, -329, -138, -28, 168, 447, -322, -469, -90, 222, 51, 83, -159, -339, 125, 488, 144, -114, -547, -182, 53, 125, -10, -267, -233, 125, 431, 134, -195, -541, -272, 206, 143, 187, -270, -171, 223, 592, 261, -378, -395, 87, 225, 303, 195, -110, -87, -75, 285, 348, -24, -269, -361, 389, 52, 23, -301, -236, -301, 401, 320, -165, -253, -257, 12, -44, -88, -200, -291, -18, 259, 80, -71, -434, 47, 324, 253, -37, -142, -290, -259, 110, 84, -116, -326, -238, 225, 513, 368, -369, -121, -275, 68, 239, 48, -224, -31, 134, 301, -131, -587, -29, -99, 157, 227, 69, -495, -11, 124, 173, 48, -5, -44, 71, 275, 469, 110, -382, -439, -71, 438, 1, -32, -384, -150, 86, 163, 197, -308, -246, 63, 192, 262, -324, -162, -73, 232, -79, -157, -192, -190, 44, 134, 166, -456, -458, -157, 242, 25, 348, -462, -158, 47, 253, 148, -215, -445, -135, 171, 249, -262, -462, -425, -107, -2, 95, -22, -307, -135, 259, 435, 72, -365, -230]
5818b30L10K17o1k81j57K77J98q7l93l2K18r9L63j93k71k01J75N36P5l63n93K84
5840c08M32N0m1L7n28K13L99p8k77l93K25J44N09n6l40j29P1K42R5k53j09j73
5862b68K83l6ol3k85L43Q3N1j52j28O0Q4K51Q3j65n33M98J8J85o08j36m1M07L92
5886C47j06n44J06J52K2K67j41o22J53L37M96n41k72M43l95O82n9k74q9k10R3
5907a55N97l20p4l63J09N05K40l73l99o7N52L99l82j87l76N1N46K71l69n91K56
5928a30J19J69J44n54j69M43o2M48o94J57j38K90J82J68k46m28L11J39q5M27q06
5949c15j34N91N7K69p31R4J93q8J74ol00M5K52N7M7k06m04L83ML87j65k79k31
5972c06L93r3L04m14n8o0M32K8l69l1j69J74R7K12j59m91M33K55J21m2k07m02
$$ y = [-230, 80, 297, 236, -45, -202, 75, 273, 186, -207, -239, -21, -120, 243, 50, -221, -422, -247, 289, 364, 1, -592, -308, 124, 174, 133, 170, -358, -145, 254, 176, -101, -494, -269, -125, 384, 328, -12, -141, -70, 172, 267, 14, -95, -268, 15, -21, -27, -60, -345, -2, 81, 132, -20, -148, -88, -4, 247, 330, 165, -368, 130, 148, 333, -275, -411, -452, -45, 347, 241, -303, -197, -45, -23, 244, 103, -519, -366, -29, 467, -74, -346, 97, -298, 384, 325, 51, -38, -248, -155, 442, 122, 48, -315, -206, 299, 539, 166, -233, -300, 252, 651, 269, 82, -294, -243, 303, 574, 205, -386, -130, -11, 158, 302, -252, -421, 22, -40, 408, -286, -129, -267, 23, 205, 373, 127, -301, 10, 149, 64, 491, -315, -449, 142, 199, 468, -263, -169, 24, -64, 110, 104, -196, -151, 101, 158, 205, -1, -405, -22, -18, 369, 204, -75, -306, 87, -6, 298, -116, -174, -234, 198, 226, -143, -174, -343, -169, -72, 140, -19, -510, -77, 178, 299, 257, 50, -352]
5994c52J28M18j98Q5m33K53J23j5p1k80r9K48J31J14J65m20j49K40L24p8l73K87
6016D8l59L10k1J86n02L7L48K41l49L4p4R1p4N54k29n94L47k20P60l50l19k82
6038d17K19L65J27n83j47M08p4L00M1n72r0M14J58J41k32k25j2L78J29m52P3l52
6060d03K61M81j81j51K66m25J92L69p5n70j7J19M94m6m59p4m41M54Q23n81j42
6081a06K3K89J56O5l30o3l97O04J4k28J07l88K75k01M51j24n10J31J20J75m0l50
6103c27r9J46K39J46j11j66r5K14M32j94j16k33j95L99M12l01l53J99Q6Q0J28
6124B91o73J57J77L34l49J63j38P8J7R2m4n22L48K1K54k8j26k65l1K09M16k76
6146A05j89l49M50K87j33k75k97O7M06L72m76M2l82K11J39L27j06k75j22K30K18
$$ y = [-352, -224, 194, -4, 81, -352, -99, 24, 9, -62, -342, -441, -193, -62, 52, 217, -203, -352, -112, 212, 134, -239, 48, -311, -1, -22, 164, -338, -301, 47, 288, -61, -27, -101, -10, -84, 470, 241, -353, -6, -226, 534, 184, -135, -417, -198, 167, 294, -289, -436, -28, -102, 198, 239, -333, -423, -9, 149, 290, 58, -167, -179, 199, 328, -124, -51, -403, -142, 339, 158, 7, 273, -152, 40, 409, 334, -236, -253, -134, 360, 314, -145, -219, -660, -206, 617, 36, -106, -83, 206, 362, 427, 97, 34, -363, 241, 255, 27, 134, -254, 21, -180, 271, 147, -363, -232, -112, 63, 23, -327, -426, -280, -41, 105, -6, -172, -267, -53, 379, 185, 69, -164, -359, 40, 452, 151, -202, -3, 83, 163, 291, -382, -225, -48, 286, -63, 100, -38, 40, 57, 149, 105, -417, -69, -48, 206, 178, 52, -213, -244, -35, 381, 105, -84, -433, 17, 304, 171, -104, -401, -334, 72, 444, -32, 10, -372, -161, -22, 305, 199, -76, -198, 32, 250]
6167B50j02l21n9j49O17k53L92p64M1K70M36m80O6m8m0K32J2l2m32M05K95l53
6189a7jk0j42M9K58O7l0j66Q8l24J20L35k99K88k55M78k84k79j38q1J78K45K28
6212B98m93K13m63N10O0N6j60j30N9K18K45m94m1n1J05L16J03o19L36LN2P3l51
6235a55j7J27J29J61L5j64m25L98J47j50j7j00k18L5J19m3L8J49k65L97p3k25
6257a17l8L9q3K15J96o41L28j38L29K96l85n92R8O50J25j95k80n6J17O36l70l48
6279b14O6k31L66L85j76l24q3P2N38K4o90K20j52L24K7K8l3k01R3K05o6k4l5j87
6303f8j9P09m63m22l3L27J14J29j40m91K56J58L8m6n7k0Q1K15kj44j74J6N9K57
6327B80j60j04j64k11N34j79j66K35j31QQ7L32n49K63l38N50k10J73m07k59N87
$$ y = [250, 148, -173, -232, -381, 236, -17, 375, -389, -348, -78, 358, -122, -56, -104, -144, 88, 100, 68, -364, 41, 336, -17, -18, -38, -180, -131, 127, 194, 164, -2, 86, -238, -118, 217, -82, 206, -49, 429, 145, -134, -272, -353, -175, 70, 298, -195, 18, -445, 65, 125, 181, 21, -109, -50, 168, 413, -81, -122, -173, -68, 248, 351, -268, 68, 71, 123, 196, -155, -172, -45, 84, 245, 280, 116, -309, 89, 236, 86, 69, -31, -249, -214, -95, -138, -100, 49, -216, 181, 108, -117, -155, -116, -199, 16, 212, -429, -101, -239, 90, 386, 1, -591, -493, 157, 282, 87, -193, -249, -132, 504, 134, -214, -148, -379, -13, 372, 196, -128, -211, -139, 399, 423, -267, -47, -199, 125, 152, 180, 147, -54, 39, 244, 178, 154, 119, -68, -87, 622, 159, -263, -296, 31, 145, 274, 134, -357, -101, 57, 95, 49, -8, -28, 53, 268, 266, 122, -52, -36, 23, 280, 120, 16, -148, -359, 175, -4, -170, 65, -66, -58, 29, 361, -188, 75, -263, 287, 77, 250, -157, -416, 171]
6348A71pK08k15l35K9L17N4l37K1J46J56k0J52n06k78N32j09M19j26m66K0L09
6370A35M2J6p0l15j66P24R3m66K42k45OJ5K62l88l48L97K24o3l2k76J98m9K04
6393A40K52m35j40j70O23m4j83k33K9M31J73l43j01k39mM59j86K15m86j95O04
6414A67k35L02j94o65O93L5P0k0j74k55K62K45N2m05l18K04M94M2k47L3k17J16
6436a5J18L54j19n57k64N98L04l99K2j60j34J92K26l53N4J46j03K96k4k29q6Q0
6458e3J73j49p9L7q9K45K48k55r1n31L65K57P5m94n1M8M18K69m78j5l27M13K36
6481A72Q4j95j16Mn1K77k27J55m19M14J29j48k09K16O9j94K81l5l08l5K03J70
6503B37l79P8l9k77M70o8J15j89j50K69q3J23m17Q9L18j23K59j48j54k25K06K4
$$ y = [171, 164, 372, 157, -178, -149, 168, 222, -115, -94, 52, 208, 188, 340, -166, -444, 88, -21, 398, 272, -194, -174, 135, 177, 193, 123, -192, -358, 366, 459, -7, 235, -10, -4, 11, 273, -115, -463, -66, 158, 95, 63, -213, -15, -64, 140, 392, -43, -183, -353, 270, 226, 43, -190, -161, 270, 443, 100, -1, -240, -244, 215, 29, 244, -242, -437, 167, -68, 234, 40, -625, 68, 103, 173, 153, -21, -276, -14, 231, 283, -122, -440, -236, 258, 300, 53, 86, -131, -15, 103, 457, 338, -219, -483, 115, 419, 20, 42, -118, -252, -60, 166, -187, -133, 13, -90, 206, 182, -47, -133, -53, 120, -29, -108, -71, -160, 85, 333, 78, -13, -544, -179, 78, 153, -341, -392, -344, 74, 343, -135, -150, -477, -64, 172, 256, 61, -55, -51, -102, 175, -52, 103, -316, 98, 227, 79, -130, 86, 155, -39, 242, 207, -101, -136, 67, 237, -142, -64, -103, -380, 90, 22, 137, -52, -202, 67, -16, 107, -310, -221, 97, -26, 233, 85, -69, -294, -88, -64]
6525f4K45K03p19J23J61K87l33o4K52n19K87J88j19j00Q2p1N41k08k10k59j23
6546d20M70M3j19J61k87O0L19m62N8p8j68O72J87k64J46p16L68p0O56p41k34N89
6568A70r8J32l14k0R4K11L7k33K22o57J00L87l4m6k98L32N5K70k91K94j53k29
6590f9NJ63j68or3J01K11J21n26J20K13j68M18O6l07k95K84N13p00J98k43J93
6612C1j01J09L6l53L4J44R1j3L7q3l4L3M28m54k0N0r7L40j6k84q9K72rK45j10
6637A87m89O7J54L34nl14k80K52L8P7j39K95n18L26J39J90j67r9k29J79K29l05
6659g8J47m24K32J60p9J06k80M7K92K17k03j35j58l1M31Oj29j72r2n4M6L48l39
6682a42O6m6K38K49k73n64L43L02j18N2n2l11J31P8N38o35K3k99L99J17J44l28
$$ y = [-64, 181, 384, -335, -212, -51, 236, -97, -161, 91, -428, -141, 47, -72, -172, -90, -161, 380, 172, -38, -297, -420, 50, 93, -26, 135, -152, -92, 227, -235, -177, -255, -423, 249, 436, 172, 318, -398, -30, -100, 556, -185, -419, 170, 72, 204, -110, -130, -36, 175, 212, -21, 201, -456, -356, 31, -3, -49, -347, -15, 40, 310, 19, 313, 160, -69, -64, 99, -69, -75, -168, -67, 144, 265, -261, -141, 72, -96, 322, 388, 81, -214, 70, 583, -117, 81, -162, 31, -70, 39, 75, -278, -244, -100, -9, -22, 15, -68, -102, -69, 359, -95, -115, -65, -162, 178, 162, -122, -211, 61, 52, 297, 187, -302, -235, -81, 253, 248, -66, -346, -94, -56, 21, -118, 177, -341, -15, 124, 314, 147, 48, -181, -2, 227, -78, 69, -355, -123, 37, -42, 64, -216, -169, 123, 340, 137, 2, -156, -187, 244, 250, 121, -51, -143, -197, -151, 197, -142, -76, -122, 116, 365, 92, -472, -129, 173, 55, 107, 55, -256, -125, -47, 491, -144, -121, -420, -21, 96, 240, -88]
6704h8O1j78K88J55l73J11k43M03J11j78J13l70J31L4L0l0l15K00L6J11K70k02
6726G7k73k8L40K9J19k66k54N42J32l45J78l46L51j56R1j69r6k43K33N59n43N2
6748a6l87J17K40L22O7l03l01L98k68N16n10K8K6J75O0m5k41KJ88l9J27j84k30
6771b58P4O40m33K70l28j86K88P2l03J12k21O4K1Q9J36j77K5L0L47j11J72n60
6793b37J16L43k7m6m15J76M0K26p8lk25k16M98R8M9p58J21M74j51M29K2q07K09
6816a62K37O3J39m04r3J79K57L1j78k33J06K60O8k20n2l66N29J81j73k01p0J09
6838GK61j41j75P2k50J54J85j12L65n56R3P9J43k61J42J19K50k81J56om02J34
6860b4Q8k1j88k6j67rM79l01M3j08j11O9K55N8j51j46L38J35L5m96o0L99j86N40
$$ y = [-88, -27, -205, 83, 238, -135, -24, -267, 136, 247, 69, 182, -188, -57, -23, 7, -23, -338, -138, -102, 9, 279, 77, -196, -224, 116, 145, 264, -2, -256, 286, 418, 73, 251, -95, 256, 100, 191, 22, -74, -317, -84, 475, -68, -16, -403, -286, -46, 276, 343, 40, -261, 137, -131, 385, -125, -97, -71, 104, 164, 119, -122, -120, 68, 29, 156, -28, -258, -184, 456, 23, 293, -35, -221, 67, 139, -164, -52, -273, -209, -188, -99, 37, -140, -115, -85, 262, 151, 323, -237, -121, 222, 195, 149, -266, -90, -50, 176, 98, 95, -130, -346, 152, 250, 299, -459, -338, 136, -15, 414, 436, -371, -162, 75, 138, 277, -127, -220, -41, 216, 247, 69, -164, -58, 202, 270, 50, -2, -368, 161, 342, 169, -32, -102, 7, 268, 127, -48, 24, -226, -72, 113, 1, 366, -190, -97, -18, 125, -136, 6, 125, 375, 94, 250, 244, -158, -24, 64, 43, -145, -171, -338, -347, 132, -169, -126, -234, -345, -276, -21, 37, -114, -260, 78, 213, 248, -248, -308, 91, -95, 445]
6884D45l04m3l94L57J40l2k7k56M9O1L19m64k3l17J76O35j31j05o8k46R7L08N8
6907B35l69K95l04PM45l69On2mJ87J72n48K67l91N00p3N2k17l20O05K14j75l36
6930a73O9J03J39J09m70J43k93M14J19j35m20J59j17L89J61l70N4k66J43N56k10
6951A04l9j78n0O8P0K30m30m3L63K4K17l21j85KL30J79k26j71OJ59kK04k83Q0
6975A08m5j38ll1K13m62N03J42l26Po8l56P34m43K72J3l36K60J45j06J8k8j12
6998c9K07m9O2k44j39O8K49J08j07l09L07k6K63k56l62K63l32J99J65k83M8K12
7020EJ80l63K57p0r7P8j38N37m04k82K54J78QL5k98m3K52j84J84j47jj98O90k31
7044B02n9k24k38O13qn1j97j44j55R3L93j34k69jJ19O9O5k01k11J91K76kr3j03
$$ y = [445, 141, 98, -296, 61, 201, 169, 142, -114, -65, -4, 315, -149, -172, -489, -313, 322, 191, 86, 18, -228, -131, 177, 235, -134, 161, -143, -136, 309, -60, -54, -106, -110, 77, 249, -299, -32, -423, 77, 4, 56, -161, -481, 124, 338, 163, -173, -104, -1, 138, 247, -223, -80, -373, 41, 160, 25, -395, -236, -353, 36, 197, -173, -119, -385, -242, 314, 104, 65, -113, -163, -95, -25, 205, -225, -268, 95, 119, 336, 15, -170, -168, 162, 341, 115, -56, -50, 109, 107, 311, 28, 108, 63, -75, -78, -109, 104, -358, 145, 287, -39, -32, -100, -456, 278, -165, 107, 120, -216, 44, 189, 83, 101, 73, -39, 168, 119, 181, -63, -202, -134, 115, 223, 116, -193, 114, 88, 351, 95, -267, -4, -336, -137, 28, -255, -207, 5, 185, -178, 79, 9, -88, -10, -148, 389, -15, -297, -43, 135, 143, 178, -120, -163, 89, -95, 89, -58, -59, -257, 433, 202, 143, -81, -319, 294, 286, 235, 38, -106, -261, -168, 225, 91, -178, -179, -60, 9, 74, -127, -338, -147, 129, 127, 34, -69]
7068f9Nj29N89r4k14j67Q8j06K11j10k00K00L74l36J18l16J62j30L55j86o0J10
7090I5k75j34L36O7l11K05K13n4l64M53k87j40j66L88j20J84k53M2K61j26L66
7111C80l65j26L1n3M36p2l83J81j25J38J55j17k84J22K05q9p6o0m9K80j20j2m4
7134d7o0m3J46p8p5K02j06k11N22l27j87%K00N9K41k9l57k71N36j54Lnr9L4J45
7159C9K3K08k78m12N42Q2k35K7k35K3K82J61J20l46k39J14L86m14j50J74n6L05
7181A21j26R3k00L7RK03N42m96m11J01R1K05K05k10k56q9R2K47l66nJ29p5J95
7204C6K43l77j62k40R28k72j14q3r3M94j92j18l06o7J56K68K8k1m68M01L6L99
7226D76o83O3Q1K06J63j84j82l31M42N2k5k38L22m64M18k17J96l04N2j80N43l0
$$ y = [-69, -64, -193, 396, 302, 88, -79, 9, -97, 114, 4, -196, 4, 378, 42, 160, -156, 6, -124, 231, 45, -15, 95, -180, -314, 22, 89, -222, -17, 196, 142, -222, 231, -56, -196, -362, 26, -94, 90, -163, -121, 140, 14, 380, 15, -111, -80, -133, 303, 231, -152, 29, -96, 42, 197, 80, -204, -82, 123, 34, -42, -102, -151, 129, 9, -3, -47, -107, -150, -4, -82, -157, 45, -61, -272, 250, -77, -264, -264, -64, -5, 236, 207, -150, -421, 115, -39, -36, -41, -140, -106, 39, 62, 270, -8, -420, 122, 204, -31, -4, -239, -216, 66, 227, 347, 1, -238, -124, 262, -152, -302, -128, -184, 121, -5, 88, -112, -75, -66, 137, 679, 183, -228, -127, -36, 169, 374, 164, -92, -181, -89, 158, -208, -213, -84, -159, 36, 279, -98, -260, -500, 428, 156, 42, -41, -134, 360, 168, 50, -256, -323, -167, 101, 129, 108, -360, 41, 77, 476, -207, -144, -63, 143, 306, 122, -60, -391, 51, 103, 78, -160, 162, -302, 116, -101, 95, -209, -157, -337, 206, 176]
7248A76k21J12l71Q9L65L1n77L90k49N95m19k34J75k01M32l62L70Q3l07M2J63
7269H2j6O2k84J77J1Oj7k77M50j67j49J50K29j33k78L07P4k86J41l08K68j81J27
7292a2M07l47m5J16m0j15K95j61l74N01Mq0l59N21k52r8R6J30k19n7J14L1j49
7315i3Jn9K23J61l87L56l50j8J74M23j96l54O2l1K07K9N5j22m18L41k06K42k01
7338a61K49J16l7J01n5n1j61q7J46mO7j44k25N50j61m9l38N8J68J1K84l90k56
7361c69L81J8N5O1j68j21L59j11j0j16j37Q9K00J86l50k7j55M72k04Rk68k58L90
7384g4K14m8o2m47O18j70m6J86nl31M4n8n3K28j48l0oK67q6M9p2Rj40K41j30m8
7410i8K95m7j7k11o2M79n7rk02j05j12j06K70j74K21k60K62k12M53p1k68m01J02
$$ y = [176, -45, 67, -304, -215, 150, 181, -396, -6, -255, 340, -79, -313, -138, -339, 93, -269, 101, 184, -123, -81, 82, 66, 128, -156, 21, 32, 38, 21, -256, 194, 27, -122, 28, 257, 124, -154, 153, 227, -59, 82, -226, 42, -139, -12, 395, 48, 3, 119, 79, -36, 259, 98, -276, 225, 229, 149, -210, 311, 59, -39, 57, 187, -32, -89, 25, 56, -93, -92, -151, 72, 233, -154, 202, -148, -166, 8, 431, 235, -119, -57, -88, 119, 148, 203, 81, -337, 4, -202, 40, -161, 88, 204, 167, 268, 213, 162, 1, -86, 60, 56, 123, -21, -246, 304, 143, 94, -244, -186, -18, -7, 277, -113, -369, 12, 30, 85, 146, -22, -143, 216, 105, 95, -21, -158, -69, 131, 317, -33, -60, -215, 257, 53, 62, -206, -464, -74, 140, 92, 30, -417, 201, 31, -15, 171, 166, -165, -121, -179, -232, -4, -152, -182, -188, 79, -7, 42, -30, -21, -161, 80, -50, -98, 197, 150, 133, -78, -140, 339, 282, 273, 71, -34, -146, -252, 18, -156, 65, -195, 67, -145, 308, 237, -31, -432, -330]
7433c30M88j63L13j52k29j82O10j45l12M6L40n16M72j36O2k97k73M03m3J71k48
7454a21J48K8j95K40k21ql76N13J22j05Ql46K90J44k55J24j92L9K35K8K13rl93
7477h9l7J15j1j85K23k46M79k20n4K3J00j94J90J93l09K08l01L63k30l23j32L99
7499c8k91P07R0n06O3k52J58L71k00m75J80R2K86n6j93k01L00l03L48j09j10k71
7521d10L82J43Q5j37J2j14J9j25K21k13l3K85k88L11J4r0k19M61j56k87m3L2k06
7544c56M58J00J0l39Q6J3J49J91k0o09N74l37P8j8j69P7J25K83j36l55L9J39k
7567a9M22k90k00K31k13J82q9j30p5l50O28j47l10M79j99J0L98l1k41L9n64N83
7589A14r8K65m56L70j06qJ62j57j26j3l02M68n25L52j5K01L15k87j15q4K11R6
$$ y = [-330, 158, -5, 308, 156, -73, -255, 355, 210, -102, -56, 284, -232, 240, 104, 166, -131, -404, -1, -44, 127, -121, 27, 55, -140, 100, -121, -129, -505, 8, 130, 25, 33, -313, -23, 121, -134, -10, -202, -163, 72, 100, 313, 304, -89, -126, -11, -22, -207, 16, -230, 249, 29, -25, -2, 98, -96, 94, 287, -22, 186, -115, 248, 18, -305, -437, -38, -329, 378, 468, -38, 25, -227, -69, 302, 102, -373, -193, -101, 185, 129, -64, -265, 35, -268, 80, -29, -139, -410, -28, 115, 200, 63, 75, -39, -20, -145, 76, -137, -170, 115, -173, 138, 152, 62, -157, 304, 148, -139, -182, -150, -356, 102, 202, 212, -127, -41, -28, 121, 312, 292, -317, 257, -80, -2, -20, -189, -112, 13, 296, 160, -195, -156, -17, -19, 403, 113, -87, 144, -69, 113, 24, -106, -181, -531, 97, -50, -360, 119, -80, -70, 328, 297, 56, 95, -469, 114, 16, 281, -175, 195, 89, 81, 243, 86, -40, -53, -355, 113, -412, -60, -75, 126, 441, 154, 39, -45, 166, 262]
7611B62L35p73K90j65NK14Jm40L28k35K90k0J13k23k46L31k06L94n98J80K50k89
7633b02J09k5O0p6K8%L28o5k62KK01l72M04j16k4l5L68j87l9J3k8p1Mk63NK59
7659A6M7M3j79N2k23K97j11K75j73n8J80L0j52K92n96M16j15k80L64J84k10l01
7681b02J34J87jj49J1j86J72L40j59l4j93J44J77j17k20M44m72oP5K66j59j20
7703f8L40j73J27l81L35k86L43k56J56j26k31K45L0R0l19J18J36k0m0J03K9l63
7725b11Q3J02K31j26l31L23O2m00N01j35n16M24j55J73k27J61j96L08j06M48l25
7746H8l34L11l5J9j68l1J65k4O5ml91M32l60N87k17q1m21O65n8l3L1k79j18K61
7770G0K1j7l01J94q0n0K80k11K35k59J43lk20o4L60M2j26j33K58l19r2M7M50J10
$$ y = [262, 597, -176, 114, -51, -46, 168, 169, -271, 57, -178, 112, 92, 205, -18, -264, 67, -139, 255, -343, -163, 87, -202, -93, -118, -58, -134, -106, -106, 222, 157, -105, -103, 98, -274, 130, 14, -10, -45, 323, 136, 97, 110, 82, 11, 15, -248, -243, 16, 63, 106, -73, -21, -244, 53, -58, 217, 44, -14, 166, 196, 44, 336, -260, 156, 41, -239, 125, 309, 99, -202, -68, 119, 118, -31, -20, -206, -34, 306, 147, 113, -80, 64, 241, 124, -96, 348, -124, -130, -55, 211, 52, -68, 272, 99, 226, -155, 180, -106, 237, -19, 137, 11, -220, 25, 55, 145, -174, -56, 80, 60, 20, 123, 152, -211, -128, -26, 205, 79, -252, 71, 133, -267, 234, 99, -417, 7, -148, 25, -202, -41, -237, 71, -35, 413, 88, -246, 65, 30, 49, -119, -150, 15, -9, 56, 52, -339, 93, -267, 320, 103, 22, -399, 266, 208, 175, 206, -73, -191, 70, 91, 74, -227, -33, -113, -163, 117, -94, 141, -118, 25, 22, -198, -262, 98, 140, 14, -119, 139, -180, -272, -225, 225, 335]
7794C35k35j32o5R5k3P8k96n1o1M65j19M2op04N16J10j52K29j07k1L36j63q7o3
7818g9oM5J25k37M2l1L59j61k3jm4L2Jk70N7K7K98P7ml37J48p8m8J20P2J29n08
7845b95j1J50K55j22K6o4N1L80k38k58J02K66k98j13k22K89j78L56J78l3p3j62
7867a4p3Q1m4Ok74L74l21J99J96j5l34K81q1K34p0l94M60o21L98J43n4j82K00
7890I5k28J05M2j40Q4R2Q2J0k90J75p6j60M2L17k73j51M90l16J31K46p26Q09n79
7913b19L36P3k28k9L47j33k2J67n12l1M04n8Jj06r9K16j32l9M44l10k62R9J73
7936H0n4k56L00j62K2K24J33l16K6k65L00J09k22N0J9l7J58k92J32m37L81J9K22
7959A34K50k36l8Lm2P9j89L3o3M7J64l01J96n9PLr2K15j40J40l5j62K57l8l69
$$ y = [335, 100, -32, -97, -2, -25, 53, -243, -294, -355, 110, -9, 33, 27, -677, -161, -51, -203, 26, -81, -102, 234, 71, -16, -79, -85, -40, 85, -152, -110, -141, 218, 57, 34, 33, -11, 21, 22, -248, -191, -164, 134, 211, 207, -130, 18, -60, -108, 12, 84, 213, -295, -306, -156, 99, -23, 3, -61, -10, 370, 132, -126, -24, 242, -56, -169, -391, -102, -280, 76, 254, 221, 148, -14, -87, -6, -50, -44, -318, 56, -265, -66, 130, 115, -219, 62, -19, 215, 145, -249, 211, -410, -12, 131, 77, -105, 95, -133, -28, 14, -126, -42, 50, 132, 142, -148, 27, -49, -209, -167, 150, -123, -274, 216, -100, 31, 277, -449, 360, -219, 117, 190, -38, -67, 280, 147, 125, 292, -220, -251, 153, 95, 96, -10, -109, 107, -25, -64, 380, 70, -192, -93, 80, 26, -230, 70, -92, -70, 154, 287, -29, -3, -268, 32, 141, -81, -31, -12, -49, 109, -183, -51, -488, -107, -88, 134, 384, 148, 110, 113, 71, 150, -39, -6, -69, -22, 142, -159, 37, -22, -15, -12, -104, 111, -29, 111, 76, -86, 171, 133, -236]
7984b36O8K91k58N7k8L30J40p1l41L5M9j97L91j4Q2k54m7kj74o0K99k19K86P5
8008B02M8j14j9o4R7o9O5j97J79O4j35Q4K33m03j63L40l81N8J21j04K0L45k15
8031hK31l31r1j87M04k38M96o04K28M60K0m75J61k57K98K47r4m94K85J24j80J49
8053A44k49m2k68K93K50j10j36J39L07k95P3j80k00K70RJ7j61K55m9m3L8k47K33
8076D8k63O4J54L4j5Nm7P1k64K25j9j01J8j30L38k30l05J09L11J10k45J55J06
8099A29k13o6RO8J53k33R8P4J90l28lL92k18p8K21k90L3J34O6m6j87J42J98k35
8123A0J17J48l41j7p0j3L26l14K46j27l1K71k09J98j50K8k78M61j33m03M30k18
8145f9L17l30K2k90L68j98N09l76J01J21O6k8j23k68J83P1k10J92j76P2j61L00
$$ y = [-236, -168, 123, -135, -78, -106, 224, 364, 293, -48, -13, 36, -161, 230, 216, 298, 44, -3, -5, -179, -239, 60, -159, 127, 202, 250, 136, 117, 53, 150, 81, 146, -51, 128, 192, 57, 141, 374, -29, -192, 148, -233, -175, -54, -158, -138, 207, -8, 223, -108, -199, -386, 18, -220, 276, -328, -100, 360, 380, -95, 66, -191, 107, 354, 260, -234, 51, 175, -5, 144, -105, -147, -415, -122, 128, 18, -118, 21, 328, 33, 106, -74, -274, -4, 5, 22, -139, 116, 67, 24, 62, -185, 48, -215, -151, 3, 37, 22, 27, -20, 51, -213, 12, -7, -108, -90, -220, 118, -112, -417, -308, 3, 113, -132, 23, 129, -84, -150, -141, -73, 80, -153, -55, 19, 209, -119, -122, 270, 52, -26, 195, -95, -62, 72, 138, 92, -95, 47, 245, 10, 127, 275, -66, -83, -153, -166, 160, -154, 92, -35, -66, 205, -4, 194, 44, 72, -206, 255, 122, -281, 149, -69, 248, -82, -60, -350, 18, -180, 329, -47, 54, 175, 241, 213, 90, -178, 5, 76, -134, 58, -118, -46, -207, 93]
8167I3J72j93r0Q1k64J53P7j10K35l03K40K30l42j12K54j38q4M53n16M79m48L4
8189i9L62l48
$$ y = [93, 265, 72, -18, 63, -201, -48, 29, -81, 154, -149, 91, 321, -21, -133, 121, -17, -101, 352, -164, 315, -133, -99, 263, -85]
8191h5
$$ Imaginary data points
##PAGE= N=2
##DATA TABLE= (X++(I..I)), XYDATA
0@%%%%%%%qJ6j6J6j6K4l2L6m4N6o5P3q8J04j21J41j65J89k15K47k81L16l57M03
31B13m53N09n69O37p10P90q80R77j084J201j328J470j629J803j999K221k470K756
49A455l086L473l937M499n200O104p314R037j1705J6417k7206R8265O462j74161
63h6897K6329M4726M4110M2503l3508j28976o193J18587P4428n2774p1769l0480
75e9914K6925P2926N3547p0801j04488Q046Q4740M5210r054o4906o3501M0632
87d0638J03520J6748o8956n7669p948M4928P5086k341j04169n0838P0700O7319
99D5742O846k5780o6255l2539Q0816P7643m0206q2134l0644L0917O3470L3458
111F1334m1791p5328j1880P7275O3998k3521o3403m3365J1881P6810M2080o4634
$$ y = [0, 0, 0, 0, 0, 0, 0, 0, -8, 8, -8, 8, -8, 16, -16, 20, -24, 32, -33, 40, -48, 56, -65, 76, -89, 100, -115, 132, -149, 167, -190, 213, -240, 269, -300, 337, -373, 417, -463, 514, -570, 631, -697, 773, -856, 947, -1052, 1169, -1301, 1455, -1631, 1842, -2095, 2404, -2796, 3308, -4006, 5031, -6674, 9743, -17463, 80802, 87264, -86897, -60568, -15842, 28268, 70771, 37263, -91713, -97906, 20681, 95109, 42335, -29434, -59914, -32989, 39937, 93484, 22683, -81805, -73759, 10981, 56191, 47137, -17769, -81270, -40638, 62882, 79630, 10674, -46995, -54943, -10015, 65071, 62730, -41439, -92277, -21577, 45742, 52588, 26808, -39447, -71986, 8830, 86473, 46267, -35867, -66511, -35594, 27876, 61334, 19543, -55785, -67665, 9610, 73608, 50087, -13316, -56681, -44800, 32010, 74090, 9456]
123I456o8776L556M2574O1965K0464p7783o5531M6365P2047J2038l4067n4671
135c2363l5585M3207Q1042L18q0663l9165L8614N0174K8619j3809o8715l8810
147f7136N7866O6980j5934o0973l4235J2950N2755M7491k4349p4637j6355N9246
159C669M6432n091m4753n7001N557P4874L4336m4554n0764j1558L5843O2186J1500
172F0676o3383n4111K1565O1186K4922l1701n1873k6200L5502P1117R289o6674
184i685m0465K2885M5115L4992j4942o9684l2861M9981N7097j376m5288m2040
196d6271M592N6291M5261k5637o3494j9717L8736M5190Q463m2206n2953O129O0787
209A5171L5070k5944m7534j9106K8606N1021J3450m8479n1883J1535N1567K6247
$$ y = [9456, -59320, -55764, -13190, 48775, 69239, -8544, -74075, -27710, 44337, 56375, 22308, -32363, -67948, -24741, 56301, 56619, -24044, -63209, -24595, 25579, 54198, 40389, -28326, -67136, -9270, 57710, 41776, -19197, -53432, -40482, 12273, 59764, 35415, -39222, -55577, 3669, 50101, 45010, 257, -56744, -51187, 23687, 58023, 13469, -37295, -48853, -13010, 49176, 60676, -2707, -56818, -35253, 25933, 50855, 19154, -32719, -58919, -23417, 47700, 56989, -9685, -50150, -27265, 17850, 52842, 37900, -31784, -64645, -14664, 42433, 41057, -4231, -46271, -41679, 14612, 59873, 34236, -29258, -48975, -10239, 34951, 43414, 1208, -51745, -45616, 15171, 50241, 24297, -23237, -42343, -13737, 37284, 50734, 2255, -49628, -38093, 13474, 39721]
221C9721j7711m3494k9103L2612O1167N030m8843l6895N200M0784L7742j8299
233B7911n7286k3536L6876M9909Q161l8744m0338J737M6747M0229k1110n7002
245b6446k0473L0727M2208J4506l4512m9769L318N3847L3875j8422m4015k6204
257d1360K1608M9002J5615m2383m6136N742M3263L3258q676m4097k9367K6841
269a6690N0190R804l8294m0192j420L7901L5866q947m7806k5665K9291M6153R646
282C9837l0116l9081o671M0445L8362j7211m7070k0305K2260M1391J8612l1074
294I379m3458O01M2221L2158j2475m3051k6263J9222M4256J6597l3618m2246K056
307c4621L9704L2533o402m1104l0269K0537M5808J2147l2434l8019n395L5070
$$ y = [39721, 22010, -21484, -50587, -17975, 43192, 48222, -621, -37516, -32316, 8468, 46210, 27911, -29375, -52911, -16035, 33874, 42035, 3291, -37047, -35310, 11437, 51666, 30556, -26446, -46919, -16192, 26016, 40522, 6010, -43759, -40441, 13406, 47281, 28859, -15156, -41360, -19752, 29250, 44865, 2482, -43654, -37912, 5351, 38609, 29933, -14164, -43531, -16690, 33500, 43304, 5010, -35182, -36602, 1299, 37165, 28218, -19588, -45253, -15962, 30191, 39837, 9721, -29360, -36031, 4414, 42776, 25565, -21505, -41810, -19550, 21841, 40453, 9379, -34079, -33478, 8743, 40901, 28426, -14625, -40888, -21666, 22590, 39187, 5569, -36677, -34621, 5083, 37616, 31214, -9890, -40159, -19622, 26186, 38333, 5899, -32120, -37515, -2445]
319b445L8717n471m3797k5472K2153M0190J4925k5786m1800r673L7220L6066q565
332B6262l9650k4564J7511M0460J9947k4937m2403o760L6421L1895q629l5671
344a0118k7203J2319M2663K1407k8868l8316k033L1724L1538k047l8123l0987
356c8044J5694M1027J5197k5297l5408p276L1254L6185j209l9130k8322J6342
368a8987L8037J5128k2187l8042j1469L2868L6823l958l6665k4184J2886L6816
380A7066K1094k2076m1867r394L2287L1710k961l2388k8291J0255M0259K2403
392C8097k3252l7435q021K7213L1390J120l3718l1402J0437L9930J8840k0645
404A2554l2632j0385K4702L5671K329l6572k8826J2115L3095J7574j5753l5208
$$ y = [-2445, 36272, 30801, -12996, -38468, -16315, 23875, 38800, 13014, -28786, -38459, -1239, 34827, 26262, -13388, -37952, -20441, 20019, 39966, 15029, -27374, -34134, 2287, 34182, 25553, -10118, -37321, -25002, 17661, 39068, 10200, -28116, -30149, 1575, 33113, 31066, -7057, -38044, -22350, 18677, 33874, 8577, -26831, -34107, -2853, 33332, 32123, -7007, -35329, -18987, 19050, 34178, 11991, -26051, -37520, -4652, 32171, 28213, -8452, -32636, -19750, 17066, 38160, 16084, -25783, -35177, -2890, 28820, 25859, -6529, -34820, -24565, 15694, 38097, 14845, -22590, -30611, -3398, 27992, 29112, -4606, -36008, -25571, 14359, 33199, 12554, -20078, -30463, -5761, 29910, 32239, -4333, -33159, -21044, 12051, 29625, 13872, -21336]
416b1336j3162K8081L6027m09l2738k5079Q680L1561K1592j7110l8430j2283K8349
429f257L1879R3k7820k6590N503L5787K3398j9510l7151j0018K3868L0045M456
442B7683k9118l1650P909L7475K0453j6391l2184j4356K1285L4758M612l2617
454b141k8972O663L2185K1434j1693l3287j6063K2985L5297L539k9698k6381K395
467b3737K9052K4658j2271l6180j3433K3280L0351N975k3985k9335J715L2551
479H641K2598j5470l2215j2654J7679K9919J0062k6699l0469N980L2708J9012
491B9092j1827k8713j7786J6217L4739P125l0523k6894O393K7735K1567o364l2056
504a1295j9960K1245L4331K768k6042k5112j681K7572K6794q402l4908j5100K0271
$$ y = [-21336, -34498, -6417, 29610, 29201, -3537, -28616, -19936, 11625, 33217, 16107, -22323, -34606, -6257, 25622, 25715, -2105, -28695, -23192, 12595, 35993, 16483, -20668, -30686, -6818, 23227, 27683, -1435, -33085, -25176, 12299, 32752, 16361, -15823, -30179, -8894, 25864, 30476, -2141, -31113, -24450, 7735, 29169, 17476, -15811, -31874, -8889, 26408, 29947, 249, -26132, -23737, 5315, 29973, 17702, -18478, -31911, -8631, 21720, 27695, 3710, -25625, -23910, 8641, 31239, 15769, -16446, -29100, -11421, 18498, 28560, 1861, -28608, -22628, 10080, 29092, 17265, -11448, -29234, -13017, 21722, 28847, -1676, -28570, -22177, 5558, 27125, 20761, -11295, -31255, -10010, 24321, 27089, 1047, -24065, -25746, 1826, 28620, 20218, -14690, -29790, -9519]
517i519K9592Q152k1636k9402l382K9733K4688j1400l0094j4440J3885K9901J4006
530C0084k3244l1568K461K8244J9251p113k6091k1108J2976L3368J0062k5141
542B181k5107K348K3064K2174k993k9573k0773J6340L0673N684k0652k4990k919
555b4543K5266K5725o137l0309j5804J4812K7436J0178j9216l0318l883K8648
567A855K2989p801k5529j7001R698L1397J5365k3329k9954pK3608K0491k253k5511
581e982k2913J1229L3498J1860k1501k4301k605J8937K4656M99k9692k2059J3777
594a4597K7233J0182j5142k4542p401K2588K6450l765k7580j6616J0060K3602
606A0472J3470j4024l0296n234K5893K1400m456k0763j8224N571K9346J4698k0117
$$ y = [-9519, 20073, 28225, 6589, -22813, -26195, 3538, 28226, 16826, -13268, -27708, -13823, 16078, 30084, 6840, -24728, -22267, 5977, 25228, 18115, -7976, -29084, -16108, 17260, 27322, 2181, -22926, -20578, 2486, 24660, 21667, -7906, -28679, -12339, 18334, 24018, 3366, -21624, -24543, 723, 26448, 20311, -9998, -25802, -10990, 16446, 26624, 7408, -22910, -26793, 1855, 24844, 17043, -8486, -25487, -15789, 15608, 30973, 7644, -22310, -22317, 1291, 21782, 19529, -5982, -28895, -17666, 15832, 27692, 6191, -18110, -20715, -1778, 22878, 23377, -6315, -28374, -14597, 12636, 22818, 7676, -16866, -24267, -1679, 24771, 21006, -6574, -23190, -13130, 10472, 23942, 9918, -20378, -25612, 281, 21681, 17225, -3538, -21762, -16191, 13155, 27853, 7736]
619G736k7542k848K0622K1193M51k2800k2765R174L1138J2457j8673k3590o813
632b2260J7289K6078R72k7939k0738J0884K5945J3606j2202k6001j0021K0698
644c689K6375j417k5453j7775N109K2843J8211j1966k9672o332K1889K0632J380
657B0135j8844k2053K870K6851J5372j5070k4849o432J6632K1511M890k0619k3241
670b2847O864K7424J1050j2926k1494j0436J4991K5571K383k4499j8386Q138K2302
683H135J4044q881k4905j2072J8657K4912p99k2177j7311K672K2348J9363j0640
696A3346k6993q153J7410K1454L634j9269k2098J818K4310J7163j1606k3512q661
709b1157J3972K2244P638j9905k3340M554K2561J2767p484k1423j3437J3414K5238
$$ y = [7736, -19806, -22654, -2032, 19161, 19612, -3188, -25953, -16779, 14359, 26816, 8143, -15447, -22260, -4971, 21107, 22079, -5860, -26598, -15714, 10231, 23837, 11635, -14366, -24387, -3689, 22686, 21269, -4184, -21959, -16850, 5993, 24204, 12238, -17434, -23766, -1877, 18755, 20135, 1291, -20762, -17892, 8959, 24331, 9261, -15588, -22020, -5388, 16123, 21013, 394, -22847, -15983, 11441, 22491, 9565, -11929, -22365, -7374, 18197, 20580, -3919, -22305, -14167, 8135, 22179, 13298, -11607, -23679, -5022, 19890, 19091, -3086, -20397, -17725, 4623, 23986, 13346, -13647, -21800, -4390, 17064, 20698, 1429, -20669, -18851, 5459, 22622, 11016, -12496, -21157, -7185, 15059, 22697, 2792, -20548, -15994, 6567, 19334, 11850, -9573, -23010, -9596, 15642]
722A5642M566j9881j7641K445J8966J6117n858k3634j3538J5157K2655K171j6477
735F90j7832o26K1004J9021q797k3609r219J2712K0053N707j6602k1441j62K3284
749D183J6180q800k0586r729R848K2468Q729j9256k2365K682J9794J4492m432
762A3208k0721j4366J1540K4959O749j8267j9149OJ7617J6677k984k3181j4673
775b2585J2800K2093N786j3506j9153k778J9103J8411o034k0968j2121R394J9531
788I973Q364j3525k0863k144K0324J6385n693j7870j2510O982K1337R317j6686
801C391k0210J04J7260J5548k453j8552j4154R456K2641O972j6002j8585j567
814a6151J5031J7512j522k1322j4006J1025K0075P503j1475j9434m705J7022J8302
$$ y = [15642, 20208, 327, -17314, -14869, 4097, 20214, 14356, -9278, -22816, -7659, 14996, 17167, 690, -17142, -17768, 3236, 22257, 13460, -10149, -19368, -6656, 13397, 19104, 2502, -18939, -19101, 4183, 20363, 11563, -9023, -18752, -8904, 13564, 22293, 3037, -19328, -16646, 3148, 17640, 13208, -7513, -21879, -10339, 14620, 21369, 3102, -16047, -16041, 1576, 18253, 15269, -7912, -22585, -9785, 12308, 18094, 4588, -14565, -17343, 1760, 20171, 14137, -6831, -18952, -9558, 9973, 18337, 4812, -16051, -18195, 2129, 18514, 12821, -5049, -17559, -10577, 10760, 20077, 3391, -16819, -16715, 545, 16093, 13640, -4912, -19066, -9610, 13031, 20003, 4001, -14584, -16151, -1120, 16392, 14870, -6452, -20458, -9433, 10642, 18145, 6670, -12764, -17469, -447, 17855]
827A7855l587k0087j3036Q158J8374J0190j0743k0945m025J8713J6226l338j6714
840b959j4133M716K0294J0354j3123j9045k313J5095J6347m58j6991j4715N829
853a1102K0421Q324j2570j7306m152J2965J8121L31j9016j3299Q053J7751Q615
866A7136r410j8571o107J4476J8040k012j8165j1888O025J6881J1164r073k0034
879a1538m914J5691J5425j290j5776j4460M131J9244J1098j0554j8231m439J3468
892b145J5880J783j6380j5974N033J8887R037r575j6327o677J1869J8436K125
905A5972j7490j3954N194J6373R419p131j7573p952J2562J7789O08j5792j2250
918a4225L374J5438J2297p174j9432o274J2736J5113J214j3463j4402K109J7891
$$ y = [17855, 14268, -5819, -18855, -10697, 7677, 17867, 7124, -13821, -17846, 867, 17093, 13755, -2959, -17092, -12376, 7918, 18272, 5149, -13896, -16209, -1114, 15233, 14775, -2216, -16931, -11102, 9319, 17643, 5073, -12233, -16385, -3420, 14701, 15032, -3984, -17283, -9230, 8521, 17136, 7726, -10845, -16952, -2476, 15564, 13552, -4613, -16501, -10476, 6405, 17569, 8496, -11538, -16452, -761, 14664, 13374, -2402, -16862, -12731, 6513, 17611, 7057, -11174, -15613, -2145, 13735, 15518, -862, -16836, -11803, 7084, 16121, 6546, -9781, -16458, -4589, 13847, 15972, -1518, -15472, -10278, 6095, 15514, 8383, -9190, -17142, -4580, 13209, 13817, -1975, -14225, -10851, 4587, 16884, 9710, -9722, -15996, -3260, 11853, 13067, -396, -14798, -12689, 5202]
931E202J1632q712j7234n082J0745J5120L190j4823j6102L554J7396R865p060
944G691j5705p333J0228J7908K894j5853j4277L812J4290J0520n155j6817r382
957a7179J1784J7869J838j4186j2630O63J4574J3061n777j8464p657J1101J5347
970A0344K929j2084j3815K32J5926J2103o529j6134p335Q762J4945M822j3055
983A111j5066J624J5738J0434m941j4631q595Q565J6277L965j3729j3963J379
996a1832J3501J1534l232j6152q996J0189J6020K334j1431j3084j100J3727J2720
1009A4198m936j6645p398R127J4432M955j0564j4623j254J5316J1745n266j4941
1022e854p632N926J5334O814j1963j5757R98J4605J0502k879j3757j0549O333
$$ y = [5202, 16834, 8122, -9112, -14194, -3449, 11671, 14861, 38, -16064, -12510, 4886, 14751, 7691, -8014, -15347, -5119, 12789, 15683, -170, -14447, -10635, 3655, 14175, 9020, -7797, -17179, -5395, 12474, 14312, 126, -12504, -11841, 2733, 15794, 10017, -8447, -16104, -5003, 10344, 13273, 1189, -12626, -12394, 3532, 15635, 9106, -7028, -14363, -5601, 9344, 14166, 1111, -13955, -12331, 3407, 13841, 8900, -5731, -14326, -5761, 10516, 14481, 752, -13211, -11832, 1669, 13203, 9971, -6181, -15177, -4988, 11032, 13366, 1935, -11149, -12249, 1478, 14198, 9262, -7383, -14781, -5654, 8778, 13733, 3169, -11454, -12708, 2608, 14353, 9087, -5854, -13486, -7560, 7774, 14588, 2625, -13132, -12134, 2471, 12973, 10094, -3663, -14212, -7879]
1035g879J6896M971j2538j2841k29J1442J2134r94j4810j0547Q076J5212M055
1048A2948r915j2868k739J1927J3457k719j5192q116P309J3087N964q234j4755
1061i846k925J3726J1500l259j3467q652M668J5105O911r832j4274j003J2292
1074I44J0731j465j3168j0722N248J5551N755j0022j2153k169J0254J3311l99
1087A1696j5195r820O370J3630N325p576j3500m391J1827J4035k011j3874p781
1100a1265M176J2656P533p368j5614l201J2307J1478j534j1526r050L198J3742
1113E532Q017q834j3531k271J0390J0238J72j1410j1323M512J4679O023q185j1522
1127g513l432R345J2372K56j3391j0445N570J2192N997n800j2777m821J0816J2830
$$ y = [-7879, 9017, 13988, 1450, -11391, -11620, -178, 11956, 10962, -3848, -14395, -6319, 8893, 12948, 3033, -9835, -12574, -647, 12810, 10091, -5101, -13217, -5908, 7179, 13143, 4909, -9846, -12771, 955, 12455, 9196, -4271, -12923, -8255, 6850, 13761, 3929, -10345, -11348, 944, 11675, 10210, -2958, -13680, -8432, 7119, 12874, 2852, -9301, -11470, -1216, 12095, 11696, -3499, -13319, -6949, 6681, 12006, 4430, -9070, -13461, -1634, 12401, 10390, -3484, -11265, -7089, 5567, 13100, 5732, -9882, -13083, -776, 10702, 9168, -2358, -11408, -8210, 5532, 13549, 4715, -8816, -11087, -697, 9541, 9713, -1697, -13020, -8508, 6171, 12194, 4009, -7513, -10945, -1600, 10772, 11028, -2363, -12808, -7238, 4954, 10951, 5151, -7626, -12447, -1631, 11199]
1141A1199p93j2286q836L113J1705Q548o830j4678l154J0643J1353J5j0608j0082
1155a0691J775J3078Q782q031j2514l351P937J1384K182j1092j1350L535J3103
1168D747O364n590j1064n497P787J2377J211j2013r180K915J1104P333l960j2753
1182f219n413R443J1972n90r740q900Q48J1034R113n483j3479l342Q621J0130
1196G995J863q985j0980P18J3087Q110o746j1840l579O706J0854L802j0377j1505
1210a0877K899J1905P177n082j1006o217O662J2817J925j0225r833K017J0228
1223B390P877k863j2551o022Q238J0835J119q260r377n11J0572R388m387j1979
1237e531m503P402R350L285p858j1004k10J1437P874m921j0224m534N504J0956
$$ y = [11199, 10406, -1880, -10716, -7603, 4102, 12650, 5820, -8858, -12012, -1369, 9984, 9999, -609, -10691, -8916, 4162, 12944, 4913, -7601, -10952, -3015, 8369, 10551, -541, -11891, -8356, 4747, 11111, 5521, -5543, -11040, -3253, 9124, 10335, -1678, -10858, -7943, 3161, 10494, 6534, -6219, -11632, -2189, 9783, 9193, -547, -9447, -8599, 2435, 11548, 6065, -7414, -10756, -2135, 7995, 9858, 873, -10107, -9389, 3698, 11808, 5062, -6778, -10357, -3651, 7203, 11005, 628, -10877, -7978, 3927, 11104, 6022, -4984, -11201, -4539, 8278, 10203, -22, -9855, -7838, 2390, 10267, 7404, -5147, -11169, -2931, 7904, 9023, 763, -8614, -9125, 1447, 10835, 6448, -5531, -10034, -2632, 6718, 10003, 2145, -8859, -9069, 2368, 10242, 5321, -4903, -9437, -3933, 7023]
1251G023L282q713j0494P51J0221P682l549j0791n837N717J1777K580q729r422
1265h502M37R691Q503k658j2080n993O517J0632K560p397r915j260J0373R692
1279A0600l188j1154n667N451R543M019p079j1240r85J0712Q353k828r883o145
1293i491N268J0179L904q123r714m62R131P974k096r490p381N407J1396K880p338
1308B044q836j375P852R543k076j1035o337N736R893L268o140r338k127R561R375
1323A0008k761j0796n468M350R333M783o866j0233j733R683Q882k253r646o226
1337h943L857J0115M740p165j0075j490Q406Q581o09r525p019M020J0252M303
1351I448o592r141k384P644R204q47r773o682M215R218M295n189r275k736P941
$$ y = [7023, 10305, 1592, -8902, -8151, 2070, 9752, 6203, -4588, -10425, -4708, 7069, 9649, 920, -8502, -8065, 1626, 10129, 7471, -4609, -10602, -4085, 6547, 9107, 1710, -8205, -9465, 908, 10600, 7412, -3742, -9409, -3958, 5585, 9604, 2525, -8715, -9700, 1012, 9365, 6537, -3346, -9491, -4223, 5956, 9860, 1737, -7977, -8439, 692, 8666, 6570, -2920, -10301, -4894, 6502, 9382, 2044, -6792, -8167, -315, 9228, 7152, -3883, -10220, -4484, 5409, 8677, 2537, -6801, -8928, 633, 10008, 7247, -3549, -9017, -4667, 4666, 9449, 2583, -7650, -9383, 300, 9182, 6929, -2717, -8943, -5086, 5029, 9769, 2604, -7471, -8961, -555, 8026, 7417, -2108, -9127, -5107, 5145, 9448, 2856, -6285, -8669, -1025, 8179, 7332, -2441, -9123, -4908, 4310, 8605, 3416, -5859, -8595, -654]
1366f54R093j443r153o557L237R016N103n597r187k282P797Q928j208q586o823
1381h316K971Q974N042n502r370j847O825Q548L0q373p691L382R497M626n878
1396B918q754k826O783Q698M67q503p302L166R124M562m263r148l660P074Q643
1411F979j1q368o851K185Q853N841m254r338l431P008Q142M48p895o821J145Q939
1427B571N623m593q677k768N933Q330J222q074p330J938Q640M825l937q674k795
1442g766N514Q772R59p804p162K289P912N123l558r153l449O233Q311P98p229
1457b10o990J139Q427N476l201r299l385O167P939R19o967p099M59Q582O055l402
1473D610q724l177M797Q272J542o926p536L94Q408N743l328p462m002M475Q631
$$ y = [-654, 8439, 6996, -2157, -8714, -5477, 3539, 8642, 3045, -6142, -8424, -627, 8301, 7093, -1493, -8316, -5345, 3629, 8671, 3169, -6201, -8048, -1223, 7325, 7355, -1018, -8709, -5327, 4170, 8796, 2918, -5836, -8662, -1879, 6819, 7286, -1217, -8519, -5353, 3771, 8333, 4070, -5078, -8738, -1664, 6979, 6968, -1400, -8251, -6066, 2787, 8628, 4374, -4964, -8395, -1387, 6755, 7203, -692, -7513, -6368, 2571, 8194, 3601, -5076, -7844, -1911, 6419, 7641, -433, -7763, -5825, 2815, 7640, 3703, -4971, -7766, -2252, 6520, 7479, -325, -7487, -5198, 2714, 7837, 4279, -4874, -8323, -2090, 6221, 7019, -210, -7200, -6061, 2366, 7842, 4641, -4658, -8043, -1876, 6063, 6982, 15, -7084, -6625, 1957, 8012, 4610, -4114, -7291, -2494, 5778, 7320, 394, -7142, -6748, 1660, 7403, 4075, -3387, -7389, -2914, 5717]
1488E717K009o835p564O99P537N344k314q097m448N128P922K211o557o788M22
1503e614P223N757k226q855l965N310P237J485n249p612J23P957N622k602p811
1518c220l580L765P299K726n842q060M85P868N635k577p179m315L549Q314K821
1533G689o749o965j02O893N753j574p602m751M212Q036K110n863o551n36O276
1548B76O650j762q344m353M455P393J956m666o931j099O994O314j816p831l930
1563f694L060P026L487n138p494k88O787N416j375o596m670K693Q047K532n443
1578A350o954m94N735O056j83p526m749L139P759K479m967o574j653O444O287
1593F149j141p453m456L133P236L416m527p068j933O875N950j637o372m626K320
$$ y = [5717, 7726, 891, -6673, -5974, 1563, 6907, 4593, -3504, -7952, -2824, 5098, 7309, 752, -6036, -5614, 1609, 7366, 5140, -3715, -7680, -2370, 4867, 6352, 1103, -6509, -6386, 1571, 7193, 4591, -3220, -6800, -3035, 4264, 6990, 1148, -6912, -6427, 1441, 7076, 4499, -2680, -6995, -3446, 4868, 7689, 940, -6025, -6127, 766, 6519, 4945, -2657, -7408, -3196, 4840, 6950, 1087, -5464, -6000, 276, 6926, 5164, -3180, -7533, -3078, 4315, 6271, 1605, -5326, -6425, 569, 6883, 5067, -2764, -6694, -3634, 3392, 6879, 1741, -5753, -6041, 746, 6162, 4787, -1809, -6479, -3786, 4261, 6793, 1350, -5604, -6098, -363, 5693, 5510, -2016, -6765, -3626, 4133, 6612, 1645, -4929, -6582, -138, 6149, 5008, -2445, -6901, -3768, 3468, 6884, 2357, -4711, -6644, 231, 6181, 4544, -1828, -6454, -4134]
1608d134P156M145n017p102o34N413N560j44o225n782K340P886L149n102n715
1623d206j721N285N934N06o888n295L000O669K522l460o452k439N564P046r84
1638E081o417m291K144O137L796l697p003k074O171N069o16n432m440R07P025
1653B360M515m541o593j258M949N491m8n574n963J889P519L453l721o358j597
1668e477M067O295J197o903n339K489N884L064k441o276l109N133O832j82n801
1683e67m550J427N560M040k828p156k123N082N674r1m757n017P01O856L919l410
1699B760o378j813L864N737J004n376n557J647O656L169l021n809k299L586N990
1714D160J504o358n028J586N734L576j737o224l058M313O106P04n313m598N77
$$ y = [-4134, 3022, 7167, 2150, -4952, -5586, -173, 5387, 5243, -982, -6764, -4424, 3462, 6611, 1509, -4206, -5927, -642, 5292, 5798, -1090, -6385, -3385, 3284, 5806, 2346, -4106, -6545, -981, 6065, 5081, -1336, -5627, -3483, 2654, 6450, 2753, -4250, -6324, -153, 4916, 4300, -1132, -5572, -4665, 2360, 6875, 2334, -4259, -5517, -568, 4923, 4875, -699, -6662, -4773, 2746, 6199, 2478, -3880, -5477, -1410, 4885, 6082, -821, -6160, -3671, 2213, 5277, 2836, -3440, -6549, -1416, 5416, 5234, -567, -5117, -3690, 1870, 5910, 3082, -4074, -6197, -1115, 4559, 4468, -289, -5306, -4605, 2251, 6170, 2760, -3618, -5431, -1567, 4170, 5174, -202, -5759, -4112, 2544, 5713, 2692, -3117, -5416, -1830, 4160, 5664, -694, -5722, -4136, 1598, 5174, 3437, -2787, -5845, -1532, 4574, 5278, -35, -4633, -4056]
1729d056N329M192k125o696k411M310N524R46m400n183M4O179M210l182n647k305
1745e271L141N572J940m880n766J282N428L605k053m980l276K816N917J544n147
1760a28m386K88N331M026j313n957l555L935N911O14m763m294K27M521M665j743
1776C379o041k364L101N079J888m017n033o87N283M610k051n492k574K425N577
1791C083K106m327n120R3N110L462r89n035l640K490O125J474m262m240l62M354
1807C22M311n10n904l192K672N277J268l385m606o25M622M329q47n637k532K364
$$ y = [-4056, 1273, 5465, 3340, -3356, -5767, -1457, 4067, 5013, 613, -4570, -4526, 1653, 5863, 2681, -2966, -5271, -2130, 3442, 5382, 502, -5264, -3982, 1446, 5051, 2998, -1982, -5258, -2442, 3475, 5019, -128, -4514, -4226, 1105, 5131, 3818, -2139, -5694, -1759, 4152, 4766, 3, -4291, -4064, 457, 5122, 3379, -2662, -5026, -1925, 3154, 5042, 1025, -4008, -4695, 588, 5198, 3147, -2345, -4919, -2494, 3083, 5189, 862, -4258, -4165, 945, 4407, 3418, -1617, -5257, -2767, 3358, 4832, 570, -3670, -4032, 322, 4633, 4123, -1781, -4973, -2301, 2976, 4244, 859, -3747, -4372, 250, 4579, 3732, -1905, -4437, -2073]
$$ [...]
8191a54
##END NTUPLES=NMR FID
##END=
