##TITLE=1H_DE-40Spext
 D2O
 8 sc, 
 1.4.2024
##JCAMPDX= 6.0         $$ Bruker NMR JCAMP-DX V2.0
##DATA TYPE= NMR FID
##DATA CLASS= NTUPLES
##ORIGIN= UXNMR, Bruker Analytische Messtechnik GmbH
##OWNER= root
$$ XWIN-NMR		Version 3.5
$$ Mon Apr  1 14:27:13 2024 Russian Standard Time (UT+4h)  she@DPX200
##.OBSERVE FREQUENCY= 200.1313
##.OBSERVE NUCLEUS= ^1H
##.DELAY= (6, 6)
##.ACQUISITION MODE= SIMULTANEOUS
##.ACQUISITION SCHEME= undefined
##.AVERAGES= 8
##.DIGITISER RES= 18
##SPECTROMETER/DATA SYSTEM= spect
##.PULSE SEQUENCE= zg30
##.SOLVENT NAME= D2O
##.SHIFT REFERENCE= (INTERNAL, D2O, 0, 15.7039)
##AUDIT TRAIL= $$ (NUMBER, WHEN, WHO, WHERE, WHAT)
$$ ##TITLE= Audit trail, XWIN-NMR		Version 3.5
$$ ##JCAMPDX= 5.01
$$ ##ORIGIN= Bruker BioSpin GmbH
$$ ##OWNER= she
$$ F:/spectra/data/she/nmr/H-F/1/audita.txt
$$ ##AUDIT TRAIL=  $$ (NUMBER, WHEN, WHO, WHERE, WHAT)
(   1,<2024-04-01 14:26:08.65 +0400>,<she>,<DPX200>,
      <created by zg, POWCHK disabled, PULCHK disabled
       configuration hash MD5:
       00 E9 B6 7A A2 85 ED C7 34 08 36 98 17 FE 4E 26
       data hash MD5: 16K
       0A AA BD C9 D2 E2 83 FA C6 68 AA BC 92 54 DD C0>)
$$ ##END=
$$ 
$$ hash MD5
$$ C4 DB 8F C9 19 59 1F D3 37 D2 8D 87 90 D6 64 63
##$RELAX= 
##$RELAX= 
##$RELAX= 
##$RELAX= 
##$RELAX= 
##$RELAX= 
$$ Bruker specific parameters
$$ --------------------------
##$DU= <F:/spectra>
##$EXPNO= 1
##$NAME= <H-F>
##$PROCNO= 1
##$TYPE= <nmr>
##$USER= <she>
##$AMP= (0..31)
100 100 100 100 100 100 100 100 100 100 100 100 100 100 100 100 100 100 
100 100 100 100 100 100 100 100 100 100 100 100 100 100 
##$AQSEQ= 0
##$AQ_mod= 1
##$AUNM= <au_zg>
##$AUTOPOS= <>
##$BF1= 200.13
##$BF2= 200.13
##$BF3= 200.13
##$BF4= 200.13
##$BF5= 200.13
##$BF6= 200.13
##$BF7= 200.13
##$BF8= 200.13
##$BYTORDA= 1
##$CFDGTYP= 0
##$CFRGTYP= 5
##$CHEMSTR= <none>
##$CNST= (0..31)
1 1 145 1 1 1 1 1 1 1 1 1 1 1 1 1 1 1 1 1 1 1 1 1 1 1 1 1 1 1 1 1 
##$CPDPRG= <>
##$CPDPRG1= <>
##$CPDPRG2= <>
##$CPDPRG3= <>
##$CPDPRG4= <mlev>
##$CPDPRG5= <mlev>
##$CPDPRG6= <mlev>
##$CPDPRG7= <mlev>
##$CPDPRG8= <mlev>
##$CPDPRGB= <>
##$CPDPRGT= <>
##$D= (0..31)
0 1.2 0 0 0 0 0 0 0 0.06 0 0.03 0 0 0 0 0.0002 0 0 0 0 0 0 0 0 0 0 0 0 
0 0 0 
##$DATE= 1711967168
##$DBL= (0..7)
120 120 120 120 120 120 120 120 
##$DBP= (0..7)
150 150 150 150 150 150 150 150 
##$DBP07= 0
##$DBPNAM0= <>
##$DBPNAM1= <>
##$DBPNAM2= <>
##$DBPNAM3= <>
##$DBPNAM4= <>
##$DBPNAM5= <>
##$DBPNAM6= <>
##$DBPNAM7= <>
##$DBPOAL= (0..7)
0.5 0.5 0.5 0.5 0.5 0.5 0.5 0.5 
##$DBPOFFS= (0..7)
0 0 0 0 0 0 0 0 
##$DE= 6
##$DECBNUC= <off>
##$DECIM= 32
##$DECNUC= <off>
##$DECSTAT= 4
##$DIGMOD= 1
##$DIGTYP= 9
##$DL= (0..7)
0 120 120 120 120 120 120 120 
##$DP= (0..7)
150 150 150 150 150 150 150 150 
##$DP07= 0
##$DPNAME0= <>
##$DPNAME1= <>
##$DPNAME2= <>
##$DPNAME3= <>
##$DPNAME4= <>
##$DPNAME5= <>
##$DPNAME6= <>
##$DPNAME7= <>
##$DPOAL= (0..7)
0.5 0.5 0.5 0.5 0.5 0.5 0.5 0.5 
##$DPOFFS= (0..7)
0 0 0 0 0 0 0 0 
##$DQDMODE= 0
##$DR= 18
##$DS= 0
##$DSLIST= <SSSSSSSSSSSSSSS>
##$DSPFIRM= 0
$$ [...]
##$SUBNAM2= <"">
##$SUBNAM3= <"">
##$SUBNAM4= <"">
##$SUBNAM5= <"">
##$SUBNAM6= <"">
##$SUBNAM7= <"">
##$SUBNAM8= <"">
##$SUBNAM9= <"">
##$SW= 18.0517328524113
##$SWIBOX= (0..15)
0 0 2 0 0 0 0 0 0 0 0 0 0 0 0 0 
##$SW_h= 3612.71676300578
##$TD= 16384
##$TD0= 1
##$TE= 0
##$TE2= 300
##$TE3= 300
##$TEG= 300
##$TL= (0..7)
0 120 120 120 120 120 120 120 
##$TP= (0..7)
150 150 150 150 150 150 150 150 
##$TP07= 0
##$TPNAME0= <>
##$TPNAME1= <>
##$TPNAME2= <>
##$TPNAME3= <>
##$TPNAME4= <>
##$TPNAME5= <>
##$TPNAME6= <>
##$TPNAME7= <>
##$TPOAL= (0..7)
0.5 0.5 0.5 0.5 0.5 0.5 0.5 0.5 
##$TPOFFS= (0..7)
0 0 0 0 0 0 0 0 
##$TUNHIN= 0
##$TUNHOUT= 0
##$TUNXOUT= 0
##$USERA1= <user>
##$USERA2= <user>
##$USERA3= <user>
##$USERA4= <user>
##$USERA5= <user>
##$V9= 5
##$VALIST= <valist>
##$VCLIST= <CCCCCCCCCCCCCCC>
##$VD= 0
##$VDLIST= <DDDDDDDDDDDDDDD>
##$VPLIST= <PPPPPPPPPPPPPPP>
##$VTLIST= <TTTTTTTTTTTTTTT>
##$WBST= 1024
##$WBSW= 4
##$XGAIN= (0..3)
0 0 0 0 
##$XL= 0
##$YL= 0
##$YMAX_a= 34472
##$YMIN_a= -37042
##$ZGOPTNS= <>
##$ZL1= 120
##$ZL2= 120
##$ZL3= 120
##$ZL4= 120
##$ABSF1= 10
##$ABSF2= 0
##$ABSG= 5
##$ABSL= 3
##$ALPHA= 0
##$AQORDER= 0
##$ASSFAC= 0
##$ASSFACI= 0
##$ASSFACX= 0
##$ASSWID= 0
##$AUNMP= <proc_1d>
##$AZFE= 0.1
##$AZFW= 0.1
##$BCFW= 1
##$BC_mod= 2
##$BYTORDP= 1
##$COROFFS= 0
##$CY= 11.3945322036743
##$DATMOD= 1
##$DC= 2
##$DFILT= <>
##$DTYPP= 0
##$F1P= 15.7292609196834
##$F2P= 12.9074282941183
##$FCOR= 0.5
##$FTSIZE= 0
##$FT_mod= 4
##$GAMMA= 1
##$GB= 0.15
##$INTBC= 1
##$INTSCL= 1
##$ISEN= 128
##$LB= 0.24
##$LEV0= 0
##$LPBIN= 0
##$MAXI= 10000
##$MC2= 0
##$MEAN= 0
##$ME_mod= 0
##$MI= 1.114404
##$NCOEF= 0
##$NC_proc= 0
##$NLEV= 6
##$NOISF1= 3.799351
##$NOISF2= 2.8
##$NSP= 1
##$NTH_PI= 0
##$NZP= 0
##$OFFSET= 15.70392
##$PC= 1
##$PHC0= -25310.78
##$PHC1= 21.38731
##$PH_mod= 1
##$PKNL= yes
##$PPARMOD= 0
##$PSCAL= 0
##$PSIGN= 0
##$REVERSE= no
##$SF= 200.130013532006
##$SI= 16384
##$SIGF1= 3
##$SIGF2= 2
##$SINO= 400
##$SIOLD= 16384
##$SREGLST= <1H.CDCl3>
##$SSB= 0
##$STSI= 0
##$STSR= 0
##$SW_p= 3612.71676300578
##$SYMM= 0
##$S_DEV= 0
##$TDeff= 0
##$TDoff= 0
##$TI= <>
##$TILT= no
##$TM1= 0
##$TM2= 0
##$TOPLEV= 0
##$USERP1= <user>
##$USERP2= <user>
##$USERP3= <user>
##$USERP4= <user>
##$USERP5= <user>
##$WDW= 1
##$XDIM= 8192
##$YMAX_p= 0
##$YMIN_p= 0
$$ End of Bruker specific parameters
$$ ---------------------------------
##NTUPLES= NMR FID
##VAR_NAME=  TIME,          FID/REAL,        FID/IMAG
##SYMBOL=    X,             R,               I
##VAR_TYPE=  INDEPENDENT,   DEPENDENT,       DEPENDENT
##VAR_FORM=  AFFN,          ASDF,            ASDF
##VAR_DIM=   8192,          8192,            8192
##UNITS=     SECONDS,       ARBITRARY UNITS, ARBITRARY UNITS
##FACTOR=    0.0002768,     1,               1
##FIRST=     0,             0,               0
##LAST=      2.2672688,     0,               0
##MIN=       0,             -37042,          0
##MAX=       2.2672688,     34472,           0
$$ Real data points
##PAGE= N=1
##DATA TABLE= (X++(R..R)), XYDATA
$$ [...]
$$ plain form
2045 -661 -1504 134 1583 837 -1536 -750 984 1285 -232 -1667 -443 1045 1225 -747 -1616 -142 1608
2062 1608 677 -1184 -1367 997 1555 83 -1475 -798 1257 1391 -863 -1320 -70 1623 720 -1433 -1078
2079 -1078 1016 1459 -62 -1873 -647 1397 1280 -748 -1470 352 1409 731 -1344 -1330 840 1571 -292
2096 -292 -1608 -552 1069 1075 -783 -1348 134 1526 406 -1007 -1273 784 1410 -144 -1504 -550 1177
2113 1177 1080 -1061 -1518 19 1393 689 -998 -913 609 1477 -23 -1604 -781 1157 1091 -754 -1455 342
2131 342 1513 563 -1418 -1007 493 1657 110 -1593 -338 1015 820 -811 -1498 -61 1450 483
2147 483 -1203 -1222 648 1351 77 -1522 -396 1200 1106 -740 -1379 81 1302 351 -1057 -842 640
2164 640 1404 -287 -1349 -460 1119 719 -708 -1298 94 1344 639 -1279 -1080 689 1338 -66 -1603
$$ packed form
2045f61q43J638J449p46k373P86J734L01j517j435J224J488J80j972q69J474J750
2062A608r31j861j83K364N58j472j558O77K055J34k254m57J250J693r03k153L55
2079a078K094M43j521j811J226K044j17k028p22J822J057o78k075J4K170P31j863
2096b92j316J056J621Oj858n65J482J392j120j413k66K057O26j554j360R54J727
2113A177r7k141m57J537J374p04j687Q5J522Q68j500j581Q23J938o6j845p01J797
2131C42J171r50j981M11J500J164j547j703J255J353j95j631o87J437J511r67
2147D83j686j9J870P03j274j599J126J596r4j846o39J460J221r51j408K15J482
2164F40P64j691j062Q89J579m00j427n90J392J250p05j918J99J769O49j404j537
$$ plain form
2181 -1603 -499 1094 894 -838 -1338 61 1340 488 -1140 -956 599 1120 -128 -1320 -702 1021
2197 1021 1191 -549 -1130 -188 1534 610 -1060 -1024 517 1431 -251 -1039 -702 1092 1215 -491 -1352 254
2215 254 1441 458 -1163 -1155 515 1455 -126 -1356 -781 961 1036 -745 -1367 -70 1504 521 -845 -1049
2233 -1049 870 1178 130 -1451 -503 1150 1100 -343 -1151 -105 1175 490 -1188 -719 503 1252 -206
2250 -206 -1258 -481 1011 997 -597 -987 50 1443 601 -975 -1099 461 1215 -9 -1435 -384 967
2267 967 1290 -879 -1136 -302 1249 341 -958 -997 562 1171 97 -1289 -374 892 896 -513 -1196 191
2285 191 966 382 -1266 -813 762 1058 41 -705 -491 983 1004 -348 -1111 3 951 733 -789 -1225
2303 -1225 630 969 -230 -1263 -553 820 947 -510 -1282 -160 906 358 -964 -920 671 1400 -130
$$ packed form
2181a603J104J593k00j732n00J399J279q52j628J84J555N21j248j192O18J723
2197A021J70j740n81R42J722r24j670L6J541R14j682p88L37J794J23j706q61J606
2215B54J187r83j621QJ670R40j581j230N75J742P5j781o22J297J574r83j366k04
2233a049J919L08j048j581R48J653n0j443q08J046J280o85j678M69J222P49j458
2250b06j052P77J492j4j594l90J037J393q42j576j24J560P54j224j426J051J351
2267I67L23k169k57Q34J551r08j299l9J559O09j074j386R15J266Mj409o83J387
2285A91P75n84j648M53J575K96j017p46K14J474K1j352p63J114R48k18j522m36
2303a225J855L39j199j033P10J373J27j457p72J122J066n48j322M4J591P29j530
$$ plain form
2320 -130 -1292 -580 1039 917 -364 -1355 -111 1234 610 -983 -870 577 1424 34 -1209 -411 830
2337 830 921 -404 -1141 140 1200 512 -816 -787 400 1032 236 -970 -274 923 1030 -832 -1136 -138
2355 -138 1166 688 -1061 -880 549 942 50 -1198 -601 1017 834 -476 -1305 -21 1061 413 -920
2372 -920 -689 455 1217 -88 -1127 -402 780 892 -624 -986 43 1141 456 -752 -934 618 927
2389 927 226 -1012 -377 906 802 -425 -973 -331 1076 363 -1008 -847 584 1168 50 -1015 -450
2406 -450 855 708 -374 -911 286 992 544 -896 -877 635 1244 -41 -1060 -250 908 663 -351
2423 -351 -818 -133 1105 478 -910 -842 419 1260 212 -895 -600 898 1002 -297 -857 35 1131 265
2441 265 -576 -1030 374 1016 -160 -972 -534 877 785 -382 -1040 -83 897 415 -827 -670 471 977
$$ packed form
2320a30j162P12J619j22j281r91J244J345o24j593J13J447Q47j390j243P98J241
2337H30R1j325p37J281J060o88j328K9J187O32p96j206O96J197J07j862l04R98
2355a38J304m78j749J81J429L93q92j248N97J618j83j310q29J284J082o48j333
2372i20K31J144P62j305j039P25J182J12j516l62J029J098o85j208j82J552L09
2389I27p01j238O35J283j04j227n48O42J407p13j371J61J431N84j118j065N65
2406d50J305j47j082n37J197P06m48j440J9J512O09j285j019Q10J158k45j014
2423c51m67O85J238o27j388O8J261Q41j048j107K95J498J04j299n60Q92J096q66
2441B65q41m54J404O42j176q12M38J411r2j167o58R57R80m82j242J57J141N06
$$ plain form
2459 977 -19 -827 -544 646 736 -490 -783 224 1136 337 -686 -917 223 713 -134 -956 -434 650
2477 650 799 -426 -917 -245 945 381 -704 -611 424 832 -48 -654 -454 678 373 -510 -848 126 807
2496 807 503 -845 -833 342 1001 234 -970 -507 682 547 -612 -705 62 746 261 -774 -669 433
2514 433 702 -207 -822 -396 776 805 -539 -1104 218 1102 553 -684 -708 217 886 84 -613 -228 615
2533 615 805 -247 -945 -68 709 371 -452 -929 359 720 -178 -919 -299 828 718 -562 -796 266
2551 266 628 610 -538 -518 377 532 -123 -667 -439 742 621 -517 -1026 136 733 508 -867 -826 286
2570 286 878 -107 -677 -326 596 1017 -335 -876 5 749 617 -454 -880 349 748 167 -850 -51 862
2589 862 963 -299 -994 -313 970 300 -436 -403 539 1012 52 -992 -532 567 661 20 -603 288 647
$$ packed form
2459I77r96q08K83J190R0j226k93J007R12p99j023k31J140M90q47q22N22J084
2477F50J49j225m91O72J190n64j085R3J035M08q80o06K00J132l05q83l38R74O81
2496H07l04j348J2J175O59p67j204M63J189j35j159r3P67O84m85j035J05J102
2514D33K69r09o15M26J172K9j344n65J322Q84n49j237k4R25O69q02o97L85Q43
2533F15J90j052o98Q77P77l38q23m77J288L61q98p41O20J127j10j280k34J062
2551B66L62j8j148K0Q95J55o55n44K28J181j21j138n09J162N97k25j375M1J112
2570B86N92r85n70L51R22M21j352n41Q81P44j32j071m26J229L99n81j017P99R13
2589H62J01j262o95O81J283o70p36L3R42M73r60j044M60J099R4o41o23Q91L59
$$ plain form
2608 647 476 -857 -705 218 833 78 -921 -271 970 992 -444 -822 36 737 489 -772 -1009 91 590
2627 590 -86 -827 -135 593 916 -478 -794 134 865 522 -694 -806 92 646 147 -1029 -547 519 484
2646 484 -560 -1125 -83 645 430 -564 -640 605 898 -116 -608 -563 568 423 -224 -633 -54 882 368
2665 368 -450 -693 592 677 106 -709 -408 765 718 -66 -285 149 662 261 -809 -548 180 972 -41
2684 -41 -737 -512 654 616 -324 -784 194 567 250 -678 -672 324 760 -37 -583 -231 563 854 -272 -718 -23
2705 -23 866 272 -435 -559 168 616 -182 -939 -489 617 519 -439 -669 3 488 481 -460 -462 393 644 90 -662
2727 -662 9 611 334 -226 -711 -111 452 363 -716 -584 317 657 -54 -869 -352 418 665 -307 -579 -5
2747 -5 857 143 -410 -264 595 771 95 -606 -377 346 204 -96 -503 32 563 394 -646 -555 68 814 20
$$ packed form
2608F47j71j333J52R23O15p55r99O50J241K2j436l78Q58P01k48j261k37J100M99
2627E90o76p41O92P28L23j394l16R28P31l43j216j12Q98N54m99j176M82J066l5
2646D84j044n65J042P28k15r94p6J245K93j014m92M5J131j45o47m09N79R36n14
2665C68q18k43J285Q5n71q15L01J173m7p84k19M34N13m01j070K61P28P92j013
2684d1o96K25J166l8r40m60R78L73l17r28OR96M36p97n46L52P94K91j126m46O95
2705b3Q89n94p07j24P27M48p98p57M50J106r8r58k30O72M85pr41kQ55K51n54p52
2727f62O71O02k77n60m85O00N63q9j079J32R01L40p11q15N17P70K47r72k72N74
2747eQ62p14n53J46Q59J76o76p01K29P23j42l00m07N35N31j69j040R1O23P46p94
$$ plain form
2768 20 -762 -345 704 765 -251 -758 -33 608 210 -193 -461 66 722 112 -620 -114 210 735 -540 -819
2788 -819 -254 609 521 -380 -423 138 323 -222 -733 -263 579 685 -72 -836 -22 415 261 -336 -295 485 718
2809 718 -133 -624 -364 388 513 41 -532 174 807 418 -469 -764 511 590 118 -474 -245 427 685 -56
2829 -56 -365 -219 488 452 -418 -792 193 717 60 -367 -269 346 198 -281 -737 61 745 281 -509 -301 286
2850 286 791 121 -261 -269 413 486 -93 -422 36 480 117 -308 -429 488 605 9 -467 -343 412 484 -126
2871 -126 -654 162 734 256 -420 -733 170 553 88 -435 -490 398 107 42 -447 -83 469 39 -286 -376 249
2892 249 620 88 -226 -793 382 657 -142 -405 -202 442 279 -334 -560 545 682 152 -647 -315 386
2911 386 348 -296 -748 -219 734 389 -550 -249 54 354 -47 -320 -435 389 493 -503 -532 312 684 390 -441
$$ packed form
2768B0p82M17J049O1j016n07P25O41l98m03k68N27O56o10p32N06L24N25j275k79
2788h19N65Q63q8r01m3N61J85n45n11M70Q42J06p57p64Q14M37j54n97M1P80K33
2809G18q51m91K60P52J25m72n73P06O33l89q87k95J275P9m72n92K29O72K58p41
2829e6l09J46P07l6q70l74R85N24o57m27R8O15j48m79m56P98O84m64p90K08N87
2850B86N05o70l82qO82P3n79l29M58M44l63m25j21R17J17n96m76J24P55P2o10
2871a26n28Q16N72m78o76l13R03L83m65n23n5Q88k91o5m89L64N52m30l25r0O25
2892B49L71n32l14n67J175K75p99k63K03O44j63o13k26J105J37n30p99L32P01
2911C86l8o44m52N29R53l45r39L01L03L00m01k73j15Q24J04r96k9Q44L72k94q31
$$ plain form
2932 -441 -719 240 555 121 -681 -149 39 288 -76 -296 -60 234 122 -243 -408 178 424 -165 -667 31
2952 31 527 403 -277 -499 -267 478 159 -365 -476 162 413 -23 -297 -39 259 326 -65 -689 299 178 279
2973 279 -529 -419 370 553 -105 -492 -437 324 489 -136 -612 -100 459 35 -345 -386 -116 516 -179 -477 -220
2994 -220 40 386 -92 -416 213 453 -9 -428 -480 326 441 56 -575 -409 550 332 -331 -563 -130 433
3014 433 179 -228 -437 -20 450 350 -518 -305 474 477 77 -556 42 211 205 -318 -209 89 357 -11 -402
3035 -402 36 500 307 -340 -483 -44 705 -43 -670 -210 493 354 260 -657 -355 639 470 -124 -475 -337
3055 -337 332 274 -392 -373 26 447 159 -602 -130 171 348 13 -554 90 417 60 -551 -263 463 408 -186
3076 -186 -364 -5 720 403 -408 -227 263 229 79 -483 -219 300 439 182 -421 -323 367 343 -407 -324 163
$$ packed form
2932d41k78R59L15m34q02N32J88K49l64k20K36K94j12l65j65N86K46n89n02O98
2952C1M96j24o80k22K32P45l19n24j11O38K51m36k74K58K98O7l91o24R88j21J01
2973B79q08J10P89J83o58l87N5P61J65o25m76N12N59m24l80m1K70O32o95k98K57
2994b20K60L46m78l24O29K40m62m19n2Q06J15l85o31J66R59k18o63k32M33N63
3014D33k54m07k09M17M70j00q68K13P79Lm00o33N98J69on23J09K98K68l68l91
3035d02M38M64j93o47j43M39P49p48o27M60P03j39r4r17L02R94j69n94l51J38
3055c37O69n8o66J9L99M21k88p61M72L01J77l35n67O44L27l57o11K88P26n5n94
3076a86j78L59P25l17q11J81M90l4j50n62K64N19J39k57o03R8O90k4p50Q3M87
$$ plain form
3097 163 583 123 -170 -679 70 377 -112 -359 -202 27 321 -52 -588 -275 520 323 -340 -247 -40 390
3117 390 64 -187 -285 417 136 -273 -588 145 380 80 -212 -236 198 316 108 -58 -361 323 195 -96 -378
3138 -378 40 361 -24 -237 -46 148 267 152 -348 -74 243 498 -351 -535 -249 610 -132 -257 -624 114
3158 114 234 -66 -439 -388 334 240 -278 -547 59 718 236 -352 -379 153 311 -51 -227 -541 426 264 -109
3179 -109 -269 -149 280 155 -233 70 -70 410 33 -499 -398 52 551 -156 -151 186 170 321 -400 -63 147
3200 147 181 -90 -179 -126 225 12 -335 -47 -31 325 -33 -317 -98 23 255 221 -312 -315 251 202 -103 -319 -183
3223 -183 409 401 -160 -287 241 326 80 -369 -262 383 101 -489 -282 38 439 114 -473 -399 153 602 80
3244 80 -457 -345 289 271 -314 -434 -176 61 147 -224 -324 187 415 -22 -281 -49 371 322 -252 -216 53 249
$$ packed form
3097A63M20m60k93n09P49L07m89k47J57K29K94l73n36L13P95j97o63R3K07M30
3117C90l26k51r8P02k81m09l15P33K35l00k92k4M34J18k08j66l03O84j28k91k82
3138c78M18L21l85k13J91J94J19j15n00K74L17K55q49j84K86Q59p42j25l67P38
3158A14J20l00l73N1P22r4n18k69O06O59m82n88k7N32J58l62j76l14R67j62l73
3179a09j60J20M29j25l88L03j40M80l77n32J01M50M99p07NL37j6J51p21L37K10
3200A47L4k71q9N3L51k13l47K88J6L56l58k84K19J21K32l4n33lN66m9l05k16J36
3223a83N92qn61j27N28Q5k46m49J07O45k82n90K07L20M01l25n87P4N52M49n22
3244H0n37J12O34j8n85j20K58K37Q6l71j00N11K28m37k59K32M20m9n74L6K69J96
$$ plain form
3266 249 -5 -333 -337 99 331 78 -514 -246 32 452 -247 25 -470 237 -63 -306 -94 140 210 226 -181
3287 -181 -87 332 82 -104 -309 149 25 108 93 -482 107 284 -53 -240 -344 85 200 -54 -389 -21 399
3308 399 -32 -323 -277 59 230 34 -143 -164 42 205 -114 -106 223 356 538 -183 66 -73 223 -84 -216
3329 -216 -62 232 338 100 -213 152 259 162 -628 -73 283 138 -13 -117 100 381 448 -144 -317 40 245
3350 245 157 62 -242 120 14 -58 -218 -279 84 403 -183 -101 -15 130 6 -350 -212 222 299 -137 -283 -168
3372 -168 505 102 -72 -265 79 589 71 -112 -221 295 419 203 -63 222 413 30 -148 -228 -68 397
3392 397 -27 -329 -74 215 425 78 -189 -348 494 308 -315 -300 15 335 -84 -275 -104 105 169 41 -279
3413 -279 -262 86 122 -291 -279 -129 496 324 -509 -418 -31 318 -76 -92 -318 105 325 -143 -423 120 358 -40
$$ packed form
3266B49k54l28mM36K32k53n92K68K78M20o99K72m95P07l00k43K12K34P0J6m07
3287a81R4M19k50j86k05M58j24Q3j5n75N89J77l37j87j04M29J15k54l35L68M20
3308C99m31k91M6L36J71j96j77k1K06J63l19QL29J33J82p21K49j39K96l07j32
3329b16J54K94J06k38l13L65J07r7p90N55L56j45j51j04K17K81O7n92j73L57K05
3350B45q8r5l04L62j06p2j60o1L63L19n86Q2Q6J45j24l56J38M34P7m36j46J15
3372a68O73m03j74j93L44N10n18j83j09N16J24k16k66K85J91l83j78q0J60M65
3392C97m24l02K55K89K10l47k67j59Q42j86o23J5L15L20m19j91J71K09O4j28l20
3413b79J7L48L6m13J2J50O25j72q33R1L87L49l94j6k26M23K20m68k80N43K38l98
$$ plain form
3435 -40 -249 -178 -44 346 -17 -392 -34 219 320 -155 -279 -157 78 36 -138 -89 200 435 -180 -394 -180
3456 -180 147 508 -51 -254 -248 274 26 -152 -304 229 45 -17 -300 -165 -17 237 -56 -461 -236 245 71
3477 71 -268 -305 -29 483 -68 -142 -136 -69 180 70 -85 -166 257 108 -16 -213 57 19 -13 -217 -38 16 173
3500 173 -151 -197 -185 522 268 -363 -99 108 244 106 -157 -143 107 -1 -99 -129 -187 348 -12 -138 -182 52
3522 52 181 -173 -21 2 280 233 40 -532 -52 -105 -61 -330 -216 -3 -111 128 -65 -125 283 -11 -221 -223 118
3545 118 127 -37 -223 -51 110 261 174 -251 182 131 184 22 -195 19 17 62 -74 -19 -40 443 -332 -299 -195 95
3569 95 242 -121 -21 114 133 118 -243 -125 -153 296 33 -109 -83 236 -7 -38 -103 -195 24 87 39 -157 28
3592 28 12 -36 297 80 324 -102 -175 72 -28 347 -32 -28 -48 -92 105 -24 -188 -44 265 17 -275 -245 132
$$ packed form
3435d0k09P1J34L90l63l75L58K53J01m75j24J22K35m2j74M9K89K35o15k14K14
3456a80L27L61n59k03ON22k48j78j52N33j84o2k83J35J48K54k93m05K25M81j74
3477G1l39l7K76N12n51p4OO7K49j10j55q1M23j49j24j97K70l8l2k04J79N4J57
3500A73l24m6J2P07k54o31K64K07J36j38k63J4K50j08r8l0n8N35l60j26m4K34
3522E2J29l54J52K3K78m7j93n72M80n3M4k69J14K13j08K39j93o0M08k94k10kL41
3545A18Rj64j86J72J61J51q7m25M33n1N3j62k17K14kM5j36N5k1M83p75L3J04K90
3569I5J47l63J00J35J9j5l61J18k8M49k63j42K6L19k43l1o5r2K19O3m8j96J85
3592B8j6m8L33k17K44m26p3K47j00L75l79Mk0m4J97j29j64J44L09k48k92L0L77
$$ plain form
3615 132 173 107 -471 -351 169 -15 42 -212 -127 131 263 -120 -110 38 193 -58 137 -62 -92 92 114 -92
3637 -92 -5 231 82 -94 -296 65 71 88 -211 -133 469 546 -105 -109 44 238 36 -92 -96 181 -106 57 -194 -26
3661 -26 282 -40 -257 -139 -26 186 146 -36 189 -42 227 -132 -185 53 406 89 -290 -177 269 151 170
3682 170 -245 -455 60 17 58 -174 75 401 82 -169 -107 221 54 210 31 173 155 200 12 -44 133 144
3704 144 121 -178 -527 65 294 -234 -431 -428 111 -72 -53 -11 12 159 -149 -117 -502 -40 386 -29 -213 113
3726 113 177 65 -177 -346 122 449 124 -144 -72 -125 226 240 -370 -60 -63 221 189 -367 220 42 335 -62
3748 -62 -296 -32 218 -10 -159 -225 297 310 53 -400 -115 323 -52 -213 -66 82 258 89 -234 -218 150
3769 150 451 1 -169 -27 313 120 -11 -13 286 383 353 156 -286 166 120 -75 -445 -230 194 37 -141 -353
$$ packed form
3615A32M1o6n78J20N20j84N7k54Q5K58J32l83J0J48J55k51J95j99l0J84K2k06
3637i2Q7K36j49j76k02L61OJ7k99P8O02P7o51mJ53J94k02j28mK77k87J63k51J68
3661b6L08l22k17J18J13K12m0j82K25k31K69l59n3K38L53l17l79J13M46j18J9
3682A70m15k10N15m3M1k32K49L26l19k51O2L28j67J56j79J42j8M5j88n6J77J1
3704A44k3k99l49N92K29n28j97LN39j83J9M2K3J47l08L2l85M62M26m15j84L26
3726A13O4j12k42j69M68L27l25k68P2n3L51J4o10L10lK84l2n56N87j78K93l97
3748f2k34K64K50k28j49o6N22J3k57m53K85M38l75j61J47J48J76j69l23J6L68
3769A50L01m50j70J42L40j93j31kK99R7l0j97m42M52m6j95l70K15M24j57j78k12
$$ plain form
3791 -353 15 325 -79 -43 -89 225 154 171 -303 -41 65 80 -103 7 149 170 85 -75 -63 113 100 124 -74
3814 -74 -84 31 406 -36 -356 -128 319 167 -130 127 -206 211 -36 -54 -132 172 36 125 -149 121 56 -85
3836 -85 -125 -155 184 170 -2 -220 -28 26 183 139 44 240 23 59 -254 -158 160 179 -154 -208 -105 120 125 -69
3860 -69 -177 40 321 129 -288 115 96 142 -61 101 -14 -214 46 4 -255 -54 -61 -57 -180 -191 -127 -113 64 -280
3884 -280 -114 111 126 152 -167 406 281 -119 83 -137 33 -43 113 -177 -131 100 -140 -198 -176 -425 409 72
3906 72 -261 70 172 215 126 -202 19 239 129 -289 -360 -47 150 148 -105 -74 36 216 157 -474 234 316 151
3929 151 -74 -214 37 259 55 -149 -315 14 178 -166 -201 137 97 217 -78 -304 -80 154 185 -136 -263
3950 -263 -39 32 135 -55 -78 357 188 -242 -302 94 81 6 -279 12 178 222 -315 -117 116 -107 297 -112
$$ packed form
3791c53L68L10m04L6m6L14p1J7m74K62J06J5j83J10J42K1q5j60J2J76j3K4j98
3814g4j0J15L75m42l20K28M47j52k97K57l33M17k47j8p8L04j36Q9k74K70o5j41
3836h5m0l0L39j4j72k18J92N4J57m4r5J96k17L6l13R6L18J9l33n4J03K25Nj94
3860f9j08K17K81j92m17M03j9M6k03J62j15k00K60m2k59K01pMj23j1O4J4J77l44
3884b80J66K25J5K6l19N73j25m00K02k20J70p6J56k90M6K31k40n8K2k49Q34l37
3906G2l33L31J02M3q9l28K21K20j10m18p1L13J97kk53L1J10J80n9o31P08Q2j65
3929A51k25j40K51K22k04k04j66L29J64l44l5L38m0J20k95k26K24K34L1l21j27
3950b63K24P1J03j90k3M35j69m30o0L96j3p5k85K91J66M4n37J98K33k23M04m09
$$ plain form
3972 -112 1 145 102 -210 -63 -307 -106 193 -4 -33 97 128 259 -93 -162 65 168 143 -88 -7 -59 36 -78
3995 -78 -214 12 246 -18 -251 80 152 165 -183 -186 -100 -3 52 -85 -230 -256 147 81 -42 -102 -312 -47 -113 -333
4019 -333 -92 125 121 59 -49 -39 112 182 61 -26 42 58 -19 -14 -248 178 184 24 -263 17 145 -13 -395 -204
4043 -204 160 130 -63 -11 -191 -187 315 -135 -158 71 -83 162 -211 -254 -74 254 111 -153 -75 26 224 -19
4065 -19 -120 -28 413 -62 36 -202 -34 89 -189 34 -205 109 173 -329 -143 101 84 289 -29 157 -137 75
4087 75 -24 -212 -153 242 6 -28 -190 165 91 -19 -177 -189 30 181 17 -117 -61 138 129 -89 -233 72 69 -34
4111 -34 -55 21 -45 -57 10 -78 -32 19 -6 -48 -358 -138 169 143 -204 -114 -11 302 -3 -103 -178 186 -246 -151 -43
4136 -43 -171 -23 -16 -40 -338 269 248 284 -278 -480 -151 40 -17 89 -16 207 189 -223 -74 311 249 122 -107
$$ packed form
3972a12J13J44m3l12J47k44K01K99j97k9J30L1J31l52o9K27J03k5k31Q1n2R5j14
3995g8j36K26K34k64k33L31P2J3l48lQ6R7N5j37j45k6M03o6j23o0k10K65o6k20
4019c33K41K17mo2j08J0J51P0j21q7O8J6p7Nk34M26Oj60k87K80J28j58l82J91
4043b04L64l0j93N2j80MN02m50k3K29j54K45l73m3J80L28j43k64P8J01J98k43
4065a9j01R2M41m75R8k38J68J23k78K23k39L14O4n02J86K44j7K05l18J86k94K12
4087G5r9j88N9L95k36l4j62L55p4j10j58j2K19J51j64j34N6J99rk18j44L05lj03
4111c4k1P6o6j2O7q8M6N1k5m2l10K20L07k6l47R0J03L13l05j00p5L64m32R5J08
4136d3j28J48Pk4k98O07k1L6n62k02L29J91n7J06j05K23j8m12J49L85o2j27k29
$$ plain form
4159 -107 -23 -45 -27 48 -411 -89 89 103 -19 -46 -156 49 44 53 -122 135 -32 275 -1 -452 265 14 -23 -438
4183 -438 -143 365 111 -314 1 284 422 101 -308 -120 44 -163 -153 6 317 113 196 -195 17 -21 74
4204 74 -48 -195 -32 216 295 -154 -141 133 321 -229 -179 68 28 332 59 -231 -74 -30 285 -91 -189 141
4226 141 69 -123 169 -61 170 424 -70 -30 -156 117 90 -32 5 -123 84 -111 -195 -194 -263 -130 33 -53 162
4249 162 132 338 -45 -159 12 150 -10 -168 -48 9 160 -118 -176 -56 218 228 -176 -373 152 -26 18 -98
4271 -98 -121 31 -69 -283 -177 177 62 144 -103 -36 -33 241 162 -6 47 70 1 236 -377 -77 417 121 -36
4294 -36 35 -55 -101 149 66 -12 -57 126 16 -240 376 67 206 -2 -252 -27 57 198 -144 -28 -79 38 -100
4317 -100 40 146 62 -64 -42 -137 91 98 64 -291 -269 10 213 -107 -73 36 97 145 5 -276 -183 130 -441 48
$$ packed form
4159a07Q4k2J8P5m59L22J78J4j22k7j10K05nRj75K57j67L07k76m51P17k51l7m15
4183d38K95N08k54m25L15K83J38l21m09J88J64k07J0J59L11k04Q3l91K12l8R5
4204G4j22j47J63K48P9m49J3K74J88n50N0K47m0L04k73k90J57M4L15l76r8L30
4226A41p2j92K92k30K31K54m94M0j26K73k7j22L7j28K07j95q4Jo9J33J63q6K15
4249A62l0K06l83j14J71J38j60j58J20N7J51k78n8J20K74J0m04j97N25j78M4j16
4271i8k3J52j00k14J06L54j15Q2k47O7LK74p9j68N3K3o9K35o13L00M94k96j57
4294c6P1r0m6K50q3p8m5J83j10k56O16l09J39k08k50K25Q4J41l42J16n1J17j38
4317a00J40J06q4j26K2r5K28Pl4l55K2K79K03l20L4J09O1M8j40k81R3L13n71M89
$$ plain form
4341 48 -62 189 142 -33 85 8 118 87 -114 -49 -6 310 126 -21 36 240 42 201 -59 157 42 -126
4363 -126 -77 94 -35 154 273 -201 116 44 51 99 -83 219 -45 8 93 -17 159 148 -52 -247 -87 36 -81
4386 -81 -219 -22 29 -216 134 95 -26 47 -228 60 109 -73 3 82 -186 111 -59 56 39 104 21 81 333 -83
4410 -83 -244 -229 257 87 -224 -74 -105 237 20 -230 -59 140 23 55 -66 -315 307 59 -109 -97 22 111
4432 111 76 -75 -183 23 -121 -72 -66 -61 -47 153 146 -198 -30 -4 65 39 -59 -15 67 -1 55 -80 142 114 269 -117
4458 -117 139 143 167 -187 -152 112 -89 151 -292 36 162 56 -101 -158 145 163 352 -134 1 71 -139 -152 -156
4481 -156 72 -99 -217 -134 -193 194 187 73 -285 -224 -172 134 111 -119 -11 -46 130 -148 230 -27 -13 128 112
4504 112 -17 -62 251 -91 -63 -66 94 48 -292 -312 237 103 -39 34 -282 -156 105 24 -8 -230 -51 110 -55
$$ packed form
4341D8j10K51m7j75J18p7J10l1k01O5M3L16j84j47N7K04j98J59k60K16j15j68
4363a26M9J71j29J89J19m74L17p2PM8j82L02k64N3Q5j10J76j1k00j95J60J23j17
4386h1j38J97N1k45L50l9j21P3k75K88M9j82P6P9k68K97j70J15j7O5q3O0K52m16
4410h3j61J5M86j70l11J50l1L42k17k50J71J99j17L2j21k49O22k48j68J2J19Q9
4432A11l5j51j08K06j44M9ONJ4K00pl44J68K6O9k6r8M4Q2o8N6j35K22k8J55l86
4458a17K56MK4l54L5K64k01K40m43L28J26j06j57n7L03J8J89m86J35P0k10j3m
4481a56K28j71j18Q3n9L87pj14l58O1N2L06k3k30J08l5J76k78L78k57J4J41j6
4504A12j29m5L13l42K8lJ60m6l40k0N49j34j42P3l16J26K61q1l2k22J79J61j65
$$ plain form
4527 -55 -296 116 -50 129 -145 15 170 45 66 -79 -21 138 -187 79 -220 -46 43 -14 -241 24 -11 -12 -30
4550 -30 128 177 -5 -45 -1 -186 -123 125 -125 -169 -39 -215 209 92 -110 100 167 -119 -165 17 254 76 -160
4573 -160 -79 -141 195 360 274 -75 -243 -136 233 -14 -44 167 -82 5 -67 -160 165 -2 67 -142 -19 80 -125
4596 -125 -111 -346 -100 -27 90 16 -33 -124 147 169 -150 -117 -18 -8 30 -339 -187 28 55 -50 -107 -16 291 110
4620 110 52 56 6 47 42 -159 -82 97 192 85 -16 -208 36 -49 -396 -87 31 -287 -147 -172 -144 17 -280 -253
4644 -253 154 -72 -115 -268 40 -429 121 296 122 5 15 -134 -47 -155 -155 81 32 157 -229 -6 -157 218
4666 218 -156 -50 -247 192 24 -345 -4 45 240 -140 181 96 41 25 144 18 -217 105 411 -21 191
4687 191 -80 296 -36 -148 11 103 39 79 22 51 150 117 -233 -61 201 207 94 -417 236 63 95 -96 -110 141
$$ packed form
4527e5k41M12j66J79k74J60J55j25K1j45N8J59l25K66k99J74Q9n7k27K65l5jj8
4550c0J58M9j82m0M4j85O3K48k50m4J30j76M24j17k02K10O7k86m6J82K37j78k36
4573a60Q1o2L36J65q6l49j68J07L69k47l0K11k49Q7p2r3L25j67O9k09J23R9k05
4596a25J4k35K46P3J17p4m9r1K71K2l19L3R9J0L8l69J52K15K7j05n7R1L07j81
4620A10n8Mn0M1nk01P7J79R5j07j01j92K44q5l47L09J18l18J40k5K8J61k97K7
4644b53M07k26m3j53L08m69N50J75j74j17J0j49Q7j08%K36m9J25l86K23j51L75
4666B18l74J06j97M39j68l69L41M9J95l80L21q5n5j6J19j26k35L22L06m32K12
4687A91k71L76l32j12J59R2o4M0n7K9R9l3l50J72K62Oj13n11O53j73L2j91j4K51
$$ plain form
4711 141 74 -119 -168 76 -64 406 -147 39 64 -61 110 -168 -146 -186 -2 182 -242 1 161 298 327 -132
4733 -132 133 313 31 -47 23 -159 312 77 75 -44 66 -10 -90 50 64 -243 199 -44 -278 1 -95 100 -79
4756 -79 -251 252 283 -8 -74 137 371 198 210 -7 243 -77 148 -189 -243 7 -181 -10 -4 -233 102 -89
4778 -89 -223 -163 149 242 -45 111 110 135 61 146 13 271 -14 296 -317 62 -107 209 128 -173 -105 45 41 -81
4802 -81 -217 -239 102 191 -42 39 -109 32 -172 -302 -253 -209 63 -213 -75 52 22 124 1 -69 155 219 71
4825 71 -7 44 -78 282 8 -211 202 -159 201 137 2 73 287 129 277 -55 48 -46 -159 -154 65 -80 180
4848 180 22 -1 179 -107 222 107 -39 199 204 5 137 61 -37 21 -68 -13 4 -160 -102 360 -97 -174 -20 -230
4872 -230 -43 -71 -144 -47 82 -191 168 273 -8 -187 -120 123 -218 99 63 -54 71 -136 -65 -113 56 207
$$ packed form
4711A41o7j93m9K44j40M70n53J86K5j25J71k78K2m0J84J84m24K43J60J37K9m59
4733a32K65J80k82p8P0j82M71k35kj19J10p6q0J40J4l07M42k43k34K79r6J95j79
4756g9j72N03L1k91o6K11K34j73J2k17K50l20K25l37n4K50j88J71Ok29L35j91
4778h9j34O0L12R3k87J56jK5p4Q5j33K58k85L10o13L79j69L16q1l01O8J50mj22
4802h1j36k2L41Q9k33Q1j48J41k04j30M9M4K72k76J38J27l0J02j23p0K24O4j48
4825G1p8N1j22L60k74k19M13l61L60o4j35P1K14j58J48l32J03r4j13NK19j45K60
4848A80j58k3J80k86L29j15j46K38Nj99J32p6r8N8q9N5J7j64N8M62m57p7J54k10
4872b30J87k8p3R7J29k73L59J05k81j79O7K43l41L17l6j17J25k07P1m8J69J51
$$ plain form
4894 207 -44 160 10 -6 287 -159 278 -146 103 268 -24 -39 26 261 -2 -199 -146 -72 46 -65 59 -283
4916 -283 -65 -73 -117 114 12 -151 304 125 -21 5 432 -10 -484 -35 311 -192 -27 -159 -177 174 -79 -19
4938 -19 -55 177 175 -50 235 135 295 263 71 62 -189 36 -153 -146 -7 -71 -29 283 20 -203 -32 226 130 -39
4962 -39 65 -71 143 14 83 -79 -41 -245 -90 -182 -100 253 -195 -119 8 140 -88 68 -88 201 -45 -7
4984 -7 193 -114 -14 222 27 -203 -209 63 -115 -84 -104 -249 68 -47 58 -216 256 229 -65 -240 66 -129
5006 -129 -134 -51 -278 136 61 69 79 69 188 -46 -137 -128 -115 9 180 14 -10 -183 130 32 73 -174 289 202 -54
5031 -54 -133 126 235 164 -188 9 -258 112 -88 -279 122 97 263 -36 1 -55 28 -75 -110 194 -13 -187 27
5054 27 35 -303 -197 146 7 90 -38 103 238 101 -127 50 86 101 -107 74 196 -11 66 -258 48 -95
$$ packed form
4894B07k51K04j50j6K93m46M37m24K49J65k92j5O5K35k63j97N3P4J18j11J24l42
4916b83K18qm4K31j02j63M55j79j46K6M27m42m74M49L46n03J65j32j8L51k53O0
4938a9l6K32kk25K85j00J60l2j92rk51K25j89PJ39o4M2L12k63k23J71K58r6j69
4962c9J04j36K14j29O9j62L8k04J55r2Q2L53m48P6J27J32k28J56j56K89k46L8
4984gK00l07J00K36j95k30oK72j78L1k0j45L17j15J05k74M72k7k94j75L06j95
5006a29nQ3k27M14p5QJ0j0J19k34r1RJ3J24J71j66k4j73L13r8M1k47M63q7k56
5031e4p9K59J09p1l52J97k67L70k00j91M01k5J66k99L7n6Q3j03l5L04k07j74K14
5054B7Ql38J06L43j39Q3j28J41J35j37k28J77L6J5k08J81J22k07P7l24L06j43
$$ plain form
5076 -95 -164 -218 -85 195 -215 195 -123 -173 -52 -5 -32 325 -215 111 -45 99 271 437 120 124 151 -156 316
5099 316 289 -255 -177 218 115 -32 40 -153 -23 39 133 -3 79 136 181 276 125 1 -420 -12 11 479 -175
5122 -175 145 305 245 99 -206 -60 116 -59 -42 177 181 207 330 140 171 93 -56 50 27 32 16 121 14 345
5146 345 231 -36 -116 49 11 -8 -28 -16 350 -50 -40 -38 -145 80 142 -191 68 311 255 281 85 78 192 -77
5170 -77 40 -43 -219 43 113 -193 4 269 6 -61 -135 -151 -29 58 -155 -22 -154 -224 -113 -11 -200 -177 347
5193 347 -5 -38 104 250 -113 -105 132 -225 173 190 85 12 260 -97 -14 -184 -147 304 49 53 -102 -111 -127 -2
5217 -2 150 -150 16 27 127 -39 -120 127 -221 -148 -121 245 0 236 -255 -114 236 16 -96 -40 76 116 -101
5240 -101 70 -253 29 27 13 -359 -49 44 202 158 102 -151 101 203 -299 18 18 225 -83 -136 -217 146 77 97
$$ packed form
5076i5o9n4J33K80m10M10l18n0J21M7k7L57n40L26j56J44J72J66l17MK7l07M72
5099C16k7n44P8L95j03j47P2j93J30O2R4j36Q2N7M5R5j51j24m21M08K3M68o54
5122a75L20J60o0j46l05J46J76j75J7K19MK6J23j90L1p8j49J06k3Nj6J05j07L31
5146C45j14k67q0J65l8j9k0J2L66m00J0Kj07K25O2l33K59K43n6K6j96pJ14k69
5170g7J17q3j76K62P0l06J97K65k63o7p4j6J22Q7k13J33j32p0J11J02j89K3N24
5193C47l52l3J42J46l63QK37l57L98J7j05p3K48l57Q3j70L7M51k55Mj55rj6J25
5217bJ52l00J66J1J00j66q1K47l48P3K7L66k45K36m91J41L50k20j12N6J16M0k17
5240a01J71l23K82kj4l72L10R3J58m4n6k53K52J02n02L17%K07l08n3q1L63o9K0
$$ plain form
5264 97 -210 -122 -28 -114 -101 -122 91 -27 38 175 -31 155 34 42 -104 11 -135 114 -221 -85 104 191 33
5287 33 9 -234 -10 39 128 97 -78 -33 -15 130 -217 10 -1 119 -284 19 182 46 156 -209 -89 -113 334
5310 334 -77 -45 -3 25 22 83 92 -138 149 -279 -289 -189 148 271 -122 111 -12 25 305 -183 -302 136 79 -28
5334 -28 -18 -219 -103 87 -66 -109 -161 292 32 -33 200 22 113 -98 85 -47 -150 -241 219 177 42 134 -141
5357 -141 132 26 179 123 -180 -19 -26 151 -14 -78 -196 -166 23 32 134 61 -34 -194 348 46 -156 60 63 21
5381 21 91 339 311 92 -312 -121 142 -44 -191 -302 50 340 51 -73 8 156 -91 93 -97 -125 270 242
5403 242 -119 -50 -269 -149 277 -15 -101 137 -113 5 -17 -191 90 35 -42 -41 275 249 36 158 94 0 191
5426 191 -196 -96 -20 -81 -1 -99 -62 -31 118 -20 102 59 56 10 -98 54 11 -58 31 -188 -233 -284 -20 287 47
$$ packed form
5264I7l07Q8R4q6J3k1K13j18O5J37k06J86j21Qj46J15j46K49l35J36J89Q7j58
5287C3k4k43K24M9Q9l1j75M5J8J45l47K27j1J20m03L03J63j36J10l65J20k4M47
5310C34m11L2M2K8lO1Rk30K87m28j0J00L37J23l93K33j23L7K80m88j19M38n7j07
5334b8J0k01J16J90j53m3n2M53k60o5K33j78R1k11J83j32j03r1M60m2j35R2k75
5357a41K73j06J53n6l03J61pJ77j65o4j18L0J89RJ02p3r5j60N42l02k02K16Lm2
5381B1P0K48k8k19m04J91K63j86j47j11L52K90k89j24Q1J48k47J84j90k8L95k8
5403B42l61O9k19J20M26k92q6K38k50J18k2j74K81n5p7JL16k6k13J22o4r4J91
5426A91l87J00P6o1Q0r8L7L1J49j38J22m3lm6j08J52m3o9Q9k19m5n1K64L07k40
$$ plain form
5451 47 -168 227 -18 7 102 -59 -39 -97 -228 -19 63 163 -13 -132 -244 61 57 -161 -33 -72 152 21 222
5474 222 64 128 -73 94 50 -24 -87 -78 82 -10 42 134 130 178 -87 -114 137 179 -17 24 -85 86 -88 137 -139
5499 -139 149 228 -182 -82 -7 -157 -46 -6 222 184 -125 13 114 -142 103 202 81 -96 83 83 -14 -111 -286
5522 -286 20 138 109 28 163 223 -169 -25 -59 -106 130 128 -172 -164 90 213 -98 20 -99 -16 144 -23 -62 -59
5546 -59 21 -167 -144 166 -123 27 -202 -284 -29 141 171 -58 -189 246 156 120 -18 -148 -32 -20 129 -264 -154
5569 -154 50 -40 -117 -64 29 -127 -126 9 -39 -179 -142 47 -32 9 210 7 213 -72 8 159 -86 -48 -79 -141 165
5594 165 176 -51 12 -50 94 162 -111 -191 193 291 16 -5 -55 93 5 118 -125 -129 -36 -135 -81 9 39 125 72 244
5620 244 108 37 108 -164 89 -45 -27 -62 -182 160 197 130 281 191 245 9 -98 43 80 -53 -55 44 34 -5 47
$$ packed form
5451D7k15L95k45K5R5j61K0n8j31K09Q2J00j76j19j12L05mk18J28l9K24j31K01
5474B22j58O4k01J67m4p4o3RJ60r2N2R2mM8k65k7K51M2j96M1j09J71j74K25k76
5499a39K88P9m10J00P5j50J11M0K28l8l09J38J01k56K45R9j21j77J79%r7r7j75
5522b86L06J18k9q1J35O0l92J44l4m7K36kl00QK54J23l11J18j19Q3J60j67l9L
5546e9Q0j88K3L10k89J50k29q2K55J70L0k29j31M35r0l6j38j30J16J2J49l93J10
5569a54K04r0p7N3R3j56JJ35m8j40L7J89p9M1K01k03K06k85Q0J51k45L8l1o2L06
5594A65J1k27O3o2J44O8k73q0L84R8k75k1n0J48q8J13k43mR3r9N4R0L0Q6n3J72
5620B44j36p1P1k72K53j34J8l5j20L42L7o7J51r0N4k36j07J41L7j33kR9j0l9N2
$$ plain form
5645 47 -17 148 -69 146 33 164 -6 -243 172 -66 127 43 -72 -37 130 -61 -257 -135 -251 -68 46
5666 46 37 223 13 -13 80 84 -148 67 28 -375 -16 3 129 -30 35 149 -71 -101 115 332 347 97 40 50 79
5691 79 44 83 -34 73 -194 39 -16 -266 -114 -59 -65 124 -63 -92 -175 -56 -52 -370 223 31 185 46 147 -48
5715 -48 13 77 -54 130 220 37 70 -317 -44 2 18 -178 -42 -146 97 -133 -93 171 0 -274 -16 -56 -142
5738 -142 81 -60 -42 -8 57 133 7 -162 -196 -129 -41 149 -48 -121 -390 -27 -245 -148 473 222 31 157 -254
5761 -254 56 40 2 28 -138 -91 -3 -118 5 63 27 -139 -31 46 -85 -113 76 -270 97 172 122 120 150 48 209
5786 209 -22 -219 -54 43 87 -4 -5 -80 -122 -9 -93 -88 247 -71 -232 -1 109 18 202 -167 -35 -41 2 25 -237
5811 -237 -120 162 -141 -176 -139 65 225 34 134 -256 -214 -173 124 196 61 7 7 -90 14 247 353 -4 -85
$$ packed form
5645D7o4J65k17K15j13J31j70k37M15k38J93q4j15L5J67j91j96J22j16J83J14
5666D6rJ86k10k6R3Mk32K15l9m03L59J9J26j59O5J14k20l0K16K17J5k50n7J0K9
5691G9l5L9j17J07k67K33n5k50J52N5oJ89j87k9q3J19Ml18N93j92J54j39J01j95
5715d8O1O4j31J84R0j83L3l87K73M6J6j96J36j04K43k30M0K64j71k74K58m0q6
5738a42K23j41J8L4O5P6j26j69l4O7Q8J90j97p3k69L63k18R7O21k51j91J26m11
5761b54L10j6l8K6j66M7Q8j15J23N8l6j66J08P7j31k8J89l46L67P5n0kL0j02J61
5786B09k31j97J65R7M4r1jp5m2J13q4NL35l18j61K31J10r1J84l69J32oM3K3k62
5811b37J17K82l03l5L7K04J60j91J00l90M2M1K97P2j35n4%r7J04K33J06l57q1
$$ plain form
5834 -85 98 275 128 -136 154 -25 275 -34 213 56 174 155 -251 257 67 -370 22 -85 -90 -25 -168 -29
5856 -29 -35 -65 344 -148 -186 -164 36 194 -62 176 217 62 83 -12 -61 -150 -18 178 37 119 -260 288 -55 1
5880 1 -161 -218 165 54 56 -276 -24 -91 102 91 74 127 -13 -117 243 -93 -83 197 -180 -39 0 241 -177 71
5904 71 -158 -86 -3 65 -57 80 107 265 -15 -145 -23 -98 -112 -67 13 -178 252 143 -30 28 -101 315 -222
5927 -222 -208 215 -6 -114 -89 -26 71 -184 36 -248 -296 -1 102 -141 259 305 23 90 -68 41 -113 -103 303
5950 303 -172 -137 53 12 -94 72 35 92 -38 68 -204 -112 218 63 172 -65 -49 1 38 -19 -88 31 113 138
5974 138 283 41 173 -107 -269 -36 146 -39 -102 -43 1 35 26 15 -117 73 75 71 166 -82 48 80 -112 -120 146
5999 146 42 76 -151 -163 26 29 -1 -21 -138 159 -8 80 189 283 -6 83 -129 117 99 -12 -93 88 42 68
$$ packed form
5834h5J83J77j47k64K90j79L00l09K47j57J18j9m06N08j90m37L92j07nO5j43J39
5856b9ol0M09m92l8K2K00J58k56K38M1j55K1r5m9q9J32J96j41Q2l79N48l43N6
5880Aj62n7L83j11Kl32K52o7J93j1j7N3j40j04L60l36J0K80l77J41L9K41m18K48
5904G1k29P2Q3O8j22J37K7J58k80j30J22p5j4M5Q0j91M30j09j73N8j29M16n37
5927b22J4M23k21j08K5O3R7k55K20k84m8K95J03k43M00M6k82O7j58J09j54J0M06
5950C03m75L5J90m1j06J66l7N7j30J06k72R2L30j55J09k37J6N0L7n7o9J19Q2K5
5974A38J45k42J32k80j62K33J82j85o3N9M4L4rj1j32J90KmR5k48J30L2j92qK66
5999A46j04L4k27j2J89Ll0k0j17K97j67Q8J09R4k89Q9k12K46j8j11q1J81m6K6
$$ plain form
6023 68 -96 147 -8 -245 145 -66 -32 -19 -37 -166 -39 -124 -93 -134 -90 -128 -149 355 -31 -78 -70 -121 190 265 -202
6048 -202 -139 -129 -78 -92 -186 -3 238 199 -160 -63 84 103 154 -250 112 -114 12 106 -56 -39 -206 58 -8 143
6072 143 -257 173 132 -103 -150 24 39 197 -74 -338 -60 55 -56 50 -32 -110 -39 -158 -43 120 196 194 6
6095 6 234 65 247 -19 168 -67 196 101 -138 -124 -100 241 -16 -12 -140 -56 -205 -103 -98 -214 -118 -155 -111 -89 73
6120 73 -45 -122 126 -82 -148 254 24 -120 -97 -97 -270 -299 134 -130 -81 88 -120 7 -382 219 209 248 56
6143 56 -95 -17 -55 -174 0 92 -245 -98 160 17 188 -1 45 -120 -11 -120 13 6 97 16 -165 -59 2
6166 2 253 -51 32 102 -121 148 91 -2 -295 -149 -89 260 126 -67 215 -3 21 352 -79 172 -33 -95 -89 -308
6190 -308 174 140 88 59 72 140 156 -213 8 -110 -108 -117 254 -61 137 36 57 114 -191 10 252 -194 54 66
$$ packed form
6023F8j64K43j55k37L90k11L4J3j8j29J27q5L1m1M4l8k1N04l86m7Qn1L11P5m67
6048b02O3J0N1j4r4J83K41l9l59R7J47J9N1m04L62k26J26R4j62J7j67K64o6J51
6072A43m00M30m1k35m7J74J5J58k71k64K78J15j11J06q2p8P1j19J15J63P6kj88
6095FK28j69J82k66J87k35K63r5k39J4K4L41k57Mj28Q4j49J02Nj16R6l7M4K2J62
6120G3j18p7K48k08o6M02k30j44K3%j73k9M33k64M9J69k08J27l89O01j0L9j92
6143E6j51P8l8j19J74R2l37J47K58j43J71j89M6j65J09j09J33pR1q1j81J06O1
6166BK51l04Q3P0k23K69n7r3k93J46O0L49j34j93K82k18K4L31m31K51k05o2Ok19
6190c08M82l4n2k9J3O8J6l69K21j18KrL71l15J98j01K1N7l05K01K42m46K48J2
$$ plain form
6214 66 147 41 -117 -35 -61 85 10 98 -42 -36 104 110 -40 45 -100 29 -258 -172 -37 -103 -132 3 -28 99 -207
6239 -207 -71 -249 -18 -112 -33 352 81 127 287 -6 -8 -190 130 116 -107 -100 70 3 73 -52 -69 111 -32 91
6263 91 -17 57 101 106 -98 -50 151 131 49 105 -52 97 -47 91 6 46 20 167 12 -307 -28 -7 126 -145
6287 -145 20 85 88 355 -22 -216 22 82 -98 -235 234 126 -246 -139 -2 99 56 40 206 -128 224 -99
6309 -99 -228 -89 276 -3 23 162 -112 -100 34 -9 170 -178 -12 110 -106 -112 -15 -95 -47 29 20 -41 21 102 -191
6334 -191 -145 -132 178 -225 -202 160 -30 -279 -72 -95 50 235 -112 -68 65 155 -20 -97 197 41 232 -24
6356 -24 -87 -124 280 -81 -68 -62 -108 96 -107 -58 102 10 25 263 82 -139 44 45 -299 -42 164 -46 -95 -114 35
6381 35 -32 -3 14 -172 -135 144 -124 -175 17 -110 155 53 -120 6 33 129 -50 -186 -91 -98 -146 -59 -370 -82
$$ packed form
6214F6Q1j06j58Q2k6J46p5Q8j40OJ40Oj50Q5j45J29k87Q6J35o6k9J35l1J27l06
6239b07J36j78K31r4P9L85k71M6J60k93kj82L20j4k23PJ70o7P0j25j7J80j43J23
6263I1j08P4M4Nk04M8K01k0q2N6j57J49j44J38q5M0k6J47j55l19K79K1J33k71
6287a45J65O5LK67l77j94K38O0j80j37M69j08l72J07J37J01m3j6J66l34L52l23
6309i9j29J39L65k79K6J39k74J2J34m3J79l48J66J22k16oR7q0M8P6ro1O2Q1k93
6334a91M6J3L10m03K3L62j90k49K07k3J45J85l47M4J33R0j75p7K94j56J91k56
6356b4o3l7M04l61J3Om6K04k03M9J60r2J5K38j81k21J83Jl44K57K06k10m9j9J49
6381C5o7K9J7j86L7K79k68n1J92j27K65j02j73J26K7R6j79j36R5pm8Q7l11K88
$$ plain form
6405 -82 -49 -195 -32 69 -162 82 256 -218 -198 128 -13 -204 -18 -63 224 -117 46 -115 133 -202 190
6426 190 117 179 -30 158 -24 -201 62 230 -38 239 -167 -60 116 -83 23 231 -234 -14 119 192 -149
6447 -149 -2 4 -13 89 29 -48 -69 -139 219 -75 -48 -123 -4 149 110 19 -8 198 -24 -133 84 145 26 78 0
6472 0 -155 -40 -106 20 274 119 134 -89 -173 -54 72 54 92 -22 211 -39 -179 3 135 -73 -216 -196 -54
6495 -54 -18 149 182 -34 -59 -45 16 103 18 -165 24 -5 -201 40 -107 -73 401 134 -15 117 115 83 27 82 31
6520 31 51 258 -93 43 -103 65 99 78 99 -68 21 14 334 106 -42 -48 34 294 8 -5 338 -64 -94 76
6544 76 90 -76 -6 160 -186 -114 35 196 210 -13 188 -48 18 17 52 -15 -25 12 -61 151 373 -94 33 -148
6568 -148 -122 99 214 80 -66 324 -63 82 -210 -2 -89 38 -76 117 58 -190 14 86 23 370 71 -33
$$ packed form
6405h2L3j46J63J01k31K44J74m74K0L26j41j91J86m5K87l41J63j61K48l35L92
6426A90p3O2k09J88j82j77K63J68k68K77m06J07J76j99J06K08m65K20J33P3l41
6447a49J47Oj7J02o0p7k1p0L58k94K7p5J19J53l9r1k7K06k22j09K17O1j19N2p8
6472@j55J15o6J26K54j55J5k23q4J19J26j8L8j14K33k50j40J82J32k08j43K0J42
6495e4L6J67L3k16k5J4O1Q7q5j83J89k9j96K41j47L4M74k67j49J32kl2n6N5n1
6520C1K0K07l51J36j46J68L4k1K1j67Q9pL20k28j48oQ2K60k86j3L43m02l0J70
6544G6J4j66P0J66l46P2J49J61J4k23K01k36O6jL5o7j0L7p3K12K22m67J27j81
6568a48K6K21J15j34j46L90l87J45k92K08q7J27j14J93n9k48K04P2o3L47k99j04
$$ plain form
6590 -33 -124 76 -174 198 -35 -21 -26 111 161 -43 100 131 -21 153 -170 364 -162 28 -129 27 47 -222 -159
6613 -159 -38 -209 51 -127 -120 63 -28 -261 -79 107 -78 36 318 149 107 97 151 120 -332 141 -56 285
6635 285 -18 -61 65 5 15 -255 78 142 205 3 170 121 63 -73 -56 171 -47 154 -74 205 -186 133 171
6658 171 -251 98 161 -129 4 194 91 54 -71 -256 -114 24 -108 -117 -24 -21 -312 92 -86 2 -29 4 55 9
6682 9 -14 177 105 109 277 -29 287 -2 28 -124 181 -235 -88 111 64 -224 131 -64 -4 -142 -110 33 -10 107
6706 107 -162 156 -182 91 45 -198 -172 -194 59 -113 176 45 -164 28 -46 206 117 46 62 -195 100 171 25
6729 25 -290 2 154 111 77 -149 -98 -42 99 59 139 -113 43 -162 64 180 -408 -187 -21 -147 120 -105
6751 -105 -219 -217 44 -193 12 86 302 31 -40 -30 21 19 172 175 143 -22 -286 -112 168 15 -31 -159 -122 9
$$ packed form
6590c3r1K00k50L72k33J4nJ37N0k04J43L1j52J74l23N34n26J90j57J56K0k69O3
6613a59J21j71K60j78PJ83r1k33J82J86j85J14K82j69m2j0N4l1m52M73j97L41
6635B85l03m3J26o0J0k70L33O4O3k02J67m9n8j36J7K27k18K01k28K79l91L19L8
6658A71m22L49O3k90J33J90j03l7j25j85J42J38j32rR3Lk91M04j78Q8l1L3N1m6
6682Ik3J91p2MJ68l06L16k89L0j52L05m16J47J99m7k88L55j95O0j38L2J43m3J17
6706A07k69L18l38K73m6k43K6k2K53j72K89j31k09J92p4K52q9p1J6k57K95P1j46
6729B5l15K92J52m3l4k26N1N6J41m0Q0k52J56k05K26J16n88K21J66j26K67k25
6751a05j14KK61k37K05P4K16k71p1J0N1kJ53Ll2j65k64J74K80j53m6j28L7J31
$$ plain form
6775 9 95 -121 -28 -35 213 -120 37 128 76 199 90 -14 153 -118 238 42 -35 42 -492 -216 201 -66 98
6798 98 -13 177 -107 30 85 -11 19 12 -136 259 -165 -152 -17 -170 -137 -1 245 -258 -116 -33 -70 -49 148 -61
6822 -61 62 -5 202 -140 -122 -128 130 -11 -16 89 -207 32 -60 138 9 -30 185 13 -63 -56 120 183 118 295 69
6847 69 49 126 47 -138 -47 70 30 303 -31 51 54 82 -170 -100 -217 -78 9 -173 266 75 225 -179 -57 142
6871 142 66 -31 -86 23 -43 59 94 3 -328 -172 -143 44 -221 44 -190 81 -46 -209 -41 -264 -52 -73 -49
6894 -49 -210 -96 -102 -36 -45 141 233 42 84 -80 147 -11 -34 212 49 -16 41 -39 -48 -38 291 94 -9 110 23
6919 23 -77 37 -120 -50 -63 -26 65 -173 100 -78 -50 -210 -105 -45 -120 98 -219 -64 -28 261 -157 -205 218
6942 218 -81 -35 -203 -99 282 -81 242 -149 168 -72 -311 98 74 86 -111 -132 90 240 -90 75 -128
$$ packed form
6775IQ6k16R3pK48l33J57R1n2J23j09j04J67k71L56j96p7P7n34K76M17k67J64
6798I8j11J90k84J37N5r6L0pj48L95m24J3J35j53L3J36K46n03J42Q3l7K1J97k09
6822f1J23o7K07l42J8oK58j41nJ05k96K39r2J98j29l9K15j72p6PJ76O3o5J77k26
6847F9k0P7p9j85R1J17m0K73l34Q2LK8k52P0j17J39Q7j82M39j91J50m04J22J99
6871A42p6r7n5J09o6J02L5r1l31J56K9J87k65K65k34K71j27j63J68k23K12k1K4
6894d9j61J14oO6rJ86R2j91M2j64K27j58k3K46j63o5N7q0rJ0L29j97j03J19q7
6919B3j00J14j57P0j3L7R1k38K73j78K8j60J05O0p5K18l17J55L6K89m18m8M23
6942B18k99M6j68J04L81l63L23l91L17k40k39M09k4J2j97k1K22J50l30J65k03
$$ plain form
6963 -128 -165 -231 97 76 79 -97 78 -249 -275 -193 -92 -123 -110 -189 48 60 210 -157 -275 131 -155 263 128 25
6987 25 54 -55 -119 -272 -108 -56 43 -61 211 -181 -72 89 -389 -99 17 18 -84 -23 111 233 -52 110 49
7010 49 84 118 -6 -144 -40 -138 60 6 -13 -139 77 -214 -166 -158 18 16 106 56 -287 -68 26 219 187 4 12 -42
7036 -42 -5 -142 70 25 12 -108 79 -3 -70 -137 -229 127 113 -97 137 -104 312 203 -148 65 -224 231 -333
7059 -333 138 78 -147 -140 -32 238 187 -173 28 230 -77 -141 162 102 -116 55 -314 -24 -8 -218 -18 -46 70
7082 70 -172 -133 -73 71 -145 -221 24 -4 96 101 276 -225 -61 135 -5 -167 -76 43 -281 97 13 -367 222
7105 222 93 -191 -59 -222 -254 -159 25 108 234 9 21 -66 -50 -42 167 119 -87 15 164 64 -64 -41 -58 30
7129 30 225 15 -156 134 6 -121 -71 103 259 162 -36 -262 235 67 -236 -5 61 137 125 -110 -150 -178 -28
$$ packed form
6963a28l7o6L28k1Lj76J75l27k6Q2J01l1J3p9K37J2J50l67j18M06k86M18j35j03
6987B5K9j09o4j53J64N2R9j04K72l92J09J61m78K90J16Jj02O1J34J22k85J62o1
7010D9L5L4j24j38J04r8J98n4j9j26K16k91M8QJ76kR0n0l43K19R4J93l2j83Qn4
7036d2L7j37K12m5j3j20J87q2o7o7r2L56j4k10K34k41M16j09l51K13k89M55n64
7059c33M71o0k25PJ08K70n1l60K01K02l07o4L03o0k18J71l69K90J6k10K00k8J16
7082G0k42L9O0J44k16p6K45k8J00NJ75n01J64J96j40j62R1J19l24L78q4l80N89
7105B22j29k84J32j63l2R5J84Q3J26k25J2q7J6QK09m8k06J02J49j00j28K3j7Q8
7129C0J95k10j71K90j28j27N0J74J56r7j98k26M97j68l03K31O6P6j2k35m0k8J50
$$ plain form
7152 -28 -31 -108 -149 -122 -121 -23 6 94 283 -64 -85 -161 -296 219 228 -10 -35 -92 -51 92 -169 -195 71 -41 -59 114 -197
7179 -197 -39 53 110 1 -83 -136 -243 -167 -19 -92 98 94 -142 179 306 61 6 147 -121 175 210 -109 61
7202 61 21 95 77 20 110 343 147 133 -140 119 -162 -110 66 -194 -21 -102 -20 -131 130 188 96 85 24 7 192
7227 192 -265 -255 53 227 28 -125 -39 88 -133 39 54 72 255 -66 53 86 92 262 -25 37 -17 -36 -154
7250 -154 28 131 -104 29 80 -9 -78 80 -43 217 -107 -113 25 -131 -13 73 124 -10 -114 -126 10 -69 173
7273 173 60 29 80 49 199 -187 -127 202 49 -153 -168 -73 -25 97 120 21 -8 257 225 90 -48 -91 217 -159
7297 -159 54 -144 131 -88 -117 -14 -179 228 153 261 -54 112 -239 134 6 288 -91 -175 -144 17 203
7318 203 116 -258 -40 -5 188 -303 33 284 29 80 213 274 -99 -42 -173 100 -49 31 -79 -83 108 -110 61
$$ packed form
7152b8lp7m1K7JR8K9Q8J89l47k1p6j35N15Rk38k5n7M1J43k61k6K66j12j8J73l11
7179a97J58R2N7j09q4n3j07P6J48p3J90mk36L21J27k45n5J41k68K96L5l19J70
7202F1m0P4j8n7R0K33j96j4k73K59k81N2J76k60J73q1Q2j11K61N8r2j1o1j7J85
7227A92m57J0L08J74j99j53Q6J27k21J72J5J8J83l21J19L3OJ70k87O2n4j9j18
7250a54J82J03k35J33N1q9o9J58j23K60l24oJ38j56J18Q6N1j34j04j2J36p9K42
7273A73j13l1N1l1J50l86O0L29j53k02j5R5M8J22K3r9k9K65l2j35j38m3L08l76
7297a59K13j98K75k19k9J03j65M07p5J08l15J66l51L73j28K82l79q4L1J61J86
7318B03q7l74K18L5J93m91L36K51k55N1J33O1l73N7j31K73j49Q0j10mJ91k18J71
$$ plain form
7341 61 257 -311 36 -154 181 160 -167 -45 133 188 244 -226 130 -136 -8 99 79 -225 1 91 -90 36
7363 36 9 -227 -40 67 -35 -27 206 86 86 -36 -127 -16 -224 71 -484 200 -2 204 126 -105 -64 4 -5 248
7387 248 -142 -118 167 38 63 182 51 -66 -5 192 104 139 41 -175 27 92 56 0 -28 -110 136 -297 212 -50
7411 -50 52 47 -25 270 56 -233 43 -72 146 -142 -71 40 171 21 -201 -103 -86 -101 -64 293 160 -50 -129
7434 -129 82 17 233 91 -149 229 102 125 136 -28 -118 240 31 -17 267 -164 -133 54 138 -73 -61 42 -59
7457 -59 135 101 76 -68 130 188 52 31 -12 110 59 -212 -150 48 -164 169 100 301 119 -56 182 133 -202
7480 -202 157 -220 -31 12 294 37 -84 66 -64 294 -190 -76 -208 27 102 152 47 -307 -189 12 -5
7501 -5 87 -152 -158 -5 -12 47 24 -11 406 -31 40 -47 101 -137 48 -222 5 -82 -92 -141 -35 114 -167 -152 -118 100
$$ packed form
7341F1J96n68L47j90L35k1l27J22J78N5N6m70L56k66J28J07k0l04K26R0j81J26
7363C6k7k36J87J07j02QK33j20%j22r1J11k08K95n55O84k02K06p8k31M1O8rK53
7387B48l90K4K85j29K5J19j31j17O1J97q8L5r8k16K02O5l6n6k8q2K46m33N09k62
7411e0J02np2K95k14k89K76j15K18k88P1J11J31j50k22R8J7j5L7L57j33k10p9
7434a29K11o5K16j42k40L78j27K3J1j64r0L58k09m8K84m31L1J87Q4k11J2J03j01
7457e9J94l4k5j44J98N8j36k1m3J22n1k71O2J98k12L33o9K01j82j75K38m9l35
7480b02L59l77J89M3K82k57j21J50j30L58m84J14j32K35P5N0j05l54J18K01j7
7501eR2k39oJ53pN9k3l5M17m37P1q7J48k38J85k70K27q7j0m9J06J49k81J5L4K18
$$ plain form
7527 100 63 142 -146 223 -189 -134 14 -101 6 -5 39 57 30 121 21 14 163 -48 -68 -192 168 -63 47 18
7551 18 56 -71 120 66 125 397 158 -150 -325 185 -123 43 79 94 -78 90 98 -100 -43 -67 275 129 274
7574 274 -135 196 190 -162 -127 30 13 63 -27 -83 -100 268 104 22 69 101 208 351 37 37 85 62 11 -262 -262 -31
7600 -31 -107 -62 -54 -70 161 156 -43 20 40 -36 52 69 77 -39 71 61 -33 218 74 2 116 -23 190 -184 -52 114
7626 114 58 41 58 137 36 49 168 35 208 -134 -95 -28 101 -1 258 -190 -132 -93 -179 104 -232 212 123 124
7650 124 42 -7 158 -167 82 -130 -49 -21 137 191 -129 114 250 -81 -142 97 47 -222 23 -5 172 -94 -56
7673 -56 -11 160 3 61 -273 82 -174 -36 24 -270 -99 -205 -94 9 -104 1 52 -54 130 -138 -8 -39
7695 -39 -66 91 315 10 264 -91 -44 -31 -46 115 -170 244 160 92 -20 -153 118 48 -32 -434 -15 213 16
$$ packed form
7527A00l7P9k88L69m12N5J48j15J07j1M4J8k7R1j00pJ49k11k0j24L60k31J10k9
7551A8L8j27J91n4N9K72k39l08j75N10l08J66L6J5j72J68Qj98N7k4L42j46J45
7574B74m09L31ol52L5J57j7N0r0n6j7L68j64q2M7L2J07J43l14%M8k3n1k73%K31
7600c1p6M5Qj6K31nj99O3K0p6Q8J7Qj16J10j0r4K51j44p2J14j39K13l74J32J66
7626A14n6j7J7P9j01J3J19j33J73l42L9O7J29j02K59m48N8L9q6K83l36M44q9J
7650A24q2m9J65l25K49k12Q1K8J58N4l20K43J36l31o1K39n0k69K45k8J77k66L8
7673e6M5J71j57N8l34L55k56J38O0k94J71j06J11J03j13J05N1j06J84k68J30l1
7695c9k7J57K24l05K54l55M7J3j5J61k85M14q4o8j12j33K71p0q0m02M19K28j97
$$ plain form
7718 16 6 15 -5 -22 -174 -74 -120 156 -101 55 -73 130 83 -105 -201 -3 -77 -66 -57 24 -139 -105 -60 -106 69 -205
7744 -205 -40 105 -208 -242 188 123 221 242 61 -10 103 25 42 65 -93 310 -9 -246 51 187 -186 -212 -199
7767 -199 248 -45 -75 -206 -27 -97 16 -93 29 -53 201 19 -124 -3 -253 -160 -112 38 -139 -100 -61 93
7789 93 25 -93 -100 -179 30 -236 91 347 -57 286 -2 88 113 -177 118 -208 -34 -75 -79 -224 18 34 113 -24
7813 -24 -202 72 85 30 -79 -264 -118 195 -67 4 -47 98 -38 69 143 -16 -67 137 -14 -47 84 15 152
7836 152 -179 74 185 -120 -170 -138 40 -28 -145 -156 -99 60 20 -215 -300 21 248 162 -165 -104 215 -121 -115 -50
7860 -50 -148 -35 74 78 36 -8 50 -73 -113 202 347 211 -190 68 402 -23 39 -131 -10 -31 -136 -42 -70 -80
7884 -80 -195 -47 131 -307 -1 27 -108 -126 21 -258 -126 189 5 40 138 197 369 -61 -52 324 -10 50 -142
$$ packed form
7718A6j0Rk0j7j52J00m6K76k57J56j28K03m7j88r6J98p4J1RQ1j63L4M5m6J75k74
7744b05J65J45l13l4M30o5R8K1j81p1J13p8J7K3j58M03l19k37K97J36l73k6J3
7767a99M47k93l0j31J79p0J13j09J22q2K54j82j43J21k50R3M8J50j77L9L9J54
7789I3o8j18pp9K09k66L27K56m04L43k88R0K5k90K95l26J74m1mj45K42J6P9j37
7813b4j78K74J3n5j09j85J46L13k62P1n1J45j36J07P4j59n1K04j51l3J31o9J37
7836A52l31K53J11l05n0L2J78o8j17j1N7J59m0k35q5L21K27q6l27O1L19l36OO5
7860e0r8J13J09Mm2m4N8j23m0L15J45j36m01K58L34m25O2j70J21k1j05R4k8j0
7884h0j15J48J78m38L06K8j35j8J47k79J32L15j84L5R8N9J72m30RL76l34O0j92
$$ plain form
7907 -142 -33 -149 -198 14 -33 60 161 -84 4 136 5 -107 205 -139 213 199 43 222 198 83 33 -79
7929 -79 102 63 208 -188 -114 -5 -193 -48 94 85 -230 -92 -86 -132 -174 109 -140 -116 24 -9 -15 98 26 -126 -96
7954 -96 88 25 -129 -11 3 25 217 44 -23 231 24 179 148 26 14 69 89 -159 -257 173 -83 -197 193
7977 193 169 98 -106 123 -163 279 -20 0 -133 -71 447 -89 -127 -204 104 -139 -38 -148 -146 23 2 -116 205
8000 205 192 42 81 111 -39 -14 72 8 214 -12 -31 -8 -118 -11 44 106 -149 -224 230 378 -63 9 147 -96
8024 -96 -58 38 136 -172 -102 61 177 85 -208 11 -91 12 126 126 117 95 -293 -90 57 70 51 -116 141 69 -53
8049 -53 -84 -180 -163 -117 163 75 198 10 -6 -177 30 -155 79 -91 33 1 77 -120 -134 6 -34 96 197 -176
8073 -176 -249 71 -15 81 -166 -68 -151 53 -29 -190 -240 -22 -174 -270 -32 -322 108 -38 29 36 -71 2 136 68
$$ packed form
7907a42J09j16m9K12m7R3J01k45Q8J32j31j12L12l44L52j4j56J79k4j15n0j12
7929g9J81l9J45l96P4J09j88J45J42rl15J38Om6m2K83k49K4J40l3oJ13p2j52L0
7954i6J84o3j54J18J4K2J92j73o7K54k07J55l1j22j2N5K0k48r8M30k56j14L90
7977A93k4p1k04K29k86M42k99K0j33O2N18n36l8p7L08k43J01j10KJ69k1j18L21
8000B05j3j50L9L0j50K5Q6o4K06k26j9K3j10J07N5O2k55p5M54J48m41P2J38k43
8024i6L8R6R8l08P0J63J16r2k93K19j02J03J14%rk2l88K03J47J3j9j67K57p2j22
8049e3l1r6J7M6K80q8J23j88j6j71K07j85K34j70J24l2P6j97j4J40m0J30J01l73
8073a76p3L20q6R6k47R8q3K04q2j61n0K18j52r6K38k90M30j46O7Pj07P3J34o8
$$ plain form
8097 68 12 235 32 -106 27 131 12 55 86 34 -176 130 -63 19 -53 273 -51 70 35 -119 -11 -1 -58
8120 -58 158 -116 -45 109 -31 -60 111 109 -61 -150 -34 15 184 66 -17 -14 -57 41 -110 57 -24 138 -208 -183 -127
8145 -127 -2 -90 181 -148 189 -121 166 -67 100 -114 -53 -128 153 -193 -46 237 -114 140 114 52 175 -3
8167 -3 -307 -97 -193 51 -115 57 195 5 -77 -241 -37 94 -304 40 -71 -94 72 329 -56 198 288 234
8189 234 -130 -151
$$ packed form
8097F8n6K23k03j38J33J04j19M3L1n2k10L06j93Q2p2L26l24J21l5j54J08J0n7
8120e8K16k74P1J54j40k9J71kj70q9J16M9J69j18q3Lm3R8j51J67q1J62l46K5N6
8145a27J25q8K71l29L37l10K87k33J67k14O1p5K81l46J47K83l51K54k6o2J23j78
8167cl04K10r6K44j66J72J38j90q2j64K04J31l98L44j11k3J66K57l85K54R0n4
8189B34l64k1
8191a51
$$ Imaginary data points
##PAGE= N=2
##DATA TABLE= (X++(I..I)), XYDATA
$$ plain form
0 0 0 0 0 0 0 0 0 0 0 0 0 0 0 0 0 0 0 -5 7 -7 7 -7 7 -12 14 -14 16 -21 22 -28 30 -36 43 -46 51 -59 67 -75 85
39 85 -94 104 -117 130 -144 160 -176 195 -217 238 -260 287 -317 350 -387 427 -471 523 -581 647
59 647 -727 818 -933 1074 -1254 1501 -1848 2398 -3391 5831 -29786 -10563 33845 17684 -18788
74 -18788 -31255 7329 34472 7198 -29218 -19160 17584 32228 -7861 -31644 -9286 29478
86 29478 17894 -16037 -31924 8275 29247 9282 -27551 -19427 16388 30340 -6223 -29096
98 -29096 -7945 24643 21355 -17829 -26976 4119 29495 7174 -22781 -21927 17787 25438 -2808
111 -2808 -28826 -7294 23013 21154 -16301 -25600 3694 26824 9419 -24158 -18724 14044 25922
124 25922 -4507 -25395 -10669 24259 16960 -13034 -25527 4230 24931 10020 -23084 -17362
$$ packed form
0@%%%%%%%%%%%%%%%%%nJ2j4J4j4J4j9K6k8L0l7M3n0N8o6P9q9R7j10J26j42J60
39H5j79J98k21K47k74L04l36L71m12M55m98N47o04O67p37Q14q98R94j104J228
59F47j374J545j751K007k328K755l349M246n789R222l5617J9223M4408j6161l6472
74a8788j2467L8584K7143k7274l6416J0058L6744J4644m0089k3783K2358L8764
86B9478j1584l3931j5887M0199K0972j9965l6833Q124L5815J3952l6563k2873
98b9096K1151L2588l288l9184r147L1095K5376k2321k9955Q54L9714P651k8246
111b808k6018K1532L0307j859l7455r299K9294K3130j7405l3577N434L2768J1878
124B5922l0429k0888J4726L4928p299k9994j2493K9757K0701j4911l3104N722
$$ plain form
136 -17362 13206 23177 -2483 -25181 -8365 20520 18035 -13738 -21442 944 25868 7320 -18988
149 -18988 -17696 13192 21320 -580 -24685 -7728 19294 16969 -11886 -22411 2100 22512 8244
162 8244 -19404 -15396 10138 23442 -2991 -21134 -8520 19264 14771 -9966 -22204 2611 21090
175 21090 7703 -17912 -15738 10730 20559 -1520 -21271 -6537 15974 16694 -11260 -19012 1038
188 1038 21050 6338 -15863 -16295 11030 18482 -1419 -20199 -7197 16459 14733 -10041 -19020
201 -19020 2348 18544 8018 -17495 -13499 9159 19042 -3105 -18165 -8348 17073 13204 -9234
214 -9234 -18323 1981 18662 7379 -15631 -13637 9917 16987 -691 -19239 -6045 14815 13808
227 13808 -10535 -16526 -28 19299 5719 -14533 -13375 9577 17051 -745 -18197 -6229 15257
$$ packed form
136a7362L0568R971k5660k2698J6816K8885k485l1773p704K2386K4924j8548k6308
149a8988J292L0888Q128k1900k4105J6957K7022k325k8855j0525K4511K0412j4268
162H244k7648M008K5534J3304k6433j8143J2614K7784m493k4737j2238K4815J8479
175B1090j3387k5615K174K6468R829k2079j9751J4734K2511P20k7954p752K0050
188A038K0012j4712k2201m32K7325P452j9901j8780J3002K3656j726k4774q979
201a9020K1368J6196j0526k5513L996K2658R883k2147j5060R817K5421l869k2438
214i234r089K0304J6681j1283k3010J994K3554P070j7678j8548J3194K0860j007
227A3808k4343n991J6498J9327j3580k0252J158K2952P474j7796j7452J1968K1486
$$ plain form
240 15257 12504 -8614 -17939 1952 16915 6977 -15673 -11912 7658 18056 -2105 -16365 -6604
253 -6604 14807 12348 -8136 -17054 1437 17335 5560 -13739 -13489 9035 15578 -775 -17500
266 -17500 -5405 12932 13539 -9097 -15201 977 16937 5759 -13106 -13083 8746 15804 -1851
279 -1851 -15715 -6885 14066 11721 -7807 -16543 2365 15062 7487 -14381 -11415 7833 15794
292 15794 -1792 -15381 -6943 13649 11427 -8020 -14949 264 16132 5896 -12631 -12156 8693
305 8693 14178 182 -16530 -4998 12186 11855 -8245 -14452 124 15887 5246 -12656 -11122
318 -11122 7453 15079 -1133 -14555 -6439 13244 10433 -6463 -15506 1578 14440 6034 -13273
331 -13273 -10465 6366 14978 -1088 -14713 -5535 12349 11848 -6981 -13920 356 15274 5014
$$ packed form
240A5257k753k1118r325J9891J4963r938k2650L761J9570J0398k0161j4260R761
253f604K1411k459k0484q918J8491J5898j1775j9299K50K2524O543j6353j6725
266a7500J2095J8337O07k2636o104J6178J5960j1178j8865K3K1829P058j7655
279a851j3864Q830K0951k345j9528q736J8908J2697p575k1868K966J9248P961
292A5794j7586j3589Q438K0592k222j9447o929J5213J5868j0236j8527M75K0849
305H693N485j3996j6712J1532J7184l31k0100o207J4576J5763j0641j7902J534
318a1122J8575P626j6212j3422Q116J9683k811j6896r043J7084J2862q406j9307
331a3273K808J6831Q612j6066j3625R178J7884n01j8829o939J4276J4918j0260
$$ plain form
344 5014 -10968 -11948 7441 13711 -516 -15094 -5126 10843 11565 -7121 -13743 684 14192 5563
358 5563 -11348 -10947 6758 14119 -1281 -13132 -6634 12092 10162 -6254 -14209 1264 13099
371 13099 6371 -11758 -9814 7002 13583 -545 -13322 -5644 11166 10577 -7128 -12605 -173
384 -173 13872 5082 -10594 -11025 7002 12439 385 -13846 -4976 10857 10330 -6597 -12974 346
398 346 12977 5435 -11207 -9658 5455 13222 -744 -12544 -5953 11401 9260 -5066 -13249 703
412 703 12896 5483 -10574 -9662 5549 12866 -338 -13337 -4882 9697 10494 -6091 -12038 14
426 14 13499 4411 -9187 -10391 6117 11945 58 -12869 -5167 9732 10135 -5663 -12527 455
440 455 11870 5631 -10012 -9043 5326 12832 -1046 -11171 -5991 10332 9197 -5350 -12471 335
$$ packed form
344E014j5982r80J9389O270j4227j4578R968J5969P22j8686o622J4427J3508q629
358E563j6911M01J7705P361j5400j1851O498J8726j930j6416p955J5473J1835
371A3099o728j8129J944J6816O581j4128j2777P678J6810n89j7705n477J2432
384a73J4045q790j5676m31J8027N437j2054j4231Q870J5833n27j6927o377J3320
398C46J2631p542j6642J549J5113P767j3966j1800O591J7354k141j4326q183J3952
412G03J2193p413j6057R12J5211P317j3204j2999Q455J4579P97j6585n947J2052
426A4J3485r088j3598j204J6508N828j1887j2927P702J4899M03j5798o864J2982
440D55J1415o239j5643R69J4369P506j3878j0125N180J6323j135j4547p121J2806
$$ plain form
454 335 11359 5617 -9843 -9783 5778 11619 304 -11938 -4625 9057 9989 -5846 -10841 -629
468 -629 12148 4419 -9145 -9754 5857 11109 237 -11737 -5227 9721 9159 -4647 -11393 396
482 396 11398 5754 -9588 -8444 4060 12018 -525 -10998 -5359 9494 8331 -4408 -11406 224
496 224 11470 5062 -8242 -9238 4751 10707 388 -11652 -4680 7943 9313 -5035 -10418 -750
510 -750 11384 4311 -7671 -9261 4853 11004 216 -10722 -4950 8649 8519 -4317 -11260 276
524 276 9802 5600 -8976 -8108 3973 11359 -325 -9876 -5159 8628 8815 -4342 -10455 -222
538 -222 10533 4621 -7728 -9149 4608 9721 748 -10616 -4227 7662 9029 -4902 -9806 -1095
552 -1095 10429 4638 -7819 -8496 4093 9988 209 -9790 -5155 8386 7846 -3575 -10237 -203
$$ packed form
454C35J1024n742j5460O0J5561N841j1315j2242P313J3682R32j5835m995J0212
468f29J2777p729j3564o09J5611N252j0872j1974O510J4948n62j3806o746J1789
482C96J1002n644j5342J144J2504P958j2543j0473N639J4853j163j2739o998J1630
496B24J1246o408j3304r96J3989N956j0319j2040O972J2623J370j4348n383R668
510g50J2134p073j1982j590J4114O151j0788j0938N772J3599j30j2836o943J1536
524B76R526m202j4576Q68J2081P386j1684r551M717J3787J87j3157o113J0233
538b22J0755n912j2349j421J3757N113q973j1364O389J1889J367j3931m904Q711
552a095J1524n791j2457o77J2589N895r779r999M635J3541n40j1421o662J0034
$$ plain form
566 -203 9574 5113 -8322 -7501 3616 10408 60 -9679 -4452 7805 7957 -4041 -9688 -720 10122
581 10122 4146 -6833 -8158 4294 9483 794 -9981 -4180 6877 8221 -4091 -9643 -906 9677
595 9677 4382 -7143 -7556 3619 9877 125 -8818 -4641 7328 7511 -3307 -9831 256 8648
609 8648 4818 -7301 -7672 3339 9459 437 -8931 -4633 6841 7913 -4185 -8896 -887 9109
623 9109 4155 -6748 -7829 3942 8529 983 -9224 -4462 6408 7571 -3592 -8713 -710 8956
637 8956 4752 -6921 -7263 3125 9062 232 -8399 -4895 7310 6832 -3003 -9163 -50 8642 4730
652 4730 -7074 -7045 3110 9034 988 -8919 -4312 6500 7391 -3467 -8442 -1039 8930 3979 -6005
667 -6005 -7540 3428 8471 890 -8461 -3814 6247 7001 -3439 -8631 -405 7829 4286 -6419
$$ packed form
566b03R777m461j3435Q21J1117O792j0348r739N227J2257J52j1998n647Q968J0842
581A0122n976j0979j325J2452N189q689j0775N801J1057J344j2312n552Q737J0583
595I677n295j1525m13J1175O258r752q943M177J1969J83j0818o524J0087Q392
609H648l830j2119l71J1011O120r022r368M298J1474J072j2098m711Q009R996
623I109m954j0903j081J1771M587p546j0207M762J0870J163j1163n121Q003R666
637H956m204j1673l42J0388N937q830q631L504J2205m78r835o160R113Q692l912
652D730j1804K9J0155N924q046r907M607J0812Q91j0858m975P403R969m951r984
667f005j535J0968N043p581r351M647J0061P54j0440n192Q226Q234l543j0705
$$ plain form
681 -6419 -7155 2701 9049 43 -7604 -4403 6599 6977 -2549 -8714 -216 7738 4384 -6394 -7058
696 -7058 3342 8155 757 -8045 -4010 5689 7431 -3567 -7602 -1180 8310 3806 -5470 -7334 3288
711 3288 7657 900 -7863 -4257 5989 6885 -2556 -7999 -479 7446 4732 -6404 -6463 2301 8345
726 8345 366 -7435 -4698 6246 6377 -2672 -8061 -767 7384 4279 -5613 -6305 2904 7394 1214
741 1214 -7787 -3428 5176 6997 -3057 -7564 -1468 7647 3781 -5343 -6518 2428 7553 919 -7461
756 -7461 -3821 5641 6099 -2285 -7915 -572 6782 3968 -5876 -6196 2122 7878 408 -6600 -4033 5406
772 5406 6474 -2101 -7853 -610 7264 3784 -5134 -6575 2835 6977 994 -7297 -3850 4766 6706
787 6706 -2766 -6526 -1146 7135 3954 -5140 -6343 2690 7197 825 -6571 -4056 5048 5997 -1929
$$ packed form
681f419p36R856O348r006p647L201J1002L78r526o165Q498P954l354j0778o64
696g058J0400M813p398q802M035R699J742j0998m035O422R490m504r276j864J0622
711C288M369o757q763L606J0246Q96r441n443P520P925k714j1136n9Q764O044
726H345p979p801K737J0944J31r049n389P294Q151l105r892o92R209M490o180
741A214r001M359Q604J821j0054m507O096R115l866r124j175Q946N125o634q380
756g461L640R462M58q384n630P343P354k814r844l20Q318N756p470p008K567R439
772E406J068q575n752P243P874l480q918j441R410M142n983q291L447Q616J940
787F706r472l760N380Q281l181r094j203R033M507o372p396K515R104R49p926
$$ plain form
802 -1929 -7449 -700 6456 4465 -5478 -5547 2145 7245 556 -6393 -4085 4895 5658 -2477 -6575 -1449
818 -1449 6813 3458 -4797 -6281 2583 6796 1634 -6863 -3502 4388 5970 -2253 -6383 -1276 6632
833 6632 3841 -4570 -6036 1909 7191 823 -6219 -3798 4723 5800 -1573 -7318 -679 5883 3833
848 3833 -4645 -5478 1546 6999 704 -6439 -3983 4454 5632 -1973 -6245 -848 6172 3495 -3974
863 -3974 -5719 2397 6087 1143 -6539 -3262 4044 5985 -1953 -6529 -1023 5998 3654 -4588 -5518
878 -5518 1922 6915 725 -5540 -4042 4797 5312 -1588 -6523 -695 5617 3675 -4498 -5088 1620 6174
894 6174 953 -5793 -3438 4162 5633 -1877 -5811 -1383 6127 3233 -3713 -5666 2081 5802 1133
909 1133 -5972 -3282 4211 5413 -1616 -6103 -960 5623 3404 -4161 -5193 1390 6510 519 -5550
$$ packed form
802a929n520O749P156j991r943o9P692N100o689o949K308Q980P63q135m098N126
818a449Q262l355q255j484Q864M213n162q497L361P890J582q223m130N107P908
833F632k791q411j466P945N282o368p042K421Q521J077p373n745O639O562k050
848C833q478q33P024N453o295p143K456Q437J178p605m272N397P020k677p469
863c974j745Q116L690m944p682L277P306J941p938m576N506P021k344q242r30
878e518P440M993o190o265J498Q839N15o900m935N828O312j942q173n90O708M554
894F174n221o746K355P600J471p510l934M428P510k894o946j953P747L721m669
909A133p105K690P493J202p029m487N143O583k219p565j032O583N120n991o069
$$ plain form
924 -5550 -3568 4405 4804 -1263 -6223 -683 5306 3371 -4059 -5048 1460 5815 791 -5547 -3239 3557
940 3557 5066 -1888 -5567 -992 5593 3244 -3567 -5410 1991 5850 1018 -5394 -3272 3772 5047
955 5047 -1669 -5702 -867 5355 3302 -3795 -4767 1413 5865 678 -4729 -3738 4012 4634 -1485 -5729
971 -5729 -997 4882 3301 -3904 -4810 1442 5235 1301 -5335 -3179 3677 5097 -1859 -5243 -913
986 -913 5209 2776 -3438 -5058 1694 5199 1119 -4971 -3564 3647 4774 -1472 -5516 -666 4858
1001 4858 3431 -3620 -4421 1065 5850 770 -4772 -3351 3752 4358 -1542 -5537 -970 4674 3087
1016 3087 -3301 -4697 1730 5259 1284 -5460 -2834 2902 4778 -1762 -4937 -1169 4880 2794 -3111
1031 -3111 -4964 1628 5279 853 -4591 -3201 3415 4598 -1078 -5340 -430 4197 3104 -3787 -4300
$$ packed form
924e550J982P973L99o067m960N540N989j935p430r89O508M355n024o338K308O796
940C557J509o954l679M575O585k349o811j843P401L859m832o412K122P044J275
955E047o716m033M835O222k053p097r72O180M452n187n407R91P750O22o119m244
971e729M732N879j581p205r06O252L793l934o636K156O856J420o956l384M330
986i13O122k433o214j620O752L505m080o090J407P211J127o246m044M850N524
1001D858j427p051q01N486M785n080n542J421P103O06n900l995M567N644j587
1016C087o388j396O427L529l975o744K626N736J876o540l175L768O049k086n905
1031c111j853O592L651m426n444J390O616J183n676m262M910M627j093o891n13
$$ plain form
1046 -4300 948 5243 660 -4324 -3243 3670 4620 -1408 -4892 -1334 4770 2882 -3331 -4665 1608
1061 1608 4851 1290 -4962 -2988 3083 4398 -1540 -4558 -1272 4988 2870 -3307 -4250 1558 4888
1076 4888 842 -4305 -3123 3226 4186 -795 -5221 -639 3975 3028 -3145 -3950 1064 5088 677 -4440
1092 -4440 -3186 3043 4462 -1084 -4803 -1266 4403 2854 -2412 -4463 1207 4826 1329 -4535 -2727
1107 -2727 2766 4699 -1441 -4722 -982 4204 2874 -3122 -4475 934 4961 971 -4035 -3094 2984
1122 2984 4000 -1160 -5042 -999 3936 3026 -3288 -4096 923 4506 1063 -4038 -2893 3023 4159
1137 4159 -1240 -4821 -1313 4401 2474 -2859 -4378 1233 4197 1111 -4236 -2850 2751 4259 -1118
1152 -1118 -4279 -1224 3979 2868 -2892 -3701 711 4728 935 -3678 -3001 3283 3715 -856 -4923 -738
$$ packed form
1046d300N248M295m583m984J081O913R50o028l484L558O104j888o213j334O273
1061A608L243l561o252J974O071J315n938l018L286O260k118o177r43N808L330
1076D888m046n147J182O349R60m981m426M582M614r47o173q05N014M024m411n117
1092d440J254O229J419n546l719L537N669j549n266k051N670L619l497n864J808
1107b727N493J933o140l281L740N186j330n996j353N409M027l990n006R41O078
1122B984J016n160l882M043M935r10o314q08N019L583l443n101J145N916J136
1137D159n399l581L508N714j927n333j519N611K964l086n347J386N601J508n377
1152a118l161L055N203j111n760q09M412M017l793m613O77O284M32m571m067M185
$$ plain form
1168 -738 4035 2947 -2714 -3817 981 4511 1026 -4157 -2638 2809 4058 -1136 -4051 -1055 4247
1183 4247 2516 -2519 -4296 923 4352 1218 -4027 -2767 2604 3949 -1241 -4336 -778 3828 2717
1198 2717 -2699 -3688 822 4141 634 -3654 -3065 2975 3848 -724 -4526 -711 3833 2839 -2904 -3769
1214 -3769 724 4019 1141 -3989 -2709 2188 3831 -1123 -4002 -1264 3662 2476 -2188 -3876 864
1229 864 3827 1220 -3783 -2528 2252 3620 -550 -4261 -1315 3536 2881 -2691 -3558 495 4319 937
1245 937 -3344 -2768 2683 3429 -613 -4325 -1039 3657 2633 -2297 -3754 811 4070 1135 -3538 -2218
1261 -2218 2216 3833 -847 -3660 -1120 3669 2413 -2261 -3909 915 3922 1192 -3543 -2566 2266
1276 2266 3560 -640 -3935 -984 3624 2871 -2205 -3627 413 4122 618 -3084 -2606 2464 3416 -632
$$ packed form
1168g38M773j088n661j103M798L530l485n183J519N447J249n194k915K996N302
1183D247j731n035j777N219L429l134n245J260N371J345n190l095L558M606j111
1198B717n416r89M510L319l507m288N89O040Q73m572l802L815M544r94n743q65
1214c769M493L295k878n130J280M897J643m954k879K738M926j186m664j688M740
1229H64K963k607n003J255M780J368m170l711K946M851o55n572q67M053L824l382
1245I37m281N76N451P46m042l712L286M696j024m930j457M565L259k935m673J320
1261b218M434J617m680k813K540M789j256m674j648M824L007k730m735R77M832
1276B266J294m200l295K951M608p53n076j422M040L709l504l702M78N070R52m048
$$ plain form
1292 -632 -3762 -991 3349 2846 -2251 -3834 658 3440 1126 -3448 -2472 2072 3609 -764 -3344 -1091
1308 -1091 3198 2667 -2284 -3471 705 3720 1111 -3123 -2874 2387 3142 -638 -3941 -1067 3028 2722
1324 2722 -2529 -3379 413 4061 973 -3075 -2670 1873 3207 -349 -3658 -1255 3324 2484 -1902 -3563
1340 -3563 846 3434 911 -3355 -2172 1802 3717 -540 -3518 -1305 3300 2360 -2136 -3613 344
1355 344 3562 888 -2761 -2477 2077 3157 -275 -3501 -662 3113 2598 -2111 -2877 569 3662 841
1371 841 -3023 -2382 2042 3472 -433 -3096 -1179 3198 2324 -1700 -3435 835 3269 1254 -3110 -2120
1387 -2120 1567 3404 -752 -3512 -1347 2706 2718 -1886 -3199 357 3303 1102 -2674 -2338 2288 2801
1403 2801 -138 -3229 -975 2745 2616 -1941 -3198 440 3390 1237 -2844 -2270 1683 3241 -460
$$ packed form
1292f32l130K771M340n03n097j583M492K782k314m574R76M544J537m373k580K253
1308a091M289n31m951j187M176L015k609m234K49N261P55l780l303K874M095l06
1324B722n251q50L792L648l088m048M05M543J334l556l309K403M579q40m386j661
1340c563M409K588k523m266J183L974J915m257k978K213M605r40m496j477L957
1355C44L218k674l649K84M554J080l432l226K839L775n15m709p66L446L093k821
1371H41l864O41M424J430l905k663J917M377q74m024j735M270K434k015m364R90
1387b120L687J837m156k760K165M053J2m604j313L556K946k201l776L36M626N13
1403B801k939l091K254L720j29m557j257L638K950k153m081N74L953J558l701
$$ plain form
1418 -460 -3247 -1178 3062 2291 -1579 -3338 570 3408 1111 -3134 -2236 1383 3415 -166 -3033 -1018
1434 -1018 2556 2284 -1745 -3144 234 3319 1001 -2937 -2432 1808 2858 -180 -3557 -1097 2486
1449 2486 2357 -1774 -3315 377 3326 1418 -2703 -2153 1565 2914 -353 -2929 -1049 2712 2182 -1493
1465 -1493 -3287 565 3213 1080 -2567 -2125 1617 2763 -340 -3115 -1034 2556 2350 -1898 -2837 216
1481 216 3292 1012 -2717 -2541 1724 2902 -348 -3183 -1098 2653 2306 -1594 -2688 282 2991 1149
1497 1149 -2594 -2074 1315 2974 -370 -2967 -1133 2598 2073 -1143 -3151 171 2761 849 -2275
1512 -2275 -2042 1395 2893 -209 -3022 -806 2318 2225 -1730 -2879 180 3277 854 -2460 -2247 1187
1528 1187 2663 -249 -3155 -1095 2674 2280 -1480 -2974 289 2933 1156 -2427 -1957 1729 3195
$$ packed form
1418d60k787K069M240p71l870j759L908K838k297m245Q98L619K032l581k867K015
1434a018L574k72m029j399L378L085k318l938N05M240J050l038l377K460L583
1449B486j29m131j541L692K949j908m121N50L718J349l267k576J880L761n30l675
1465a493j794L852K648k133l647M42L742J146l103k775K081L590k06m248r39L053
1481B16L076k280l729J76M265J178l250k835K085L751l47l900j094K970K709j842
1497A149l743N20L389J659l344k597J834L731n25l216k008L322K590j912l124
1512b275K33L437J498l102k813K216L124r3l955j149L059L097k423l314K13L434
1528A187J476k912k906K060L769l94l760j494L263K644j777l583M70L686J466
$$ plain form
1543 3195 -395 -2687 -1282 2550 1905 -1198 -3048 238 2830 1091 -2285 -2305 1406 2735 -46 -2699
1559 -2699 -949 2335 2390 -1707 -2388 -86 2999 797 -2108 -2280 1683 2568 7 -2783 -1149 2556
1575 2556 1878 -1447 -2869 301 2753 1280 -2379 -1588 1284 2491 -352 -2463 -894 2397 1856 -1171
1591 -1171 -2738 193 2697 1039 -2082 -2020 1300 2437 -71 -2730 -1084 2294 1893 -1176 -2447 16
1607 16 2627 793 -2100 -2047 1351 2677 -469 -2591 -1167 2207 1710 -1368 -2598 95 2488 1186
1623 1186 -2025 -1880 1153 2701 -266 -2692 -1107 2369 1947 -1081 -2475 301 2646 1009 -2051
1638 -2051 -2207 1423 2531 -46 -2621 -944 2048 1813 -1370 -2428 -57 2710 932 -1853 -1936 1038
1654 1038 2385 4 -2524 -1232 1972 1998 -1073 -2474 550 2271 1296 -2266 -2026 1234 2630 158
$$ packed form
1543C195l590k292J405L832o45l103j850L286K592j739l376k0L711J329k781k653
1559b699J750L284N5m097o81K302L085k202k905j72L963Q85k561k790J634L705
1575B556o78l325j422L170K452j473l659P91K872J207k843k111J569L291n41l027
1591a171j567K931K504j658l121O2L320J137k508k659J646L378m01l069j271K463
1607A6K611j834k893N3L398J326l146k122J424L374m97l078j230K693K393j302
1623A186l211J45L033J548k967k426J585L476m22l028j394K776K345j637l060
1638b051j56L630J108k577k575J677K992k35l183j058K371K767j778k785q3K974
1654A038J347k381k528J292L204K6l071j401L024J721r75l562K40L260J396k472
$$ plain form
1670 158 -2470 -952 1962 1793 -935 -2313 -19 2657 832 -1730 -2054 1289 2328 -187 -2673 -788
1686 -788 1710 1978 -1069 -2514 71 2370 1164 -2129 -1792 908 2380 -85 -2394 -1178 2136 1847
1702 1847 -737 -2614 -351 2277 1185 -1954 -2013 1103 2244 -78 -2263 -1093 1726 2084 -877 -2426
1718 -2426 -83 2352 1059 -1832 -2114 1090 2240 117 -2356 -884 1535 2082 -798 -2210 -158
1733 -158 2105 1055 -1985 -1767 811 2217 -22 -2210 -1150 1609 1668 -886 -2155 -128 2332 1306
1749 1306 -1758 -1794 1037 2200 -206 -2339 -1112 1636 2029 -977 -2071 -46 2177 805 -1471 -2022
1765 -2022 950 2427 113 -2306 -1172 1985 1900 -893 -2345 -142 2050 1148 -1860 -1758 641 2103
1781 2103 35 -1894 -1469 1957 1665 -763 -1969 15 1916 1085 -1634 -1880 794 2005 100 -2177
$$ packed form
1670A58k628J518K914j69k728j378K294K676j825k562l24L343J039k515k486J885
1686g88K498K68l047j445K585K299j206l293L37K700J472k465k309J216L314k89
1702A847k584j877K263K628j092l139n9L116J141k322k185J170K819L58k961j549
1718b426K343K435j293k891k82L204J150k123k473J472K419N47k880j412K052
1733a58K263j050l040K18K578J406k239k188J060K759N9k554j269K027K460j026
1749A306l064l6K831J163k406k133J227K748L93l006j094K025K223j372k276n51
1765b022K972J477k314k419J134L157q5k793j452K203K192r02l008J02K399J462
1781B103k068j929M25L426k92k428j206J984J901q31k719k46K674J211j905k277
$$ plain form
1797 -2177 -857 1130 1720 -874 -1834 -144 2062 901 -1709 -2068 692 2288 132 -2131 -953 1753
1813 1753 1581 -868 -2249 -203 2021 1173 -1757 -1914 903 2242 155 -2197 -992 1441 1366 -749
1829 -749 -2176 -69 2019 1159 -1499 -1813 891 1911 341 -1843 -956 1349 1925 -560 -1922 -484
1845 -484 2024 1117 -1475 -1695 863 1922 269 -1886 -1130 1683 1621 -586 -2096 112 1920 1104 -1522
1862 -1522 -1685 665 2060 425 -1807 -1163 1417 1538 -823 -2010 -279 2007 1059 -1273 -1751 871
1878 871 1776 254 -1943 -674 1333 1832 -740 -1623 -226 1735 791 -1454 -1610 652 1959 -34
1894 -34 -1799 -1095 1620 1330 -460 -2002 -66 1722 727 -1429 -1439 561 1814 92 -1666 -1113 1646
1911 1646 1654 -769 -1962 -406 1701 1071 -958 -2013 910 2145 500 -1643 -964 1255 1531 -637
$$ packed form
1797b177J320J987N90k594r60J690K206j161k610l59K760J596k156k263J178K706
1813A753j72k449j381K046K224q48k930j57K817J339k087k352J205K433p5k115
1829g49j427K107K088q60k658l14K704J020j570k184Q87K305N76k485j362J438
1845d84K508r07k592k20K558J059j653k155P56K813o2k207j510K208J808q16k626
1862a522j63K350J395j635k232O44K580J21k361j187J731K286r48k332m78K622
1878H71R05j522k197J269K007M99k572q83J397J961r44k245j56K262J307j993
1894c4j765P04K715k90j790j542J936J788r95k156j0K000J253j722j758N53K759
1911A646Qk423j193J556K107o30k029j055K923J235j645k143O79K219K76k168
$$ plain form
1927 -637 -1616 -425 1960 845 -1442 -1221 710 1897 137 -1629 -985 1395 1547 -531 -2271 -24
1943 -24 1637 1073 -1331 -1748 382 1702 231 -1490 -603 1182 1817 -834 -1889 -191 1765 971 -1056
1960 -1056 -1469 722 1715 207 -1904 -822 1160 1488 -466 -1795 -216 1751 977 -1203 -1472 321
1976 321 2103 92 -1340 -1142 1313 1322 -596 -1987 -54 1423 1043 -1035 -1458 807 1733 235 -1471
1993 -1471 -992 1263 1543 -749 -1785 -268 1548 865 -1028 -1443 576 1539 330 -1510 -638 1288
2009 1288 1588 -333 -1501 -176 1737 863 -1421 -1359 263 1499 159 -1414 -1037 1035 1314 -320
2025 -320 -1661 -116 1644 956 -1074 -1530 804 1645 114 -1667 -1014 940 1590 -503 -1508 -271
2041 -271 1969 955 -1072 -1372 546 1487 135 -1524 -802 974 1282 -501 -1567 -227 1532 1015
$$ packed form
1927f37r79J191K385j115k287K21J931J187j760j766O44K380J52k078j740K247
1943b4J661n64k404m17K130J320j471j721Q87J785O35k651j055J698J956p94k027
1960a056m13K191R93j508k111J082J982L28j954j329J579J967p74k180k69J793
1976C21J782k011j432J98K455Rj918j391J933J477l80k078m23K265R26j498j706
1993a471M79K255K80k292j036J517J816o83j893m15K019R63j209j840Q72J926
2009A288L00j921j168J325J913q74k284O2J622J236j340j573L77K072K79j634
2025c20j341J545J760o88k030m56K334Q41j531j781O53J954O50k093j005J237
2041b71K240j014k027l00J918R41j352j659P22J776L08j783j066J340J759n17
$$ plain form
2057 1015 -961 -1234 567 1978 -112 -1327 -864 1349 1338 -705 -1542 -368 1416 899 -1249 -1367 688
2074 688 1543 348 -1530 -964 929 1301 -629 -1299 -321 1400 729 -1054 -1415 458 1441 364 -1487
2091 -1487 -1072 1203 1271 -362 -1607 -130 1254 967 -1188 -1076 268 1632 360 -1390 -666 1344
2107 1344 920 -163 -1489 -430 1274 998 -988 -1603 433 1322 394 -1581 -526 795 1383 -444
2123 -444 -1476 -349 1170 752 -958 -1126 370 1507 225 -1197 -846 1128 1068 -270 -1442 12
2139 12 1107 1062 -1029 -1498 269 1614 -68 -1219 -850 761 1393 -262 -1523 -163 1132 782 -673
2156 -673 -1354 274 1503 471 -1478 -641 745 1039 -539 -1279 -240 1443 802 -866 -1166 488 1354
2173 1354 350 -1193 -795 850 998 -401 -1529 -79 1234 904 -906 -1033 306 1626 334 -1457
$$ packed form
2057A015j976k73J801J411k090j215M63K213j1k043q37J174J784n17k148j18K055
2074F88Q55j195j878N66J893L72j930o70R78J721o71j783l61J873R83j077j851
2091a487M15K275O8j633j245J477J384k87k155J12J344J364j272j750P24K010
2107A344m24j083j326J059J704k76j986o15K036Q89r28j975J055J321N88j827
2123d44j032J127J519m18j710j68J496J137j282j422L51J974o0j338j172J454
2139A2J095m5k091m69J767J345j682j151L69J611O32j655j261J360J295l50j455
2156f73o81J628J229j032j949Q37J386K94j578p40J039J683o41j668l00J654Q66
2173A354j004j543L98J645J48j399j128J450J313l30j810j27J339J320j292j791
$$ plain form
2189 -1457 -552 793 1341 -473 -1560 -83 1393 815 -1031 -1445 283 1002 326 -1377 -719 1056 1187
2206 1187 -383 -1123 -378 1378 775 -843 -1085 221 1632 248 -614 -621 663 1034 -346 -1467 -77
2223 -77 1129 836 -1194 -1376 405 1113 207 -1212 -815 926 1177 -242 -1352 -445 1274 866 -717
2240 -717 -1237 631 1204 512 -1061 -582 697 895 -285 -1195 -145 1350 817 -681 -996 219 1534
2257 1534 247 -887 -732 1016 877 -505 -1293 -288 1394 889 -800 -939 254 1410 235 -1030
2273 -1030 -821 778 1379 -426 -1267 -452 1316 597 -811 -1077 329 1236 248 -1288 -527 742 1146
2290 1146 -322 -1263 -400 1070 819 -929 -978 285 1224 504 -1213 -758 762 953 -279 -1212 -238 969
2308 969 769 -682 -1317 224 1313 264 -1010 -545 549 1032 -479 -966 -485 863 670 -966 -1084
$$ packed form
2189a457R05J345N48j814j087J477J476n78j846m14J728P19o76j703O58J775J31
2206A187j570p40P45J756o03j618k42J306J411j384q62pJ284L71j380j121J390
2223g7J206k93k030j82J781P08r06j419L97J741K51j419j110R07J719m08j583
2240g17n20J868N73o92j573M79J279J98j180r10J050J495n33j498l15J215J315
2257A534j287j134J55J748j39j382p88J005J682n05j689j39J193J156j175j265
2273a030K09J599O01j805q41Q15J768p19j408k66J406R07r88j536P61J269M04
2290A146j468r41Q63J470k51j748m9J263R39p20j717M55J520J91j232r33R74J207
2308I69k00j451o35J541J089j049j274M65J094M83j511m87M81J348j93j636j18
$$ plain form
2325 -1084 502 1139 169 -1249 -529 516 932 -171 -1137 -95 1159 661 -890 -697 382 1280 115
2342 115 -1063 -998 666 1037 -175 -1286 -212 1330 781 -657 -992 195 977 348 -1254 -353 733
2359 733 1085 -369 -1132 -324 821 837 -784 -1072 310 1044 352 -1116 -782 817 1198 -386 -1121 -211
2377 -211 997 842 -659 -965 161 1225 190 -810 -812 698 1090 -257 -896 -259 1003 702 -598
2394 -598 -1081 379 979 288 -869 -720 605 1054 -215 -1066 -68 831 748 -763 -1182 272 1175 342
2412 342 -934 -780 687 912 -298 -1034 -289 609 792 -768 -1213 232 1090 198 -638 -398 662 877
2430 877 -42 -993 43 989 557 -436 -1183 416 1119 169 -889 -581 706 1114 -322 -1082 -226 847
2448 847 430 -598 -900 98 1116 -5 -1214 -940 824 885 -300 -1204 -293 988 528 -656 -1185 283
$$ packed form
2325a084J586O37r70j418P20J045M16j103r66J042J254m98j551J93J079Q98j165
2342A15j178O5J664L71j212j111J074J542n49j438l35J187P82o29j602R01J086
2359G33L52j454p63Q08J145J6j621k88J382P34o92j468L34J599L81j584p35R10
2377b11J208j55j501l06J126J064j035j000kJ510L92j347o39O37J262l01j300
2394e98m83J460O00o91j157J49J325M49j269q51R98Q99q3j511m19J454R03q33
2412C42j276J54J467K25j210p36P45Q98J83j560m45J445Q58q92q36K40J060K15
2430H77r19r51J036R46m32r93p47J599P03r50j058L08J287M08j436p60Q56J073
2448H47m17j028l02R98J018j121j209K74J764O1j185r04R11J281m60j184n29J468
$$ plain form
2466 283 1120 276 -1041 -770 434 1022 -70 -951 -94 1000 682 -669 -1099 108 938 236 -918 -578
2484 -578 654 835 -239 -975 -290 692 606 -397 -979 -86 1195 128 -850 -545 572 934 10 -674
2502 -674 -477 821 835 -795 -705 -17 1173 232 -844 -394 697 1027 -538 -1018 -328 866 534 -336
2520 -336 -959 76 934 224 -813 -480 532 732 -285 -1143 -283 790 864 -590 -597 -45 1051 123 -657
2539 -657 -590 812 597 -306 -960 -174 579 738 -265 -743 204 906 -33 -570 -635 193 834 -219 -745 -370
2559 -370 1037 820 -386 -666 155 633 252 -712 -590 719 611 112 -762 -518 665 535 -355 -652 81
2578 81 797 218 -766 -439 785 889 71 -854 -133 898 583 -287 -946 105 664 245 -897 -238 609
2597 609 635 -22 -710 -355 794 531 -564 -517 203 689 296 -601 -555 582 924 -351 -978 -281 567 618
$$ packed form
2466B83Q37q44j317K71J204N88j092q81Q57J094l18j351m30J207Q30p02j154L40
2484e78J232J81j074p36O85R82q6j003n82Q93J281j067r78L05J117L62r24o84
2502f74J97J298J4j630R0O88J190r41j076M50J091L30j565m80O90J194l32q70
2520c36o23J035Q58p10j037L33J012K00j017q58Q60J073P4j454pN52J096r28p80
2539f57O7J402k15r03o54P86P53J59j003m78R47P02r39n37o5Q28O41j053n26L75
2559c70J407k17j206k80Q21M78l81r64J22J309j08m99q74K44J183j30q90k97P33
2578H1P16n79r84L27J224J04q18r25P21J031l15q70o59J051N59m19j142O59Q47
2597F09K6o57o88L55J149k63j095M7P20M86l93q97M6J137L42j275o27O97Q48N1
$$ plain form
2617 618 -224 -894 149 833 288 -457 -692 474 842 -390 -880 -266 746 333 -443 -583 200 813 238
2636 238 -720 -590 536 978 -78 -749 -51 693 402 -332 -716 -168 823 142 -722 -586 382 669 -76
2655 -76 -781 -84 604 362 -918 -821 86 587 -198 -708 -581 376 509 -325 -728 -281 694 193 -620 -847
2675 -847 -98 605 243 -606 -399 686 730 -116 -841 -125 719 296 -373 -774 146 648 421 -675 -438 428
2695 428 581 -286 -546 -122 770 522 -319 -799 162 718 74 -550 -479 398 522 -255 -547 -167 862 682
2715 682 -429 -495 306 783 263 -620 -237 228 651 -385 -599 -361 568 490 -243 -528 412 989 148 -413
2735 -413 -293 352 593 -336 -945 -169 328 443 -267 -373 163 839 302 -695 -465 231 406 -238 -797 -403
2755 -403 585 664 -271 -392 233 473 104 -666 -523 368 587 -248 -496 -177 549 401 -129 -379 -1 435
$$ packed form
2617F18q42o70J043O84n45p45k35J166L68j232m90O14J012m13p76j40P83O13n75
2636B38r58J30J126M42j056o71O98P44k91p34l84N48R91o81q64J36R68K87p45
2655g6p05O97O88k42j280R7R07N01p85n10J27R57J33q34m03M47R75n01q13k27
2675h47P49P03l62q49K07J085M4q46p25P16Q44m23o69m01R20N02k27j096K37Q66
2695D28J53q67k60M24Q92k48q41m80R61N56o44o24P1Q77J24p77k92L80J029j80
2715F82j111o6Q01M77n20q83L83M65M23j036k14K38R29p8p33k85R40N77q41n61
2735d13J20O45K41r29o09P76M97J15p10j06N36O76n37r97K30O96J75o44n59L94
2755d03R88P9r35j21O25K40l69p70J43Q91K19q35k48L19P26j48n30k50L78M36
$$ plain form
2775 435 145 -579 -482 583 715 134 -667 -7 305 626 -277 -435 158 714 239 -804 -454 425 409 -91
2795 -91 -809 -208 412 501 -396 -911 233 549 338 -629 -234 489 532 -235 -696 -333 911 622 -191 -618
2815 -618 122 521 78 -600 -697 783 509 114 -864 -169 558 338 -188 -276 154 550 359 -669 -399 70
2835 70 522 -25 -600 26 537 170 -402 -470 359 559 2 -881 -416 291 702 -86 -373 -393 183 216 -420
2856 -420 -436 265 882 246 -476 -675 374 336 109 -562 -241 352 254 -366 -392 129 514 125 -514 -492 252
2877 252 485 -301 -787 -517 228 400 -252 -394 -40 427 32 -701 -592 551 428 -52 -468 -387 428 412
2897 412 -127 -442 -85 692 81 -335 -267 203 439 -133 -716 -366 259 115 -382 -512 264 563 430 -604
2917 -604 -515 -79 214 21 -433 -307 345 375 -281 -460 461 417 225 -668 -440 261 482 -61 -561 -354 310
$$ packed form
2775D35k90p24R7J065J32n81q01O60L12L21r03j58N93N56m75j043L50Q79j6n00
2795i1p18O01O20Q9q97n15J144L16k11r67L95P23M3p67m61L63J244k89q13m27
2815f18P40L99m43o78r7J480k74l95r78O95P27k20n26q8M30L96j91j028K70M69
2835G0M52n47n75O26N11l67n72o8Q29K00n57q83M65P07M11p88k87k0N76L3o36
2856d20j6P01O17o36p22j99J049l8k27o71L21N93r8o20k6N21L85l89o39K2P44
2877B52K33p86m86K70P45J72o52j42L54M67l95p33J09J143j23m80m16Q1Q15j6
2897D12n39l15L57P77o11m16O8M70K36n72n83L50O25j44m97j30P76K99j33j034
2917f04Q9M36K93j93m54J26O52L0o56j79R21m4j92q93K28P01K21n43n00K07O64
$$ plain form
2938 310 654 -377 -330 36 539 234 -509 -123 135 688 -12 -355 -267 607 222 -418 -641 -53 385 519
2958 519 -423 -404 55 287 134 -290 -248 310 -43 -399 -147 269 610 131 -395 -178 449 414 -148 -656 -163
2979 -163 382 417 -296 -330 121 869 96 -324 -393 439 227 -85 -623 40 338 155 -111 -633 -179 294 204
3000 204 -253 34 348 337 -258 -461 104 421 264 -599 -561 86 695 239 -378 -167 324 247 67 -700 26
3021 26 308 370 -57 -395 223 190 274 -166 -474 314 299 -272 -253 -29 492 394 -350 -441 180 295 61 -470 -87
3044 -87 399 793 115 -464 -393 527 558 -475 -577 100 299 201 -148 -291 35 479 66 -533 -439 182 429
3065 429 -153 -146 36 306 109 -381 -261 255 501 -156 -403 113 50 225 -342 -203 156 532 75 -286 -195
3086 -195 189 532 -129 -450 -238 525 281 -141 -488 124 590 83 -372 -477 321 411 -57 -522 -285 601
$$ packed form
2938C10L44j031M7L66N03l05p43L86K58N53p00l43Q8Q74l85o40k23N88M38J34
2958E19r42J9M59K32j53m24M2N58l53l56K52M16L41m79n26K17O27l5n62n08M93
2979a63N45L5p13l4M51P48p73m20o9Q32k12l12n38O63K98j83k66n22M54M73r0
3000B04m57K87L14j1n95k03N65L17j57q63L8O47O09m56o17K11M91p7j80p67P26
3021B6K82O2m27l38O18l3Q4m40l08P88j5n71J9K24N21r8p44r1O21J15k34n31L83
3044h7M86L94o78n79P1R20L1j033j02O77J99r8l49j43L26M44m13n99R4O21K47
3065D29n82PJ82K70j97m90J20N16K46o57k47N16o3J75n67J39L59L76m57l61R1
3086a95L84L43o61l21K12P63k44m22l47O12M66n07m55j05P98R0m68m65K37Q86
$$ plain form
3106 601 445 -156 -351 33 177 109 -213 -435 343 377 -12 -133 -340 355 138 -450 -311 -211 328 247 -316
3127 -316 -494 104 291 -90 -331 -201 373 366 -74 -232 171 663 263 -329 26 304 320 -43 -431 93 563
3148 563 289 -272 -110 22 584 -47 -558 -369 216 447 -11 -504 -338 678 314 -367 -507 10 125 9
3168 9 -386 -454 202 310 -128 -311 -221 141 388 -78 -261 21 178 248 -225 -243 225 218 296 -302 279 184 231 -143
3192 -143 -145 -97 118 265 -295 -141 -117 298 -64 -122 36 75 296 -379 -447 187 563 -38 -90 -520 -48 351 11
3215 11 -624 -91 309 137 -560 -123 74 325 125 -486 -199 281 345 -208 -451 -118 341 -36 -299 -591 -237
3236 -237 504 108 -245 -173 518 382 -294 -324 3 343 134 -141 -421 -173 488 -82 -363 -181 200 382 -228
3257 -228 -392 -153 179 534 -143 -329 2 411 -91 -304 -371 157 274 166 -232 -415 200 164 100 -415 -265
$$ packed form
3106F01j56o01j95L84J44o8l22k22P78L4l89j21k07O95k17n88J39J00N39q1n63
3127c16j78N98J87l81k41J30N74pm40j58M03M92m00n92L55K78J6l63l88N24M70
3148E63k74n61J62J32N62o31n11J89N85K31m58m93J66J016l64o81j40N17J15j16
3168Il95o8O56J08m38j83R0L62K47m66j83K82J57P0m73j8M68pP8n98N81r5M7l74
3192a43kM8K15J47n60J54K4M15l62n8J58L9K21o75o8O34L76o01n2m30M72L99l40
3215A1o35N33M00j72o97M37J97K51k00o11K87M80O4n53k43L33M59l77k63k92L54
3236b37P41l96l53P2O91j36o76l0L27L40k09k75k80K48O61n70k81J82L81J82o10
3257b28j64K39L32L55o77j86L31M09n02k13o7N28J17j08l98j83O15l6o4n15J50
$$ plain form
3278 -265 497 11 -354 -288 255 517 82 -373 -310 267 302 77 -64 247 202 61 -77 -317 262 263 -71 -205
3300 -205 187 130 105 -70 -401 126 153 -178 -118 -6 197 199 20 -218 264 409 323 227 -320 245 354 -41 -180
3323 -180 88 5 178 56 -107 151 135 -39 -225 -315 91 317 -99 -122 -155 127 209 -134 -513 -154 168 68
3345 68 -143 -306 19 97 1 -242 -128 71 114 -29 -367 -232 394 103 -242 -174 285 307 -34 -373 -68 249
3367 249 264 -78 -489 -134 44 -158 -177 -394 -111 96 -337 -374 47 207 130 27 -326 -25 132 175 -310 -103
3389 -103 125 212 -120 -67 -63 258 346 -280 -277 -268 374 128 -191 -306 109 213 -120 -324 -285 205 149 -81 -385 12
3413 12 368 382 -287 -533 13 498 280 -275 -27 376 485 -49 -299 -85 220 250 -96 -196 39 216 301
3434 301 -174 -207 155 395 -118 -207 -110 249 59 -22 -428 -97 264 -118 -126 -116 273 121 -156 -242 -359 285 175
$$ packed form
3278b65P62m86l65O6N43K62m35m55O3N77L5k25j41L11m5j41j38k40N79Jl34j34
3300b05L92n7k5j75l31N27K7l31O0J12K03Kj79k38M82J45q6r6n47N65J09l95j39
3323a80K68q3J73j22j63K58j6j74j86r0M06K26m16k3l3K82Q2l43l79L59L22j00
3345F8k11j63L25P8r6k43J14J99M3j43l38J35O26k91l45O8M59K2l41l39L05L17
3367B49J5l42m11L55J78k02j9k17K83K07m33l7M21J60p7j03l53L01J57M3m85K07
3389a03K28Q7l32N3ML21Q8o26LRO42k46l19j15M15J04l33k04L9M90n6k30l04L97
3413A2L56J4o69k46N46M85k18n55K48M03J09n34k50K14L05L0l46j00K35J77Q5
3434C01m75l3L62K40n13q9R7L59j90q1m06L31L61l82qJ0L89j52k77q6j17O44j10
$$ plain form
3457 175 -209 -189 94 32 76 -186 -271 250 -38 24 -164 -190 149 210 -72 -70 -108 222 100 -171 -243 -15 -3 99
3481 99 -266 25 -7 140 -123 37 210 441 -41 -217 -199 76 309 -39 -175 -132 84 75 5 -203 -97 244
3503 244 153 -116 -56 -297 178 -126 -29 23 92 85 -171 -257 -161 -65 -106 -352 -401 -91 195 -122 -169 53 27 -7 13
3528 13 -21 -59 182 -32 29 191 -159 233 -261 -35 188 3 143 -137 24 98 109 138 101 -78 66 261 -187
3551 -187 -197 63 240 116 -188 -182 55 107 22 -202 -124 -258 193 30 -354 -185 -72 -98 48 -81 -140 177 -138
3574 -138 -333 173 433 -5 -49 -4 5 228 -137 -141 -81 -40 248 117 -143 -145 12 157 119 -163 -280 128 61 1
3598 1 -151 -117 -241 63 -110 -94 22 -76 -331 -43 264 38 69 -163 38 79 -86 -80 -112 59 205 32 -1 -40
3622 -40 74 364 -127 -451 -30 -8 107 -133 -39 1 178 -160 -112 -8 -8 327 -143 -78 -73 260 333 -364 -40 63
$$ packed form
3457A75l84K0K83o2M4k62q5N21k88O2j88k6L39O1k82Kl8L30j22k71p2K28J2J02
3481I9l65K91l2J47k63J60J73K31m82j76J8K75K33l48j36M3K16rp0k08J06L41
3503B44r1k69O0k41M75l04R7N2O9pk56q6R6R6m1k46m9L10K86l17m7K22k6l4K0
3528A3l4l8K41k14O1J62l50L92m94K26K23j85J40k80J61P4J1K9l7j79J44J95m48
3551a87j0K60J77j24l04OK37N2q5k24P8j34M51j63l84J69J13k6J46j29n9L17l15
3574a38j95N06K60m38m4M5RK23l65mO0M1K88j31k60kJ57J45l8k82j17M08o7o0
3598Aj52L4j24L04j73J6J16r8k55K88L07k26L1k32K01M1j65Ol2J71J46j73l3l9
3622d0J14K90m91l24M21K2J15k40R4M0J77l38M8J04%L35m70O5NL33P3o97L24J03
$$ plain form
3646 63 468 58 -19 -279 7 98 128 45 -43 89 -124 -24 -361 19 232 211 -223 -147 200 165 -58 -159 175
3669 175 39 291 -67 -197 -144 167 -20 27 -267 48 9 155 -137 -2 -34 -184 -25 -249 -4 238 125
3690 125 -145 -236 -266 -5 -194 -291 -357 159 96 -66 56 30 -88 1 8 -149 222 192 -43 -100 -10 86 173 -141 -85
3715 -85 256 275 108 135 50 67 72 124 -233 -181 337 126 260 -109 123 102 15 202 -81 62 154 124 -116 -277
3739 -277 259 258 -141 -280 -59 442 -4 -490 -107 231 278 41 -248 -94 427 175 12 -56 -103 100 39 -112
3761 -112 -175 152 93 187 -165 -109 225 88 -494 -92 157 114 -95 -159 -174 176 238 157 -100 -171 111 20 -64 -363
3785 -363 -123 100 414 -201 -209 84 214 65 -42 -333 350 -208 -390 -162 8 181 132 -308 -205 -60 100
3806 100 0 -466 75 117 109 94 -164 18 76 60 -39 -153 220 -134 -72 -389 -164 223 104 -96 -321 -281 252
$$ packed form
3646F3M05m10p7k60K86R1L0q3q8J32k13J00l37L80K13k1m34P6L47l5k23j01L34
3669A75j36K52l58j30N3L11j87M7k94L15l9J46k92J35l2j50J59k24K45K42j13
3690A25k70r1l0K61j89r7o6N16o3j62J22k6j18Q9Pj57L71l0k35n7R0R6Q7l14N6
3715h5L41J9j67K7q5J7NN2l57N2N18k11J34l69K32k1q7J87k83J43R2l0k40j61
3739b77N36jl99j39K21N01m46m86L83L38M7k37k89J54N21k52j63o8m7K03o1j51
3761a12o3L27n9R4l52N6L34j37n82M02K49m3k09o4j5L50O2q1k57p1K82r1q4k99
3785c63K40K23L14o15qK93J30j49j07k91O83n58j82K28J70J73m9m40J03J45J60
3806A00j00m66N41M2qj5k58J82N8j6r9j14L73l54O2l17K25L87j19k00k25M0N33
$$ plain form
3829 252 250 -431 -29 188 69 -133 -244 218 135 -62 -320 -346 10 244 60 -190 -76 262 -138 147 -139
3850 -139 -30 180 189 -41 -277 144 454 -30 -225 212 -144 79 3 -154 -38 202 244 18 -274 -126 264
3871 264 24 -455 -407 -57 246 241 -237 58 440 189 -157 -132 -87 149 60 -67 -360 31 -16 79 -101 168 -28
3894 -28 190 -136 110 -104 195 -79 -39 -160 61 103 -258 -271 -12 161 138 11 -147 47 7 259 171 -224
3916 -224 165 365 -39 -104 -240 330 154 -70 -183 297 208 -41 43 -137 219 355 139 -288 -157 46 66
3937 66 -169 -211 -21 94 117 -153 -267 -25 305 -303 -42 -202 228 -209 3 -254 72 147 144 2 20 -20 270
3960 270 -21 -124 96 260 210 -52 -112 -34 13 -74 -115 -104 -110 214 138 -157 -135 34 135 -245 -41 -127 49 248
3984 248 -61 -184 159 89 -78 -342 21 93 431 95 -104 77 157 85 -168 -112 84 387 3 -39 -24 241
$$ packed form
3829B52ko81M02K17j19k02j11M62q3j97k58k6L56K34j84k50J14L38m00K85k86
3850a39J09K10Rk30k36M21L10m84j95M37l56K23p6j57J16K40M2k26k92J48L90
3871B64k40m79M8L50L03nm78K95L82k51l46K5M5K36q9j27k93L91m7R5j80K69j96
3894b8K18l26K46k14K99k74M0j21K21M2l61j3K59J73k3j27j58J94m0K52q8l95
3916b24L89K00m04o5j36N70j76k24j13M80q9k49Q4j80L56J36k16m27J31K03K0
3937F6k35m2J90J15K3k70j14K42L30o08K61j60M30m37K12k57L26P5lj42J8m0K90
3960B70k91j03K20J64n0k62o0P8M7q7m1J1oL24p6k95K2J69J01l80K04q6J76J99
3984B48l09j23L43p0j67k64L63P2L38l36j99J81Q0p2k53N6J96L03l84m2J5K65
$$ plain form
4006 241 121 -55 -150 -92 193 143 -131 120 120 76 121 -82 70 77 307 -232 -355 41 207 208 -147 -200 144 70
4030 70 135 -119 8 114 176 -134 -28 22 255 87 -347 -456 76 83 153 -75 -129 170 56 -17 -77 -90 204 102
4054 102 -86 -253 -92 187 77 -303 27 43 214 -142 -92 -184 145 52 31 -1 -12 417 98 -142 -22 281
4076 281 34 93 -193 -196 14 -121 -41 -86 90 157 -83 -105 -200 225 12 29 -31 -139 175 20 -129 -18 24 463
4100 463 226 -438 -124 146 333 -30 -41 -229 7 -146 -250 -49 27 -163 -6 105 -216 206 4 65 -37
4121 -37 149 66 198 -271 -49 161 95 115 -329 -211 -66 -14 -43 -158 -95 144 72 41 -115 -96 38 20 -14 25
4145 25 158 71 148 -87 72 339 301 -209 -27 195 124 -121 -208 -230 377 46 -60 -299 -307 125 199 -283 -239 -129
4169 -129 113 -159 -237 45 163 31 133 -121 -49 200 169 35 -184 292 -42 -114 37 111 -34 -32 -169 -53
$$ packed form
4006B41j20j76r5N8K85n0k74K51%m4M5k03J52PK30n39j23L96J66Jl55n3L44p4
4030G0O5k54J27J06O2l10J06N0K33j68m34j09N32PP0k28n4K99j14p3o0j3K94j02
4054A02j88j67J61K79j10l80L30J6J71l56N0r2L29r3k1l2j1M29l19k40J20L03
4076B81k47N9k86lK10j35Q0m5J76O7k40k2r5M25k13J7o0j08L14j55j49J11M2M39
4100D63k37o64L14K70J87l63j1j88K36j53j04K01P6j90J57J11l21M22k02O1j02
4121c7J86q3J32m69K22K10o6K0m44J18J45N2k9j15O3K39p2l1j56J9J34j8l4L9
4145B5J33q7P7k35J59K67l8n10J82K22p1k45q7k2O07l31j06k39qM32P4m82M4J10
4169a29K42k72p8K82J18j32J02k54P2K49l1j34k19M76l34p2J51P4j45Kj37J16
$$ plain form
4191 -53 -79 253 27 32 -101 -210 173 37 -44 -33 241 256 113 -218 -110 114 -29 94 -112 -7 150 -19
4213 -19 3 -79 79 108 -70 -121 -117 224 44 6 -32 -37 -128 143 -347 15 121 34 -171 -408 -7 240 -41 -61 -49
4238 -49 168 216 -98 71 -288 -135 -105 -17 -337 -21 91 -14 136 -27 190 101 -139 -312 -95 5 164 68
4260 68 -187 161 164 86 -37 -442 -62 138 -114 -123 -213 -156 203 64 -92 179 264 -76 -295 -240 55 204 -52
4283 -52 -135 -242 149 45 215 -176 -10 37 -120 97 81 16 188 -65 -59 -45 -57 51 90 25 72 330 -154 86
4307 86 -61 -242 234 194 12 -63 201 152 -394 -94 -22 175 -1 117 80 146 10 3 -109 129 176 185 -68 -275
4331 -275 -52 256 255 -89 -410 213 -153 -15 -250 -212 139 -6 -176 -90 197 -77 132 -12 -72 54 -19 -38
4353 -38 -216 -59 -30 -170 -124 64 -261 10 176 148 -36 -38 94 -122 160 -309 222 -295 -146 169 151 -40
$$ packed form
4191e3k6L32k26Nj33j09L83j36q1J1K74J5j43l31J08K24j43J23k06J05J57j69
4213a9K2q2J58K9j78n1ML41j80l8l8nr1K71m90L62J06q7k05k37M01K47k81k0J2
4238d9K17M8l14J69l59J53L0Q8l20L16J12j05J50j63K17q9k40j73K17J00J59r6
4260F8k55L48Lp8j23m05L80K00k52rr0N7L59j39j56K71Q5l40k19N5K95J49k56
4283e2q3j07L91j04J70l91J66M7j57K17j6o5J72k53OJ4j2J08L9o5M7K58m84K40
4307H6j47j81M76m0j82p5K64m9n46L00P2J97j76J18l7O6j36pj12K38M7Rk53k07
4331b75K23L08jl44l21O23l66J38k35L8L51j45j70Q6K87k74K09j44o0J26p3j9
4353c8j78J57K9j40M6J88l25K71J66k8j84kJ32k16K82m69N31n17J49L15j8j91
$$ plain form
4375 -40 433 -149 18 -50 154 -20 141 -102 195 82 -4 180 -23 157 -96 -478 226 2 -58 -123 -260 -187
4397 -187 244 137 -21 -141 -31 268 32 -91 -129 234 -122 -274 -41 -295 240 101 102 3 181 51 128 192
4419 192 -40 77 100 -80 -98 -100 156 178 -155 -135 248 354 149 -123 12 31 -59 133 13 -74 98 92 -3 -162
4443 -162 -151 327 48 -218 -172 150 107 87 167 41 -89 153 15 -61 -10 -152 49 -271 5 122 147 -20 -220
4466 -220 -225 -87 102 -41 -48 -17 -31 -79 -228 215 17 74 -172 -13 -108 282 177 47 -1 -119 -81 -6 -87 -123 -1
4491 -1 197 126 5 42 234 156 -350 -276 23 92 33 -145 -195 186 11 0 282 -13 8 84 62 -274 335 165
4515 165 -217 -96 -116 1 158 420 -49 -213 -47 18 146 162 70 -18 65 -34 50 299 75 -148 -72 -50 -8 16
4539 16 -100 -273 -212 -158 -121 -62 267 79 99 -104 -61 77 -5 415 77 35 38 211 101 -322 -469 -76 58 -318
$$ packed form
4375d0M73n82J67o8K04j74J61k43K97j13q6J84k03J80k53l82P04k24o0o5j37P3
4397a87M31j07j58j20J10K99k36j23l8L63l56j52K33k54N35j39Jr9J78j30P7O4
4419A92k32J17K3j80j8kK56K2l33K0L83J06k05k72J35J9r0J92j20q7J72or5j59
4443a62J1M78k79k66M6L22m3k0Q0j26j30K42j38p6N1j42K01l20K76J17K5j67k00
4466b20nJ38J89j43pL1j4m8j49M43j98N7k46J59r5L90j05j30m8j18L8P5q1l6J22
4491aJ98p1j21L7J92p8n06P4K99O9n9j78n0L81j75j1K82k95K1P6k2l36O09j70
4515A65l82J21k0J17J57K62m69j64J66O5J28J6r2q8Q3r9Q4K49k24k23P6K2M2K4
4539A6j16j73O1N4L7N9L29j88K0k03M3J38q2M20l38m2LJ73j10m23j47L93J34l76
$$ plain form
4563 -318 -113 -78 100 173 -324 -76 -113 -96 -56 -76 -194 101 184 -58 -176 -95 314 -51 -198 -308 -101 -65 -15
4586 -15 -167 -49 325 110 3 21 -196 -87 90 124 -171 -135 166 126 -118 115 -31 221 -51 -163 72 -64
4608 -64 -246 -164 -89 4 82 15 65 175 52 97 -16 -109 35 -76 -6 -114 -122 203 -34 76 -63 28 -28 48 -4
4633 -4 -191 -59 -31 321 185 -141 -157 -56 -75 -105 90 -113 30 162 68 -79 109 30 -199 -71 -12 163 -92
4656 -92 -196 -43 129 79 -36 -9 44 321 148 25 -223 -180 151 45 -111 91 168 15 -90 -86 314 15 184
4679 184 -9 -226 -64 96 26 -42 -215 -58 -112 -88 -389 -182 114 57 -30 75 288 -45 151 -269 24 389
4701 389 122 262 -175 112 122 -52 51 47 -259 333 110 -107 -218 32 -19 -89 18 33 22 48 -24 -4 264
4724 264 -50 270 -434 -130 -41 -136 102 37 227 -199 26 -245 108 -86 43 -152 -27 244 -70 201 11
$$ packed form
4563c18K05L5J78P3m97K48l7J7M0k0j18K95Q3k42j18Q1M09l65j47j10K07L6N0
4586a5j52J18L74k15j07J8k17J09J77L4k95L6L01m0k44K33j46K52k72j12K35j36
4608f4j82Q2P5R3P8o7N0J10j23M5j13r3J44j11P0j08qL25k37J10j39R1n6P6n2
4633dj87J32K8L52j36l26j6J01j9l0J95k03J43J32r4j47J88p9k29J28N9J75k55
4656i2j04J53J72n0j15K7N3K77j73j23k48M3L31j06j56K02P7j53j05MM00k99J69
4679A84j93k17J62J60p0o8j73J57n4K4l01K07K96n7q7J05K13l33J96m20K93L65
4701C89k67J40m37K87J0j74J03ml06N92k23k17j11K50n1p0J07J5j1K6p2K0K68
4724B64l14L20p04L04Q9r5K38o5J90m26K25k71L53j94J29j95J25K71l14K71j90
$$ plain form
4745 11 93 207 58 -11 9 158 86 30 147 -72 -335 152 -108 56 -105 -14 206 -90 35 -108 77 102 -94
4768 -94 -8 42 -49 133 -240 -194 30 -125 52 39 -3 -185 83 -96 17 -49 29 239 -54 -52 13 -45 175 195 -340
4793 -340 -18 -340 131 -46 -140 -33 325 239 -237 -91 44 110 -87 -181 112 43 -213 -247 -348 -12 32 154
4815 154 -177 -70 273 -108 5 -223 -219 245 5 -324 -92 -52 -50 -173 -359 -18 62 158 0 -229 239 157 -110
4838 -110 -59 -29 67 -364 -12 -71 29 -8 21 -217 71 -13 -48 -8 -144 13 -84 322 -41 -256 -134 59 72 -189
4862 -189 96 148 -152 -255 35 75 445 62 -183 -156 -345 -182 -148 52 -102 -7 93 -30 -88 63 145 86 126
4885 126 83 0 54 41 -98 -2 193 -22 -91 227 69 72 89 -68 99 -322 -53 -60 -159 -97 126 36 85 -49 -15
4910 -15 -163 -147 11 309 -34 -85 339 257 30 213 -10 -2 -93 285 -172 42 -14 -172 61 -63 -75 -197 -209
$$ packed form
4745A1Q2J14j49o9K0J49p2n6J17k19k63M87k60J64j61R1K20k96J25j43J85K5j96
4768i4Q6N0r1J82l73M6K24j55J77j3m2j82K68j79J13o6P8K10k93KO5n8K20K0n35
4793c40L22l22M71j77r4J07L58q6m76J46J35O6j97r4K93o9k56l4j01L36M4J22
4815A54l31J07L43l81J13k28MM64k40l29K32M0Kj23j86L41Q0R6j58k29M68q2k67
4838a10N1L0R6m31L52n9J00l7K9k38K88q4l5M0j36J57r7M06l63k15J22J93J3k61
4862a89K85N2l00j03K90M0L70l83k45K7j89J63L4K00j54R5J00j23n8J51Q2n9M0
4885A26m3q3N4j3j39R6J95k15o9L18j58LJ7j57J67m21K69pr9O2K23r0M9j34L4
4910a5j48J6J58K98l43n1M24q2k27J83k23Qr1L78m57K14n6j58K33j24j2j22j2
$$ plain form
4933 -209 -342 108 47 -86 141 307 179 226 2 9 80 -27 80 -85 -93 73 358 351 -195 108 -87 -37 -26 -21
4957 -21 -42 296 -388 -107 63 335 44 -100 -104 -53 48 71 -119 -127 14 -36 -92 -89 -32 -149 42 193 -291 -106
4981 -106 212 -128 35 -156 -90 43 -126 -50 -5 335 -136 -250 -100 30 -135 -187 -156 -41 107 38 -181 73
5003 73 -7 220 -192 63 -337 140 -100 -84 -245 191 83 -83 44 -61 318 174 59 -181 85 -98 351
5024 351 -100 -121 49 -67 -93 -93 78 -153 59 -38 -23 -25 14 23 -3 -65 393 215 -137 40 169 -341 -52 -299
5048 -299 -173 77 -213 160 -99 13 70 193 -63 -219 88 -121 36 -127 -206 -225 -6 323 -102 -105 -30 171
5070 171 57 -54 44 -80 35 168 -23 -73 60 42 -59 -42 -277 -108 156 -72 -29 -50 -78 -92 0 -47 183
5093 183 51 -8 -128 -220 124 45 -68 56 140 266 -104 255 -124 169 86 -186 2 -59 147 -59 69 174
$$ packed form
4933b09j33M50o1j33K27J66j28M7k24PP1j07J07j65qJ66K85pn46L03j95N0J1N
4957b1k1L38o84K81J70K72k91j44mN1J01K3j90qJ41n0n6LN7j17J91J51m84J85
4981a06L18l40J63j91O6J33j69P6M5L40m71j14J50J30j65n2L1J15J48o9k19K54
5003G3q0K27m12K55m00M77k40J6j61M36j08j66J27j05L79j44j15k40K66j83M49
5024C51m51k1J70j16k6%J71k31K12r7J5kL9Rk6o2M58j78l52J77J29n10K89k47
5048b99J26K50k90L73k59J12N7J23k56j56L07k09J57j63p9j9K19L29m25lP5K01
5070A71j14j11R8j24J15J33j91n0J33j8j01J7k35J69K64k28M3k1k8j4R2m7K30
5093A83j32n9j20r2L44p9j13J24Q4J26l70L59l79K93q3k72J88o1K06k06J28J05
$$ plain form
5115 174 -89 35 102 -23 -183 -55 297 34 -108 -183 -34 -67 -146 50 -8 -15 74 -175 -76 -174 -141 9 -219 97
5139 97 48 228 274 130 -138 19 101 -8 -8 7 -118 -187 -333 -48 341 -31 -68 -34 202 -368 245 1 124
5162 124 41 75 -196 -124 -45 232 10 -117 118 -72 23 -162 -136 -124 -43 340 -221 -243 5 20 61 -281 -28 -128
5186 -128 155 141 -176 -91 -65 50 62 -16 -65 7 94 -337 -19 -15 70 -73 64 149 132 210 73 -172 -102 16 162
5211 162 -40 -388 -36 269 44 -232 -145 217 176 -127 39 -97 101 -50 17 25 -171 112 198 -112 9 -194
5233 -194 206 -25 -173 -200 23 -48 62 -48 47 174 7 -9 -100 -106 149 -150 -46 -164 -64 225 109 -165
5255 -165 135 455 144 -45 4 96 2 191 102 0 228 -148 116 -93 -80 -114 -21 145 -46 -102 -120 -139 -52 -58
5279 -58 182 -89 -243 36 -259 13 -267 -224 176 129 158 63 -40 124 -1 -79 -13 -8 308 -152 -118 151 -76
$$ packed form
5115A74k63J24O7j25j60J28L52k63j42p5J49l3p9J96n8pQ9k49R9r8L3J50k28L16
5139I7m9J80M6j44k68J57Q2j09%J5j25o9j46K85L89l72l7L4K36n70O13k44J23
5162A24q3L4k71P2P9K77k22j27K35j90R5j85K6J2Q1L83n61k2K48J5M1l42K53j00
5186a28K83j4l17Q5K6J15J2p8m9P2Q7m31L18MQ5j43J37Q5j7P8j37k45P0J18J46
5211A62k02l48L52L05k25k76Q7L62m1l03J66j36J98j51O7Qj96K83Q6l10J21k03
5233a94M00k31j48k7K23p1J10j10R5J27j67j6r1oK55k99J04j18J00K89j16k74
5255a65L00L20l11j89M9R2r4J89q9j02K28l76K64k09J3l4R3J66j91n6j8j9Q7o
5279e8K40k71j54K79k95K72k80M3M00m7K9r5j03J64j25p8O6NL16m60L4K69k27
$$ plain form
5302 -76 204 281 -235 -274 104 -109 -9 28 -82 49 -144 -64 8 -67 -229 -30 75 -120 -11 191 49 -96
5324 -96 -217 119 149 -64 -102 -25 260 126 84 63 267 216 216 -51 13 -15 45 216 -70 14 -67 -22 24 74 -16 199
5350 199 62 -1 18 -82 174 87 23 -118 -170 368 204 -47 40 -21 247 140 129 7 -19 84 -129 125 -291
$$ packed form
5302g6K80P7n16l9L78k13J00L7j10J31j93Q0P2p5j62J99J05j95J09K02j42j45
5324i6j21L36L0k13l8P7K85j34m2k1K04n1%k67O4k8O0J71k86Q4q1M5M6N0r0K15
5350A99j37o3J9j00K56q7o4j41n2N38j64k51Q7o1K68j07j1j22k6J03k13K54m16
$$ [...]
8191A21
##END NTUPLES=NMR FID
##END=
