##TITLE=1H_DE-40W2
 D2O
 64 sc, 
 1.4.2024
##JCAMPDX= 6.0         $$ Bruker NMR JCAMP-DX V2.0
##DATA TYPE= NMR FID
##DATA CLASS= NTUPLES
##ORIGIN= UXNMR, Bruker Analytische Messtechnik GmbH
##OWNER= root
$$ XWIN-NMR		Version 3.5
$$ Mon Apr  1 14:43:33 2024 Russian Standard Time (UT+4h)  she@DPX200
##.OBSERVE FREQUENCY= 200.1312
##.OBSERVE NUCLEUS= ^1H
##.DELAY= (6, 6)
##.ACQUISITION MODE= SIMULTANEOUS
##.ACQUISITION SCHEME= undefined
##.AVERAGES= 64
##.DIGITISER RES= 18
##SPECTROMETER/DATA SYSTEM= spect
##.PULSE SEQUENCE= zg30
##.SOLVENT NAME= D2O
##.SHIFT REFERENCE= (INTERNAL, D2O, 0, 15.7039)
##AUDIT TRAIL= $$ (NUMBER, WHEN, WHO, WHERE, WHAT)
$$ ##TITLE= Audit trail, XWIN-NMR		Version 3.5
$$ ##JCAMPDX= 5.01
$$ ##ORIGIN= Bruker BioSpin GmbH
$$ ##OWNER= she
$$ F:/spectra/data/she/nmr/H-F/1/audita.txt
$$ ##AUDIT TRAIL=  $$ (NUMBER, WHEN, WHO, WHERE, WHAT)
(   1,<2024-04-01 14:42:28.31 +0400>,<she>,<DPX200>,
      <continue with go, POWCHK disabled, PULCHK disabled
       configuration hash MD5:
       00 E9 B6 7A A2 85 ED C7 34 08 36 98 17 FE 4E 26
       data hash MD5: 16K
       6B 60 F0 0C 21 65 2A 4F E5 1E 7E C8 CD D1 4A 0D>)
$$ ##END=
$$ 
$$ hash MD5
$$ 36 0D 84 46 83 F7 D6 67 5D D1 2B 74 30 43 C9 0A
##$RELAX= 
##$RELAX= 
##$RELAX= 
##$RELAX= 
##$RELAX= 
##$RELAX= 
$$ Bruker specific parameters
$$ --------------------------
##$DU= <F:/spectra>
##$EXPNO= 1
##$NAME= <H-F>
##$PROCNO= 1
##$TYPE= <nmr>
##$USER= <she>
##$AMP= (0..31)
100 100 100 100 100 100 100 100 100 100 100 100 100 100 100 100 100 100 
100 100 100 100 100 100 100 100 100 100 100 100 100 100 
##$AQSEQ= 0
##$AQ_mod= 1
##$AUNM= <au_zg>
##$AUTOPOS= <>
##$BF1= 200.13
##$BF2= 200.13
##$BF3= 200.13
##$BF4= 200.13
##$BF5= 200.13
##$BF6= 200.13
##$BF7= 200.13
##$BF8= 200.13
##$BYTORDA= 1
##$CFDGTYP= 0
##$CFRGTYP= 5
##$CHEMSTR= <none>
##$CNST= (0..31)
1 1 145 1 1 1 1 1 1 1 1 1 1 1 1 1 1 1 1 1 1 1 1 1 1 1 1 1 1 1 1 1 
##$CPDPRG= <>
##$CPDPRG1= <>
##$CPDPRG2= <>
##$CPDPRG3= <>
##$CPDPRG4= <mlev>
##$CPDPRG5= <mlev>
##$CPDPRG6= <mlev>
##$CPDPRG7= <mlev>
##$CPDPRG8= <mlev>
##$CPDPRGB= <>
##$CPDPRGT= <>
##$D= (0..31)
0 1.2 0 0 0 0 0 0 0 0.06 0 0.03 0 0 0 0 0.0002 0 0 0 0 0 0 0 0 0 0 0 0 
0 0 0 
##$DATE= 1711967930
##$DBL= (0..7)
120 120 120 120 120 120 120 120 
##$DBP= (0..7)
150 150 150 150 150 150 150 150 
##$DBP07= 0
##$DBPNAM0= <>
##$DBPNAM1= <>
##$DBPNAM2= <>
##$DBPNAM3= <>
##$DBPNAM4= <>
##$DBPNAM5= <>
##$DBPNAM6= <>
##$DBPNAM7= <>
##$DBPOAL= (0..7)
0.5 0.5 0.5 0.5 0.5 0.5 0.5 0.5 
##$DBPOFFS= (0..7)
0 0 0 0 0 0 0 0 
##$DE= 6
##$DECBNUC= <off>
##$DECIM= 32
##$DECNUC= <off>
##$DECSTAT= 4
##$DIGMOD= 1
##$DIGTYP= 9
##$DL= (0..7)
0 120 120 120 120 120 120 120 
##$DP= (0..7)
150 150 150 150 150 150 150 150 
##$DP07= 0
##$DPNAME0= <>
##$DPNAME1= <>
##$DPNAME2= <>
##$DPNAME3= <>
##$DPNAME4= <>
##$DPNAME5= <>
##$DPNAME6= <>
##$DPNAME7= <>
##$DPOAL= (0..7)
0.5 0.5 0.5 0.5 0.5 0.5 0.5 0.5 
##$DPOFFS= (0..7)
0 0 0 0 0 0 0 0 
##$DQDMODE= 0
##$DR= 18
##$DS= 0
##$DSLIST= <SSSSSSSSSSSSSSS>
$$ [...]
##$SUBNAM2= <"">
##$SUBNAM3= <"">
##$SUBNAM4= <"">
##$SUBNAM5= <"">
##$SUBNAM6= <"">
##$SUBNAM7= <"">
##$SUBNAM8= <"">
##$SUBNAM9= <"">
##$SW= 18.0517418723606
##$SWIBOX= (0..15)
0 0 2 0 0 0 0 0 0 0 0 0 0 0 0 0 
##$SW_h= 3612.71676300578
##$TD= 16384
##$TD0= 1
##$TE= 0
##$TE2= 300
##$TE3= 300
##$TEG= 300
##$TL= (0..7)
0 120 120 120 120 120 120 120 
##$TP= (0..7)
150 150 150 150 150 150 150 150 
##$TP07= 0
##$TPNAME0= <>
##$TPNAME1= <>
##$TPNAME2= <>
##$TPNAME3= <>
##$TPNAME4= <>
##$TPNAME5= <>
##$TPNAME6= <>
##$TPNAME7= <>
##$TPOAL= (0..7)
0.5 0.5 0.5 0.5 0.5 0.5 0.5 0.5 
##$TPOFFS= (0..7)
0 0 0 0 0 0 0 0 
##$TUNHIN= 0
##$TUNHOUT= 0
##$TUNXOUT= 0
##$USERA1= <user>
##$USERA2= <user>
##$USERA3= <user>
##$USERA4= <user>
##$USERA5= <user>
##$V9= 5
##$VALIST= <valist>
##$VCLIST= <CCCCCCCCCCCCCCC>
##$VD= 0
##$VDLIST= <DDDDDDDDDDDDDDD>
##$VPLIST= <PPPPPPPPPPPPPPP>
##$VTLIST= <TTTTTTTTTTTTTTT>
##$WBST= 1024
##$WBSW= 4
##$XGAIN= (0..3)
0 0 0 0 
##$XL= 0
##$YL= 0
##$YMAX_a= 521476
##$YMIN_a= -534494
##$ZGOPTNS= <>
##$ZL1= 120
##$ZL2= 120
##$ZL3= 120
##$ZL4= 120
##$ABSF1= 10
##$ABSF2= 0
##$ABSG= 5
##$ABSL= 3
##$ALPHA= 0
##$AQORDER= 0
##$ASSFAC= 0
##$ASSFACI= 0
##$ASSFACX= 0
##$ASSWID= 0
##$AUNMP= <proc_1d>
##$AZFE= 0.1
##$AZFW= 0.1
##$BCFW= 1
##$BC_mod= 2
##$BYTORDP= 1
##$COROFFS= 0
##$CY= 11.3945322036743
##$DATMOD= 1
##$DC= 2
##$DFILT= <>
##$DTYPP= 0
##$F1P= 15.7292609196834
##$F2P= 12.9074282941183
##$FCOR= 0.5
##$FTSIZE= 0
##$FT_mod= 4
##$GAMMA= 1
##$GB= 0.15
##$INTBC= 1
##$INTSCL= 1
##$ISEN= 128
##$LB= 0.24
##$LEV0= 0
##$LPBIN= 0
##$MAXI= 10000
##$MC2= 0
##$MEAN= 0
##$ME_mod= 0
##$MI= 1.114404
##$NCOEF= 0
##$NC_proc= 0
##$NLEV= 6
##$NOISF1= 3.799351
##$NOISF2= 2.8
##$NSP= 1
##$NTH_PI= 0
##$NZP= 0
##$OFFSET= 15.70392
##$PC= 1
##$PHC0= -25317.97
##$PHC1= 32.78731
##$PH_mod= 1
##$PKNL= yes
##$PPARMOD= 0
##$PSCAL= 0
##$PSIGN= 0
##$REVERSE= no
##$SF= 200.130013532006
##$SI= 16384
##$SIGF1= 3
##$SIGF2= 2
##$SINO= 400
##$SIOLD= 16384
##$SREGLST= <1H.CDCl3>
##$SSB= 0
##$STSI= 0
##$STSR= 0
##$SW_p= 3612.71676300578
##$SYMM= 0
##$S_DEV= 0
##$TDeff= 0
##$TDoff= 0
##$TI= <>
##$TILT= no
##$TM1= 0
##$TM2= 0
##$TOPLEV= 0
##$USERP1= <user>
##$USERP2= <user>
##$USERP3= <user>
##$USERP4= <user>
##$USERP5= <user>
##$WDW= 1
##$XDIM= 8192
##$YMAX_p= 0
##$YMIN_p= 0
$$ End of Bruker specific parameters
$$ ---------------------------------
##NTUPLES= NMR FID
##VAR_NAME=  TIME,          FID/REAL,        FID/IMAG
##SYMBOL=    X,             R,               I
##VAR_TYPE=  INDEPENDENT,   DEPENDENT,       DEPENDENT
##VAR_FORM=  AFFN,          ASDF,            ASDF
##VAR_DIM=   8192,          8192,            8192
##UNITS=     SECONDS,       ARBITRARY UNITS, ARBITRARY UNITS
##FACTOR=    0.0002768,     1,               1
##FIRST=     0,             0,               0
##LAST=      2.2672688,     0,               0
##MIN=       0,             -534494,         0
##MAX=       2.2672688,     521476,          0
$$ Real data points
##PAGE= N=1
##DATA TABLE= (X++(R..R)), XYDATA
0@%%%%%%%%%%%%%%%%%%%%%%%%%%%%Oj7L4o1P8q2R4j06J10j19J28j39J58j76J92
43A00k07K30k57K80l08L36l66M06m51M94n50O15o80P58q54R73j121J305j530J834
63A007k266K899l908N692r436K0149r2682m55949K09990N17913K70207k18703
75B44913n70671j79193M85089M52292p3167m58687l76322K06036N58857J72623
85D61770l79811m46429l1288M56898L91531j86996m78250k16380K77743M84581
95C33369P4849m46374l59583J17084M26274K80092k48470m79954p8724L73549
105g888L56720l8855m20634k98394K25650M29549J20744l03670l87641L987M07262
116H6830K80746j61504l95529j84793K83227L95074K531l52050k86724R2349M00122
$$ y = [0, 0, 0, 0, 0, 0, 0, 0, 0, 0, 0, 0, 0, 0, 0, 0, 0, 0, 0, 0, 0, 0, 0, 0, 0, 0, 0, 0, 0, 6, -11, 23, -38, 40, -42, 52, -54, 56, -63, 65, -74, 84, -92, 100, -107, 123, -134, 146, -162, 174, -192, 214, -237, 257, -293, 322, -358, 400, -454, 519, -602, 703, -827, 1007, -1259, 1640, -2268, 3424, -6012, 14137, -78545, -534494, -324504, 193409, 463616, 244913, -325758, -504951, -19862, 432430, 359263, -99424, -475746, -269710, 289147, 461770, 81959, -364470, -395758, 61140, 452671, 265675, -212575, -428955, -151212, 333369, 408218, -38156, -397739, -280655, 145619, 425711, 177241, -302713, -381437, -7888, 348832, 309977, -110657, -409051, -183401, 246148, 366892, 63222, -324419, -320432, 86830, 367576, 206072, -189457, -374250, -91023, 304051, 306582, -45468, -332192, -239843, 160279]
127A60279K08604k67548l59919l8627K96447L12382o0336l89470j98565K18627
137a18126L34575Q9056k78562l25548N3410L50470K04305j58165l42073j18454
147c09112K70615L07369k6678l07973k32519J26585L46638J20462k40614k89750
157b34977j6962K89427K53623j15062l26810j26986J96769K92885M8347k83388
167b3134k49684R4258K97236J51215j66235l02583n6295K61273K38893n4372k79894
178h9322j79370J53344K96602O3505k25277k44510J9463K79803J85554j39432
188A20360k74163q7242J97098K60060o383k69282j82843J07595K63726J14534
198B43460j86310k60598j869K41345J91011p5441k66172j27440J76068K47973
$$ y = [160279, 368883, 101335, -258584, -297211, -764, 311618, 251282, -138188, -336753, -118126, 216449, 305505, 26943, -298605, -245195, 105275, 309580, 151415, -190658, -309112, -38497, 268872, 242194, -65779, -298298, -171713, 174925, 295387, 54773, -234977, -251939, 37488, 291111, 176049, -150761, -277747, -80978, 211907, 260254, -23134, -272818, -178560, 118676, 269891, 103656, -198927, -255222, 6051, 244944, 190572, -89322, -268692, -115348, 181254, 244759, 19482, -225028, -205565, 74238, 259792, 120360, -153803, -241045, -43947, 216113, 209730, -59552, -242395, -134800, 128926, 243460, 57150, -203448, -205317, 36028, 227039, 151598, -114574, -242014, -65946, 182027]
208A82027K3613k15889k10391N8899K63190J28704j49126k40837n3842K07583
218f069K19326n0469k45249j38140J19759K47166P0772k00990k13190L0526K24036
229E7478J60007j03029k50000p5359J79815K10075j905k16888j74557R4664K38581
240A18882Q5247j53334k17848j8731K14675J74489p8103k20805j09078J37063
250f7543K26609K6053k00229j73787N0126K17339J26905j28921k21214l8093J77347
261e408J84711k9551k17223j32293J15235K10404O0254j62428j97587K1051K06566
272E3731J34602q9493k08486q0290J57171J95782r212j87359j48574P0327K12139
283A00338Q7362j45840j87139j4011J75201J63790o0809k06906r1903J22819J88772
$$ y = [182027, 205640, -10249, -220640, -161741, 101449, 230153, 81027, -159810, -213652, -6069, 213257, 162788, -82461, -220601, -100842, 146324, 217096, 16106, -197084, -166558, 57478, 217485, 114456, -135544, -210903, -31088, 178987, 177082, -39806, -214363, -119699, 118882, 204129, 50795, -167053, -185784, 28891, 203380, 125277, -95528, -204606, -67543, 159066, 185119, -15110, -188897, -138771, 78568, 205473, 76552, -144662, -182755, -5408, 179303, 149752, -67471, -199764, -84529, 125875, 186129, 23701, -173886, -152835, 53731, 188333, 98840, -109646, -189936, -32765, 163017, 153805, -33554, -182128, -111801, 100338, 187700, 41860, -145279, -159290, 15911, 179701, 118892, -88014, -179917, -57098, 131674]
294A31674L5973j73431j66909N2222J90529J05410j01953j96417m6234J65238
304c898J62833l1195j79604j23459R3266J95971N0859j47200j63583P052J79929
315D0971J31709q5747j84951o4826J28560J73583M527j76040j30873O7527J78047
326H2487Q3254j20196j77764j1449J61605J35198m5794j78339r5096J14611J71745
337A20262K3491j45579j47998L3475J80848R5268r8752j66806m3891J39087J57053
348A46458k8215j69764j01085P8560J69852N7705j35783j53777J6352J54717J14377
359A49397o4353j74339o2442J25516J49009L700j48350j26727N8501J69115O6553
370A45580j05548j53537k0418J47393J29883m8606j58663q0720R1987J60590K7432
$$ y = [131674, 167647, -5784, -172693, -120471, 70058, 175468, 73515, -122902, -169136, -3898, 158935, 127740, -51864, -175323, -82057, 113914, 164773, 17573, -146010, -138958, 40971, 172680, 86933, -98018, -162844, -34284, 139299, 143826, -32214, -163087, -95560, 82487, 165741, 45545, -132219, -143668, 17937, 153135, 107341, -70998, -166094, -51483, 120262, 143753, -1826, -149824, -116349, 64499, 159767, 61015, -105791, -149682, -10595, 146458, 118243, -51521, -152606, -74046, 95806, 153511, 17728, -136049, -119697, 35020, 149397, 85044, -89295, -151737, -26221, 122788, 126488, -21862, -148589, -90088, 79027, 145580, 40032, -113505, -133923, 13470, 143353, 94747, -63916, -144636, -52649, 107941, 135373]
381A35373j40077j27896K9445J54102R4995q6670j57840l4505J23059J35496j3177
392A12305j55832r9483P8602J49781M8625j10773j44879O896J49659R9238n8630
403G5509j48806o3682J06117J45702K77j34815j09836M4341J51438O9642r8769
414C7118j39413j5063J23856J21885l7165j50467p0976Q3734J38008L3070j22525
425B062j25892L1865J39122P9801o8311j43702m0452J18791J21034j8189j29593
436c3464r3627O0750J45220M4856j06654j21787K194J27711R8936n6229j36158
447f8252n1718Q9735J30893P168j26295r9254M4410J29862O4806q2238j34883
458i5766j1520J17537J00472k8857j29385p5398Q0124J29194J9816j04466j08833
$$ y = [135373, -4704, -132600, -103155, 50947, 145942, 59272, -98568, -133073, -10014, 125482, 112305, -43527, -143010, -64408, 85373, 133998, 23225, -121654, -114758, 34901, 134139, 75509, -73297, -136979, -30862, 114840, 115117, -19698, -129534, -85193, 66245, 135887, 37118, -102295, -117358, 6498, 128383, 91218, -59249, -130225, -46491, 91517, 124587, 2062, -123830, -91965, 47157, 126958, 58647, -85055, -125507, -6716, 114318, 96129, -33464, -127091, -66341, 78879, 123735, 17081, -104706, -102512, 25199, 124135, 67906, -68252, -119970, -30235, 100658, 107826, -18469, -117723, -73313, 56549, 121355, 39117, -95766, -107286, 10251, 110723, 81866, -47519, -122917, -42793, 86401, 106217, 1751, -107082]
469a07082J8107J30147P7813o9710j24834l4670R8401J17054j5993j22363q0260
480a13390N4789J25860M6337r6760j15615Q577J12386Q8563m4901j28881m9889
491a12924R0376J11687O434j07344r8290L9584J26170N3127p6234j14802j8112
502a00328J06120J00322l3433j17904o2703O6029J19228K5565j03339r8200K0917
513g7726J12885P3860o0784j21446k7250R1602J01280p569j13268p9191N6789
524e0818J14711L6297q1838j07473P87J11086P9555m5019j11152m8938P7512J10058
536H4768L808j03075q2846L1665J12819N7018p4680j07379j0276R2326R1334k4050
548G1432j14568n7975O6236J03386K4715q9773r6661K0755J08542O0939n2029
$$ y = [-107082, -88975, 41172, 118985, 49275, -75559, -110229, -11828, 105226, 89233, -33130, -113390, -58601, 67259, 113596, 16836, -98779, -90202, 22184, 110747, 65846, -63035, -112924, -22548, 89139, 95573, -11771, -110061, -70477, 55693, 108820, 32586, -82216, -100328, 5792, 106114, 72681, -45223, -107926, -41897, 77331, 102896, -443, -98643, -77726, 35159, 109019, 48235, -73211, -100461, -8859, 92421, 84852, -28416, -107607, -50818, 63893, 100190, 18352, -89121, -88334, 22752, 102307, 57288, -53864, -102802, -25290, 84768, 88576, -14499, -97345, -65680, 47139, 104157, 29477, -77902, -88178, 4148, 95482, 71432, -43136, -101111, -34875, 68511, 93226, 3453, -93208, -72453, 36089, 97028, 44999]
559D4999j07537l4212Q8923R5398j3376r8993p0458M2826J11881L5984q1969r2494
571g9028j99R5969P9004m1215j07946l8541O9364R6524J0718r6926q0363L5203
583e7436J01405M7962o0737j03216j3533R2099P9341k3023r8151n8805N8784J02430
595F7120J6622q1365q4340J2003J01797O0677n4248r6330k6605P4175R1100r117
607G1489r7784o1027M2561R5637L7271p2890r2124N325Q9294O7315l3479r8206
619d6618m1410O8831Q9625M049q2830p6440K9289R8707M1816n9608q9378j4533
631g8500Q2531P8938k6826r1220m8512M8990R4829K0541q0570p7887J7367Q7020
643B6701N7868m5160r6080k2195P1899P8740o579q6880o2014M2068R1252K9325
$$ y = [44999, -62538, -96750, -7827, 87571, 74195, -24798, -95256, -52430, 59451, 95435, 13466, -79028, -79227, 16742, 95746, 54531, -53415, -91956, -22592, 73932, 84650, -12276, -92639, -57436, 43969, 91931, 31194, -72022, -85555, 6544, 85885, 62862, -35289, -94094, -35310, 67120, 83742, 2377, -81963, -69960, 31837, 92514, 38266, -58064, -84669, -10494, 80606, 71489, -26295, -87322, -44761, 50876, 88147, 15257, -76867, -71542, 17752, 85067, 51588, -46618, -88028, -19197, 70428, 74477, -8353, -84793, -55504, 43203, 85019, 25411, -63967, -78500, 4031, 82969, 56143, -35077, -83589, -34599, 60230, 80771, 201, -77686, -60319, 26701, 84569, 39409, -56671, -78866, -6967, 71773, 65194, -21686, -83700, -41632, 49620, 78945]
655G8945o4088q4048k25Q6544O3387l5474q6958l8412N9505Q6659M311q0838o6070
668g6762K5731Q7480M6247n8165q5765r520P3294P1797j8497q9171m7424N2118
680b8637Q3327J8298o9305p6941J5242Q6136M8718m1479q4471k6669O8250P7200
692F9669r881p9678n5903L4707Q7278K9568o3808p5491K11P6258O3299l2611q5263
705d1645l1637N3837P8309Q128p6253o4505K8063Q0382L8811m7311q2380j3284
717f9485P3306O4669j7861p8024m6993M5057Q1243J5869o5019o7866R551P9248
729B3695M9989m1935p7081k2877N8739P3049n502p7204n0806L2870P6530L1831
741G1298n7420p4588K188P1579N3996k4478p8686l4454N3223P3542L932o5457
$$ y = [78945, 14857, -69191, -69416, 17128, 80515, 45041, -41917, -80329, -20824, 65835, 70146, -10692, -76762, -51031, 36449, 82696, 24531, -61234, -70754, 2540, 74337, 55840, -33331, -80755, -28637, 54690, 72988, 3683, -73258, -58016, 28120, 76838, 35359, -49112, -75781, -7531, 69669, 59788, -19890, -75793, -41086, 46192, 75760, 11952, -63539, -63328, 12930, 76229, 43618, -41645, -73282, -19445, 58864, 66992, -9261, -73766, -45703, 34679, 73490, 26179, -56201, -69485, 3821, 68490, 50629, -27395, -74388, -29331, 51912, 67781, 2762, -65104, -55553, 23695, 73684, 31749, -45332, -68209, -9470, 63579, 58077, -19127, -69933, -37063, 39467, 71298, 13878, -60710, -58522, 13057, 67053, 42575, -36111, -70565, -17342, 56200, 60132, -5325]
753e325o1003J9625P9171L6606m6577p2381j3642O4559O2879j6962p3150m0683
765f6883L8828P4481J9205o3326o2726J0467O9253M7894l4500p6367k0075N6214
777g535O2350l30o9196n2826L3140P2800K4717m9273o7537l581O8963N2223k6972
790C6943o9282l2048M5706P0629M758o3646n3722J7834P0597L7478m4032o8685
802d7470r323N7275N8049j2653p0020l9507L9264O6757J5616n3098o1979R455
814d7634O8002M0310l1074o8106k2036N2720O1604n159o2605m6064K6423O8816
826C5197K4859m9166o0040j238N8521N1393k3537o6993k7330M1777O1513Q611
838E3567n8966n2084J8835O4043L2669l6552o4812j1105N6072N2211j2979o1404
$$ y = [-5325, -66328, -46703, 32468, 69074, 22497, -49884, -63526, 1033, 63912, 46950, -26200, -66883, -28055, 46426, 65631, 2305, -60421, -49954, 19299, 67193, 32693, -43674, -63749, -7535, 54815, 54485, -14711, -67537, -34397, 38403, 63120, 13847, -53690, -57271, 11692, 63915, 36943, -32339, -64387, -18681, 51948, 56706, -6940, -60662, -42828, 27769, 65247, 21215, -47470, -56793, 482, 58531, 45878, -24142, -63649, -24385, 42372, 57988, 4890, -57089, -47634, 20368, 60678, 29604, -38502, -60538, -7818, 53786, 48627, -13978, -60042, -33619, 35197, 60056, 10890, -49150, -50388, 8133, 59526, 35989, -31004, -58334, -16557, 44956, 53567, -5399, -57483, -38648, 25395, 58064, 21512, -43300, -54405, 1667, 53878, 40899, -20505]
850b0505l8492L3950O4575J4106n0535n3634N303O1798M1024l0904o2447j8012
862e3773M4053N8308j853o0868m1911K5611O0681K5710m3140n9722N8N5438M4702
875E3294j8963o1870k9219M1292N8653N002n1782m8959J4964O2446L0243l6592
887A8509n6867j2980N0770N2288j3241n8738l3240K9075N9841J6981m9551n1119
899d8272Q650N3604L9273k5652o1953j6948M4426N0937p67n3620m1848K3470N8660
912B9960K0416l8215n3568l835N3243M2724j9814n6026k6683L5951N6256N125
924D5534n0401m2149J3184N4594L0856l2798n6305p888M4839M6161p871n5330
936a7574l3819L1856N2412J3657m1039n0120O088N3502L3047k4038n2860k0031
$$ y = [-20505, -58997, -25047, 39528, 53634, 3099, -50535, -45232, 16566, 57590, 26686, -35761, -53773, -9720, 48588, 46735, -14133, -56044, -30433, 30248, 55958, 12818, -46904, -46846, 8592, 53294, 34331, -27539, -56758, -15466, 43187, 48189, -3593, -52552, -37588, 24858, 55101, 18509, -38358, -51338, -568, 51720, 38479, -20259, -53499, -24424, 35417, 52398, 2847, -48272, -39622, 13982, 53255, 27603, -34350, -51298, -6872, 44065, 43298, -10322, -52170, -28700, 29960, 50376, 12161, -41407, -45242, 8001, 50725, 30911, -25115, -51798, -15847, 40409, 45534, -4867, -47016, -33832, 20762, 51618, 18820, -37485, -45373, -534, 45627, 37756, -17574, -51393, -19537, 32875, 46532, 5493, -44627, -38539, 14963, 48010, 23972, -28888, -48919]
948d8919M2067N0013l801m8436l8370J9227N4629K2131l8221m9180k653M6549
960E036M3027j7775n4339k3876L4025M8779R034m7449m2019J3805N2281K6457
972D6986k9254n1140j1559M5398M2722r935m7865l2341K6468N1636J2713l9336
984D493m4842L004N0166L3639k4058m9042j8012L5774M6877J337m8266l5398J8887
997b5441M9149K1530l3912m8217k123M4308L7120j2659n0058k5135L1176M8115
1009C3853N968m1047m0487R577M9908K7903k8927m7176j0606L8514M2983p686
1021C2777m7940k6873K1487M7590J5287l7168m2937M281M3395L1695j7903m9370
1033b5679j7393L6128M2788o70m1998l5445J7102M7685J8853l0408m3505m942
$$ y = [-48919, -6852, 43161, 39360, -9076, -47446, -28219, 26410, 48541, 10320, -38860, -41513, 5036, 48063, 30288, -24051, -47927, -13902, 34877, 43911, -3538, -45557, -31752, 20529, 46986, 17732, -33408, -44967, 431, 43153, 33218, -14647, -46988, -20520, 31116, 43829, 4493, -40349, -37345, 12821, 46460, 22402, -26640, -44652, -8878, 37999, 39336, -8930, -44328, -25441, 23708, 45238, 11326, -36891, -39014, 5294, 42414, 29755, -20303, -45438, -14262, 33853, 39821, -1226, -41713, -32136, 17772, 45675, 16748, -30428, -41034, -2520, 40463, 32777, -15163, -42036, -20549, 27041, 42328, 5160, -37777, -33496, 9899, 41594, 23691, -25679, -43072, -6944, 35844, 35174, -6824, -42269, -25167, 22518, 41371, 10963, -32542, -37484]
1045c7484M2104L6283j3477m6640k2422K6773M5683P485l9717l5986Q899M2713
1057A4214K8206k5138m5953r775L6490L7915m468m2890k9465K2696M2768J2960
1069C7560l1748m0662K193M2954K8441j7843m1864j8171L0023M2017P01l9750
1081f149l0514J3228M2596J9417k9288m0372k394L5993L4966j1057m3212k1116
1093c7902K4888L9671Q055l5354l5410R870M0091K3386k1208m0140j1988L4270
1105a771L5575n560l8324k7041J8451M1698J2729l0909l5949K032L6774K8675
1117C6380j6312l9896j5282K7446L7477K313l7844k9175J3308L9133J8209k4823
1129A0934l9754l274L4944L0340q672l9345k2299K3638L8825O333l1501l2039
$$ y = [-37484, 4620, 40903, 27426, -19214, -41636, -14863, 30820, 38305, -1412, -37398, -28499, 14214, 42420, 17282, -28671, -38446, -1956, 35959, 31491, -11399, -40864, -18168, 24600, 37560, 5812, -34850, -32657, 10297, 38738, 20895, -20969, -39140, -9117, 32900, 33601, -6149, -36663, -23435, 19161, 38578, 9290, -31082, -33476, 2517, 37483, 26426, -16786, -37902, -13014, 26657, 34712, -642, -36052, -26182, 13909, 37295, 16087, -24053, -36041, -1771, 33804, 28244, -10080, -37121, -18670, 23028, 35757, 4848, -31101, -29069, 7705, 36380, 20068, -19828, -35110, -7664, 29813, 32126, -5718, -34893, -21585, 17548, 35757, 10934, -28820, -32094, 2850, 33190, 24518, -14827, -37126, -13488, 25337, 31670, 169, -31870]
1141c1870N264L8556K4273k2822l5806j1295L0060L4524l744l8203k3595J7650
1153a7008L6918J4011k8224l5252J356L5176K5982j3194l9510j4265K6565L3375
1165B5930K959l2556k9260J1040L8628J5934k2859l4635n603L1360L0621j0021
1177B1538l5132j9037J9151L5513R110l1331l0099O835L3174K3732j7215l7399
1189b1160r372K8384K9877j643l3830k4152J6254L4462J1922k4793l2350o81L3547
1202F465K2777j1731l3584j6511K4223L3987P89k9169k6524R726L3729J7429k1646
1215I960l3019m871K7994K8125o445l4062j8398J8397L1331R791k6855k8911M977
1228b1986L1793K0326j6015l2888j0196K5433K9793l597l0079k2149J2303L4235
$$ y = [-31870, -26606, 11950, 36223, 13401, -22405, -33700, -3640, 30884, 27140, -11063, -34658, -17008, 19910, 33921, 5697, -29555, -28199, 6977, 32959, 19765, -19745, -34010, -7445, 25930, 28889, -3667, -32927, -21887, 16741, 32675, 9816, -24819, -30422, 938, 31559, 21538, -13594, -32631, -13480, 22033, 31143, -188, -30287, -23452, 9722, 33454, 16239, -21160, -30532, -2148, 27729, 26086, -7744, -31896, -15642, 18820, 30742, 5949, -26401, -27082, 6465, 29242, 17511, -16073, -32584, -8361, 25626, 26415, -2754, -29278, -19552, 14177, 31606, 9960, -23059, -27930, 64, 28189, 21744, -12318, -30716, -12319, 19012, 28803, 1948, -26963, -21986, 9807, 30133, 14118, -18770, -28966, -3533, 26260, 22663, -7416, -29565, -17262, 16973]
1240A6973J2248k3281k9566j040K9392K3962j0790l3216j3481J9998L0445M215
1252B5859k8412k5845J0260L0806J6455j8242l1911n622K6937K5661n831l0280
1264a0165j8750J6288L2080P182k4335k6097J236L0331J9473j3908l0387r806
1276b6858K1818K8480j99k9008k0488J0963K9326J3138k0193k9542J8K7075K1344
1289B5874q583k9009j5843J9643K7782L475k3520k5130P348K9007J5132j6292
1301I884k8368n643K3339K4912n544k7487j7088J4237K8324Q850k2961k5022K427
1314b0140K6481J9361j1926k8884r605J9715K5071R15k5201k0439J0279K8311
1326A3938J1242j8237k6749k592K4875K1498p760k6495j4319J5552K7131M467
$$ y = [16973, 29221, 5940, -23626, -24666, 4726, 28688, 17898, -15318, -28799, -8801, 21644, 25859, -2553, -28398, -18138, 12668, 29123, 10881, -21030, -26652, 285, 25946, 20115, -10165, -28915, -12627, 19453, 26635, 2300, -23797, -22561, 7770, 27243, 13335, -17052, -26858, -5040, 23440, 23241, -5767, -26255, -15292, 14034, 27172, 6979, -22563, -22545, 4530, 25874, 17291, -11718, -27561, -7918, 19864, 23339, -181, -25311, -17963, 11044, 26176, 9884, -18484, -24127, -788, 24124, 18580, -8907, -25995, -11758, 16566, 25416, 2455, -22567, -20140, 6341, 25702, 13776, -15108, -24713, -4998, 20073, 20988, -4213, -24652, -14373, 13938, 25180, 6943, -19806, -22398, 2477, 23975, 16215, -10280, -24599, -9047, 18084, 22551]
1338B2551k3738k1503N091K6257J6629j6144k6437n247K0789K2787k976k5052
1350f993j6827J2719K5392Q936j9807k4420J972K5588J6394j0680k5517j0130
1362b3373J9282K3974o89k3045j8200P277K6001J2335j7672k3345j943K0631K0538
1375B1771o790k6168j1349J4478K3824N391k1756j9834L837K3368J5815j2523
1387A0064k4310o704J9619K0465l342k1709j5816J1038K4152P948j8136k1611
1399a8342M50K2414J7129r947k3161j0529J5809K3867J546k2177j7761P803K2240
1412I341J1987j4394k3925j449J9867J8423n550k3045j2024J3008K2713L694j7795
1425H51j9396K585K3601J3516j2332k1579p219J7521J9888k175k1312j4008R054
$$ y = [22551, -1187, -22690, -17599, 8658, 25287, 9143, -17294, -22541, -1752, 21035, 18059, -6993, -23820, -11101, 14291, 23227, 3420, -21000, -19028, 6560, 22954, 12274, -13243, -23373, -4091, 19883, 19194, -3851, -22051, -14774, 11227, 23562, 5890, -17455, -19398, 1233, 21771, 14981, -11187, -22536, -8058, 15766, 21157, -599, -20433, -16596, 6772, 22587, 10064, -14246, -20950, -1331, 19134, 15792, -5917, -21733, -10695, 13457, 21405, 3269, -18342, -17892, 4522, 21651, 11704, -11457, -21986, -6177, 17690, 19236, -2941, -20702, -12899, 9341, 21328, 6934, -16991, -18440, 1427, 19850, 14300, -8745, -20769, -7761, 14952, 18646, 851, -18545, -15960, 7641, 21157, 8825, -12754, -19973, -2452, 17436, 15261, -6051, -20059, -11005]
1438a1005K2261Q650j7261j9176J103J9236J5169p852k1747q864J4071K0433K070
1451A7088j9366j7146O584K1127J1164j2369k1167m411J9234J6796m773k0211
1463g450j1376J0928K0847N428j8102j6811L093J8539J3584j0396k0481n112J4616
1476b693J8796r60j9113j4536Q666J9982P907j3409k0464o3J8726J5199o819j9730
1490h511r681J2805K0102R92j6348j6706N403J9242J0388j1044j8955k942J4698
1503e57J6714l065j8803j1516R407J9132N817j5777j7700L323J8289J2058q867
1516H455j9145o660J5174J6643m35j7192j4023O747J9495P395j2100j7554j941
1529a5141J6512J4282m955j8031q762J1044J7387K366j5754j3909N132J5896J0244
$$ y = [-11005, 11256, 19906, 2645, -16531, -15428, 3808, 18977, 11125, -10622, -19486, -5415, 15018, 17088, -2278, -19424, -12840, 8287, 19451, 7082, -14085, -18496, 738, 17534, 12761, -7450, -18826, -7898, 12949, 18377, 275, -16536, -13443, 5096, 18680, 8284, -12197, -17309, -2693, 16103, 15143, -3970, -18506, -9840, 10142, 18049, 4640, -15824, -15887, 2839, 18038, 11219, -8511, -18192, -5387, 14715, 15707, -641, -17347, -11944, 7298, 17686, 6642, -12313, -15255, -557, 16157, 13092, -5711, -17227, -7820, 11312, 17129, 1352, -16348, -13025, 5264, 17322, 8455, -10690, -17350, -2176, 14467, 14032, -3160, -17183, -10436, 9059, 16454, 4354, -13200, -15141, 1371, 15653, 10698, -7333, -16095, -5051, 12336, 14702, -1052, -14961, -9829, 6067, 16311]
1542A6311j0158j7621l187J4392J3657k453j6438j1458R753J8036L451j2258j5298
1555a3271RJ7499J2061r085j6465o305J2037J7190l56j6608j1900O094J7374P474
1569A5748j1748j6048j037J4252J2963k578j8580q522R734J7090K887j4036j4019
1582a3894L061J6104R288p936j6029m743J2744J4858k624j4790j0873P223J6301
1595H690N786j2974j3592J488J2561J1269n373j5638n159J0127J4680n97j3835
1608b567j1391N735J4884O764r472j5448q86J3737J1712l884j4730q115Q649J5830
1622A0818K410j3341j2789K781J5079R329r028j4203m588J1737J4312k544j3456
1635c483r762O763J4311N789j1244j3571M60J3321J0496n694j4602o687J0663
$$ y = [16311, 6153, -11468, -14655, -263, 13394, 10941, -5497, -16955, -7202, 10834, 14285, 2027, -13271, -13262, 4237, 16298, 7213, -9252, -15557, -3520, 13670, 13314, -3294, -15194, -9100, 8274, 15748, 4000, -12048, -13085, 1167, 14130, 11552, -7028, -15550, -5816, 11274, 14161, 125, -13894, -10833, 5271, 14559, 6623, -9406, -14149, -1405, 13453, 10829, -3961, -14834, -7611, 8690, 14476, 1502, -12090, -10602, 1959, 13228, 7855, -7783, -12942, -2815, 11865, 11268, -2567, -13958, -8223, 6661, 13425, 3953, -11495, -12381, 1356, 13068, 9184, -5546, -13661, -5012, 10818, 13228, -113, -12902, -10121, 4958, 14287, 5259, -8944, -13532, -1795, 12517, 9973, -3483, -13245, -6482, 7829, 13618, 2374, -11197, -10737, 2584, 13080, 7386, -7216, -13903, -3240]
1648c240J3311J495j2943j1460M562J4038O942q298j3190k824J1457J1886k571
1661I165j3698p618O843J3785L829j2105j1931K837J2353R066o283j4070l574
1674a1401J0240J0785N49j1880j0337N851J3293L864q032j3126O03J1378J0575
1687A2362n476j3802m290Q515J2410R94j1920r872L289J2853O573q331j2308j656
1701a0659J0652J0004j673j2476p682P509J2701K503j0273j1223J345J2390P941
1714A1059n784j2674l484R644J1871j860j0929r505N337J2860M306p957j1797
1727h913l52J0688R525m007j2770o027Q719J1804J748r922j0502K652J2154N814
1741A0611o785j2100j868R783J0052j508j1632p741O321J2387K320q698r988m18
$$ y = [-3240, 10071, 11566, -1377, -12837, -8275, 5763, 12705, 4407, -8783, -11607, -150, 11736, 9165, -4533, -12151, -5308, 8477, 12306, 201, -11730, -8893, 3460, 12526, 6243, -7827, -11401, -1161, 9624, 10173, -1707, -12044, -6193, 7100, 10964, 2932, -10194, -9591, 1787, 12362, 6886, -6916, -11206, -2691, 9719, 10713, -1207, -11079, -7790, 5063, 11636, 3305, -9003, -10659, -7, 9997, 8324, -4152, -11834, -4325, 8376, 10879, 606, -10617, -9272, 3118, 11059, 5275, -7399, -10883, -1239, 10632, 8772, -2157, -11662, -6325, 6535, 10841, 2884, -8913, -9265, 1423, 10948, 6941, -5829, -11856, -3137, 8667, 10415, 493, -10009, -7357, 4797, 10611, 3826, -8274, -10142, -359, 9693, 8185, -3447, -11188, -4867, 7520, 9840, 1142, -8846, -9264]
1755i264J1889P660m924j1416m049Q225R817J001j0056q605L832R882N136o080
1769C048j1406m9Q662Q552l020r468o945P596R991J415q486q679J342J0707N666
1784H926n026j0216k893Q187R391p69j0351o433M467J0716L163p145j0099P44
1798g338R703O921m088r849n016P954R487k41q781p672L321J0772L375o206r461
1813g119j499R322P541k775q224n459M878R588J635p510q857J581J1004M837n312
1828C631r415k269P682P732k78r516n857M968Q935K229o356q429Q2R031O056l029
1844E197r617l403N399R363K23q275p053K673J0201L211n627q470j517Q053P336
1859G694j348r792l888M564Q895J768p648p348R38Q724N239m737q063l032P339
$$ y = [-9264, 2625, 10285, 5361, -6055, -10104, -1879, 7938, 8939, -1117, -9722, -5890, 3992, 9128, 3048, -8358, -8407, 255, 8807, 5787, -3681, -10626, -3030, 6961, 8376, -110, -8789, -7447, 3260, 8926, 3900, -6316, -9209, -1022, 8369, 7600, -2751, -9184, -4717, 5999, 9162, 2017, -8082, -7338, 2365, 9286, 5198, -4651, -9667, -1713, 7774, 7533, -1248, -8920, -5599, 5173, 8548, 2342, -7119, -8618, 704, 8245, 5470, -2754, -8213, -3335, 6253, 7888, 378, -8479, -6898, 4106, 8943, 3631, -5784, -8053, -371, 7361, 7083, -2433, -8290, -3322, 5613, 7842, 1486, -6943, -6861, 2170, 8226, 5197, -4420, -7823, -2424, 6939, 7162, -1113, -8166, -5493, 4708, 7919, 2292, -6178, -7695, 358, 7694, 6346, -3446, -7334, -2770, 6125, 7893, 245, -7103, -6165, 2559, 7798, 3061, -5002, -8034, -695]
1874f95P873j238p480o741M056Q534L536o740p943j89Q418O290l054r046l667
1889h086N514Q080J351p481o346J742Q503M664m862q908j863P694P098j501p949
1904b350n412M441Q532K028p041o452q8R058N248m380p480l756N772R010o22p915
1920a407n665K387Q411M162n756q222k91P732N089j055q387m159N813O355K217
1935G224o866o923J835P054M620l998p617k009N596O986l50p103n197L165P506
1950C923K603m887p545N70O403O306l937p800k790O021O830J55o806n808K211
1965d551P352L685m641p066r36O585N470j703n959m550L331P204J451n974n506
1980e808R13O581M606l145p301j551M953N677N49p386m417K799P042K185m511
$$ y = [-695, 7178, 5940, -1540, -8281, -4225, 4309, 7845, 1105, -6838, -7027, 1391, 7681, 4627, -4419, -8086, -2572, 5508, 6859, -622, -6968, -5226, 3277, 7941, 3079, -5829, -7692, 2, 7100, 5599, -2350, -7762, -3321, 5211, 7239, 198, -6254, -6342, 2716, 7964, 3584, -3896, -7652, -1880, 7130, 6508, -1407, -7072, -4685, 3726, 7888, 2132, -6090, -6381, 1351, 6440, 5385, -3002, -7161, -1348, 5007, 7224, 358, -6565, -4730, 2324, 6944, 2946, -4671, -6680, -1084, 5902, 5552, -1551, -6748, -3583, 3923, 6526, 1639, -5906, -5336, 1067, 7373, 3436, -4364, -7154, -1133, 5697, 5852, -954, -6762, -4551, 2801, 6486, 1845, -5221, -6157, 428, 5898, 4195, -1764, -6314, -2983, 4221, 5672, -302, -5808, -4895, 1686, 6292, 3147, -4154, -5705, -752, 4925, 5474, -1912, -6329, -3530, 3512, 5697, 1186]
1995A186o391r7N588N028j933n887l306M179O451L57n730m916J730N537M811n312
2011A295m693k133N372N844j532n823n320M098O618J960m780n483L27N423M928
2026F101k771p051k913N827N858q93m815n130K290N962J765k793n827p23N521
2041D08M643j047o785k872M437M632J304m826m249P86N882L953l901n631j782
2056e048M411N181p70n093m299L683N211J921m854m715j159N843M520j520o063
2071b751k824M324N320N98n186l888J186N124K803k955n517m69M278M955j176
2086C822n892k338K946M462J584l725m974r0N441L421k008n641j903M373N096
2101D574k30n704l299J278O609J540l483n722m2N727L008j647m482l004L206M925
$$ y = [1186, -5205, -5302, 286, 5314, 3381, -2506, -5812, -1633, 4818, 5175, -555, -5471, -3741, 1796, 6607, 1295, -3398, -5531, -159, 5685, 4153, -1670, -6990, -2892, 3726, 5686, 906, -4577, -4250, 1173, 6101, 3330, -3721, -6634, -807, 5051, 4158, -657, -5787, -3497, 2465, 4230, 1437, -4390, -5113, 408, 5051, 4004, -2781, -5653, -1216, 3416, 4720, -106, -4355, -3569, 2313, 6266, 2365, -3266, -5048, -637, 4544, 3774, -1319, -5618, -1935, 3276, 5197, 343, -4372, -5531, 312, 4832, 3312, -2751, -5575, -1251, 4069, 4667, -519, -4407, -3221, 1903, 4706, 1751, -3766, -4235, 43, 4998, 3822, -2070, -4408, -1462, 3000, 4584, 859, -4115, -4205, 1236, 4657, 2649, -2992, -4895, -522, 4574, 4344, -1360, -4659, -3381, 3228, 4768, 1285, -4437, -4479, 1248, 4256, 2609, -1873, -4877, -1671, 3254]
2117C254J085m990m477J571N299K405k267m927j060L946M272p05m397l624K132
2132b483N077J579l885l761j89M699L882l232l965k167L325M446K76m375l292
2147d065J059M912K647l494l997j209M273L099q6n140k130J812N715K66l851l656
2163c845Q24L781L102j698m477j449K909N064j087m487k760J317N216J718l066
2178A062m133j199M343M002j825n035q98K095M422P24l748l705J317M270K352
2193D044k439l935j140L098M110j540l688k403J822M344J954l937l406J069K599
2208E52K886j441l868j553K715L941k63m278k056J999K895K070l200l978Q42L124
2224C87L815k124l235k393J760M408M55k891l566J321L899J076j367l969q56K961
$$ y = [3254, 4339, -651, -5128, -3557, 1742, 4147, 1880, -3047, -4107, -161, 4111, 3406, -991, -4615, -2483, 2594, 4173, 288, -3473, -3662, 1037, 4919, 1687, -2278, -4445, -1120, 3326, 3602, -773, -4065, -3006, 1906, 4553, 1059, -2938, -4147, 126, 3225, 3139, -2001, -4131, -2319, 3396, 3662, -189, -3845, -3021, 760, 3862, 2164, -2313, -3762, -853, 4211, 3124, -1363, -4123, -2806, 2410, 4128, 1062, -3071, -4270, 73, 4075, 2250, -2785, -3683, -1588, 2834, 3558, -190, -3895, -2578, 1692, 4044, 1605, -2330, -3470, -372, 3738, 2198, -1490, -3893, -2071, 2273, 4227, 290, -3116, -2047, 552, 3438, 1997, -1871, -3424, -709, 3232, 2969, -1309, -3365, -1366, 1529, 3599, 399, -3579, -2737, 387, 4202, 2078, -1157, -3550, -1790, 2618, 3073, 182, -3384, -2063, 1836, 2912, 1545, -2424, -3280, -319]
2240c19L155k14l651k318J691K975R14j984k857L49K502K489r41l159j959K489
2256h38L221j7l136k204J470K836J850j944l661j195L920K660m97l723j659J716
2272a201L760J70k534l247K69M415O99j390l019o96K716K676n31k267j968q8L972
2289A736J729l032j753j600L658J523l97k741k619L024L097L4k771k652O83L488
2305A407O25q19l031k21K016K749r59k801j998J683L303Q6k249j997l85L351K367
2322C127j844k048k157J966L159K26l331j772M96K565K977l194j818j017K470
2337a95L190j318k675j466J634K654R45l068k296L38K786K492j412k931j496L027
2353B09K214j034j718k759J451L699p5k134j801l12K075K866q63l074j646K643
$$ y = [-319, 2836, 2622, -1029, -3347, -1656, 1319, 2233, 249, -2608, -2259, 243, 2732, 1791, -1368, -3327, -838, 2383, 2366, -770, -2974, -1504, 1332, 3182, 1238, -2423, -3618, 302, 2962, 2465, -1258, -2917, -1201, 2559, 2729, 195, -3052, -2783, 1632, 2331, 941, -2078, -2774, -58, 2618, 2087, -180, -2148, -2236, 1736, 3465, 433, -1320, -2920, 738, 2261, 1864, -877, -3496, -472, 2625, 2659, -112, -2764, -2081, 1407, 2032, 1213, -1818, -2039, -23, 2726, 1767, -1034, -3032, -1349, 1954, 2040, -209, -2206, -2591, 760, 3127, 1283, -765, -2922, -956, 2203, 2429, -902, -2674, -2178, 387, 3364, 170, -1648, -2665, -195, 2995, 1677, -998, -2464, -830, 1824, 2769, -299, -2595, -2257, 529, 3021, 1609, -1322, -2818, 209, 2423, 1389, -329, -3088, -1637, 2062, 1987, -147, -1948, -2260, -185, 2681, 1818, -1256, -2902, -259]
2369b59J720J01k308j409M72K694J329j517k732p93K739K463p22k939j658J907
2385i12J909J337k877j384n24L311J250j064k418k55J248J482M06k522j604J341
2401a276K636J21r73k079q0J897K071Ml226j045J916J608M27k082k482J074K254
2418G65K082k756j888J8J790K314m61k803r18K07L569K70k153k118L75J565K409
2435B267j196k212j042J904K076m89j885j509P03J955J218j305j473j294K310
2450B8K428n86k686j488J761J800N32k125j277p1K124J769k226j150p12J036K694
2467A851j00k609q29J84K709J95j039j670Q40Q82J106l99k346q54J264K612Q7
2484A884j976j824K68L160O43o68l119m30J320K745q29j545r96K13J803J721k109
$$ y = [-259, 1461, 1562, -746, -2155, -1683, 1011, 2340, 823, -1909, -2702, 37, 2500, 1778, -1161, -2819, -912, 997, 2334, -543, -1927, -2451, 860, 2110, 1046, -1372, -1627, -379, 1103, 1509, -1013, -2617, -1276, 1360, 1481, 508, -1571, -1651, 246, 2317, 2321, -905, -1950, -34, 1574, 2001, -81, -2563, -1489, 765, 2847, 91, -1797, -1779, 11, 2325, 1864, -939, -1857, -1650, 1919, 2189, 36, -2082, -1707, -142, 2267, 1071, -1141, -2183, -279, 1797, 1308, -577, -2086, -1383, 572, 1790, 485, -988, -2282, 28, 2456, 1870, -816, -2304, -543, 1257, 1789, -336, -1613, -1684, 440, 2209, -17, -1167, -1879, -843, 1851, 1751, -858, -1687, -1503, 1206, 1401, 362, -1308, -468, 414, 1520, 1121, -1225, -2079, -815, 1797, 1884, -92, -1916, -1648, 1512, 2155, 1487, -1632, -2062, -742, 2003, 1174, -371, -1367, -1154, 649, 2370, 261]
2501B61k293M39J803J867r93k537o46K226J587R3k606p66J431P61P22p47k603
2518b001L28J292J689l65j787p14Q19K466kk142j337P21K268K41j89j804j004
2535a521J655J389m45j518j102J072J155Q48r55k120KJ936N08J99j799j308J559
2552d45R37J209j068k198K93K219Q65p28k526O20L36J697n97j363J63p92J906
2569E28J408j831r91n37J727J640j476j396q42J144J518L14j454j069P79J346
2585H08K91n44k158M62J731N87p22j609j081J504J721O99j348k140J105J033P39
2602A078j30k112m01J586J342p13k56j911K13J844R60j542j178j98J232J974p55
2619A033j454j780J667K177p62j80k157m0J642J250o09j942n94J037J984k4j417
$$ y = [261, -2032, -1593, 210, 2077, 1084, -1453, -2099, 127, 1714, 1807, -799, -1565, -134, 627, 1349, 602, -2001, -1673, -381, 1308, 943, -844, -1558, -739, 1727, 1725, -417, -1754, -1033, 1235, 1476, 1287, -517, -1521, 134, 1523, 1078, -440, -1542, -470, 685, 1533, 578, -1542, -1540, 396, 904, 1103, -696, -2004, -445, 492, 1701, 633, -1565, -1272, 947, 1812, 1084, -1442, -822, -486, 1211, 614, -749, -586, -1378, 528, 1936, 105, -886, -1423, 304, 1944, 468, -928, -1770, -626, 892, 1206, -248, -1317, -538, 808, 1099, 555, -1603, -1141, 590, 1177, 455, -1154, -2235, -731, 990, 1689, 341, -1799, -694, 339, 1078, 948, -1164, -1565, 21, 1363, 650, 394, -1517, -1304, 540, 1500, -42, -1220, -1418, -186, 1788, 1033, -421, -2201, -534, 1643, 881, 701, -1456, -1496, 146, 1396, 787, -1155, -1749, -712, 1272, 1248, -169]
2636a69j278M20J935M98r08k155P81J939J73q94j423m71P49J802N19j422j826
2653a730J233O50J278j393j588K13J501J681p95j391n17j00J495P22j664j41k71
2670h17J401J003j209p34j045J185J532j84j299j070M5J960M48j434o02mJ211
2687C87J359r75j389rQ2Q02Q80o36k199R33J421k8o55o68L9K86K155n76j716j308
2707a815J619L39J613j895q63N76k83J260o8j393n56Q25J671K54j450j376N00
2724a042K532p1o87j554J55O47J251p9j602n30L18J293N73j216j274N61P70J064
2742A109l64j518Q41K8R50j70j272k48k15J074O72l55j294j39J039J114j233r62
2760i43n12Q63J546L08n33j780J094M11O41q77j209L58L20O58m4l95j274N82J518
$$ y = [-169, -1447, -1027, 908, 1406, 498, -1657, -876, 1063, 1236, 342, -1081, -1552, -803, 999, 1518, 96, -1730, -497, 153, 1431, 38, -1550, -1337, 164, 1845, 1050, -341, -858, -958, 537, 1259, -405, -546, -817, 584, 1587, 378, -356, -1401, -216, 1316, 1132, -167, -1237, -1192, 768, 1216, -218, -820, -824, 387, 1746, 771, -618, -627, -545, 257, 1137, 501, -1698, -765, 656, 628, -27, -695, -656, -370, 1785, 1209, -507, -1815, -196, 143, 1756, -139, -1002, -426, -709, 551, 483, -910, -1466, -641, 1030, 1284, -166, -1542, -1042, 1490, 1419, 732, -822, -667, -20, 1231, 1152, -450, -980, -662, 631, 1204, -12, -1286, -725, 45, 1109, 745, -773, 68, 96, 1046, 876, -396, -644, -859, 215, 887, 532, -762, -901, 138, 1252, 19, -943, -1455, -592, 954, 1262, 729, -1051, 43, 454, 1095, 218, -991, -633, -313, 345, 301, -94, -1368, -786, 732]
2779G32P41j691p06O39K82J911j650k48q35N81k40J413m83k135J358O30J048j408
2797f1j439P88J234N07l45j508o10M63J215J949k625K1l76J265J168r69j296l46
2815i65J048O47K93j405j463J086J120J666k043l44r99Q83J448m01p47p75K95
2832f56J520kr82m40p50J918Qj31q95j447J924P52q3j154j17q2J023M08l90j118
2852f94m91J129J294o35o12q60O20J233k26j239N3l2Q50Q16m04q04j609J363J256
2871A008o65r81l05L83R94l1p55o64Q8J448J84k18j424o15J677J367n11j662J86
2890d96P0M50R92j190q92P56K92J227n22o31r14R79M46L19j675o03P42N76J643
2909A569q67k224R73O71N30n46n79o39M41J397Q17j115j211J20Q64J072j411o81
$$ y = [732, 1473, -218, -924, -285, -3, 1908, 258, 10, -825, -244, -484, 929, 446, -1689, -331, 299, 1347, -61, -1500, -712, 522, 1029, 684, -824, -1434, -971, 244, 2193, -432, -411, -787, 478, 1646, 677, -619, -965, 83, 730, 1023, -382, -1845, -759, 361, 2027, -16, -360, -1359, -476, 972, 571, -176, -951, -656, 864, 862, -120, -560, -1310, 608, 616, 485, -410, -1857, 67, 819, 736, -418, -535, -617, 406, 814, 424, -694, -1185, -56, 1238, 603, -9, -869, -249, 984, 758, -481, -428, -460, 390, 1206, 802, -2, -1611, -248, 1008, 343, -638, -943, -560, 434, 403, -352, -1016, -928, 520, 704, 486, -938, -1553, 124, 1491, 980, -682, -496, -426, 24, 1016, -174, -1066, -310, -18, 1209, 687, 56, -858, 121, 567, 886, -789, -1392, -650, -74, 1569, 702, -1522, -549, 122, 652, 106, -473, -1112, -671, 726, 1543, 428, -783, -663, 201, 1273, -138, -819]
2927h19m87K103o81P02m15j334M78P54K31K68j838kP20O93K50j254l42J22J055
2946B04m3n91p17M67N62J611j386j43j010O31J121J57j087r13O08J250o3p12r38
2965i92m9J071Q48r48N55j414J149J49N79j620l75M69M66Q71m4r37r38R64R93
2984G97m64p19m51j19J583L44j121k48k49N77O87l1o41r42P79N76l16P7j249K96
3004h34J327N18m95q23j021M59J992p13l51q71R65L33K07k41j726Q04M3J731n14
3023G90m66j086N90J080j4j122j90L5Q67P84j074j037j50J296N95o93n06K31n13
3042e83J420k70k65j026O47L05J164j427r46K01M90O64M28k182J69Q16K95O00
3060E00R9j302k06J018M31n23o50j13L93Q05n84l86k53R49K90Q23j208m73l96
$$ y = [-819, -1306, 797, 116, 818, 403, -931, -453, 301, 532, 800, -1038, -1040, -320, 373, 623, -631, -973, -851, 204, 161, -430, -1147, -680, -118, 1493, 107, -36, -1046, -415, 706, 863, -224, -1137, -529, 721, 658, -54, -992, -1041, 30, 878, -70, 485, -929, 220, 369, 948, -672, -1047, -578, -112, 759, 715, -222, -1160, -196, 797, 333, -386, -837, -956, 627, 971, -150, -398, -647, -70, 617, 586, -55, -997, -218, 358, 42, 119, -1130, -834, 493, 1011, 516, -307, -1328, -869, 1123, 410, 59, -812, 153, 486, 693, 452, -1274, -470, -427, 1304, 790, 324, -762, -172, 908, 894, -228, -418, -383, 484, 1268, 194, -843, -993, 303, 898, 205, -301, -70, -583, 837, 567, 302, -724, -77, 228, 1392, -35, -981, -780, -290, 374, 802, -1380, -1211, -395, -100, 500, 599, -703, -909, 109, 540, 17, -633, -746, -353, 452, -132, -518, -771, 178, 468, 1291, 83, -390, -786]
3079g86N16P82K60r96K13J62Q97K93j657J40n47Q11J187j602j74k52M32N21N87
3098G87k44k84k37j57J375j491j8k74M17P09M41j223j110O72J875k61j237r89
3116a249P58O22N08k58n20o52P98N70O41j034j585L14J291J14j10r44K03N80P51
3135G98l54j028J82R44j85L75r2q05j23P01R7j7j040l79J182K26n83J39p43p9
3155g84J641n36o53q40K09K49J305L1r14O7M78J36M06j709k53O23K28K46m13P08
3175B25j106Q78M63K00k56j145O50L89o63K16J22k69J74O48n72o49L00L73n5J360
3195A283j619m38M74J348q25j35o76k51J359L48j099K87j066j07J797p02p0q5
3213a77m17K06K50J41rk54K76K17K06n88m91L90M49o13K36j116O96O57K67M39
$$ y = [-786, -270, 512, 772, -224, -11, 151, 1048, 1341, -316, -176, -723, 88, 1275, -327, -501, -753, -321, 200, 787, 543, 259, 22, -135, 1240, -251, -269, -543, -126, 583, 1024, -199, -1309, -637, 1238, 977, -260, -1249, -491, 131, 639, 381, -139, -791, 7, 577, 1218, 184, -1401, -1087, 204, 318, 208, -736, -533, 47, 798, 444, -584, -402, 542, 357, 732, 640, -165, -288, 413, 510, 493, -547, -926, 256, 482, -101, 38, -705, -784, 857, 321, -332, -1172, -963, -714, 591, 622, -292, -225, 253, 389, 795, -914, -1167, -544, -316, -70, -483, 225, -881, -3, 460, 660, 404, -741, -91, 298, -365, -149, -27, -296, -122, 526, -46, -695, -395, -22, -77, 1283, -336, -774, -300, 1048, 223, 88, -588, -839, 520, 868, -231, 56, -1010, -1117, 680, -22, -92, -177, -594, -388, -138, 3, -6, -260, 16, 233, 439, -149, -640, -250, 199, -414, -178, -1294, -598, 59, 326, 765]
3233G65p52m92M12M45K09q09o9L72l23M82j3r46m3J020q19P25j295N30m58J443
3253C84J282k313J29k16Q76N37m48l44m22L84JJ87n67j4K77M86J111q29r93J54
3273c38L46O10n22q52M97J5Q22Q4l96m84q5j47O31Q3m18q16J257J31j23m27o99
3294h31l45J630n17j37n61O75j97R25n81l30RN81j2k04j97J10p56J654j88j414
3314f86J031o03K78Q14p16k81l89O25M27M51j450p61Q38J16R21L13j066J09j36
3333a65Q05m08L07j164O5Q63k67O26n1p32j3M74M40r62j28J021n50N66p55p81
3353h09J79O7N95J24L27l30p70O81M11q89Q1m94J340O9l22j206L64O50L55k04
3373B19p58M59M89l8j12n29n83Q05J38N18q74J60j62L60P08q35k88J80j136J254
$$ y = [765, 13, -479, -67, 378, 587, -222, -291, 81, -242, 240, 227, -719, -762, 258, -561, 164, -1131, -601, -1059, 384, 1666, -647, -518, -734, 142, 679, 231, -113, -535, -151, -150, 37, -530, -544, -267, 219, 1330, 501, -492, -338, 8, 618, 96, -756, -259, -244, 578, 662, 266, -218, -303, -450, 181, 264, -154, -970, 287, 418, 295, -132, -831, -1176, 454, -63, -200, -761, -86, -283, 642, 61, -269, -260, 321, 309, 105, -92, 18, -738, 916, 728, -686, 345, -258, 20, 834, 118, -163, -552, 73, 500, 951, -499, -1260, -422, -306, 615, 928, -138, -29, -165, 640, 232, 539, -625, -560, 303, 36, 662, 611, -121, -134, 340, 780, -182, -310, 711, 161, 727, -28, -809, -630, -563, 32, 156, 483, 153, -617, 64, 475, -414, -333, -827, 513, 582, 260, -946, -582, 68, 423, 219, -539, -80, 409, 371, 259, -270, -853, -48, 90, 608, -266, -106, -268, 92, 800, -35, -323, -143, -1279, -25]
3393b5Q68r46M38l92M63m12O9l51L08J19Q00o11o17l66J02J411m78l20o44K84
3413c00R9M38l68p16j34R49N53m98k10M11j339J615OM43k005P09N70k12M83m89
3433Er98J694m61L41p84J79q85J135j1J20n77N9k14J87P77q83J54J30K01P41q88
3454B2k22j30J41M88m04p5R0k0J55P06o32o58J49P28J103j089q41P05m28K35J65
3475A88J13q60m2P97j43n4j54n04J063M21o13Q3m65N9Q83l88m03K48J80J04m77
3496C6l78o4k12J151o30N34k57j044O49P65m37p9m03P6J08L96m23L73n55M02L16
3517C24k73k07m22O07L18k80o25L3l03J896p26M92o29o66J47J263r94J83p59Q13
3537A92j53L59o1k31j143M25J263l97l47K14J81L40k16n3p13J00O51l35l60K16
$$ y = [-25, 843, -103, 335, -57, 406, -6, 63, -288, 20, 139, 939, 328, -289, -655, -553, 858, 380, 60, -584, -300, -201, 237, -131, -847, -981, -32, 521, 23, -187, 224, -1115, 500, 506, 949, -1056, -347, 223, 11, 494, 5, -993, 701, 240, 581, -203, -24, -909, 226, 215, 335, -242, -183, -397, -210, 567, -316, -162, -32, 169, 910, 22, -200, -330, -189, 299, -105, -180, -90, -110, 45, 751, 119, -539, -390, 338, 1441, 352, -489, 216, -212, 23, 188, 301, -559, -601, 196, 53, -1, -155, -659, 404, 825, 212, 295, -170, -111, 772, 384, -19, 229, 409, 513, 36, -342, -406, -618, 533, -97, 437, 180, -864, -215, 550, 113, 34, -369, -293, -185, 211, -212, 161, -394, 8, 324, 51, -156, -578, 29, 347, 67, -558, -525, -828, 1068, 342, 834, 205, -461, -314, 949, -45, 138, -621, 192, 39, 398, 337, 106, -1037, -612, 651, 254, -93, 121, 302, 642, 426, 373, -340, -240, 411, 76, -284, -68]
3557f8j29n12K12M40Q1m69O0J46Q71j95k92r44P24l78R54o09K26p88P05K10p8
3578A67q41N6J109Q0m98j54p00K90N18R56o59l48l65k4R69m25j97j92J00m29J085
3599D98n86k27R3J309q11O21q21J8p88J94N75j076J116j92K86J03j037K14n04
3618a015J374p0j29p73r0R66N43o16K84k77m08J187n06n67n22L54Q87k88p38l8
3638d42N98J71p25R07n26pL18n68Q92m33n39O79n89J54K93K20j326N50J018O8
3658G13n91j166R98N37J59L70p92q07MM63J215j945N59N05Q51K3j172q52N88J172
3678H32l03k73m69m59J92Q00L75m53l6j30j51M18k6r39Q30M51l92L12p03m38P2
3699d90J183J60p69l14l51R44M13n88j23j013J822l87L27j889Q15L44Q53q29j10
$$ y = [-68, -197, -709, -497, -57, 24, -445, -385, -239, 632, 437, 145, -799, -75, -453, 501, -108, 118, -670, 35, 245, 167, -674, -618, 491, 571, 73, -81, -781, -491, 27, 983, 324, -24, -389, -413, 556, 131, -66, -258, -158, -587, 498, -88, -315, -222, 1087, 276, 897, 76, 94, -694, -500, 75, -1001, 115, -77, 209, 312, -725, -511, -1015, 359, 289, 160, -613, -703, 263, 806, 190, 474, 197, -211, 976, 470, -97, -619, -265, 622, 334, -404, -442, 156, 327, -398, 509, -17, -24, 294, -274, 618, 185, -354, 325, -264, -110, 183, 403, -923, -373, 645, 713, 122, -1044, -46, 491, 650, 1020, 228, -579, -575, -112, 1103, -842, -283, 222, 1073, 1096, -76, -928, -340, 832, 529, 256, -213, -672, -480, 320, 695, 242, 206, 76, -75, 343, 317, -622, 208, 659, 267, 579, -124, -562, -490, 693, 853, 84, -230, -581, 363, 776, 188, 65, -948, 874, 487, 814, -1075, -260, 84, 937, 108, -2]
3718bo46J71J319q36N39o79j02j3Q64O2j439m64R95N84J84n19k70l93L40J419
3738A114p32q01k29j04J89J019k58m33m15J353M5K91r54o59P68m13R76p69p27
3757g39R62l6J85p77K53P9M39L23j267P87p05J084j02L4q50k12L67O49n01N53
3777E26j12r96o5J506j362N59o40L49N61l60R1k52l06K97P07J54o04m96O6N84
3797B07j49j38q6JJ5j91N61J62r3m36O26r3l56n10J07L95M02n92n00L82L51K13
3819B78J72o80j87P16J4K42r72j49l46P66L95N77q62O1l9O71l79L86j064l07O08
3840i9L38l45r79J622j64K55j301P38n15M24q2M83o80P3J92Q5k91j41K0k55L01
3861c21P60K42k22j368Q72J2m65L33l94P21k44p1L33r7k84N44K3l8m43k98J182
$$ y = [-2, -648, -477, 842, 6, 545, -134, -236, -249, 615, 677, -762, -1226, -231, 353, 537, 18, -252, -645, -305, 1114, 382, -419, -648, -752, -563, 456, 198, -235, -650, 703, 748, 1039, 85, -574, 194, -219, 757, -12, -739, 223, 187, 372, -405, -152, -73, 366, 689, -578, 209, -496, 588, 486, 520, -330, -542, -175, 474, -27, 526, 414, -582, -647, 859, -503, 56, -584, -235, 326, -34, 57, -195, -501, -204, 503, 657, 53, -443, -377, 207, 58, -80, -166, -165, -150, -341, 220, 382, 289, -147, 479, 386, 30, -480, -373, 22, 424, -168, -668, -286, 65, 278, 450, -230, -417, 299, 313, 555, -417, -566, -912, -146, 249, 826, -36, 25, -14, 657, 278, 664, -400, -707, -99, 239, -106, -1085, 537, 373, 628, -673, 65, -450, -26, -108, 375, -305, -232, -40, 45, -246, -387, -367, -622, -321, 439, 681, 459, -909, -37, -25, -490, -157, -551, 170, -74, -145, 188, 91, -193, 351, 374, 336, -107, -405, 777]
3882G77J78q11L96j422R52P8n79J217j257p1L06M35P90j055k95J02J95O55j282
3901f91j89J70J440J40k37m86k70L33M79r98l9N45q67J141n18P7m29k27M55L44
3921A73J38J74o30J97k97J182p50J68n88P7N74k90m48L14K14M05J57o40q42K08
3941e04k55J262M0j157L08M0R26n35l68k06N09J1O05n18q25K17L59J253j178J64
3961A48n22J74R50o61P78j285K01N82o8j59m48n21Q91R98o12o08L7M27k18L36
3981D20m25M56j51j44N14l36q62k55J175K25k13n2r41N94L65P0l93J07j400Q64
4001c82N8R90q09m0J01Q14m31o85r5K36J188j099J138j738N89K21l40M61j05j32
4021f0J25L51m90M15q97N20K45N58q83m95j37J040l20N64l11m61L18j21P11n14
$$ y = [777, 955, 144, 540, -882, 70, 148, -431, 786, -471, -542, -236, 199, 989, -66, -361, -259, -64, 591, -691, -880, -710, 730, 870, 633, 147, -123, 210, 689, -309, -348, 197, -670, 471, -47, 30, -399, -626, -171, 173, 311, 485, -145, 52, -245, 937, 187, 355, -233, -156, 418, 128, -320, -6, 208, 613, 770, 130, -712, -504, -759, 503, 543, -614, -306, -266, 660, 125, -243, -449, 60, 71, 676, 158, -667, -450, -91, 1162, -16, 148, -374, -200, 750, 89, 867, -418, -217, 365, 297, 138, -310, -831, 60, 1058, 446, -162, -125, 302, 84, 420, -5, 451, 300, 156, 670, 334, -528, -783, 392, 617, 404, 352, -589, 5, 370, 440, 47, 154, -1246, -382, -324, 666, -143, -183, -82, 732, 301, -384, -479, -243, 945, -154, 984, -754, -165, 56, -284, 177, 72, -60, 65, 416, -74, 341, -556, -36, 209, 767, -116, -611, -748, 292, -28, 536, 225, -236, 82, -39, 672, 158]
4041A58n18m98J221L20m15o16l29M08r4L93O14j091J32M44m88p3P62o89M37M80
4061E58m32k44m84O74p30J406o14n25J03N76q7o64L08l45M99k49K38M00n07r42
4081a061N84K42L54L51n36k33J74L56l27r2l62J104q99K28j03j96N42J16L87j21
4101E08p86N64m33P04p78Q3K54p43J194j003n9J97M83O89n54n51j68J81K81Q13
4121H76o01j413P76Q00m09K60n47l08O00n56Q50j426M88M75N36n95K5q02O28K59
4141h4M68L9q09l34N37M62n98l59M08K27m67P42o04K69M25q8j4N3j71l63P69j181
4163f73J119k18k86k22O72K94l39q48P21k16K16M05p76j70Q99J2j213N42o48J100
4183C71m11K89N05n76n97P86N2o08L65m21Q4J32j11L08j24p28K33L56M33q34M38
$$ y = [158, -360, -858, 363, 683, 268, -348, -677, -269, -363, 30, 644, -447, -315, 129, -359, -432, 330, -359, 78, 558, 126, -118, -602, 72, -658, 748, 134, -391, -288, 288, 201, -463, -155, -500, -1, -250, -12, 388, -119, -1061, -477, -235, 119, 470, -66, -299, -125, 231, -96, -188, -550, 554, -345, -117, -220, -416, 126, 242, 629, 508, -278, 286, -147, 557, -221, -138, 116, -627, 567, -436, -495, -298, 185, 874, 320, -231, -399, -218, 63, 876, 275, -1138, -362, 438, 29, 289, -258, -566, 34, -522, 328, -1098, -610, -135, 401, -194, -169, -971, -343, -84, 384, 423, -386, -720, -183, 279, -319, -678, -270, -43, -510, 232, -372, -103, 322, 234, 220, 273, 102, -261, 508, -673, 446, 228, -58, -280, 392, 686, 347, -501, 220, 4, 220, 625, -151, -321, 578, 590, -623, -81, -729, 371, -40, 249, 754, 178, -419, 367, 419, -189, 176, -245, -161, -29, -140, 168, 44, -684, -451, -95, 338, -496, -58]
4204e8L73L1J26j046J28Q75o61O72m7O00p21o00j39L91O73j357K04M7k08L85J55
4225a77Mj57L21N11m06l43j42P62p05K69J14N75l48k60m78j6q0j0J614p64j53
4246A31J08k22p1K94l22p3L6j33O25J80j061J49N07L26l75J89n34M1N71o9p79
4267d82P6j29P99l43Q15k11j100J220n74J49l39k63O33p23L58K18k65l61J159
4286F37l91K68k06p28P2O22L97j113N06K18n99M82L35o08j38K86j20m77L81p29
4306i05Q20n6R02j530L8R24q82P16l8m68J102p37L97k81M79j195M99R7P23J87
4326G92o93l38l77R09l17R5n58L72J47K47M75o10l46K27P23m35j046P56j52J311
4346A182j212l16M73o38N82O59p57L07q20J021N52q59pn20K47j23j57J95K92M53
$$ y = [-58, 315, 346, 472, -574, -446, 429, -232, 440, 393, 993, 272, -328, -467, -76, 597, -760, -556, -509, -717, -332, -177, -173, -330, -9, 502, 96, -247, -389, 373, -332, -63, 51, 626, 278, 18, -460, -476, -556, -566, 1048, 284, 131, 239, 17, -54, 240, -82, -155, -119, -252, 373, 553, -508, -359, 148, 474, 99, 288, -246, -205, 366, 297, -482, -406, -535, 264, -79, 736, 525, -575, 645, 71, 220, -119, -382, 251, -472, -114, 104, -161, -522, 637, 246, 514, 308, -420, -348, 274, 671, -442, 64, 282, -317, 165, 500, -108, -246, 40, -80, -557, -176, -905, -85, -141, 761, -769, -731, 193, -689, 27, -11, -479, 623, -114, 283, 2, 481, -714, -215, -118, 605, 792, 99, -239, -616, 293, -24, 71, -487, -115, 32, 279, 754, 144, -202, 25, 748, 313, -733, 23, -129, 1182, -30, -346, 127, -511, 71, 730, -27, 280, -540, 481, 1033, 174, 167, -353, -106, -229, -386, -191, 101, 554]
4366E54r06N76N43r87L70j19J153r33J46o51K26O59j128J0J53k26N1K69Q93r60
4386c07l91O40j70J27L82o93N43K80o4m89P3j54k3K64N05r48K44k08N8O41m16
4407a06K55L78K60r08O93r18l84O37j30O01k78N29q61M45n63k04j92O21M90K5
4427C90o66R90j539O71k30Q52L50q89K30k62J18O09r46l49P8P18K9j05n32O64
4447A81l67M98p57N08M68o10J80P46j167Q5p00Q07K90m31N49l27J46Q12r9j304
4467d92nk16J089o54K74J46p4O73K32l76o34k3l5o3O03n96L80m79O05k83j24l93
4489d45J257p57M89p95N80l69pK9J36l91M97l1n50R35j55n1q26M08P20n1j023
4510d00l75N58O09M65l64r32k12R74k96M64n09k6J75K69R7j569O12R13j326J346
$$ y = [554, -352, 224, 767, -220, 150, 31, 1184, 251, 397, -254, -28, 631, -497, -487, -334, -560, -509, -240, 653, -307, -698, -58, -228, -101, 281, -412, 131, 411, 347, -142, -69, -223, -246, 18, 523, -425, -181, -389, -331, 310, -106, 149, 527, 787, -121, 572, -346, -730, -93, -223, 378, 100, 629, -232, 213, -350, -554, -746, -125, 365, 390, -276, 714, -825, -154, -384, 468, 818, -71, 159, -103, 15, 624, -322, -671, -593, 125, 154, 49, -483, 181, -186, 312, -445, 63, 531, -79, 101, 847, -320, -235, -935, -128, 162, -269, 280, -47, 99, 911, 812, -492, -497, -713, 376, -278, -4, 142, 68, 741, 973, 597, -37, -60, -95, -158, 445, -151, 229, -250, 355, 72, -52, -445, 812, 55, 544, -251, 329, -40, -47, -18, 118, -273, 224, 193, -357, 578, 423, 372, -454, -46, 674, 623, -400, -775, -217, 392, 857, 493, -439, -651, 323, 27, 491, -18, -44, 131, 400, 497, -1072, -460, 453, -873, 473]
4530D73o30RL10l55L04j20J52k74M42j03J12K41j054N72P9K69j117Q61j288J305
4550A88J293j035j053K24k64R03k32j9P3k50M69j44l22l72P74J45J088j226m66
4569b26k34M06j38L47k90L43m91L4L37QJ65K35l29l72l05K63J96N79n21rk06n64
4591g72J532r63J022m62L51j866J122k71N84n92K99k05J41K95k99L66l32l78J156
4610G28n65k99j5J63N02j07q49N90o27R51j89Q3r61N98k06N77l33M13r20M0P57
4631C31m1J27n82k74J28N72L94l97n2j30M32l59J88q59m92R55k50J201j932J116
4651G6k66M93j46J95r64R71j69P11p74p77N61l00P53k05j34m10K65L62oJ34m56
4672h6j36L65k53K43O9q49L51Q30K00o67l54N4j90R70J93n81j240J214j85J67
$$ y = [473, -157, -148, 162, -193, 111, -9, 143, -131, 311, 208, 320, 561, -493, 79, 158, 427, -690, 171, -1117, 188, 1481, 446, -607, -383, -647, 256, 24, 5, 78, -172, 297, 153, -169, -541, 233, 378, 1466, 240, -226, -460, -54, -192, 155, -135, 208, -283, -249, 88, 96, 261, 496, 167, -205, -510, -247, -51, 528, 7, -2, -208, -772, 760, -203, 819, 357, 708, -1158, -36, -307, 277, -315, -16, -221, -80, 215, -84, 282, -50, -428, 728, 163, -136, -151, 12, 514, 407, -442, 148, -479, 472, 283, 366, -595, 3, -203, 374, 41, 454, -466, -426, 331, 290, 417, -165, -439, -311, 261, 655, 258, 206, 76, 508, 149, 337, -522, -1014, -59, -309, 892, -1040, 76, -190, 303, 157, 352, -612, 359, 190, 901, 127, -650, -89, -389, 364, 159, 25, -385, -120, 242, 236, 370, -86, -222, 143, -110, 133, 202, -647, -296, 534, 734, 67, -287, -233, -423, 547, 740, 159, -1081, 133, -52, 115]
4692A15r28J00J472j118P28q87k58l63R92K88%N13M4k58o64J344j369l2M09p49
4712f21J567p68o75K91O96L53p42K25J6q00m48J068N3m10n09R53J43k65n1L02
4732C78q9j77J09q11M92K76o7m3Q08j587J208p24O53j355J531N6j259N52J04J67
4752B22m27J28M71L12m2k81m15P48r83N49j37n44L95J49P04r72o47K45Q63j83
4772A55N97j024K35m78J286m92j7o09M15p50L53m59J37P86R9J43l17l7n63N64
4792B4K53o0l18o41R95k31J01o60J87Q72n73o5J19o6q10M53L26K30J39J51l31
4813I5O91j065R90m60r01K03L45M97n8p14j27k70R60l79j57L10O64j72p8o85M59
4834A48n4m57M47l14R9k82Q05L45j464M06O80m66L92k7l74m91J389p31N36o00
$$ y = [115, -813, -713, 759, -359, 369, -518, -776, -1139, -147, 141, 141, 654, 698, 440, -224, 1120, -249, -281, 128, -621, 946, 178, -497, -206, 490, 843, 101, 326, 342, -458, -906, 162, 215, -195, -704, 249, 392, 127, 76, 378, 289, 112, 221, -590, -98, 178, 111, 68, 876, -711, 497, -227, 426, -929, 602, 658, -601, -49, 55, 222, -205, -77, 394, 706, 664, 383, -32, 716, -267, 282, 145, -399, -4, 145, 849, -123, -770, -525, 338, 155, 752, -272, -37, -515, 771, 279, 262, -347, 68, -682, -329, -788, -651, 135, 234, 377, 60, 23, -540, 24, 277, 217, -101, -742, 253, 22, 123, -537, -350, 522, -51, -116, 3, -63, -873, -420, -94, 136, 275, 426, 95, 786, -279, 711, 251, -650, -447, -102, 395, 337, -377, -504, -774, 186, -193, -350, -40, 624, 452, 374, -311, 148, 94, -363, 84, -230, -131, -413, 392, 737, -727, -321, 359, -107, 285, 258, -116, -607, 782, 51, 587, -13]
4854a3L60j461N28M44J52p13J75L53K26JK46J49j99j37l03P46j297N81P09p93
4874b46J98m78M85J11R7rp64M0L96j10R46m7j535R18j66Q19p34l26K5k18M9N6
4896d93L08L03P7m0r20R03j062P06M03O1l56r4J96J69j58O4l8k02k84K25O96m71
4918gL18Q9o28N55j86j40r3m09J251j017L07J64j006M13L84J24K47p65L14K40
4938A55L3o40J66J19Q30k14K05q00n05k49J462k92o28L80M32J44j18j09J26o41
4958a44J02m07K36N40J62o97L24L06q7m53M30Nl05m8O2N92j85M96j203M92n30
4979c12K02M44J21j13l73l39J4J300o94p59P13m33k20R48J86j249N44M09P0m87
4999b8J76q82J103j72j93m52o08O54Q29O4m58j048J085n8K88r3j609J194K17J55
$$ y = [-13, 347, -1114, -586, -142, 10, -703, -528, -175, 51, 52, 298, 447, 248, 111, -192, 554, -743, -162, 547, -246, -48, -526, -41, 70, 167, 158, -606, -566, -170, -280, 666, 619, -916, 2, -164, 655, -79, -405, -380, -598, -549, -493, -185, 118, 195, 155, -765, 138, -924, -218, 185, 246, -110, -204, -8, 161, 3, 67, 29, -173, -457, -232, 464, -7, 311, 400, -228, 327, 141, 1, -92, -501, 750, -267, 40, 204, -802, -389, -5, 119, 366, -399, -85, 155, 188, -452, -286, -167, 663, 449, 654, -146, -651, -900, 562, 270, -358, 22, 454, 598, 480, 371, 497, -144, -42, -449, -213, 327, 489, -208, 116, 422, 335, -118, 312, 317, 12, -36, 26, 618, 433, 929, -274, 218, -312, -110, 334, 455, 342, -31, -370, -356, 944, 250, -509, 204, -229, -449, 499, 685, -564, -20, 389, 459, -28, 148, -734, 369, 197, 4, -448, -1056, -402, 427, 491, 33, -1015, 70, 12, 300, 207, -1402, -208, 9, 164]
5019A64M21j07qj313J83Q49n0n48K33J34P2L78j54o89L30Q2M52n83k52M07J43
5040A44n31m45P35j72m72J122k5k32n33M25L30p6m29q9N80N1P10k39p32q23L41
5061c60P63m84O9l27P2J027r64M89k40n74L46J23K47q32J56n95Q14M89L16n62
5081b7M7j1J031j172n38Q40r29J143j82j044Q41K45k83J15N2q8M50j9l90J22q94
5102f91j01M93L9Q43o41J27K94L6l07%j27l73M78K2l67k26k87R63M47J9o21q4
5124f4L09J04n65l21J22L77K48j02L49l69p5k29n2O42j120Q35k09k2M45J18k93
5145A28m97L96N19k22q51K81O25l77n0j51K6n47O3M84N34p44n9j73K49L44n94
5166f16Q84l77j27K50n55O46K3o21J273p49k16k40N08jo36J598j245j042J906
$$ y = [164, 585, 478, 470, -843, -660, 189, 139, -409, -176, -42, 30, 408, 254, -435, -105, -23, 429, -154, -406, 1, 144, -387, -832, -97, -269, -741, 381, 356, 124, -409, 16, 346, 270, -159, -248, 332, 383, 1093, 854, 122, -701, -360, 403, -81, -12, -339, -267, 760, -204, 285, 45, -529, -183, -60, 187, -645, -489, -1084, -270, 219, 535, -27, 20, 9, 1040, -132, -670, 170, -759, 384, 202, -842, -1, 244, -39, 76, 128, 40, 490, 471, 81, 203, -691, -792, -299, -260, 583, -58, 69, 363, 399, 92, 92, -35, -408, 70, 92, -275, -501, -788, 175, 622, 641, 20, -64, 245, 349, -216, -537, -415, -38, 210, 108, 457, 88, 13, -216, -268, 374, -746, 89, -120, -142, 303, 421, 128, -369, 27, 546, 324, -527, -246, 379, 2, -48, -199, -173, -720, -657, -173, 361, -383, -442, -615, -366, -22, -616, 268, -109, -236, 14, -541, 105, 128, -493, 780, 31, -185, -425, 83, 82, -554, 1044, -201, -1243, 663]
5185F63j151J106p42m80J34O93J126j600k35N03k1K37Q4j306N8R29j28Q19m78
5204B11q28K59Q7R35j60l66n36K13N12J35q78q2k82Q64P76j219M92j50q0n79M31
5225b45p6q4J89J03J063o53p63J515j177qL10P99j025M22r9M01q06j9O27l80K74
5246C68J21n15M3k78l10p9J5J75R94m98m40N68l79O69k81L51l09L00j026R32j75
5267B46j75r19Q80j540J486r5j18J4p35N16Q52k51o43J50q7N86j3q68O62m20J443
5288I71n90n46l58P3N78o5m65M03o67O76l18L00q14L80O67o39P07l08k23l07P92
5309B47J73o31k27L7J34K20M51j23L52l65o3M22J05o98l08O17k49m01r4j76O60
5330H3K24K57j74q95N67k66M40k4m74o07J164p11J53K74o00N31l67P41K14l82
$$ y = [663, -488, 618, -124, -604, -470, 223, 1349, -251, -486, 17, -4, 233, 317, -989, -931, -2, -130, 689, 211, -617, -358, -271, 664, 504, 138, -398, -185, 327, 462, -416, -498, -780, 84, 860, -359, 133, -17, -97, -676, -245, -321, -405, -216, -113, 950, 297, -466, 1049, -128, -136, 174, 973, -52, 370, 271, 672, -134, -153, 474, 94, 368, 489, -26, 17, -261, -571, -650, -635, -460, 534, 36, -404, 164, -215, 454, 173, 524, 215, 515, -511, 421, 246, 71, -848, 32, -1508, -22, -117, -235, -221, -956, -440, 412, 161, -482, -332, -419, 167, 154, -714, -52, -472, 971, 381, -165, -523, -450, 128, 63, -402, 1, -666, 10, -308, -8, -822, -442, 225, -414, 293, -15, -238, -545, 247, 420, -211, -438, -401, -267, -47, 404, 281, 633, 268, 205, 627, 732, 34, -274, 343, 94, -307, -401, -577, 83, 307, 564, 390, -505, 62, -204, 236, 212, -262, -869, 295, -416, -263, 11, -589, -58, -425, 316, 530, 148]
5350A48o65Q25J66m1p50R4k07J207p12l56J78k61K48L34j54J34j032O17N50k72
5370E1J12o1l69J99R61j087R6N31l35J56n5m80l94O42P1K22P4l22m23j8J498j142
5392g3n4R2m35J302p21J84l76k25j00J90J71k54j094J335k38M7M28J79o84m0L27
5413c9L6Q3l6M62M8p98R9m76K72l0M81m65Q7N16j16J032l83o93k38j88R18j167
5435e95L25n82J288j68K98n79l48qM14m71J26N39p43R68l1l05n16R4j76K86P42
5456E58j04q03P50j134N19k63L4K14M70l67O44p50k01j0P63N6J80o24k75Q87q13
5477b69r3K55q55J189l12K21J94p97l18J236p65L96o00L27j08L21K9k97M91l38
5497i3l76R95l16n37M70p7M42n63m51N69k19K88p7q38N14M9N33q65Q23o81K6L78
$$ y = [148, -517, 308, 474, 433, -317, -223, -430, 777, 65, -291, -113, -374, -126, 208, 54, 188, -844, -227, 323, 51, 163, 102, -267, -68, 893, -194, -98, 433, 98, 254, 199, -281, -675, -33, 38, 260, 334, 12, -411, -429, 1069, -73, -127, -35, -470, 832, 111, 295, -81, -306, -406, -216, -45, -299, -1393, -58, -296, -249, 179, 358, -326, -366, -39, -3, 80, 44, 506, 554, -244, -145, -621, -349, -379, 102, -363, -276, 240, 124, 1156, 773, 80, -158, -346, 572, -595, -270, -852, 436, 268, 566, -13, -361, -369, 45, -426, -300, 239, -504, 464, 433, 128, -388, -294, -470, -184, 558, 454, -349, 401, -733, -214, -477, -443, -229, 241, -126, 518, -232, -433, -443, 320, 376, 556, -68, -343, 544, -269, -362, -107, -962, 227, -85, 136, 330, -467, -785, 451, -314, 82, -518, -191, -299, 22, 51, -246, 245, -93, -469, 526, 210, -327, 143, 66, 508, -55, -506, 63, -156, 132, 55, -783, -269, -220, 313, -552, 271, -410, -384, -6]
5519fK05K74n65J32O10q61K83p94J54P34p7R32r01l49k57K60P56q51M47n78M04
5540d8M38k67k48M95n06P75N1n13j027O63K28k26N99n50j012M64J463o32K97n25
5560h1K03k8L00o2l56j34O04K36n83m3j076O35O48k03qn75O14k25j48J067j628
5581h43j66R96J261q38o57k48O94j63P29j020K99N55l09j37l75j77N4P81M46n1
5601H31p85r69J212k52j11J35N57m41J99j0n25Q21p34k04M96K77m73k73N0Q52
5621F53l64j75n09k87L70J213p27K32k29p44R43k8R40r08j335J023J68k63nn37
5641e69Q39L28n12M48q04Q84l46l08l47Q22j005O27k30N73r88Q26l23J42m88P31
5661C00J64j191J521q61l5j7n7J56K08n69R59j021j7N27k00O56m75m48K07N90
$$ y = [-6, 199, 473, -92, 40, 650, -211, 72, -722, -568, 166, 89, 1021, 120, -229, -486, -226, 530, -321, 126, -452, -48, 390, 123, -125, 370, -136, 639, 690, 177, -850, -187, 41, -185, 414, -136, -1148, -684, 779, 147, 444, -81, 122, 94, 394, 332, -24, -158, 446, 682, 99, 56, -1020, -385, 263, 60, 52, -523, 91, -134, -282, 785, -843, -1009, -13, 1248, 410, -247, -495, 199, 36, 765, -255, 44, 599, 290, 153, -222, -399, -345, 436, 882, 831, 46, -923, 289, 37, -74, 61, 618, 177, 376, 366, -159, 662, -72, -276, 220, 497, 24, -249, -199, 653, 289, 114, -395, -682, -312, 901, 174, 406, 177, -567, 376, 348, 1288, 380, -955, 68, 236, -27, -32, -569, 270, 598, 86, 534, -270, 614, 268, -40, -387, 435, -570, 57, -173, 400, -588, 238, -85, 57, -431, 300, 464, -727, 794, -67, -102, -119, -176, -20, 188, -381, 578, -443, -460, 67, -133, 523, 48, -400, -193, 397]
5681C97L10j424K55J22Q87j089P12m01n43J106j77P57p58o03L97M08k75K86k096
5700a729J907Q7m3o49N31O2n02K8K89l03O9p8O64j90k15K69o78O52N63r46L56
5721A44J54o07Q91q06j30K5k7Q08L97k91r99J04O22n70k19J7Q4m6Q97l90p73L14
5743d01N14J33P3j12n19J05K77l32O36j48n31L57j37N21m73Ko65L16K18Q79p17
5764dM7k55J74P01j005K50k60J60J38M08r24o6N99K87P36j670O45j16O60n24l84
5785d03N9q2K14l24R80r12r1J103p10O27m05n48L7R4P8J001q45k68r0O48j45l1
5807a3l83J085M39p17j013J02Q5P72L06j03o44r8m05J079o16q4j1J54K17R30o07
5828D75m37q1O77q24p6M97p2l22Q16o1l36l97p69J281k51j55O2n38N62l98J015
$$ y = [397, 707, -717, -462, -340, 547, -542, 170, -231, -774, 332, 155, 912, 154, -449, -52, 356, 81, 367, -1729, 178, 265, 222, -427, 104, 166, -336, -308, -19, -322, -253, -331, 333, 143, -72, 197, -481, 171, 734, -212, 144, 298, -309, 582, -224, -354, -329, -356, 452, 849, 558, -441, -337, 285, -285, -504, -487, -403, -449, 448, 58, -715, -401, 113, 246, 319, 207, -312, -207, 70, -262, 374, 226, -305, 52, -85, 436, -37, -35, -700, -384, -166, 713, -4, 43, -212, -38, 663, -342, -92, -352, -192, -54, 354, -570, -636, -37, 250, 986, -684, -39, -155, 505, -19, -403, -344, -426, -212, -536, 444, -468, -559, 544, -166, 461, 56, -492, -455, -361, -283, 718, -127, -395, -485, 163, 18, -13, -396, 689, 1128, 411, -602, -500, -415, 357, 663, 560, -84, -182, -587, 492, -124, -208, -219, -65, 152, 1082, 475, 38, -43, 634, -190, -266, 231, 159, -163, 653, 592, 256, -141, -910, 371, 120, -35, 27, -511, 51, -347, 668]
5849F68q34j42p8R04k97n56P88l29L69o27J70m53M96Q5K99m34N2n71N55J16K0
5870B01o16J93L57K1qR5L05j023M48j87N02n14N9n27J041j69m41k75k4Q09o36
5891c89O15l11R3R8L00o95M02l91L11j02j87r2l96N31J094j072P77m34r70J374
5911E56n61j43O8o98O68q0L5rM03K47n70O52L62j207k39K56O86L56p83m44N31
5932H6j45M39o69Q81m74n71j27K55M22l54M94O08q03K62n66O6J78j34J76K3J2
5953E9l24Q61r63P63m15M27j196Q91l7j342j68J758N40l23l69p65M37J28O24m44
5973A42m80j33R67k49l52m35M87L60j5m74j70J64o32J275J33o44k80m05M15K05
5993a21m01N90n8p58J294m01m26K67P34n13R1k5n08R33j78p8j58l16k63J63J82
$$ y = [668, -166, -308, -386, 518, 221, -335, 453, 124, 493, -134, 36, -417, 79, 164, 463, 29, 81, -490, 65, 181, 201, -415, -222, 135, 156, 148, 243, 548, -475, -27, -214, 288, -226, -167, -694, 347, 178, -263, -538, -562, 247, -389, 226, -85, 8, 106, 406, -289, 113, -278, 33, -69, -256, -348, -744, -213, 881, -191, 586, 152, -818, 556, -5, -148, -80, -778, -110, -190, -155, -164, 239, 486, -84, 568, 930, -277, -516, -260, 426, 782, -1, -445, 86, -59, 380, -289, 592, 118, -453, -580, -325, 97, -257, 237, 845, 42, 304, -262, -196, -18, -152, 24, 47, 59, -265, 596, -367, 396, -19, 408, -788, 103, 66, -1276, -1444, 314, 854, 531, 162, -603, -166, -38, 586, 142, -338, -471, 496, 247, -105, -540, -53, 307, 292, -182, -352, -188, -820, 455, 588, -56, -336, -741, -326, -121, -522, 68, 10, -748, 546, 145, -281, -14, 720, 207, 298, 273, -235, 698, 520, 442, 284, -32, -295, -132, 50]
6014E0L08Q9n80K33n30P61K33n83m03J041K68n59J5p38r1L1J206n17k16P4m9N33
6036E76Qo52j35Q02r0m78m88M81j17m46P73K39o64J72l36P07N23k60j016J08m2
6057c35R62m20k73J049j640J209K07o40k93J172o61q34Q01m25j01l20O33P1p95
6076f33P75J89o9O04j253M68M85q86K83J71M71j82m95j01O9L62k68k46L11P16
6096G71q88K26p29K78j6J93o15Q42Q26o34o82n5L81j1R01j83m95p71M31R2K02
6117F4q77M59N5J50M09L89r08K02P98m47k86L81o86o3J66J39m86P92k43j5R1K5
6139A09J72N2j79k8m54N38k29l8o6J12K41j071M1K88K06r8N98m66P35m40N32o00
6161d5j47Q24j226R31K50o36p29O80O87n18L0l50J90k12J000p58p55M07K70n93
$$ y = [50, 358, 447, -133, 100, -430, 331, 564, -19, -422, 619, 887, 328, 343, -395, -486, -455, 751, 234, 18, 92, 43, 576, 584, -68, -203, 599, 509, 31, -457, 24, -93, -539, 234, 473, -191, -19, -355, 352, 875, 615, -401, -293, -335, 627, 207, -66, 983, -657, 552, 759, 119, -174, 998, 337, -497, 304, -121, -222, -542, 91, 162, -633, 142, 331, 262, 866, -387, 81, 566, -320, -37, 134, 605, 423, -72, -173, -104, 258, -10, -256, 55, 771, -117, 109, -620, -342, -358, -165, -780, 62, 888, 254, -428, -483, -102, -113, 788, 605, 110, -661, -230, -138, 64, -813, -354, -299, -149, 260, 649, -259, -57, 741, 294, 8, 389, -297, -360, -194, -55, -541, 251, 8, -7, 84, 109, 281, 333, 154, 126, -328, 210, -19, -57, -123, -11, 230, -841, -800, -512, -306, -404, 194, -272, 463, 23, 555, -45, -192, 632, -594, 337, 587, -49, -778, -98, 589, 71, 101, -249, -59, -271, 729, -29, -784, -377, -107, -700]
6181g00J410j063L43N0O7r4k38N11j490J188K6P2L7J27j18M55M24l68p81L55L95
6202F08m96J00Q2m30L83l38l05Q73o38R11l70m62o89J32J146p0m06N21o39l06
6222c93l92R49m43N12k04p12Q48K94j54r12J41J93P09o90l45K79O59m53Q82m70
6242B98n43K40j82m5M02q73O90k12O74q0j063M74N22Q8n91Q7o16J138l39N28j91
6263D06o96L19o0K03L0l7p57Q76k11p71N19k15K86J78j59L60k56l43O94K13m35
6284A44l9n79L90k57o15P12J81P2j52L65j62l9J41J08k73K99l00J23j33n64M64
6305a14O14m4p0q35J94M05p79L54Rp9L78j126R01N67r80J803j552J057j155R32
6325D80k51N1p27O67K1K76Mq61O35m71k17M15L67J90p41n40J111o66K57M41p70
$$ y = [-700, 710, -353, -10, 40, 107, 13, -225, 286, -1204, -16, 10, 82, 119, 246, 128, 583, 1007, 639, -142, 213, 608, 112, 212, 294, -136, 247, -91, -396, 477, -161, 750, 380, -82, -771, -639, 507, 437, 31, 552, -87, -393, -785, 164, -279, 233, 29, -683, 165, 459, 305, -607, -466, -273, 436, -254, -599, -320, 339, -114, 768, 298, -245, -5, -187, -232, 170, -703, -13, -225, 449, 369, -694, -220, 302, 390, -201, -114, -730, 408, 69, 597, 406, -290, 29, -31, 172, 202, 165, -592, 284, 73, -698, -179, -394, -108, 70, -89, 271, 15, -328, 366, 579, 144, 105, -474, -84, -341, -956, -244, -63, 9, -143, 222, 60, 21, 162, 270, -3, 296, -4, 119, -14, -578, -114, 500, 456, 386, -449, -255, 150, -629, -275, -266, -345, 33, -1093, -192, 375, -605, 1198, -354, 703, -452, 480, 229, 280, -447, 220, 241, 517, 521, -340, 295, -176, -393, 22, 389, 579, -162, -702, 409, -257, 0, 441, -329]
6346c29J7K48k74K51R22r57q6L17k87p2L62M49j115N58k32M39l98k41j66m45Q45
6367a94o23P94r0J87kr19M82Q7K96L90k10K08p05j59Q81l54n59K32j63P54O3k57
6389A39k31R77j289K08R75j173R46p98r2O70j81j4J05k37l94J75J063l89p67L68
6409F1m70P80R8k00l12k0l68J072p65L16p92O53L67m57M71r70O26M20L5Q95j873
6430d33J17M17L26j74q01N13L2J72p72J335j289J243j097O9n02J379j380J553
6448G08n46N83r38K13j174J439J83O10j154L45p8r5o59N46k43O14k88N37k3o40
6468f0L10l13K39p11N43m92O47j047O70O8M07o56J65O22k27o43P33m59K17O2J61
6489B36n14J34k50L21L81o29P99p02R20l12p21j28N08l48J70j33O34J77j421L75
$$ y = [-329, -312, -64, -338, -87, 835, -122, -208, 109, -178, -250, 112, 561, -554, 4, -228, 211, -187, -428, -594, -1039, -194, -817, -23, -113, 74, 72, -847, -365, -278, 18, 408, 198, 406, -299, -458, 423, 69, -490, -258, -421, 333, 396, 139, -92, 885, -404, -196, 779, -394, 552, -246, -338, 332, 151, 137, 242, 5, -389, -214, 849, 460, -307, 61, -409, 371, 469, 269, -43, -63, -431, 641, -124, 192, -600, 53, 420, -37, 434, -536, 90, 510, 545, 1440, -433, -316, 101, 427, 253, -548, -35, -3, 169, -603, 732, -557, 686, -411, -342, -844, 535, -845, 708, 162, 745, -193, 20, -1154, 285, 468, 1078, -76, 269, 191, 96, -563, -17, -260, 354, 66, 603, 580, -60, 250, -63, 176, -535, 8, -484, 163, -884, -214, -146, 261, -395, -230, 392, 165, -478, 255, -204, 13, 75, 236, -278, -144, -394, -73, 308, -321, 478, -224, 696, 384, -337, -465, 43, -305, -135, -268, 366, 543, -878, -503]
6509e03O55P39o97K93o4J4j325L83N57N04o49N94m05q17O42k71M37O24l07j52
6529B52j43j55p12Q59l31O45r69Q78p09J88K60Qj72J20j9k35Q99n06o15L32n77
6550g02J146r24J007J46p70l39O04k2j41N85n08L35k01k68K20m12j89P24n1J27
6570C67j098O66P54p27K73o46O70j20L72o67K83l59K42N15o75k64N43J40k26n41
6590d98N32N38n64L18n47M63J81j169N57P38j007K32N4m35L63L10K25j316N28
6609d97Q78r05R88j248N28N06j02q16R00l76M76J08k83l59m94J022o80P78j89
6628B35o46P63l99n17J18M66P19n95J15K11n05n93M92K86J12l77K26K96P9o36
6648a50L08k5k61K71J2Q9K03M13p51j32n33J019J85p84J77r1M99q10L01m43j10
$$ y = [-503, 152, 891, 194, 487, 423, 437, -888, -505, 52, 556, -93, 501, 96, -721, -79, -350, 87, 711, 404, 252, 109, -46, -758, 101, -230, 415, -554, 324, -385, -197, 63, 71, -101, 19, 0, -235, 664, 158, -457, -125, -702, 444, -480, 527, 673, -97, -436, 168, 146, 5, 590, 82, 417, 216, -52, 168, -244, -433, 291, 240, 367, -731, -65, 689, -38, 235, -411, 259, 139, 511, -156, 127, -232, 10, 525, -150, -414, 129, 269, 43, -498, 34, 572, 8, 326, -221, 242, 423, -746, -189, 549, -458, -226, -172, -607, -244, 66, 291, -1025, -497, 381, -524, 464, -784, -256, 250, 148, -668, 232, -144, 332, 440, 157, -202, -696, 326, -354, 424, 235, -411, 352, -47, -564, -446, 20, 739, 144, 259, 470, -35, -628, -136, 150, 262, -115, 111, 407, 486, -150, 158, 133, -128, 143, 155, 244, 447, 860, 109, -23, -556, 463, 648, -136, 41, -50, 449, -361, -60, -503, -613]
6669f13O98p8k07j42J02k29l07M63m15O57J32M55l43O9j96L56k68o38O31n72R98
6690E53l42m15j86L58j62N30l16k01L53K16m75K03L97q24L97N22p10j50L01j63
6710a14J087p41qm80K60L27m51P47r94J092r15O2M39k41o52j9O69L32j595J192
6730cl74Q82r3o66N25k76o2n13J455j608M53j76K46J43K3N64J10j021r6q3L29
6751b41N09n21J11m24N37J75J64l52j65n14J529q13L42R0K19n18N95q23n3K11
6771E8O6m96N46K78n00n08Q05m90L65P7%k20M9l30K47k0K47l69K93J28O7J60r76
6794e23K75L37R7k27r1L28n6l50M43l32m97R15J58m23M69o39O52j069Q23n21M59
6815B28m89l52M62J27q1N62K42n48q88M04P2J002q54P28p18M14N1k58R18r61m06
$$ y = [-613, 85, 7, -200, -342, -240, -469, -776, -313, -728, -71, 61, 516, 173, 242, 46, 402, 134, -504, 127, -445, 553, 211, -204, -390, -32, -194, 336, 20, -181, 172, 388, -87, 116, 513, -311, 86, 608, -102, -252, 49, -114, 973, 232, 224, -256, 4, 331, -120, 627, -367, 725, -190, -128, 311, 70, -582, -601, 68, 400, -1195, -3, -377, 505, 412, -254, 271, -5, -67, -580, 875, -733, -280, -456, -210, -67, -44, 520, 630, -391, -487, -570, -241, 268, -253, -142, -566, -29, 146, 310, -42, -207, -721, 808, -5, 337, 427, 646, 128, 723, -100, -153, 58, 124, -372, 174, 452, -48, -556, 249, -241, 124, 201, 201, -19, 30, -300, -53, -73, 174, -195, 98, 226, 293, 453, -523, -248, 89, 186, -41, -132, 196, 140, -210, 233, -99, -596, 319, 477, 54, 523, -116, 536, -533, 290, -231, 228, -261, -613, -151, -24, -105, 457, 699, 151, -737, -333, -261, 741, -113, 615, -103, 311, 362, 104, 1022, 61, -345]
6836c45N79N49j229N16J69l60K8O63j532J403J35m26K95m68p75J017j21N9M1l46
6856a48j91L00O1O42k54r78O54J86J76l01L77N54p86l80n6O49o06L9J91lq8m45
6878d07O33n94L36L82p07O42j382J354K71m33j83L01j54n45J496j434O89Lj06
6897A62p44N33N39Q7n01p93J059r14N47k26M26j16l78N78l75j94J053k88q51L86
6917a0N54j456Q63O11o55p04J062o97J363j265M51M48l13k39N5O6p0K44n95J38
6937a49J38m12qO57n28J021l41l85o1k7l42j28R19m46J34L21j53j44M78o92o7
6958b15M43n58Q39j68M5m76N77r28M95M33L17q41n11J152n00l14O56q65J81N65
6978C27l85J47l38M38l05M89j033Q46l2J3l54K37l47l33L44K56M77q67K85K89
$$ y = [-345, 234, 783, -446, 70, 239, -121, -93, 570, -962, 441, 576, 150, 445, -23, -798, 219, 98, 157, 198, -148, -339, -39, 22, 664, 410, -568, 86, 272, 448, 147, 524, 1078, 292, -88, -144, 505, -101, -62, 129, 126, 38, -407, 226, -368, -32, 350, -357, 285, -1097, 257, 528, 95, -88, 213, 59, -486, 1010, -424, 265, 268, 162, -582, -49, 490, 577, 76, -717, 342, -572, -25, -251, 175, 59, -319, 259, -116, -310, 743, 455, -396, -10, 544, -912, -49, 562, -93, -797, 265, -432, 931, -334, 117, 565, 252, 13, 68, 134, 64, 308, -287, -149, -11, -423, -431, 226, -302, 719, 378, -7, -68, -95, -437, -565, 354, -92, 42, 363, 210, 66, 544, -148, -215, 228, -330, 509, 341, 386, -90, 487, -441, 54, 487, 804, -37, -548, 604, 104, -210, 446, -419, -238, 327, -58, 89, -249, 189, -116, 373, -660, 186, 154, 167, -187, 50, -297, -630, -286, -30, 447, -420, -135, 154]
6998A54q2ll70P12o62N92m55L82p9r04J122j07r44Q78r63J155m1p43N84M37r82
7019c19j37J266j069O78j246J176l31k41J28K20p31M47L71o56L51j047J214m83
7037d09P97n97p96R11Q01q21L71l06N96q31O59K70q43N2n79J425m54p01R70k60
7057B55Oq50K98M39n42L31k92N54j22L71m6l60p27R49j33j030Q79j53o72J100
7077B55o42m68K27N66N57m64q40R11M3lK27p23Q00l58p14L57P22r0m14k80K08
7098a23k66M96J22m13J45K14k87Lp1N19m09k37L17o46M55J96K06j66l36L17Q2
7119A18m28P49k16J94j026L55PJ532j006M11q77K70j61k4P09n21j37M17K16m32
7139A50l96j25J355j257N73l01L21l96n00J071m64m62Q44k48j25k08N5O13k45
$$ y = [154, 72, 69, -301, 411, -251, 341, -114, 268, 189, -715, 407, 300, -644, 234, -729, 426, 385, -358, 226, 663, -319, -456, 810, -259, 419, -827, 349, 18, -223, -95, 125, -606, -159, 212, -444, -93, -1140, 74, -409, 388, -209, -1005, -94, 707, -114, 257, -49, 547, -284, 375, 645, -198, -146, -725, 700, 246, -455, 515, 255, 261, -589, -291, 148, -394, -63, -355, 199, 77, 448, 402, 42, -685, 264, 131, -899, -20, -173, -845, 255, -387, -855, -628, -62, 495, 31, -809, 102, 145, 142, 369, -354, 446, 88, -626, -269, 453, 363, -51, -331, -123, -389, 107, 229, -184, -39, 175, -112, -109, -180, 339, -70, -307, 10, -636, -181, 15, 221, 55, -281, 36, 118, -310, 439, 223, 417, -609, -254, -247, 1285, 279, 690, -187, 83, -78, -102, 607, 86, -51, 366, 582, 150, -246, -371, 984, -273, 300, -1, 320, -76, -576, 495, 31, -431, 413, 165, 40, -168, -113, 500, 255]
7158B55l25l36J55N46l42J37P0K63r92J09M79m99j12M0P71l10k15K25L71n00o6
7179b76K38r07R87K37n54J02L00k18k80K80l36P0P85l52j28K20K96j036k89L31
7199e30J3N02l1l99J0J646j500R28j126M28q01R88k34N42K40j058O7R64o99j48
7219a98N00p75P63j28j07K23n39Q10j26o64L68k82j08K75j15m7L88j120J244q73
7239e11L23K2o9j34J001q33k7K12K78q74M82j46J88N16p49K99n29L98J71p25L71
7260c36P53n09k41K82J240j011K03P0L99m97l19l30J12J011m10J43n99J38N69
7279F68R6k97p5p36r3N66j62O30O0n15k00J51K37K39n8m25M41l41J29q67M08K45
7301A01P72j047k40J53J17M06j9m9l37k05M31L23n85K59J36M1n31l17P06N1O1
$$ y = [255, -70, -406, -251, 295, -47, 90, 160, 423, -569, -460, 19, -480, -592, -552, 219, -91, -306, -81, 290, -210, -276, -38, -945, 42, 279, -275, -173, 127, -91, -371, -91, -427, -357, 428, 76, -52, 168, 464, -572, -861, -530, -517, -15, -46, -445, -435, 1211, -289, 639, -487, -59, -860, 128, -106, 436, 676, -382, -315, 649, -50, -198, 302, -473, 290, 162, 55, 278, -261, 549, 423, -241, 127, -155, -263, 12, -103, -150, 238, -882, 362, -511, -188, -166, -235, -369, 632, -201, -228, -16, 262, -612, -130, -276, -88, 428, -321, -22, -551, -153, 18, -707, -336, 417, -92, -333, -51, 1189, 178, 381, 451, 850, 353, 34, -296, -184, 827, 417, 560, -39, 99, 668, 764, 467, 392, -344, -437, 129, -33, 597, 657, 142, -58, 93, 330, 569, 511, 86, 527, 186, 315, -552, -144, 101, 873, -174, -414, -261, -144, 262, 243, 194, -143, -348, 83, 406, -179, 80, 216, 257, -274, -591, 115, 166, 227]
7322B27j3k65Q24j494L34K83M53j45o85J158n61k62l2j90O64N5p14J61l66R27
7342C59j173R08M17l21O7l07K16m38J00J70M54q88N2K98N56o80Q18j013L32J65
7362I2n94J55M16J95m34M25L46j022J33q7k2L00j28k35O05N9k40K59r07N25M4
7383a15L20o57J50L65m90M15p2k85L31r5K49J13ko66P35r11N88q11J155n02O24
7404D39k47Kn43n3K51N29n52j9K49j60K98N34p57r1n08K48P14n53K22J24p47P47
7426A27R57j300M07J27o92P9K94n76R94j04n1j85m40N54k58n2L42l29M25K74l36
7447B57j25n4l01q1O3O39j74k53L82l29l04R11j309o1N68k71pJ48J56J19k54J130
7469H50m91k08l38K03M8j69J18j13JJ42J9J81K03p70Q26o94R3l05j23P28O4J00
$$ y = [227, 214, -51, 773, -721, -387, -104, 349, 204, -481, 677, 116, -146, -178, -368, 296, 351, -363, -202, -568, 359, -814, 94, 511, 190, 257, -50, 166, -272, -172, -2, 452, -436, -384, -86, 470, -210, 608, -405, -73, 92, -502, -347, 69, 264, -170, 255, 601, -421, -288, -375, -397, -97, -225, -460, 145, 204, -36, 223, -684, -159, -115, 205, -452, -302, 63, -427, -12, -84, -369, -38, -133, 116, 229, 227, -439, 296, -615, -27, -838, 317, -185, 439, 192, 194, -349, -402, -151, 378, -174, -193, 56, -104, 194, 728, -29, -120, -628, -380, 334, -219, 3, 127, -620, 127, 1084, -216, 191, 318, -374, -295, -1, -577, 417, 313, 262, 77, -363, 191, -67, -119, 223, -106, 319, 593, 257, 132, 78, -223, -304, -241, 398, 224, -29, 353, 24, -280, 631, -678, -739, -171, -442, -449, -301, -145, -26, -280, 850, 359, 151, -187, 16, 64, -105, 13, -100, -99, 43, 62, 243, 446, -324, 502, -192, -99, -404, -527, 201, 265, 365]
7491C65j059M78O25q85Q19J37l35r3l6M03Nj85O53j118K7j73k48l7P84m40L45
7512C2Q8Lo16J43K66M99n96j4K58o97Q80O5o6o60J81J298q72O27j04n83l85J62
7534i1L88j79m61K46O99r22K59n62j41N25N51p17j21N30K65k38L16m71l27O34
7554A83M6Q0q5J76q05Q62j22q43K62K1k89K62Q23p52L00m79J119q59O26n1j076
7575f01Q52K19o0j107L55O15l6n08K71j05L79L25l50K16n81j63L86m58K19L11
7595A79M4j03o55K83O01P03j841J74O80J35o37N70m99N65l34l25k62K43M07M1
7615c1l12o2L20j98K4N87o17p8N21J73p18j82p7K57O04m39o8R22j52j85q9j40
7637F0J46M2J20j73K08j53n09m40J027L04j169M78L42p83M18N31R3o51P60n86
$$ y = [365, -694, -216, 409, -476, 343, 480, 145, 52, 16, 419, 424, 239, 892, -226, -199, -372, -620, -657, 127, -313, 32, 120, 123, -493, -350, -84, 415, -181, -195, 63, -634, 246, 311, 245, -415, -234, 1064, 192, 819, 715, 132, -253, -91, 297, 118, -343, -97, 602, -320, -61, -623, -764, -239, 312, -405, -526, 4, 269, 31, 347, -124, -451, 183, 229, 309, 224, 400, -405, 457, 335, -508, -246, -225, -514, -252, 571, -181, 119, -360, 759, -100, 526, 475, -601, 251, 470, 410, -697, -342, 273, 237, -271, 0, -105, 274, 599, 249, 465, -116, -279, 107, -351, -132, 179, 223, 120, -535, -252, 349, 1052, -789, -615, 65, 200, -437, 133, -366, 199, -135, -460, -722, -479, -72, -31, -343, -405, -85, -283, -259, 328, -289, -367, 154, 327, -391, -573, -650, -393, 211, -228, -296, 626, 474, 289, 200, 60, 206, 248, 368, 195, 403, 250, -259, -699, 328, 632, -537, -59, 283, -500, -82, 449, 542, -109, 651, 65]
7657F5J0m25M96m73P50l04o20M27k40M91N47n13p21M00K64n40M53L84n91k62m39
7678h41N13L84m31l45M78j29P78o39pj007J112J69p04J003r39K13M42R25j212
7697b37R37r72J94L97j551J294QK23M35m14p01O07n09P58j132N15j1M63o11O19
7717C12m55P2q3M30m28l39M53j00L34l33l33O41j18L94m02J11j54k6J1L9j70Q6
7739e8q12O2J217l44M0R1m15r1J57j11N58l41L60r38M25k35N09m68J21n63P75
7760f1M4l37P3M70L04k57R5l91l65J81K58m95O76n5K18K83n36O11o93L08l20j04
7782i3N24k52m26N56j14k90Q47p68O11L1j277K39K30N50L0q6K17j278o8Q92j66
7803i1J74q7j3j30L48L80n29L66p16l94J107n12l6p9J1j41P47o48K81l64M76m60
$$ y = [65, 75, -350, 146, -327, 423, 119, -501, -74, -314, 177, 724, 211, -510, -110, 154, -386, 67, 451, -140, -402, -841, -328, 56, -375, -720, -242, -371, 407, -232, -239, -1246, -134, 35, -669, 334, -605, -392, 50, 975, -237, 700, -272, -78, 319, -1232, 62, 70, 293, 728, 314, -387, 220, -289, 469, -663, -148, -159, 304, -307, 312, -143, -71, -154, 276, -152, -491, -38, -138, 196, -137, -470, 171, 53, 447, 45, 156, 2, -24, -13, 26, -144, -58, -870, -808, 409, 65, 105, 196, -219, -310, -153, -264, 294, -47, 313, -625, -200, -435, 74, -394, -273, -836, -61, -17, -354, -281, 189, 493, 236, 331, -60, -425, -244, 14, -481, 195, 140, 358, 641, 105, 716, 23, 331, 11, -93, 431, 179, -247, 309, 195, -95, 752, -16, 595, 626, -651, -412, -182, 368, 398, 312, 529, -749, -817, 75, -91, 83, -4, -17, -147, 201, 581, 52, 418, -298, -692, 415, -97, -133, -212, -201, -342, 405, -243, 38, -326, 150, -310]
7825c10L97j22o53O98P3k16q08J096j19J68j65k02O49p87L08J3O60r25N04p6J77
7846C60m18l52P64m51L92o49j13m88M95M66p77R14k72o8N60J02o88P0J37l66R59
7867E77q70k67R85l31m62Q53N03r90k77O78o00n55J117m6r7M70r30P46o61M00
7887B43o92R79r98J02O12q1j78k48K66m88N59P9N22j45q58j26O61j09J93l40l25
7908c72N78j79K0J70n06M08N05m54jp56l02R75J5K64p31K80k7r11J208m03n80
7929g99J93J184p85J7K00L1L78m08k82m91J734q87l32R11o20J6K2L89m53J78J21
7950C17k52O89o58m21M75m75J09J064r56J53m45M88q0J40K26l77J14K5K6k83m08
7971e29L73q8M10l95K5L36k96M71l26P05j405J146p17J04J027j233J41Q66m95
$$ y = [-310, 87, -35, -688, 10, 83, -133, -941, 155, 36, 204, 39, -163, 486, -301, 7, 20, 680, -245, 259, 183, 360, -58, -410, 354, -97, 295, -354, -467, -955, -460, 6, -771, 143, -129, -197, 363, 465, -223, -153, -16, -382, 577, -293, -560, 425, 94, -368, 485, 988, -2, -279, 399, -201, -756, 361, 315, 218, 688, -242, 504, -157, 243, -449, 530, -468, -366, 246, 165, -13, -261, 5, -483, 76, 155, 677, 532, -326, -452, 209, 100, 293, -47, -372, 206, 27, 47, 217, -289, 119, 624, 170, 169, -587, -889, 86, 101, 365, -366, -86, -113, -1024, 184, -219, -799, -606, 578, -207, -190, 10, 41, 419, 11, -271, -762, 972, 85, -247, 664, 44, 60, 82, 471, 18, 196, 317, 65, 754, 96, -325, 150, -325, -216, 848, -108, 45, -400, 88, 8, 148, 374, -3, 111, 136, 162, -121, -529, -156, -244, 166, -229, -204, 132, -164, 307, -19, 686, -719, 427, -290, -186, 841, -392, -251, 615, 120]
7990A20k67L19M7j20k04N11q41L10K61m04o9M51N69l87L6k72n89R49o84K98O02
8011F36j64J80K08p32L4n48J004n8n15n85M33M56j8L45r44L11N59O6m04n57P27
8032D34M78l87m07R1k27R24m13q78J402j152j47Q3N24o72J59M85m12l49N44J43
8052B23n07P15j86K85r61O03J07n75K57J1n56N19K37n08K54L71J13q76N77ql67
8073b72J06k07Q42j14O9n34k63N90m29J48K11m40O77o99M38P01j228N29l25J51
8093d9N64j180J185l87l02L73p76N0N41L97j81p8K09n57l50J69J98P34j32l45
8113H3J3O3m64L59N06o77q3j71O67n86J2P97j34o85n7P15o38O94l53K77m08l4
8135a04j21P46j174P66j51o80Q35r93P24n3j1R39q24n1l42O95L18q49K43M61o61
$$ y = [120, -147, 172, 219, 99, -105, 406, -435, -125, 136, -268, -337, 114, 683, 296, 332, 60, -529, 420, -264, 34, 636, 472, 652, 860, 128, 162, -386, 618, 560, 45, -540, -107, 349, 331, 676, -268, 43, 602, 668, 264, -293, 434, 912, 525, 118, 209, -18, 906, 493, -385, 1017, -135, -282, -199, 325, -347, -188, 297, -115, -464, 80, 223, -284, 431, 245, 530, -431, 172, 279, -296, -39, -28, -584, -65, 172, -336, -82, 289, 402, -474, 103, 95, -272, -166, -373, 469, 355, 424, -110, -373, 217, -212, -64, 147, -293, 384, -315, 123, 824, -404, 125, -200, -49, 515, -665, 520, 133, -169, 204, -572, -522, 19, 416, 235, 157, 366, -191, -541, -372, -174, 560, 428, 83, 96, 159, -305, 54, 560, -117, -200, -371, 296, -290, -278, 519, 385, -300, -357, 358, -280, 414, 61, 338, -70, -104, -225, 521, -653, 113, -38, -718, 117, -876, -152, -205, -216, 723, -101, -152, -494, 201, 519, -330, -87, 374, -287]
8156b87K99j80k17N80p48P54l9l74N83j46J33O18o71P4j125R01o5m04P4N12q36
8177e64K40O60j10n50m5P36m7k37m89L41O93p96R03n11
$$ y = [-287, 12, -168, -385, 195, -553, 201, 162, -212, 371, 225, 358, 976, 305, 379, -746, 155, 90, -314, -240, 272, -564, -324, 336, 226, -324, -369, 367, 320, 83, -406, -65, 628, -168, 735, 224]
8191B24
$$ Imaginary data points
##PAGE= N=2
##DATA TABLE= (X++(I..I)), XYDATA
0@%%%%%%%%%%%%%%%%O2j24J24j24J24j24J86k48K48l10L72m27M89n58O40p08Q15
33D37r36J062j192J340j512J689j883K099k333K588k870L178l510L877m279M719
49B474n197N726o313O952p666Q469r367J0382j1544J2890j4462J6334j8611K1444
63A1511k5086K9960l6857M7504o6202J08732m14894R5258O85072l7385l43694
74E3919n00384M9497N52343L66101l25272m73367j83513L71828N01118p757n21322
85a16809l27318J78554M97506K29474l47152m78420j1524M05190L85266j10213
95C04554n03969k41291L11022M22141R3760l67781m14693R0700M65648K35554
105C95645k21105m22684j44478L52223L97845n8963l96249k77782J64515M33680
$$ y = [0, 0, 0, 0, 0, 0, 0, 0, 0, 0, 0, 0, 0, 0, 0, 0, 0, 62, -62, 62, -62, 62, -62, 124, -124, 124, -186, 186, -241, 248, -310, 330, -378, 437, -499, 563, -629, 711, -801, 888, -995, 1104, -1229, 1359, -1511, 1667, -1843, 2034, -2245, 2474, -2723, 3003, -3310, 3642, -4024, 4445, -4922, 5460, -6084, 6806, -7656, 8678, -9933, 11511, -13575, 16385, -20472, 27032, -39170, 69562, -345332, -250074, 434998, 397613, 53919, -446465, -396968, 155375, 521476, 196204, -277163, -460676, -88848, 412270, 404513, -116809, -444127, -265573, 231933, 461407, 114255, -364165, -375689, 29501, 414767, 304554, -199415, -440706, -129684, 292457, 386217, 18436, -396257, -305557, 160091, 395645, 174540, -248144, -392622, -40399, 357446, 298483, -97766, -375548, -211033, 222647]
115B22647J52199l09991l66296j5240L68426L17291j51928m06924j57559K40231
125a07144L73765O5753l62769l14232J27102L57398J91216j91744l83628p7319
135c21602L32311K89426o9301l33102k26366J79495L68358Q2834k77407k95008
145b70362J9308L33772K32067j61652l34381j12164K34753L15274k048l19525
155f4958k22295J20164L14191J48741k19497l16739o092K83741K28261p9496l13001
166a26980j63872K05744K96294L3078k50808k48461N8741L07564J60545j71560
176A00285k81918o8204K35877K58719m8422k84348j66978J32842K84461R0882
186B53196k28192k49105K8796K54111J88153j09680k87392r5032K03921K41985
$$ y = [222647, 374846, 64855, -301441, -316681, 51745, 369036, 217108, -189816, -347375, -107144, 266621, 332374, -30395, -344627, -217525, 139873, 331089, 139345, -244283, -321602, 10709, 300135, 230834, -102268, -328634, -149139, 219219, 302053, 24646, -270362, -251054, 82718, 314785, 153133, -181248, -293412, -58659, 256615, 254567, -64958, -287253, -167089, 147102, 295843, 76346, -240393, -246485, 37256, 265517, 186021, -126980, -290852, -85108, 211186, 244264, -6544, -255005, -196264, 111300, 271845, 100285, -181633, -249837, -13960, 244759, 196337, -88011, -254989, -122147, 162314, 253196, 25004, -224101, -195305, 58806, 246959, 137279, -150113, -245145, -41224, 200761]
196B00761M738k43830k04686R9019K74415J04642j72009k48296k9181K40182K05525
207B31280q2652k53437j26570J48379K57939L7942k24828j99564N1564K43676
217H3729J49255j40663k53114m6654J96660K09916k6089k43662j54097J25468
227i9251K37666O9982j76092k23845J4333K34561J54897r8947k31458r4559J67994
238d4719K25887n778k11182j65323P1933K35473J06442j59437k16557j5428J92747
249A4058J83437n9675k32121j08931J36082K11719M2701j87112j91033N0522K15082
260G4729J21796j11920k18853n5426J79866J86318k9910k01557j40489J00117
270i5329K18830O1993j60350j86805N279J96830J50810r0134k07820p5535J39781
$$ y = [200761, 205499, -38331, -243017, -143998, 130417, 235059, 63050, -185246, -214427, 25755, 231280, 148628, -104809, -231379, -83000, 174939, 212881, -11947, -211511, -159947, 83729, 232984, 92321, -160793, -207447, -10787, 199129, 173040, -70622, -224719, -99251, 138415, 208397, 32305, -191540, -177207, 57354, 212251, 113304, -118154, -212713, -44719, 181168, 175390, -35792, -201115, -129182, 106291, 212733, 53296, -163261, -178689, 14058, 197495, 137820, -94301, -203232, -67150, 144569, 187270, 158, -190875, -140353, 74729, 196525, 84605, -134248, -189674, -9808, 176510, 146600, -54957, -195446, -95329, 123501, 185494, 25144, -161661, -156382, 40448, 191258, 101124, -106696, -182231, -42450]
281d2450J95403J0671j95718j48403P1802J94724R8340j27839k02679j5681J79870
292A8040J50846m7647j94497j11656J21764J94387K9051j58027j63231K8399J96687
303F4116J14172j07271j85078n0398J47648J74529k3675j86759j16003Q3016J86404
314A00701O8464j43460j73441J1922J70682J29616o7048j90382p4232J32579J67778
325A33179R329j61895j42999N9621J85169P8467j12329j69948k7577J59843J45664
336A56524n1382j71052r3321R6135J79500L3754j53069j40992K9620J65328J09600
347A60645r0941j77376l8877J34331J46932j0953j66796j14348Q2558J67234N4236
358A46645j19140j57455M1J64000J14478o4897j61163p2667J12549J61415M686
$$ y = [-42450, 152953, 163624, -32094, -180497, -108695, 86029, 184369, 56530, -146149, -161830, 18040, 168886, 121239, -73258, -184914, -63150, 131237, 160288, 2261, -160970, -132571, 64116, 178288, 71017, -114061, -164459, -16811, 157718, 134043, -52716, -168719, -85703, 100701, 169165, 25705, -147736, -135814, 34868, 164484, 97436, -92946, -167178, -34599, 133179, 142508, -19387, -162386, -102765, 82404, 160871, 48542, -121406, -148983, 10860, 156524, 105142, -65910, -159231, -63096, 116404, 150158, -2911, -143903, -114283, 51045, 160645, 69704, -107672, -146549, -12218, 134714, 123761, -43035, -157383, -74825, 92409, 146645, 27505, -129950, -129909, 34091, 148569, 83672, -77491, -150158, -37609, 123806, 128492]
369A28492j49851j19386M5947J63804Q2016j07070j56447j8290J36477J32252
379A37944l5000j64667q3874R2255J53018L5946j30730j38477K9636J51925R1662
390A39638p2605j58448m6709J25779J35438j5130j41895j04215O2855J60648M9634
401A34990j12561j34365l118J37893J14979n8453j53323n8184R6440J42915J2976
412A20189j36128j13833M5948J43692P3523q6799j48695j8446J27585J13532k8095
423I2473j41317q5996Q3986J44836K4448j11532j21142J3401J43635Q7934p5111
434E5615j35546m0486J02262J30501r993j35914q9263N6861J36532N2724r9370
445B3923j30317L850J23684R8074m4009j39386n9199R3537J25053J0567j14863
$$ y = [128492, -21359, -140745, -94798, 69006, 151022, 43952, -112495, -130785, 5692, 137944, 102944, -61723, -145597, -53342, 99676, 135622, 4892, -133585, -103949, 47976, 139638, 67033, -91415, -138124, -12345, 123093, 107963, -33932, -138147, -75292, 85356, 134990, 22429, -111936, -115054, 22839, 137818, 79365, -73958, -132142, -35702, 107213, 120189, -15939, -129772, -83824, 59868, 133391, 46592, -102103, -120549, 7036, 120568, 92473, -48844, -134840, -50854, 93982, 118430, 6898, -114244, -100843, 42792, 130726, 55615, -79931, -120417, -18155, 112346, 102353, -33561, -122824, -65963, 70569, 123293, 23923, -106394, -102544, 21140, 119214, 75205, -64181, -123380, -29843, 95210, 105777, -9086]
456i086j09472L8991J37404O0595p9402j24659k5776J13817J11559l1659j27922
467d5610p0531O6572J31293L1694j08988j10269J9471J20793Q2319o1589j29824
478g4669l5257R6659J12218m741j21336q8402N6998J24261M3330q4851j17915
489i3705l239J19310Q6795m5254j17964n7646P9656J22151O805j09615r1242L2217
501g1731J19205O5119p5912j18682j5699R9611R8734k1918j21012o7614O8090
512d1809J14167K9244r4548j06162J8590J14893P0400n4670j15812l9080R2404
523a2383J04859r777j07416p8038M4134J19256M3170q6151j02588l176J03326
534A5216Q6647l9957j16126m6273P3267J06029J3742j02460q9299L5130J08467
$$ y = [-9086, -118558, -79567, 57837, 118432, 39030, -85629, -111405, 2412, 113971, 82312, -45610, -116141, -49569, 81724, 113418, 4430, -105839, -86368, 34425, 116744, 55155, -74669, -109926, -13267, 98951, 94210, -27126, -115528, -58530, 65731, 109061, 24210, -93705, -96944, 22366, 109161, 63907, -54057, -111703, -32047, 90104, 96909, -12706, -103948, -71731, 47474, 112593, 36681, -82001, -97700, 1911, 100645, 78727, -42285, -109899, -41809, 72358, 101602, 7054, -99108, -80518, 34375, 104775, 50105, -65707, -104787, -12383, 92476, 82699, -24717, -102755, -58621, 60635, 103805, 17654, -84934, -88110, 15216, 101863, 61906, -54220, -100493, -27226, 78803, 92545, -9915, -99214, -64084, 44383]
545D4383N5408o2751j11731j8856R7343Q7619k2171j03959o6766N9110J13081
556G0710K0658q6474r1042R154J07077P0487n6375j05206l1316P7560R8781l688
568H0326j05216p0323M5164J01938M3341p4410j02319J477R6479P3414l1658j04045
580d5832n1058P2224R8498P566q7930q1960K4624J06569M9876o1914r6296k0224
592h5857Q6282Q6825k2650r9680n4643N1460R9309K6539q3743q5593J4742R1967
604B4958O4182m3754j03324k7984P6196Q4439k649r1280p0687M2772R8015L4186
616H5070o6935r0344l827R1042P0693l5241r2357m4112O0692R4624P326q6675
628a0044o9618K2562R3141N2012n8961r3065j1593P6141P7644j6059r4646n3211
$$ y = [44383, 99791, 37040, -74691, -93547, 3796, 91415, 69244, -34715, -101481, -42371, 70710, 91368, 4894, -86148, -76994, 30083, 100570, 44195, -61011, -92327, -14767, 84014, 80326, -24890, -95213, -50049, 51889, 95230, 20820, -81499, -80022, 16457, 89871, 58213, -45832, -96890, -24666, 73832, 81398, -6532, -88492, -63868, 42701, 92577, 30663, -65633, -85857, 425, 87250, 64600, -35080, -89723, -38263, 61046, 87585, 3842, -81751, -67009, 24958, 89140, 45386, -57938, -85922, -9726, 74713, 72064, -19216, -89903, -47131, 50884, 85070, 18135, -72209, -76036, 15006, 85699, 50458, -41899, -86011, -25319, 69305, 76631, -10044, -79662, -57100, 36041, 88053, 29092, -63973, -75566, 575, 78219, 62160, -32486, -85697]
640h5697N2950Q9237K1727p1524q2712J1451R1408N4635m2415q9986l0742P0960
652a0708Q3656q041q3164o2280L5023R2517L4535o5966q2001k055P8994O9333
664G9843l0475r1593l7899N7363Q4243J1578p9691p1412K6973Q5416M4416n0035
676B8727q7250j5141P6586O9682j7156q3179n1748M5611Q9672J7194o9174p1992
688f8168P996Q2997N6137m1902q5935k5116O2259P7235k477q1454n7025L4518
700d0935Q2755L4148n9375p9803q47P5499O0461k4192q4561l9979N6082P9089
712E8342O760o9012o7270K0197Q4479M1011m8954p7642j6436O7228P0389j6640
724E2452q0043m4847M1041P9292K2351o5409o9726R826P4995N2436l5818q1857
$$ y = [-85697, -32747, 56490, 78217, 6693, -76019, -64568, 26840, 81475, 39060, -50926, -81668, -10708, 72948, 64907, -18257, -80537, -45514, 47003, 81538, 15572, -66429, -68484, 10510, 79843, 49368, -42225, -80124, -22761, 61482, 73060, -6631, -78043, -51070, 34346, 78762, 28727, -58523, -73664, 2922, 72604, 55448, -27731, -79479, -33868, 55804, 72998, 3824, -68168, -60172, 22825, 78962, 37060, -48875, -73991, -11732, 65503, 63026, -18428, -75453, -40935, 41820, 75968, 16593, -63210, -64057, 11442, 71903, 47711, -36850, -76829, -20747, 58342, 65102, -3910, -71180, -50983, 33496, 74507, 25553, -52089, -68525, -1297, 69092, 52452, -27591, -72438, -31397, 47895, 70246, 4837, -64889, -55063, 19932, 72368, 36550, -45307]
736d5307k5012O0855O9576j745p3047n7614L3048P9099K8167n2244p2414m987
748f1625P1474N8511k6902p4156l6093M7535P5821P853o8215n8456J7429P4454
760B7630M2237m5154p3574j2547O0103O2333j0148p5111m3403L8814P1631K0685
772F3496n5947o8497Q732P2379M4626l1513p1974k7341N5360O7859m784o6369
784a3973m9518K4999P3552L1050n2307o6381k860O2586N5888k1729p2826l2226
796f3745M4520O6546J1224o1060n8678J8692O8591L6755l7451p0805j4291N9798
808I6N7767j2600o6539m2380L4539P1102J6637n3448n8860N067O6115M4887l2332
821C0051o7222k1706M7483O2505L1o4185m5960K5336O4919K8925m4538o4713j964
$$ y = [-45307, -70319, -9464, 60112, 58367, -14680, -72294, -39246, 39853, 68020, 15776, -56638, -61625, 9849, 68360, 41458, -32698, -68791, -21256, 54565, 62418, -5797, -64253, -46824, 27630, 69867, 24713, -48861, -61408, -1305, 61028, 50880, -24231, -67634, -28820, 42811, 63496, 7549, -60948, -52216, 20163, 64789, 33276, -38698, -66039, -10679, 57180, 52396, -13973, -63491, -38492, 35060, 66110, 13803, -52578, -55438, 7148, 63036, 41307, -31519, -63745, -19225, 47321, 58545, -2515, -61193, -42501, 26090, 62845, 25394, -45411, -59702, 96, 57863, 45263, -21276, -63656, -29117, 41985, 58622, 5174, -53686, -48619, 17496, 62383, 30051, -37171, -58877, -11394, 51111, 51142, -13043, -59003, -33667, 31252, 60177, 15639, -49074, -51038]
834e1038N8998M8399j8195o5543l3285M2942O3173O696n4450n3274J4654O5560
846B4637L4431l7897o1393j3813N1415N6756j1350o2940l6546L0493O2867J9860
858E6520n1606n5630P085N7851M1450k4757o5358k1501M6267N5951R6n6058m6368
871e6058K2889O3562K4439m0730n7618o909N7406M6920j9418n9536k9679L5266
883a9466O1982P846n3488m7311J2506N7855L5695l3741o0899j0625M6873N0643
895D7870o851n8259l7617L1233N7599J6286m2850n4769M936N6846L6920k4396
907B6948n5919k2176M0837N5865k957n1835m1342J9048N8864K4790m0085n3104
919d1066l286M8646M5350j5599n8317k6259L4405N3090R300m6898m7940J4515
$$ y = [-51038, 7960, 56359, 38164, -27379, -60664, -17722, 45451, 52147, -2303, -55577, -40923, 24637, 59068, 21171, -40222, -54035, -2620, 54136, 42786, -20154, -56700, -26207, 36660, 56520, 4914, -50716, -43631, 14220, 55670, 30913, -34445, -55946, -9679, 46272, 46368, -9690, -56058, -33169, 30393, 54832, 14102, -43516, -50425, 6981, 53901, 34483, -25053, -54732, -19466, 42516, 50362, -3126, -50437, -37931, 19924, 55619, 21878, -39021, -49646, -2773, 47870, 41019, -17240, -54857, -23624, 33975, 50261, 7411, -47358, -42422, 14424, 51344, 26948, -28971, -51147, -10310, 45555, 42598, -9237, -50579, -31531, 27333, 52123, 12038, -41066, -44352, 4294, 49644, 34045, -24272, -50531, -16126, 36964, 46264, -634, -48574, -34059]
931c4059N4379K9047k8785n5120j2885M6506M6371q767n1561l5162K5389N7242
943C2595J4639m2269m7015J718N1126L8812k4366n4056j8162L6446N0263K300
955D2031n1006l8727K0166N1233K4420l3986n3324l596M8259L9225j3059n1889
967b0253k8770L2683N2213P225m3591m2745Q729N3315K8846k8503n0283j3791
979d4925M2255M4787o667n0554l1065K3753N1206J6899l9938m6699M484M6738
991A0274L4153j8099n3165j8974L7813M5444Q74m4031l9187J6276N2320K1035
1003D4733l2806m6010n859M2882M0644j4003m9703k3471K6519M9238R469m3019
1015a386l8417R492M4802K9658k3739n0267j1212L7901M0892l460m7088l0777
$$ y = [-34059, 20320, 49367, 20582, -34538, -47423, -917, 45454, 36687, -14874, -50036, -24647, 32595, 47234, 4965, -42050, -40332, 10794, 49606, 25240, -28816, -46978, -10532, 39731, 42031, -8975, -47702, -27536, 23697, 48117, 14131, -39193, -42789, 5470, 44695, 31636, -20253, -49023, -16340, 35873, 43098, -493, -43238, -34509, 18806, 47652, 19149, -31134, -44925, -2670, 42117, 35450, -15104, -46169, -22416, 28790, 45689, 5751, -40948, -36464, 10274, 44427, 26328, -26837, -45811, -7998, 37446, 38320, -5711, -44898, -28622, 23698, 44733, 11927, -34083, -39942, 2940, 43584, 29581, -20122, -43593, -17074, 32164, 41633, -1386, -39803, -30311, 14491, 44149, 20410, -29857, -41069, -3168, 37724, 34264, -12824, -43601]
1027d3601K3306M7866J3311l4830m2150J44M6028L1396j8192m5315j9196L1000
1039a0233M4663J513m1698l3675J2981M6470K1770k9006m3834n886L8318L7929
1051C9312j0322m6500k3311K6822M1922R837l6354l9750Q818M3845K4084k0840
1063A7563m4099j3548L6879L9029n365m0394l0019J7677M6178J5259l3783l7803
1075c2426n20L9927L2102j6731m4332j5857K7957M0602M245l9655l4118J4048
1087b4758M1138K1688k5111m1805o070L6718L3794r473m0960k3665K2382M2957
1099B6835P763l3744l4688M853M0957K6501k1637m0243j1032L0176L7138k764
1111C0115m0076k6521J6502L9815J6298k9910l7982J220L7196K7835j2376m0458
$$ y = [-43601, -20295, 27571, 40882, 6052, -36098, -35954, 10074, 41470, 23278, -22037, -41233, -10233, 34430, 35943, -5755, -39430, -26449, 20021, 41791, 12785, -31049, -36935, 1383, 39312, 28990, -17510, -40821, -13999, 27923, 37760, 1406, -38344, -29526, 14319, 38403, 17563, -26536, -40084, -3205, 35824, 30459, -9935, -39954, -22277, 23901, 39160, 5377, -32426, -32946, 6981, 39083, 22352, -21980, -37837, -9880, 30722, 34967, -4688, -38806, -24758, 16380, 38068, 12957, -28848, -34918, 1800, 35594, 26121, -14839, -38504, -16122, 26835, 34598, 854, -33834, -28981, 11976, 38477, 16840, -23403, -34435, -4259, 32879, 30115, -9961, -36482, -19980, 19835, 36133, 6223, -31759, -30539, 6657, 34492, 22116, -18342]
1123a8342j8584K8610L7784J834l4500l0834J0538M1078J7646k3581l6671p861
1135c2883L3424L3129q670l9169k0442J9540L8866R714l2469l3239N346L7398
1147A0545K3943j8511l9019j0654K9693L3672k380l6418k6488J6443L8330J2451
1159C1607k5069l4241k265L5616K6983j3288l5992j7353K4706L6184K655l3137
1171c594k7347Q818L5683K0274k2556l5331n879L0256L0056o182l6613k0216K0170
1184a2461L4822R602k8603l2478M634L4555K1860j6119l5666j1429K6267L2412
1196B7396j881l2967k3644J1833L6666J3352k4385l1790q50L0127K7743j2539
1208A9061l4658j4123K0893L2570L966k9774k8246R316L4351J6169j8665l2943
$$ y = [-18342, -36926, -8316, 29468, 31302, -3198, -34032, -23494, 17584, 35230, 11649, -25022, -32883, 541, 33670, 25000, -14169, -34611, -15071, 23795, 33509, 1040, -32199, -26853, 10545, 34488, 15977, -23042, -33696, -4003, 29669, 27289, -9129, -35617, -19174, 19156, 31607, 6538, -27703, -29968, 5648, 32631, 19343, -16649, -34002, -9296, 26888, 29543, -3594, -30941, -22123, 13560, 33834, 11278, -24053, -29932, 324, 30380, 24198, -12415, -32631, -12461, 22361, 31963, 3360, -29118, -24484, 10071, 31931, 15812, -19854, -31283, -5016, 27396, 25515, -7452, -31096, -19263, 17403, 30755, 6370, -25420, -26270, 3857, 31600, 19061, -15597, -29720, -8827, 23743, 27709, -2065, -30311, -20995, 13356, 29525, 10860, -22083]
1220b2083o862K9423K7851n514l2205k0963J7392L3386P666k5479k8968J878L2088
1233G610K1952j4824l2495j0110K2283L1031m52l1065k2174J1613L2950J2668
1245B8987k2125l0354k245K9336K3827q455l2066j5902K0370L0739L124k6568
1257a332k5508N746L2339J6975j6751l0556q137K6002K8093o031l0427j7663J4052
1270a3198L0864R473k4554k6633K563K8037K0920j2341l1088j1588K1508K7947
$$ y = [-22083, -28945, 478, 28329, 22815, -9390, -30353, -12961, 20425, 28091, 2612, -26356, -24478, 7610, 29562, 14738, -17757, -27867, -5584, 25447, 24995, -6070, -28244, -16631, 16319, 28987, 6862, -23492, -25737, 3599, 27426, 18971, -13095, -28997, -8627, 22112, 25236, -1332, -26840, -21094, 11245, 28220, 11469, -19087, -27224, -1222, 26871, 20840, -9587, -27250, -13198, 17666, 27139, 2585, -24048, -21485, 6552, 27472, 15131, -15957, -27545, -6037, 21910]
$$ [...]
8191d00
##END NTUPLES=NMR FID
##END=
