##TITLE=1H_DE-4oil
 CDCl3
 8 sc, 
 9.8.2023
##JCAMPDX= 6.0         $$ Bruker NMR JCAMP-DX V2.0
##DATA TYPE= NMR FID
##DATA CLASS= NTUPLES
##ORIGIN= UXNMR, Bruker Analytische Messtechnik GmbH
##OWNER= root
$$ XWIN-NMR		Version 3.5
$$ Wed Aug  9 13:42:07 2023 Russian Standard Time (UT+4h)  she@DPX200
##.OBSERVE FREQUENCY= 200.13135
##.OBSERVE NUCLEUS= ^1H
##.DELAY= (6, 6)
##.ACQUISITION MODE= SIMULTANEOUS
##.ACQUISITION SCHEME= undefined
##.AVERAGES= 8
##.DIGITISER RES= 18
##SPECTROMETER/DATA SYSTEM= spect
##.PULSE SEQUENCE= zg30
##.SOLVENT NAME= Acetone
##.SHIFT REFERENCE= (INTERNAL, Acetone, 0, 15.7039)
##AUDIT TRAIL= $$ (NUMBER, WHEN, WHO, WHERE, WHAT)
$$ ##TITLE= Audit trail, XWIN-NMR		Version 3.5
$$ ##JCAMPDX= 5.01
$$ ##ORIGIN= Bruker BioSpin GmbH
$$ ##OWNER= she
$$ F:/spectra/data/she/nmr/H-F/1/audita.txt
$$ ##AUDIT TRAIL=  $$ (NUMBER, WHEN, WHO, WHERE, WHAT)
(   1,<2023-08-09 13:40:57.75 +0400>,<she>,<DPX200>,
      <created by zg, POWCHK disabled, PULCHK disabled
       configuration hash MD5:
       00 E9 B6 7A A2 85 ED C7 34 08 36 98 17 FE 4E 26
       data hash MD5: 16K
       71 0E A8 5E 86 1A 46 8B 6A DA FC 2A F0 04 0A 9C>)
$$ ##END=
$$ 
$$ hash MD5
$$ 52 5E 91 97 54 E7 21 DC CA DD CB 81 23 F9 A0 5B
##$RELAX= 
##$RELAX= 
##$RELAX= 
##$RELAX= 
##$RELAX= 
##$RELAX= 
$$ Bruker specific parameters
$$ --------------------------
##$DU= <F:/spectra>
##$EXPNO= 1
##$NAME= <H-F>
##$PROCNO= 1
##$TYPE= <nmr>
##$USER= <she>
##$AMP= (0..31)
100 100 100 100 100 100 100 100 100 100 100 100 100 100 100 100 100 100 
100 100 100 100 100 100 100 100 100 100 100 100 100 100 
##$AQSEQ= 0
##$AQ_mod= 1
##$AUNM= <au_zg>
##$AUTOPOS= <>
##$BF1= 200.13
##$BF2= 200.13
##$BF3= 200.13
##$BF4= 200.13
##$BF5= 200.13
##$BF6= 200.13
##$BF7= 200.13
##$BF8= 200.13
##$BYTORDA= 1
##$CFDGTYP= 0
##$CFRGTYP= 5
##$CHEMSTR= <none>
##$CNST= (0..31)
1 1 145 1 1 1 1 1 1 1 1 1 1 1 1 1 1 1 1 1 1 1 1 1 1 1 1 1 1 1 1 1 
##$CPDPRG= <>
##$CPDPRG1= <>
##$CPDPRG2= <>
##$CPDPRG3= <>
##$CPDPRG4= <mlev>
##$CPDPRG5= <mlev>
##$CPDPRG6= <mlev>
##$CPDPRG7= <mlev>
##$CPDPRG8= <mlev>
##$CPDPRGB= <>
##$CPDPRGT= <>
##$D= (0..31)
0 1.2 0 0 0 0 0 0 0 0.06 0 0.03 0 0 0 0 0.0002 0 0 0 0 0 0 0 0 0 0 0 0 
0 0 0 
##$DATE= 1691574057
##$DBL= (0..7)
120 120 120 120 120 120 120 120 
##$DBP= (0..7)
150 150 150 150 150 150 150 150 
##$DBP07= 0
##$DBPNAM0= <>
##$DBPNAM1= <>
##$DBPNAM2= <>
##$DBPNAM3= <>
##$DBPNAM4= <>
##$DBPNAM5= <>
##$DBPNAM6= <>
##$DBPNAM7= <>
##$DBPOAL= (0..7)
0.5 0.5 0.5 0.5 0.5 0.5 0.5 0.5 
##$DBPOFFS= (0..7)
0 0 0 0 0 0 0 0 
##$DE= 6
##$DECBNUC= <off>
##$DECIM= 32
##$DECNUC= <off>
##$DECSTAT= 4
##$DIGMOD= 1
##$DIGTYP= 9
##$DL= (0..7)
0 120 120 120 120 120 120 120 
##$DP= (0..7)
150 150 150 150 150 150 150 150 
##$DP07= 0
##$DPNAME0= <>
##$DPNAME1= <>
##$DPNAME2= <>
##$DPNAME3= <>
##$DPNAME4= <>
##$DPNAME5= <>
##$DPNAME6= <>
##$DPNAME7= <>
##$DPOAL= (0..7)
0.5 0.5 0.5 0.5 0.5 0.5 0.5 0.5 
##$DPOFFS= (0..7)
0 0 0 0 0 0 0 0 
##$DQDMODE= 0
##$DR= 18
##$DS= 0
##$DSLIST= <SSSSSSSSSSSSSSS>
$$ [...]
##$SUBNAM2= <"">
##$SUBNAM3= <"">
##$SUBNAM4= <"">
##$SUBNAM5= <"">
##$SUBNAM6= <"">
##$SUBNAM7= <"">
##$SUBNAM8= <"">
##$SUBNAM9= <"">
##$SW= 18.05172834244
##$SWIBOX= (0..15)
0 0 2 0 0 0 0 0 0 0 0 0 0 0 0 0 
##$SW_h= 3612.71676300578
##$TD= 16384
##$TD0= 1
##$TE= 0
##$TE2= 300
##$TE3= 300
##$TEG= 300
##$TL= (0..7)
0 120 120 120 120 120 120 120 
##$TP= (0..7)
150 150 150 150 150 150 150 150 
##$TP07= 0
##$TPNAME0= <>
##$TPNAME1= <>
##$TPNAME2= <>
##$TPNAME3= <>
##$TPNAME4= <>
##$TPNAME5= <>
##$TPNAME6= <>
##$TPNAME7= <>
##$TPOAL= (0..7)
0.5 0.5 0.5 0.5 0.5 0.5 0.5 0.5 
##$TPOFFS= (0..7)
0 0 0 0 0 0 0 0 
##$TUNHIN= 0
##$TUNHOUT= 0
##$TUNXOUT= 0
##$USERA1= <user>
##$USERA2= <user>
##$USERA3= <user>
##$USERA4= <user>
##$USERA5= <user>
##$V9= 5
##$VALIST= <valist>
##$VCLIST= <CCCCCCCCCCCCCCC>
##$VD= 0
##$VDLIST= <DDDDDDDDDDDDDDD>
##$VPLIST= <PPPPPPPPPPPPPPP>
##$VTLIST= <TTTTTTTTTTTTTTT>
##$WBST= 1024
##$WBSW= 4
##$XGAIN= (0..3)
0 0 0 0 
##$XL= 0
##$YL= 0
##$YMAX_a= 62904
##$YMIN_a= -99604
##$ZGOPTNS= <>
##$ZL1= 120
##$ZL2= 120
##$ZL3= 120
##$ZL4= 120
##$ABSF1= 10
##$ABSF2= 0
##$ABSG= 5
##$ABSL= 3
##$ALPHA= 0
##$AQORDER= 0
##$ASSFAC= 0
##$ASSFACI= 0
##$ASSFACX= 0
##$ASSWID= 0
##$AUNMP= <proc_1d>
##$AZFE= 0.1
##$AZFW= 0.1
##$BCFW= 1
##$BC_mod= 2
##$BYTORDP= 1
##$COROFFS= 0
##$CY= 11.3945322036743
##$DATMOD= 1
##$DC= 2
##$DFILT= <>
##$DTYPP= 0
##$F1P= 15.7292609196834
##$F2P= 12.9074282941183
##$FCOR= 0.5
##$FTSIZE= 0
##$FT_mod= 4
##$GAMMA= 1
##$GB= 0.15
##$INTBC= 1
##$INTSCL= 1
##$ISEN= 128
##$LB= 0.24
##$LEV0= 0
##$LPBIN= 0
##$MAXI= 10000
##$MC2= 0
##$MEAN= 0
##$ME_mod= 0
##$MI= 1.114404
##$NCOEF= 0
##$NC_proc= 0
##$NLEV= 6
##$NOISF1= 3.799351
##$NOISF2= 2.8
##$NSP= 1
##$NTH_PI= 0
##$NZP= 0
##$OFFSET= 15.70392
##$PC= 1
##$PHC0= -21056.93
##$PHC1= 28.65272
##$PH_mod= 1
##$PKNL= yes
##$PPARMOD= 0
##$PSCAL= 0
##$PSIGN= 0
##$REVERSE= no
##$SF= 200.130013532006
##$SI= 16384
##$SIGF1= 3
##$SIGF2= 2
##$SINO= 400
##$SIOLD= 16384
##$SREGLST= <1H.CDCl3>
##$SSB= 0
##$STSI= 0
##$STSR= 0
##$SW_p= 3612.71676300578
##$SYMM= 0
##$S_DEV= 0
##$TDeff= 0
##$TDoff= 0
##$TI= <>
##$TILT= no
##$TM1= 0
##$TM2= 0
##$TOPLEV= 0
##$USERP1= <user>
##$USERP2= <user>
##$USERP3= <user>
##$USERP4= <user>
##$USERP5= <user>
##$WDW= 1
##$XDIM= 8192
##$YMAX_p= 0
##$YMIN_p= 0
$$ End of Bruker specific parameters
$$ ---------------------------------
##NTUPLES= NMR FID
##VAR_NAME=  TIME,          FID/REAL,        FID/IMAG
##SYMBOL=    X,             R,               I
##VAR_TYPE=  INDEPENDENT,   DEPENDENT,       DEPENDENT
##VAR_FORM=  AFFN,          ASDF,            ASDF
##VAR_DIM=   8192,          8192,            8192
##UNITS=     SECONDS,       ARBITRARY UNITS, ARBITRARY UNITS
##FACTOR=    0.0002768,     1,               1
##FIRST=     0,             0,               0
##LAST=      2.2672688,     0,               0
##MIN=       0,             -99604,          0
##MAX=       2.2672688,     62904,           0
$$ Real data points
##PAGE= N=1
##DATA TABLE= (X++(R..R)), XYDATA
0@%%%%%%%%%%%%%%Qj6J6j6J6k4L2l2M0m8N6o5P3q8J04j20J36j52J74j98K23k53
36a34K85l18L54l95M40m90N45o04O67p37Q14q98R91j090J200j324J459j608J775
55I32j966K180k426K712l044L442l927M532n314O369p874J0212j4369K3971q7773
70g2343k7261J31145n1146k0993O1273P144n1327L1136J7127q159L2714J3594
82F2904n8925M45L7464l0836l0063M9294Q692n1129r759J6934j9968M188K9957
95I198j5846j8885L0970p835m4443K9860N3624l0118k7358L2701q88l0438J7882
108a576J8051j1649J4808M258m0544L869M1986k0082k7064L9962J1484m7940p214
121b1651K8847l326p139R547r856p489J2525j2865j9420K9771K2995l2072j6049
$$ plain form
0 0 0 0 0 0 0 0 0 0 0 0 0 0 0 0 8 -8 8 -8 8 -16 16 -16 24 -24 32 -33 40 -48 56 -64 72 -80 94 -104 119 -134
36 -134 151 -167 187 -208 232 -258 287 -317 350 -387 427 -471 520 -570 630 -694 765 -843 932
55 932 -1034 1146 -1280 1432 -1612 1830 -2097 2435 -2879 3490 -4384 5828 -8541 15430 -72343
70 -72343 -99604 31541 -19605 -40598 20675 27819 -23508 7628 24755 16596 49310 62904
82 62904 3979 4424 41888 11052 -19011 30283 38975 -12154 -21913 -4979 -24947 -20759 9198
95 9198 -6648 -25533 5437 -2398 -46841 -16981 36643 6525 -20833 11868 10980 -19458 -1576
108 -1576 16475 4826 19634 23892 -16652 -12783 29203 9121 -17943 22019 33503 -14437 -21651
121 -21651 7196 3870 -3269 6278 -3578 -11067 1458 -11407 -30827 -1056 21939 -10133 -26182
134b6182K8322J943k2641J1829K0228p360m569J724j0572N970K1007j2126j5411
147g838K2423O171l2805l143K7955r16j5439K226Q36k821K840q818n457K1495
161F709O835k8609m532K6619r07k0344R231J8892o554j3848P00P345N850j112
175F275q273J623J2279n383j7603O783K0129o008j6576M487R808n463o253Q93
189c282M203N435l816j3227J835J4385l709j3673P246J1701p236j1425M512J0122
203C071J888o479l164P406O988q252q233J0583J1226q799j2551O169J0056n832
217D077j0331L519R252k165j0519k507Q060M104o966o502O867P643p478r100P182
232d864J0920m012r666K426J1111l30j0619q12J2237L986j0770n985J0090Q063
$$ plain form
134 -26182 2140 4083 -18558 -6729 13499 6139 1570 3294 -7278 -1308 19699 7573 -7838
147 -7838 14585 20756 -12049 -15192 12763 11847 -3592 -1366 -530 -3351 -511 -9329 -14786 6709
161 6709 13544 -15065 -19597 7022 6115 -14229 -4998 13894 7340 -6508 -5808 1537 7387 6275
175 6275 -1998 -375 11904 6521 -11082 -4299 15830 9822 -6754 -2267 7541 2078 -4175 -3282
189 -3282 921 6356 2540 -10687 -8852 5533 1824 -11849 -4603 7098 -138 -11563 -7051 3071
203 3071 4959 -1520 -4684 2722 9710 1458 -6775 3808 15034 6235 -6316 -147 9909 4077
217 4077 -6254 -2735 6517 4352 -6167 -8674 -614 3490 -3476 -9978 -3111 4532 -2946 -12046 -4864
232 -4864 6056 2044 -7622 -5196 5915 5585 -5034 -5846 6391 10377 -393 -6378 3712 11775
246A1775q786r851P881J0414q343j2578O030J1598o258j1030L322R761j728r809
260g602q55J0044L669r408m599J0273P003q979n440Q651O199n735n714L465N444
275F416k35n568l202O020M519p832o642O977O352p963p119N569O276l955o846
290g233J025P819K001r118l672J1133N288j1416n104J2178N583r885n218Q432
304A813O049n573o756K931P785j197r865o5J0537K01j1170n56R524M09q193j981
320f107N461L464l367n695K112Q314m56r939M82J1166J17r842k66R453J717o829
336b15l713N880O356n701q611N127R816n638j1186N181J0507n160r543K904Q271
351D275j533p535j475P452M369p859n613P996O697p799n272P096N079n149l808
$$ plain form
246 11775 2989 -6862 1019 11433 3090 -9488 -3458 8140 1882 -9148 -5826 3935 2207 -7602
260 -7602 -8457 1587 5256 -4152 -8751 1522 8525 -454 -5894 2757 8956 3221 -2493 972 6416
275 6416 6181 613 -2589 3431 7950 118 -6524 453 6805 -1158 -8277 -2708 3568 -387 -7233
290 -7233 -6208 1611 3612 -5506 -9178 1955 7243 -4173 -9277 2901 8484 -1401 -6619 1813
304 1813 7862 2289 -4467 -1536 6249 5052 -4813 -4878 5659 5860 -5310 -5866 3658 4067 -4126 -6107
320 -6107 -646 2818 -549 -6244 -4132 4182 3726 -6213 -5731 5435 5552 -4290 -4556 4897 6614 -215
336 -215 -3928 1952 8308 2607 -6004 -877 8939 3301 -7885 -2704 7803 2643 -6900 -3996 4275
351 4275 2742 -4793 -6268 1184 5553 -2306 -7919 77 6774 -1025 -6297 799 5878 729 -3079
366c079K661L767R00m454l777N611M965p040n598P112N134p081n022M814M315
381C228j712n105r20O272L106q357m561J1082N151j1449l752J0459K939q397k774
396d790O205L818l371n850L79Q456Q96r634r30J1349n18j1822J109R535j016o099
412b283k96K510K204o49n700m87R614K22j1750L64J1337j761r663K944P711j054
428C263n568j988K503O292j055q858K554J0805m649j2295O791J1851n927q823
442e104M790M987l753k671J95L086L685m103q802M365R572o521p237P886N119
457E494q685k847N436J310Q77J104m523o38P297l069q211P045J0139q320r226
472f817O783M480n179j728L007J376Q71m518p082O299J0369p339r492J0643O226
$$ plain form
366 -3079 -418 3349 4249 -205 -3982 1629 6594 -446 -6044 1068 6202 -879 -5901 -1087 3228
381 3228 1516 -3589 -4509 1763 4869 -3488 -8049 3033 8184 -3265 -7017 3442 6381 -2016 -4790
396 -4790 1415 5233 1862 -3988 -3609 4847 5743 -3891 -4821 6528 6010 -5812 -4703 4832 3816 -2283
412 -2283 -2579 -69 2135 1486 -4214 -4701 4913 5135 -6615 -6251 5086 3325 -6338 -3394 4317 3263
428 3263 -2305 -4293 -1790 4502 3447 -5411 -2857 7948 3299 -8996 -2205 9646 3719 -5104
442 -5104 -314 4673 920 -1751 -1556 1530 5215 1112 -7690 -3325 6247 -274 -7511 375 5494
457 5494 -3191 -6038 -602 708 1585 2689 -1834 -2472 4825 1756 -6455 590 10729 2409 -6817
472 -6817 -34 4446 -733 -2461 546 1922 2793 -1725 -8807 -2508 7861 522 -8970 1673 7899
487G899j3410m024J2105L956o723j233M38K55K712k748l236Q817N058j2979n759
502h872J2584K490j0143K700Q064l595n940Q5j24L447O129o068p186Q271L086
517D928j2290k46J4409j31j0852O12M083k198N51R79o76M797K036j1564l280J4194
533E352J705j1859L293J0294p344q992N060N403m10O77l706m001M948J194q634
548g020L420J2706m418j2256L566O275m058n83N104j60j395l61o205r21J1712
563E406J568j1269K160R175p565q994Q578Q622m286l078q47j712L372J425n516
578b961L359R802p428j3413O670J0152p101l666Q039K40p583j726J137K979O343
593D843j541p929K921O659p558m816J1924O293r768m829M152L24q76J973l49N02
$$ plain form
487 7899 -5511 -9535 2570 6526 -197 -1430 -992 -737 1975 -773 -4009 4808 9866 -3113 -8872
502 -8872 3712 6202 -3941 -1241 6823 3228 -2712 -2627 -2751 696 6825 757 -6429 1842 4928
517 4928 -7362 -7608 6801 6670 -4182 -3570 513 -1685 -1134 -155 -831 3966 6002 -5562 -8842 5352
533 5352 7057 -4802 -1509 8785 1441 -7551 -2491 2912 2502 3179 -527 -4528 420 1614 -7020
548 -7020 -3600 9106 4688 -7568 -4002 2273 -1785 -2368 2736 2576 1181 820 -5385 -6306 5406
563 5406 6974 -4295 -2135 7040 -525 -9519 -941 7681 3395 317 -530 -2242 1130 2555 -2961
578 -2961 398 10200 2772 -10641 -3971 6181 -920 -4586 3453 3693 -3890 -5616 -4479 -1500 4843
593 4843 3302 -4627 -1706 4953 -2605 -7421 4503 10796 1028 -3801 351 675 -201 1772 1423 1925
609A925K909o673q252Q184R270p929n195Q716L83j0446O74P884J796j013k032
624B01m314K401M975n482k083J0882K041j2360k217Q494J79m333L772J551l151
639E56p44k054k524O120N612p579m782P018L89q353K110Q550q97m992j354o71
655c595K470L872l707k678Q459J268j2328n32J2648N52q861K499N104l219m274
670b322L91L034L948j082p657n0P402k528q402N302Q442o252p230L863L944j898
686a095J04L03n6L009p25o490K457Q717k388p341M094M235m849k581L450J598
702B442p3j220m783R08O406l010o630N202O467o890o081N777M527l270k975K244
718i59J843P00k859k613M882M299n060m513N815L431o299j636N777J097l426j593
$$ plain form
609 1925 4834 -1839 -10091 -1907 7363 -566 -5761 2955 3338 -7108 -6434 1450 3246 2233 201
624 201 -4113 -1712 3263 -2219 -4302 6580 8621 -3739 -5956 2538 2717 -1616 2156 3707 556
639 556 -188 -2242 -4766 1354 6966 -613 -5395 1623 2012 -6341 -4231 4319 3422 -1570 -2924 -3595
655 -3595 -1125 2747 -960 -3638 4821 6089 -6239 -6771 5877 6429 -2432 67 5171 1952 -2322
670 -2322 -1931 1103 5051 3969 -3688 -3738 3664 1136 -7266 -1964 6478 226 -7004 -3141 803 -1095
686 -1095 -991 -688 -744 2265 1540 -4950 -2493 6224 3836 -3505 589 4824 -25 -2606 844 2442
702 2442 2369 1149 -3634 -2726 3680 670 -5960 -758 5709 -1181 -7262 -1485 3042 -228 -3203 -959
718 -959 884 1584 -1275 -3888 994 5293 233 -4280 1535 4966 -1333 -2969 2808 3905 479 -1114
734a114P34J369J677l116k733M547K640n843l276O009K454m616j806K146K393
749A465q96k918o19N024J637n813j767O309J998o781p49O421J273n546j826L886
765A098K933l160m234K535M768k073n969J516N962j234o022R93M459m72l697n98
781c195K972J996k068l189K311M280k225m032K590L848j159l814K20L689Q42l602
797e36k011L782K819l663l981L007M345l291l999J976L876j230l779Q7M072L63
813A837l888j284M312K106m360j855M023K486l104k889K815K730q74l505J65L937
829B652L60m057j297M034J634m075k014L266K488l191l495K053L967j656m364
844c695O87N166l44n700M96N705N57n050p70N017J801m174k324L642L267l111
$$ plain form
734 -1114 -380 989 2666 -450 -3183 1364 4004 -1839 -5115 894 3348 -1268 -3074 -928 1465
749 1465 569 -2349 -2968 2056 3693 -2120 -3887 2422 4420 -2361 -3110 3311 4584 -962 -2788 1098
765 1098 4031 871 -3363 -828 3940 1867 -4102 -2586 3376 2142 -3880 -2887 1572 1100 -2597 -3195
781 -3195 -223 1773 -295 -3484 -1173 3107 882 -3150 -560 3288 2129 -1685 -1465 2224 3066 -536
797 -536 -2547 1235 4054 391 -3590 -583 3762 471 -3528 -1552 2324 1094 -2685 -2598 1474 1837
813 1837 -2051 -3335 977 3083 -1277 -3132 891 3377 273 -2616 199 2929 2055 -1450 -1285 2652
829 2652 3012 -1045 -2342 1692 3326 -749 -2763 503 2991 -200 -3695 -1642 2325 669 -3695
844 -3695 -3008 2158 1814 -3886 -3390 2315 2872 -2178 -2948 2069 3870 -304 -2628 1014 4281 1170
860A170m133L042L820k274m151J509L938j423l843K65K884K16k759j139K644J852
876A618k599k152J908L313j217l252N68L542L96l409o92L752J804l763k036L052
892H33K781k943k845K151L431k120m221J154M495o20n133M07M535k40m513%M319
909A471P64l703j411K766K257j633l145J915L900j688m074J231M056n26l003L47
925d76K155L32k041k323K200L165j734m554J126N001k330m441J982M805k012l729
941b874n2L140J371k141j968L191L025l869m247M746M685m587l350L973J995l566
957e28j904K487K143J49k628k805K894K781l810j912M817J654n000j637L134R15
973G50k88n25n70O43J681k558l015N105L965n427k969M663Q29m018J78L377M64
$$ plain form
860 1170 -2963 79 3899 1625 -2526 -1017 2921 1498 -2345 -2080 804 1020 -1739 -2878 -234 1618
876 1618 -981 -3133 -1225 2088 871 -2381 -1813 1729 2125 -1284 -1976 1776 3580 -183 -2219 833
892 833 3614 671 -2174 -23 3408 1288 -2933 -1779 2716 2096 -3037 -2630 1905 1665 -2848 -2848 1471
909 1471 2235 -1468 -2879 -113 2144 511 -2634 -719 3181 1493 -2581 -1350 2706 2180 -823 -476
925 -476 1679 2011 -30 -2353 -153 3012 1278 -3276 -2150 2851 521 -3920 -1938 2867 855 -2874
941 -2874 -2926 214 1585 -556 -2524 667 3692 -177 -4424 322 5007 420 -2930 1043 3038 -528
957 -528 -2432 55 2198 2347 -281 -3086 -192 2589 -1221 -3133 1684 3338 -1662 -3299 -165 750
973 750 462 -63 -633 10 1691 -867 -3882 1223 5188 -239 -3208 1455 2284 -1734 -1556 1821 2285
990B285q85k472k019L323L164m437k076N911M14p232p1O426k56k982N48M19p96
1007g36M68j318p78N135J497o630j838O683n36n200K795M635k724l189L58J66
1023a212K369J903l225j775M669o52p322K443Q056k598n811K458K056l080K07
1038a514J387M40K235j072n475L78O703j761n245N029L489n796l318M771J028
1053A279q69J768j468k045K486j50m765L637N804m286n610L870J843l562O97K699
1069A328n09o5r97l861J403O528j886n534M093M245p011k737O591K204l224l83
1085A85J20j433J653m91k182L768L855o516m205N901K124n529J225M682k100l306
1101b249L61K0R86L802j822l810K867K387n517q82P054N27n038J00J946j188K73
$$ plain form
990 2285 1400 -1072 -3091 232 3396 -1041 -3117 2794 3208 -4024 -4095 2331 2075 -907 -359 60 -736
1007 -736 -268 -1586 -2364 2771 4268 -2362 -4200 2483 1947 -3253 -458 4177 1453 -1736 -1378 -1212
1023 -1212 1157 3060 -165 -1940 2729 2077 -5245 -2802 5254 2656 -3155 -697 1359 -1721 -1514
1038 -1514 -127 313 2548 1476 -3999 -3621 3082 1321 -3924 1105 4594 -1202 -4520 251 1279
1053 1279 410 2178 710 -1335 1151 1001 -3764 -127 5677 1391 -4219 -349 1494 -2068 -1371 1328
1069 1328 819 754 -243 -4104 -2701 3827 1941 -3593 500 4745 -2266 -5003 1588 3792 568 185
1085 185 305 -1128 525 34 -2148 1620 5475 -1041 -5246 655 2779 -2750 -1525 3157 1057 -2249
1101 -2249 -1888 -1868 -882 2920 1098 -2712 155 2542 -2975 -3857 3197 3724 -1314 -1214 732 -456 -183
1118a83J054j206K571J250n695k610O639K197o485R62N034k590m937J900L052
1133I53q3K19j611j530K464O65m034J263N955j860n816K100L240k430q49K790
1149A436J49j218L60k123p48M278R86m752N30L776k422l856K826K992j259j127
1165a72q44m12J782N59l088Q58M869k378n473K766M820k785k954K893J599j833
1181B07j758j9K430K127j908l549K318L138l740k526M558K329l670k197K234N37
1197E11n78n89Q0Q93J264k483k654L156L465l629j699L174J019k553j178J878
1213G7J874k85j926j174K103J838l060j635M036J149m079j210L156R21k346p54
1229a315J620P91j024k093O30K479N22l265n06L215M43l071O8K805L12j697j111
$$ plain form
1118 -183 871 -335 2236 3486 -2209 -4819 1820 4017 -2468 -1506 3528 938 -3999 -2099 953
1133 953 870 1089 -522 -2052 412 1077 -2957 -1694 4261 2401 -3415 -1315 1925 -505 -1354 1436
1149 1436 1585 367 727 -1396 -2144 2134 3120 -1632 -1102 2674 252 -3604 -778 2214 955 -172
1165 -172 -1016 -1428 354 913 -2175 -1317 3552 1174 -4299 -1533 3287 502 -2452 441 2040 207
1181 207 -1551 -1570 860 2987 1079 -2470 -152 2986 -754 -3280 1278 3607 -63 -2260 -26 511
1197 511 -67 -656 -576 317 1581 -902 -3556 -400 3065 -564 -2263 911 1930 -623 -1801 77
1213 77 1951 1666 -260 -1434 669 2507 -553 -2188 1848 2997 -1082 -2292 864 1785 -561 -1315
1229 -1315 305 1096 72 -2021 -1391 1088 1610 -1655 -2161 1054 1497 -1574 -1506 1299 1611 -86 -1197
1246a197R43J554k64j849m58K757O11l214q17L526K91k847o48K076R28k154j647
1263b409J736K256j304k687Q55L488j110l411Q96L659o00l102L89K744M70k155
1279b85p86J977J241j881j708J381K341j601k260J122J856p70k318K96K244K74
1295A123k331p91J792J621j513k246J792K475j424k448J138K873q79k196J19K546
1311A651R8k286o04K542O70k203j426K270J161k008j767J743J611j489j710O06
1327a141J618L6j715k35J924P04j992j132J749J718j398j424J200J587o22j513
1343f36K19J800L83k297q47K799M60k509j262K423J334k169j893J788K051j632
1359A2k199P69K774o76k657K46L279P8k945lK433L27k271q7J749R82j387j487
$$ plain form
1246 -1197 -254 1300 1036 -813 -1271 1486 2097 -1117 -1934 1592 1883 -964 -1612 464 1392 -762 -2409
1263 -2409 -673 1583 279 -2408 -1553 1935 825 -2586 -1690 1969 1369 -1733 -1344 1400 1870 -285
1279 -285 -1071 906 2147 266 -1442 -61 2280 679 -1581 -459 1397 627 -1691 -1395 849 1123
1295 1123 -1208 -1999 -207 1414 -99 -2345 -553 1922 498 -1950 -812 2061 1182 -1014 -895 1651
1311 1651 1749 -537 -1141 1401 2071 -132 -1558 712 1873 -135 -1902 -159 1452 -37 -1747 -1141
1327 -1141 477 513 -1202 -1437 487 1191 -801 -1933 -184 1534 136 -1288 -88 1499 877 -636
1343 -636 -417 1383 1766 -531 -1378 1421 1881 -628 -1890 533 1867 -302 -2195 -407 1644 12
1359 12 -2187 -1418 1356 680 -1977 -1731 1548 1626 -1319 -1322 1111 1438 -833 -920 829 1811 424 -1063
1377a063J231J922j243k181Q30K423q81k270K83J819J2j656q69J582J106j274
1393b29j712J094J987q07k463J306K553j165k075R43J926m18j381n88J676R94
1409A641j420j623J360K255j923k134J792J789j693j648J201J190k39j227m86
1424a165O00J552j326j384J570J954k000j935J709J595p76j411O46J139O07j650
1440b75j025J673K018k288k027K728J754l297j305K622J226k008j243Q53J305
1455G11k74j391k87K215N45l207n87L187N51k797L25K516p30j360j93J245O98
1472A167L85j456j361K029R87k740p0K725j14k952M65J218k92p6k87l88J252M11
1490I03k817m57L785O48l799M49K927j267k199J622J528K2q36j067n03J885O51
$$ plain form
1377 -1063 168 2090 847 -1334 -504 1919 1038 -1232 -949 870 882 -774 -1643 -61 1045 -229
1393 -229 -1941 -847 1140 333 -2130 -824 1729 564 -1511 -568 1358 940 -441 -1029 647 1641
1409 1641 221 -1402 -42 2213 290 -1844 -52 1737 44 -1604 -403 787 548 -679 -1165
1424 -1165 -565 987 -339 -1723 -153 1801 -199 -2134 -425 1170 394 -1017 -371 768 1375 -275
1440 -275 -1300 373 2391 103 -1924 804 2558 -739 -2044 578 1804 -204 -1447 -594 711
1455 711 437 -954 -1241 974 1519 -1688 -2275 912 1463 -1334 -1009 1507 777 -583 -776 469 1167
1472 1167 1552 96 -1265 764 1751 -989 -1059 1666 1552 -1400 -935 283 -9 -85 -372 -760 492 903
1490 903 -1914 -2371 1414 2062 -1737 -1288 1639 372 -1827 -205 1323 1345 509 -558 -1061 824 1475
1507A475k767Q10L070j732l505J689K643j716o40J257n73p86P79j410M1K968k1
1524A582l595M49L113j675j881K492K098j870j120j32j94J717O88k145J60K727
1540B414j993l931L109L585k942k174K437J76k165KJ265N98J252j567k711J719
1556i26K756k347j455L956O03m337l31K822l48k20J121o58j155J237j050j895
1572b227K905K466l448j573K433j36k120R32J793m73q0l80k549J421K931j741
1588A54k040L277P41m583j6L858N5j581N24n4j119O45k77n99K892J283m462r32
1606b234L679k54k740J392K669j960j891P09n19N93K083j628j642K889r0l898
1622b842J118M164q54l010J088J081j200k93Q12J96J047K6k760l32L798q74l051
$$ plain form
1507 1475 -1292 -482 2588 856 -2649 -960 1683 -33 -673 584 11 -775 4 -1406 -1365 1603 1582
1524 1582 -2013 -1564 1549 -126 -2007 485 2583 713 -407 -539 -733 984 1672 -473 -313 2414
1540 2414 421 -3510 -401 3184 242 -1932 505 681 -1484 -1482 -217 381 1633 66 -2645 -926
1556 -926 1830 -517 -1972 1984 2587 -1750 -2081 741 393 173 1294 636 -519 718 -332 -2227
1572 -2227 678 3144 -304 -1877 556 420 -1700 -768 1025 552 472 92 -2457 -1036 1895 154
1588 154 -1886 1391 2132 -2451 -2467 1391 1446 -135 389 335 -784 -139 -416 -1015 1877 3160 -1302 -2234
1606 -2234 1445 1191 -1549 -157 2512 552 -1339 -630 -1149 -556 1527 -101 -1743 1146 1056 -2842
1622 -2842 -1724 2440 1586 -1424 -336 745 -455 -748 64 260 1307 1333 -1427 -1759 2039 1165 -1886
1639a886J961K518k830k304K356Q41o48J95oj012J045j15k087J621K909k076k501
1656b019J676J400k215L59J615j56n76K87j746N16K609n86k546J562K216l169
1672g73j557K492J698j744p30P56m75L48l17r48J665J512k279k260K600J746k553
1689h19l01K282r1j906J57L37N50J096n88j822J567R57k123j005K855O86k301
1706d69k64Q38l2K38m69n39J196O22j930j582K923P03k403j15K150J14k280K42
1724a057J620N30p43o95j24J730n45j928O91K250q02k314P80J828p58j389P83
1741a43P43r7q66p46O24Q04M7j560M41J523n66j229P91R61k46n26j42J11Q61l92
1761C93j139M71J309m02k041Q90J780p11j295OJ374j10j285j53J345P39j550r25
$$ plain form
1639 -1886 75 2593 -237 -2541 -185 656 8 203 197 -815 230 115 -1972 -351 2558 482 -2019
1656 -2019 -343 1057 -1158 -799 816 660 84 371 -1375 -859 1750 1164 -1382 180 2396 -773
1672 -773 -2330 162 1860 116 -614 142 -333 15 -302 -1250 415 1927 -352 -2612 -12 1734 -819
1689 -819 -1120 1162 1071 -835 -678 -341 209 1305 717 -1105 462 1419 -704 -1709 1146 1832 -469
1706 -469 -733 105 73 311 -158 -697 499 1121 -809 -2391 532 1235 -1168 -1283 867 981 -1299 -1057
1724 -1057 563 1093 350 -345 -469 1261 716 -1212 -521 1729 927 -1387 -607 1221 463 -926 -143
1741 -143 600 503 -363 -1109 -485 319 366 -1194 -753 770 204 -1025 -234 727 481 -45 -187 -76 785 393
1761 393 -746 -275 1034 632 -1409 -519 1261 550 -745 -739 635 525 -760 -913 432 1171 -379 -1304
1779a304J124J418j438j093J179J684j447j121M96J210k87j170J89J189L35j242
1795b78n44J217Q55j244q02Q65J012o77j123J75J632m92j525n2J218L84j243m98
1813a120J533Q87j651q51J149Q01p96r64P95J458j054j138Q08R62q3j329n8J536
1831H85J15j479j99J034O91j141o99O77O76l53j026L63R64k23j019J12J020J51
1849E49j023o00J088Q40r37r91J139Q46p13r53K11J277Q7j395k92J672L45j618
1867d68k95J305K72j005q55J031P80j100o42N11J515r69j576J102R61j86j425
1884a044L47J068k8q80k00R79R67j239q80N34J412n24j308M78J542q43j203L28
1902d94P47M85q76o03N33J366j523j115J371J079q39j412J181P43n94j048R97
$$ plain form
1779 -1304 -180 1238 -200 -1293 -114 1570 123 -998 -502 708 421 -749 -560 629 964 -278
1795 -278 -822 395 1250 6 -796 69 1081 404 -719 -544 1088 596 -929 -981 237 621 -622 -1120
1813 -1120 413 1300 -351 -1202 -53 748 -48 -1012 -217 1241 187 -951 -143 819 736 -593 -651 885
1831 885 1000 -479 -678 356 1047 -94 -793 -116 560 207 -819 -456 508 285 -734 -622 398 549
1849 549 -474 -1074 14 854 -83 -1074 65 911 198 -755 -544 733 820 -575 -867 805 1150 -468
1867 -468 -763 542 814 -191 -1046 -15 765 -335 -977 -466 1049 80 -1496 -394 567 381 -1044
1884 -1044 -697 371 343 -537 -737 242 1209 -30 -910 -376 1036 512 -796 -318 1224 381 -822 -494
1902 -494 253 738 -138 -741 -208 1158 -365 -1480 -109 970 131 -1281 -100 643 49 -999 -2
1919bN10j23p20k92J122P36j205o88J247M70j352n52J148M88n94j92l05L64J05
1938A65m82p50J062R51j462q80J678O47j273j87N74L61k51o28j97J490L26j457
1956c13o47K042M9k223p7K282K3j571K7O06K35l19q49J76J407j67j723q8K026
1975H96m38j706P93J286o76r02M66L51N06L73j289k78J349j4j676N64K226j238
1993E93j593N48R01k27k12M14l44N22m28j289K54K150o81j998J026J496j667q64
2011a399J515N84o25p1o05k57J387P7j318J033J526j820j680J509J284j200l2
2028i2P75k16m69q8q83M69J849o36k202J100J438j935p10K145Q66j757m34N21
2046b59N0N16Pr65J317Q42k069j418K472J181k097o6J410n10j111L56M05L24N13
$$ plain form
1919 -2 508 385 -335 -627 495 1231 26 -662 585 1055 -297 -849 299 787 193 1 -304 60 165
1938 165 -317 -1067 -5 946 -516 -1396 282 929 -344 -531 43 404 153 -475 -672 818 1144 -313
1956 -313 -960 1082 1131 -1092 -1169 1113 1136 -435 -408 198 433 114 -735 -559 848 681 -1042 -1130 896
1975 896 458 -1248 -455 831 155 -747 -281 70 576 949 -340 -618 731 717 -959 -395 1831 593
1993 593 -1000 -452 449 222 10 424 80 602 174 -1115 -861 1289 608 -1390 -364 1132 -535 -1399
2011 -1399 116 700 75 4 -601 -858 529 606 -712 321 1847 27 -1653 -144 1140 -60 -92
2028 -92 683 467 -2 -90 -973 -504 1345 709 -1493 -393 1045 -890 -1600 545 1411 -346 -780 -259
2046 -259 -209 307 314 -651 666 1508 -561 -1979 493 1674 -423 -489 921 411 -700 -344 61 385 898
2065H98p23j317J000Q15j513k11K177J30k454J65J384m48q3Q52q19k46R03j236
2083g26o58K345P00j868m95J741m69j758J202J104r4o45m16p27P57N20q16k47
2101e50K013r22k386O29J900n30o67Q73L2r50J62n5RJ367M64k206L8J683o86j111
2121h93J265J326j187o97P4k77L42Q83j157l57J482q16k066J178K343j000j657
2138a214J280L12j096Q8M35M11P17m46j854Q99J658j225j024K087N82j859p94
2155a043J355K32n05K65k18k23K44m56q67J502Q82j359o78Q46K50r98J65J222
2173F16j53k86K8p20J95J200n86j010J366N06j908m48J778L89p45l63L18m14J01
2192a36qm67J049L78j445n26J900m06j358P23R51l67j079K52N18J41L25o78j19
$$ plain form
2065 898 175 -1142 -142 673 -840 -1051 1126 1256 -1198 -1033 351 -97 -180 672 -147 -393 510 -726
2083 -726 -1384 961 1661 -207 -702 1039 570 -1188 14 1118 1024 379 -37 -764 -7 513 -303 -550
2101 -550 1463 541 -1845 -1216 684 154 -513 360 392 -558 -396 -451 -442 925 1389 -817 -779 904 218 -893
2121 -893 372 1698 511 -186 -112 -389 -47 836 -321 -678 804 -12 -2078 -900 1443 443 -1214
2138 -1214 66 378 -718 -630 -195 216 933 487 -1367 -468 1190 -35 -1059 1028 1610 -249 -1043
2155 -1043 312 544 39 304 86 -137 107 -349 -1216 286 1168 -191 -869 -23 227 -771 -606 616
2173 616 463 177 205 -515 -320 880 294 -716 650 1156 -752 -1200 578 967 222 -141 177 -237 -136
2192 -136 -144 -611 438 816 -629 -1155 745 339 -1019 -296 655 288 -791 -539 -21 120 445 -233 -352
2211c52P63K14j116l20J626Qj246p1J191l91m42K58L4K33K91j367j98J381p3j490
2231a067N81J200n62j390R13Q52j69o54J48J51M70o50n00P76Q53m81j393Q81Q94
2250H53n04p14K44R84q62l48N3L58L25l28n66M18P41j178j21K79O18k57o26L25
2270c06O77Lm58n41P77M95p32l81R36N60r45o89P42P49o40o14K87L90J52j001
2290e39q1O19L70o62n36J062J08p05m67P51K44l4m66O2P42O2r09j88J124%n01
2311E6o32Q84M84m68o62M76R41q01q56K70O39J24j126J92R24j2j218J81J104k54
2331B46o87kN89L42o23n48P08N93n09o49M25P76l04q82L90M27J29m41k22N76L59
2352F93q28l59M46J48k98m66M40M08l9o85K74M07J54m41k46M91N98o16p59P87
$$ plain form
2211 -352 411 625 -491 -811 815 823 -423 -494 697 306 -136 122 156 389 680 -687 -885 496 423 -1067
2231 -1067 -486 714 152 -1238 -325 527 358 -296 -148 3 473 -177 -677 99 952 471 -922 -41 853
2250 853 349 -365 -121 863 1 -347 -294 64 389 61 -505 -87 654 -524 -645 -366 252 -5 -631 -306
2270 -306 371 374 -84 -625 152 647 -85 -466 470 1030 85 -604 138 887 247 -367 -80 310 462 -539
2290 -539 -620 -1 369 -293 -829 233 341 -364 -831 -80 164 130 -336 -274 468 530 -379 -567 557 557 56
2311 56 -576 308 792 324 -338 138 1079 278 -578 -308 331 455 -671 -479 445 433 -785 -604 500 246
2331 246 -441 -443 146 488 -135 -683 25 618 109 -540 -115 661 357 -525 -135 292 421 -20 -242 334 693
2352 693 -135 -494 -48 100 -198 -664 -224 184 145 -540 -266 141 295 -146 -392 99 697 81 -678 109
2372A09O38n68o92L14R47kj255L02R24o0r99j30Q40P5n10p39J021J26m44n32N61
2393g4N10l79p36K78O25%m28k00Q87K72p04m95M09N51o50m27O89N01p26n42N32
2414a07N52K96j030n8P29N0j003L5J019P3p51l23N42K30n42k38P19J04j20m67
2434b90O0O06q6p31M39M20j68n99k24P29K98l88j77K22L17k91n32l24J075K81
2454F37r42l63Q52J86q51J02N31j85j55l93L61Q48j85p04l9R98l09j082M94J222
2474A023o46p02L77L65k62k59j48M79J96J80j405K75J055l65q05N58P19q08m47
2493f20K76L01J46J3o25L03R72n82j107J140P58o61j105P74N98n87j93M97m2l8
2513B18l72q12Q09N76n24m42Q57J60j190pJ151j82k38n3k46o9J22K26n33J054
$$ plain form
2372 109 747 179 -513 -199 748 746 -509 -207 717 657 -342 -472 368 443 -67 -806 215 341 -103 -635 -74
2393 -74 436 57 -679 -401 224 224 -204 -404 483 755 51 -444 -35 516 -134 -561 128 629 -97 -639 -107
2414 -107 445 741 -289 -347 382 432 -571 -536 483 556 -195 -518 24 254 -288 -526 193 297 177 -290
2434 -290 -230 376 290 -441 -2 418 250 -349 -573 156 454 66 -111 111 428 137 -395 -719 356 637
2454 637 -305 -668 184 370 -481 -379 152 -33 -188 -581 -220 628 443 -261 -300 698 389 -693 -199 1023
2474 1023 377 -325 52 417 155 -104 -252 227 423 603 -802 -527 528 163 -642 -84 635 -173 -620
2493 -620 -344 -43 103 116 -509 -206 766 184 -923 217 975 314 -791 -17 581 -6 -199 298 256 218
2513 218 -154 -966 -157 419 -105 -547 310 470 -720 -727 424 242 4 -49 -295 -364 -242 -16 -549 505
2533E05M09q73q25P83N69q54K72L29k19j34l74PK93R37m62r51Q87L62j409K6J301
2554E79R4j039J3J79J71j06N5j26N66L03j297j86J350lr97N19Q08q02q44P82M73
2575D92l06M89n41k63P5M61j315N36J377p14j002L15N99k60l34O76l51q5M06q62
2595f07K0J167L34j524L17R89p92p37R38O52m81n7l60m43O53J25p89P23O96o64
2615A60j323Q15P70o46j17O01J66q93M60l91K93O91Pr78J89O14q99l30J399L19
2635I07q83m6ml33N99K56m63K85L70p13j065J152P34q47m52Q24k35m76j97N46
2655d1J57K50k93q32O49P35r07k18J262m3j314K91O62Rk65L9k3r0J52l24m84Q32
2677B04M82j068o6P00j06q25N31K83J10m27K98n69N91K64q82J35Q89j23j196K13
$$ plain form
2533 505 914 41 -784 -1 568 -286 -14 315 96 -38 -412 -405 -112 825 363 -588 299 661 -748 -722 579
2554 579 673 -366 -353 -174 -3 -109 -54 -180 386 689 -608 -794 556 553 -444 75 883 81 -763 19 492
2575 492 186 675 134 -129 -54 407 -908 -372 1005 291 -711 -396 203 -57 -391 285 -66 -151 255 -607
2595 -607 -587 580 914 -610 -293 696 -96 -833 105 757 276 219 -141 -584 69 194 -595 128 824 160
2615 160 -1163 -348 422 -224 -341 260 426 -467 -7 -398 -105 586 593 -385 -196 418 -481 -811 588 907
2635 907 24 -22 -26 -359 240 496 33 318 688 -25 -1090 62 796 -51 -503 321 86 -390 -587 -41
2655 -41 116 366 73 -759 -110 625 -282 -500 762 719 -595 -304 358 367 102 141 118 28 180 -144 -628 204
2677 204 686 -382 -448 252 146 -679 -148 135 245 -182 116 -453 138 402 -480 -345 544 421 -775 -562
2697e62R18o2o16O62o3k84j46N8J04L25j8p88R8O26k85k19L31M19m71k10j80K21
2719a42J90K8m50L73O08n22p99N39N59r4p93K82P67m73k85P3K24K91m16l15N49
2740A94L20m36o28O36M55o99n40N83L43j60k40r5M11J05k37l77L96N61p83P8K04
2761I1L28m93l16J88N32r8n02K01K18L66k46o29N75J09o39k33L38M94n99j65J75
2782c05K55J60p22L25O71j64m28m5O36k26m20K70J64K25n30%L08L68l06o68L25
2803a07M34l52j77J17K81j46k12m66Q79o8l34j02L2O02j67n47K0N87j91m43N9
2824c01O82J76p30q9O67L48o32l31M60M23n34n84N11L82j70o36J89M94j09p84
2844e68J72O62k68k82k0K85J39l08J11L19o5j1n44K94P06l05m37K19M7K25k99
$$ plain form
2697 -562 356 294 -322 340 277 -7 -153 -95 9 334 316 -472 -374 252 -33 -252 79 498 27 -183 -363 -142
2719 -142 48 76 -374 -1 607 85 -714 -175 384 290 -503 -221 546 73 -212 -139 85 376 -40 -355 194
2740 194 514 78 -550 86 541 -158 -698 -115 228 68 -172 -267 144 249 12 -365 31 592 -191 -113 91
2761 91 419 -74 -390 -202 330 232 -270 -69 149 515 269 -360 215 324 -315 -548 -210 284 -315 -480 -305
2782 -305 -50 110 -612 -287 384 220 -208 -253 383 157 -263 7 171 396 -134 -134 174 542 236 -432 -107
2803 -107 327 -25 -202 -85 196 50 -162 -628 251 183 -151 -253 -221 381 214 -333 -313 274 83 -360 -301
2824 -301 381 557 -173 -262 405 753 121 -210 250 673 139 -445 66 448 278 -358 -169 325 216 -568
2844 -568 -396 266 -2 -284 -304 -19 120 -188 -77 242 177 166 -378 -84 622 317 -120 99 146 371 72
2865G2l11N87j25l75k61M76L76l02n10K0O37j52m71J64M60L1o47j10N49N6k95
2886a31j48M58R3K5o90L71M57q7m12Q3j36L74m34J55J04K37m59l90M69J06k28
2907a83o8L02j4n5j84k53O50R9n72J07J09L17l57k66L55M44l34m41N81J45j55
2928B27k74j00M60O3o58J31N35l63m28J84N26l19m37J35M17l7l32M5L5M15rn51
2950c35P8O13k64l42J77J77p0j32Q8Q4N34m50l00r8O31l33m13K64N02l81m12L29
2972e3L05J28l33m96K58K12j0m51O96M54q65m19O07O86p16j76M65j62l5l9p1J16
2994A01L31l67q05Q44K04m75k04N69L3k26j98J34K41n9k69op7N16l68p98J095
3015B16K95n75L2K50Qm33M03M1m7J08l04m48O41J64n38j09Q83j39o68K10J58j17
$$ plain form
2865 72 -239 348 223 -152 -413 63 439 137 -373 -353 284 132 -339 -175 285 316 -331 -441 108 164 -131
2886 -131 -279 179 272 297 -393 -22 435 348 -64 19 -117 257 -177 -22 82 319 -140 -530 -61 45 -183
2907 -183 -251 51 37 -18 -202 -455 195 294 -278 -171 -62 255 -102 -368 -13 431 97 -344 237 382 227
2928 227 -47 -147 313 376 -282 -151 384 21 -407 -223 303 -16 -453 -318 99 62 -270 -225 -190 225 216 -335
2950 -335 -257 356 92 -250 -73 104 34 -98 -10 74 608 158 -142 -240 391 58 -355 -91 411 30 -382 -53
2972 -53 252 380 47 -449 -191 21 11 -440 256 710 -155 -574 33 719 3 -173 292 130 95 56 -15 101
2994 101 432 65 -740 104 308 -167 -371 198 231 5 -193 -59 182 123 -146 -152 -229 287 -81 -879 216
3015 216 511 -64 -32 218 226 -207 196 237 190 298 -6 -454 187 351 -187 -296 587 448 -220 -10 148 31
3037C1l2K8p0k32J49J2l45Q34J19o72m62P06J44m67M29M63l58k63j12j17L50J77
3059C12m37p7M67M3p54N1P74k02l66j62M35k66J38j25K09K97j67p98l05J361m27
3080Am47O68L09q28k8M02n1K20J76o60K37K96l19o11N65N67j88j015Q23j7k87
3101a87P2P5J05K2l7o07K72P91n34l58N04L09q04j37O34L49l61L35l88j53L19
3122B21R2n61P01P0p93j07M55R4o62J84M15k37k19M67n41J33M03L2o25M48K40
3143B10l20n48J063j22k67j49O8M0J86k44J25J82K65o57m64P68M47o26O2M39n73
3164a15l51J94J51J53o1p7k3R8o4J7l54P93R4p09J03K77j22j07M40j48j0J0j79
3187A0l44O31j00n20J41N92l60n28L55M49o2l68k33L43K83l01m43K24O99k20o81
$$ plain form
3037 31 -1 27 -43 -275 -126 -114 -459 375 494 -178 -640 66 210 -257 172 635 277 14 -98 -215 135 312
3059 312 -125 -202 265 308 -446 -395 379 177 -189 -351 84 -182 -44 -169 40 337 170 -628 -933 428 1
3080 1 -446 222 531 -297 -325 77 26 246 422 -238 -1 295 -24 -635 -70 497 309 -706 117 100 -187
3101 -187 -115 -40 65 87 50 -557 -285 506 -28 -386 118 427 -377 -514 120 469 108 443 55 -98 221
3122 221 313 -248 453 523 -270 -377 78 172 -490 -306 109 -128 -347 120 -421 -288 115 147 -478 -30 210
3143 210 -110 -658 405 283 16 -133 -65 -25 161 -83 42 224 489 -168 -632 136 583 -43 19 458 -115
3164 -115 -466 -272 -121 32 -29 -106 -129 -31 -95 -78 -432 361 455 -254 -151 126 4 -103 337 189 179 189 10
3187 10 -334 297 197 -323 -182 410 50 -478 -123 326 264 -104 -337 6 289 -12 -455 -231 468 248 -433
3208d33O15K04o55k47P51K5m05QM8K89P7k44j06J88p1p6j97L80J50k77j45K0j6
3231a17K16N7l88O3L91J79r60N40K75l28m06R03k63k0n23J72K53L97l84j78K66
3252A45M4l24m23Q13kk73l70L21M27k90jJ2m4Kk92J7K33M58p48O0L61K23m45j34
3276b30L50K41o04K49QR3Q4l77n3P08k46l53J94J01J33o32J93L59P2k58m96L24
3298a40K91q9R5l96L36j94n5J86K60k19j50K8K14L13n93l3P8M52l43m16L10L01
3320B36L2m86rM80j00j28j29L22n3j11j59l8K71l4l06J82L33k09m70J11M42k9
3342A48k62J0Q2J13k16J80J71mp7l62M10N5m49Q9J22J73Kj91q6K65j48l47R2M48
3366B18j85j38o7K19M17l17M3k80L12k59j24K0K31j20o0J36L15M9k09l22J67n2
$$ plain form
3208 -433 182 386 -269 -516 235 260 -145 -137 -89 200 277 33 -73 115 44 -32 -229 151 301 24 -121 -101 -117
3231 -117 99 156 -232 -169 222 401 -559 -19 256 -72 -478 425 162 142 -381 -209 44 441 57 -121 145
3252 145 189 -135 -558 255 253 -20 -390 -69 358 68 67 79 35 37 -255 -238 -5 453 -295 -235 126 349 -96 -230
3276 -230 120 361 -243 6 14 107 191 -186 -239 469 223 -130 64 165 298 -334 -141 218 290 32 -464 -140
3298 -140 151 62 157 -239 97 -97 -152 34 294 75 -75 -47 167 480 -113 -146 -68 384 41 -375 -65 236
3320 236 268 -218 -227 253 153 25 -104 218 165 54 -105 -143 128 94 -212 -30 303 94 -376 -265 177 148
3342 148 -114 -104 -22 91 -125 55 226 222 145 -217 193 248 -201 -112 10 183 185 -6 -92 173 25 -322 -230 218
3366 218 33 -105 -172 47 464 147 190 -90 222 -37 -161 -141 90 -30 -90 46 361 410 201 -121 46 -6
3388fj52p2O7K06J5k60k54N47n3k33O3K40p2k71pL61n4J90l56K16j98J50J33m57
3412b57M38L5k59L3K96J8m00j17K73M6j11n2J12L55l41k25K0L72j93n16K35M50
3434B12p0l32K71o7K28p4n80N57J24j31k39p8N03n86j5Q9N21j88m88L93M3J35
3456B28l9l11k07N60j94l02n8N24j61l08K60J9K56k81m5o2Q5R2j95L27k8m32n1
3479c23M68K2n0n70N79j65%J9q3J10J13j10Jj62L25l13m63O26J27j27k41L35J95
3502C13k76j16K18o4L92o54M1K44K38k55m22N07J54k82k81J10%K07k26q5L44o8
3524C9k86j36N64j63k42n9L79j01m04M31J72L9k11J0k33L89j58j54L1K76j11l18
3546b46R8K69j76k47M24l65K56J73j38k16M03J08q33M21J93l80N0K21K92l18J00
$$ plain form
3388 -6 -158 -230 -163 43 58 -202 -456 91 38 -195 -132 108 36 -235 -242 119 65 255 -101 115 -83 67 200 -257
3412 -257 181 216 -43 -10 286 304 -96 -213 60 106 -5 -57 55 410 69 -156 -136 236 43 -473 -238 212
3434 212 142 -190 81 14 242 168 -412 145 269 138 -101 -179 324 -262 -277 -188 333 145 -343 50 93 228
3456 228 189 -122 -329 231 37 -265 -323 201 40 -268 -8 11 267 -14 -59 -121 -36 56 -139 188 160 -272 -323
3479 -323 145 167 117 -453 126 -39 -39 -20 -103 7 120 10 11 -151 174 -139 -602 24 151 24 -217 118 313
3502 313 37 -79 139 75 467 -187 -146 98 336 81 -341 166 320 38 -243 -133 -133 74 -152 -237 107 39
3524 39 -247 -383 181 18 -224 -283 96 -5 -409 22 194 233 22 32 -201 188 30 -124 -93 183 72 -246
3546 -246 -148 121 -55 -302 122 -243 13 186 48 -168 235 343 -490 -69 124 -256 -206 15 307 -11 89
3567H9r6o3K74j26j75J22M05l58l69L46J59q6k2q6m5j02R4K78o26L71J74n91M92
3590E9m8n5k15M29N0l74n4J3J05L71r4o2j10K31k99k80L98N14l45k49K79N1m45
3613a30J98O9R2k8m04J5mM98l43j38K98K56o73j11M33O5l83P05j91j88k26L06
3635A16m65L84L52n55k21O34J1l65N9O66m24m84K70j40QK35j72n7J22K45n70Q7
3657b64L38J78l66j14L99k5J4j07K20J59k64m38o2M74L53q55M96L26l88j19%R6
3679E1M7Q0l72J15j3J73m86J98L50J1l78r9M45l47K01J07N5N9J24l97pL56j82
3702I1j98M86R7m47l11J84J48J80k29l74M19o7j61N1J28J25k40J1J32o9J34k12
3724a22J74J7l6l2O8k4J79k56j6l2K78m34M85k42P2l57J07l5K95P7l11J27k14
$$ plain form
3567 89 -7 -70 204 78 -97 25 430 72 -297 49 208 122 100 14 -31 -133 -39 239 -387 -16 158 -433 59
3590 59 11 -44 -259 170 220 -154 -208 -195 -90 281 187 125 15 246 -53 -333 65 579 234 -15 264 315 -130
3613 -130 68 137 229 201 -203 -188 -192 306 -37 -175 123 379 -294 -405 28 93 -290 415 224 36 -190 116
3635 116 -349 35 387 -168 -389 245 256 -109 -50 616 192 -292 -22 -162 -154 81 -91 -148 -26 219 -351 -264
3657 -264 74 252 -114 -228 171 146 160 53 273 432 168 -270 -332 142 495 -360 136 462 74 -45 -45 51
3679 51 98 178 -194 -79 -92 81 -405 -207 143 154 -224 -323 122 -225 -24 83 138 197 321 -76 -83 273 91
3702 91 -107 379 476 29 -282 -98 50 230 1 -373 46 -21 -182 -131 -3 122 -118 -107 25 -44 90 -122
3724 -122 52 69 33 1 69 45 224 -32 -48 -80 198 -236 249 7 79 -278 -171 -206 89 166 -145 -18 -232
3747b32M28m23J67O8K07k65q6K83l1o4l2J52K0k19q9L2J76r4j21j65M94L8k31
3770A3j94J82J97j36L0j33K03m70K34J08J48p4j15k87K19J45Nj72J92J05m03J75
3792b8j58M83k43k64J93K83j42k22j99N48j32j46J6Q1n5M7j37J48J14k37j30J67
3814a3l2l3J05J4m8l6k8J33P9j31p0J15J5M21m53k16L58j71j99j6L02j87L3K16
3838A58k62K63q8j90K4R2j04L44j66k9J7j83K5M5J37j61k05L01J3j35M25n69J69
3861g9K44k93L54j33J50m54r0L47qNk52J70K13k16o1P1J67J9k6j69j32J72j80
3884a81N8K9Q8n4J2J21J17J78m78J07J17oo7k56M32j78m2p0J68J46l29N9L5j45
3908a39%j43K88j53K65l04J05J16m6q5L0L44Qj59l2l07K85k10j65J93J11r1KP6
$$ plain form
3747 -232 196 -227 -60 8 215 -50 -136 147 116 52 20 172 192 -27 -116 -84 92 -2 -123 -288 206 244 13
3770 13 -181 1 198 62 92 -41 162 -308 -74 34 182 108 -7 -294 -75 70 75 -97 95 200 -203 -28
3792 -28 -186 297 54 -210 -17 266 124 -98 -297 251 119 -27 -11 70 15 62 -75 73 187 -50 -180 -13
3814 -13 -45 -78 27 41 -7 -43 -71 62 141 10 -60 55 70 491 38 -178 180 9 -190 -206 96 -91 -58 158
3838 158 -104 159 71 -119 -95 -3 -107 237 71 42 59 -124 -99 -54 83 -78 -283 18 31 -104 321 -248 -79
3861 -79 165 -128 226 93 243 -211 -301 46 38 43 -209 -39 174 -42 -103 -32 135 154 128 -41 -173 -1 -181
3884 -181 -123 -94 -6 -60 -48 73 190 368 -110 -3 114 108 41 -215 217 39 -3 -73 95 241 -88 -29 6 -139
3908 -139 -139 -282 6 -147 118 -186 -81 35 -11 -96 -66 278 286 127 95 -212 73 -137 -302 -109 2 -89 -87 -11
3932a1L14km20k8RM61j78k46j63J14L03o77L71K16J48m97J04K13p3j61M14k39
3954b8j22K10J15j26J35k60p6L49k86M9J60L1j01O4k79m16L65K5R1J57o1O1l65
3977c08L4J34K49l15K45Q4m3J26m43j48N59j22k84K05J6N06p07J93j40L20l20
3998a59K63l01K99p7q1k62K42K81k63k9R5J22N7k49K13l34N7J89j18K09J19j50
4020A23k85N9J68j01q8J80L5j55J34M5k35J40q4Q0n1L10m34M3J64J89n63O9L07
4043E0n9l75J96J58k21L86J2k25J43o4k56J90R7l9L4r0J73l59J76N3K23k18M6
4066C1j25N9J43j44k58L81J71k83k80L07J62k33K02j79o2K48j89p2M8M63m37k85
4088c32N21J99l06l28P94o83J22%k7l80P05j88k01K62m4k60k7M11m3n93L21J88
$$ plain form
3932 -11 303 301 -119 -147 -138 323 145 -101 -264 -150 153 -524 -153 63 211 -286 -182 31 -42 -203 211 -28
3954 -28 -150 60 175 49 184 -76 -152 197 -89 -40 120 151 50 114 -165 -581 -216 -191 -100 57 -4 57 -308
3977 -308 -274 -140 109 -206 39 123 80 206 -237 -385 174 52 -232 -27 -11 495 -212 -19 -159 161 -159
3998 -159 104 -197 102 25 -56 -318 -76 205 -58 -87 8 130 187 -62 151 -183 -126 63 -55 154 273 123
4020 123 -162 -103 65 -36 -124 56 91 -64 70 115 -120 20 -64 16 -35 275 -159 -116 48 237 -326 -257 50
4043 50 -9 -384 -188 -30 -251 135 147 -78 65 1 -255 -65 32 -7 27 -63 110 -249 -73 -20 203 -15 31
4066 31 -94 -35 108 -36 -294 87 258 -25 -305 2 164 -69 133 -46 -108 140 -49 -121 -73 390 -47 -332
4088 -332 189 388 82 -246 548 -135 -13 -13 -40 -420 285 97 -104 158 114 -146 -173 238 195 -398 -77 111
4110A11k23J06M6n8lJ25j07l46M03J38k52L6j1N3q9K52k25J95J19k98j90K40M4
4133F6m3j49L65j0q29M99L87l47l18M67j68j17K40l44L14Q6J86o09L15J69J18
4154B78o18L22K20j26j39P4j70j2M63m43mL40P0m04N8J15j66P1P1r2n7K75j60
4177c4K47k33J60j57j99N28l20o2j45L47j96m3J95j61q5J96J53k04K27k32n5N6
4199a7J18Q0l93J79Oq1R4J33J0OJ85l80O9J47k82R1J15J47j06m54N83j35K31n00
4223a54K13p2M8j84L8L28k39r3K2J40q0M5q5J88k29kqJ57J70j65J13j55m2K76
4247B30k25j6P5J80l32k8J37j9L7N5M6k42J70N2p3M7J23k27k54K10k77L76k42
4270a97K47j22J3J66k66J33J13j46R1M9Nl7k77L03j7n5J57k41K01J40k29j52J30
$$ plain form
4110 111 -112 -6 40 -18 -21 104 -3 -349 54 192 -60 -24 -35 18 -71 181 -44 151 270 -28 -218 22 66
4133 66 23 -126 239 229 -600 -101 286 -61 -379 88 -80 -197 43 -301 13 99 285 -324 -9 160 278
4154 278 -340 -18 202 76 -63 11 -159 -171 292 -151 -155 185 255 -149 -91 24 -142 -71 0 -92 -149 126 -34
4177 -34 213 -20 140 -17 -216 312 -8 -70 -215 132 -64 -107 88 -73 -158 38 191 -13 214 -18 -73 -17
4199 -17 101 181 -212 -33 -27 -108 -14 119 129 135 320 -60 9 156 -126 -35 80 227 121 -333 250 115 346 -154
4223 -154 59 -13 35 -149 -111 217 -22 -115 -93 47 -33 12 -73 115 -114 -116 -124 33 203 38 151 -4 -46 230
4247 230 5 -11 64 244 -88 -116 21 2 39 94 140 -102 68 120 47 94 217 -10 -264 -54 -331 45 -197
4270 -197 50 -72 -59 107 -159 -26 87 -59 32 81 86 49 -228 75 58 3 160 -81 120 260 31 -121 9
4293IM1m02J45K51p0J64k29J63j58J18p5J50J0k17J54n9j14M9J64O3j11K9j11
4316c6j15K63r6o6l25N68j71j3j6J3q6j87J98J48M3k83p9K89K62j73l51L15l07
4339b05N66o36L32j61J26K25l59J04J59j14m7j95L02k24K2R5J75j36j11R0j50
4360a42R2K7k20L95m2j47j66K35J91n35M17k70M16j86o6j13K19j65j9N4R1k2M6
4383I0K16l72L22j17k54R4K78k51p3p7L61l54K20l23N38o31K29Q1j19Q3J88k05
4405g6q6K25m3j80M7J90N9j4k9M9j17k01l1K17n9N6K37J8k78J5K00l82J60o8p9
4430a70K17M8J09Pj62j94J18J32J4l8k9J33k09j51K38k79J49L46m48J68K37k54
4452a8J53pP3j57p6q3J30k65J56K28j50jo2R3j59J78k57N9L42m9l0Q9j37qj32
$$ plain form
4293 9 50 -352 -207 44 -26 138 -91 72 -86 32 -43 107 117 -100 54 -5 -119 -70 94 157 46 75 -36
4316 -36 -151 112 16 -50 -375 193 22 9 -7 6 -80 -267 -69 79 122 -161 -240 49 311 138 -213 102 -205
4339 -205 361 -275 57 -104 22 247 -112 -8 151 37 -10 -205 97 -127 -105 -10 165 29 -82 8 -142
4360 -142 -50 -23 -243 152 110 -37 -203 32 223 -312 105 -165 251 65 -1 -114 105 -60 -79 -25 66 44 90
4383 90 306 -66 256 139 -115 -21 257 6 -67 -144 217 -137 83 -240 298 -333 -104 -23 -142 -59 129 -76
4405 -76 -162 63 20 -160 -113 77 136 122 93 142 25 -176 -207 10 -49 7 244 262 -16 -1 199 -183 -23 -91 -170
4430 -170 47 95 204 211 49 -145 -27 105 119 81 52 185 -24 -175 63 -216 -67 279 -169 -1 236 -18
4452 -18 135 128 201 44 -32 -115 15 -250 -94 134 -16 -17 -79 14 -145 33 -224 -165 177 128 98 187 50 42 -90
4477i0J60r7J75l23J92k9K90l27j44L64j07J6n9n3J65k29J58J76k29j43L36l29
4499a27K82J34m84J04J80j6k47L89r0jj7k2q6J28n5q4k18J89K89k00p4J42j03
4522A3L5J47l47ok1J61l4j39O6l7N5LN1j16K08R9j55k45L48m4o6J48j38j92J91
4547a5k2k87J00k3K41l9J7M6l05K13J64k50K49k03JJ91L06n31j8K50J98m2m76
4570b35P8J12Q7j28Q5j27J28p5N9N5M6pl96K56l3k7JK69r0j10j16P7L3n7J70l7
4596A8K64j74k09K3j5p4k6J70K04r1k52M76l41j7J79j30O5q4J7q3m1J87J41l91
4620a84O2O0J72l42J24Q4Q0Q7k24P9L6K6j24K40K86k64m24K74k1rJ59j21j09J04
4644E1j00p6k5M97k36k98L01k7j38L06q5k12k18L40j09l59Q95k07n06J02M19n07
$$ plain form
4477 -90 70 -27 148 -175 17 -12 278 -49 -193 171 64 80 21 -32 133 -96 62 238 9 -134 202 -127
4499 -127 155 289 -195 -91 89 73 -174 215 125 124 107 85 -1 127 72 -12 -230 -41 248 48 -26 116 13
4522 13 48 195 -152 -158 -179 -18 -52 -191 -125 -162 -107 -104 -53 -169 39 138 -17 -262 86 42 -24 124 -14 -206 -15
4547 -15 -37 -324 -224 -247 -6 -45 -28 18 -287 -74 90 -160 89 -114 -113 78 384 -147 -165 85 283 241 -235
4570 -235 -157 -45 42 -86 -1 -128 0 -75 -16 39 85 78 -318 -62 -95 -122 -121 148 58 -52 -168 -91 -58 -115 55 18
4596 18 282 108 -101 -78 -93 -167 -193 -23 181 90 -162 314 -27 -44 135 5 70 -14 3 -80 -121 66 207 -184
4620 -184 -122 -62 110 -232 -108 -24 56 143 -81 -2 34 60 -64 176 462 198 -226 48 27 18 177 56 -53 51
4644 51 -49 -125 -150 347 111 -187 114 87 -51 255 170 -42 -260 80 -29 -388 507 300 -206 -104 315 -192
4666a92o5L57p0k05K17Jj57P1J3j1n1L22k55k10K20M9M4k91M90l00J69k78k24
4689c56N38k07o0M9J42J71m00k24O4L22j34j05L45j00J71k3k30J19p7K20m67L41
4711I9K89m65J55k84L46j2l04L75l07J07J02k03K63Rj48j68J24J32J07j54o9L1
4733B5J77j25o4o3M0j81J48o1J16o0R2J0j4N7k66K6J42m4J88j82K17k06k5J36
4757H3r2R3r4j56M3J94n9M12k85k07o2J38p9J12j45N2j08R4J03P3J5o8j67K1K59
4782A70j40J09q2J05m46K43K3j79J4M9M34m58RL8J55j91Rk79L55P6j04p6J56Q2
4806G2k19J16J9j2j20J08O9j18l1m4L5J27N1j46J03P8J60j68J7qj95J98n3j29
4830i0j20K23M3N1M3J87m05J91j98J92m07K53J8j22k05O9L07K07l76N2J77J09
$$ plain form
4666 -192 -257 100 30 -175 42 43 -114 -43 -30 -41 -92 230 -25 -235 -15 34 78 -213 277 -23 146 -132 -356
4689 -356 182 -25 -85 -36 106 277 -123 -347 -283 39 -95 -200 145 45 216 193 -37 82 5 225 -242 99
4711 99 388 -77 78 -206 140 128 -176 199 -108 -1 101 -102 161 170 22 -146 -22 110 217 63 -6 25
4733 25 202 77 13 -50 -10 -191 -43 -104 12 -48 44 54 40 97 -169 -143 -1 -45 143 -39 178 -28 -53 83
4757 83 -9 84 -10 -166 -123 71 12 424 139 -68 -130 8 -71 41 -104 -52 -160 -66 37 110 125 57 -110 -89 170
4782 170 30 139 57 162 -284 -41 -18 -197 -183 -134 300 -158 -149 -111 44 -147 -138 -417 -62 14 -90 -166 -10 72
4806 72 -147 -31 -12 -24 -144 -36 33 -85 -116 -160 -125 2 53 -93 10 88 248 80 97 89 -106 92 39 -90
4830 -90 -210 13 56 107 150 337 -68 123 -75 117 -290 -37 -19 -141 -346 -277 30 237 -139 -87 90 199
4852A99j67J92k42k2J65K0O9l78J68l7L66k88k30j25K32J73J19m06K0K74j12K89
4874B79m57K76j62j47J58O0k35R6M2J00O7j59K77j63k1o9O0k39L32m4l6k8o2J55
4898H0p0lJ02J5j16q6r3K58n1R3k41L46j22r3m3J32J03pl17J07m0K57K0k43p7
4923h9j3J61j33l4J72o4j26k5J64Q8K1j04J43j75L5J39k11P1M7O0krk37L49k13
4948A5j53K8Q2K3m3J51Q1k09q4K5J35k03Q2J66L6P7j69j18J6J30j96J31l62L63
4972Dl17L29j09m7K26j80M5j12K54k46J41J58L7qj10m09M03qJ8r2k94M80l25l0
4996a92J35J02mj49J98k56L82m38J88j37M62k17K9m6j39Mj63K23J20N7j96k26
5018b63L9M75k05J56m11L00l60K59J40j88N7k1m2k03K47J20l0l27J48K7r6L78
$$ plain form
4852 199 32 224 -18 -40 125 145 214 -164 4 -33 333 45 -185 -310 -78 95 214 -192 -172 102 -10 279
4874 279 -178 98 -64 -211 -53 7 -228 -132 -90 10 77 -82 195 32 11 -58 2 -237 95 51 15 -13 -75 80
4898 80 10 7 109 124 8 -78 -171 87 36 129 -112 234 112 19 -24 108 211 204 -113 -6 -46 211 231 -12 -89
4923 -89 -102 59 -74 -108 64 0 -126 -151 13 101 122 18 161 -14 21 160 -51 20 67 127 125 116 -121 228 15
4948 15 -138 -110 -28 -5 -48 103 184 -25 -109 -84 51 -152 -70 96 132 209 40 -78 -62 68 -128 3 -359 4
4972 4 -313 16 -93 -140 86 -94 -49 -161 93 -153 -12 146 183 175 65 -344 59 51 69 -23 -317 163 -162 -192
4996 -192 -57 45 41 -108 90 -166 216 -222 -34 -171 291 74 103 57 -82 -78 -241 -18 102 159 -37 -263
5018 -263 -224 251 46 202 -209 91 -269 -10 130 -58 -1 -22 -64 -267 -20 100 70 -257 -109 -82 -178 200
5040B00j32ok42j2P4K48m2k8Q7j04j44Q4K66n76J40K73K74k99j00K07k55l2K21
5063A02J41k81J27M2j54j9O6P2j50K00j69RP1m2k36J10N9L7j3K1j67J80N0j01
5087d5J48Q2J02k07l20L60P0l37K76M2J6l85J65P0RQ5L7j77M5r2J64L8r8J07j67
5112a2O5o1k9r5J33k39M7K73R8p0lj65j10L00M0l74L83K35k78O7K59l95l4J33
5136A68j39mo4J10l52K5L07J03n40O74j90P0m14L14K1j44J46J05k38L33m37K52
5158A06L6Jjk99N09m81K42j53K46m07R5j49K27nL86k38j99L4J88j94K9J00M2J8
5182A33k84N2J63l5q7K99m88M05k21k5K22l48L04j59j43j04L31q7J7J08N7Rl44
5205b25L4M93k64n0J32m7L1j69L9J20l47L60k08n2L73l58M6K23R2j88j44K69k60
$$ plain form
5040 200 68 62 -180 -192 -118 130 88 60 147 43 -101 -17 249 -327 -187 86 360 61 -39 168 -87 -119 102
5063 102 243 -38 89 131 -23 -42 24 96 -54 146 -23 -14 57 15 -221 -111 -52 -15 -28 -7 -174 6 56 -45
5087 -45 103 185 287 80 -240 120 190 -147 129 171 187 -198 -33 37 46 131 168 -9 36 -56 108 146 48 155 -12
5112 -12 53 -8 -37 -132 1 -238 -191 82 180 110 107 -58 -168 132 172 -202 181 416 138 205 464 69 35 168
5136 168 29 25 -39 71 -281 -256 51 154 -386 288 98 168 -246 68 89 -55 91 196 -42 291 -146 106
5158 106 142 143 142 -157 352 -129 113 -40 206 -201 -106 -255 -28 -33 353 115 -84 -50 138 -56 -27 73 115 133
5182 133 -151 -99 64 29 -58 241 -247 158 -63 -88 134 -214 90 -69 -212 -316 15 -72 -55 53 110 119 -225
5205 -225 -191 302 38 -12 120 73 104 -65 -26 94 -253 107 -101 -153 220 -138 -92 131 223 35 -109 160 -100
5228a00R6j31J57k19L55k81p6M37k51r6J23J07p1j06j03K70r1qJ87j35l36L32
5250F0K8n5J60r4l06M36k31l6J23l21L06j48J17r6J53j18K21k04j48K55j60j68
5272b26L91k5J16m71K31K65k95j16N9J87j86K22J19j84P4j61n2K9J4J96m1J23
5294B69l02J17j15J64n1j49K05J30k94M14k23j4K1J39r7k87K3J80j9j16%j16Q5
5317c6m5N9J11Q4k23P0j90L63n25L50J29r4P1n05L32K35j68J90k57o3R5J09j13
5340b1J09j72J90K42l00p2J4K99j45r9J51j55j47J61j42j94L47J13o9j19n6N8
5362gO5j8k00K31m4J11q5j2q2L2m4J30Q5R9k78j19K03M5j81j26K19j61J79Q4l75
5387b49K20k01J06L0k1K48m67K82P7J00J52k84L8k39L58l24OR4J76j6oJ3j23K30
$$ plain form
5228 -100 -4 -135 22 -197 158 -123 -199 238 -13 -109 14 121 50 -56 -159 111 20 12 199 64 -272 60
5250 60 88 33 193 99 -207 229 -2 -38 85 -236 70 -78 39 -57 96 -22 199 -5 -153 102 -58 -226
5272 -226 165 140 256 -215 16 281 -14 -130 -71 116 -70 152 271 87 161 0 -52 -23 -9 187 146 269
5294 269 -33 84 -31 133 82 -67 138 268 -26 388 165 151 172 311 214 -73 -50 130 111 -5 -5 -121 -36
5317 -36 -81 -22 89 173 -50 20 -170 193 -332 18 147 53 124 -381 -49 186 18 208 -49 -112 -17 92 -21
5340 -21 88 -84 106 348 48 -24 -10 289 144 45 196 41 -106 55 -87 -281 66 179 110 -9 -65 -7
5362 -7 58 40 -160 71 27 138 53 41 -41 -9 -53 77 162 261 -17 -136 67 112 -69 -195 24 -137 42 126 -249
5387 -249 -29 -230 -124 -94 -115 133 -334 -52 25 125 277 -7 31 -208 150 -174 -168 -74 102 86 80 93 -30 200
5411B00k8k49r0L23j51j33J94m34K43J10Q5J2Nj44o5Q7n8m1k7L33l22k3R1N7j9
5436d4j39J42l4jK01k11j37K68J88l36J9K03k63J43L7J24Q8k88K76j69n1k33J86
5459c1P1k27J14K53k18N2j05j32L41J88l76l0J74r5M6r8M17j58q6m72M49j11p4
5482a08L08O4k43q6J95j35J45K48k49j85K55J00q7o07lK15J31L1j14K9N0k3KJ06
5506C9k92K56J66j94M21l42j41Q2J72k24j47L21J48j61p9J85j22k30J95j57J55
5527E1nj50J20j79K05r6mK51k17l17N77l97L84j59J74j08j54J88k48%J22L8l5
5550D1oK8k40R0k89L48P6l41m9L72LK87k43k58L78j39m14M02j45j3L62k41J2q7
5574f6J19j06l6K7J91m9j98MJ22J10j00P4l3j34K80j80k77M20k84j14K64q7M9
$$ plain form
5411 200 172 -77 -167 156 5 -128 66 -368 -125 -15 70 82 87 -57 -122 -35 -93 -134 -161 172 -150 -173 -82 -25 -44
5436 -44 -183 -41 -75 -76 125 -86 -223 45 233 -103 -84 119 -144 -1 36 160 248 -40 236 67 16 -217 -31
5459 -31 40 -187 -73 180 -38 14 -91 -223 118 306 -70 -100 74 -21 25 -73 344 186 100 -372 77 -34 -108
5482 -108 200 264 21 -65 130 -5 140 388 139 -46 209 309 222 -385 -388 -173 -42 -11 -125 -96 -46 -69 -67 39
5506 39 -253 3 169 -25 396 54 -87 -5 167 -57 -204 117 265 104 25 210 88 -142 53 -104 51
5527 51 46 -104 16 -163 42 -54 -58 193 -24 -341 236 -161 223 64 238 130 -24 164 -84 -84 38 76 41
5550 41 35 63 -177 -87 -376 -28 48 -293 -342 30 33 320 77 -181 197 58 -356 46 -99 -112 250 9 21 -66
5574 -66 53 -53 -89 -62 129 80 -118 -114 8 118 18 92 59 -75 205 25 -252 168 -116 -230 34 -53 -4
5597dj51J01R0l2kJ49j71l9r3J4J58J02k32m2j7M9O3P1J37j41r9K26k11Q7R6l10
5623b01J81J88j25J27q3N3k7k69J6l5J16K88P4m4j05k77J72P0j54J51r9j40K16
5646I3j08j19L73k62J26R0k22j46K29p5J16m2L6q5m5K81k68l5J24L6k24K0K45
5669A38j63n7K48p9J22l41L05j25j31m7J88k7K3l0J06p6q6J53N3M5rk19K15k3
5693A83p7k80L38l54K08K5L0P8k9j13L0l5L38k43k97K92j29rK1k6J93NN1k36j58
5718a94J00K93k05j3P5j00J1N6N6Qk6J41j10j51K7n2L27j32l75K93Q0j82K21r2
5742E6j11L17n01K28j22JJ02j06K50p6j2k85K96m5l0n0M4j1J32j66J30L4qj51
5766h4l9K95k26k29K22k6q0M28j37k55n8J07q1K53l92L41Lj3nj82O4j06M42n6
$$ plain form
5597 -4 -155 -54 36 4 2 151 -20 -59 -152 -138 20 122 -110 -152 -169 -120 -57 14 151 10 -89 137 -74 13 109 -201
5623 -201 -20 168 43 170 87 140 113 -156 -140 -175 -59 229 303 259 154 -123 49 119 -35 116 17 -123 93
5646 93 -15 -134 239 -23 103 193 -29 -175 54 -21 95 53 89 4 -41 240 -28 -63 61 97 -127 -107 138
5669 138 -25 -82 166 87 209 -132 173 48 -83 -130 58 31 54 24 130 54 -32 121 174 219 210 -9 206 183
5693 183 106 -174 164 -190 18 43 73 151 122 9 39 4 342 99 -198 94 -35 -44 -23 -49 144 149 200 -36 -194
5718 -194 -94 199 -6 -19 56 -44 -33 23 79 87 61 202 92 -59 -32 -84 243 111 -264 29 109 -73 148 56
5742 56 -55 262 -239 -11 -133 -132 -30 -136 114 38 26 -259 37 -8 -38 -88 -44 -55 77 -89 41 75 67 -84
5766 -84 -123 172 -54 -283 -61 -87 -167 261 124 -131 -189 -82 -163 90 -302 39 42 29 24 -158 -94 -200 242 186
5790A86k77p6L22m0j14J46j41j13J59P3j53J18k28j22N96o21L14j02j25N77k09
5811A70o0o3P6j10K59k29J66m64J84R1j68K92j58j55J55p1J91j78K26j98n8K60
5833A58J30L2l41J6M3Q5l42O1M0J26j64L87j61k39o8K10m6q3J93K52l41O6m2j9
5857d7j9J49l8j2J10j87J27O8n0m9K38k79j04K60k65p2j22L98K0j28m7j20O6K07
5881A04M3k22K11l69L72M4j23l31J79Jq8j3K04o1J7k82L54o9J17k69l2j0J25J10
5905A2K5O0l17L09l2J31l17J01k8k8J8K0J09n8l00K73Q4j93o0J13J54j09J79J14
5929B60m52Q2J32N2J4k17J65k4k09J54J36j21J1Q0J8q1k0k14K01J82k01K39o5
5952A22k16m3L75j89M2j46p0J71p4j89L31J86k61l6l7M3Qq2J85k18R0J71j37j38
$$ plain form
5790 186 -91 -167 155 115 1 147 6 -107 52 125 -28 90 -138 -260 336 -285 29 -73 -198 379 170
5811 170 110 47 123 13 272 43 209 -255 -71 20 -148 144 -14 -169 -14 -85 106 -72 154 -44 -102 158
5833 158 288 320 -21 -5 38 123 -219 -158 -118 8 -156 231 70 -169 -237 -27 -73 -156 37 289 -52 14 -28 -47
5857 -47 -66 83 45 33 143 -44 83 151 101 52 290 11 -93 167 -98 -170 -292 106 126 -2 -49 -169 -103 104
5881 104 147 -75 136 -233 139 183 60 -271 -92 -91 -179 -192 12 -49 -32 -314 40 -29 88 -181 -213 -223 -98 12
5905 12 37 97 -220 89 57 188 -129 -28 -56 -84 -66 -46 63 5 -295 -22 62 -131 -191 -78 76 -33 146 260
5929 260 -192 -110 22 74 88 -129 36 12 -197 -43 93 -28 -17 63 81 0 -20 -234 -33 149 -52 187 122
5952 122 -94 -137 238 49 91 -55 -125 46 -28 -217 114 300 39 3 -34 9 17 -65 120 -98 -8 163 26 -112
5976a12q2J40K19k17K40m16K74k7j71J90n3j82K64p0j71L35jj43O5j27M6K1J6
5999C8L8l24N23j93j78M4K4r1K34lj29p5j69L43j6K1J7q8l26K03O4j56J34J05
6023D0m0q3J4J14o5J06L9l34L03K2J72l61J85n9m8q5K65k45J50Q5j24J18j67P5
6047G7m0p6K2J52o8k0j61j85J48J54j27K67j64J13k0Qj97K1J69L33k89k65j25
6070b73K46k43K83R2L6l65K75k33K45j64J72O8k60K92j63j60M3J29K16l26K38
6091A48k32J23n7R1j24J15j15j86M01O5l27L85n5m65L68J1j61r2J03K9O5j00J1
6114Anj80L20l07Q9K51j97L5j56r6L95k05k9P1J9L22k28Rn5J49k45P5J60j07m29
6139c43M76J48j23l47J72Q7j45j20J69N7n6M4j90J21K51j32R6j46j20j31J83j93
$$ plain form
5976 -112 -194 -54 165 -52 188 -228 46 19 -152 38 -15 -197 67 -3 -174 161 160 17 82 -45 1 22 38
5999 38 76 -248 275 82 -96 -52 -28 -119 115 112 -17 -92 -261 82 66 87 104 16 -310 -107 -43 -199 -65 40
6023 40 0 -83 -69 45 -20 86 125 -209 94 116 288 -73 112 53 5 -80 185 -60 90 175 51 169 2 77
6047 77 37 -39 -17 135 67 47 -114 -299 -151 3 -124 143 -21 92 72 80 -117 -96 73 406 117 -148 -273
6070 -273 -27 -270 13 105 141 -224 51 -182 63 -101 71 139 -121 171 8 -152 -109 20 236 -90 148
6091 148 -84 39 -18 73 -51 64 -51 -237 164 229 -98 287 232 -233 135 146 -15 -107 -4 25 90 -10 1
6114 1 -4 -184 136 -171 -82 169 -28 7 -149 -245 150 -55 -84 -13 6 328 100 109 54 203 -42 33 193 86 -343
6139 -343 133 281 158 -189 -17 70 -75 -195 -26 31 -25 19 -171 -50 201 69 165 19 -101 -232 -49 -242
6161b42M29m2j23N5k20L48j05k71J81J33k91K04k4o4J78k73n2J07J48k42J84r1
6183g3N5j87L86K9j10J38k48r0J87R7m72M64j77p8O8p1L04k20m6j47L82P7k37
6206C1j81K36j10N2j13L7K6m0k34K55rJ54k39J70Q0j35o3J61N7p4OK5l56K62K15
6231B13l90M15l88J01k23K15L6j09R0n4p4M2R4j54K09J11k83ml2L75j12o5p8K36
6255A71l36J16p0Q7O5j03j51NK77j20q3j03M38n8J94m29M8J48j81K33Q7j78j28
6278g1o9K0j29L53Kk2L6j36r6P1N6k6j42J15J08J57l95K49k59K17nK62k50j61
6302a15j83N77j43j88Ro9j96K69k80J60K08j16L6J71P1l36K45j86J03R1J13k5
6324B16o4j37MJ88k59M2J75L1j42j60R4L5r3j15J24q0R9r3J80j22p2K18k36P7
$$ plain form
6161 -242 187 145 22 77 -143 205 100 -171 10 143 -148 56 32 -32 146 -127 -179 -72 76 -166 18 -73
6183 -73 -18 -205 181 210 100 238 -10 -100 87 184 -288 176 -1 -79 -11 -82 222 2 -44 -191 191 268 31
6206 31 -150 86 -24 28 -85 -48 -22 -62 -296 -41 -50 104 -135 35 115 -20 -83 78 135 61 67 92 -264 -2 213
6231 213 -177 238 -150 -49 -272 -57 -21 -130 -40 -94 -168 -126 -32 -186 23 134 -149 -153 -185 190 78 13 -65 171
6255 171 -165 -49 -119 -32 33 -70 -221 -216 61 -59 -142 -245 193 135 329 -100 -52 96 -85 148 235 57 -71
6278 -71 -140 -120 -249 104 106 84 120 -16 -112 -41 15 -11 -153 -38 70 227 -168 81 -178 39 34 296 46 -115
6302 -115 -298 279 136 -52 -43 -112 -308 -39 -319 -159 49 -67 -31 140 211 -125 120 -66 37 128 241 216
6324 216 152 15 19 207 -52 -10 165 196 54 -106 -12 23 -70 -185 -61 -141 -42 -135 45 -77 -149 69 -167 -90
6348i0M7l9L36l42J70K6O1j16k1n4j39K03K93k03k83JN3R8Rl49L37J75k36K4j91
6373b30Q2K01j62j95M06P4j16l47K28k9j44K12M4j05m2O0K9RM8o7j29j53L37J66
6397A77n2m3j77K2p5Q8P8m3j7M0Oj27J52J73j15K62k62N7j87K53k24J06q3k20
6421b11J65j39K03k69K16k14K92J79j82p1K22l33K83k36J68j24J75J1ok47L38
6442B20k57o8J46q9j00q8L57k47J11k15K29j8p2K0L9J10L4k32J08n9K04m5j90
6465a02j74K15L72k96L0k97K41M1j30J64j71J88J7r2m7pJ68j77J56j12j11J53
6487B9J57n20N74j71J2k02K33j25P2K9j93j2J61j5J02j41m8N6J68J72m97K09K
6510E2o4LK89K04l39l14j10L31j66pj42J98j73L38q8k42J21J16J01l54J22R9J10
$$ plain form
6348 -90 -43 -82 254 -88 82 108 169 53 32 -22 -161 42 335 132 -151 -150 -97 1 10 -339 -2 173 -63 -39 -230
6373 -230 -148 53 -109 -304 102 176 60 -287 -59 -88 -232 -20 24 -81 -123 -63 -34 -25 23 -44 -173 -326 11 177
6397 177 125 82 -95 -73 -148 -60 18 -25 -42 -2 4 -123 29 202 87 349 87 144 -43 210 -14 92 9 -211
6421 -211 -46 -185 18 -251 -35 -249 43 222 40 -31 191 -142 141 -95 73 -51 124 135 129 -118 220
6442 220 -37 -105 41 -48 -148 -236 121 -126 -15 -230 -1 -19 -91 -71 -32 78 112 -120 -12 -71 133 88 -102
6465 -102 -276 -61 311 15 45 -252 -11 30 -100 64 -107 81 98 6 -41 -48 120 -57 99 -13 -124 29
6487 29 186 -334 240 69 81 -121 112 -13 59 88 -105 -117 44 29 131 -10 -58 -2 166 338 -159 50 52
6510 52 -12 -9 280 484 145 -169 -279 52 -114 -121 -263 -65 -238 100 12 -230 -109 7 108 -246 -124 -25 85
6533H5J26Oj18j10K42n0l35L86k77J6p0J96j36J61n2k0j1L6Ko5j91K76l2l17K17
6558c5M7j50LJ45o4k26N57j19j52j34K67p4m5K2J76l50m5M29l84J50p5k0K80n32
6582c29J85L50l85r2L07O9Q9k78J93P5k30k6J24P0k65N4R2k9nN5j39K64p6l44
6606b71K68O1r2m7J18j9k3r0J84O1j83J04N0rl23J56K77k40k10K68j81J33pj4
6630b9J81R7k84K0Rj94M1L20j07k03K83r2k63J71K34k66K54L6l95L1J37J74k49
6653i4Q9o4O5p7k9P6R9r0jO2m8j20J82k15K03j10j16J76jK0r8J86l5j15N1J6j07
6680i5Q8K32l83K48j38j19r8K56k79L60j18l3L2K9J13n3j86m3K48k13J05K13p9
6703H7r0P0j70q0K23L4r8L23m56Q6m6q7M98m62J06j53K17K2Lo1j56J47K7k91M95
$$ plain form
6533 85 211 217 99 -11 231 181 -154 232 -45 -29 -99 97 -39 122 70 50 39 75 77 12 -179 97 65 -252 -35
6558 -35 12 -138 -135 10 -54 -280 277 158 6 -128 139 65 20 42 218 -132 -177 252 -132 18 -57 -77 203 -329
6582 -329 -144 206 -179 -271 36 105 194 -84 109 184 -46 -72 52 122 -143 -89 3 -26 -31 24 -115 149 73 -271
6606 -271 -3 58 -34 -81 37 18 -5 -95 89 150 -33 71 121 112 -211 -55 222 -18 -228 40 -141 -8 -15 -29
6630 -29 152 249 -35 -15 -6 -200 -159 161 54 -149 134 42 -221 -50 184 -82 172 208 -187 -156 -19 155 -94
6653 -94 -5 -69 -4 -81 -110 -34 65 -25 -26 36 -12 -132 50 -165 38 -72 -188 -12 -13 7 -91 95 60 -55 -4 12 -95
6680 -95 -7 225 -158 90 -48 -167 -265 -9 -288 72 -46 -79 -47 -18 95 42 -144 -187 61 -152 -47 166 87
6703 87 -3 67 -103 -183 40 74 -24 299 -157 -71 -117 -204 294 -168 -62 -215 2 24 27 -34 -190 -43 -16 -307 188
6728A88m66L14j52j09K30j77K86k45qK31l1r7J87k03J56L1j18R0l16J37J9Q6p4
6751d1k7k41K40K45k30K09j69J27n7K01n41K22o9N07l41K44l09J68N5m18M1J15
6773f9p3M6J30N6K9j23L30m45K19K5j91J08o2J01l5r0K30p9K33m04J10j39L29
6796B36l10K2K93k44K9k9J32k1J2j53k09M05j93Q9j34J17k07K72Pl32k9J35m5
6819a57J28j04J17L5k33J49J99j50L0J73k54O6n3L0l43M66p9n8J08q6lJ45k9j22
6843b5j17J43J97k18LJ44n3M5k43J19m2K51j2j24k44K71J10j17n5N8j02k03K52
6866C8K2n9K54n49J93P3L1O7j94Po2K49J75j78m66K26L23L0j58j72O2J18O7p6
6890B1j9j65J51l2J29l7m33N05p1Q4Q6j29L4k29J6L89k63K5J21o7j00k84L33O
$$ plain form
6728 188 -278 36 -116 -225 5 -172 114 -131 -139 92 61 -36 151 -52 104 135 17 107 -209 -72 -53 33 -41
6751 -41 -68 -309 -69 176 -54 155 -14 113 56 257 -284 -62 -131 376 35 279 -30 138 193 -225 -184 -69
6773 -69 -142 -96 34 90 119 -4 326 -119 100 125 -66 42 -20 81 46 -44 186 107 340 -64 46 -93 236
6796 236 -74 -52 241 -3 26 -3 129 108 120 -33 -242 163 -30 59 -75 42 -165 107 114 -218 -247 -112 -157
6819 -157 -29 -133 -16 19 -214 -65 134 -16 14 187 -67 -1 -54 -24 -367 99 20 -38 70 -16 -19 126 97 -25
6843 -25 -142 1 198 -20 -17 127 74 119 -124 -5 -47 204 192 68 -176 95 205 88 33 91 -11 -214 38
6866 38 60 1 255 -294 -101 -28 3 70 -124 -117 -179 70 245 67 -399 -173 150 180 22 -150 -88 30 97 21
6890 21 2 -163 -12 -44 85 48 -385 120 49 133 219 90 124 -105 -89 300 37 62 183 116 16 -268 65 71
6914G1j72J43k11J11J53k70O4k4K24j49K1J92j55P2ok58oK34o9l3j14Q2J90j39
6938d9p4Q7j60K3L96l97K98m6k55K90p1k00R7j50M46j45j51J25k51M4L58n28K66
6961d7J2L7q6j84L93j28M1j42J68j16J02o1j39K03O0l36K27k22Q0L37k09Q4Q5
6984A59k03j74K22J28J51k96J6m7L89m43NJ26L0q1O5lQ3k17kM8j1O1J79k44J18
7009E9k01K01k33K77N7k78L3J03j11J51j72N5J93p5M5j3j70k5j8j31K25K32k59
7032e5q2Mj00K83j96L7k4J97j76l56N69o0P7Pr6K2j2j16o7R6K16j43N5L7l25K62
7058E4J26l35N1LL50j03m42J83R7j37L21k01J24m02M11j9P6k05r4L55l08K12K79
7081C96m33o0J50j46Lm2J57o5O7p6L49m16Q5J01Q7k55j0l2m9P6K9O7j8P8Qm7J80
$$ plain form
6914 71 -101 42 -169 -58 95 -175 -111 -135 89 -60 -39 153 -2 70 64 -194 -200 34 -35 -68 -182 -100 90 -49
6938 -49 -123 -36 -196 -173 223 -174 124 78 -177 113 42 -158 -61 -211 235 90 -61 64 -187 -143 215 -313 -47
6961 -47 -35 2 -84 -268 125 -3 38 -104 64 -52 50 -11 -150 53 113 -223 4 -218 -138 199 -10 74 159
6984 159 -44 -218 4 132 283 -13 3 -44 345 -98 -93 33 63 -18 47 44 127 -90 -92 -44 -55 6 185 -59 59
7009 59 -142 59 -174 103 160 -118 -85 18 -93 58 -114 -59 134 59 104 91 -79 -104 -122 -253 -28 204 -55
7032 -55 -137 -133 -233 50 -146 -109 -133 64 -112 -468 101 41 118 125 29 51 39 -77 -144 -48 168 25 80 117 -208 54
7058 54 180 -155 -104 -101 249 146 -296 -113 -16 -153 168 -33 91 -311 100 81 157 -48 -142 213 -95 117 396
7081 396 -37 -97 53 -93 -90 -132 25 -40 27 -49 300 -116 -31 70 157 -98 -108 -140 -189 -113 -84 -17 -35 43 51 4 184
7108A84l58NK36J06j65n6p9K7N8O0jR0mL23m96N8L08k61O8M1j85Q8j7J37l6Q4
7134B15j41k74J74M8L11l60j47J13M5K9Rk35K63J60n05K09j5r6L25k92L7J32O9
7157G4O6j83K55k87J93J24J3m42R8J03m3J34j95j6j56R6O5K01k66l2J87K27j66
7180E0n8Q8p7p4J33J81k95J07P7l9j40L4O8k37J55J90j75K04k60J89k24j11L13
7203I9j80L50o16L71P5j29J99n9j89K2L24j28j52n6m4K30K22k27L3J81r1m44L96
7226A87j63o3J44j69P8k81L28j1j05J08o5J42k44R6J14q4l50L58M6j72J00o3Q1
7249A2j8m9n0K27Ok27K82k79M1n1N9O5j1n4K63l47O2N49o14J53K09j18k02l63
7273d55M42Lp6M5p2K5J02mj90N6J63p2J21j25K28p0J16j38j48o2J96L9k69K18
$$ plain form
7108 184 -174 -169 67 173 8 -48 -127 -100 -42 18 17 107 103 426 -70 -12 296 35 103 144 -41 47 30 167 131 215
7134 215 74 -200 -26 22 333 -27 -174 -61 -16 13 22 -213 50 210 -295 -86 -101 -197 128 -164 -127 5 74
7157 74 140 -43 212 -75 118 242 255 -187 -89 14 -29 105 -90 -106 -262 -166 -101 100 -166 -198 -11 216 50
7180 50 -8 80 3 -71 62 243 -52 55 132 93 -47 -13 55 -182 -27 163 -12 192 -68 121 -103 -214 99
7203 99 -81 269 -347 24 99 -30 169 110 -79 -57 267 139 -13 -69 -113 117 339 112 145 326 235 -209 187
7226 187 24 -39 105 -64 14 -267 61 50 -55 53 -12 130 -114 -18 96 12 -338 20 66 -106 -6 -69 12
7249 12 -6 -55 -105 122 128 -99 183 -96 -55 -106 -47 18 7 -47 216 -131 -69 480 -134 19 228 110 -92 -455
7273 -455 -13 -10 -86 -41 -113 -88 14 10 -180 -124 39 -33 88 -37 191 121 237 99 -49 -111 85 124 -145 73
7297G3r2J33j0n3k54K36M8q9j73J47k8O0j25J13l4J10l8j30j42L19Jl72K98j30
7321a32K69l3k77J96k2O1j80J97r5K40j96K81l53m3k4J84m2J46j88K12j20J02
7343A83n2j81l2R2j39P4J5J13j72J41oJ26r6q2K42l3j04m05J54J23O1j94K03j45
7367a14L08n8k24K06R3l34J37J0L4k08L63O4k5k45p7J41rl00L06n0m2O5j65k5
7391a49L09j29p8J63m90M58k59J52m9po0J69J81l8l17J68L30l93O7j47K90O3l48
7414a14Rj16J77j59Q5J98r0k33L72n0n2K45j42m47L47K22k0j86o7O3q1j39L7L40
7438A99j11k31J36jK9k4r5L8rJ49j69J4O6L1k07K11KN2n2k3J43j7J6j22j01N5
7464b1L50l69n0J14k57L40J76Ok03Lm3n8Nj49L03n1q6j29K08j03N3jK62k71P7
$$ plain form
7297 73 -19 114 104 51 -203 33 81 -8 -181 -34 -62 -2 -127 -14 -48 62 24 -106 -248 71 72 -300 -2 -132
7321 -132 137 104 -173 23 1 62 -118 79 -16 224 28 309 -44 -87 -111 73 31 177 -11 201 81 183
7343 183 131 -50 -82 10 -129 -55 -40 73 -99 42 36 162 66 -16 226 193 89 -316 -162 -39 22 -172 31 -114
7367 -114 194 136 -88 118 211 -123 14 24 58 -150 213 277 252 7 -70 71 62 -238 68 18 -24 41 -124 -149
7391 -149 160 31 -47 116 -374 84 -175 -23 -72 -79 -139 30 211 173 -144 24 354 -39 28 -119 171 234 -114
7414 -114 -105 -221 -44 -203 -118 80 -10 -243 129 79 27 272 130 -317 30 252 232 46 -21 42 -39 -178 -141 199
7438 199 88 -143 -7 -8 21 -3 -98 -60 -69 80 -89 -75 -9 22 -185 26 28 80 28 5 148 131 147 25 -76 -21
7464 -21 329 -40 -90 24 -233 107 283 289 86 89 46 -12 -7 -156 147 96 10 -119 89 -14 39 38 300 29 106
7489A06n5j18K41q6k35K45O4l89J23K49j53q5J25J25m8l07M2K56j04J0j25J00
7511a9q6M94k50k48K29J86j82j8m4J0j29K47k43J86j73J86k82K77j22q9K51P3
7533B54j83k44L19j24j16L0J20m50J58K29r6K5j00J22J58n6J67J53l24P8j35J85
7555A70k37r7R3o6K91k97K30j76k9J80q4k34Q4J15J75k60J58M8K25p9k95N2O0
7578B7j52K74j45J07m45L23L68j14m90K69p8n1J11J82N1k12j33K3J25J4r6M2m2
7601d2OJ09m17M28Q7Rj33m9N2J64l73q7M64o8J31j40r5J8k86Q2j12L19K32m69
7625a70J93N3l28J4K79j53j21L27M5j97K01k71K13J8q6J15r8j47J67j24M4K42
7647B16j78M1j65q1MQ4k31N13k05m3k05L68K9k19m8L97m75J63J50l53K27J80k38
$$ plain form
7489 106 51 -67 174 88 -147 98 162 -227 -104 145 -8 -93 32 157 109 -198 -156 100 -4 6 -119 -19
7511 -19 -105 389 139 -109 120 306 124 106 62 72 -57 190 -53 133 -40 146 -136 141 19 -70 181 254
7533 254 71 -173 146 22 -94 -64 56 -394 -236 -7 -103 -78 -178 -56 102 46 213 366 42 120 -15 170
7555 170 -67 -164 -71 -137 154 -143 87 -89 -118 62 -22 -256 -172 -57 118 -142 16 64 289 210 -85 -33 27
7578 27 -125 149 4 111 -334 -11 357 243 -247 22 -56 -107 4 186 237 25 -108 -85 40 54 -42 0 -42
7601 -42 -36 73 -344 84 171 180 47 -2 50 214 -159 -246 218 150 281 141 46 64 -222 -140 -252 67 299 -170
7625 -170 23 76 -252 -238 41 -112 -233 94 139 -58 143 -128 85 103 17 132 34 -113 54 -70 -26 216
7647 216 38 79 -86 -167 -163 -79 -310 203 -2 -45 -250 118 147 -72 -120 277 -198 -35 115 -238 -11 169 -69
7670f9n2K63J48k36ON5n5j88k7M03l92N8J10O9k22J12j34K52j86J43l46L68K1
7693A01j66R3L6j58P7Q7o8J00p4l06L28k66K62J08l49K12j89K16k59L08j42K3
7715b6k46J93Q5M9L6k67L02j51J19l29N3K83r8Q2M3j30J84k21J28j3L3j50J40
7738I9m4J13n1K90n76K82j68J88l37O1J72m2K9J45n41K98K07p8r4J4l5l9n0J63
7762FM8j85J73j37O9Q0k03N0J00n0K52k39R2LJ55j29j59J91p2N2p6M8j56L16j13
7787A16R5j92n2m3L19j43R9l99J00P8J7R0P7m4l67J56K36o2q8J01P1N0l74o5J94
7812c0K72j96n0r9j25O5M28l80J5oJ75k44J16J68j03K5l14K07J85Q0k46p8K62
7835A27k07J91k64K04J63k55P0j65j07J63P2M0l03K42L08k64J44j23R5k97L10
$$ plain form
7670 -69 -121 142 290 54 60 115 60 -128 -155 248 -144 -86 24 93 -129 -17 -151 101 -85 58 -288 80 101
7693 101 -65 28 64 -94 -17 70 2 102 28 -278 50 -216 46 154 -195 17 -172 44 -215 93 -49 -26
7715 -26 -272 -79 6 55 91 -176 126 -25 94 -235 -182 101 3 85 128 -2 182 -39 89 76 109 -41 99
7738 99 55 168 117 407 -169 113 -55 133 -204 -143 29 -13 16 161 -380 -82 125 47 -47 -33 -68 -107 -157 6
7762 6 54 -131 42 -95 -26 54 -149 -99 1 -49 203 -36 56 59 214 85 -74 117 45 97 21 69 -87 229 116
7787 116 211 19 -33 -76 243 100 199 -200 -100 -22 -5 85 162 118 -249 -93 143 81 -7 94 165 215 -159 -224 -30
7812 -30 242 46 -4 -103 -228 -163 265 -115 -100 -106 69 -175 -59 109 6 31 -283 -76 109 189 -57 -135 127
7835 127 -80 111 -153 51 214 -41 29 -136 -243 -80 -8 32 -271 -29 279 15 159 36 131 -166 144
7856A44Kr3n6K02l69K88l69J59K04j8n1Q2j89j97L00j61l0l43M51j34J91j67J48
7879fp6j24R8j94K64J51Mk40M17l06p5J39j69L20Rk39Q5l7J29k94J28q3J43J8
7903F2p1o3K27j49J98l37j44K26J62o9m4j34K32o7Q1j12k32K81J07n0k57j37M24
7926A34l3m48O77k99j77J53Q0r4o6O1NJ50j26r0n4R7k7j0K6J98j36P1k21r9K13
7951a5p6O9R4k17R2k70R5J78K2K0o7J3k27j48L38j38RL47j31j40L0J33k0j31J10
7976c0j72kL64r4p0J09j67J42N3j70K22j25j70J16Q9q4P8J46j26k03L02j45r3
7999c0N2O3j06j31K69j97K01J62l69L09n88O90m02j74L23o1o0K49n48L95J60m10
8021b03J20m9K39l52J99j94M16k69K16j39O2n6q8jj2K77l11K38k07LK26m1QK58
$$ plain form
7856 144 146 53 -3 199 -170 118 -251 -92 112 94 43 125 -64 -261 39 -122 -152 -495 -44 -178 13 -154 -6
7879 -6 -82 -206 -108 -302 -38 113 117 -123 294 -12 -87 52 -117 203 212 -27 58 21 150 -144 -16 -99 44 62
7903 62 -9 -72 155 6 204 -133 -277 -51 111 42 -2 -136 96 29 110 -2 -234 47 154 104 -153 -290 134
7926 134 101 -347 330 31 -146 7 87 -7 -73 -12 -7 143 17 -73 -127 -30 -57 -67 -41 157 21 92 -129 -228 -15
7951 -15 -91 -22 72 -145 -53 -323 -228 -50 -28 -8 -75 -62 -289 -437 -99 -237 -228 119 -12 -152 -122 11 -9 -140 -30
7976 -30 -202 -204 160 66 -4 105 -62 80 133 -37 185 60 -110 6 95 11 89 235 109 -94 208 63 -30
7999 -30 22 85 -21 -152 117 -80 121 283 -86 223 -365 325 -77 -251 72 11 -49 200 -348 47 207 -203
8021 -203 -83 -132 107 -245 -46 -240 176 -93 123 -16 46 -10 -98 -99 -111 166 -145 93 -114 -111 115 74 82 340
8045C40l07p9J56k0k26K27j14O7k17J90N2k4j40K38l14J3J92k16M86k71r6J35
8067G2p6J7K38k71j8K00k43J63k12m3K13Q8p9j05K1N8P4j0q0K33m20J04L4j39
8091a81J3L8P9M25l84M8k1r0M26l77R2j2J01j51J05O8l70J87J0J08j11j09J7K00
8115A11m33K40J66j50M0J93j77N6j7K36k75O1j63K18N5J1j33l08L22k42J36j58
8137b11L94l14J39K06l02L3K06O4k69j22J35J96l23K75j46q0M3J35l0O8k2k71
8159a96Q8Q0L0J59k85p3M24j96k9Jk58K28M8J27j8n8r0j08k0J0L88l83J16J1P7
8184G3L2q6l1j88L11m7k5
$$ plain form
8045 340 33 -46 110 90 -136 91 -23 44 -173 17 69 45 -95 143 -171 -158 34 -182 304 33 -63 72
8067 72 -4 13 251 -20 -38 162 -81 82 -130 -173 40 128 49 -56 -35 23 97 87 7 240 -180 -76 -42 -181
8091 -181 -168 -130 -51 374 -10 38 17 -73 353 -24 68 56 157 6 111 179 -191 -4 6 114 3 -106 -89 111
8115 111 -322 -82 84 -66 -26 167 -10 46 29 265 -10 51 -112 106 161 172 39 -269 53 -189 -53 -211
8137 -211 183 -131 8 214 -88 -55 151 215 -54 -176 -41 155 -168 107 -39 -119 -76 59 29 97 75 -196
8159 -196 -108 -28 2 161 -124 -197 227 31 2 3 -255 -27 21 148 130 72 -18 -126 -146 -136 252 -131 -15 -4 73
8184 73 105 19 -12 -200 111 64 39
8191C9
$$ Imaginary data points
##PAGE= N=2
##DATA TABLE= (X++(I..I)), XYDATA
0@%%%%%%%%%%%%%%%%%jRj6J6j6J6j8K6l2L2m0M8n4O2p1Q1r1J05j19J33j49J67
39H8j86K07k30K56k85L16l49L85m24M68n16N67o26O91p60Q38r27J027j140J271
59F71j422J597j809K069k396K824l408M260n644Q402k5119N3957l2624q4039N7592
74b5089P976n5724J8782M6099j3883J9176J7921m1048k349N8205j0162k8034M4049
87C5919K0290n5363j1802L2476p385q904K3612j5387l1440J9031L492l9890J9683
100a5668N1520l1253m3276L1842J2746l1865J3124K7572j5699k226Q419k8931
112b3695M08M6131q969l3856L1671J9809m5496p805M1653K904j7041P126l160
125I680j1513J0584k818j6854K0740K0008l4003k3624K8535P881k6371N047K1725
$$ plain form
0 0 0 0 0 0 0 0 0 0 0 0 0 0 0 0 0 0 0 -1 8 -8 8 -8 8 -10 16 -16 16 -24 24 -30 32 -39 42 -49 56 -63 70 -79 88
39 88 -98 109 -121 135 -150 166 -183 202 -222 246 -270 297 -329 362 -398 440 -487 540 -600 671
59 671 -751 846 -963 1106 -1290 1534 -1874 2386 -3258 5144 -19975 33982 1358 -82681 -25089
74 -25089 -17113 -72837 -54055 -7956 -21839 -2663 15258 -25790 -28139 30066 19904 -8130 35919
87 35919 56209 846 -10956 21520 14135 5231 28843 13456 -17984 1047 4539 -35351 -15668
100 -15668 35852 4599 -38677 -6835 5911 -25954 -12830 14742 -957 -3183 5236 -23695
112 -23695 -23287 22844 13875 -19981 11690 31499 -13997 -21802 19851 22755 5714 12840 9680
125 9680 -1833 8751 5933 -10921 9819 29827 -4176 -27800 735 8616 -17755 -12708 9017
138I017j0995j3484N199k733L854J9023p010j7744J8064J2097k7487k617L2799
151A7983J817k2292J734P282m163J426k864n440J4218N175k7355p405K7130J335
165H581k3819N273J9480q768j6332M591J1535L872k932p022R81J0654l118j4631
179a1655O734K0238o293j8609N731J3431m958o978L635N203J633m317j0200K362
193d043J4365l241j4618M588J1973p964j2730N473J0156j908q525l192P003N427
207B764p010o280J0499J1002r028j1070Q152J1957n196r871N166R965l102j0411
221b463o48R067K809q144o160O306O257q044q395O860R535n793j0764L060J0810
236D293j502j0806J08J1273L027j1320m727J0804P725q965q430Q720J0908q001
$$ plain form
138 9017 -1978 -15462 -10263 -12996 -9142 9881 2871 -14873 3191 15288 -12199 -14816 17983
151 17983 19800 -2492 -758 6524 2361 3787 923 -4517 9701 14876 -12479 -19884 7246 8581
165 8581 -15238 -9965 9515 747 -15585 -10994 541 4413 1481 -5541 -4560 6094 2976 -11655
179 -11655 -4921 15317 9024 -9585 -3854 9577 4619 -2359 1276 6479 8112 3795 -6405 -4043
193 -4043 10322 7081 -7537 -2949 9024 1060 -11670 -6197 3959 2051 -6474 -9666 -2663 2764
207 2764 -4246 -10526 -27 10975 1947 -9123 -971 10986 5790 -4081 1085 11050 7948 -2463
221 -2463 -3111 5956 8765 621 -5539 767 7024 -1020 -9415 -2555 6980 1187 -9577 -6517 4293
236 4293 2791 -8015 -7907 3366 6393 -4927 -9654 1150 8875 -90 -8520 200 11108 3107
250C107j1249P261J2655o272j1680M491R688k972j0289j9R414J632j0239m738
264i210R376N509r757o280Q674O582p341n653N209N938p70m740r90O154M600o440
280H61n061P523O972p333o929O704O310n064p367K222O510l83q948l366R603M236
296F490j1896n726J1773N639j1381n411R932O111o886n632M933P770j348q745
310d377Q47J0601N30j1111n45J0468%r444j145O580K136n125n052K344O843j649
326A901r498P08J0511l30j0619N32J0274J212p844k328O944N445n269p133N088
341d06R539m865j0493M984J1095n560j0321L709Q898k629p917p73P333K883p606
356b129n169P818O152q247o248P549N451o019m065L759M096p01m175k287N432
$$ plain form
250 3107 -8142 -881 11774 5502 -6178 -1687 8001 5029 -5260 -5279 4135 5767 -4472 -9210
264 -9210 166 5675 -4082 -10362 -1688 4894 -2447 -8100 -2891 3047 2277 -2463 -3453 2701 7301 861
280 861 -4200 3323 10295 2962 -3967 2737 9047 3983 -3384 -1162 5348 4965 -3983 -7349 2254 6490
296 6490 -5406 -11132 641 6280 -5101 -10512 -580 5531 -1355 -6987 -2054 5716 4368 -4377
310 -4377 -3530 7071 7601 -3510 -4055 6413 6413 -3031 -4176 2404 4540 -585 -5637 -3293 3550 1901
326 1901 -7597 -6889 3622 3292 -7327 -6795 3479 4691 -3153 -5481 1463 6908 1639 -5494 -406
341 -406 9133 4268 -6225 -1241 9854 4294 -6027 -2318 6580 3951 -3966 -4739 2594 5477 -2129
356 -2129 -7298 520 6672 -1575 -7823 -274 5177 -842 -4907 -1148 2948 2247 -1928 -4215 1217
371A217M708o272n434P236N381p266n011O143M515l308m800K32N585J880p790
386b984l804R800M707j1059m916J1047L500r600k786P690L013m661m724J819P166
401D208P30r287j126J0836K47j1505Q84J1158j026p975K38M387P31j209l584j25
417b418P356M80j1254J02J1820r90j0786K550Q188k632o721O8L941M037j477p836
433e572J248R943l258j1744O167J2256o356j0643O195O727l941l061K767K467
447C195K021l605o816M130R675n783r144P294N858r378m697P410K408k553n58
462e43l062j096O261m72p298N476R960p658r838P878P402n516k731M383O06j630
478B122l071m260N231R313p231j0869Q515P609j2421n001J3583L990j0092k482
$$ plain form
371 1217 5925 -347 -5781 1455 6836 -430 -5441 702 5217 1909 -2891 -2659 2926 4806 -2984
386 -2984 -6788 3012 7719 -3340 -8256 2791 6291 -3309 -6095 1595 4608 -53 -4777 -2958 4208
401 4208 4938 -4349 -5475 5361 5608 -5897 -5013 6145 5119 -2856 -2618 1769 2500 1291 -2293 -2418
417 -2418 4938 5418 -5836 -5734 6086 5096 -5690 -3140 5048 2416 -4305 -4237 -296 3741 2264 -5572
433 -5572 -4324 5619 2361 -9383 -3216 9040 2684 -7959 -1764 4963 1022 -2039 728 3195
447 3195 5216 1611 -5205 -1075 8600 2817 -6327 967 6825 -2553 -7250 160 2568 15 -543
462 -543 -3605 -4701 1560 1088 -6210 -734 9226 1568 -8270 -392 7010 1494 -1237 3146 3752 2122
478 2122 -949 -5209 22 9335 2104 -8765 -250 7359 -5062 -10063 3520 7510 -2582 -5064
492e064L346Q40J561j017k739O018M373j1629n486J3451M353j1269K60Q878l764
507B112p119K140L167J913L564m998o942O567N468j0171j503J3833n2j3323L7
522e307P082q30j728K124j073J373Q88q717k396J3295L143j3299O36J1176n715
537F52r757P290Q157k847j929k220l241M554L461o893J150J0757m670j3295L569
552e262R769l929k917N058o98m055l45j880k06R530J816j2124l56J0093m550q969
568i025Q748R550o564o554J222N47K695K416l928J149P863n919j2219P770J2298
583A0049o947p219P285J229q774j097M871K419K536k233q497J713P720n060n364
598g369J0151O331j1176o036P354L116k032J860M50j326J569l737n783P960R259
$$ plain form
492 -5064 -1718 -878 683 -334 -3073 2945 7318 -4311 -9797 3654 8007 -3262 -3002 5876 2112
507 2112 -5007 -2867 300 2213 5777 779 -6163 404 5872 -4299 -5802 8031 7979 -5344 -5307
522 -5307 1775 945 -783 1341 268 1641 2529 -6188 -8584 4711 7854 -5445 -4809 6367 652
537 652 -9105 -1815 6342 3495 1566 -654 -3895 659 4120 -2773 -1623 9134 4464 -8831 -5262
552 -5262 4507 578 -2339 2719 2021 -2034 -2379 -4259 -4465 5065 6881 -5243 -5599 4494 -56 -9025
568 -9025 -277 9273 2709 -3845 -2623 -2076 619 3035 -893 256 8119 2200 -10019 -2249 10049
583 10049 3102 -4117 3168 4397 -4377 -5474 -603 1816 4352 2119 -6378 -4665 3055 -2005 -7369
598 -7369 2782 9113 -2063 -8099 -745 2371 339 2199 2649 1323 2892 -845 -6628 1332 10591
613A0591q704p866Q274J772j0071O73R763M09n201j976k278J979M950l015l361
628d061P959K176j2061k688J1498J646n948K209K606l811j631J023l68M700M155
643G404p168n995O895K699p518J237Q621k005p523l55J689J800K876k923l587
658c853N546J706j0470r83J3218Q38j0533Q80O612k880m174K778L911J784j378
673C002o024K77P620q99q035M143Q372o437q606M930N646l385k008R89p60Q41
689c34k24m590J881P991k394p899L452N915m312k960M817J816j417j319k340J254
705f63N206j422o619L979O219o403o956O650N426n519l489K357K093j182k563
720b886j159L856L745n012m932O028M252n930k335O605J286m195j284J894J738
$$ plain form
613 10591 1887 -5979 2295 4067 -6004 -5331 4432 4841 -360 -2336 -4614 -2635 2315 -700 -4061
628 -4061 3898 6074 -5987 -8675 2823 4469 -1479 730 3336 -475 -2106 -1083 -1451 3249 7404
643 7404 236 -5759 1136 3835 -3683 -2446 6175 4170 -3353 -3708 -2019 -219 2657 -266 -3853
658 -3853 1693 3399 -7071 -8054 5164 6002 -4531 -3651 2961 81 -4093 -1315 2596 4380 3002
673 3002 -3022 -2745 4875 3976 -4059 84 8456 2019 -6587 -1657 3989 604 -1404 -415 -1175 -334
689 -334 -558 -5148 -3267 4724 2330 -5569 -2117 3798 -514 -3474 1343 3159 1742 423 -1917 -663
705 -663 4543 3121 -3498 481 6700 297 -6659 -9 5417 -102 -3591 -1234 859 -323 -2886
720 -2886 -4045 -189 3556 -1456 -6388 -360 3892 -2038 -4373 2232 3518 -677 -1961 -67 1671
735A671R35k162k342L589K805n590l327O229K697n357k703L544J964j791k766
750b604L53L756J257n522j745O615K004p019j265O970P34n738j022M673K600l715
766C32l214K467M463k090n311J829N890j597n767Q64N265r58m224k63L159J349
782B194k722k761K112L859k410m316K204M373j956l848Q77L941L2l028j467L417
798E01L035l520l114L578L877l286l980K426M421k149m018R53L889m66l964j117
814b934M262J059l964k071L729K350l706k362K946K939k034k735N99M051K54l670
830a287r41M166K013m247k049M076K327l413k897K281L454j662m546P48M845p20
846B148n497k27N730N9n522q35N201J639m667j956M256K960l642k994L035L878
$$ plain form
735 1671 2606 444 -1898 1691 4496 -1094 -4421 1808 4505 -852 -3555 -11 1953 162 -2604
750 -2604 -2251 1505 2762 -2760 -4505 2110 4114 -2905 -4170 2800 3534 -2204 -3226 1447 4047 332
766 332 -2882 -415 4048 1958 -3353 -1524 4366 2769 -2998 -2134 3131 2173 -2051 -2314 845 2194
782 2194 -528 -3289 -1177 2682 272 -4044 -1840 2533 577 -3271 -2394 1547 1579 -1449 -2916 501
798 501 3536 16 -3098 480 4357 1071 -2909 -483 3938 1789 -2229 -1276 2613 2147 -1817 -2934
814 -2934 1328 2387 -1577 -3648 81 2431 -1275 -3637 -691 2248 214 -2521 -1922 2129 2383 -1287
830 -1287 -2228 1938 3951 -296 -2345 1731 4058 645 -2252 29 3483 1821 -2725 -1977 2868 2148
846 2148 -3349 -3576 2154 2213 -3309 -4144 1057 2696 -1971 -3927 329 3289 -353 -3347 -312 3566
862C566k086m036K123L972j354l805Q07L223k65k906q44K654J226k447k268J837
878f03K395j714l128P66L493m03l427j28L697J306l743j566L247K653k592k713
894b460K606L321j942l829J518M320r97m634L29M757n60m958q7M507J83l836j238
911c000K796K293k363k732J729L625j474m418J403M575n08l474K43K658K26k058
927d79r64J999K831j746m377J417M577j348m739J896M456k391m462R45L762N58
943A935k730j794K301K767l045m172M553M472m208m067M036K640l488j703L149
958F46J559p73k583j404K718K747k536k518M210J481n211j592M497Q02j977l03
974b37k15O6J062j511k386L942L635n450l725N108K000l920M1L443M92k311j542
$$ plain form
862 3566 1480 -2556 -433 3539 2185 -1620 -813 2410 2145 -761 -1605 1049 2275 -172 -2440 -603
878 -603 1792 78 -3050 -2284 1209 806 -2621 -2749 948 2254 -1489 -3055 192 2845 253 -2460
894 -2460 146 3467 1525 -2304 -786 3534 2537 -2097 -1768 2989 2429 -2529 -2616 1891 2074 -1762 -3000
911 -3000 -204 2089 -274 -3006 -1277 2348 874 -3544 -2141 2434 1926 -1548 -1305 1353 1579 -479
927 -479 -1443 556 3387 1641 -2736 -1319 3258 1910 -2829 -933 3523 1132 -3330 -2385 1377 1935
943 1935 -795 -2589 -288 2479 -566 -4738 -185 4287 79 -3988 48 2688 -800 -2503 646
958 646 2205 1432 -1151 -2555 163 2910 374 -2144 2066 3547 -1664 -3256 1241 2043 66 -237
974 -237 -452 -386 676 -835 -3221 721 4356 -1094 -4819 289 2289 -1631 -1590 1853 2345 34 -1508
991a508k43K555L000l504k795M853J238p000j67O882P66n426j04J966j137M6j18
1008f96m89L124J111n887k279P043J013n594J525M534k897m111J895J969J275
1023A536R68k904k149M106J47n830K006P930k651p256K395L839k880m17K216L56
1039A412p9o43m570P21O592j100n822L101M265n646l201N236K417k577K55n30
1055a69k182K427J269l476K135N557m192o346M336L779l231o21L004q01k008J50
1071c69k116Q65N487j558o476L081M630n797l328P514K515n621q38J647p36J433
1087C33N98j697J814L271n368m452O931L186n581o40N268k427m105J313J844J91
1103D79J810j095m359J939L553m280j705O765M49o275k00L307l86o46J664q61
$$ plain form
991 -1508 -1751 804 3804 300 -2495 2358 3596 -3404 -3571 3311 4077 -1349 -1453 513 -624 -578 -696
1008 -696 -1185 1939 3050 -2837 -5116 1927 2940 -2654 -1129 3405 508 -3603 -1708 261 1536
1023 1536 2504 -400 -2549 1557 1704 -4126 -2120 5810 3159 -4097 -1702 2137 -743 -1160 1056 1412
1039 1412 1333 690 -3880 -3159 3433 2333 -3489 -388 3877 -1769 -4970 266 2683 106 361 -169
1055 -169 -2351 76 1345 -2131 4 5561 1369 -4977 -641 3138 -93 -714 2290 1489 -519 -369
1071 -369 -2485 -1620 3867 2309 -4167 -1086 3544 -2253 -5581 1933 4448 -1173 -2011 -364 -1100 333
1087 333 931 -766 1048 4319 -1049 -5501 1430 4616 -965 -1605 3663 1236 -2869 -1556 288 479
1103 479 2289 1194 -3165 -1226 2327 -1953 -3658 3107 3556 -2719 -2919 388 2 -644 1020 159
1119A59O63J135m041k161O666K594o548o10N700k071n406K991L906r83j724r28
1135f58j196J539J539l254M22N101j940o646K711M875k550j816L036L51k247j99
1151i32r8j82L575R51m767k86L960j128l992L023L490k329k205Nk6J381J051k712
1169a221J89L847k102n361K760N632k630l901K930J917k649j619J288K132O90
1184A902j509l059J814L307k640k719L782L077m535k136K697J637j492J26j63
1199H9L56P52j695k138L026K894l453k431K898J495l214r47K505J601j458j712
1215a432l91K146J654k799j242L338J468m153q08L648J312l233m91K021N36j432
1231A42j423N36K149L04l065o78L033L18l146J7K653M20k503l99J139J375k69
$$ plain form
1119 159 822 1957 -2084 -4245 2421 5015 -1533 -2143 3557 1486 -3920 -929 2977 1994 270 -658
1135 -658 -1854 -315 1224 -2030 -1608 3493 1553 -5093 -2382 2493 -57 -1873 1163 1514 -733 -932
1151 -932 -1030 -1212 2363 3314 -1453 -1739 2221 1093 -2899 124 3614 1285 -920 -915 -941 440 1491 -1221
1169 -1221 -1032 2815 713 -4648 -1888 3744 1114 -2787 143 2060 -589 -2208 -920 1212 1902
1184 1902 393 -2666 -852 2455 -185 -2904 878 3955 -580 -2716 -19 1618 126 252 89
1199 89 445 1197 -498 -2636 390 3284 -169 -2600 298 1793 -1421 -2368 137 1738 280 -1432
1215 -1432 -1823 323 1977 -822 -2064 1274 2742 -1411 -2219 1429 2741 -492 -983 1038 1574 142
1231 142 -1281 -745 1404 1708 -1357 -2035 998 1316 -1830 -1813 840 1260 -1243 -1642 -503 872 603
1248F03j643J55K180L53k739l01L141K82k884m06K328R09k108j394J740J684j320
1265E80k867J062K750n59l502P66L409o80l120K46L156J9k500p02K566Q33j498
1282d1j633K015J952j461k125J272K107q12k645O79K319l23k109o58K047R49j656
1299a23j938J684J966j563k514J585K297j120k156N30K583j78k333n1K329N18
1315A516k050r07K305J634k208j652K076J731j841j671J120J448m98j951j38K000
1331I14K76k069j084J969J017j949j097J654J373q30j714O26K112Nk352P5K046
1348I72P70k146j111K466J498k337j718K126J747j906k239J152K618q70k940K13
1364a705L207l55l010K7K824J32k669l61K253Q42j489j216J287J860j366j605
$$ plain form
1248 603 -1040 -885 1295 1648 -1091 -1392 1749 2031 -853 -1259 1069 1978 -130 -1524 216 1900 580
1265 580 -2287 -1225 1525 966 -2536 -1770 1639 959 -2161 -1915 1241 1260 -1240 -1942 624 1457 -41
1282 -41 -1674 341 2293 832 -1293 -21 2086 1274 -1371 -692 1627 1304 -805 -1463 584 1533 -123
1299 -123 -2061 -377 1589 26 -2488 -903 1394 274 -1882 -1352 1231 1053 -1280 -1331 998 1516
1315 1516 -534 -1441 864 2498 290 -1362 714 2445 604 -1067 53 1501 1003 -948 -1086 914
1331 914 1190 -879 -1963 6 1023 -926 -2023 -369 1004 174 -1540 -914 1198 1203 -1149 -1074 972
1348 972 1742 -404 -1515 951 2449 112 -1606 520 2267 361 -1878 -726 1892 1022 -1918 -1705
1364 -1705 1502 1147 -1863 -1836 988 1120 -1549 -1910 343 1185 -304 -1520 -233 1627 261 -1344
1380a344R45K319n31k585N61K375m00j895k90J534R81j608j315Q66J763r78k194
1397a796J154K248j029k488P19K377m73j921J23J708O73j507j689K167J875j877
1413B64j758J896J546j421j663J390J285p69j118m52J022J033j146j595J276J727
1429A517k048j853K004J877j428j617J257O62j65r32o11J819J630k154k378K469
1445D9K450k802j697L065J438k679j144J252J311k97j580j56J689M35k780r73
1461b419L712L92k971l68K738m55k009L38J226P26l28j027j043J817J336k206
1477e41n93L153l52l018J31K304j44o55K5m43L83N97k043m12L156N50m127j5L039
1496I95p64k325J396K247j047j161l85J30J400J030k143o4L229j638l542K172
$$ plain form
1380 -1344 -399 1920 1389 -1196 -635 1740 1340 -555 -845 689 1670 62 -1253 -387 1376 398 -1796
1397 -1796 -642 1606 577 -1911 -1192 1185 712 -1209 -1086 622 1295 -212 -1901 266 2141 264
1413 264 -1494 402 1948 527 -1136 254 1539 770 -348 -800 222 1255 109 -1486 -210 1517
1429 1517 -531 -2384 -380 1497 69 -1548 -291 371 206 -726 -1337 482 2112 -42 -2420 49
1445 49 2499 -303 -2000 1065 2503 -176 -1320 -68 1243 946 -634 -790 899 1334 -1446 -2419
1461 -2419 1293 1685 -1286 -1654 1084 629 -1380 -1042 184 910 582 -445 -1488 329 1665 -541
1477 -541 -1134 2019 1667 -1351 -1220 1084 940 285 310 -133 250 847 -1196 -1608 1548 2098 -2029 -2044 995
1496 995 231 -2094 -698 1549 502 -659 -1044 -914 486 1516 -627 -691 2538 900 -2642 -470
1512d70L376j984j716J461k13r20L94j98q0K094j08l797j41L677j036k410K190
1529A19J927k405j447Q96M35J327N64k185p4K469j008l363K924L704k900l207
1545b224K563J098k288qJ719j0K22j311k243J435L182j931k284L326P57m233p87
1562c017L546L43j181Q74k99j123R11R2j500K060K507l415k399L015J026k525
1578a085R61K175j308j004j24j199J156K617j456k485K142J471m591q0M672L00
1594B162k998K06P19j144N99O48p86J902J077l608j645L923P10l187J201K675
1610B454k211k271J570P86n8J208j082j910J739R41l320N34M639j574l603J416
1626g42J538j304l79J227K3K13Q1k546J15L525j27l363J398K760k574k453K627
$$ plain form
1512 -470 2906 922 -794 667 454 -466 -72 -270 -350 1744 1636 -2161 -2302 1375 339 -2071 119
1529 119 2046 -359 -1806 -910 -475 852 1416 -769 -843 1626 618 -2745 179 3883 983 -2224
1545 -2224 339 1437 -851 -859 860 850 1072 -239 -2482 -1047 2135 204 -2080 1246 2003 -2230 -3017
1562 -3017 529 872 -309 565 266 -857 54 146 -1354 706 3213 -202 -2601 414 1440 -1085
1578 -1085 -124 2051 743 -261 -385 -1584 -428 2189 733 -1752 390 1861 -2730 -2810 1862 2162
1594 2162 -836 -630 89 -1055 -456 192 -594 1308 2385 -1223 -2868 1055 1765 -1422 -221 2454
1610 2454 243 -2028 -458 328 270 1478 396 -1514 225 1166 -2154 -1620 3019 1445 -2158 -742
1626 -742 796 -508 -887 340 363 576 657 -1889 -1774 1751 1624 -1739 -341 2419 -155 -2608 19
1643A9J854j572j11k20q18R06M18j499O46K977j976l066J837K146k183m52K026
1660I32j55j301P5k73PJ991qk944J142K310k071j785K701J572k145q54Q12J6J46
1679A68K5o36O66J476k166j955K457J883k436q71K218N7k058r3J155R3P32o07
1697A08j345R26J689k010q88K509R38k633l29J699J9o72R4K7O81K40j682j040
1715a669K416J113k599j056K777j10k307Q3J969K86j128o90O4J276j17j413M43
1732f62K535q63k627R03K310p28j692O39J031k74j115N0O14P84k24j868N57J564
1750I34o14j495P41R98l61r75J38M60L89N6r68J73J296k44j545K38J987k95j734
1769h21M04J120j10j278j17J171N80j068j142J366J176j626j127J564Q71o46j496
$$ plain form
1643 19 1873 301 190 -30 -848 58 476 -1023 -377 2600 624 -2442 -605 1541 -642 -1094 932
1660 932 777 -524 -449 -722 -715 1276 1268 -1676 -534 1776 -295 -2080 621 2193 48 -806 6 22 168
1679 168 193 -443 223 1699 -467 -2422 35 1918 -518 -1389 829 886 -1172 -1265 -110 -17 715 108
1697 108 -1237 -311 1378 -632 -1520 989 1927 -706 -1035 664 683 11 105 132 813 1053 -629 -1669
1715 -1669 747 1860 -739 -1795 982 872 -1435 -1352 617 903 -225 -915 -851 425 308 -1105 -662
1732 -662 1873 1010 -1617 -714 1596 868 -824 -185 846 572 -543 -493 121 905 681 -1187 -630 934
1750 934 320 -1175 -434 564 203 -772 -634 -174 215 271 -697 -524 772 528 -1017 -779 1208 913 -821
1769 -821 -417 703 593 -685 -802 369 949 -119 -1261 105 1281 -345 -1472 92 963 317 -1179
1786a179J026J111l24j473K90J218N0j204o67J703N49j222p49R05R01q31q83N91
1804a88J067l17j287R5J178J42j027n76J395K91j058n99Q48J303j433q98R86R86
1822I08p68j168M82J545l40j421K88J037J50j260r5J096M45q49q50P08J016o67
1840B57j017N42J010o03n34p2R50K11j159m03J029P88j273n69N78J126o65j290
1858a094O02J065O2j441n61K021O77j889m12J836l8j138m81J234O22j222p08O87
1876a78J306p77j416M41J702o96j481N66J053r3r52m35R10O78p54q70Q98R81n64
1895C19j360N33J608o45j284L75J301k17q85n11J347N01j013q44R29J237j382
1912Ij373J294R24r87p54N24R39l58j048Q7R39N79r92q16J519J69r48m20J211
$$ plain form
1786 -1179 -153 958 634 -839 -549 669 719 -485 -1152 551 1100 -122 -871 34 935 104 -779 -188
1804 -188 879 562 -725 -630 548 690 -337 -913 482 773 -285 -884 -36 1267 -166 -1064 -78 908
1822 908 140 -1028 -546 999 659 -762 -474 563 713 -547 -642 454 899 50 -800 -92 924 257
1840 257 -760 -218 792 189 -345 -417 533 744 -415 -818 211 999 -274 -843 -265 861 196 -1094
1858 -1094 -492 573 635 -806 -1367 654 1331 -558 -970 866 828 -310 -791 443 1065 -157 -865 -178
1876 -178 1128 351 -1065 -624 1078 382 -1099 -533 520 427 -525 -960 -50 628 -126 -996 -98 883 319
1895 319 -1041 -508 1100 455 -829 -454 847 630 -255 -766 581 1082 69 -775 154 1391 9
1912 9 -1364 -70 854 -133 -887 -363 576 218 -830 -743 196 775 -217 -1033 486 655 -293 -713 498
1931D98M97j139j10O19P8L90p55p32R92M17p94j171J561M48j043n74J024K05m85
1950g4n52K55J042L93j614o88J573N94j921k5K423l56j724J06J105K89q46k84
1968c04M04P57l56j598J39J732L2j749N16J525j134j198R88O68q5j02r59R7R38
1987C11L43j574L00K086q40j947O36J754q38n73N76n2L44m00q70K24J778k24k168
2006a134M49K077j933q31J749O63j215l78j8m8O17K47o90J05J536j328j712J763
2024h1J494j241m56R48j85p25M07l00N6J242l22k299J051J636j094j214J974M22
2042A313j755p55R26K89J31O5p31J41J007j496j093K483J503k534p56J991n47
2059A82j270Q62J013j2j47o21r57J018Q78r46q07K124k13k359K53J774k31r73
$$ plain form
1931 498 995 -144 -254 365 443 833 78 -654 338 755 -39 -1210 351 799 -244 -818 206 411 -74
1950 -74 -626 -371 671 1064 -550 -1238 335 929 -992 -1017 1406 1050 -674 -568 537 826 -20 -304
1968 -304 100 857 501 -1097 -958 774 806 -943 -427 1098 -36 -1234 -246 422 337 235 -724 -627 311
1987 311 654 -920 -620 1466 626 -1321 -685 1069 231 -342 234 182 526 126 -744 -520 1258 1034 -1134
2006 -1134 -685 1392 -541 -1372 377 1040 -175 -553 -571 -619 -2 245 -445 -340 1196 -132 -1844 -81
2024 -81 1413 172 -284 664 479 -246 161 -139 -83 1159 837 -1462 -411 1225 131 -1083 891 1313
2042 1313 -442 -1197 -271 18 149 214 -517 -376 631 -865 -1958 525 2028 -506 -1262 729 182
2059 182 -1088 -226 787 775 628 7 -950 68 946 0 -807 1317 1104 -1255 -1002 772 541 -432
2077d32O33k65m90J48k30m79J706J015k441o24K067j68j454J211J239q49q01j3
2095b27k75N19J144j033m03J533o16k262O61K474r09j341J036K1j109n4N45J70
2113a26M69N31j942n42K248o9j235O73J238j168j166Q17L15N75M35q00p33J146
2131F66j27j927Q90K558j485j905Q43Q44p73m65R23P14l26o97q66L79J702r09
2149C9j159J372O77j808n51J801P55j085K0L40n05L92k68m20Q81R63j199j361
2167a116J079Q22j285N9J130k00q49p9j79K99J035l41j111R40O86j561n11J862
2185F80M19j557J51Q00m11l33J22K77M35L70j532n37J577K29j195j00J385l66
2203D14j219J77P63J59j89k08n94Q53K53r63j20J420j8j612J27J436j88p65M66
$$ plain form
2077 -432 201 -64 -554 -406 -636 -1115 591 1606 -835 -1459 608 440 -1014 197 1436 587 -214 -227
2095 -227 -502 17 1161 128 -275 1258 642 -1620 -959 1515 606 -735 301 322 -787 -841 -296 -126
2113 -126 343 874 -1068 -1610 638 569 -666 7 1245 77 -1089 -272 43 618 1053 253 -480 666
2131 666 539 -1388 -498 2060 575 -1330 -487 357 -416 -881 42 756 430 -267 -1133 -754 948 39
2149 39 -1120 252 929 -879 -1430 371 1126 41 61 401 -104 288 20 -400 481 1444 245 -1116
2167 -1116 -37 785 -500 -441 689 489 -360 -439 -618 -319 716 375 -736 204 890 -671 -1182 680
2185 680 1099 -458 -307 493 82 -251 -129 148 583 953 -579 -1116 461 690 -505 -605 780 414
2203 414 -805 -628 135 294 105 -103 -697 156 409 -554 -674 746 728 -884 -757 679 491 -274 192
2222A92j2L92j97j048J60J390J27j516r3J569o88j306O35R09k60o61n1K53N42
2241C37l46r45P61R91p49r30M49J489o80j135P27P41m10k71l21M75M32m38m21
2260b44K63R91r67n94M69O27l21o49J39L04J31n69k44P23J58o76l79J124N24r36
2280a26m45P78J63l83o09P42N06j79p66j3O64L92q94l93Q84L77n85p63O61L33
2300C44n22l97L64N61k18p28j27O84L81p02k74O55Q49q35p50J013M69o65o82L43
2320b37P85n6j090L41Q63r6r03J80P54r3r40j20Q48L55q78m90O65M78m38p87P98
2341f1M40l34m48K13P85m06o14L57M24O0o13k61N31M99q4o44K41K85l5o54q1Q65
2363D65j60o49l37O75M25o04n25O77L83m58o81O78Q36o24n39L28O90k76n63K7
$$ plain form
2222 192 180 572 375 -673 -513 877 1004 -512 -605 964 276 -1030 -395 514 254 -407 -458 -205 337
2241 337 -9 -954 -193 798 49 -881 -432 1057 377 -758 -31 710 300 29 -292 183 615 177 -244
2260 -244 19 1010 43 -551 -82 545 224 -425 -286 18 149 -420 -664 59 217 -459 -838 286 810 -126
2280 -126 -571 207 370 -13 -622 120 626 447 -319 -332 332 724 -170 -563 321 698 113 -650 11 344
2300 344 -178 -575 -211 350 132 -596 -723 -39 342 -360 -634 21 870 35 -715 298 767 102 -580 -237
2320 -237 548 492 -598 -257 606 510 -393 -213 541 448 -492 -612 236 591 -287 -777 -112 366 -72 -859 -61
2341 -61 379 45 -403 -190 595 189 -425 -68 356 416 -197 -458 73 572 488 -156 85 370 335 -319 -400 465
2363 465 305 -344 -681 -6 419 -185 -710 -33 350 -108 -789 -111 725 101 -438 -110 580 304 -259 -232
2383b32N09L93q68l53Q58M26p79l50N19N66p34o56O68K08K2m46j13N09Q6n31m34
2404g32R15K01q22j38M46N13m09o83N85N60j56n89J87N35L53j021j84P48N24r09
2424g6l08R07lp59j93N33L79n94o24L37O50J8o85j00P56P5p93J13P16m4j65l76
2446b36M8O03r6n78J56P96j21j178J27P66J96n28m33O20om90l14N22M78j3r80
2467f61L9R01l5j018N24J295n91j012K45Q41m80j03P9L08J80l37q20L75Q87k86
2487C31p22M93N94q73l55N04M00j21k74m42k3Q67j51j046P11R80o48j354Q25Q74
2507E70n44l94O76J46m52n3l24O57O82o28q45N66O90j069m84J203K69p92k29J85
2527a70k10O04l98o1K48N57j058p19J173P41j062O1N55j71n01J09J07M81O05p39
$$ plain form
2383 -232 277 670 -198 -551 307 733 -46 -396 123 689 -45 -701 -33 175 197 -249 -362 147 233 -298 -732
2404 -732 183 384 -438 -576 -130 383 -26 -709 -124 436 280 -309 -122 413 766 -255 -439 309 833 -76
2424 -76 -384 523 520 -239 -432 101 480 -114 -738 -401 249 267 -418 -518 238 313 -480 -367 349 305 140 -236
2446 -236 -188 415 319 -259 -103 693 572 -606 -479 287 483 -45 -478 142 136 -354 -668 -146 332 319 -661
2467 -661 -622 279 244 -774 -250 1045 454 -558 -313 528 48 -55 24 332 512 175 -645 -270 617 331
2487 331 -391 102 696 -177 -532 -28 372 251 -23 -465 -488 379 228 -818 -107 873 225 -1129 -304 570
2507 570 26 -368 308 454 2 -51 -375 282 964 336 -509 57 747 -322 -806 397 666 -126 -355 -170
2527 -170 -380 224 -174 -235 13 570 -488 -1207 -34 707 -355 -294 261 90 -411 -302 -195 286 891 152
2547A52n88L61R01j250k18J542p1j111m63Q64k66j84N35n84L44M04j141r0J385
2566E22J84j385K84R43n89p16O80N60k21J55p00m18R76K35o57J73J052o12j433
2585i67N67Q63m37k56M99l85j82L51m95j04J203p7j157N2J277m85j068J078O12
2604H89p53k61j6k18M78L70m90k25J033n88j430J050R87p91l81N35j5p20K66j7
2624b97K33L68P1j251L98N53j17o81J195L36j150o6J16K24R1K78l89j39Q39n93
2644A9p72J085Q65j102p36Q63n3p85J33O69J01pm31p27N04R34o95m12J179p1j312
2665g51k2J195k92j31K21j76q7K48k71m09J056J99j059n07J322k45p40M34Q73
2684H58n46n89n0J0K44O68j074J27J011n44p62K15J064l24o14K40P24r70K96L6
$$ plain form
2547 152 -436 -75 826 -424 -642 900 829 -282 -745 119 -147 -331 204 -380 -36 368 -773 -863 522
2566 522 706 -679 -395 548 -41 -757 -77 483 262 417 -283 -701 275 510 -147 26 1078 466 -967
2585 -967 -400 463 26 -230 269 -116 -298 53 -442 -546 657 580 -577 -525 752 267 -801 277 889
2604 889 136 -125 -141 -359 119 489 -1 -226 807 219 -1211 -161 826 35 -346 189 174 -546 -280 -297
2624 -297 -64 304 375 -876 -478 75 -42 -723 472 808 -342 -408 -292 -68 23 301 -88 -227 612 19
2644 19 -753 332 1197 95 -641 222 169 -616 -483 186 287 280 -151 -878 -374 560 -135 -547 632 561 -751
2665 -751 -773 422 130 -1 220 44 -43 205 -66 -475 581 780 -279 -786 536 291 -449 -15 858
2684 858 312 -277 -327 -317 -73 595 -479 -352 659 115 -647 -432 632 308 -306 -66 658 -312 -16 20
2704B0j62L90L95r88K45L77j3m40J63O80k18j004L68L13O1O7m84L4M53m8o52J50
2726b93Q85l47n80J45M44j44n29M21P5J32j52o83N40O77m21m81M09M45m32q01
2746f90P12N76o32j27J69L00k00n80J06N49r2k57j98L33L17k48l85K7O40m41L63
2767B42n12M52K22l44l52N92M89o87n70P41K27m84n63N86M40l72n85K81L35K3
2787A61n17j19P63O9o84J13M94M4n36k1L73L67o81k13K97L27O1l70KL08J91m21
2809Hj57L44K74n68R9k6L93j39l63j3M18j40n54j07P78p2m59j52P04M8m19o01
2831g04R76j17l1l55J52O84m11o25N15N24j35p94K69O59l80m19kM27k9l34j53
2852b83K62K22l49l45K7O50m6n24M3M98m3r2l54N86L07o41j65K79O23l70l80J71
$$ plain form
2704 20 -142 248 643 -345 -100 277 264 -176 -13 667 449 -555 -187 126 187 254 -230 -196 257 209 -443 -293
2726 -293 592 245 -335 -190 254 110 -419 2 77 209 57 -626 -86 591 170 -311 98 543 111 -690
2746 -690 22 598 -34 -161 8 308 108 -472 -366 183 91 -166 -364 -31 286 38 -347 -320 320 -121 242
2767 242 -270 182 404 60 -292 300 789 102 -468 273 500 16 -547 39 479 107 -478 -197 138 161
2787 161 -356 -475 288 357 -327 -214 280 324 -212 -233 140 507 -174 -387 -90 237 298 -72 -70 238 429 8
2809 8 -149 195 469 -99 0 -26 367 228 -135 -148 270 130 -424 -531 247 175 -284 -436 268 316 -103 -704
2831 -704 272 155 124 -231 -79 605 194 -431 84 608 473 -321 -52 607 227 -192 -194 233 204 -130 -283
2852 -283 -21 201 -148 -493 -466 184 138 -386 -343 155 112 20 -334 252 559 -82 -247 32 655 285 -95 76
2874G6M98m31k44J42L37k48k77K72J50n1m19k88N72K58o71q0M78J02m04m5J21
2895a52N80k36k65J9K93j43j38j5K22l3j20o2R0L51m02m24L18L06l5k48k34O37
2917C09k11n57K5N52L34n67m39O49L64m90m50N02L57l28n65L09R11m54n54O2O81
2938D40m21l45L79K76%l02o1j71K68Q7n49K76M93m52m81K98L67M5l81K9K78l3
2960D0Rj35q9N84j14o24l9O83j08m88L12N72n47n37K45J28K44k8k66o9M71m52
2982b08k73J65P95m42l54J90N22o25L66j30OL29j96p24N75M82k40l58K57K04l88
$$ plain form
2874 76 574 143 -101 41 378 130 -147 125 275 224 -195 -483 89 347 -324 -404 74 176 -228 -273 -152
2895 -152 428 192 -73 -54 239 96 -42 -57 165 132 12 -50 40 391 -11 -435 -117 189 154 -94 -328 309
2917 309 98 -459 -434 118 452 -115 -554 95 459 -31 -481 21 378 50 -515 -206 705 251 -303 -241 440
2938 440 19 -326 53 329 329 27 -34 -205 63 150 -399 -123 370 -82 -563 -265 102 147 -234 -205 73 40
2960 40 49 -86 -175 409 295 -329 -368 315 207 -281 31 603 56 -481 -236 -108 136 108 -158 -227 244 -208
2982 -208 -481 -316 479 37 -317 -127 395 -230 136 6 12 341 145 -579 -4 478 238 -120 137 341 -47
$$ [...]
8191D1
##END NTUPLES=NMR FID
##END=
